##TITLE=1H_DE-71R_oil2
 CDCl3
 8 sc, 
 29.10.2024
##JCAMPDX= 6.0         $$ Bruker NMR JCAMP-DX V2.0
##DATA TYPE= NMR FID
##DATA CLASS= NTUPLES
##ORIGIN= UXNMR, Bruker Analytische Messtechnik GmbH
##OWNER= root
$$ XWIN-NMR		Version 3.5
$$ Tue Oct 29 16:09:23 2024 Russian Standard Time (UT+4h)  she@DPX200
##.OBSERVE FREQUENCY= 200.1318
##.OBSERVE NUCLEUS= ^1H
##.DELAY= (6, 6)
##.ACQUISITION MODE= SIMULTANEOUS
##.ACQUISITION SCHEME= undefined
##.AVERAGES= 8
##.DIGITISER RES= 18
##SPECTROMETER/DATA SYSTEM= spect
##.PULSE SEQUENCE= zg30
##.SOLVENT NAME= CDCl3
##.SHIFT REFERENCE= (INTERNAL, CDCl3, 0, 15.7039)
##AUDIT TRAIL= $$ (NUMBER, WHEN, WHO, WHERE, WHAT)
$$ ##TITLE= Audit trail, XWIN-NMR		Version 3.5
$$ ##JCAMPDX= 5.01
$$ ##ORIGIN= Bruker BioSpin GmbH
$$ ##OWNER= she
$$ F:/spectra/data/she/nmr/H-F/1/audita.txt
$$ ##AUDIT TRAIL=  $$ (NUMBER, WHEN, WHO, WHERE, WHAT)
(   1,<2024-10-29 16:08:03.42 +0400>,<she>,<DPX200>,
      <created by zg, POWCHK disabled, PULCHK disabled
       configuration hash MD5:
       00 E9 B6 7A A2 85 ED C7 34 08 36 98 17 FE 4E 26
       data hash MD5: 16K
       7D 7E C0 5C 9D 14 3D 9E D9 BC 02 2E D3 10 28 8B>)
$$ ##END=
$$ 
$$ hash MD5
$$ 08 FB D5 AD D0 B0 C7 81 89 AC 37 2C 4E 30 B6 12
##$RELAX= 
##$RELAX= 
##$RELAX= 
##$RELAX= 
##$RELAX= 
##$RELAX= 
$$ Bruker specific parameters
$$ --------------------------
##$DU= <F:/spectra>
##$EXPNO= 1
##$NAME= <H-F>
##$PROCNO= 1
##$TYPE= <nmr>
##$USER= <she>
##$AMP= (0..31)
100 100 100 100 100 100 100 100 100 100 100 100 100 100 100 100 100 100 
100 100 100 100 100 100 100 100 100 100 100 100 100 100 
##$AQSEQ= 0
##$AQ_mod= 1
##$AUNM= <au_zg>
##$AUTOPOS= <>
##$BF1= 200.13
##$BF2= 200.13
##$BF3= 200.13
##$BF4= 200.13
##$BF5= 200.13
##$BF6= 200.13
##$BF7= 200.13
##$BF8= 200.13
##$BYTORDA= 1
##$CFDGTYP= 0
##$CFRGTYP= 5
##$CHEMSTR= <none>
##$CNST= (0..31)
1 1 145 1 1 1 1 1 1 1 1 1 1 1 1 1 1 1 1 1 1 1 1 1 1 1 1 1 1 1 1 1 
##$CPDPRG= <>
##$CPDPRG1= <>
##$CPDPRG2= <>
##$CPDPRG3= <>
##$CPDPRG4= <mlev>
##$CPDPRG5= <mlev>
##$CPDPRG6= <mlev>
##$CPDPRG7= <mlev>
##$CPDPRG8= <mlev>
##$CPDPRGB= <>
##$CPDPRGT= <>
##$D= (0..31)
0 1.2 0 0 0 0 0 0 0 0.06 0 0.03 0 0 0 0 0.0002 0 0 0 0 0 0 0 0 0 0 0 0 
0 0 0 
##$DATE= 1730203682
##$DBL= (0..7)
120 120 120 120 120 120 120 120 
##$DBP= (0..7)
150 150 150 150 150 150 150 150 
##$DBP07= 0
##$DBPNAM0= <>
##$DBPNAM1= <>
##$DBPNAM2= <>
##$DBPNAM3= <>
##$DBPNAM4= <>
##$DBPNAM5= <>
##$DBPNAM6= <>
##$DBPNAM7= <>
##$DBPOAL= (0..7)
0.5 0.5 0.5 0.5 0.5 0.5 0.5 0.5 
##$DBPOFFS= (0..7)
0 0 0 0 0 0 0 0 
##$DE= 6
##$DECBNUC= <off>
##$DECIM= 24
##$DECNUC= <off>
##$DECSTAT= 4
##$DIGMOD= 1
##$DIGTYP= 9
##$DL= (0..7)
0 120 120 120 120 120 120 120 
##$DP= (0..7)
150 150 150 150 150 150 150 150 
##$DP07= 0
##$DPNAME0= <>
##$DPNAME1= <>
##$DPNAME2= <>
##$DPNAME3= <>
##$DPNAME4= <>
##$DPNAME5= <>
##$DPNAME6= <>
##$DPNAME7= <>
##$DPOAL= (0..7)
0.5 0.5 0.5 0.5 0.5 0.5 0.5 0.5 
##$DPOFFS= (0..7)
0 0 0 0 0 0 0 0 
##$DQDMODE= 0
##$DR= 18
##$DS= 0
##$DSLIST= <SSSSSSSSSSSSSSS>
$$ [...]
##$SUBNAM2= <"">
##$SUBNAM3= <"">
##$SUBNAM4= <"">
##$SUBNAM5= <"">
##$SUBNAM6= <"">
##$SUBNAM7= <"">
##$SUBNAM8= <"">
##$SUBNAM9= <"">
##$SW= 24.0689170037331
##$SWIBOX= (0..15)
0 0 2 0 0 0 0 0 0 0 0 0 0 0 0 0 
##$SW_h= 4816.95568400771
##$TD= 16384
##$TD0= 1
##$TE= 0
##$TE2= 300
##$TE3= 300
##$TEG= 300
##$TL= (0..7)
0 120 120 120 120 120 120 120 
##$TP= (0..7)
150 150 150 150 150 150 150 150 
##$TP07= 0
##$TPNAME0= <>
##$TPNAME1= <>
##$TPNAME2= <>
##$TPNAME3= <>
##$TPNAME4= <>
##$TPNAME5= <>
##$TPNAME6= <>
##$TPNAME7= <>
##$TPOAL= (0..7)
0.5 0.5 0.5 0.5 0.5 0.5 0.5 0.5 
##$TPOFFS= (0..7)
0 0 0 0 0 0 0 0 
##$TUNHIN= 0
##$TUNHOUT= 0
##$TUNXOUT= 0
##$USERA1= <user>
##$USERA2= <user>
##$USERA3= <user>
##$USERA4= <user>
##$USERA5= <user>
##$V9= 5
##$VALIST= <valist>
##$VCLIST= <CCCCCCCCCCCCCCC>
##$VD= 0
##$VDLIST= <DDDDDDDDDDDDDDD>
##$VPLIST= <PPPPPPPPPPPPPPP>
##$VTLIST= <TTTTTTTTTTTTTTT>
##$WBST= 1024
##$WBSW= 4
##$XGAIN= (0..3)
0 0 0 0 
##$XL= 0
##$YL= 0
##$YMAX_a= 240231
##$YMIN_a= -256783
##$ZGOPTNS= <>
##$ZL1= 120
##$ZL2= 120
##$ZL3= 120
##$ZL4= 120
##$ABSF1= 10
##$ABSF2= 0
##$ABSG= 5
##$ABSL= 3
##$ALPHA= 0
##$AQORDER= 0
##$ASSFAC= 0
##$ASSFACI= 0
##$ASSFACX= 0
##$ASSWID= 0
##$AUNMP= <proc_1d>
##$AZFE= 0.1
##$AZFW= 0.1
##$BCFW= 1
##$BC_mod= 2
##$BYTORDP= 1
##$COROFFS= 0
##$CY= 11.3945322036743
##$DATMOD= 1
##$DC= 2
##$DFILT= <>
##$DTYPP= 0
##$F1P= 15.6554695791079
##$F2P= 12.8336369535428
##$FCOR= 0.5
##$FTSIZE= 0
##$FT_mod= 4
##$GAMMA= 1
##$GB= 0.15
##$INTBC= 1
##$INTSCL= 1
##$ISEN= 128
##$LB= 0.24
##$LEV0= 0
##$LPBIN= 0
##$MAXI= 10000
##$MC2= 0
##$MEAN= 0
##$ME_mod= 0
##$MI= 1.114404
##$NCOEF= 0
##$NC_proc= 0
##$NLEV= 6
##$NOISF1= 3.799351
##$NOISF2= 2.8
##$NSP= 1
##$NTH_PI= 0
##$NZP= 0
##$OFFSET= 15.70392
##$PC= 1
##$PHC0= -26356.27
##$PHC1= 23.18743
##$PH_mod= 1
##$PKNL= yes
##$PPARMOD= 0
##$PSCAL= 0
##$PSIGN= 0
##$REVERSE= no
##$SF= 200.130013532006
##$SI= 16384
##$SIGF1= 3
##$SIGF2= 2
##$SINO= 400
##$SIOLD= 16384
##$SREGLST= <1H.CDCl3>
##$SSB= 0
##$STSI= 0
##$STSR= 0
##$SW_p= 3612.71676300578
##$SYMM= 0
##$S_DEV= 0
##$TDeff= 0
##$TDoff= 0
##$TI= <>
##$TILT= no
##$TM1= 0
##$TM2= 0
##$TOPLEV= 0
##$USERP1= <user>
##$USERP2= <user>
##$USERP3= <user>
##$USERP4= <user>
##$USERP5= <user>
##$WDW= 1
##$XDIM= 8192
##$YMAX_p= 0
##$YMIN_p= 0
$$ End of Bruker specific parameters
$$ ---------------------------------
##NTUPLES= NMR FID
##VAR_NAME=  TIME,          FID/REAL,        FID/IMAG
##SYMBOL=    X,             R,               I
##VAR_TYPE=  INDEPENDENT,   DEPENDENT,       DEPENDENT
##VAR_FORM=  AFFN,          ASDF,            ASDF
##VAR_DIM=   8192,          8192,            8192
##UNITS=     SECONDS,       ARBITRARY UNITS, ARBITRARY UNITS
##FACTOR=    0.0002076,     1,               1
##FIRST=     0,             0,               0
##LAST=      1.7004516,     0,               0
##MIN=       0,             -256783,         0
##MAX=       1.7004516,     240231,          0
$$ Real data points
##PAGE= N=1
##DATA TABLE= (X++(R..R)), XYDATA
0@%%%%%%%Nj3J6j6K4l2L2m0N6o8P9r4J10j30J54j81K10k41K76l17L64m13M70n32
31b81N97o72P56q46R43j050J169j301J446j602J773j964K174k408K666k953L278
48A725l646M068m556N128n806O625p647Q956j0695J3134j6816K3111n1193K77843
62B40231j76728k63193L06876r3072j14749K55596j24728k32472K99374J3436
72A10571k48923J53717N0986j78952J75293L7842k45327J36916J52156k28750
82h4471L4840J58324j71963n424J68473j43295l0731J88562j26363j08740K14127
93I3339k4907j62682J24412J6334j20398J25031M024j81420J32086J15795j93587
104g1973J6602J26510j12156L4698J07303j76163o052J99155j14496r5648J49013
$$ y = [0, 0, 0, 0, 0, 0, 0, 0, 5, -8, 8, -8, 16, -16, 16, -24, 32, -36, 43, -51, 59, -71, 83, -98, 112, -129, 147, -170, 194, -219, 251, -281, 316, -356, 400, -446, 497, -553, 616, -685, 761, -841, 932, -1032, 1142, -1266, 1400, -1553, 1725, -1921, 2147, -2409, 2719, -3087, 3538, -4109, 4847, -5848, 7286, -9530, 13581, -37612, 240231, 63503, -199690, 107186, 14114, -100635, 154961, 30233, -202239, 97135, 110571, -138352, 15365, 66351, -112601, 62692, 100534, -144793, -7877, 144279, -84471, -49631, 108693, -63270, -68694, 99779, -43516, -74247, 114315, -12048, -120788, 93339, 68432, -94250, 30162, 46496, -73902, 51129, 55153, -126267, 5819, 121614, -71973, -55371, 71139, -41017, -6319, 100984, -75179, -81231, 117924, 3428, -92220, 56793]
115E6793o0437o7466J52751p2910j13240J79377o171j63635J16010M3137j33318
126f9109Q7565M3426j43369P1510Q4539j34554K9453J06222j05235j0518R6173
137E6103p4665j2731R3372p8719m3764J08886l5605o6482Q3249j1601o1915P6944
149C3072l832q2153P4365L4365r9648K7915N7838p1278J1887N8217o9225k545
161c1022P4311n4141k4798P7614l4331m4091O3350k0453m1327O4696j7583n9695
173d7470O5941Q393o6057N1109K3187o5504L7068K6868o8961L1438M7777p1092
185b7303J039N5611m5568o898N1083l5862j2264M8937l1205k2679N1754j4818
197A1827l3337L1478r006k0091L7080j0261l4414L8640Q971l9587K1159J5870
$$ y = [56793, -3644, -71110, 81641, 8731, -104509, 74868, 68697, -94938, 21072, 64209, -69109, 18456, 61882, -81487, -9977, 74562, -59992, -30539, 75683, -29552, -40070, 56103, -18562, -31293, 62079, -16640, -60404, 48482, 12877, -53605, 29644, 18043, -43872, 33072, 29240, -52913, 21452, 55817, -43831, -15916, 41922, -29356, -17469, 40748, -28477, -31022, 43289, -10852, -35650, 41964, 7633, -36458, 26892, 6439, -34888, 29808, 12225, -47470, 18471, 26864, -39193, 11916, 35103, -30401, 6667, 33535, -35426, -3988, 43789, -27303, -26264, 29347, -16221, -23119, 27964, -7898, -20162, 28775, -2430, -25109, 26645, 11827, -21510, 9968, 962, -19129, 17951, 7690, -26724, 11916, 20887, -18700, 2459, 18329]
209A8329l0105J5048J0969l9638J3532L5851l2727j1580L1045j3416p666K7355
221A6997j5817j3409L0785j1865k6085K6764L864k3333J6186j354k0208K6505
233I030P323l2835J7859J8510l1404M733J9879k3440N043J9681l0939k214L6529
246A7755j4386j5728K1696p325p998K0938j1740j5029K2931m534k0777J4365K194
259B362r796J5875l964j9563J9692Q940k2461P949J0901j9787L997J3174j6896
272i577K772J9456j7105p527K2423l727j0356J3686n763j2156J4532k067j5861
285a1270J2925N202j7107O636Q601j0844Q904P843j8895K726J5659j3762l147
298f529J3365j1385n105J6303p668o425J7837m183j3506J2571J645j1102Q978
$$ y = [18329, -11776, 3272, 14241, -25397, -11865, 23986, -8741, -20321, 10724, -2692, -10358, 16997, 1180, -12229, 18556, 6691, -19394, 7370, 11234, -12099, 4087, 2733, -17475, 9030, 16353, -16482, 1377, 19887, -11517, -6784, 13095, -10345, -5302, 14379, -16560, -18774, 17755, 3369, -12359, 9337, 2012, -5986, 14952, 3212, -11817, 11114, 6580, -14197, 168, 2362, -7434, 8441, 4477, -15086, 4606, 13546, -8915, -966, 9935, -9852, -5855, 7319, -9577, -6805, 12651, -4454, -11981, 10442, 6715, -3641, 10045, 4282, -7874, 6658, 4591, -11270, 1655, 6857, -10250, -3614, 4987, -5857, 3047, 10890, -8005, -5279, 10380, -3382, -6529, 6836, -4549, -9654, 6649, -1019, -7444, 10393, 6210, -7296, 5275, 6920, -4182, 4796]
311D796N87j4360O494N047j0533P092O617j0751K863P194q989L813Q861j2210
325c479k343J0647q244l116J3021n916p838J2359o46q907J0808K646j3768L996
339g80N578j0716L170P290r959j147Q941n411j39R989n306m866P746m390m364
354d364R502l523p929P399L81p071Q883M092j0148M143M596r190K583P295r445
369b796k888O538n393j183Q897k656l939O247j991k801P409j940n868M414k036
384A4n789P396J712p603M977K993p597M982O757r089n68O256q251j982Q849m325
400a268n188P679k093m368R287J105o731M712J82o690N069K402o883K140K227
415A582o648L714O163n173J88M821o704n14O985m706l937N444m242l379P590J85
$$ y = [4796, 5383, -8977, -2483, 2564, -7969, -877, 5740, -5011, -2148, 5046, -3943, -130, 8731, -3479, -5822, 4825, -3419, -6535, 6486, 570, -7268, 5091, 4445, -4462, 6346, 8992, -4776, -780, 4798, -5918, -2748, 4542, -5417, -6564, 2377, -3034, -3173, 6816, 1510, -3356, 4390, 0, -4364, 5138, 1615, -6314, 1085, 1466, -5605, 3278, 7370, -2778, 1365, 5961, -3229, -646, 6649, -2796, -5684, 854, -4539, -5722, 3175, 519, -3420, 2827, 836, -1965, 5444, 3504, -2364, 2050, 14, -5775, 1621, 3333, -4270, 707, 3700, -3897, 1085, 7842, -1247, -1815, 4441, -3810, -5792, 3057, -1268, -6456, 1223, -870, -5238, 4049, 5154, -1577, 3135, 3317, -3373, 1696, 4098, -2785, -645, 1582, -5066, -1352, 4811, -362, -174, 4647, -2057, -2571, 4414, -292, -4229, 1215, -3027, -6406, 1184, 1369]
431A369m135N678j27n165M870K458m851K342o14n954K586L492m842K637L257o340
447c339J496O199m704k63M858o487l213P742k855m306O698j814m989P054J747
462C824m820M701J177p266K306L360n335J504K158o220J554M831l472J615M111
477D028m669r85M017l606m76N004m965m047O042j87j781M873j135l646M738O19
493C824m817L559J005o385Q07J443l212L755K487o006J517M687l638P89M638m836
509c83j630M172m365j686P591k328n492M633J567k495M672r44n478L677J047o002
525c444K084K756l309J14j37k709N027M366n689k70L554k410J01K339l613n62
541a802M013m611j009O524o34k974K316j671r99M596k133m974L453N72n117K185
$$ y = [1369, -2766, 2912, 2785, -2380, 2490, 4948, 97, 2439, 1825, -4129, -1543, 1949, -2893, -256, 3001, -3339, -1843, 4356, -348, -611, 4247, -2240, -5453, 2289, -566, -4872, 1826, 12, -4977, 2077, 3824, -996, 3705, 4882, -2384, -78, 3282, -2053, -549, 1609, -4611, -3057, 1774, -1698, -83, 4028, -641, -1626, 2391, -1215, -1691, 3313, -1652, -5699, 343, 156, -1625, 3248, 2113, -1533, 3205, 3824, -993, 2566, 3571, -2814, -2007, -564, -3776, -21, 2466, -3540, -2023, 2664, -974, -185, 4453, -383, -2013, 2159, -2206, -3892, 3699, 1371, -4121, 512, 2079, -416, 4256, 3312, -2166, 1511, 2558, -3444, -1360, 1396, -1913, -1799, -1936, -4645, 382, 4748, -941, -1211, 2343, -67, 34, 2373, -1240, -1802, 2211, -2400, -3409, 3115, 2481, -493, 1823, 152, -847, 3749, 1616, -3358, 95, 667, -4450, -2265]
557b265K180j230K623n36m658M885M783m834j787J866k655J240K497m391M66N315
573C499l477l041M723O25j258J388l691j873M785j590l678L190n7l095L359K87
589I6n57M917j871o635N206L595n732K99J740m474L535K358o951K888P607n938
605H3k989N035k085l67L971o653k720P611k137m295O476m0n001M826M76l580O025
622D636j045q396N020L767p173R22L961m098L462J987q401L131J0583p295n855
637d794M658j218P21N301q428l782J2251p77q687N682K723m211M549k445p848
652f305R708L617j3199K102P997o705P46O037p209K801Q021j2052k365J4865m338
667C721r913N068n07n33R223p465r579J5352L865j3773K633N412l746N067k730
$$ y = [-2265, -85, -1315, 1308, 772, -3886, 999, 5782, 948, -839, 1027, -1628, -388, 2109, -2282, -1816, 3499, 22, -3019, 1704, 2329, 1071, 2459, -1232, -3105, 1680, 90, -3588, -398, -455, -3550, -191, 96, -461, 4456, 2585, -4050, 1156, 4751, -981, -682, 1058, -3416, 119, 2477, -4474, -1586, 6021, 83, -2906, 2129, 44, -323, 3648, -3005, -5725, 1886, -251, -4546, 1930, 1890, -3111, 1715, 2191, -1389, 4636, 3591, -4805, 215, 3982, -3191, -2269, 1692, -2406, 1056, 3043, -5358, -2227, 8356, 1061, -4794, -136, -1354, -633, 4668, -3760, -7542, 4709, 3932, -4755, 927, 3650, -561, 3988, 1543, -6305, 3403, 7020, -6179, -4077, 3920, -2785, -2039, 3998, -3211, -410, 7611, -4441, -6806, 8059, 3721, -6192, -1124, -1631, -2164, 7059, -406, -9985, 5367, 9232, -4541, -1908, 3504, -242, 4825, 2095]
682B095j3869R641J2630j2760n484R303k029J158M998j0293K61J4022q434j0532
696i293J0771K603o135L475l917l093J2871r17j4214P568R478j0272k057L621
710D89m526O508L647j6009J518J7844n356r484N122k49J080P282j0114p465J5609
725E896J216j4668L462P034l190N121l340j0259J0778Q775j4650j532R628m725
739d54j302K544o990M471J0564j1354o803J3810J587p205K733l358j045J0037
753G235n419j1421J0086O764r230p44K825j978P107M33j2938L485J0586o638m677
768d524M759k130O32M486o555j37R604l154p637N596K375l701K389k089m477O554
784A991J422r149L775P342m979k125J987k328L972L494r243k093Q639j376l808
$$ y = [2095, -11774, -2133, 10497, -2263, -7747, 1556, -473, 685, 5683, -4610, -4349, 9673, 1239, -9293, 1478, 4081, -2054, 1421, -2496, -5589, 7282, 6365, -7849, -281, 9197, -1075, -3132, 489, -4037, 2471, 6118, -9891, -8373, 9471, 4115, -5369, -247, -496, 584, 7866, -2248, -9713, 5896, 7112, -7556, -4094, 2940, -250, 4871, 1531, -8728, 2050, 10825, -3825, -5357, 4271, -454, -1756, 788, -6202, -1731, 8833, -2521, -9324, 4486, 6073, -1132, 1601, -1757, -2802, 7235, 1816, -9605, 481, 7245, -1985, -2729, 96, -1882, 5225, 5658, -7280, -3795, 6791, 153, -4524, 235, -1895, -1263, 3223, -3332, -3469, 6135, 2981, -4656, 940, 3315, -386, 2003, -86, -4563, 1991, 3413, -5736, -1961, 5381, 402, -1723, 264, -2064, 1908, 5402, -3841, -5934, 2705, 1329, -2479]
799b479K388j564Q89M940m264l528P256L23n992K141R6k472L700n83m851M252
815B52J852m905K959L541l962j0N80k530K805K424n916m61M970j251j658J914
831F04p4N07K297l888k279N159N43m153m16q7L52K264m17k505K519J461k908J65
849h56K875j688n82l2k417J883K958l344p18L864m71j817J303k96K71K323m268
866a012l684N002J765l304J24j40k1L714j284l817L752K359m415l94J522j041
882h74J875q3m447K436M176k292j680K606r21n00R19k546P57K661k773l300L026
899i60J743j93K59j369p79L506l88l770J635K180j859j174M19n60K340J033l358
916a295n00L480J10j720M77r28m41J265j724j371L320J55k953J563J513n47J399
$$ y = [-2479, -91, -1655, -766, 4174, -90, -3618, 3638, 3961, -2031, 110, 206, -2266, 1434, 851, -4000, 252, 2104, -2801, 158, 3699, -263, -273, 307, -2223, 582, 3006, -2910, -3371, 1599, 348, -1310, 604, 530, 1037, 3334, -554, -2833, 2326, 2869, -1284, -1700, -1787, -1435, 829, 412, -2093, 426, 1887, -1021, -856, 2019, 331, -251, -283, -2700, -817, 2141, -1203, -1921, 1943, 1472, -345, 958, 662, 933, 3256, -1012, -4696, 306, 2071, -1233, -1109, -1249, -1270, 2444, 1160, -2657, 1095, 3454, -961, -1355, 167, -874, 1001, 918, -3529, -1093, 3083, 791, -889, 1717, 796, 296, 1215, -1331, -574, 2087, -686, -3986, -960, 783, 590, 849, -520, -1299, 2207, 1819, -1951, -316, 1864, 5, -1169, -750, -1310, 1030, 2063, -1295, -1795, 1685, 1795, 75, 552, -376, -817, 448, -1276, -2647, 673, 828, -2125, -562, 951, 404, 1803]
933A803l54k850J731J424k571J6J745j108o8K24j308J732K500k616j488J664k90
950A86j71O26j779j28J497j075n09J980L71p69L99o08Q6J746p40j374J5j89o32
969a068R33O25j125R35J60r97Q08J121p68q91k41o77L94P28m32j38P52l6k84J222
989A021M50n39J18j032p46M42M88p94j69L85m83N32J102m66J5M56j406M16O57
1008D47p98P1L88j378L88J397p48M36J288j138n07J369p06m39Q15r53j416J364
1026a20K14o01J117N9j499J062O11j138Q47R9j547M03L47n59P55O59j070k3J249
1045H65m84K98R68p50j559P35m16o85J204q86n96J111J20j31J138J05r34J95m1
1064B57j124J080K55j471J94Q48n86N97J396j012o57R24m44p04J615p82j442K32
$$ y = [1803, 1449, -1401, 330, 1754, -817, -801, 944, -164, -232, -8, -1316, 416, 2916, 300, -1188, 476, 186, 15, 641, -1138, -1266, 231, -844, -1353, 627, 998, 229, 628, 20, 106, 1852, 1112, -262, -247, -436, -1068, -135, 490, -635, 300, 460, -537, 271, 1392, 624, -267, -508, -1185, -791, -63, -495, -633, 119, 83, -201, 1021, 1471, 932, 1050, 18, -728, -286, 202, -592, -761, -376, -859, -327, 775, 309, 324, 780, -626, -210, 447, -351, -280, 108, -1270, -882, 515, -233, 203, 1491, 353, -154, 1215, 509, 70, 885, -68, -1484, -120, 94, -507, 610, 669, -830, 232, 843, -295, 552, 651, -896, -493, -146, -705, 50, 709, -361, -384, 865, 381, 679, 1647, 897, -662, 73, -343, -1028, 176, -710, -1306, -195, -75, -206, 932, 1037, 103, 298, 257, -867, 213, 468, -1003, -809, 39, -547, 50, 1446, 434, -223, 701, 257, -447, 1168, 386, -1056, -824]
1082h24J21o29J358P54j080O65M34r60R43N65j633n5P97j331K28J130l37o41Q31
1101C36j75l18J301j67j192K9R1q08O82J61j104Q19P0m13Q13J097j090J21N25
1120G78r58k54N39m08l34N50n52l08J420L40q97P02j12q10N91M42j447K78K18
1139b22j224Q98J528j573N57J146j223P4J488q29o82O09q25j287J243O47q56O44
1157A13k9p83J246M18q97M14j85j247L66O92r65M50P52j363N15J973r99j65P05
1176A011o76p51Q91n26n10J093o38j136J123R04p98M79P1j316J011P29j954P09
1194b84P92j400o8J289o54N12Q41q17r03J784k63j328R38j23j311R04N1j188J649
1213D21L20k076O49J713o81K48K29j969M30J885j894j66J738j152o38J677j077
$$ y = [-824, -703, -1332, 26, 780, -300, 365, 799, -161, 782, 1347, -286, -341, 456, -875, -647, 483, 146, -495, 336, 161, -157, 1144, 977, -215, -186, -95, -903, -221, -60, -1164, -345, -275, -688, 125, 1222, 132, 253, 778, -180, -434, 105, -303, -637, -87, -639, -947, 473, 813, -84, 618, 506, -304, 287, 729, -718, -440, -222, -1446, -548, 980, -593, -36, 1110, -113, -39, 1449, 620, -62, 547, -278, -1565, -322, 325, -531, 113, 84, -699, 547, 965, 68, 482, 297, -950, -584, 108, -857, -407, 345, -1018, -503, 1470, 471, 306, 1011, 335, -416, 475, -51, -561, 532, -106, -1242, -119, 785, -13, 466, 537, -779, 232, 961, -993, -284, 508, -892, -960, 329, -325, 187, 1028, 211, -692, 1092, 829, -499, 439, 316, -995, -91, -40, -1228, 421, 741, -1335, -686, 1027, 346, 594, 823, -1146, -716, 1169, -725, -891, 847, -305, -943, 734, -343]
1230c43K51J867j268j585J148N86j774J485m07j541J376N13j560J962J088k490
1246f92K28J843j637O9J108k027J15K194k069n75K784l90j602J379o35j333K946
1263A706r07l028J714J159k125J504O71k146J554J642k729N24K675k437j116K674
1279A335j890k62K218j935p44K987j409k533L727K12k621J560q91j660L312l71
1295A035l877J970K891k940L63J801j816J180J996m100k0L990j775k632K209p88
1311e13p77K914j654j890L675P8l993K154J932k767Q62k3k759K846K629m438k07
1328a931M223j812j009J669j790M63L337l724l034M852M77l256J167L82j341L918
1344B591j354m225L562K482m510L9K575j897J087R67m080J725M851l539k484L811
$$ y = [-343, -92, 1775, 507, -1078, 70, 656, -1118, 367, -40, -1581, -205, 308, -1252, 710, 1798, -692, -464, 1379, -258, -189, 919, -1108, -993, 1201, -868, -1443, 1341, 951, -651, 728, 93, -1240, 1706, 799, -2229, -515, 644, -1481, 23, 694, -1452, 102, 1744, -985, -461, 2214, -223, -1339, 1335, -555, -817, 1401, -534, -1278, 1709, 300, -2233, 1494, 1706, -915, 645, -246, -1906, 1406, 1035, -2842, -872, 2019, -921, -558, 1243, -573, 607, 2603, -1497, -1517, 2473, 698, -1934, 275, -513, -1290, 1624, -30, -1920, 1755, 1833, -2160, -6, 1926, -841, 21, -2, -2761, 85, 2714, -1724, -1931, 2292, 480, -529, 1140, -650, -187, 3150, -574, -3608, 1244, 1721, -1535, -368, 14, -1327, 2591, 1237, -2988, 574, 3056, -1454, -1415, 1160, -737, 350, 1317, -2763, -1038, 3813, 274, -2210, 1601]
1360A601p44q95J112j956j088M917k155m698L258K751k343N95l78j971L923R28
1376B857n290Q70M120k537j063J242j483J657K400m054j015M903q95l036J825
1391E01l46j285K369j704k447M507Q77m689P37L043j348O55pl132K315L069m519
1408a404j223L692J41j718Q11j620N82M316k819m163M205Q88k133O88r85j064
1424a806L030j61l303J921K604k247k21R26j285J054R24l228M81L217j953j406
1440a453K152j38m50Q07j865%L183q69l683J326J698j057N38l90j187K031Q08
1457A451k649O86K371j334p89L17j076N77J895k228q74K708o89j054J606k73j102
1474d57J098r78p35J969m58k227J393R37j016M47L60j070J794M39k571J34K109
$$ y = [1601, 857, -38, 1074, -882, -1970, 2947, 792, -3906, -648, 2103, -240, 355, -23, -1994, 1929, 2857, -2433, -1563, 2557, 20, -1043, 199, -1284, 373, 2773, -1281, -2296, 2607, 1712, -1324, 501, 155, -1130, 1239, -465, -2912, 1595, 2472, -2217, -1480, 1563, 215, 870, 863, -2269, 46, 3115, -1404, -2627, 1065, 1206, -512, 299, -1321, -739, 3577, 758, -3405, 800, 1688, -445, 243, -742, -1806, 1224, 1063, -2240, -319, 2285, 38, -183, 743, -542, 512, 1436, -1792, -1311, 1906, -47, -1453, 699, 561, 111, 918, -947, -947, 2236, 1367, -2316, -990, 708, -349, 189, -201, -1388, 643, 1451, -1198, -512, 1859, 525, -264, 53, -1023, -446, 1449, -779, -1653, 1055, 366, -688, 918, 645, -457, 641, -337, -1072, 897, 439, -1788, -395, 542, -474, -27, 333, -737, 1057, 1496, -1075, -941, 1168]
1491A168q20n63J69j125J264R71j334q48K253k57j527J190l35j96P48j546q38
1508a626K261n3j637P16J099j111P39k00o82J259M67j936k23J208O1l38j44p83
1526i23L75J935j479r96J888j93p57m7m90L02J250r74j684J440J340j171J75J17
1544A08p4N24j00j183K84J860j835q41J028K50J69N50j187j79K169r38j520J012
1562I7M56q61L25n31o13K174j26k095O76J459o89J48k40q65N82J102j682k93J470
1581D94m99n77N99j09M88Q67j105q70J004M45j366M51M00n97L36j4q69J301Q43
1600A222j506k34M85k14K44P92j378m8J213o98r25P53P37p32P23k96m76Q82J40
1619F84j192P2M20o07N93K76m41L42L8m08M4Q04k84m52j19j64j50N23l06p0M95
$$ y = [1168, 348, -215, -46, -1171, 93, 1064, -270, -1118, 1135, 878, -649, 541, 206, 10, 758, -788, -1626, 635, 582, -1055, -339, 760, -351, 388, 188, -494, 765, 1232, -704, -927, 281, 342, 4, -140, -923, -548, 1387, -92, -1088, 800, 607, -150, -197, -687, -385, 865, -109, -1793, -353, 987, -184, -9, 108, 34, 558, 458, -725, -441, 1419, -416, -1257, -229, 21, 190, 740, -447, -626, 1543, 605, -915, 97, 553, -308, 17, -514, -1127, 1047, 921, -1174, -498, 961, 272, 420, 180, -685, -103, 999, -683, -976, 494, -5, -582, 17, -92, 396, 1263, 158, -712, 292, 737, -629, -178, 222, -375, -39, -53, -922, 379, 1222, -284, -518, -33, -247, -3, 789, -589, -637, 576, -122, -1047, -294, 443, -289, 434, 138, -338, 544, 684, -508, -436, -16, -623, -30, 246, -195, 147, 185, -223, -179, 625, 341, -111, -230, -394, -544, -21, -327, -397, 98]
1640I8j83j34M61M78k40j93l01m76N81K3n96L80J15n03L41P90p64O4M75k13l90
1661a87O21k22m84J13k13k70P11J92k88L35R8n52M74J48m89J70j96o16L18N63
1681B26m56n1N27q5l91O09j27r7J90l90q19Q95j45N7j99L15j66K98j7O2j89K54
1703C01o81K40j74M14mm37J69m62M58K27j5L11j01j93j9N3o15J94N27q28M62K45
1725G2J59p7J56O2k55L50k83n27O87m04o09M03P1J38K16n1j97Q4L49j02n8K4m70
1748b62k66M40N6o0N85n56j44P16n85N73j40m4n46p3J80P7j03L01n60L6M41k4
1770D2K20R8k27j41K44k30J07P2o2l10J11q8L28L22l14k64L52j82k91K16J04p51
1792f44K16J68nN25o3j35J08J58k23J27r9j58l03O8K06M6n2J01j17j13MK96K02
$$ y = [98, -85, -219, 242, 720, 480, 287, -14, -490, 91, 114, -482, -102, 13, -490, -149, 641, -123, -59, 416, 203, -187, 434, 212, -272, -159, -372, -642, 69, 261, -27, 308, 406, -146, 328, 476, -13, 157, -39, -655, -337, 226, -230, -281, 246, 161, -230, 379, 252, 155, 345, -45, -864, 31, -114, -57, -256, 59, -107, 191, 174, 236, 47, 301, -380, -140, -314, 100, 96, -341, -172, -634, -176, 51, 36, 347, 246, 53, 34, 87, -528, -334, 193, -635, -173, 72, 231, 154, 310, 372, 117, 467, 184, -343, 344, -60, -669, -266, -195, -57, 159, 108, -89, -5, 344, 242, 184, 208, -262, -528, -88, -32, -92, 493, -63, -207, 509, -76, 497, 357, 313, -233, -306, -126, -49, -152, 149, -411, -375, 66, 42, 262, 360, 133, -8, 236, 6, 113, 185, 123, -187, -76, -164, 164, 486, 172, -92, 260, 78, -213, 3, 107, -644, -428, -260, -265, 260, 197, 62, 170, 328, 105, 232, 133, -25, -328, -260, -54, -8, -60, 41, -76, -189, -185, 111, 313]
1815C13R8n11J08qk97J80j30M58l53J7n5J93L42ol55J05J49j47n16N49m7l08j14
1838c35J44M69m23K93J33m02K49J08o08L20K58o72P2M90k48M89k03q7j09M51J57
1859E46l39r8m20M6L07l47L4J64K89l13m8J65K45J12j02k45Q7j1k53K01K95n37
1881b22m01P65l99N03O73r36m44N80j85j95O60p27j81Q80m76k97R25j37p97M20
1901IJ45l71M67j46r95L04P01l28k08P60l38L00J00r24O37O72j180j12P30l98
1921a75m11Q85k99n57R54j53r83J095L87r41NN26j149Q72M70j123L21R38j031
1940c69j12J032m65O5K12n13m68J367p90q54P15J64n33P31M71j299J420l2j418
1959f76K34J443j529K63N44r05N45Q14j121J78J235q45q27J256p40n39J348r17
$$ y = [313, 411, -100, 8, 0, -297, -117, -247, 211, -142, -125, -180, 13, 355, 349, -6, 99, 248, 101, -415, 134, 87, -221, -335, -191, 278, -145, 148, 281, -121, 128, 236, -372, -52, 206, -466, -394, 96, -152, 337, 134, 47, -62, 389, 546, 207, 109, -311, -265, 42, -305, -271, -107, 182, -131, -179, -14, 231, 343, 241, -4, 83, 72, -181, 20, 315, -222, -623, 142, -257, 246, 919, -17, -461, 119, -66, -261, 399, -328, -509, 371, -105, -402, 523, 386, -411, 9, 154, -217, 250, 104, -891, -587, 114, -214, -422, 338, 0, 300, 400, -524, 113, 785, -395, -507, 223, -175, -586, 299, 0, -557, 397, 244, -739, 356, 743, -198, -193, 333, -816, 56, 526, -597, -276, 662, -369, -481, 551, 86, 151, 363, -150, -618, 749, -41, -895, -180, -16, -549, 182, 653, -646, 774, 742, -676, -442, 1001, -528, -265, 279, -626, -81, 733, -388, -210, 1025, 180, -647, 609, -131, -670, 678, -239]
1977b39j035J754K12j668J196O72j057N08J60j205R72O16j891K14J263o02K00
1994G0J85j119M64J682j185q27J485m63n85Q42m95p99J353k26j551R49J398j530
2012c52k53J177p41L82K86j519R04J355j914m49J449p17K23J165j625J89J825
2029A385q27j944J490L43q44M10l33n75J778j7k016L02J532p94M55J13j108N19
2047a31R26j357k26J389o60m84N60j79K91J013p68j571J747J85j461M79L76q65
2065g36J179j45j189J567O49j806p7Q76n09K40J95j087J84J394j120r93K178n53
2083B47n55J008j030q8J353n87j559R48R14j343O99K37p44P93J16j028J86J794
2101A361j390m14P49n91M09O16j257Q5J334p05j065J157J22m71O11r24o96J793
$$ y = [-239, -1274, 480, 692, -976, 220, 892, -165, 343, 503, -702, 270, 886, -1005, -791, 472, -130, 70, 255, -864, -400, 1282, 97, -730, 755, 292, -293, 549, 54, -745, 608, 382, -1169, -220, 1178, -352, -605, 572, -169, 213, 499, -1020, -116, 1239, -675, -1124, 325, -392, -169, 996, -629, -440, 1385, 558, -1386, 104, 447, -397, 13, -320, -895, 883, 866, -1150, -848, 684, -110, 345, 458, -650, -131, 795, -562, -788, 601, -59, -543, 17, -162, 129, 1142, 374, -1197, 550, 735, -726, -247, 129, -736, 443, 298, -891, 676, 1325, -481, -558, 318, -191, 49, 244, -843, -659, 735, -385, -1378, 800, 247, -308, 700, -330, -418, 935, 348, -1211, -263, 651, -692, 7, 244, -500, 293, 409, -619, -433, 1361, -29, -443, 306, -285, 124, 740, -517, -432, 902, 197, -868, 289, 411, -60, 551, -373, -1069, 724]
2119G24k87j353Q42P40j242P20K73r81J068O52j733j50J236n06p85J123p33M18
2137B6P34j356J68J625q75j057J012J48o75P47p84j069J583M12j513O72O08j71
2155B35m6K84p47M11N68j346l48J958j266j08P68n49K8P26j027k32J412j79j232
2174f90P33N7o05P76Oj211R74P77j393N07N54n97oQ66j290K71J223j483k48J352
2194E73p87j45O64m06m00J529q09j350J461L22j072K55l82L1R66J47j326M66J234
2213I71j079n08J108o01L94K44j474L19J031k67p64J019j56m84R00m21q39J075
2231D68R2j190M44N74p50L92J40j019R40R27j454j09J147n08l51O82n73j38P07
2250D21o05n64J327k75r20O97l3l39O70j80q45N12M32j007M57N19m69N44k53n28
$$ y = [724, 437, -916, -74, 666, -576, 144, 417, -564, 504, 1156, -577, -727, 509, 3, -782, 341, -392, 26, 760, -596, -428, 1197, 322, -735, 277, 425, -250, 497, -287, -1356, 227, 639, -874, -202, 406, 235, 189, 473, -274, 137, 705, -641, -989, 969, -297, -405, 363, -186, -158, 568, -459, -691, 721, 542, -690, 43, 100, -505, 271, 277, -934, 40, 817, -576, -69, 485, -112, -118, 748, -542, -271, 952, -531, -779, 573, -214, -359, 305, -101, -501, 1028, 219, -1131, 330, 652, -420, -165, -547, -516, 450, 597, -729, -263, 971, -108, -616, 492, -109, 285, 529, -945, -626, 405, 138, -626, 393, 237, -247, 653, 232, -607, 468, 560, -630, -186, 388, -362, 30, 170, -849, 91, 1018, -436, -545, 602, 94, -257, 425, -148, -286, 421, -184, -748, 579, 304, -616, 81, 48, -291, 379, 199, -646, -134, 298, -709, -252, 267, -202, 342, 89, -439]
2270d39K34Q90r40j6O04n79j0M25l19j50Q66m33j012J388j06m15K86l07N5p9M19
2291C62q89L82K35k83J86M26k54k29P20j063J61M88j40k49L57l54l03N61J14k53
2311b5O45l09p41O05j33k17nM67n81K22K68k17Q5J04k74P1N23n12j52M41l67J58
2333E6Q6l59o0K71J57k55oL61j16J88m42Rj52K58l30K07N2j82N30k13J3Q6K43
2356D02l45j03L7J20k42K72l56j51N51qo23O70j90o8J13J17n43J93K77m00QN9
2378b10J15L0K79l26O9M63k63k11L61m67J14J82k29j06L39J19m35J31L14m13O09
2399D65m91k73J40K05k1l58M48l61K22L09l14J4M5J33Q0LN5l23O4j77K10j25q9
2422a39P6J63j06J91K5k18r6j42L84l8j42J90m93K81o5j40M52K4k35K9J63k67
$$ y = [-439, -205, 685, -255, -271, 333, -246, -256, 169, -150, -300, 566, 133, -879, 509, 403, -12, 274, -33, 22, -57, 362, -527, -145, 90, -193, -7, 419, 165, -64, 656, -407, -246, 242, 102, -147, 210, -144, -447, 114, 228, -25, 620, 311, -430, 175, 42, -175, -180, 287, -294, -72, 196, -21, 64, 168, -106, -35, 488, -24, -176, 265, -102, 56, 142, -217, -277, -6, 151, -104, -110, 251, 135, 323, -119, -110, -262, -4, -334, -127, -75, -257, 273, 60, 73, 159, 402, 57, -46, -9, 111, -131, 141, -215, -366, 185, 177, -446, 224, 34, -34, 79, 196, -347, -154, 123, -277, -269, -210, -95, -65, 214, -112, -43, 420, 157, -54, 307, -160, -46, 136, -93, -199, 140, 259, -176, -45, 269, -144, 465, -26, -299, -159, 46, 25, -333, 115, -246, -24, 285, -29, -15, 30, 163, 243, 246, 301, -22, 42, -135, 75, -50, -139, -63, 100, -6, 185, 210, -8, -104, -246, 138, 100, -42, 148, -345, -64, -129, -269, 183, 207, -28, 1, 164, -103]
2444a03j52J95J0n2j07J77L9K3k92L68J3J08MM4j91o2n6M8l59K84J13l2j7j22
2468a19J26k58L07l98K25J22j32Q0K24O1k48N3k64L23J7l7j21K52k81j04J80K41
2490B49j98n54N05j53L51k71L59l94K34k57j04M62j57k17M57l04o0K47j66M8k08
2511a31P8j37L54o8l78K80j71j23J90L43l13j14M44m22K01K93l93j85K59K0K0
2532D7k91K01k89M07j59O7J77p6m20J51K86m16K35N7l90j16M21O7J63n4p6N2N2
2555I6P7r7K78o57J64p3N30n97J92K22k38m0K46k25K8L59k65l18M30m65M9L53
2577D9k30J58K36j17l63O24m13nP4m3l18M23L54r40L14L82n65M20J01m26L08J95
2599B18n53J50J02n6k32L66K1n72Q04p2k82N48l27n18M46L52m14j18N05j029O70
$$ y = [-103, -255, -60, -50, -102, -209, -32, 7, 30, -262, 106, 119, 227, 231, 275, 84, 22, -34, 14, -345, -61, 52, 20, 3, -119, 7, -251, 56, -342, -117, 5, -127, -47, 177, 238, -10, 43, -221, 102, 119, 82, -39, 213, -68, -172, 8, 249, 51, -503, 2, -151, 200, -71, 288, -106, 128, -129, -233, 229, 72, -145, 312, 8, -52, 195, 29, 77, -131, -53, -190, 164, 96, -282, -2, -173, -296, -106, 237, -76, -190, 254, -168, 33, 326, -67, -252, 7, 27, 47, -244, -43, -332, 75, -84, -17, 160, 84, -336, -185, 101, -315, -80, -23, -413, -529, -108, -41, 122, 68, -8, 44, 96, 173, 76, 354, -303, -139, -212, 318, -279, -87, 135, -103, -143, 103, -122, -94, 265, 0, -318, 112, -353, -304, 49, -181, -23, 213, 96, -267, 357, -56, -61, 13, -30, -348, 75, 429, -511, -197, 185, -380, 40, 141, -285, 23, 218, -335, -185, -83, -139, -371, -5, 16, -556, 248, 176, -106, 442, 115, -403, 43, 395, -19, -137, 368, -661, 9]
2620IM37r95N73K98l72K15K16n78L78N70q68m85R83m72k99Q75k59n74O96j86m62
2641c00O59lp24K43N58p26K78L03r00M52L88k47m2Q14n68k84L26o56K52N32k95
2662F0q14J014P7m34O22m89m57N54K96r29K99M30n44j28P49o15L30M21q42J50
2682b50P76n09l76R07m81o07R61n89j92Q26m34p50P78J52j54J79L0q56N71K23
2702B05r99Q62J67l31J82L95m66L42L76p52k63N27o06k26M98J79n02N27l62L6
2722b11M32N54j327M75N36m78M0J07o68O00N60j186M93K99o1m55N15l06j44J098
2742H73j052k62J85L39m15L05l8k85R48n24p89O99N54r32l85J006n53L61L71q40
2762d34M28K81o1p04P74j02j72P1k28j75O63k4o59N86J3m65L45L23n50Q0J76o86
$$ y = [9, 446, -549, 24, 322, -50, 165, 381, -197, 181, 751, -117, -602, 381, -91, -390, 485, 226, -348, 348, 162, -300, 359, 356, -368, -125, 433, -293, -15, 288, -612, -160, 228, -19, -61, 753, 185, -99, 227, -429, -177, 355, 60, -754, 260, 337, -97, 525, 36, -421, 133, 429, -500, -201, 229, -315, -443, 306, -309, 21, 442, -400, -250, 526, 17, -359, 548, 67, -540, 421, -168, -360, 466, 32, -718, 60, 212, 58, 237, 267, -589, -18, 205, -794, 68, 235, -96, 86, 481, 15, 357, 733, -19, -282, 245, -361, -587, -89, 90, -412, 115, -247, -211, 221, 775, -552, -77, 459, -19, 21, 128, -540, 60, 620, -566, -73, 226, 165, -290, 225, -81, -225, 873, -179, -441, -256, 83, -332, -27, -65, -350, 598, 74, -715, -16, 538, -394, -779, 227, -326, 35, 406, -434, -6, 275, 214, -490, 284, 182, 10, 81, -147, -322, 341, 317, -342, 244, 257, -208, 137, 460, -90, -10, 166, -520]
2784e20O06K49o81K00O23p11J81L13m33K3P15l37n45L77O8J31J19m40n22Q66j67
2805A15l43L50J85n33M01L32r92N54L50o83l89Q07k59j8L12j46m27N62j55n96
2825e73Q89J8r63N29K49l27N19j45n61L66O49j021L33L60l60M37l13p00N89L76
2845C51o57j6P75m26k05N32n06j93R82p78j81N87J19q03N72k81J36O9K36p66L88
2866f5L93o23K25P22p87K26M2m62K5N38j22l83N75N5o04M57l05m65O81Nn37L58
2888e1J49l45L46J26m27O05j23n80o5N49k03j82N25o62K05R8j58j22O96k97j76
2909i2K68k71K78J73k32p07Q24k33n8N4j44J00J53J48m03o7M90k60n1K36n07K13
2931h8K17m3j46K59k42k92M76J84l75L79l75k8K36j14l21J97L73k01K16l45k38
$$ y = [-520, 86, 335, -346, -146, 477, -234, -53, 260, -173, -150, 565, 228, -317, 60, 128, 259, 378, -62, -584, 282, 115, -228, 122, 307, -226, 175, 507, -485, 69, 419, -264, -653, 154, -105, -123, 189, 43, -384, 178, 23, -573, 316, 334, -629, -100, 149, -178, 341, 196, -365, 1, 650, -371, -38, 322, -38, 399, 86, -614, -25, 351, -306, -322, 453, 27, -178, 354, -152, -345, 637, -141, -322, 265, 384, -419, 153, -128, 8, 77, 313, -453, -65, 328, -295, -70, 652, -135, 91, 133, -329, -304, 234, 112, -271, 304, 359, -245, 212, -93, -558, 123, 128, -409, -51, 98, -247, 99, 225, -202, 403, 280, -300, -365, 184, -19, -201, 324, -338, -133, -35, -193, -315, 381, 84, -92, 176, -95, 183, 356, 124, -583, 241, 8, -50, 4, -140, -40, 113, 261, -142, -209, 281, 21, -30, 206, -301, -88, 129, 86, -60, 199, -43, -335, 141, 325, -50, 329, -46, -74, 162, 48, -273, -76, 297, 96, 312, -33, -271]
2952b71K31N39l58k70K28J26m42L41k63o1M75L2m65o9M72k43N1J82l15k02L06
2973B4l0l1J15j89Q3M22m08r6L00k10k3N81n81R7j08m0J69k31j4K64j29j07R2
2996e0l0K95k32j37L5L0l42O41m41K18L14m09M99M5l86j84K92l54J22j53K46l20
3018c01K68k35j66N10m3j12PQ8K64n67L50jk94K46j31r5J23O8m4J21J29k80L22
3041B27j51m9q9k05M00j73K99o78L59m0J8K08j08K66m23K84j90R8j97J81Q8K24
3063C49m21K03J96k02o6m8J44pk63j3LM52l7j08j79j83O5q4K65J61l39R4M08m40
3087e0J79l58J34pj0K83j21J97m07J05N6J54K89n97o9M15P7l55l7J0J98m1r0L53
3111C08l81O5J68j1m58O84n17P24p24j49M82K08l88R4L2p0j74M3%J87N3l71L59
$$ y = [-271, -40, 499, 141, -129, 99, 225, -217, 124, -139, -200, 275, 307, -158, -227, 245, 2, 53, 235, -80, -282, 24, -6, -37, 78, -111, -28, 394, -14, -110, 190, -20, -43, 538, -43, 54, -54, -94, 75, -156, -170, 94, -35, -142, -50, -80, 215, -17, -154, -119, -89, -431, 210, -231, -13, 301, -108, 391, 436, 50, -134, 158, -196, -74, -227, 19, -301, -33, -268, -434, 76, 33, -79, -72, 16, 280, -287, 63, 62, -232, 14, -117, -212, -89, -21, -65, 56, 185, -95, 227, 76, 27, -62, -267, 133, -40, 259, -419, -60, -100, -82, 126, 18, 284, -139, 145, -45, 53, -144, 37, 125, 349, -72, 131, 327, 125, 59, 11, 155, 148, -115, -128, -125, 327, 290, 182, 3, -180, -115, -199, 66, 227, -112, -18, 390, -50, 129, -229, -95, -102, -112, 171, 50, 247, -160, -55, 1, 155, 444, -153, -222, 193, 270, -85, -122, -112, 86, 45, -45, 308, -73, -8, 160, 149, -309, 375, -142, 582, -142, -291, 191, 399, 11, 105, 137, 67, -107, -64, -64, 123, 176, -195, 164]
3134A64k04J92j57J67j43J17j02j4j44K48j1m6k47K69J34k1k51j2k6K13j47K4
3156CK0j95L4pQ2J64j14K92k53J95k88M44k98l01K37OO3k87L95k76J58q3J12l6
3180F7N0j22N5J86n43N51m85K57K94r8j85j48J55k02L10n0Rm76K91J81J54l56
3202a05K48j95O6Q5o1l1r0M0J53l66o4L10K0O3j34j83L25m09M82m92L58J88Ok66
3226e2l14M82l07K76j12r1J95o6N7K24l94NM0K36Q9n29O55l28j91L1j88J46L98
3249B62l52k01K74J69j54L4R7k39N5r5M0K40p8j9p2j9L0j20J08K59k66O2k41l
3273b29M06K2k74M30q1j73K67j64k67K47k65J71l00J48l0J75j97K16k7k5R2l0
3295A12r6n2K9l0L88k32k28L22l55J59M44l29j73Q7l07N23k85j66K9M02k43j50
$$ y = [164, -40, 152, -5, 162, 19, 136, 34, 20, -124, 124, 113, 67, -180, 89, 223, 202, -49, -61, -87, 126, -21, 3, 23, -172, -138, -145, -63, 101, -13, 279, 26, 221, -67, 377, 79, -222, 15, 21, 84, -203, 192, -84, 74, -9, 103, 67, 117, -5, 50, 236, -307, 244, -241, 16, 310, 212, 27, -121, 34, -168, 142, 92, 101, -375, -84, 97, 251, -105, 143, -52, 14, 99, 38, 7, -83, -43, 110, -256, -320, -10, 10, 73, -61, -244, 81, -328, 154, -338, 20, 208, 214, -52, -366, 116, -191, 85, -27, -118, 77, 11, 68, 292, -102, -97, -57, 179, 268, -261, 394, 66, -125, -94, -282, -136, 262, -90, -291, -17, 152, -2, 32, 129, -110, -55, -150, -110, 130, 52, 33, -39, -58, -28, -148, -40, 219, -47, 15, -226, -229, 177, 199, -75, 355, 274, 101, 368, 204, -63, 184, -81, 90, -210, -62, -92, 83, -114, 102, 75, 50, 142, 112, 16, -36, -7, -37, 351, 119, -109, 213, -142, 17, 461, 132, -41, 46, -261, 262, -23, -189, -160, 242, -1, -151]
3317a51K75j43K49k30P2k01J89mk99P2K45o7j74J08j4k14L68k15K10J01j35K9
3339G1k92r7K42K66l91J55K68j61n5j63L04k65L39l03q1P01l33m63O5P25o28L
3361i3MK32L4Kn23j03J108p80P2j58K26K85k09k25J00k89N27J00m06L3j26k1J69
3384d1k78K84L99o06L29j86K27j61K41j90k08K78j5j76K37p9j26O2M11m51K66
3405B17l54l7K45N6N6j82k5n1K9K49j88R0J41k08O4j03L0j17K68k37j52J56j6
3428f9K0jJ7j59N14m80P0J95J13n20O6K58n5p1K97n19K72M8j86L04j05Rj80J57
3452ek30Q8K48k15j8L78k08k14L43k28lR3J34p5j47L37m31k20J67J3N98l69j74
3475a38J60R9N1l05J08K03j43K2l18K37K25k68J86N0j82j74J56j55L7L23k1k57
$$ y = [-151, 124, -19, 230, 0, 72, -129, 60, 56, -243, -171, 74, 7, -167, -59, -73, -287, 81, -134, 76, 177, 42, 71, -221, -318, -76, 190, -201, -46, 222, 61, 6, -157, 147, -118, 221, -82, -163, 538, 205, -258, -193, 532, -96, -93, -89, 143, 177, 179, -344, -447, 661, -119, -47, -205, 21, 306, 97, -128, -28, -317, 210, 310, -96, -63, -189, -210, -41, -319, -35, 364, -242, 87, -99, 128, -33, 208, 18, -190, 88, 73, -103, 134, 55, -71, -9, 402, -49, 217, -137, -174, 71, 127, 183, 1, -24, -75, -46, 203, 15, 105, 246, 38, 102, -1, 29, -88, 180, -57, -209, -53, -69, -49, -50, -33, -192, 322, -158, -88, 107, 220, -300, -234, 24, -31, -102, 195, -324, -52, -4, -190, 114, 9, 18, -162, -5, -235, -147, 101, -114, -132, 246, 38, -176, 167, -61, -64, 29, 163, 88, -59, 278, -153, -373, -206, -193, 405, 36, -138, 22, 121, 172, -133, -25, 178, 35, 57, -261, -24, 201, -67, 119, 169, -13, -187, -31, -186, -149, 174, 153, -104]
3497a04K2r6j61L30j44m0K02j22m7j98N22J30k79q8J16j47J52k68K5N67l99K08
3519A81K13m0m30K15j26J88q4j35k9k70K78j47J84j5L89l55j22j29K88j95J47
3540FMj19Q9j71K49l78J40J92J15l35J39J57n4M5j00j3J7K82j08l05N1K60k27
3563f4K51k92N6P4K00k41j49J28j59j36L81k23K28k33p7L21J04k58R2j39Q4O6
3585A4kK32k13mj70J31J79L7j17J1P7k73K10j26l42N47J98m5l19l76L47J11K30
3608C37n57K35J28k88J61L26k92j38L65k25l0L03m64L62l09M3o9J57j87N3%n4
3630a43K2K69j90L44l50K07j39ok01J17J03j80r3p9J83J31j91L58j25J03k07p4
3652a41M3j56M97n46J14j7J70j31K28j79J10M3M43l31l06J19k3L6K8K05m84K43
$$ y = [-104, -82, -178, -339, -9, -153, -193, 9, -113, -160, -358, 164, 294, 15, -73, 43, -104, 48, -220, -195, 372, -27, 181, 394, 354, -76, 139, 13, 201, 117, -18, -47, -317, -39, -186, -2, -17, 372, 17, -105, -234, 54, -141, 6, 10, -109, -20, -191, 58, -320, -180, 12, 127, -208, -69, 88, 34, 79, -21, -34, -17, 265, 157, -148, -97, 163, -64, 187, -105, -49, 25, 225, -16, -165, -37, -196, -332, 49, -174, 54, -179, -256, 65, 169, -89, 3, -136, -52, 14, 12, 244, 31, 27, -143, -12, 167, 204, 87, 98, 175, -98, 112, -14, -356, 191, 389, 344, 25, -351, -4, 107, 337, -220, 15, 143, -145, 16, 342, 50, -88, 277, 52, 22, 325, -139, 223, -86, -43, -112, 45, -142, -89, -89, -143, -121, 148, -42, 302, -48, 159, 20, 14, -187, -70, 33, -147, -240, -319, -136, -5, -196, 162, 37, 140, -67, -141, -98, -254, 243, -303, -189, -206, -36, -167, 61, -118, -8, 35, 478, 147, -159, -40, -63, -27, 1, 206, -278, -35]
3674c5J03k43j00J54M54o9j57j5k8k21J70q5K33J23Ql96K73L7l12l7K89j45J22
3697A23O9m19K16q5J56k83L95J18m40J18K42k78p7J75K2j45L95k87J17p7j78J35
3719A2r6n8JJ91J53k87P3Q0p9k36j75L79K85n05J90j82k3M89k60j8J55j54p6n5
3743a96J91j03K79J84m19j0R5J20J07j26m88N02n06L08o2R8l03L22J07k04K14
3764A10r8j43P7j62Q0J44K6MM6j10j76J86J78j2j3J58k76o2J32k61L20Ll35j7
3788b01K67k53L14j53L11m70K48r0K30n99M85J1k76N20k75J51l15J80j72K00m06
3809b93J91J34j52Q4j45J0J92k26J00J69m11J41K47M8o4nl5%M7r0J61j97L25j92
3833C9K72m90K79k37j06K82j8J71m23L02l7L2J04J2j58j00nJ84r4L8J31k08j93
$$ y = [-35, 68, -175, -275, -121, 333, 264, 107, 92, 64, -157, 13, -72, 161, 284, 292, -104, 169, 206, -106, -143, 146, 1, 123, 192, -227, -11, -96, 60, -223, 172, 290, -150, -32, 210, -68, -145, 30, 52, -93, 302, 15, 132, 55, -123, 12, -84, -142, -141, 50, 203, -84, -11, 69, -10, -246, -421, -42, 243, -262, -72, -254, -277, 212, -48, -66, 89, -65, -141, -196, -5, -108, 171, 355, -64, -74, 21, 141, 248, 122, -366, 136, -370, -62, -124, -26, -329, -7, 100, -104, 110, 12, -131, -54, -216, -136, 8, 34, 38, 84, -26, -202, -16, 162, 150, 137, 295, 19, -43, 89, -172, 148, 151, -184, -201, 66, -187, 127, -26, 285, -185, 63, -27, 203, -396, 89, 100, -176, 344, 69, 220, -95, 85, -87, 113, -293, -102, 32, -120, -36, -181, -171, 21, -205, -105, 64, -347, -206, 41, 89, 25, 20, -15, -15, 32, -58, 103, -94, 231, 39, 311, -179, 100, -137, -243, 39, 21, 192, -231, 71, 34, 66, 170, 182, 24, -76, -81, 103, 9, 47, 178, -30, -223]
3856b23J35R0j14m4j20K99l3J44l3k10J23j77J82J17m0J33l65R1J59p0K9q8j22
3879a37J33K07j3k39K07j49m9k3L0k1L18k55J17j3k18J60O2K06l33r7J45J8N6
3902A12p0o1k30L53J45p6l2j43O5J16m8j61J32m0N5M6k45J37q6j58L16M1J89n32
3926a75J67J23k26R4J9R2l56J81L37j39j98K96j00j93l5Q1m4J34k32L30j93k40
3948b77M76K82j21j78k97J9N3K00q1M3K8R7m37K55K5j73k15J92Q4j22K65j93P
3971f8P1j7qN5k10L05j46P9J1j09L12k94l89N59k8j83j78M90K05l58N3r7L3J88
3995B76k22m1N4kM0l38L19l18M62j53J44l3k99k7R3l6j79J83m7J7J90k47N3L23
4019B12k27J17k43m8J89m1j76M94k99k43M65O6j57P1k65J36q0J71k87L07n1K76
$$ y = [-223, -88, 2, -112, -156, -276, 23, -10, 134, 101, -109, 14, -163, 19, 136, 96, 229, -136, -45, 114, 44, 73, -15, -137, -4, 203, 190, -49, 158, 9, -40, -63, -33, -54, 264, 9, 126, 113, -105, 55, 117, 323, -10, -107, 38, 56, 112, 42, -19, -249, 104, 249, 173, 141, -2, 63, 179, 131, -30, 102, 62, 117, 163, -82, 55, -31, -189, 127, 168, 357, -175, -8, 115, -111, -17, 2, 94, -262, -81, 256, 117, -81, 215, 115, -78, -113, -32, -76, 58, -174, 156, -37, -277, 199, 481, 360, 182, -115, -96, -43, 157, 76, 119, 147, 244, -193, 62, 87, -86, -301, -109, -25, -147, 118, -75, -68, 3, -14, -22, 33, -177, 128, -18, 61, 72, -37, 275, -19, -408, 151, 123, -60, -238, 252, 457, 99, 152, 55, 88, 276, 54, 13, 67, 65, 105, -233, 86, -232, 230, 77, 221, 188, -111, -138, -45, -81, -260, -77, -124, -107, 83, -164, -111, 212, -15, 102, -141, -189, 0, -41, -217, 277, -22, -265, 200, 266, 109, 180, -85, 51, -29, 142, -145, 162, 111, 387]
4041C87l74m06M68j55J81p8k3q0N43m84j36K45j58L68k32k79K50k80M07K6l26
4062a36j61J12L86J37k76K42o5l00J10j34j97K04K47j82P9R7j63k3j09q6L17r1
4084HJ42k85L76l87K71Q1k37j00J57j30O6j1O3j20K38j32K90m26l49N52J39J13
4106C19k74o6q3L6j52K02J8J06J48k4r6k64J59k81P4M16l31q9J02j8j24J92K1
4129iQ0k27OK94n1j50n0Q0k73R3L76l28J66J84j03k03J69L22l87J08j29j71J96
4152gJ06n5l12P71m80j8J71j22j66K37q6j03k20N97n05J07j74J53K39k02J55J02
4174A88m6k41k5J24O0K2K33k87l99O64j98J6m3j50K71k54o7J9J52k21K01Lj03
4197h1J99MR6l74M03j62l11J56J2K6k26M53l90j94K51L05R4l73L90l97L59l20
$$ y = [387, 13, -393, 75, -80, 101, 23, 0, -80, 463, -21, -157, 88, -70, 298, 66, -213, 37, -243, 164, 190, -136, -297, -185, 201, 338, 62, 304, 239, -61, 49, -85, -282, -78, 169, -13, 66, 163, 0, -23, -132, -218, 99, 8, 150, -135, 241, -146, 125, 206, -31, -131, 26, -104, -38, -49, 14, -106, 132, 0, 290, -136, -485, 67, 206, 319, 45, -21, -104, -68, -220, -18, 0, 106, 254, 230, 134, -130, 29, -252, -178, 238, -93, -182, -80, -98, -222, -30, -9, 71, -156, -150, 144, 93, -57, -107, -27, -300, -207, 169, -159, 7, 191, 88, -115, 54, 376, -11, 97, -32, -203, -7, 99, 44, -268, 503, 23, 5, 176, 54, -112, 125, 39, -64, -284, 313, -192, -85, -259, -106, 133, -69, 86, 188, 142, -99, -124, 0, 60, 82, 315, 28, -371, 293, 95, 111, 68, -82, 189, -65, -132, -113, 39, -182, 19, 22, -81, 118, 122, 218, -156, 247, 85, -226, -70, -58, -32, -258, 195, -195, -389, -138, 167, 261, -112, 278, -119, 240, -80]
4219h0j0M15m48k3J6oJ63j34n1J28j76K78m26L77o0J50o6M3j50j01K22J65m80
4242b54K23p5K19j94M1J42p7j14J5J29q1K22nj90Q8p5j66P6J47J62l85J55L08
4265C11l03j32J05k97L78O6l26K59j79J84j5K46j47m7M5n42K31j4o9j03M69j46
4287b6p2J35K10n63J58K39j82L40k25m4j31R0k87M83K53k87l03K56l3M4P0L1j49
4310Gj64K49m1j15J8qL73n9o46N57j54R2j71L44k32j26PK38k88J91o6r0L27m05
4334a62K98j63J37j16J91j98p1n2K76m51K74K94o01K71K83n17K38L4j47K99M4
4355A61r9j12L3k68M44k27J69J24k97L4L5k28J65P6m3J15K48l4l68o0L23j8%r0
4379H3m4j70q3J18q0j14M59m0l63J54j82L46m25K99j21m6J05j51K12n9J31K5J96
$$ y = [-80, -90, 325, -123, -146, -130, -136, 27, -107, -158, -30, -206, 72, -354, 23, -37, 113, 47, 90, -60, -161, 61, 226, -254, -31, -106, 113, -81, -40, 102, 25, -89, -74, 55, -26, 196, 191, 1, 89, 14, -152, -76, 71, 233, -152, 3, 311, 8, -124, -19, -316, 62, 128, -198, 61, -118, 66, 51, 297, 150, 103, 148, -394, -163, -177, -246, -349, 120, -26, -98, 37, 247, -316, -158, 81, -101, 239, 14, -30, -161, -71, -358, 125, 378, 91, -212, 44, 11, 55, 125, 156, 7, -157, 92, 51, -64, -46, -54, 319, 260, -386, 171, 17, 109, -62, 282, 50, -76, -69, 169, -119, 72, 6, -84, 243, -162, 136, -27, 110, -6, 185, -13, -84, -136, 140, -311, -37, 257, -344, -73, 210, -307, -69, -35, -182, 117, 161, 62, -50, -17, -285, 159, -68, 101, 225, -72, -38, -3, -231, -66, 10, -33, 82, 330, 296, -72, -132, 191, 173, 173, 83, 39, -131, -214, -96, -176, -290, 169, 129, -234, -80, -262, 84, -341, -42, -163, -209, -104, -255, -43, -102, 29, 54, 250]
4402B50m27K09P5q0j71L26j61j27q2J55j52L6m6J25J87oj47q2K9J18J57j33l32
4425b79J17L42k23L65n19J05M5pQ2J62r0m5n3K25m9m1K0j04J3k12r0K95Mk25J33
4450b9J0k07M34l92q8J64K44J47j91J23k93K29q3j66J87j38j49J66r1OP8K5n4
4473f8J21k84L4K97j92K37k15j84J28J31l5l04L76l7j25l4k4K82j88P0N4p8j85
4496b23K68O7j61p5J52n9l03L57L9K4k9J11k21j74J90m3J93J62o2j98j83L60j15
4519G7l03K84j08J05j15l0J73j54J36J5k2l09K71J5O4l00J73Q7q9K29m27J87l0
4542g1j09K56j37j4J68k25J83k31qK12k9J91k2L0m07K11l51K37J84l92J93J86
4564E5j93KL48m55r3J28Q3J95j14J87l60J62K90k42J0j46L61j43k0q1o6K08m8
$$ y = [250, -177, 32, 107, 27, -144, 182, 21, -106, -188, -33, -185, -149, -195, -70, 117, 111, -36, -118, -89, 29, 186, 53, -279, -162, 180, -43, 322, -197, -92, -47, -54, 28, 190, 100, 55, 2, 227, 178, 137, 157, 53, 66, -146, -236, 59, 63, -162, -29, -19, -226, 208, -184, -272, -108, 136, 283, 92, 215, -78, 151, 68, -98, 89, -49, -198, -32, -123, -117, -39, -14, -68, 53, -231, -197, 100, -92, 145, -70, -254, -126, 5, -30, -334, 42, 5, -120, -154, -178, 104, -84, -14, 40, -38, -223, 45, 112, -49, -124, 28, -31, -334, 23, 62, 86, 57, 168, -53, -227, -37, -80, 113, 275, 213, 15, -168, 192, 77, -226, 58, -50, 55, -60, -90, 83, -71, 65, 80, 58, -251, 20, 35, 99, -201, -28, 59, -30, 199, -228, -41, -71, -180, 76, -61, -75, 93, -132, 51, -180, -188, 24, -5, 186, 164, 194, -213, -2, -353, -116, 68, -324, -131, 55, -138, -136, 212, -243, -336, -208, -125, 70, -44, 143, -217, -55, 235, -7, 3, -143, 218, 75, 55, -26, -92, 116, 68]
4587F8JR9n1k87J15M9m5N2J31k21J61m36L51K79q7q4j15k2P0l38L50l20L54R3
4611A67l71o3K01P1R6j34o7k0K43n2l8j30k8K08l31Q9K67k70R4M1J7K33n56M96
4635A63q0J55Q2l05l18N67n1n34L65K64k24j37K64NJ32l79q8p5L32l03L75q8n01
4658c79M01j11K43l08J39O4j20o3J96K08l35j73Q6K89k1P6k14J95m90J99L82k70
4680fJ36J1k21j56K88J92l10L40k19n04K80N32q89N32KJ23q5j82L25l39N8r0L22
4703A40L60n37j08K10k50K93n5j5J55p4r7k6J58r4m27M81L27n95l1K55j25k40
4725b95K72J25j12r1K09K27l57r4N8J64j90J41k3l49L23k95L56J41k67L50k59
4746C4K81o05M24j90n9J15j5r8J56k1K1J45j05l9k6j37q6L51L6j97j07J77J9k80
$$ y = [68, 69, 168, 117, -170, -55, -6, -51, 1, 132, -89, 72, -364, -13, 266, 179, 95, -20, -42, 28, -310, 40, -280, 74, 167, -204, -267, -66, 5, 101, -33, -100, -120, 123, 71, 33, -97, -125, 83, -248, -159, 108, -162, -68, -27, -10, 223, -333, 163, 83, 238, 320, 15, -303, 264, 213, -321, 44, 308, 84, -53, 211, 216, 348, -31, -119, -194, 138, -165, 210, 122, -379, 22, -89, 154, -154, -15, 49, -71, -134, 62, 270, -65, -238, -152, 137, 116, 192, -22, 173, -317, -118, 264, -6, 130, 141, -80, -236, 52, 244, -66, 274, 55, -449, -169, 363, -526, 6, 8, 131, 46, -136, 189, -150, -92, -182, 140, 500, -37, -145, 65, -185, 108, 53, 38, 193, 119, 22, -4, 154, 60, -367, 114, 441, -154, -185, 70, -55, -295, -23, 102, -10, -101, 108, 335, -22, -116, -58, 106, -84, 57, 34, -315, 8, -287, 69, 210, -57, 293, 34, 315, -290, 134, -56, -115, 0, -15, -113, 43, 22, 43, 188, 83, 44, 18, -119, -205, 146, 182, -15, -122, 55, 74, -206]
4770b06M79L1j17l07n3K59k2k40K36j7m3p0P8m4n1J24O2J78l42J79J88m02K41
4793A41j42J54j8j12J1l1K0J27k94O4K63l33K57j31J16r1J02j09Q8n9K1k80j34
4816c70M13j03K54m38L91j25j68L7P4N5j0R6j45o1L35l31N0J92J32l54K47l19
4838a48J76N5J50m86J80K18jp3j09J46m48J89N15m96q3K19L18k48j1N0r7K71m90
4861b03J92K26k31M8L4k47J80n6K7P9J6J82k85KJ36j71R8J06QK4k00M6L5K35n9
4886B22k18J45k65L27l0K49m38k50L57m67N83j07m10M12j48p0J26l0l28M29Q0
4907A69k10J51j38J95J55m00K99j35J03O4m64K69j35j02K71o9k11L39l94K49o2
4928e6k8K01N3l17N9L43j81J18k16j66J36Kp6P6L7q5n1J9L64k46l15K31k50J20
$$ y = [-206, 273, 304, 187, -120, -173, 86, 64, -176, 60, 43, 0, -70, 8, -36, -87, 37, 99, 277, -65, 114, 302, -100, 141, -1, 153, 135, 23, 34, 3, 23, 150, -144, -80, 183, -150, 107, -24, 92, 1, 103, -6, 82, 23, 44, -236, -370, 43, -60, 194, -244, 147, 22, -146, -109, -35, 20, 10, 106, -39, -100, 235, -96, -46, 146, 278, -76, 171, -148, 28, 83, 233, -253, -73, 145, 144, 71, -38, 108, -340, -151, 364, -132, -215, 4, 322, 74, 63, 113, 16, 287, -203, -11, 215, -16, 32, 66, -181, -1, -57, -30, 49, 65, 247, -38, -36, 100, -71, 27, 133, 141, 165, -35, 11, 46, 281, 222, 4, 149, -116, 211, 181, 430, -8, -258, 99, -368, 215, 108, -302, 110, -38, -108, 18, -12, -340, 89, 169, -41, 110, -28, 167, 322, -78, 221, 86, 189, 253, -211, 58, -77, -179, 92, 23, -188, 151, -243, 6, -56, -84, 117, 170, -147, -88, 255, 74, 192, -24, -190, -54, -52, -128, -52, -15, -100, -151, -132, 232, -14, -329, -98, -348, -228]
4952b28K91m2Pk68K64N8l9q1q8O5J07M3l0k4PO8k35M45J30n34K90j25j31k7O7
4977a0Q6J31%m66K85m4J79j18L1j80J94k29L07K03n07L95o71M77j06O1K5j91K80
5000A32M2j19k92L45m35K72J43k00J98j43j76L42j8j88J77k7N6j18o6R1O6j20
5022c8n5K46k39k65L02l60J93J71j39jM14k83j9J71k27L94k51J92l00l0L82Ok53
5045A1o1n0M1K15j74J62O5k76K18j74J01k76K49M76l96j06j2m3R9Rl72K99O2l23
5069b56L21j49J66k09K06j3K4O0J09l27J19K21l19Q0j93J2K41O6l59P3K08j13
5091c2Kj61J90l26K10L08j31K83l21O7k14J66k09j13J61Q4M6j18J02k63K32j46
5113a83J82k7N7n6p8oj11J34K90j31k21p8L06L8l66M16j92l9K13l67J33j32P2
$$ y = [-228, 63, 21, 28, -240, 24, 82, 43, -38, -126, -61, 46, 89, 59, 35, 42, 110, -125, 320, 450, -84, 206, 81, -50, -77, -10, 76, 207, 207, -259, 26, -18, 161, 43, 74, -106, 88, -141, 166, 369, -138, 257, -414, 63, -43, 18, 43, -148, 132, 174, 55, -237, 108, -327, -55, 88, -112, 86, -57, -233, 109, 91, -97, 80, 53, 109, -9, -75, 16, 82, -38, -93, 153, -86, -351, -49, -409, -216, -45, -184, -185, 229, -54, -73, 98, -129, 265, 14, 206, -94, -124, 258, 264, 11, -50, -100, -59, 156, -18, 144, 209, -67, 151, -23, 78, -198, 51, 527, 131, 25, 13, -30, 69, 78, -294, 5, 67, -256, 65, -84, 82, -127, 79, 66, 90, 150, 259, -68, 51, 272, -47, 33, -160, -148, 93, 159, -200, -127, 81, -32, -30, -191, -1, -327, -117, 191, 60, 343, 22, 89, -125, 41, -168, -281, -120, -36, 10, -108, -6, -269, -37, -183, -1, -28, 29, -27, -105, -111, -222, -88, 202, 71, -150, -228, 78, 116, -250, 166, -26, -65, 148, -219, -86, -218, -146]
5136a46o7j3K20J5J2j84Q2L9Jk57J18K86j71n1J74K6l22J87K56L1m69M48k00j01
5160h6n4K0j12J55J48k17L47l99K42j92Q9J88l0p0j3K39j62j65L24m72J58Q0J54
5183A72m19j1L03j97L78m22k2L87o8K5r3M73n67o0K72o8k92J72J52P0k04K01k78
5206i6J94k43n9NL26J21n22N80l48J41m39N34m69M48j89Lj99L72k06J56j79p9
5228a48J97k0L90p80L82j12QRN3K27k0k58j23j76J93K93k05J77p4l91J30M65m26
5251b09K27l85K95K64j7l67L42l81M88n07L82j3P7k59MK40M2J70m79J91p2N1K03
5274B87j22o0K9k55Q7K0j36J99J02k92J59J73j21K90k99k01j5M27n13J31r8N86
5296C78p56L90j28M09P9m24J47p5l33K50J48k60L67l47J98k59L49j20j6l1k22
$$ y = [-146, -213, -226, -6, 9, 21, -163, -81, -42, -41, -298, -180, 106, -65, -116, 58, 84, -238, -51, 205, 236, -233, 215, 15, -86, -140, -120, -232, -77, 71, -146, 201, -198, 44, -148, -59, 129, 99, 29, 16, 255, 93, -72, 252, -220, -62, 18, 172, -247, -258, 45, -152, 226, -196, -218, 169, 101, 126, 33, 506, -61, -121, 151, 83, -209, -37, 115, 185, -19, 182, -96, 98, -145, -204, -199, 127, 248, -274, 306, -42, 99, -340, 194, -275, 173, -16, -13, -212, 160, -46, 110, -69, -148, 49, 29, 419, -361, 21, -91, -83, -74, -21, 206, 186, -72, -195, -371, -178, 115, -90, 87, 13, -378, -248, 217, -209, 18, -367, -72, 192, 175, -192, 150, -231, 257, -250, 132, 119, 196, -63, -59, 181, 223, 393, -86, 105, 33, 84, 287, 165, 105, 134, -121, -34, -14, -150, 49, 151, -141, 18, 191, 70, 360, 61, -140, -155, 272, -241, -110, -208, 378, -378, 12, -116, 293, 372, -52, 95, 20, -313, -63, 85, -175, 192, -155, 43, -216, 133, 13, -3, -34, -256]
5317b56L01j48k59N6L23j67M81l94K45k55l4K74L8k82J52j50J35k19J96P3l2j42
5339f4M35l72n9K5K06J7j88j37N9K00j70J51L81n83k92M95k33L73l64J15K96j30
5361A61m78J77K58m09L25j28o7N8R2J48k20K96j45q0p8J20l41R1K09j46P0O8P
5384a2M0K56j33j10J73j02Q9k67K29l62m8L55l20K13K02k00j39oL31k32l5K90
5406B12n06L95J83n18L35k17O6J13L03k55J2j04J14j99m48P67k82K6n4J01j41
5427i7J59R6J68n55L83k32N8R5k54K93K7M2j28j33J30p6j93J88K22j85J56k22
5449e8j04n6k7K01OL87l36r1L4J86j45m7J01P5k3P4l2j8o8m7j18OO8N3K22l41
5475i8nK03j80J39Nj89J30m5J58k58J74J10l60P55o22n8L41m03K77J36j12m7j33
$$ y = [-256, 45, -103, -362, -306, 17, -150, 331, -63, 182, -73, -107, 167, 205, -77, 75, -75, 60, -159, 37, 110, 78, -64, 371, -1, -60, -35, 171, 188, 0, -137, -78, 122, -48, 103, 484, -99, -391, 104, -129, 244, -120, -5, 291, 161, -317, -140, 118, -291, 34, -94, -161, -103, -11, 137, -83, 213, 68, -12, -90, 30, -311, -220, -11, -157, -87, -19, -12, 28, 284, 151, 41, 214, 112, 201, -66, 163, -199, -247, 108, -212, 1, 203, 3, -136, -142, 189, -43, -78, 212, -294, 101, 284, -234, 101, -116, -50, 63, 366, 111, 123, 19, 133, -66, -514, 253, -29, -3, -57, 44, -97, 62, 158, 326, -229, 154, -78, -20, 75, -179, 114, 141, 183, 55, -78, 52, -24, -217, -29, 193, 8, 164, -58, -162, -218, -245, -44, -38, 349, 13, -78, -44, 142, -3, -50, 51, 126, 103, 177, 145, 127, 59, 12, -106, -100, -32, 21, 243, -98, -103, 100, -80, 59, 64, -125, 5, -40, 118, -140, 34, 144, -216, 539, -83, -141, 200, -203, 74, 210, 98, 51, -82]
5498h2K19J2j17J50j52P2J96k46J9m8J71j18j8n8J04J51m98N02l06l9J65J54m42
5521b09K54O0k09J41J22P1o9j81P2j56j10L81l88L74l21J90r0k8Q1J72k45J16
5543B8o0M1r9j49K94Q6j84l8j6K80k76k28O08j25q2K7R2k05J25m62L14l06N82
5566B47k60k19J34k6n7q2M91m96J54O8j28j05J79J6O03n85j23N37l93r8o3K22
5588A6n8K10j21K4k37P9L02l39j29J64J19M27m53K21k6k08j35J80j15m4K97l53
5610a79k00M78m20L23J06l72L33q1j01L28l94N11m07Jj86P5J63K5k19N9N6K77
5632A76j48J9J34l30p3K63M7j4k9j07j26J56J12N7J13m56K04Lk64K16O2m9K19
5655A85l52J73o4L0L16k77J53j2j87K66m07k22M31j29J07j06K16k77K20L00m3
$$ y = [-82, 137, 149, 32, 182, 30, 102, 298, 52, 71, 23, 194, 76, 58, 0, 104, 255, -243, 259, -47, -86, 79, 233, -209, 45, 105, -104, 37, 159, 230, 161, -20, 52, -104, -214, 167, -221, 153, -168, 22, -68, -96, -15, 157, -88, 28, -32, 9, -90, -239, 55, 141, -43, -81, -97, 183, -93, -321, 287, 162, 80, 107, 199, -6, 119, -343, -29, -335, 247, -13, -232, -98, -124, -181, -263, 228, -268, -114, -46, -174, -279, -100, -84, 519, -66, -189, 348, -45, -143, -206, 16, -42, 168, 47, 71, -166, -87, 215, -124, -253, -89, 30, 457, 4, 225, 199, -9, -144, 36, -79, -123, 174, -179, -379, 99, -321, 2, 108, -264, 69, -12, -113, 215, -179, 332, -75, -74, -260, -185, -22, 3, -216, -157, -101, 176, 28, 47, 181, -149, -222, 41, 88, 74, 45, -62, -188, -32, 80, 137, 250, -206, -2, 1, -263, -47, 15, -34, 185, -167, 6, -58, -28, 288, 11, 164, 152, -35, 231, -176, -398, 33, -96, 11, -95, 121, -156, 64, 364, 321]
5676C21k54N5k62L02j10j97R6o2mR8pK1O3l0R8j66J82K09m91J48K43k82K74l86
5700a41J62j0J01j3Q5j48k99Q3nM30j35m58L84J58l50K1J2J95k11kR6J76k37q2
5724a88K0J54k5N6J90j02j42J04K02m57K44J47k91K21j56P3j27K3J04N7q2j03
5746g8j36L16R4m29O9L82m47J76J69m30N05j35L2J37j64l27J94J87l8K1j41k08
5768b51J68L85j62j17L50k93o34N86K42J4m82M49j29k54K51j01k81M29k86j20
5788b36M05k49j35J79J69l13L25r5k19J99n7J81m99M51l74L26j18j32J11j41k74
5809d96L66Q0j38J2L83l31K82o3j59j0j34N6K73j38j39M66k56l8l4j89M2M14j1
5832B38k31M3j21J22j44J50J12k44K58j12p0J02q7K94m28k4J16Q9L6m8L73l31
$$ y = [321, 67, 122, -140, 162, 52, -145, -49, -111, -115, -17, -24, -3, 60, 30, 128, -38, 144, 353, -138, 10, 253, -29, 245, -141, 21, 11, 112, 99, 184, 36, -263, -180, -185, 245, 110, -348, 36, 194, -156, -135, -123, 72, -139, -141, -45, 131, -106, -188, -168, -14, -39, 17, 207, 105, -37, 67, 269, -188, 56, 203, -88, 133, -23, 50, -77, -54, 50, 107, 25, -78, -214, 102, 196, -233, -164, 218, -229, -53, 116, -314, 191, 56, 88, 225, 61, -266, -72, 115, 77, 98, -43, -251, -83, 302, 140, 23, 373, 80, -554, 32, 274, 288, -194, 255, 126, -128, 123, 22, -259, 170, -116, -236, 169, -80, -215, -36, 133, -180, 145, 50, -169, 30, -27, 154, -345, 106, -268, 58, -60, -192, -81, -222, -496, -130, -50, -188, -176, 207, -124, 158, 95, -64, -74, -208, -152, 121, -17, -156, 310, 54, 16, -18, -207, -165, 249, 238, 7, 50, -71, 51, -93, 57, 169, -75, 183, 71, 1, 103, 16, 310, -118, -142, -26, 63, 99, 51, 424, 93]
5854I3pk23K9j37M53j40p7n6O5k6n4K72j91k03J14Q7j66J46k84N12k61J45N2J65
5878C08nj67k47n6k37M79J83j37J60k43j05q3J36n3j40L52l8j98j67J84M9M32
5900D07m92j08J99r5J56r1M83l20P6j32j01On2k2L21j89K7N5nj77K07k51M3K29
5924A74l26J80n42M67qJ9K25Lr4k92L03j83Q2J91J02m83J41K2J81j98R6j69J49
5947D0P2K37j66k48J41l05K96o7L05l51J50r8l7k29K19J82l01Q6K36l56K46j47
5969i5m3K35k90L05M9J09k83p8l6j5J08j35L64l82J21JN1k62Q5K86k63p4L47r3
5993A2m6M0m9o0L3K20J6o3M7k06J7J52k3O5l81q2M87k31J58l6J3k23M10l98M7
6018h1J08Ml0P2j0J26l10j56N03j18l94K32j7L79j22k77QJ85k0k56L54k76l1k2
$$ y = [93, 86, -137, -108, -245, 208, 68, -9, -65, 0, -26, -80, 192, 1, -202, -88, -1, -167, -21, -305, 207, -54, 91, 143, 308, 303, 136, -111, -167, -404, 75, 258, 121, 281, 38, -67, -150, -14, -67, -207, 145, 107, -91, -258, -74, -25, 407, -85, -193, 6, -89, 67, -24, 459, 139, 215, 83, -18, -12, -64, -86, 235, 46, 73, 128, 123, -54, 153, -98, -55, 174, -152, 28, -514, -47, -55, -36, 189, 192, 98, -194, 109, -74, 8, 199, 301, -182, -41, -19, 162, -36, 60, -109, 40, 112, 349, 183, -65, 76, -229, 67, 0, 305, -46, 104, 6, -31, -260, -41, 141, -160, -74, 162, -194, 52, -95, -138, 97, -193, 112, 161, 270, -13, -91, -127, -142, -34, -169, 195, -187, -66, -65, -14, -276, -191, 95, -168, -242, 105, 12, -34, 6, -43, -103, -70, 150, 166, 103, 150, -56, -39, 113, 90, 155, -226, -308, 179, -52, 106, 70, 83, -140, 270, -128, -81, 27, 31, 1, 73, 63, 189, -121, -277, 226, 108, -286, -54, -71, 308, 186, -91, -83, 102, 82, -174, 180, -96, -127, -149]
6042a49K41k58m1k44P03j92k21J2J89Q1R5j75J56l28L2J03K47k37K24J5J2k00
6064F5J4j17L22o1n47M78j12K0k4K22o45O47p7j93J54o3J6R0l56L34l29L38j44
6087C2l08J74J69J16n02J27K79O5n6k75L06ol04J16L14k5m71L93k91J01l9J56
6109G1p1o2j25K36k82M10k79J4J48K4k01p1J74K11P1k49K16m4j69jJ21l20L0K68
6133A20l7j55J11n2r6j0J43l01K33N3Rk2m3k50L25k50N97m29K4J0L93l13L5j97
6157a02J42k40K08J43n05J23J12n9o8K73j13K62m51K76J21l56N13l08P4j83N9
6178g9R8QL07o80N96n85N84o33O31k07J20l66J22Q4PJ61p6J71m56N88m32M14r17
6201e40N74J6k05J92j33N3R2k34J83n8J61k54K45j2o7p0K86j48r8K76l35K31o8
$$ y = [-149, 92, -166, -207, -451, 252, 60, -161, -149, 40, 121, 216, 41, 197, -131, -99, 4, 251, 14, 238, 253, 265, 65, 79, -38, 284, 223, -324, 154, 42, 62, 38, 260, -385, 262, 185, -8, 146, 83, 99, 189, -167, 167, -162, 176, 32, -276, -102, 67, 183, -319, -192, 87, 152, 96, -179, 127, 121, -183, -67, 247, 222, -249, 144, -147, -46, -85, 71, 0, -62, -187, 49, -233, 177, -102, -88, 60, 84, -117, -188, -14, 197, 268, 19, 235, 191, 22, 21, 142, -178, -148, 120, 83, -72, 39, -13, -109, -119, 24, -277, -44, 9, 18, -4, -47, -297, 28, -222, 375, -54, -30, -20, 373, 60, 95, -102, 40, -200, 8, 151, -354, -231, -119, -178, -246, 27, -86, 176, -275, 1, 122, -234, 279, -29, 45, -138, -79, 19, 27, 334, -346, 250, -335, 249, -384, 247, 40, 160, -206, -84, 0, 7, 168, 92, 263, -193, 395, -37, 377, -540, 34, 50, -155, 37, -96, -43, 49, -185, -2, -60, 101, -153, 92, 80, 13, -57, 229, 81, -17, 259, -76, 155, 87]
6224H7P1j27k3o2l9J17J87l44J11J18Q7J26k29K01l41J46k9k26r7K98j23K17J04
6247B30j15k47p9m9K22J77L2n6k28J34l34L18Pj42m8K23K1j82J20j2J21n40K73
6270a54L5J82p2R3Rj62L65l73R4p0lK60Nk42N7k5J32m16M50j78K17j83k98O19
6294C42l53NK15k88K53k56KK73k86J25L27l43L12n21M39J70m46p4J37K04j46k35
6316a44J20k69J11L79k84J37K12Oj35K3l07N2K65L07n38k2K70n00J6L77m19M98
6338A55j2k96J68O0n31R27l68j31L20p1j77Q3K20k37j05J35j22q9L0R2m9J60L4
6361A96l44L01j83p4m6K23K90l17n0r8J05P4l99j40N08k4m2J44l07M41n35K40
6383c7N9J13m5l53M86k59J30P8j17lj89K59k71j25M28j02O6r2mk3j58J65o3Q8
$$ y = [87, 158, 31, 8, -54, -93, 24, 211, -133, -22, 96, 183, 309, 80, 281, -60, 86, 57, -169, -266, 32, -91, 126, 230, 115, -132, -211, -260, -38, 139, 171, 115, -113, 21, -313, 5, 12, -130, -178, 45, 66, -116, 4, -8, 113, -427, -154, -119, 63, -9, 84, 93, -69, 296, -77, 17, -53, -56, 204, 209, -33, 24, -1, 131, -285, 165, -13, 204, 21, -277, 342, -11, -6, 209, -79, 174, -82, -80, 193, -93, 32, 359, 16, 328, -193, 246, 416, -30, -104, 33, 237, 91, -144, -24, -293, -182, 197, -87, 50, 262, 268, 133, 156, -151, -99, 166, 473, -65, -87, 183, -317, -301, 76, -343, 155, 143, -153, 15, 75, -456, 471, 103, -28, 292, 221, 44, 127, 347, 110, 5, 140, 18, -71, -41, 51, 2, 162, 196, -148, 153, -30, -104, -150, 73, 363, 46, -4, -102, 3, 77, -322, -462, 46, 22, -20, 124, -183, 258, -277, -37, 22, 135, 90, -263, 223, -36, 94, 172, 55, 52, -137, 122, -149, -274, 154, 52, 118, 26, 22, -1, -159, 6, -57, 31]
6407C1l4K5J90k25K55q0k37J29L28l20J2k17J96j73L7J27k2k16p9j64J09N03q9
6430H6j7l6L12k99L5k54L79k87l62L97j33J21L18l67M06m97J84j7k51J74KJ03
6452cN6r5K3k25lJ63MJ76l49K76k69K11J40n2j93K08n2q6j01n6L0J52L0K05l84
6477a94j1J83k05P4K35k33J96J40r9k27J27o4j25L14j33O9M2j9k54J34k24K75
6499AJ19J0L8J7l84L76q9k0n56N70j46J61m17M04J16J14j84K66n74J79k37qN70
6522C26m03J65o3j0O3o3m73O01l63J64o2K67P9n3m9k38l8m30N06j11K41j48Qk15
6546b99L09j83J77n1k8k0k64K88k57N68j65N8j10p9J47k71J51k2j49K80K40n09
6568a89K02k06K02q9j2L76j71j33j08R1K66l85l9K4k4N1J14j77n5J57L3L59k14
$$ y = [31, -3, 22, 212, -13, 242, 162, -75, 54, 382, 62, 74, -143, 53, -120, -83, 44, 22, -194, -273, -437, -328, 175, 86, 69, 33, 345, 46, 81, -173, 206, -81, -443, -46, -179, -58, 260, -107, 299, -198, -14, -31, -282, -108, -106, -3, 53, -42, -19, -244, -247, -84, -80, 96, -253, 23, -246, -35, 105, 53, -140, 68, 16, -70, -171, -227, -197, -45, -15, 190, -194, -205, -22, -227, -153, 82, -151, 45, 185, 86, -141, -14, -78, -203, 111, -22, 47, 89, 70, -184, -50, -274, 1, 120, 130, 168, 185, -199, 177, 88, 68, -488, 82, -64, 97, -320, 84, 200, 314, 130, 396, -178, 1, -236, -244, 326, -77, 88, 25, 15, 78, 15, -458, 143, -220, -56, -118, 149, 228, 175, 126, -112, -150, -580, -74, -185, 56, -92, -84, -299, 10, -173, 4, -47, -75, -95, -359, -71, -328, 240, 75, 133, 23, -56, 91, -180, -29, -51, -200, 80, 320, -189, 13, -193, 9, -80, -92, 284, 113, -20, -128, -37, 229, -156, -195, -171, -195, -144, -30, -207, -262, -105, -72, 287, 73]
6591G3N6j26j93J48k13J91j8k24P1R2Q0k10J62k42M30k08K63j78L11j03K6m7p6
6614F5k09M57m10J80L08n37o4k5K39j52l2L74k56m4j9K0j59J41L15j82J06j71
6636e5J36m79K94M97k52k06J01N9k39K81k43l48N73N8l33L50k59K79r9l5r8Q0
6658F2k67K5L92j47j28l7j71M71l22K39%j90l7L07k97J06j95J65K60o00K56J25
6680A7K71j41M9l43J25k95K55P1q0J25j44j0K13j14j10J67J67J53n23K16%j96
6702a27K17M4j49j9J87r7rJ5L2k23J31J02j10k53L90k58K83M1r2J21r4k34j07
6725b09K13r2L14k62J3J61KN5K8k12j46K35K33m68J64k9o8j50K35o2O7Q3p9J26
6749A52m1j60J14j73k91L01R4Q1Q8j52r5J28L88k22l95K60J02m6j43P7k29J09
$$ y = [73, 129, 3, -190, -42, -255, -64, -82, -306, -235, -143, -63, -273, -111, -353, 77, -131, 132, -46, 265, 162, 188, 141, 65, -144, 313, -97, 83, 391, -146, -210, -235, 4, -148, -180, 194, -62, -106, -125, -105, -264, -123, 192, 10, 116, -55, 81, -398, -104, 393, 141, -65, 36, 95, -144, 137, -106, -454, 119, 177, -156, 194, -65, 214, 115, 80, -18, 62, -205, -180, 212, 65, -63, -100, -271, 200, -122, 117, 117, -73, -110, 197, -100, 6, -189, -24, 236, -364, -108, 17, 288, 147, 196, -147, -22, -317, -62, 9, -71, 54, -90, -100, 113, -1, -111, 56, 223, 376, -147, 69, 69, -127, 90, 134, -15, -34, 153, 56, 47, 62, 94, -129, 2, 104, -6, -259, 131, -127, 156, 197, 105, 226, 132, -102, -209, 4, -88, 226, -36, -23, 138, 140, 195, 223, 11, -135, 100, 333, -135, 29, 0, -68, -218, 17, -45, 22, 105, 26, 152, 111, -49, 65, -108, -399, -98, -4, 77, 165, 13, -82, 46, 434, 212, -183, 77, 179, 133, -10, 67, -162, -53]
6771e3K32k49P6j98M02k47J23O1j13n0K8o1k1k06K60m8Q6J82m36N86k10j81K8
6794iK56k14k04j32L44j99l26L91L32m36k8J79L32K3l16j02J32j27l89K75J41
6815g7J26J15n90M45J21j48k70M88m29L52L8m35N68l89L83n34K7L19nm8J36m52
6837b59P3L54j68R7k55K30o7j10n5j49L57l4L51l58K9k32L95j15M1r3o1K74l59
6860a14L65j70k56J5m4O16p22O3M89k08j12J51k57J49k8J5J29q7J40j10M72n02
6882fp6j59N47l64L12l7m33M82k23J24J81k92o9M2l25K2j9J49M98j88k74K52m4
6905A00j06j71R1L6J53l06K88m4k96j81L41O2j38J31J49M1l76M15K01n32J27O3
6927D8M37l69l0k86p5K30q2L23n8K49m24K50k34L37p8k96R9J07J70k12l78L86
$$ y = [-53, 179, -70, 6, -192, 210, -37, 86, 147, 34, -16, 12, -49, -70, -276, -16, -64, 22, 204, -232, 354, 144, -37, -9, 247, 33, -171, -303, 41, -158, -484, -93, 239, -197, -225, -46, 286, 309, -7, -109, 23, -104, -493, -218, -77, 49, 164, -426, 19, 140, -8, -278, 210, -219, 133, 171, -264, 304, -85, 298, -236, -209, 110, 105, 57, 193, -259, -186, 168, 0, 97, -158, 72, 5, -105, -160, -309, 48, 14, 365, 7, 36, -196, 199, 84, 125, 32, -29, 245, -114, 251, 81, -175, -160, -204, 412, -310, -247, 242, 34, -78, 73, -184, -35, -63, -48, 81, -6, 134, 24, 496, -6, -82, -241, 306, -58, 254, 217, -216, 266, 43, 167, 348, 56, -13, 29, -296, -274, -293, -144, 354, 166, -108, 144, 100, -6, -177, -86, -50, 103, -203, 85, 41, -255, -436, -95, -33, -171, -40, 109, 150, -226, 189, 390, -142, -15, 48, 485, 116, 86, -200, -275, -45, -127, 196, 138, 387, -37, 213, -21, 316, 238, -58, 41, 148, 318, 106, -272, 114]
6949A14r5K9l23J55J07L88m08k16L80l20J22j54J67L75l45k0J23j48J71k58p4
6970b30N58j77l39P8J0K21K3J9k71J50k29M15m41N68m87J33rr6J76K8r7j2J11
6993A02m28J6M62l5k41J28K74q4j51L0q0q8r1K79k0J62n5l57L63j82P4N0j40O
7017fJ1j63Q2j49L1L42O7n4j34r7J24p7k01M27j84Q3lj80Ro6L75k53Q8l36M20
7042A56j89j88K95p8j39M6j38L83R1j71j67j85L34J90k72J40L34q41M60p7Q1j50
7064h5j88L59n7k65L04rj74L20k71O9J2o9L71k39J03k28k62K62j18m6L13Qj48
7087c8PK75k76R1r1J22j70L44l88K05j63l7R9o2J23L2N5k31L58k04l0J6k88J66
7111h5J95j33l03K86j03J89j59m9K9j49N25k16L6m64K02M45k23Qj00J6L00l51
$$ y = [114, 19, 48, -275, -120, -13, 375, -33, -249, 131, -189, -67, -221, -54, 321, -24, -44, 79, -69, 102, -156, -230, 328, 151, -188, -110, -100, 121, 144, 163, -108, 42, -187, 228, -213, 355, -132, 1, -8, -104, 72, 100, 3, -9, 102, -326, -310, 152, 117, -124, 4, 278, 194, 43, 73, -7, -95, -186, 93, 73, 235, 180, -177, 186, 4, 78, 128, -12, -6, 5, -158, -76, -225, -194, 148, 215, 161, 27, -70, 54, -23, -224, 203, 19, 102, 99, -81, -72, -138, 237, -16, 72, -264, 156, -33, -221, 74, -4, -143, -97, -235, 148, 239, 68, -99, -284, 50, 240, -32, 108, 442, -399, 61, -16, 65, -85, -273, 86, 29, -236, 68, 59, -115, 205, -66, 3, 15, -54, 317, 78, 181, -47, -309, -47, -165, -211, 102, 110, -38, -31, 244, -32, 59, -32, 90, -80, 264, -124, 81, -82, -119, -20, -82, 41, 73, 128, -103, 255, 51, 21, 37, -251, -85, 110, -23, -326, -40, -143, 46, -113, -162, -133, -282, 243, 27, 63, -401, -199, 246, 23, 31, -69, -53, 247, -104]
7133a04p3K04J37l49j34M95k01K28k3j16kk56P5K59m8j20L77o34L86j92K64n63
7155c90J37J72N9j63J25O0j36J52l67O24n99L71J85m30K43L3O9k22M1O1k55M14
7177A84j44P1j52J51k29L3K5M98q4j41j55M1J11jk86l77M75N5l44L43N2l83J55
7200a02l3K89p67P78o4j90n2L28Ml18L46k53J41l16L53j64J66j44K80l10K13j74
7222A1l7jk0k16L72R3l21K18P9k58o9K00j08R5P1j09M68l52j00kj46j79N8L43
7246I0l5r5J08m60M81j18r1L19r9j90J0J46q3j61J10L46m49J25L6N9p5J43k14
7269i7K32j65k69q5M84oq9j61L47k79J78J20j18k23J96K04M9l24J99l37K09p4
7291iJ53l01J11M18j77k52j52J2K56j76R4K6m1K98n20K12P7J10k00JK07j21j93
$$ y = [-104, -177, 27, 164, -185, -319, 176, -25, 203, 180, 64, 62, -194, -119, 140, 92, -28, 349, -285, 101, -91, 173, -390, -253, -81, -22, -185, -60, 0, -136, 16, -351, 273, -326, 45, 230, -200, 43, 76, 145, -77, -36, 25, -230, 184, 40, 111, -41, 110, -119, -86, -61, 437, 353, 212, 57, 98, 209, 208, -78, -455, 20, 75, -269, 74, 126, -257, -102, -135, 154, -613, 165, 101, -89, -141, 187, 191, -127, 219, -34, 107, -209, 144, -20, 146, 2, 282, -28, 185, 11, -26, -27, -47, -263, 109, 202, -119, 99, 178, -80, -149, 51, -57, 38, 109, 0, 468, 116, 16, 14, -132, -311, -253, 90, 55, -40, 68, -392, 89, -29, -120, 199, 100, -90, -80, 66, -17, -178, -68, 278, -171, -46, -10, 49, -26, 117, -97, 135, -30, -299, -384, 100, 94, 5, -156, 191, -88, 90, 210, 92, -131, 65, 269, 318, -6, 193, -144, 65, -9, 144, -157, -46, 372, 195, -57, -209, -197, 59, -117, -23, 3, -38, 260, -260, -48, 29, 139, -61, -60, 147, 26, -167]
7314a67j67L41k34N02m13j6j11l9K43j87M11k81r2K6J63J29J27k81J40j9J37j37
7336G5K36m55L9k7J75J43k34K17m1qL2k86Q4J83l19K53k83K25m16O47J8k39j07
7359h8O8k89M93nn1l39J20O0J50k47K60j52l4J72k20N2k78j18M16N0M12l80m9
7382CJ70k60L09k51J23J44k58K77j30k08k07N02j55j13K60l19l1l6J67j53K56
7403I0m2j56L39N5l28J42rj75L60k17j18J60j34J04J1k37K05J41j80J2K52n43
7425b68L39J21q4k75K04q3k02L11j11J51j04mj59M09l19K1q4L88k62j21L8p1K5
7448a40j3L7J83o3j77K90j87J33J4K3o6n4k89J42p8K56M16m58j18K54l7p8L1K48
7472B69J81m15k70L15p1K43l07KP5M3j78j4L66k97K16o6j76J33P3q5l2o5J60K0
$$ y = [-167, -334, 7, -227, 275, -138, -154, -265, -304, -61, -248, 163, -118, -210, -184, -21, 108, 235, -46, 94, 75, 212, 75, 311, -144, -105, -132, 43, 186, -48, 169, 128, 120, 152, -134, -50, 133, -186, 67, -216, 9, -407, 240, 258, 19, -88, -20, -309, 184, 179, 128, -211, -91, -31, 119, -128, 132, -20, -54, 118, -102, -50, -328, -446, -30, 20, 432, 52, 3, 173, -87, 222, -29, 94, 238, -20, 257, 127, -81, -288, 214, 59, -54, 206, -113, -144, -180, -13, -166, 90, 48, -108, 231, 286, -42, 100, 91, -84, 276, 59, -59, 101, -33, 71, 82, -155, 50, 191, 11, 23, 275, -268, 71, 192, 108, -167, 37, -46, -248, 63, -48, 103, -1, -5, -164, 245, -74, -53, -137, 251, -11, -132, -94, -165, -140, -153, -116, 67, 4, -173, 117, -70, 63, 77, 100, 34, -20, -309, -167, -245, 11, 427, -31, -149, 105, 68, -10, 21, 269, 450, 35, -235, 80, 9, 252, -55, -53, 22, 65, -113, -127, 239, -58, 158, 92, -84, 49, 122, 37, 5, -60, 100, 120]
7496A20j13j28J49M1l16L86K77m35j33L90j12l3k42M6J45j87J56pP3n9N4j27M02
7519C47m02k88M06k29j68K69M3j19L01q7j22n3j35n9K28N11l86j8L6J28k04J72
7541A71J06j85L4j8k2lN5j90K04K5k81OL60k91k17K58R4l65J44J04l0K39j75Q3
7565A06k41P1lj36K60k79R4L7L5K50l82J34O4k8rR7o1n23M89J70k47L7K11l58
7589b12P7LJ22nJ04J72k31n5L6K3r7L6K73m04K47m2m6p3K0o8k4J19J00l8j52K59
7615A44K8m05l73N97J31m90K77J28j92K17R2k88K33J7j32K05k12K26l26M7j37
7636b13J91q2J67P2n16K56N9J2L3K42j14J52k76Q4J38j92r8J4q6J57J60j02q3
7659b5L6J22k46J63P9l87K49j86JL81j88J67k70J49p6j08j99J89J11J60j53j50
$$ y = [120, 7, -121, 28, 69, -247, 139, 416, -19, -152, 238, 126, 93, -149, -103, 42, -145, 11, 4, 77, 18, 72, -55, 347, -55, -343, 63, -166, -334, -65, -22, -141, 160, 73, -49, -102, -237, -296, -68, 443, 57, 39, 75, 203, -1, 171, 277, 92, 126, 108, 86, 83, 138, -52, 152, 177, -104, -98, 262, -29, -246, 12, 106, -259, -115, -11, -41, 198, 23, 106, -135, -64, -67, -203, 57, -222, -128, -91, -56, 194, -188, -54, 10, -18, -27, 70, 9, -514, -25, 145, -102, -65, 146, -212, -135, -132, -10, -15, 89, 261, 30, -25, 11, 34, -63, -27, 246, -158, 89, 47, 1, -72, -52, -120, -144, -25, 75, 37, -115, 144, 172, -233, -606, -9, 122, -368, -91, 37, -155, 62, 154, -134, 99, 116, -16, 189, -23, 203, -123, -76, -213, -22, -104, 63, 135, -381, -125, -66, -54, -21, 221, 107, 259, -17, 67, 205, 13, -85, -71, -157, 0, 160, 58, -25, 11, 133, -113, 50, 129, -258, -9, -195, -194, 187, -1, 166, -104, 45, -31, -139, -338, -149, -38, 122, -31, -181]
7681a81K2J91l38K95j00K07n6j90K85l05K60k9j74P5rj79L13j76J90n8m09L73
7703Gr7J80l74L34n3K8M0K01k69j09n1J64l8j50J30J11K06l08n9N5J22rM3j35
7727c1m20Q16k13r8j6m1L3k15L56m4R4j43m36L56J66j86K7j65K87K52l8j98j34
7750Im2Q2r7J49o0J8J29R7l29K35j26j05R8Rl3j88R2N82p61K01K99j98j61k7P0
7775e7L42k81k02K72K7j63k22N62l38j02Q3J56R6J57L1k84j61J26J04l52L39j68
7797c5L0O4n31M39j34Q3n1K21l89J24k08L74l22k8K70K33l85K81K7k25J13J00
7819E1J54j5p4k17k0M9J51o6M7o1L53k40m7j61K63r8J18k47j78M8K35j19J0J66
7843A02K88p19L40J13Q8m22J23L4J06p7P8k00j31K48K26m07j11K70l5K07k13j7
$$ y = [-181, -159, 32, -306, -11, -111, 96, 40, -150, 135, -170, 90, 61, -113, -38, -47, -226, 87, -89, 101, 43, -366, 7, -90, 90, -284, 50, -3, 25, 65, 266, -3, -112, -163, 1, -37, -187, -57, 54, 260, -48, -107, -52, 70, 61, 104, -31, -451, 365, 152, 54, 38, -3, 30, -185, 171, 127, 221, 78, -358, -2, 164, -22, 5, -160, 127, 379, 341, 143, 9, -33, 49, -48, 101, 41, 59, 188, 285, -44, 191, 65, -40, 58, 67, 34, -154, -62, 520, -241, -40, 259, 61, -100, -127, -57, 285, 4, -198, 74, 101, -62, -284, 278, -60, -162, -79, 77, 173, 330, 361, 77, -84, 42, 146, -206, 133, -35, -5, 59, -472, -33, -167, -84, -135, 86, -303, -179, -387, -13, -335, -363, -93, 140, -245, 36, 63, -162, -49, 51, 205, 190, 116, -101, -121, -72, 79, 13, 60, -1, 352, 112, 65, -96, 167, 69, 187, -60, -238, -190, 45, -74, -64, 102, 390, -329, 11, 124, 212, -210, -87, -53, 53, -24, 54, -146, -277, -29, 197, -210, -321, -51, -86, 121, -92, -109]
7865a09L8L10l31o1J48L00k43l16K17j25L11l78M38PQ2j37k70M85l83OL55k07
7887A37K6m03M50j2n6J5j26j41K40l26K8L06j59J43K03j72k08j1L44j34o7j01
7909b4K4J24j52J4J14l1j19J16k09L5m8j0K63p0J30l4l59N2K96k57p1N95l11o8
7933@j08L03l05O36n31j6m3j70J95r0K24J57k11J9j43M3k19L99K0K36m61m1K14
7956A08R9k29L04k97K14l97J4q4J88K58M1k11K01l95M0N68l37j47J88n28J98N02
7978B98l56j01N0L11k97n7KJ40K61j50j04J45j63K7K1o3K06K73n41Q2J00l19K53
8001A8J10k44r4N27n56l7L90n41K58K81l05j32L14j61J26K03J44j97l32R3R3k19
8023b61J71L9l1l0J73o8N5n0J52k30J15K82l92L10k93j33j74N12j97K97r8k28
$$ y = [-109, -71, 239, -92, -153, -5, 295, 52, -264, -47, -172, 139, -239, 199, 206, 288, 151, -119, 366, -17, -11, 344, 137, 163, -240, 210, 198, 142, 157, 31, -110, 130, -196, -168, 138, -21, 122, 325, 153, -55, -66, 278, 144, 77, -24, 0, 124, -28, -14, 100, 69, -50, 66, -143, -108, -156, -166, 97, 27, 157, 123, -236, -184, 112, -145, -216, 379, 68, 0, -108, 195, -110, 526, -5, -21, -64, -234, -39, -129, 95, 252, 41, 60, -83, -40, -259, 140, 160, 396, -65, -106, 108, 207, -22, 282, -15, 199, -198, -184, -268, -80, 178, 219, 8, 209, -186, -146, 422, 85, -62, 126, -402, -204, 298, -58, -159, -109, 202, -95, -152, -150, -10, 251, 101, -3, 142, -21, 6, 27, -36, 170, 443, -98, -16, 84, -235, 18, 128, -116, -210, 317, -239, -276, 114, -427, -169, 112, -193, -325, -11, -172, -46, 157, 301, 104, -228, -135, -42, -261, -90, -51, -82, -112, 61, -7, 48, -2, 150, -80, 35, 317, -75, 235, -58, -191, -365, 147, -50, 247, 149, -79]
8045g9M48o18K30J82l83L82j68n2n5J60O9N0M6j78k63K08j67M65j35lj45J07j66
8068f5L47l20K7J8M2J12J24l08m32M25J27j72OO9L3Q3l66L91r2l5J62j98N1k00
8092a71m9Q8K44K2m5j16J1K42m44J25M54l21j81k31L00J77l75O71k93l08j34K69
8114f5m5J87k99J56O3r0P1J66j78q3p9L40J48l83j82M02l62M75K77l46j94R4L1
8137A04k2j26L02j37k58K4K04r7j65K70J78j13m57J94J45k1K23k26k18J93J14
8158A11j97O3J13k2L6j82k11O41k34J6k48K06j0J05J3k44J5K85j14l17K20J05
8180A50j59L2lR3Jj62K02r4n4L9j82
$$ y = [-79, 369, -249, -19, 163, -220, 162, -6, -58, -113, 47, 116, 166, 212, 34, -229, -21, -188, 277, 142, 139, -6, 101, -65, 282, -38, -11, 7, 49, 161, 285, -23, -455, -30, 97, -75, -69, 0, 33, 116, -250, 141, 49, 14, 176, -22, 29, -171, -220, -132, 112, 134, 89, -27, -16, 226, -218, -93, 361, 40, -141, -372, -72, 105, -270, 401, 108, -200, -334, -65, -110, 77, -222, -66, -3, -93, -22, 144, -34, -117, -196, 144, 292, -91, -273, 129, -233, 242, 519, 173, -21, 73, 104, 82, -44, 258, 121, -137, -113, 91, -6, -171, 99, 277, 164, -293, -99, 46, 25, 248, 22, -196, -3, 111, -86, -23, 90, 68, 104, -78, -289, 352, 118, 134, -114, 92, 82, 187, 200, -44, -29, 256, 142, -175, 45, 150, -9, 23, 20, 113, 114, -48, 154, 60, 6, 45, -137]
8191a37
$$ Imaginary data points
##PAGE= N=2
##DATA TABLE= (X++(I..I)), XYDATA
0@%%%%Qj6J6j6J6k4L3m1N0n8P3r6J19j37J61j91K24k62L02l46M00m59N24n98O78
29C60p63Q60r70J087j215J356j511J681j867K072k296K542k814L115l450L824
45B011m240M708n240N851o561P392q385R597j1116J3080j5727J9511k5388L5795
59B1288n9434J97273Q120m24030L10976N2507k15875J82553P213k85252K43668
70C9007J23628k92966P8090J70052j94782P7426J18265k30675M9985K19546k04093
81d6517n9048K08900j15220q8254J92763p7592j07753J81045m9631j62375J85597
92F1915M1804k05647Q3248R5612j39886O0845P1783j67709O8112J63267j77410
103d4066n0906J76135p4431n1743J24476j15965o5314K04889n8782j59804J46749
$$ y = [0, 0, 0, 0, 0, 8, -8, 8, -8, 8, -16, 17, -24, 26, -32, 41, -55, 64, -73, 88, -103, 121, -141, 161, -185, 215, -244, 280, -318, 360, -403, 457, -513, 574, -641, 715, -796, 885, -982, 1090, -1206, 1336, -1478, 1637, -1813, 2011, -2229, 2479, -2761, 3090, -3471, 3921, -4464, 5133, -5983, 7097, -8630, 10881, -14507, 21288, -38146, 159127, 167247, -256783, 54193, 106700, -109175, 73378, 80591, -204661, 39007, 162635, -130331, -52241, 117811, -76971, 455, 118720, -111955, -61970, 157576, -46517, -105565, 103335, -11885, -100139, 92624, 15032, -92721, 88324, 38693, -123682, 61915, 103719, -101928, -18680, 76932, -62954, -2109, 69674, -98035, -29923, 133344, -44066, -94972, 81163, 6732, -45011, 79465, -36500, -101814, 103075, 44293, -115511, 31238]
114C1238J7556j19841J21102l46j48795J37367N8104j89103O7897J10626j39784
125e3979K6558R7872j29620J6699J27081j12690k7953J32209p6559o1942J11908
136D9584l8377n9938R3488l7322p5624J04032M011r4709O7501K8951q0985M9632
148A0244L2261q8073M0732O2258r6017l341Q6191n5536k3477P2663m4570l3048
160c9713P9951k7235n4595P3000o507o8111N4625J2150n8667M7793J4309o9498
172d2498M6443L8138p2366K4097M8529o6034P618N0495n9672J763O4465n6875
184a5897k4199P0384k5911l3015N5505j6825l4784M7503j1533l9866M5776K583
196A9721m6802K6392J2966k9311K6351O678l9713K6796K3007m2368O457K9857
$$ y = [31238, 48794, -71047, 50055, 49709, -99086, 38281, 96385, -92718, -24821, 85805, -53979, -27421, 70451, -59169, -42470, 84611, -28079, -56032, 76177, -382, -62324, 49584, 11207, -48731, 44757, 7435, -68189, 35843, 39854, -54855, 12646, 41597, -39388, 10244, 42505, -45568, -4836, 57422, -38595, -41936, 44255, -11281, -34758, 37905, -6665, -39713, 40238, 13003, -41592, 31408, 24901, -43210, 11415, 23565, -35102, 12691, 27000, -42498, 3945, 42083, -30283, -6186, 42343, -23691, -16073, 34422, -25250, -23487, 40978, -15897, -40096, 30288, 4377, -28638, 26867, 10042, -24742, 22761, 11228, -28638, 17138, 19721, -27081, -689, 12277, -17034, 9317, 15995, -23718, 3078, 26085, -16283, -9826, 20031]
208B0031k9966q07K3181l0050J695M1597k4778k4301L5857j631k0328K3310n325
221H485k3145K4365N87l1604K1531J5983k8559P910J3018k0410J5117J6435l3188
234a3475M889K7698k7798p375K7901j5768q022K5149j9476j1354L7601n724k8227
247a3981J9968L448j7316J5891k723k0500J8634M816k3709J1127J2839j2966P906
260C434M026k0239J2626J5588k3200j086J7783j5309l205J9175j1457m919J9904
273A3121j0120j4433K1553J493j8213R280J444j4957J0799N152j6399Q466J1341
286H527j5941J813J4573r642m22J0880j5513l244J8515r226r861J5259m861r730
300h873J6357j021j2502J3985J131j7957Q525P992j3776L680O033j3124L659J1325
$$ y = [20031, -9935, -10742, 12439, -17611, -15916, 25681, 903, -23398, 12459, 10828, -9500, 13810, 8485, -14660, 9705, 10292, -21312, 219, 16202, -12357, -4447, 8571, -11839, 3278, 19713, -13475, -8586, 19112, -8686, -16061, 11840, -3928, -11950, 13199, -6277, -17631, 19970, 14246, -13981, 5987, 9435, -7881, 8010, 5287, -15213, 3421, 8237, -15472, -4345, 8494, -4472, 3434, 7460, -12779, -153, 15435, -7765, -8851, 8932, -6377, -9582, 9593, -1864, -6783, 13121, 3001, -11432, 10121, 11614, -6599, 2681, 4125, -10832, -33, 5119, -11280, -2814, 8527, -7414, -5601, 8972, -670, -1092, 9788, -5725, -8969, 9546, 320, -9541, 5718, 857, -8873, 7484, 6463, -6039, 7946, 9077, -8880, -355, 7637, -6139, -2459, 3574, -9550, -5891, 5434]
314E434r419J636J0131r465k006J0195o837k390R611r212o408J3211l101p178
328e798J1712r79j1515J0133M083j2260O132O070j4465l84J0574q277j077J0689
342D638o951m058J1339k079m841Q803l294q428O835o0o736P170J027r966O257
357c44M963p235M699N798j0876l91P848p700j286Q543p008n631R473q40l564Q558
373E007n87o791M889R20n056M939J44p710K719K365n187N110M206p967K340N683
389E024p308R12P522q037m037P498m266m000R972j473p129P466J869o536O379
404C856L149q793J406L172o566K486N031p051j8N471m679J211O800m675l607N544
420B737l974l519P345k056o029N740k31m111P049K449o082K849J661n631K799
$$ y = [5434, -3985, -2349, 7782, -1683, -3689, 6506, -331, -2721, 6890, -2322, -8730, 4481, 1380, -5798, 5914, 4935, -6580, 3553, 7636, -4624, 1508, 7578, -6887, -7271, 3303, -4974, -6051, 4638, -2313, -6371, 4968, 2889, -1952, 6851, 3557, -4871, 1964, 1904, -4832, 2338, 3365, -6601, -344, 4619, -2616, 2083, 7881, -2995, -3386, 4462, -3238, -4524, 4019, -2989, -8620, 853, 13, -3551, 5007, 4420, -2371, 2518, 3438, -1618, 3321, 3465, -4245, -1526, 839, -4348, 762, 4968, -2999, -659, 5024, -2284, -1372, 6150, -1887, -5924, 1574, -2692, -6692, 3280, 1807, -5322, 2144, 4013, -2523, 3856, 7005, -1788, -382, 2790, -3776, -1290, 3741, -3310, -3328, 2143, -2536, -1325, 5475, 800, -2807, 2737, -1237, -4756, 2589, 533, -5496, 244, 13, -4098, 2951, 5400, -682, 2167, 3828, -1803, 996]
435I96L179n944k15K617n123J527N719l978m31M990m865p10O835l770l832N226
451B221l771m462P860N14n613N365J486o245M980M118o952J192K882p640O80N664
467B279l970j358M211m227j30O667k275j898M212l372l422M794j350k561M353
482A953k057m706O042K525l602K629L19n565L225K178n258J059K816n634j68M404
498A60k147J577L752m852m73O179l170k351M653l478l905N357j677k625O600n70
514C030p007M328L933m194J572N92o070K009L345n652R07M941l039r42K868j698
530a077K860M088n747k702M529j299j885K840l036j164M365k328k293O629m6n500
546a766J832L44k267L153q16n329L010L160m438J385L982j533Q03K42l813K698
$$ y = [996, 4175, -1769, -1984, 633, -4490, -2963, 2756, -1222, -1653, 3337, -1528, -2238, 4597, 827, -3005, 2221, -1550, -6012, 1848, 2362, -3251, 2114, 3600, -2645, 2335, 6453, -499, 693, 3575, -4065, -3385, 2279, -1691, -3049, 1162, -3065, -3195, 3472, 1197, -701, 3511, 139, -3283, 1511, 161, -2400, 1953, -104, -4810, 1232, 3757, 155, 2784, 3103, -2462, 763, 2941, -2317, -1258, 1558, -4076, -4244, 160, -1987, -410, 3342, -1510, -1983, 4196, 1026, -1325, 3328, -150, -4055, 1302, -375, -3000, 3600, 3030, -3977, 351, 4284, 90, 1662, 2254, -3816, -1807, 1538, -4114, -3207, 1734, -1305, -2247, 621, -1077, 1783, 5871, 124, -2578, 1951, 652, -1233, 1607, -1429, -2593, 1772, -556, -2849, 3780, 3734, -1766, 66, 410, -1857, 1296, 480, -4849, -1839, 1321, -3117, -1732, 2250, 717, 1520, 1762, -2051, 647]
562F47N488n622m250L706q32m54K882k624j404N586j978m478M747J582l344J75
578a73j295k537M603L71m273L179J913l632K568K490k393K491j118o110K793N616
594D493o072j859M221k767J276L689m815j08P396m606n827N949K27k940L355l358
610a746m226Q166J095o183M729K652o388K980K303m773K918O77q328L153P202
625D231o570j290O171k852n89M550o858P35R959o122r276P040K679k618M008m780
641a582m423J0891K144j1392M215N718o662J068R61p092O423O460j2482r99J1840
656E088m608l527P116m270j995Q007p411n997J3850q97j3650N916N282l736O086
671E254l015j0650J1521P731j6320n58J0428m493k89J263j0327O688J4581j1980
$$ y = [647, 6135, 513, -3737, -31, -863, -1317, 1565, -1059, -2463, 3123, 1145, -3333, 1414, 2996, -348, -173, -1468, -4005, 598, 969, -3304, -125, 1788, -1844, 724, 3214, 821, 3312, 2194, -3916, -1123, 4493, -1579, -3438, 783, -1984, -708, 2981, -1834, -1942, 5454, 848, -4979, 970, 1197, -1743, 1612, -1746, -5972, 2194, 3289, -2894, 1835, 4487, -1901, 1079, 3382, -1391, 1527, 2204, -6124, -2971, 4231, -2339, -3629, 2542, -310, -899, 3651, -3207, -2472, 7487, 1365, -7911, -871, 1808, -810, 3198, -1582, -6005, 4886, 7030, -4362, -147, 5571, -1091, -23, 938, -6154, 269, 6729, -5753, -6752, 5088, 480, -3047, 4069, -201, -2196, 5811, -1600, -7597, 6253, 5356, -8294, -2378, 2904, -832, 5254, 2239, -8411, 3110, 10841, -5479, -6037, 4391, -102, -391, 872, -9455, -2767, 11814, -166]
685a66r728J2682J489m186M161o645l088J3082m576j3422J0514O865r341J300
699a059J627l957R002J618j5023M204J2263j0033n579P502j551Q82M870j1617
713f851m20J7564l538j4317O245M863l442M434n648q374J3458M381j5989K214
727e420J0951l657o11K63q482O910R937j3425n328J2505j913n846N055l033Q24
742a270R919q033j0058J4082M046j1438O67J712k800P216j819j1366Q477R526
756H861j0607l048O849j814K561J074j0781J566J2205n419p817O172J193k279
770a284M628l626k714Q466j181r715M460N202n324p4J247l958M392L533q163J484
786b627Q526m498n415M081j47M47L224o894l382J0006K23o527K949J160j457L707
$$ y = [-166, -9894, 2788, 4277, 91, 4252, -2393, -5481, 7601, 3025, -10397, 117, 6982, -2359, -1059, 568, -3389, 5613, 7231, -7792, -3588, 8675, -1358, -6937, 565, -986, -104, 4766, -6851, -7271, 10293, 6755, -7562, -1317, 3546, 104, 4538, -1110, -9484, 3974, 8355, -7634, -5420, 5531, 1874, 1263, 1526, -6956, -46, 9891, -3534, -8862, 3643, 1730, -4116, 939, -2094, -1270, 8649, 616, -9442, 4640, 8686, -2752, -2085, -373, -3173, 4043, 2224, -9142, -665, 8861, -1746, -4794, 2055, 241, 2802, 3876, -6905, -5339, 6866, 1447, -6370, -198, 995, -1284, 3344, -282, -2996, 5470, 4289, -5426, -966, 4236, -1088, -1162, 85, -3873, 519, 4052, -4111, -2627, 5899, 1401, -4014, 67, -80, 367, 3591, -3303, -6685, 3321, 3544, -2983, -34, 1126, -331, 3376]
802C376k215m991O200J492p175P73L164k687K104J346m616K823L434m524N33M906
818C943m093k361K939k002R44L349m245j899O442n90l426J945N82p16R98k660
834h50k725M232K052n431l3K329K99J827l14k681J856J978l327n45K952j329j588
851a298J109j233J200K837k557j937L977K52l460R29O41q74J376k606l069N162
867D49K584m596m15K128L1K009k79m096K483K886m533q45L076o94p9J022l527
884b396J260M947k363l096K676n13j414Q44j204k17L060k138l137L599K384j232
900A060l26n60r01K875k93m140J024K767j818j341R27M51J544N98k896q37L508
917A642J87k612m5L0m46J131n10j549L254J017l125O56K247r71P4k80k329Q26
$$ y = [3376, 1161, -3830, 2370, 3862, -3313, -2540, 624, -2063, 41, 1387, -3229, -406, 3028, -1496, -963, 3943, -150, -2511, 428, -1574, -630, 2719, -1526, -3425, 3017, 2427, -999, 946, 1528, 812, 1810, -850, -3575, 657, 2709, -2722, -2755, -426, -127, 1700, 1386, -1295, 561, 2539, -788, -1333, 1619, 290, -1298, -189, -1422, -222, 2615, 58, -1879, 2098, 2350, -1110, -181, 460, -414, 962, -1644, -4713, 449, 3033, -1563, -1978, 150, 181, 2190, 1911, -2185, 298, 3184, -1349, -2194, 882, 188, 109, 1131, -2396, -1136, 3811, 1448, -1648, 1028, 515, -899, -55, -1259, -1476, 1584, -554, -3691, -92, 2292, 1060, 734, 174, -727, 2148, 1855, -2285, -1261, 1506, -312, -1653, -726, -275, 1269, 1867, -1029, -1866, 1642, 1829, -783, -828, -798, -1244, -113, -623, -2172, 1082, 2099, -1026, -370, 1877, 906, 980, 700, -1629, -803]
935h03J930k044o71K635o35j219J335o25L26K278k814j996K570N99j403M85j137
952a189j64K230k05j313J939L46j500k0J08n95J390k43k629P70J172q00M97J050
970H44p43K17L85j311L97J504j169j414Q40m04K09J076lk64P52r3n64Q23j21p19
990B42l82p09o34J000Q63r65k55Q50J6l8J426r89m11K38q58k90J316n11m01N21
1010B9m47J86J373k37o23R93j006q89J188j62j560R43n02j058J372J265j052O92
1028E05L74j556Q04O72m90m87N55j629K45J534n00j40Q91q24M6Q21n85m70L57
1047A23o20r28P63O27p75N49L92j083R15J100n88K70K53j440k08Q50l22k12Q21
1066D87j070o5J182J38n75J253p85j459Q00M6r74J174l28j135O18Q95m26Q99Q33
$$ y = [-803, 1127, -917, -1588, 1047, 412, -807, 528, -97, 229, 2507, -307, -2303, 267, 866, -537, -52, -1189, -1353, 877, 672, -641, 1298, 1644, 144, 124, 232, -363, 1027, 784, -1845, -1075, 97, -703, -206, 844, 101, 318, 703, -608, -211, 1293, 124, -1290, -450, -854, -645, 431, 428, 164, 916, 823, 259, 1082, 961, 242, -140, -849, -1483, -483, 380, -585, -840, 10, 26, -12, 1414, 425, 14, 252, -606, -896, 420, -91, -492, 29, -418, -232, 1141, 904, 281, 1274, 268, -621, 567, 405, -1155, -212, -714, -1772, -400, 865, -187, 505, 879, -677, 127, 799, 309, -178, 377, -1252, -1007, 527, 27, -113, 778, -46, 0, 821, 236, -234, 123, -497, -1425, -662, -35, -810, -261, 131, -952, -37, 1063, 475, 745, 998, -442, -650, 200, -122, -334, 487, -583, -648, 534, 672, 97, 1350, 565, -894, -94, -48, -1022, 152, -176, -1311, -693, 202, -224, 675, 1508]
1085A508j717K6J246j110L24O51j627l79J132j45m97J361l71j037Q56M05n17N27
1103F36J18k008N29O57o94O06P17j104L09N96j02L5J128r40q64L38m52j77R59
1122B87p04k52O72J94l58Q80J88j069L31M66j191M44P08j754L88M54j32M73J266
1141A291p05n67R33r93l34J259o15j548Q25m83k59J202P44j018O08J86o47O58
1159E37L86j306O5K51r07R4J588n02n61J449q63m52J505l70j432R16o28p47N29
1178d48L11p23J002J22j369J531Q57q56l08K58q10K51R03j213k33J230q01o92
1196i88J664N4n52Q99r94r36J558J17j996Q35j5p23O80P73p38P01Q13j456j89
1215d93K015j104m98M63j490M19J782j285q04K037o51r20J002j87l60J105o13
$$ y = [1508, -209, -183, 1063, -47, 277, 928, -699, -1078, 54, -91, -588, 773, 402, -635, 221, 626, 109, 636, 754, -1254, -725, -68, -762, -156, 561, -543, -234, 362, 260, 295, 1423, 483, -381, -43, -495, -672, 287, -417, -669, 3, 197, -161, 719, 907, -162, 169, 635, -556, -112, 596, -1158, -770, -316, -448, 25, 1291, 586, 19, 952, -41, -375, 884, 269, -1279, -454, -937, -1196, 6, 750, -268, 340, 526, -121, 537, 923, -383, -318, -67, -974, -880, 708, 206, -355, 1094, 231, -221, 1284, 914, -518, 398, -230, -977, -448, -137, -860, 142, 264, -1105, 426, 1283, 427, 119, 377, -433, -182, 721, -492, -725, 505, -296, -988, 676, 730, 178, 1077, 83, -853, 705, 822, -1174, -339, -354, -1077, -397, 376, -362, 339, 1152, -304, -493, 1522, 418, -80, 383, -1107, -688, 1094, -191, -995, 1042, 391, -529, 473, 286, -74, 1031, 418]
1232D18k099J413J058j957R07O55j508J194J037j481N69J801k665n70K210m90
1248D92j303J323j374k98K085o13j817K487M43k406J084L04j262J606Q4l304J607
1265h62K342k102L46J683j792J65J979k097l48K599j976k145L254r30j469K439
1281A086o67j901K826j52l097K794J164l528P86Q82j945K266J137l862J317L852
1297B958k678r15K344j675l42K185l111j101M199r97l466K302R62j555K334m79
1313I65k785K858Q47m175J312K508k309o22J930k196J675K819l456j489M796r16
1329A762l144K299j188o52K693k153l133M618J687m563Q12J813j565K260N56m863
1345b761K365L162m185p72L128j023l95K039l242N51M842k784l783L814M48k826
$$ y = [418, -1681, -268, 790, -1167, -260, 395, -1113, 81, 1118, -363, 206, 2007, -658, -1228, 982, 492, -811, 512, -862, -1160, 925, 312, -1505, 982, 1425, -981, 103, 407, -855, 751, 835, -2469, -862, 1480, -622, -276, 1407, -385, -220, 1759, -338, -686, 1913, -63, -2208, 1046, 116, -1353, 1086, 419, -1482, 1344, 1192, -1905, 889, 2053, -1475, -689, 193, -1752, 514, 1651, -2211, -894, 2958, 280, -635, 1709, 34, -308, 1877, -1234, -2335, 1864, 867, -2599, -297, 665, -890, 1444, 965, -1820, 1038, 1885, -2290, -978, 1530, -779, -1401, 529, -1667, 8, 2827, -629, -2118, 2678, 1762, -1382, 917, -271, -923, 1770, -383, -3516, 1102, 2789, -1774, -962, 851, -714, 1546, 2102, -2761, -396, 2766, -1419, -2191, 937, -86, -481, 1558, -1684, -1133, 3709, 925, -2858, 956, 1404, -1422]
1361a422J515n56j454L877o15n137L089L870k719j072Q38j525K031K192n231j30
1377b449N073j916k912K416k40L53K293l019k452M947K95m601J289J690j905J325
1393A87j00k492L300K067m924L10L724j127j167O26k186J289L169l366k106M295
1409A499N20k917P68J76q7K844k018m542L449K440k874l4O19j043K091N91l097
1426a615J012L370k716j575K043o59L8J329k561n92L489j128k454K967K88j456
1442b20M09l88o50K263m53l230J210K463j658o3M00o24J464J035k809m29K627
1459A347q66j539R31m70L71J447j550j278K203Q26k008J094O88j766P26k20j283
1476a347K100J02k366N30K164j222MP17o73M41P05k226m48K482l84j678J019p23
$$ y = [-1422, 93, -463, -1917, 1960, 1345, -3792, -703, 3167, 448, -624, 214, -1311, 720, 2912, -2319, -2449, 2624, 708, -2204, 212, -28, 325, 2618, -401, -2853, 2094, 2389, -2212, -923, 767, -1138, 187, 87, -2405, 895, 2962, -1962, -1652, 2072, 945, -222, 404, -1782, -493, 2676, -690, -2796, 1499, 2019, -898, -130, 46, -41, 2803, 785, -3757, -308, 2132, -742, -776, -157, -1200, 891, 1482, -1615, -603, 2767, 51, -1524, 519, -140, -102, 1227, -1334, -1926, 1563, 435, -2019, 948, 1236, -220, 189, -199, -849, 1414, 961, -2269, -1059, 1404, -254, -317, 83, -541, 923, 1958, -851, -1280, 1347, 481, -1058, -127, -597, -226, 1221, -329, -1607, 596, 1422, -586, 508, 1196, -570, 156, -64, -1347, 753, 855, -1511, -981, 1183, -39, -35, 682, 9, 450, 1155, -1071, -1519, 963, 579, -1099, -80, -803]
1494h03R64J154j373q14J780k06j670J013M85j159J061p88j090J899Q56k031K31
1511d91J527q60Q4K25r14O76N13k303o6J870J7n72J46m49P59J597j335j571J558
1530D11N84j483k70R7K07J496p57j809J720J564j684o92J090o18P2N43j348l0
1548i07K184j626r39J359N16m21J50n78m17J902n30k093J374J096j469O36k62
1565b5l93J333K30k261L75J888p63l91Op20N87P64j226l40J819l95j229P47L21
1584C27j65M60n33j342J428K54j034J98R14q04K97L27n43N83Q93j380q95J272
1602B57j88k83J61p64R4J294p60o92J178P51j220K61l71j32R74j93j319L89J065
1621E02q42L81K46k70JN61p93j12J131p53m85JJ99k66P70j02m34O07J22l27L41
$$ y = [-803, 161, 1315, -58, -872, 908, 702, -968, 45, 530, -629, 432, -356, -1446, 453, 1309, -722, -491, 1036, 176, 260, 485, -429, 247, 760, -1543, -1609, 261, 278, -294, -148, -597, 162, 1759, 424, -1147, 411, 995, -488, -758, -661, -454, 1042, 285, -1524, 196, 1760, 76, -616, 474, -144, -72, 471, -877, -907, 1277, -349, -1288, 71, 587, 166, 316, -262, -679, 1223, 693, -1400, -26, 1070, -399, 237, -25, -418, 915, 1145, -1116, -741, 1147, 384, -7, -1, -721, -134, 630, -596, -936, 883, 488, -741, 6, 327, 162, 622, 89, -1253, 175, 429, -605, -407, 507, -297, 0, 327, -216, 367, 1260, -120, -1015, 257, 69, -214, -53, -817, -723, 571, -189, -881, 297, 1048, -172, 89, -282, -414, 560, 367, -952, -563, 502, -340, 41, 287, 17, 18, 579, -214, -326, 805, 52, -433, -432, -233, -499, 271, 169, -265, 342, 464, 137, 478]
1642D78L64n31l84j71l71K87Q29j187M60P9N15L0K2m00j26M66n02lj7J67n93M86
1664a02J71j22N6M32k93m1L57n92q9K96R9n17p0k3M28N16k87m58N95q4j65lL21
1687D25q94J28L74j089J081K22k90J60M40l79j36L15q6k17J87n37j95M15m0J00
1707a6J26L0j31K85J02k36Q0m12k49J47M55jo41N26p8l1M32Q3l77N75m75k51j17
1730a74K57k9j18k80j73M54Q7RP0L70m93k40L86k16j28J08r1l84N55L5q0K23o4
1753H4m29K80N32j74m12k6l75L26j10LJ6M4J42j90O57n6k16J45l91l01L33M3K49
1776A74l70Q5M5K56J37j72O0l4n12M45l8l73J46K55o28P3M23K21J24j10k15j05
1798a13M18j46L2n4m68m15P37o9j14K36J59o7j62J83m8j6J93l54j77l59Q23k13
$$ y = [478, 842, 311, -73, -244, -615, -328, 501, -686, -226, -147, 368, 398, 420, 20, -106, 360, -142, -145, -162, 5, -588, -102, 69, -53, 3, 435, 142, 101, 458, -134, -223, 73, 172, -345, -415, -438, -10, 506, 219, -239, 356, 272, 107, 104, 425, -469, -341, 33, -1056, 25, 247, -43, 117, 557, 178, 42, 357, 271, 54, 241, -296, -491, -76, -116, -16, 110, 140, 9, 294, 396, 160, 240, -172, -421, -274, 181, 180, -461, 65, -13, -44, 388, 471, 94, 669, 194, -57, -174, 83, 54, -64, -344, -517, -63, 24, 33, 103, 473, -20, -260, 126, -90, -218, -110, -201, -585, -30, 5, -75, 148, 84, -345, -65, 467, 293, -119, -145, -520, -194, -304, -301, -285, -241, -99, -289, 368, 312, 96, 241, -150, -451, -118, -75, 174, -196, -111, -66, 190, 327, 155, 215, 181, -331, 114, 76, -297, -151, 104, -524, -451, -28, 193, 317, 207, -8, -113, 305, 159, 191, 137, -331, -746, -9, -78, -192, 44, 203, 136, -26, 157, 109, 93, 286, -68, -245, -604, 219, 6]
1820FJ50j13p8j49J82O1J40j6l5k4n41M79r5L0m19J50L61k9N57k75k99J4l19L29
1844F7O8N0l83N8l97L61L44K20L2k41m15j5P18l33m54K4J75j35K50j00J66K71
1866C31k53o01N67P08k14n52J31m82K18J39k46k50Q20l33j7P88m86k48N09q63
1886c34j73P18O0n11M00j44m81N80L89o94M66K68r98J29N55j52j57J10n02L66
1906a05P64q30k64J037p71L25M0k22r0Q38p62o27P57R2l20M12J22q37P85L30j182
1927e08N12M91r37R3L61o32M16N21p21J20R15m68q96J433l99o86N08o32j8J306
1947G79l63j189P66M18m37J55M79j039N79Q09j657l3J280n08n66R46q71N47P32
1966H27q05o07J443j85j496R73K03j104J014o57l61J103M44j261k65J447j191
$$ y = [6, 156, 43, -35, -184, -2, 59, 199, 183, 148, 124, -417, 62, -33, -3, -422, -272, 89, 60, 617, 342, 43, 57, -262, 67, 135, 185, -198, -140, -537, -176, 168, 388, 420, 179, -236, -251, 467, 134, -320, -296, -121, -256, -6, -106, 60, 331, 78, -523, 44, 752, 538, -14, 117, -365, -147, -8, -254, -504, 316, -17, -34, 754, 268, 20, 529, -334, -507, 211, 271, -240, 160, 16, -465, 115, 504, -190, 276, 544, -454, -325, 230, 78, -79, 31, -471, -105, 659, -171, -435, 602, -169, 156, 196, -26, -116, 722, -40, -667, 90, 182, -138, 274, 396, -441, 344, 674, -508, 4, 495, -442, -349, 12, -620, -204, 317, -404, -284, 631, 163, -733, 700, 301, -385, 123, -509, -527, 779, 416, -773, -7, 411, -26, 129, 608, -431, 148, 957, -700, -733, 547, 39, -527, 419, -452, 95, 827, 22, -585, 858, 673, -823, 150, 353, -751, 263, -394, -755, 348, 792, -469, -734, 713, -478]
1983d78O50L72j201N55R66j425q46J886r9o39M99l93l46J704j204j293J579K92
2001E79j220M67N56r50J147m4j703J105J388j475k42Q86p64k5Q17r14k51J750
2019A107j369j120J668M62p50N16n40j053K175k45k503J416Q31q49j87L68n82
2036f55J033Q04k344L58J892p95n54N63j194N49J380j430p47J934R5j851P54O43
2054D35q44J258p43j342J305J031j997M77O54n63N97K4r62Q99J353k223l79J384
2072C64k44m81L71n64j62J878r65j029J550K32j190J4N39j058J404q3j975J158
2090b41J020j330L95R25p82O7N02j094J66J585j145q25J010j42l44Q19r42k27
2108e83J502l64j229O76Q47j181L70j54o55J037M94j549K31J176o48n4N83q82
$$ y = [-478, 172, 544, -657, -102, 864, -561, -1407, 479, 380, -259, 240, -153, -499, 1205, 1, -1292, 287, 579, -641, -174, 382, -568, 579, 535, -1168, -63, 1325, -150, -392, 494, -270, -295, 522, -392, -643, 1107, -262, -1382, 286, 748, -2, 514, -26, -1079, 1096, 851, -1652, -236, 595, -254, -441, -73, -655, 378, 1182, -1162, -804, 1088, 293, -261, 302, -892, -343, 1037, -393, -1140, 794, 889, -962, -208, 435, -409, 849, 106, -1236, 69, 1100, -897, -420, 234, -329, 268, 292, -670, 229, 1582, -641, -1020, 364, 120, -361, 10, -554, -716, 1162, 197, -832, 718, 950, -240, -226, 313, -745, 659, 576, -1399, -241, 779, -551, -156, 769, -13, 54, 556, -538, -372, 1213, 68, -757, 253, 111, -233, 586, -356, -583, 919, 555, -674, 2, 849, -332, 38, -116, -771, 266, 760, -789, -558, 618, -30, -84, 499, -383]
2126c83L99L99j129K22J532r99p13R72j02o82J013o50j50J050n33j324J179M52
2144E53j003K92j26m91J024M87j431J75J514r08k03O55q05K22Q17j279j19J114
2162D88m85m22N10J34o40J159m29j008R30M1r45J85Q01o97N68K93j184P05J043
2181A047j408k34J321q75j08O05n03k03J209j120j073J710K98r77P34j96p22R85
2199D90j60j522J205R08j259K08O83q88O63M56j581M94J551j184p14O97j27P9
2217aL89o14n31J954o38j304R94Q9n80M26P4p63N06M36r91L69J104r00k07N98
2237D10n91L30O19j291k96J082J02p33N30j39l28M90mm82R64N0j175L61J07l27
2257c21M72j0o56N12M46n77l40J262p90jL96m91m1P16k75q89O83K02p23N37J30
$$ y = [-383, 16, 415, -714, -492, 1040, 41, -672, 300, 198, -484, 529, -121, -271, 779, 246, -1078, 101, 553, -450, -158, -284, -775, 249, 736, -695, -520, 994, 86, -117, 538, -267, -45, 772, -507, -626, 488, 3, -419, 91, 225, -415, 744, 315, -693, 237, 278, -667, -482, 319, -378, 190, 483, -701, 4, 1047, -361, -595, 726, -149, -257, 348, -155, -358, 851, -269, -1342, 368, 666, -311, 423, 227, -495, 490, 330, -1192, 13, 921, -338, -130, 553, -335, 328, 784, -797, -303, 1248, 64, -650, 47, -80, -1, 388, -226, -757, 1197, 559, -745, 249, 338, -242, 184, 258, -505, 1, 437, -554, -185, 919, 19, -188, 410, -181, 149, 768, -523, -819, 263, 365, -368, 162, 23, -305, 185, 181, -301, 663, 713, -462, -101, 6, -321, 151, 141, -515, -3, 443, -134, -474, 788, -2, -3, 393, -98, -139, 577, 302, -587, 96, 298, -425, 112, 242]
2278B42o39N57q4m30L03O14o77l3j72p0L84L65l92n38J053o54r0O87l02n7J92
2299B59n7k59P61o02o82O94L0j81J24K04m45M93j55n38p2O24k79NJ89k29K18O7
2321A69Q9j41R8j46m82N86k69m5L87n32K63P3J7k2Mm4O2o0m3l86N76k42O0k1J09
2346F0q6P1l2K8m9N85o70L8J77j60j61O3n6K48R1k1j95J56Mj63L36o4l25p9L97
2371A93m85M19j52m6l6J23j45P5L54m15OJ67j37k21N2J30n26L75N02J1K94j82
2393C56p8P1m14N8M06l89j47J04O0m25L67L50l29mQ5Mo5j6j1P2m09J78K1l8J31
2418f2K3j33K50k59L70j9n41N82k55l3r5L60k78L83k18K27k46J53p9K3J3k9O9
2441B06n20K91k75J09L64k78p7L58n15N50l70J47j21j39L31j08q3N5q5L44l30
$$ y = [242, -397, 160, 76, -354, -51, 563, -114, -147, -319, -389, -5, 360, -32, -570, 483, -171, -261, 426, 124, 67, 259, 202, -57, 704, 102, -580, 114, 144, -37, 87, 291, -154, 339, 184, -354, -426, 198, -81, -76, 113, -116, 102, 169, 258, 117, 215, 69, -413, 173, -96, -141, 246, -286, -23, 50, 67, 45, 49, 5, 67, 7, -36, -422, 154, -88, -28, -49, 60, -26, 45, 13, 41, -8, 577, -93, -55, 122, -38, -199, -136, -192, 56, 147, 126, -69, 87, 91, -72, 264, 200, -125, -204, 193, -292, 127, -25, -71, -107, 16, -129, -54, 300, -115, -109, 58, -79, -300, -248, -118, -644, -269, 233, 244, 538, 356, 278, 349, -65, -7, 399, 10, -137, -33, 27, -398, -31, 319, -10, -14, 71, 75, 10, -6, -17, 55, -354, -176, -155, -193, -62, -39, -172, 78, -181, 189, 170, -371, 211, -44, -77, -172, 188, -90, 293, 75, 302, 56, 209, 130, 153, 166, 137, 206, -314, -23, -298, -189, 175, -103, -180, 178, -337, 213, -157, -10, -131, -270, 61, -47, -130, -75, -160, 184, -146]
2462a46KJ09Q3J2O7o2O0j64o3k81M21O9J00k47k1J71q6L03n34K19Jql4K7n6J58
2488A00k91O4K79Oj02J02j60p9K74k85l4n8J26k82M15k7j52J68K10%l60J75J23
2511B12j43p2m1j71J37L98n58N14j2l98Q4Q9M2J19l42R6j70O7L2Q3lJ78P8m0j7
2536A62k66N2M42p23L33L3J00k75K58l55K33J75j27l24N79n4k53N8l22J29M70
2557C25j1n20J08L55j23k75M44l34M90k06j76L2J48n50L8J31K01k52L03M1l41
2578a72M72k34j99J94j63j05J36K53m33N25o5p8r4M79m91J04M44o83J12L91n80
2599a87j58N03o6l12L37r7J26K49k81j34J58J01n76N49M2m38N3K66l05L97P1m84
2621a86j17O37m37J6M16k56m32M55l88j73P06O2l93K13L66m48K38l04j34N71k99
$$ y = [-146, -144, -35, 48, 60, 127, 65, 125, -39, -102, -383, 38, 107, 207, -40, -61, 110, 24, 327, -207, 12, 13, 5, -29, -2, -58, 100, -191, -127, 152, 158, 56, 158, -2, -81, 193, -92, -126, -184, -58, -340, 75, 48, -104, 64, 274, 274, -86, 89, 212, 69, -3, -44, -215, -78, 320, -238, 276, 264, -134, -50, 39, 81, 200, -142, -46, -216, -149, -117, -34, -37, 141, 219, 179, 162, -104, -52, 390, -333, 0, 33, 133, -142, 116, -239, -6, 169, 42, -282, 297, 243, -10, 48, -274, -145, 325, 314, -206, -98, 257, 134, -141, 303, -31, 459, 253, 77, 109, 257, -293, -255, -124, 77, -175, 128, 169, -172, 300, 66, -133, 61, -102, -207, -71, 182, -251, 274, 209, 131, 37, 516, 25, 129, 573, -110, 2, 393, -187, -345, 158, 92, -220, 117, 20, 146, 395, 114, -20, 138, 239, -337, 212, 254, -184, -131, 135, -170, 227, 298, -186, -303, 334, -103, -87, 329, 73, -359, 96, -292, -465, 241, 303, -90, 123, 489, 41, 279, -25, -159, 412, 113]
2642A13o03K50N81k35n84O87m88OL79P5o30Q44m84k99P11l14j68P80m81p85J076
2663D31J33q32j6O36m57L9M83q16J74O80p85M05L51r6k09L36o80j49P31m42n4
2684a37K35pp52O92L3m62P09k3q59N89N98p76q1N01n24K17J77l38j42R42m14l45
2706a67M60n23R9O29k49o80R60l52p43L70L45n68O10m6p22N38O58p14j3L42o93
2727d59L68M89m79j02Q51p65j60L73K42q72N95p1n53J378q49q27J032P7n15L60
2747A13K11p34N45n2o77M53P14o55l28O58j50k95N50o65M5J066q54k87O41o5o04
2768c70P15l12o28Q50j16n33O21k7n82N10L57n30K04M9n84j68J111n38k76N31
2788B84n71J49O34p93J59P80n86j32M76k47k29j9j15o3M71M00p68n1N16n50J85
$$ y = [113, -490, -240, 341, 106, -478, 209, -279, -273, 106, 181, -449, 395, -89, -388, 323, 9, -159, 621, 140, -645, 431, 564, -268, -284, 352, -105, -66, 417, -399, -225, 455, -330, 75, 426, 330, 121, 457, -223, -372, 359, -83, -137, 98, 91, -661, 31, 64, -398, 311, 288, -571, 18, 616, -160, -241, 260, -264, -47, 130, -208, -350, 592, 178, -167, 293, -230, -131, 498, 249, -431, 529, 177, -566, -196, 149, -419, 191, 145, -577, -39, 619, -95, -108, 234, -459, -91, 398, -81, -183, 668, -97, -257, 116, 358, -514, 81, 10, -543, 835, -14, -841, 191, 268, -247, 113, 324, -410, 135, 83, -594, -141, 573, -82, -410, 248, 98, -197, 353, -312, -267, 799, -55, -342, 299, 234, -370, 345, 33, -595, 255, 139, -394, 227, 200, -382, 128, 485, -45, 159, 208, -376, -544, 567, 29, -247, 284, -287, -138, 496, -297, -138, 642, 56, -76, 400, 153, -76, -95, -210, -273, 198, 598, -170, -221, 295, -255, -70]
2809g0P5m70K85R29j067k20N68m8l62K82J62n19Q89k46q26R66r5p79L40L63l95
2830b38K88mn25Q01N12j031J45K99m01L59P2l46j70O45n42o11R41K08k89l0M6
2851A29k52L71N3o39J57L11m60M49r4q0J79L32p03O8N84m00n61O47j43m08L79
2872h1k37j13Q14k14m04L45l8k76K28J69q70O88K46n50M17K63m17k38N26m06R9
2893d9J88k99k55M72m4m11N67m15j37M74l6l08L13L12p32L57O3m07K47K78j14
2914F4J09J84o18K85L42o01L26M05q38K77M69o22l32R28l21n06L38J14j89N53
2934C67p1m96J00M10l56K2k5j50L15Nk03J49K09n39P4K86j69j15L80q1o54M60
2956h2J45j60j05K43j99M53n3o54O83J48n05O8M85p23L6M6j35J29O01o70K69M05
$$ y = [-70, 5, -465, -180, 749, -318, -538, 30, -18, -380, -98, 64, -455, 434, 188, -638, 328, 233, -546, -206, 157, -238, 50, 46, -479, 322, 834, -197, -52, 247, -154, 205, 277, -69, -239, 406, -136, -747, 194, 402, 113, 83, 129, -123, 248, 301, -338, -181, 130, -330, 119, 25, -55, 124, 456, -247, -179, 405, 5, -556, 91, -52, -460, -81, -318, -431, 383, 169, -235, 110, 72, -204, 24, 193, -677, 11, 257, -293, 124, 387, -30, -268, 258, -148, -49, 139, -160, -415, 57, 13, -398, 169, -246, -383, 91, 55, -253, 60, 372, -360, -3, 60, -347, -100, 178, 64, 173, 357, -261, 24, 366, -235, 91, 496, -342, -65, 404, -218, -550, 378, 57, -449, -111, 3, -186, 367, 296, -200, -100, 310, -46, -24, -49, -199, 116, 121, -82, 67, 276, -263, -189, 97, -72, -187, 193, 112, -542, -82, 63, -97, -202, 41, -158, 295, 242, -412, 271, 419, -86, -18, 467, -256, -220, -174, -309, -180, 421, -249, 20, 425]
2978D25j46l31j57L3l11N60l6k68K71J03l66J26M46m14J89q2k71J79Mr8j17L46
3000H5j13k8J01Lk64M37j92j14M4L35p43L73J19k62J91o7j93N48j55J85l1l43
3022h4Q3j99L65k38J08p7j05J27L47j78j94K77j77n5n2K85j1pN4l96P2O5k68L31
3046G3J3o0j69O6J38L2K47l13nJ11n01J81L45r1k45M14k17M3J09J69l45l1j35
3069a71K66q3j06j26L95O9j7j23J18l24J36m9Q1k17Q9O8q1n6Q1j31L72l09l8M86
3093C30m29k8L50m2j30K8j24J9J30J16l08l4J14k80K87O9j11N0K19m48n0N47l47
3116g2K17k66L59N8J40m23J47j4k30Mk35J59L42j04M0k18J36pl59J81l2K7o3p
$$ y = [425, 279, -52, -209, -176, -487, 73, 37, -231, 40, 143, -223, -97, 349, -65, 124, 42, -229, -50, -46, -144, -261, 85, -28, -56, 45, 48, -216, 221, 29, -85, -41, 294, -449, -76, 43, -219, -28, -95, -288, 260, 105, 290, 259, -84, -1, -200, 165, -73, 35, -42, -147, -20, 327, 149, -45, 232, 55, 0, -52, 233, 222, 215, 269, -127, -55, 10, -258, 73, 86, 26, -143, -77, 61, 93, 340, 27, 22, 133, -368, -187, 158, 67, -178, 236, 19, 62, 171, 340, -5, -36, -171, 95, 12, -94, -220, 175, 244, 227, 104, 222, -102, 34, -15, 66, -151, -62, 6, -75, -131, -50, -181, 191, -118, -156, 330, -99, -127, 223, 181, 51, 79, -45, -26, 104, 220, -88, -122, -8, -288, -1, 68, -43, 7, 226, -222, -272, 275, -72, 145, -121, 238, 296, 436, 13, 160, 146, -84, -80, -315, -156, 186, 82, 122, -96, 40, 33, -326, -145, -177, -150, -213, -220]
$$ [...]
8191B18
##END NTUPLES=NMR FID
##END=
