##TITLE=1H_DE-71H_oil
 D2O
 8 sc, 
 2.11.2024
##JCAMPDX= 6.0         $$ Bruker NMR JCAMP-DX V2.0
##DATA TYPE= NMR FID
##DATA CLASS= NTUPLES
##ORIGIN= UXNMR, Bruker Analytische Messtechnik GmbH
##OWNER= root
$$ XWIN-NMR		Version 3.5
$$ Sat Nov  2 14:37:47 2024 Russian Standard Time (UT+4h)  she@DPX200
##.OBSERVE FREQUENCY= 200.1318
##.OBSERVE NUCLEUS= ^1H
##.DELAY= (6, 6)
##.ACQUISITION MODE= SIMULTANEOUS
##.ACQUISITION SCHEME= undefined
##.AVERAGES= 8
##.DIGITISER RES= 18
##SPECTROMETER/DATA SYSTEM= spect
##.PULSE SEQUENCE= zg30
##.SOLVENT NAME= D2O
##.SHIFT REFERENCE= (INTERNAL, D2O, 0, 15.7039)
##AUDIT TRAIL= $$ (NUMBER, WHEN, WHO, WHERE, WHAT)
$$ ##TITLE= Audit trail, XWIN-NMR		Version 3.5
$$ ##JCAMPDX= 5.01
$$ ##ORIGIN= Bruker BioSpin GmbH
$$ ##OWNER= she
$$ F:/spectra/data/she/nmr/H-F/1/audita.txt
$$ ##AUDIT TRAIL=  $$ (NUMBER, WHEN, WHO, WHERE, WHAT)
(   1,<2024-11-02 14:36:57.73 +0400>,<she>,<DPX200>,
      <created by zg, POWCHK disabled, PULCHK disabled
       configuration hash MD5:
       00 E9 B6 7A A2 85 ED C7 34 08 36 98 17 FE 4E 26
       data hash MD5: 16K
       81 87 35 2A 30 F5 32 4C 4F 75 06 89 47 8A 15 16>)
$$ ##END=
$$ 
$$ hash MD5
$$ 85 F2 9D 09 02 3E E4 0D F9 2D 46 16 0D 34 DC A4
##$RELAX= 
##$RELAX= 
##$RELAX= 
##$RELAX= 
##$RELAX= 
##$RELAX= 
$$ Bruker specific parameters
$$ --------------------------
##$DU= <F:/spectra>
##$EXPNO= 1
##$NAME= <H-F>
##$PROCNO= 1
##$TYPE= <nmr>
##$USER= <she>
##$AMP= (0..31)
100 100 100 100 100 100 100 100 100 100 100 100 100 100 100 100 100 100 
100 100 100 100 100 100 100 100 100 100 100 100 100 100 
##$AQSEQ= 0
##$AQ_mod= 1
##$AUNM= <au_zg>
##$AUTOPOS= <>
##$BF1= 200.13
##$BF2= 200.13
##$BF3= 200.13
##$BF4= 200.13
##$BF5= 200.13
##$BF6= 200.13
##$BF7= 200.13
##$BF8= 200.13
##$BYTORDA= 1
##$CFDGTYP= 0
##$CFRGTYP= 5
##$CHEMSTR= <none>
##$CNST= (0..31)
1 1 145 1 1 1 1 1 1 1 1 1 1 1 1 1 1 1 1 1 1 1 1 1 1 1 1 1 1 1 1 1 
##$CPDPRG= <>
##$CPDPRG1= <>
##$CPDPRG2= <>
##$CPDPRG3= <>
##$CPDPRG4= <mlev>
##$CPDPRG5= <mlev>
##$CPDPRG6= <mlev>
##$CPDPRG7= <mlev>
##$CPDPRG8= <mlev>
##$CPDPRGB= <>
##$CPDPRGT= <>
##$D= (0..31)
0 1.2 0 0 0 0 0 0 0 0.06 0 0.03 0 0 0 0 0.0002 0 0 0 0 0 0 0 0 0 0 0 0 
0 0 0 
##$DATE= 1730543817
##$DBL= (0..7)
120 120 120 120 120 120 120 120 
##$DBP= (0..7)
150 150 150 150 150 150 150 150 
##$DBP07= 0
##$DBPNAM0= <>
##$DBPNAM1= <>
##$DBPNAM2= <>
##$DBPNAM3= <>
##$DBPNAM4= <>
##$DBPNAM5= <>
##$DBPNAM6= <>
##$DBPNAM7= <>
##$DBPOAL= (0..7)
0.5 0.5 0.5 0.5 0.5 0.5 0.5 0.5 
##$DBPOFFS= (0..7)
0 0 0 0 0 0 0 0 
##$DE= 6
##$DECBNUC= <off>
##$DECIM= 24
##$DECNUC= <off>
##$DECSTAT= 4
##$DIGMOD= 1
##$DIGTYP= 9
##$DL= (0..7)
0 120 120 120 120 120 120 120 
##$DP= (0..7)
150 150 150 150 150 150 150 150 
##$DP07= 0
##$DPNAME0= <>
##$DPNAME1= <>
##$DPNAME2= <>
##$DPNAME3= <>
##$DPNAME4= <>
##$DPNAME5= <>
##$DPNAME6= <>
##$DPNAME7= <>
##$DPOAL= (0..7)
0.5 0.5 0.5 0.5 0.5 0.5 0.5 0.5 
##$DPOFFS= (0..7)
0 0 0 0 0 0 0 0 
##$DQDMODE= 0
##$DR= 18
##$DS= 0
##$DSLIST= <SSSSSSSSSSSSSSS>
##$DSPFIRM= 0
$$ [...]
##$SUBNAM2= <"">
##$SUBNAM3= <"">
##$SUBNAM4= <"">
##$SUBNAM5= <"">
##$SUBNAM6= <"">
##$SUBNAM7= <"">
##$SUBNAM8= <"">
##$SUBNAM9= <"">
##$SW= 24.0689170037331
##$SWIBOX= (0..15)
0 0 2 0 0 0 0 0 0 0 0 0 0 0 0 0 
##$SW_h= 4816.95568400771
##$TD= 16384
##$TD0= 1
##$TE= 0
##$TE2= 300
##$TE3= 300
##$TEG= 300
##$TL= (0..7)
0 120 120 120 120 120 120 120 
##$TP= (0..7)
150 150 150 150 150 150 150 150 
##$TP07= 0
##$TPNAME0= <>
##$TPNAME1= <>
##$TPNAME2= <>
##$TPNAME3= <>
##$TPNAME4= <>
##$TPNAME5= <>
##$TPNAME6= <>
##$TPNAME7= <>
##$TPOAL= (0..7)
0.5 0.5 0.5 0.5 0.5 0.5 0.5 0.5 
##$TPOFFS= (0..7)
0 0 0 0 0 0 0 0 
##$TUNHIN= 0
##$TUNHOUT= 0
##$TUNXOUT= 0
##$USERA1= <user>
##$USERA2= <user>
##$USERA3= <user>
##$USERA4= <user>
##$USERA5= <user>
##$V9= 5
##$VALIST= <valist>
##$VCLIST= <CCCCCCCCCCCCCCC>
##$VD= 0
##$VDLIST= <DDDDDDDDDDDDDDD>
##$VPLIST= <PPPPPPPPPPPPPPP>
##$VTLIST= <TTTTTTTTTTTTTTT>
##$WBST= 1024
##$WBSW= 4
##$XGAIN= (0..3)
0 0 0 0 
##$XL= 0
##$YL= 0
##$YMAX_a= 185883
##$YMIN_a= -138778
##$ZGOPTNS= <>
##$ZL1= 120
##$ZL2= 120
##$ZL3= 120
##$ZL4= 120
##$ABSF1= 10
##$ABSF2= 0
##$ABSG= 5
##$ABSL= 3
##$ALPHA= 0
##$AQORDER= 0
##$ASSFAC= 0
##$ASSFACI= 0
##$ASSFACX= 0
##$ASSWID= 0
##$AUNMP= <proc_1d>
##$AZFE= 0.1
##$AZFW= 0.1
##$BCFW= 1
##$BC_mod= 2
##$BYTORDP= 1
##$COROFFS= 0
##$CY= 11.3945322036743
##$DATMOD= 1
##$DC= 2
##$DFILT= <>
##$DTYPP= 0
##$F1P= 15.6554695791079
##$F2P= 12.8336369535428
##$FCOR= 0.5
##$FTSIZE= 0
##$FT_mod= 4
##$GAMMA= 1
##$GB= 0.15
##$INTBC= 1
##$INTSCL= 1
##$ISEN= 128
##$LB= 0.24
##$LEV0= 0
##$LPBIN= 0
##$MAXI= 10000
##$MC2= 0
##$MEAN= 0
##$ME_mod= 0
##$MI= 1.114404
##$NCOEF= 0
##$NC_proc= 0
##$NLEV= 6
##$NOISF1= 3.799351
##$NOISF2= 2.8
##$NSP= 1
##$NTH_PI= 0
##$NZP= 0
##$OFFSET= 15.70392
##$PC= 1
##$PHC0= -26357.53
##$PHC1= 21.18743
##$PH_mod= 1
##$PKNL= yes
##$PPARMOD= 0
##$PSCAL= 0
##$PSIGN= 0
##$REVERSE= no
##$SF= 200.130013532006
##$SI= 16384
##$SIGF1= 3
##$SIGF2= 2
##$SINO= 400
##$SIOLD= 16384
##$SREGLST= <1H.CDCl3>
##$SSB= 0
##$STSI= 0
##$STSR= 0
##$SW_p= 3612.71676300578
##$SYMM= 0
##$S_DEV= 0
##$TDeff= 0
##$TDoff= 0
##$TI= <>
##$TILT= no
##$TM1= 0
##$TM2= 0
##$TOPLEV= 0
##$USERP1= <user>
##$USERP2= <user>
##$USERP3= <user>
##$USERP4= <user>
##$USERP5= <user>
##$WDW= 1
##$XDIM= 8192
##$YMAX_p= 0
##$YMIN_p= 0
$$ End of Bruker specific parameters
$$ ---------------------------------
##NTUPLES= NMR FID
##VAR_NAME=  TIME,          FID/REAL,        FID/IMAG
##SYMBOL=    X,             R,               I
##VAR_TYPE=  INDEPENDENT,   DEPENDENT,       DEPENDENT
##VAR_FORM=  AFFN,          ASDF,            ASDF
##VAR_DIM=   8192,          8192,            8192
##UNITS=     SECONDS,       ARBITRARY UNITS, ARBITRARY UNITS
##FACTOR=    0.0002076,     1,               1
##FIRST=     0,             0,               0
##LAST=      1.7004516,     0,               0
##MIN=       0,             -138778,         0
##MAX=       1.7004516,     185883,          0
$$ Real data points
##PAGE= N=1
##DATA TABLE= (X++(R..R)), XYDATA
$$ plain form
0 0 0 0 0 0 0 0 0 0 0 4 -8 8 -8 13 -16 16 -24 24 -32 37 -44 48 -58 68 -78 89 -102 116 -132 151 -170 190
32 190 -215 241 -267 300 -333 371 -413 456 -506 561 -622 687 -761 843 -935 1041 -1159 1298
50 1298 -1456 1649 -1876 2158 -2518 2990 -3646 4624 -6234 9501 -31688 144653 168534 -23508
64 -23508 -68456 -109111 -49266 122355 138734 -36383 -119378 -82546 28016 126055 75907 -67265
76 -67265 -109842 -49959 62979 127973 32128 -106437 -98061 -2080 93155 109180 -21415 -136790
88 -136790 -60031 62311 92706 54500 -52931 -126464 -26457 100925 86377 -4330 -83377
99 -83377 -86784 20601 102318 55245 -34217 -87806 -61713 54813 109585 18598 -73026 -76454
111 -76454 -18234 75619 93135 -17396 -96103 -54977 27080 87888 59493 -56409 -97247 -14508
$$ packed form
0@%%%%%%%%%Mj2J6j6K1k9L2m0M8n6O9q1R2j06J26j46J67j91K18k48K83l21L60
32A90m05M56n08N67o33P04p84Q69r62J067j183J309j448J604j778J976k200K457
50A298k754L105l525M034m676N508o636Q270j0858J5735m1189J76341K3881j92042
64b3508m4948m0655N9845J71621J6379j75117q2995L6832J10562R8039n0148j43172
76f7265m2577N9883J12938O4994r5845j38565Q376R5981R5235J6025j30595j15375
88a36790P6759J22342L0395l8206j07431p3533J00007J27382j4548r0707p9047
99h3377l407J07385Q1717m7073q9462n3589K6093J16526N4772r0987r1624l428
111g6454N8220R3853J7516j10531p8707M1126Q2057O0808k8395j15902m0838Q2739
$$ plain form
123 -14508 60724 71076 19155 -71685 -80564 17017 78278 51061 -17429 -78593 -53634 45875
135 45875 80911 23249 -45232 -73980 -23746 68114 73522 -9066 -67770 -57075 14180 79662
147 79662 45704 -42311 -66653 -27427 35883 75635 21428 -67135 -61046 9094 53317 52760 -6040
160 -6040 -72027 -44958 34088 61323 30209 -31837 -70524 -19190 56824 54095 536 -47459
172 -47459 -55531 5553 67204 40317 -26838 -56014 -32215 30415 65853 15635 -47906 -48087 -6296
185 -6296 43574 54120 -5979 -59460 -35370 19566 49713 34487 -26235 -59580 -16162 38336
197 38336 46205 11570 -41719 -51863 6272 51847 32763 -12612 -46562 -34852 24824 53639
209 53639 15241 -31668 -43504 -13816 38257 46848 -4139 -43390 -33262 6969 45038 33467
$$ packed form
123a4508P5232J0352n1921r0840q879R7581O1261k7217o8490o1164K4959R9509
135D5875L5036n7662o8481k8748N0234R1860N408q2588n8704J0695P1255O5482
147G9662l3958q8015k4342L9226O3310L9752n4207q8563O089P0140M4223n57n8800
160f040o5987K7069P9046K7235l1114o2046l8687N1334P6014k729n3559m7995
172d7459q072O1084O1651k6887o7155k9176K3799O2630L5438n0218o3541j81M1791
185f296M9870J0546o0099n3481K4090N4936L0147j5226o0722l3345M3418N4498
197C8336P869l4635n3289j0144N8135M5575j9084m5375l3950J1710N9676K8815
209E3639l8398m6909j1836K9688N2073Q591n0987l9251J0128M0231L8069j1571
$$ plain form
221 33467 -22908 -46941 -16109 24766 42675 15257 -36072 -42612 1861 36498 33461 -3890
233 -3890 -43084 -30591 19821 40811 18442 -20195 -42214 -15018 33259 37822 524 -31365
245 -31365 -33383 1667 39900 28467 -15695 -36136 -20692 16827 39813 14122 -29008 -33800
257 -33800 -4084 27736 33369 -831 -36590 -25524 11402 32490 21633 -15024 -37504 -13168
269 -13168 24465 30491 6871 -24779 -32782 279 33045 23725 -8488 -30031 -21831 13087 34560
282 34560 12763 -20984 -28801 -8607 23086 30814 155 -28500 -22960 4743 27889 21996 -11988
295 -11988 -31494 -12371 16645 27280 10170 -21336 -29022 -633 25361 21963 -3259 -25931
307 -25931 -20809 10021 28202 13425 -14057 -26518 -10269 19348 26141 1758 -21759 -21841 1167
$$ packed form
221C3467n6375k4033L0832M0875J7909k7418n1329o540M4473L4637l037l7351
233c890l9194J2493N0412K0990k2369l8637k2019K7196M8277M563l7298l1889
245c1365k018L5050L8233j1433m4162k0441J5444L7519K2986k5691m3130m792
257c3800K9716L1820N633l4200l5759J1066L6926K1088j0857l6657k2480K4336
269a3168L7633O026k3620l1650q003L3061L2766r320l2213k1543Q200L4918K1473
282C4560k1797l3747p817K0194L1693P728l0659k8655N540K7703K3146n893l3984
295a1988j9506J9123K9016J0635j7110l1506p686K8389K5994l398k5222k2672
307b5931N122L0830J8181j4777k7482j2461J6249K9617O793k4383k3517q2K3008
$$ plain form
320 1167 24638 19843 -8795 -25474 -13580 11460 24837 10287 -17420 -24016 -3462 18973 21109
333 21109 -251 -22489 -18252 6833 22780 13833 -9745 -23678 -9887 15468 21613 4555 -16623
346 -16623 -20456 -653 20992 17131 -5243 -20526 -13681 8259 21750 9728 -13300 -20219 -5096
359 -5096 15392 19710 894 -18415 -15836 3435 18718 14262 -7318 -20663 -9617 11272 18601
372 18601 5769 -13737 -18326 -1955 16881 15399 -2472 -17153 -12976 5689 18238 9707 -9468
385 -9468 -17819 -6419 12110 16639 2334 -14360 -14860 789 16608 13015 -5325 -16748 -9267
398 -9267 8177 16367 6650 -10923 -16097 -2971 13161 14100 -622 -14492 -12200 3721 15690
411 15690 9450 -7365 -15393 -5995 9501 14221 3058 -11763 -13348 271 13201 11461 -3127
$$ packed form
320A167K3471m795k8638j6679J1894K5040J3377j4550k7707o596K0554K2435K136
333B1109k1360k2238M237K5085J5947q947k3578j3933J3791K5355O145j7058k1178
346a6623l833J9803K1645l861k2374j5283O845K1940J3491j2022k3028o919J5123
359e096K0488M318j8816j9309K579J9271J5283m456k1580j3345J1046K0889P329
372A8601j2832j9506m589J6371J8836j482j7871j4681M177J8665J2549q531j9175
385i468q351J1400J8529M529j4305j6694n00J5649J5819l593j8340j1423P481
398i267J7444Q190r717j7573n174J3126J6132R39j4722j3870K292J5921J1969
411A5690o240j6815q028R398J5496M720j1163j4821j585J3619J2930j740j4588
$$ plain form
424 -3127 -13934 -9040 6043 13852 6643 -8274 -14009 -3512 10482 12457 639 -11854 -10972 2328
438 2328 12954 8548 -5015 -12827 -6518 7105 12930 3499 -9313 -11356 -1059 10373 10294 -1255
452 -1255 -11668 -8410 3843 11354 6335 -6000 -11852 -3706 8373 10754 1726 -9365 -9950 1099
466 1099 11017 7640 -3304 -10676 -6046 5632 10810 3686 -7240 -9659 -2266 8699 9140 -820
480 -820 -9458 -7395 2087 10022 6329 -4734 -10314 -3714 6221 9061 2004 -7354 -9095 214 8511
495 8511 7420 -1520 -9057 -5462 4489 9174 3833 -5155 -9284 -2450 7042 8076 21 -7261 -6703
510 -6703 975 8924 6032 -3859 -8359 -3740 4289 8637 2782 -6553 -7402 -37 6592 6506 -1034 -7881
526 -7881 -5252 2892 7438 4283 -4007 -8255 -2026 5751 6603 498 -5497 -6604 697 6957 5042
$$ packed form
424c127j0807M894J5083P809p209j4917n735J0497J3994J975j1818j2493Q82J3300
438B328J0626m406j3563p812O309J3623N825r431j2812k043J0297J1432p9j1549
452a255j0413L258J2253P511n019j2335n852Q146J2079K381r028j1091n85J1049
466A099R918l377j0944p372M630J1678N178p124j0926k419P393J0965M41r960
480h20q638K063R482P935l693j1063n580O600R935K840p057r358j741R309Q297
495H511j091q940p537L595R951M685n341q988m129O834R492J034q055p282N58
510f703P678P949k892r891m500M619Q029M348n855r335q49P365O629q6p540o847
526g881K629Q144M546l155q290m248O229P777Q52o105n995j107P301O260j915
$$ plain form
541 5042 -2223 -6688 -4110 3383 7522 2239 -5091 -6418 -1211 5271 6095 -372 -6463 -4552 1776
556 1776 6403 4111 -3201 -6686 -2182 4081 5698 1450 -5167 -5716 347 5332 4481 -1287 -5736 -4066
572 -4066 2966 6268 1970 -3362 -5583 -1450 4942 5298 -254 -5186 -3946 707 5554 3809 -2625
587 -2625 -5549 -2612 2891 5357 1849 -3978 -4955 212 4341 4137 -776 -5152 -3214 2594 4576 2567
603 2567 -2563 -5264 -1563 3822 4472 129 -3618 -4003 382 4579 2998 -2001 -4168 -2387 1979 4722
619 4722 1273 -3486 -3591 -266 3447 4032 -402 -4502 -2959 1510 3918 2457 -1889 -4612 -1345 2854
635 2854 3453 450 -3416 -3703 181 3864 2608 -1210 -3723 -2402 1617 4371 1405 -2622 -3167 -1108
651 -1108 3024 3268 -231 -3510 -2333 714 3595 2501 -1842 -3526 -1247 2087 3375 1074 -2437
$$ packed form
541E042p265m465K578P493M139n283p330j327N207O482Q24o467o091J911O328
556A776M627k292p312l485M504O263J617m248o617n49O063M985q51n768m449J670
572d066P032L302m298n332k221M133O392L56n552m932J240M653M847j745o434
587b625k924K937N503K466l508n827r77N167M129k04m913m376J938N808J982k009
603B567n130k701L701N385O50m343l747l85M385M197j581m999k167J781M366K743
619D722l449m759j05L325L713N85m434m100J543M469K408j461m346k723L267M199
635B854N99l003l866k87L884L683j256l818k513J321M019K754k966m027n45K059
651a108M132K44l499l279J177L047K881j094m343j684K279L334J288k301l511
$$ plain form
666 -2437 -3114 302 3056 2566 -300 -3391 -2545 1688 3257 1211 -1912 -2709 -991 2302 2869 -66
682 -66 -2540 -2475 253 3035 2223 -1311 -2894 -1542 1578 3096 1097 -2304 -2502 -99 1855 2303 -243
699 -243 -3151 -1660 1118 2209 1705 -1089 -3049 -835 2037 2197 238 -2124 -2347 455 2409 1842
715 1842 -1075 -2172 -1432 1166 2525 787 -2078 -1856 -218 1757 2214 -33 -2125 -1890 580 2256
731 2256 1858 -1005 -2256 -1038 1323 1780 938 -1689 -2187 336 2172 1518 -534 -1772 -1491 958 2051
748 2051 1227 -1085 -1707 -513 1425 1735 39 -1750 -1276 148 1890 1283 -441 -1873 -1165 752 1559
765 1559 853 -1477 -1873 166 1601 1275 16 -1653 -915 579 1734 371 -732 -1608 -451 918
781 918 1325 308 -1329 -1399 53 1433 1333 -329 -1570 -1163 679 1685 513 -907 -1255 -271 1027
$$ packed form
666b437o77L416K754m90k866l091Q46M233J569k046l123p97J718L293N67k935
682f6k474O5K728K782q12l534j583J352L120J518j999l401j98K403J954M48k546
699b43k908J491K778J091n04k794j960K214K872J60j959k362k23K802J954n67
715A842k917j097P40K598J359j738k865K22J638J975M57k247k092K35K470J676
731B256l98k863j251J218K361M57q42k627m98K523J836o54k052j238K81K449J093
748B051q24k312o22J194J938L10j696j789M74J424J742o07j724j432P08J917Q07
765A559p06k330l96K039J435l26j259j669P38J494J155j363j103q76J157J369
781I18M07j017j637p0J452J380j00j662j241M07J842J006j172j420l48R84J298
$$ plain form
798 1027 1491 -162 -1517 -1073 303 1079 944 -603 -1369 -342 917 1085 352 -1088 -1117 138 905 663
816 663 -515 -1016 -816 399 1225 684 -746 -950 -345 1046 808 -117 -924 -998 109 1084 697 -585 -1149
835 -1149 -393 859 1115 461 -499 -991 95 575 725 -68 -840 -918 310 986 280 -555 -1095 -350 643
854 643 922 -116 -605 -722 220 801 761 -164 -990 -208 293 618 201 -409 -921 -99 426 799 -162 -868
874 -868 -402 323 702 178 6 -380 -317 523 795 88 -556 -632 111 653 579 -311 -641 -752 583 633 113
895 113 -483 -663 -299 536 581 72 -439 -647 189 994 578 -5 -630 -554 597 467 161 -74 -751 -74 614
916 614 463 -18 -614 -398 -4 873 688 -390 -365 -231 274 514 422 -435 -319 210 719 391 -342 -626 -239
937 -239 99 556 428 -533 -320 -47 380 311 -34 -531 -332 75 310 414 50 -572 -326 367 515 -56 -483
$$ packed form
798A027M64j653j355M44J376P76j35j547p66J027J259J68p33j440k9J255P67k42
816F63j178n01K00J215Q26n41j430k04O05J391k38r25q07p4J107R75l87j282n64
835a149P56J252K56o54r60m92J086M80J50p93p72p8J228O76p06q35n40P45R93
854F43K79j038m89j17R42N81m0r25q26P82N01L25m17o10n12Q22N25L73r61p06
874h68M66P25L79n24j72l86O3Q40K72p07o44p6P43N42p4q90l30j11J335N0n20
895A13n96j80L64Q35M5n09n11k08Q36Q05m16n83o25P6J151j30l06k35o77O77O88
916F14j51m81n96K16L94Q77j85j078K5J34N05K40r2q57J16N29N09l28p33k84L87
937b39L38M57j28r61K13K73M27o9l45m97J99M07K35J04l64o22K46O93J48n71m27
$$ plain form
958 -483 -291 86 277 236 -316 -284 228 301 469 167 -406 -838 -26 226 58 -129 -166 -82 299 257 41 -345
980 -345 14 -318 233 107 -10 -331 62 -306 244 221 -17 -152 -8 -30 206 -203 -169 7 -229 57 151 -347
1002 -347 -531 -258 -81 472 120 -343 -321 167 338 245 29 -328 -249 -47 46 -28 -146 30 -5 7 86 251 149
1025 149 -351 143 75 372 -200 -180 63 -55 63 47 -280 48 -208 116 -47 -16 -260 48 56 84 314 -93
1047 -93 96 -292 139 135 23 -1 266 175 -96 -25 -210 34 -40 123 -16 109 221 -38 -24 75 209 66 147
1070 147 158 -270 117 179 -167 -25 -88 -54 80 112 -272 -147 34 -157 51 285 -289 -16 105 -99 -38 22
1092 22 80 5 -32 -219 -114 375 -210 119 99 -129 29 327 15 -82 138 -371 -76 272 -253 205 181 152 -140
1115 -140 -246 137 55 -120 97 214 -129 -59 147 -232 -44 -86 -25 3 22 335 85 -3 36 -205 -225 67 3
$$ packed form
958d83J92L77J91m1n52L2N12P3J68l02n73m32Q12K52j68j87l7Q4L81m2k16l86
980c45L59l32N51j26j17l21L93l68N50k3k38j35J44k2K36m09L4J76k36K86R4m98
1002c47j84K73J77N53l52m63K2M88J71r3k16l57P9K02R3p4j18J76l5J2P9J65j02
1025A49n00M94o8K97n72K0K43j18J18j6l27L28k56L24j63L1k44L08QK8K30m07
1047i3J89l88M31mj12k4K67r1k71P1j85K44p4J63j39J25J12k59J4R9J34j43Q1
1070A47J1m28L87O2l46J42o3L4J34L2l84J25J81j91K08K34n74K73J21k04O1O0
1092B2N8p5l7j87J05M89n85L29k0k28J58K98l12r7K20n09K95L48n25M58k4k9k92
1115a40j06L83q2j75K17J17l43P0K06l79J88m2O1K8J9L13k50q8L9k41k0K92o4
$$ plain form
1138 3 -4 -28 -145 -30 90 -11 -80 -21 -481 106 244 75 -9 -118 83 -86 206 10 252 -156 -176 -183 -292 155
1162 155 -221 119 -33 6 203 -79 31 317 -116 420 200 -77 275 168 -80 7 115 112 296 -91 366
1183 366 -97 113 -35 -204 238 153 53 26 190 -26 16 -319 -97 -104 -8 -34 308 15 -91 -118 121 63 148
1206 148 77 -114 1 -174 249 -177 -218 -33 -161 -58 108 357 -307 -131 -104 215 -100 188 19 -259 -174
1227 -174 -54 6 95 25 8 374 269 151 60 53 17 172 -49 238 -25 258 137 278 -192 -156 -20 -128 63
1250 63 204 -41 -47 -350 172 -21 -69 -195 -132 91 -74 -82 -110 230 -112 -1 58 -30 -175 -100 250 47 253 87
1274 87 -137 -51 -202 288 -139 243 -208 -212 233 -102 74 288 -235 -85 -82 32 58 -296 -122 -171 253 -97 94
1297 94 -66 -206 138 15 -366 126 9 -17 205 -108 -389 -149 59 -64 -11 321 -286 -60 174 311 -90
$$ packed form
1138Cpk4j17J15J20j01o9N9m60N87J38j69q4j09K01j69K92j96K42m08k0pj09M47
1162A55l76L40j52L9J97k82J10K86m33N36k20k77L52j07k48Q7J08lJ84l87M57
1183C66m63K10j48j69M42q5j00k7J64k16M2l35K22pR6k6L42k93j06k7K39n8Q5
1206A48p1j91J15j75M23m26m1J85j28J03J66K49o64J76K7L19l15K88j69k78Q5
1227a74J20O0Q9p0j7L66j05j18r1pl6J55k21K87k63K83j21J41m70L6J36j08J91
1250F3J41k45ol03N22j93m8j26O3K23j65qk8L40l42J11N9q8j45P5L50k03K06j66
1274H7k24Q6j51M90m27L82m51mM45l35J76K14n23J50LJ14K6l54J74m9M24l50J91
1297I4j60j40L44j23l81M92j17k6K22l13k81K40K08j23N3L32o07K26K34J37m01
$$ plain form
1318 -90 -112 -307 -169 176 70 84 -62 -83 54 -86 120 144 -4 1 12 -147 24 219 -75 37 -42 115 -9
1341 -9 -100 -111 147 328 11 -7 -125 -119 227 269 162 -122 -111 -204 -212 146 -321 -4 -244 71 44 -166 64 312
1365 312 334 286 343 308 149 53 -27 -34 9 -58 66 37 317 176 65 -417 -114 -5 -262 13 88 -306 -28 70
1389 70 394 352 -299 191 -348 31 -39 -166 160 -247 -57 -266 64 -45 -214 195 -90 164 -44 -329 52
1410 52 325 176 82 -81 96 11 437 66 129 -185 -51 -41 169 -15 -201 244 -238 -215 -10 226 -23 -501
1432 -501 2 145 309 253 -415 -332 -105 -157 42 -41 -217 -413 -452 51 212 89 113 135 243 32 -210 -230 -450
1455 -450 -17 0 50 244 21 -268 -148 -35 -71 -174 34 47 -80 -130 -82 7 -46 75 95 12 -80 53 221 2
1479 2 -34 -68 38 -256 18 -40 85 94 173 279 111 -107 106 -152 84 -229 360 41 -126 68 -53 -175 -25
$$ packed form
1318i0k2j95J38L45j06J4j46k1J37j40K06K4j48NJ1j59J71J95k94J12p9J57j24
1341ir1j1K58J81l17j8j18OL46M2j07k84J1r3qL58m67L17k40L15k7k10K30K48
1365C12K2m8N7l5j59r6q0pM3o7J24k9K80j41j11m82L03J09k57K75P5l94K78R8
1389G0L24m2o51M90n39L79p0j27L26m07J90k09L30j09j69M09k85K54k08k85L81
1410E2K73j49r4j63J77q5M26l71O3l14J34J0K10j84j86M45m82K3K05K36k49m78
1432e01N03J43J64n6o68Q3K27n2J99q3j76j96l9N03J61j23K4K2J08k11k42k0k20
1455d50M33J7N0J94k23k89J20J13l6j03K08J3j27n0M8Q9n3J21K0q3r2J33J68k19
1479Bl6l4J06k94K74n8J25RP9J06j68k18K13k58K36l13N89l19j67J94j21j22J50
$$ plain form
1502 -25 7 -105 -388 164 -55 -110 155 44 107 192 196 -306 205 -7 -205 13 89 79 -288 -284 41 163 -148 -68
1526 -68 -101 108 -336 76 234 -258 -95 -51 461 -125 124 -24 -14 85 143 -126 18 -364 14 469 184 -120
1548 -120 -189 -270 -180 -105 -11 -306 -9 75 -152 67 -37 370 -48 -105 31 197 -126 106 -100 162 -264 -17
1570 -17 -68 100 -199 -35 -68 -13 96 79 -127 58 95 -132 179 -272 410 -110 -37 39 -126 -92 95 78 45 -306
1594 -306 184 67 181 169 -222 -154 -241 -43 61 141 -119 58 -326 31 190 -278 197 220 299 -158 -116 -290
1616 -290 13 325 117 82 6 110 -132 -64 44 -196 218 -42 -319 80 -120 115 -42 -29 -50 -195 -205 -36
1638 -36 -73 139 113 -150 80 -165 -4 57 24 198 -64 79 -29 182 68 81 -215 330 260 -34 69 -111
1660 -111 255 -130 156 343 -101 -95 -62 -292 13 153 74 232 34 80 181 -197 -123 213 -263 99 0 138
$$ packed form
1502b5L2j12k83N52k19n5K65j11O3Q5Mn02N11k12j98K18P6j0l67ML25J22l11Q0
1526f8l3K09m44M12J58m92J63M4N12n86K49j48J0R9N8k69J44l82L78M55k85l04
1548a20o9q1R0P5R4k95K97Q4k27K19j04M07m18n7J36J66l23K32k06K62m26K47
1570a7n1J68k99J64l3N5J09j7k06J85L7k27L11m51O82n20P3P6j65L4J87j7l3l51
1594c06M90j17J14j2l91O8q7J98J04Q0k60J77l84L57J59m68M75K3P9m57M2j74
1616b90L03L12k08l5p6J04k42O8J08k40M14k60k77L99k00K35j57J3k1j45j0J69
1638c6l7K12k6k63K30k45J61O1l3J74k62J43j08K11j14J3k96N45p0k94J03j80
1660a11L66l85K86J87m44OL3k30L05J40p9J58j98M6J01l78P4L36m76L62r9J38
$$ plain form
1682 138 0 213 -36 -92 83 17 194 -402 153 -109 -7 64 -1 -430 -134 -34 13 99 125 242 81 -104
1704 -104 252 -276 69 -212 -312 -99 -314 -213 -16 56 -193 -116 17 -152 -84 241 261 132 -11 83 -168 135
1726 135 -130 -86 -200 138 61 136 22 5 208 -317 -164 53 -131 107 -155 420 414 248 -156 -42 -269 226
1748 226 105 65 330 -67 -56 87 294 -105 222 379 -12 152 2 -168 -272 -60 -39 -91 50 -4 7 -25
1770 -25 122 152 -145 -172 103 -20 85 16 -153 -268 -69 118 29 -259 -78 -27 100 195 -102 -60 214 -22 89
1793 89 -7 -331 -167 113 138 -121 1 -12 -7 -33 204 218 161 -469 -209 -116 -226 -62 -138 90 66 -30 -198 -88
1817 -88 328 213 96 24 -133 52 -38 -106 143 -80 115 -360 -202 -181 -66 174 -124 -49 -78 -296 -50 95
1839 95 122 -47 -16 -83 -58 122 -196 108 66 453 62 65 311 -197 47 -115 100 -54 39 -140 -142 -10 123 -81
$$ packed form
1682A38j38K13k49n6J75o6J77n96N55k62J02P1o5m29K96J00M7Q6K6J17j61j85
1704a04L56n28L45k81j00K13k15J01J97P2k49P7J33j69O8L25K0j29j43R4k51L03
1726A35k65M4j14L38p7P5j14j7K03n25J53K17j84K38k62N75oj66m04J14k27M95
1748B26j21m0K65l97J1J43K07l99L27J57l91J64j50j70j04K12K1n2J41n4J1l2
1770b5J47L0k97k7K75j23J05o9j69j15J99J87q9k88J81N1J27R5k97M2K74k36J11
1793H9r6l24J64K80K5k59J22j3Nk6K37J4n7o30K60R3j10J64p6K28k4r6j68J10
1817h8M16j15j17p2j57J85r0o8K49k23J95m75J58K1J15K40k98P5k9k18K46J45
1839I5K7j69L1o7K5J80l18L04m2L87l91LK46n08K44j62K15j54R3j79kJ32J33k04
$$ plain form
1863 -81 48 -54 -277 -133 -43 -8 -84 -188 22 166 22 -40 168 -59 264 -86 316 -44 -91 215 -102 -75
1885 -75 -165 -140 -154 61 -58 50 -30 77 -7 10 258 -53 -114 -50 -10 -65 118 26 -134 -64 -332 -186 -11 -24 -161
1910 -161 -324 -11 -98 172 198 -354 18 -170 69 116 68 -102 -159 -49 52 -77 462 333 173 -327 -111 -98
1932 -98 1 156 -74 148 48 -159 22 166 259 -269 -161 55 -8 -57 -95 186 -128 82 -205 -2 23 160
1954 160 207 148 -183 -102 120 -13 -292 -135 243 -136 40 84 -347 -91 -341 -288 -149 -3 -22 -124 -111 133
1976 133 133 173 -231 -160 -109 92 -98 433 81 61 -47 332 26 52 -120 -441 70 -327 42 -45 -205 149 -80
1999 -80 -166 138 -124 -466 -167 -279 41 -10 62 264 4 5 78 175 -119 240 156 130 72 -88 162 42 103 -157
2023 -157 14 -145 14 95 88 82 112 -214 -77 68 305 -196 102 -151 -70 -234 230 -40 165 -77 -39 -210 8
$$ packed form
1863h1J29j02k23J44R0L5p6j04K10J44j44o2K08k27L23l50M02l60m7L06l17K7
1885g5r0K5j4K15j19J08q0J07q4J7K48l11o1O4M0n5J83r2j60P0k68J46J75j3j37
1910a61j63L13q7K70K6n52L72j88K39M7m8j70n7J10J01j29N39j29j60n00K16J3
1932i8R9J55k30K22j00k07J81J44R3n28J08K16o3m9l8K81l14K10k87K03K5J37
1954A60M7n9l31Q1K22j33k79J57L78l79J76M4m31K56k50N3J39J46j9j02J3K44
1976A33%M0m04P1N1K01j90N31l52k0j08L79l06K6j72l21N11l97L69q7j60L54k29
1999h0q6L04k62l42K99j12L20n1P2K02k60JP3R7k94L59q4k6n8j60K50j20O1k60
2023a57J71j59J59Q1poL0l26J37J45K37n01K98k53Q1j64M64k70K05k42L8j71K18
$$ plain form
2046 8 20 -69 -180 63 97 3 159 -69 40 184 17 -284 100 -126 324 35 -166 49 -18 -5 37 262 -373
2069 -373 148 71 -128 392 -221 160 -126 -156 -36 203 -41 161 3 123 -131 53 146 333 -143 -305 44
2090 44 88 214 -4 -33 355 -218 -5 -39 -325 -4 -172 141 26 73 -111 -120 196 20 -67 17 -61 -367 -110
2113 -110 178 443 -88 -80 5 99 -176 -59 60 -226 2 -173 90 255 -1 108 173 -62 -140 118 76 297
2135 297 -5 36 100 -117 34 -224 -27 103 46 -61 -246 157 35 29 198 -102 -156 345 -97 -197 -118 314
2157 314 -239 -47 199 -64 471 24 46 -132 -59 -181 24 185 357 256 -104 107 229 233 73 13 -276 86
2179 86 0 73 -41 -147 147 23 91 19 262 -90 -20 101 -148 246 -46 95 88 -80 -234 95 -246 -19 26
2202 26 34 22 -91 -298 -226 110 -71 -63 -53 -20 55 -50 80 -155 -120 59 -117 -19 -141 165 47 40 -186 -20 112
$$ packed form
2046HJ2q9j11K43L4r4J56k28J09J44j67l01L84k26M50k89k01K15o7J3M2K25o35
2069c73N21p7j99N20o13L81k86l0J20K39k44K02j58J20k54J84R3J87m76j62L49
2090D4M4J26k18k9L88n73K13l4k86L21j68L13j15M7j84rL16j76q7Q4p8l06K57
2113a10K88K65n31QQ5R4k75J17J19k86K28j75K63J65k56J09O5k35p8K58m2K21
2135B97l02M1O4k17J51k58J97J30n7j07j85M03j22oJ69l00n4N01m42j00P9M32
2157C14n53J92K46k63N35m47K2j78P3j22K05J61J72j01l60K11J22Mj60o0k89L62
2179H6q6P3j14j06K94j24O8p2K43l52P0J21k49L94k92J41pj68j54L29l41K27M5
2202B6Qj2j13k07P2L36j81QJ0L3P5j05J30k35L5J79j76R8j22L06j18pk26J66J32
$$ plain form
2227 112 -13 -16 -44 -107 34 63 86 -271 -36 -277 -14 -36 160 -26 -177 -406 394 -94 -60 -211 -89 10 -266
2250 -266 11 198 80 216 80 96 475 83 25 -169 -112 -43 234 90 -356 -169 132 252 335 -59 19 6
2272 6 63 -57 -549 83 -250 -91 -241 115 -230 -338 -114 -84 -202 -142 -1 -184 -45 -262 108 125 158 -265
2294 -265 -158 3 165 -242 -154 192 -233 -360 21 218 -55 -126 25 -146 -27 -25 112 -195 18 252 212 265
2316 265 184 -200 -5 -66 -32 -41 -265 10 37 -37 207 -103 138 -84 70 -74 -116 -208 94 -178 49 332 105
2339 105 -111 161 -159 142 -62 265 83 -137 72 -100 -390 -154 -424 33 101 -188 -148 246 -126 -139 203
2360 203 37 246 -106 529 155 -213 46 176 113 -99 -31 -134 -43 185 4 145 118 -387 59 -38 -116 143
2382 143 60 -236 66 -297 207 -248 -63 15 5 162 -126 158 41 135 31 153 27 -77 -34 195 -3 -51
$$ packed form
2227A12j25lk8o3J41K9K3l57K35k41K63k2J96j86j51k29Q00m88L4j51J22R9k76
2250b66K77J87j18J36j36J6L79l92n8j94N7O9K77j44m46J87L01J20Q3l94P8j3
2272FN7j20m92O32l33J59j50L56l45j08K24L0j18O0J41j83J39k17L70J7L3m23
2294b65J07J61J62m07Q8L46m25j27L81J97k73p1J51j71J19KJ37l07K13K34m0N3
2316B65q1l84J95o1L4rk24K75K7p4K44l10K41k22J54j44m2r2L02k72K27K83k27
2339A05k16K72l20L01k04L27j82k20K09j72k90K36k70M57O8k89M0L94l72j3L42
2360B03j66K09l52O35l74l68K59J30o3k12O8j03R1K28j81J41k7n05M46r7p8K59
2382A43q3k96L02l63N04m55J85P8j0J57k88K84j17R4j04J22j26j04M3K29j98m8
$$ plain form
2404 -51 67 269 450 -116 -582 -55 100 -40 -366 -70 369 32 -297 184 -6 247 -181 -37 -249 102
2424 102 222 3 -46 -280 -27 -183 229 -13 136 -64 145 -314 50 115 434 -187 -68 -29 49 -25 128 -69
2446 -69 301 260 -155 227 -89 221 202 44 -173 220 -3 -51 36 -53 27 146 -356 59 -298 197 -113 393
2468 393 294 -48 -24 -55 -128 -97 23 -41 -90 74 90 -293 62 221 -10 -198 -156 -76 164 -223 -11 254 146
2491 146 110 383 -20 89 90 45 348 221 117 164 193 204 -4 37 214 -44 242 44 -186 71 245 160 197
2514 197 -45 -302 249 -126 83 -419 113 -42 -215 -59 -85 75 -70 85 303 -71 -344 48 -239 -201 10
2535 10 -19 77 56 56 -163 267 80 76 -150 -1 -12 348 -224 -63 -25 -204 269 -139 -34 32 72 286 94 -37
2559 -37 -39 -384 -121 -70 205 133 -183 -55 -291 314 24 -157 161 -184 -6 75 13 178 101 -292 71 -246 -82
$$ packed form
2404e1J18K02J81n66m66N27J55j40l26K96M39l37l29M81j90K53m28J44k12L51
2424A02J20k19m9k34K53j56M12k42J49k00K09m59L64O5L19o21J19L9P8p4J53j97
2446f9L70m1m15L82l16L10j9j58k17L93k23m8Q7q9Q0J19n02M15l57M95l10N06
2468C93r9l42K4l1p3L1J20o4m9J64J6l83L55J59k31j88M2Q0K40l87K12K65j08
2491A46l6K73m03J09Jm5L03j27j04M7K9J1k08M1J77k58K86j98k30K57J74q5L7
2514A97k42k57N51l75K09n02N32j55j73J56k6J60j45J55K18l74k73L92k87L8K11
2535A0k9R6k1%k19M30j87mk26J49j1L60n72J61L8j79M73m08J05O6M0K14j92j31
2559c7kl45K63N1K75p2l16J28k36O05k90j81L18l45J78Q1o2J65p7l93L63l17J64
$$ plain form
2582 -82 233 -190 -122 25 101 181 120 -29 157 -124 -4 61 87 233 -76 -121 -138 -169 295 38 -52 -232 -30 143
2606 143 -242 -92 -19 -435 233 68 -8 152 -36 96 -70 2 162 -336 -4 -109 -108 35 -20 -111 -188 331 6
2629 6 -2 99 355 -250 -185 119 -144 -121 5 326 -65 -4 -79 -112 -264 7 370 210 -128 55 208 -71 31
2652 31 -103 -84 27 -4 16 -89 -121 70 -2 -19 -44 -149 214 129 0 -112 268 106 -500 161 -46 -102 -29 -239
2676 -239 -79 -63 227 -85 165 -177 178 134 329 206 -223 105 -122 163 83 -275 -44 -488 -328 253 -161
2697 -161 174 -136 34 -46 10 -182 -56 164 203 36 -106 -342 30 334 -110 53 254 -148 6 -88 4 109
2719 109 184 396 -166 -156 68 550 -64 -228 -312 188 -216 -166 -160 -235 -325 96 -287 -52 172 45 -316 13 -184
2742 -184 -181 -163 -146 38 -117 222 -11 113 -91 203 87 195 -44 225 -47 -57 88 -32 -165 125 -329 -203
$$ packed form
2582h2L15m23O8J47P6Q0o1j49J86k81J20O5K6J46l09m5j7l1M64k57r0j80K02J73
2606A43l85J50P3m16O68j65p6J60j88J32j66P2J60m98L32j05JJ43n5r1p7N19l25
2629FqJ01K56o05O5L04k63K3J26L21l91O1p5l3j52K71L63j60l38J83J53k79J02
2652C1j34J9J11l1K0j05l2J91p2j7k5j05L63q5j29j12L80j62o06O61k07n6P3k10
2676b39J60J6K90l12K50l42L55m4J95j23m29L28k27K85q0l58K31m44J60N81m14
2697a61L35l10J70q0N6j92J26K20L9j67j42k36L72L04m44J63K01m02J54r4R2J05
2719A09P5K12n62J0K24M82o14j64q4N00m04N0Op5r0M21l83K35K24j27l61L29j97
2742a84LJ8J7J84j55L39k33J24k04K94j16J08k39K69k72j0J45j20j33K90m54J26
$$ plain form
2764 -203 -94 219 -284 -62 52 -188 -165 -202 129 48 -84 184 -117 -519 74 -67 157 80 -7 113 85 -55
2786 -55 109 165 -145 -261 -128 120 155 -158 128 -175 -257 99 69 96 -91 -25 -87 -20 -86 54 -18 -239 -67 198
2810 198 -25 72 181 46 6 308 -62 229 -147 -43 -100 -294 41 181 162 -389 120 -227 -34 52 -84 -122
2832 -122 -111 6 318 39 115 34 -146 47 -80 66 -53 -137 73 -64 -282 -267 -66 -153 131 -8 -117 -31
2854 -31 18 188 13 165 -60 74 104 -129 196 -124 147 239 -107 -83 -125 49 -120 221 66 -125 83 -225
2876 -225 -76 186 -97 -86 -206 9 18 355 8 -115 142 -181 163 136 -254 -206 -99 54 82 5 -182 34
2898 34 -111 -398 -108 -13 158 116 164 605 -70 -49 258 -547 83 169 -48 -257 -327 -79 43 -6 -181 -341 218
2921 218 278 -43 -152 -251 151 344 -19 99 -248 60 -469 -103 -163 159 228 -67 3 -222 154 -112 143 89
$$ packed form
2764b03J09L13n03K22J14k40K3l7L31q1j32K68l01m02N93j41K24p7q7J20k8j40
2786e5J64N6l10j16J33K48L5l13K86l03q2L56l0K7j87O6o2O7o6J40p2k21J72K65
2810A98k23R7J09j35m0L02l70K91l76J04n7j94L35J40j9n51N09l47J93Q6j36l8
2832a22J1J17L12k79P6q1j80J93j27J46j19q4K10j37k18J5K01q7K84j39j09Q6
2854c1M9J70j75J52k25J34L0k33L25l20K71R2l46K4m2J74j69L41j55j91K08l08
2876b25J49K62k83J1j20K15RL37l47j23K57l23L44k7l90M8J07J53K8p7j87K16
2898C4j45k87K90R5J71m2M8M41o75K1L07q05O30Q6k17k09p0K48J22m9j75j60N59
2921B18O0l21j09r9M02J93l63J18l47L08n29L66o0L22O9k95P0k25L76k66K55n4
$$ plain form
2943 89 -120 -171 -47 -240 -198 267 -37 -75 26 -42 73 -227 -146 81 -265 39 47 -189 -12 -117 39 -25 252
2966 252 50 20 -248 -75 -250 224 -27 -173 -33 150 -327 -32 91 -181 -22 -42 112 -174 -425 -11 -213
2987 -213 -9 96 110 -183 141 -13 8 -14 -31 -94 -220 124 -178 -372 19 212 287 56 374 -222 -369 70
3009 70 -117 -13 -23 -9 164 -59 5 -168 226 35 -357 -167 -211 73 -305 -21 -215 31 -33 -63 176 123 117
3032 117 -40 -155 -61 -100 93 -58 84 19 338 -51 11 -328 -105 23 147 252 -36 -229 -99 -79 64 -74
3054 -74 -112 -9 -172 40 164 -78 -58 -303 54 116 40 124 -118 -169 200 -86 104 -5 -309 61 -78 165
3076 165 -162 -11 -10 -400 -185 100 -177 176 -245 169 321 238 27 -87 -92 -114 48 -68 152 26 -172 -72
3098 -72 303 257 196 185 -8 -65 422 -122 130 1 -89 147 36 38 113 183 81 176 -67 -86 -1 95 -116 -10 -135
$$ packed form
2943H9k09n1J24j93M2M65l04l8J01o8J15l00Q1K27l46L04Qk36J77j05J56o4K77
2966B52k02l0k68J73j75M74k51j46J40J83m77K95J23k72J59k0J54k86k51M14k02
2987b13K04J05J4k93L24j54K1k2j7o3j26L44l02j94L91J93P5k31L18n96j47M39
3009G0j87J04j0J4J73k23O4j73L94j91l92J90m4K84l78K84j94K46o4l0K39n3o
3032A17j57j15R4l9J93j51J42o5L19l89O2l39K23J28J24J05k88j93J30K0J43j38
3054g4l8J03j63K12J24k42K0k45L57O2p6Q4k42n1L69k86J90j09l04L70j39K43
3076A65l27J51Jl90K15K85k77L53m21M14J52q3k11j14nk2J62j16K20j26j98J00
3098g2L75m6o1j1j93n7M87n44K52j29r0K36j11KP5P0j02R5k43j9Q5R6k11J06j25
$$ plain form
3123 -135 44 102 253 -133 -164 131 -113 3 183 -55 356 1 -51 -23 145 -38 -151 55 135 -194 136 -90
3145 -90 -222 97 9 75 44 97 154 370 -120 263 -157 -6 -104 -90 -69 161 250 -163 -169 -27 -140 81 136 265
3169 265 -123 -115 -211 -120 172 105 -39 -38 174 14 -162 -257 -106 -141 140 166 -278 88 38 97 39 342 40 74 -18
3194 -18 -46 104 -138 178 -322 21 -16 -83 -194 118 -114 173 135 -105 -103 -98 -184 -97 120 2 211 377 -95 -33
3218 -33 185 -30 -421 -150 -81 -17 264 35 125 28 -123 -345 -197 248 -175 3 -32 59 9 324 -178 65 -11
3241 -11 -56 99 -285 23 -422 19 214 6 -132 -384 -262 183 -120 199 107 -250 17 -16 -173 203 35
3262 35 123 -133 -24 121 -33 254 -98 197 -91 125 -123 -147 111 -129 42 -31 53 -158 29 -221 230 -4
3284 -4 -191 -415 380 -161 174 -456 -218 -30 -66 25 -191 18 105 280 -124 147 -131 -153 230 -61 240 328
$$ packed form
3123a35J79N8J51l86l1K95k44J16J80k38M11l55n2K8J68j83j13K06Q0l29L30k26
3145i0j32L19q8O6l1N3N7K16m90L83m20J51r8J4K1K30Q9m13oJ42j13K21N5J29
3169B65l88Qr6R1K92o7j44JK12j60j76r5J51l5K81K6m44L66n0N9n8L03l02L4r2
3194a8k8J50k42L16n00L43l7o7j11L12k32K87l8k40KNq6Q7K17j18K09J66m72O2
3218c3K18k15l91K71O9O4K81k29R0r7j51k22J48M45m23J78l5R1n0L15n02K43p6
3241a1m5J55l84L08m45M41J95k08j38k52J22M45l03L19r2l57K67l3j57L76j68
3262C5Q8k56J09J45j54K87l52K95k88K16k48k4K58k40J71p3Q4k11J87k50M51k34
3284dj87k24P95n41L35o30K38J88l6R1k16K09Q7J75m04K71k78k2L83k91L01Q8
$$ plain form
3306 328 64 -187 20 -17 -138 254 -146 -21 -135 -97 -76 96 -74 31 -221 -170 -53 -177 300 331 173 249
3328 249 -96 -116 -118 12 -121 -123 58 -87 153 169 -63 4 -117 -167 -111 -94 -97 -210 36 19 -153 67 75 144 -146
3353 -146 131 153 -127 251 83 -74 103 283 -138 64 -8 -45 127 160 -351 24 3 327 140 87 48 -309
3375 -309 -269 17 13 -167 58 -161 -160 -354 -65 149 190 -27 -148 147 61 30 -44 -35 34 67 -90 -404 63 -74
3399 -74 -96 -73 -37 66 276 242 60 -20 116 -56 -64 530 -74 174 74 375 226 -124 -3 -143 219 47 6
3422 6 153 -11 182 -112 -2 162 -125 -293 84 86 -83 220 45 143 -13 -35 -160 -9 -30 -344 -31 6 -144
3445 -144 -111 3 -111 -57 -319 78 78 36 -125 -16 214 139 102 142 -39 238 174 72 -116 -147 335 189 237 170
3469 170 -246 -74 98 43 -148 -134 -356 -121 155 180 -300 58 -241 38 261 -18 100 174 -51 75 -240
$$ packed form
3306C28k64k51K07l7j21L92m00J25j14L8K1J72j70J05k52N1J17j24M77L1j58P6
3328B49l45k0kJ30j33kJ81j45K40J6k32O7j21n0N6J7lj13K46j7j72K20QO9k90
3353a46K77K2k80L78j68j57J77J80m21K02p2l7J72L3n11L75k1L24j87n3l9l57
3375c09M0K86mj80K25k19Jj94K89K14M1k17j21K95q6l1p4RO9L3j57l14M67j37
3399g4k2K3L6J03K10l4j82q0J36j72qN94o04K48j00L01j49l50J21j40L62j72m1
3422FJ47j64J93k94J10J64k87j68L77Kj69L03j75R8j56k2j25J51k1l14L13L7j50
3445a44L3J14j14N4k62L97%m2j61J09K30p5l7M0j81K77o4j02j88l1M82j46M8o7
3469A70m16J72J72n5j91J4k22K35K76K5m80L58k99K79K23k79J18P4k25J26l15
$$ plain form
3490 -240 -288 -18 -298 -156 -80 -66 236 45 -119 47 -284 80 112 -62 43 14 159 78 -48 -21 -68 -192 70
3513 70 25 281 117 184 -121 -199 469 156 -127 157 173 -18 -188 -138 259 50 -252 -69 -196 -204 -100 66 98
3536 98 -140 160 94 32 77 -114 34 -435 -337 367 -66 -326 -79 -95 -115 7 273 -80 -345 -14 291 252 95
3559 95 77 13 22 157 -139 -123 54 -73 -241 87 -327 314 -3 46 99 -153 285 172 113 -303 -55 138 29
3582 29 228 187 -119 96 -16 -193 -15 81 -63 146 1 399 20 -299 -240 -198 -55 32 -136 -106 -132 -75 23
3605 23 46 321 344 50 -48 125 -80 -59 27 246 320 -68 -3 157 24 259 123 230 27 -167 197 -237 -204
3628 -204 15 -103 -164 125 -8 -28 -122 -97 36 100 -155 186 68 78 170 -139 -88 -65 -355 -7 85 147 42 3
3652 3 96 -92 -192 255 154 -445 -38 -21 -161 -295 -43 -82 -117 -22 -265 339 -80 278 92 -241 30 230
$$ packed form
3490b40m8K70k80J42P6J4L02j91j64J66l31L64L2j74J05k9J45q1j26K7m7j24K62
3513G0m5K56j64O7l05p8O68l13k83K84J6j91j70N0L97k09l02J83j27qJ04J66L2
3536I8k38L00o6o2M5j91J48m69R8P04m33k60K47j6k0J22K66l53k65L31L05l9j57
3559I5j8o4RJ35k96J6J77j27j68L28m14O41l17M9N3k52M38j13n9m16K48J93j09
3582B9J99m1l06K15j12j77J78R6j44K09j45L98l79l19N9M2J43Q7j68L0k6N7R8
3605B3K3K75K3k94r8J73k05K1Q6K19P4l88O5J60j33K35j36J07k03j94L64m34L3
3628b04K19j18o1K89j33k0r4K5J33O4k55L41j18J0R2l09N1K3k90L48R2O2j05l9
3652CR3j88j00M47j01n99M07J7j40j34K52l9l5R5k43O04m19L58j86l33K71K00
$$ plain form
3674 230 144 -119 -213 78 -155 -207 212 -119 -167 136 303 -391 -91 -87 -147 -53 189 -217 83 -126 368 -308 95
3697 95 17 -95 136 -88 -232 8 124 -82 89 350 -108 -165 -71 -319 -15 -81 -322 111 21 490 -240 -238 209
3720 209 -55 -375 -107 -21 -338 -89 171 -63 -47 9 -45 -102 -104 261 -211 -37 281 -77 16 -438 -153 153 185
3743 185 -24 260 -18 56 171 -80 -37 -16 173 16 -152 -221 198 62 -21 162 41 163 -200 344 -105 -293
3765 -293 -92 -268 -23 133 -250 -42 -137 186 292 -197 -112 -125 -181 -230 325 53 -8 -57 224 8 -39 -27 -57
3788 -57 -32 77 -101 192 -161 -57 2 -222 -159 -18 -173 -222 -2 29 171 151 -218 345 15 -37 -2 -124 -21
3811 -21 -150 -73 73 30 132 -16 5 -197 107 -76 -15 220 9 230 102 83 187 -100 174 424 -124 59
3833 59 134 -17 4 201 -191 -138 -26 -469 190 -142 -94 -335 -27 -128 -50 -248 141 20 -43 120 11 -251
$$ packed form
3674B30q6k63r4K91k33n2M19l31m8L03J67o94L00Mo0R4K42m06L00k09M94o76M03
3697I5p8j12K31k24j44K40J16k06J71K61m58n7R4k48L04o6k41M33r0M69p30KM47
3720B09k64l20K68Q6l17K49K60k34J6N6n4n7kL65m72J74L18l58R3m54K85L06L2
3743A85k09K84k78P4J15k51M3K1J89j57j68o9M19j36q3J83j21J22l63N44m49j88
3765b93K01j76K45J56l83K08r5L23J06m89Q5j3n6m9N55k72o1m9K81k16m7J2l0
3788e7K5J09j78K93l53J04N9k24O3J41j55m9K20L1J42k0l69N63l30n2L5j22J03
3811b1j29P7J46m3J02j48K1k02L04j83O1K35k11K21j28j9J04k87K74K50n48J83
3833E9P5j51K1J97l92N3J12m43O59l32M8k41L08j01P8j98L89j21o3J63j09k62
$$ plain form
3855 -251 -255 51 3 91 -87 157 -20 25 86 205 232 292 329 -14 -53 80 57 -337 -181 72 -149 -101 62 59 -278
3880 -278 99 279 -281 -33 -4 -104 -148 -87 186 -108 178 -308 160 40 -59 -20 -150 -79 177 68 -172 108
3902 108 -132 87 -204 -50 143 -2 -45 -71 -162 -131 -96 12 -276 -36 -416 226 -28 117 177 -275 233 -19
3924 -19 -146 87 -32 24 -15 313 115 -353 124 -44 -99 12 -72 -260 -72 84 -182 44 -258 63 -58 -209
3946 -209 114 -92 32 331 94 -298 141 60 -32 -236 -132 2 324 41 333 -241 72 -155 10 186 248
3967 248 -224 -217 88 208 223 78 -34 -241 -27 -42 103 15 -286 -437 -158 81 -217 -10 -148 -92 210 205 -195
3990 -195 -25 -170 124 187 266 -65 105 98 19 9 215 -81 127 131 9 219 62 181 -85 -173 93 -10 146
4013 146 -95 -155 27 164 -166 -36 122 -530 -47 82 68 -42 -34 151 121 -46 264 26 210 -12 -36 348
$$ packed form
3855b51mL06m8Q8j78K44j77M5O1J19K7O0L7l43l9J33k3l94J56K53k21M8J63ll37
3880b78L77J80n60K48K9j00m4O1K73k94K86m86M68j20r9L9j30P1K56j09k40K80
3902A08k40K19k91J54J93j45m3k6r1L1L5J08k88K40l80O42k54J45O0m52N08k52
3924a9j27K33j19N6l9L28j98m68M77j68n5J11q4j88J88J56k66K26l02L21j21j51
3946b09L23k06J24K99k37l92M39q1r2k04J04J34L22k83K92n74L13k27J65J76O2
3967B48m72PL05J20J5j45j12k07K14j5J45q8l01j51K79K39k98K07j38N6L02nm00
3990a95J70j45K94O3P9l31J70pp9j0K06k96K08Mj22K10j57J19k66q8K66j03J56
4013A46k41o0J82J37l30J30J58o52M83J29j4j10QJ85l0j67L10k38J84k22k4L84
$$ plain form
4035 348 55 99 108 -192 -138 -147 -84 -105 83 151 -127 -69 337 -67 -87 252 -69 152 35 27 -110 1 -178 50
4059 50 -136 -187 123 247 283 287 -83 -151 69 -557 -12 134 154 -42 -138 159 226 267 19 -218 12 139 131 -240
4083 -240 -185 74 -45 -111 -270 -154 335 213 191 110 -201 251 7 -124 -39 -78 -41 -245 -323 -17 39 167 207
4106 207 -185 -125 55 -522 -72 121 -96 -54 32 187 105 -69 -214 -215 -131 152 54 32 7 119 -171 -267 63 61
4130 61 105 -400 81 160 132 -26 106 -165 -179 -54 173 -333 146 232 -309 -171 13 -130 176 18 72 -64
4152 -64 -95 -7 -110 -245 60 -125 20 78 247 -39 -83 -91 -317 -163 185 39 113 188 -12 284 -143 -222 -206 -112
4176 -112 134 -134 -169 41 124 -23 3 122 -154 525 46 -73 -137 81 91 -243 108 -37 -86 -155 -167 -190 52
4199 52 12 -178 -187 -45 212 22 189 -2 -329 22 17 -12 14 31 156 -8 -30 77 -49 14 -44 -40 -260 -85 163
$$ packed form
4035C48k93M4Rl00N4rO3k1J88O8k78N8M06m04k0L39l21K21j17qj37J11j79K28
4059E0j86n1L10J24L6Ml70o8K20o26N45J46K0j96r6K97O7M1k48k37K30J27ql71
4083b40N5K59j19o6j59J16M89j22k2q1l11M52k44j31Q5l9L7k04p8L06N6J28M0
4106B07l92O0J80n77M50J93k17M2Q6J55q2j74j45jQ4K83r8k2k5J12k90r6L30k
4130F1M4n05M81P9k8j58J32k71j4J25K27n06M79Q6n41J38J84j43L06j58N4j36
4152f4l1Q8j03j35L05j85J45N8J69k86m4qk26J54L48j46P4P5k00K96m27p9J6R4
4176a12K46k68l5K10Q3j47K6J19k76O79m79j19o4K18J0l34L51j45m9o9j2k3K42
4199E2m0j90rJ42K57j90J67j91l27L51nk9K6J7J25j64k2J07j26O3n8Mk20J75K48
$$ plain form
4224 163 -14 -99 225 207 136 111 -189 -95 -54 72 152 -259 -50 192 -49 -534 142 -326 -52 329 -38 81
4246 81 48 -198 -218 163 83 -271 -136 -133 27 -140 193 -46 -351 -328 -50 85 89 -33 30 16 93 165 -227 41
4270 41 -315 21 -16 -103 171 -90 41 -253 87 158 78 -150 266 -87 -46 22 -181 -144 -31 54 -58 84 -142
4293 -142 -131 -156 68 -120 296 7 -95 -18 129 -411 52 104 216 25 68 103 -16 46 -227 -16 116 -207
4315 -207 -448 -196 -60 -195 76 103 -206 11 -126 -139 249 216 33 52 -84 -41 39 65 -233 -20 35 27 -1 416
4339 416 -49 -33 -141 -63 141 -154 183 -183 167 221 -388 126 -234 126 -321 -167 262 -6 -20 124 119 -210
4361 -210 -15 54 41 -142 25 91 3 100 187 245 199 146 64 -13 282 -202 43 -209 98 4 -137 -66 -184 -153 51
4386 51 15 176 -94 -149 3 17 101 44 0 47 -342 120 128 -250 116 -54 82 -8 49 -51 52 -209 77 124
$$ packed form
4224A63j77q5L24j8p1k5l00R4M1J26Q0m11K09K42k41m85O76m68K74L81l67J19
4246H1l3k46k0L81q0l54J35LJ60j67L33k39l05K3K78J35Mj22O3j4P7P2l92K68
4270D1l56L36l7q7K74k61J31k94L40P1q0k28M16l53M1O8k03L7J13Q5j12J42k26
4293a42J1k5K24j88M16k89j02P7J47n40M63N2J12j91M3L5j19O2k73K11J32l23
4315b07k41K52J36j35K71K7l09K17j37j3L88l3j83J9j36M3Q0K6k98K13N5qk8M17
4339D16m65J6j08P8K04k95L37l66L50N4o09N14l60L60m47J54M29k68j4J44nl29
4361b10J95O9j3j83J67O6q8R7Q7N8m6n3q2p7K95m84K45k52L07r4j41P1j18L1K04
4386E1l6J61k70n5J52J4Q4n7m4M7l89M62Ql78L66j70J36r0N7j00J03k61K86M7
$$ plain form
4410 124 313 -247 163 -58 -59 -19 -183 -83 0 -87 -94 -49 -18 60 56 339 281 -72 92 94 -131 -5 -81 179 -163
4435 -163 203 25 -1 274 -80 379 -67 178 74 -106 -72 -64 -254 148 226 -104 138 -85 81 108 103 204 -26
4458 -26 52 -225 -113 -22 132 -100 113 19 256 -243 -57 137 158 -267 114 -78 375 -6 -72 36 -58 78
4480 78 -240 -12 -110 622 -92 -257 308 -37 105 -68 -237 108 149 26 158 -289 365 21 -38 138 -95
4501 -95 -30 143 -3 -198 -218 -51 -105 200 319 -237 -113 58 203 308 -84 -261 -138 -110 88 162 -29 -26 160
4524 160 -114 -46 -9 -161 43 -12 -39 -86 -25 -94 -124 -369 -189 -152 -104 11 -105 43 145 -317 538 -167 -152 -273
4548 -273 41 20 -102 -340 -201 -12 -87 278 -125 -335 11 152 260 113 243 -14 -151 76 -566 -391 166
4569 166 34 -80 -235 -221 -181 -136 123 -24 249 48 -189 -441 -91 -281 151 -143 -66 11 75 97 -76 203
$$ packed form
4410A24J89n60M10k21jM0j64J00Q3q7pM5L1P8mK83n8l53J64Kk25J26p6K60l42
4435a63L66j78k6K75l54M59m46K45j04j80L4Qj90M02P8l30K42k23J66K7nJ01k30
4458b6P8k77J12R1J54k32K13r4K37m99J86J94K1m25L81j92M53l81o6J08r4J36
4480G8l18K28r8P32p14j65N65l45J42j73j69L45M1j23J32m47O54l44n9J76k33
4501i5O5J73j46j95k0J67n4L05J19n56J24J71J45J05l92j77J23K8J98P4j91LJ86
4524A60k74O8L7j52K04n5k7m7O1o9l0k45J80L7M8J15j16J48J02m62Q55p05J5j21
4548b73L14k1j22k38J39J89p5L65m03k10L46J41J08j47J30k57j37K27o42J75N57
4569A66j32j14j55J4M0M5K59j47K73k01k37k52L50j90M32k94P7P7O4K2j73K79
$$ plain form
4591 203 223 -103 110 307 -87 302 -63 -127 -107 88 29 -99 -246 74 103 1 158 164 41 -306 264 -219
4613 -219 95 243 -220 -483 36 31 20 -171 -122 -33 -123 72 -75 81 60 -14 -164 -398 -62 -11 115 -17 122
4636 122 315 -46 206 20 0 164 71 -11 142 -396 -70 -116 -4 152 -87 -55 -306 -44 318 48 -118 166
4658 166 -30 76 26 -164 -200 -97 270 -171 305 -103 5 -64 -79 -28 297 60 136 208 56 193 60 -367
4680 -367 -245 -208 -132 -284 -516 126 -11 -72 -16 9 167 -173 57 451 0 -130 70 23 -89 -119 -22 39 -108
4703 -108 -77 203 -103 -92 18 527 84 -57 39 -331 272 -178 -181 -7 -133 -78 121 -105 -52 393 287 -58
4725 -58 -148 3 -203 -78 265 21 -46 -300 4 -33 -64 79 261 253 -32 120 62 154 296 -14 -107 262 166 16
4749 16 -15 -13 67 -114 107 103 78 354 254 164 127 130 -368 -312 16 108 -94 57 -55 -123 2 -143 -279 -279 -151 245
$$ packed form
4591B03K0l26K13J97l94L89l65o4K0J95n9j28j47L20K9j02J57Oj23l47N70m83
4613b19L14J48m63k63N19nj1j91M9Q9r0J95j47J56k1p4j50k34L36N1J26j32J39
4636A22J93l61K52j86k0J64r3q2J53n38L26m6J12J56k39L2k51K62L62k70j66K84
4658A66j96J06n0j90l6J03L67m41M76m08J08o9j5N1L25k37P6P2j52J37j33m27
4680c67J22L7P6j52k32O42j37o1N6K5J58l40K30L94m51j30K00m7j12l0R7O1j47
4703a08L1K80l06J1J10N09m43j41R6l70O03m50lJ74j26N5J99k26N3M45j06l45
4725e8r0J51k06J25L43k44o7k54L04l7l1J43J82qk85J52n8R2J42l10r3L69r6j50
4749A6l1KQ0j81K21mk5K76j00r0l7Lm98N6L28R2k02J51j12o8J25j45j36%J28L96
$$ plain form
4775 245 61 -143 -64 -130 -114 133 -30 -183 201 -67 55 154 -45 100 10 -342 -55 -45 65 -202 -6 104
4797 104 174 -90 -18 180 -103 179 -66 214 141 106 -84 -214 -126 127 227 -50 -48 153 147 -40 -172 99 155
4820 155 29 181 -93 234 41 203 39 -201 113 -130 -219 99 91 60 -151 -195 -22 311 91 147 -3 -141
4842 -141 128 240 193 14 177 -125 7 139 -310 69 14 -61 -55 90 -131 -13 53 2 -103 -8 -59 -170 -35
4865 -35 64 -3 -362 54 28 291 87 92 254 0 123 -66 -55 -64 92 -4 146 -187 -52 -275 -14 199 -226
4888 -226 -341 -113 64 10 -174 11 126 -54 105 -209 122 224 -75 -281 -80 290 -177 51 180 -54
4908 -54 249 -204 241 277 -50 -66 70 -183 31 0 143 -111 182 204 283 258 -48 -106 -86 376 -117 57 -312
4931 -312 -140 -279 32 -249 -127 7 244 185 -97 -304 -230 166 4 -76 122 -82 -202 166 -370 -236 88
$$ packed form
4775B45j84k04P9o6J6K47j63j53L84k68J22R9j99J45r0l52K87J0J10k67J96J10
4797A04P0k64P2J98k83K82k45K80p3l5j90j30Q8K53J00k77KK01oj87j32K71N6
4820A55j26J52k74L27j93J62j64k40L14k43q9L18ql1k11m4J73L33k20N6j50j38
4842a41K69J12m7j79J63l02J32J32m49L79n5p5OJ45k21J18O6n1j05R5n1j11J35
4865c5R9o7l59M16k6K63k04NJ62k54J23j89J1rJ56r6J50l33J35k23K61K13m25
4888b26j15K28J77n4j84J85J15j80J59l14L31J02k99k06K01L70m67K28J29k34
4908e4L03m53M45L6l27j6J36k53K14l1J43k54K93K2P9k5l06n8K0M62m93J74l69
4931c12J72j39L11k81J22J34K37n9k82k07P4L96j62q0J98k04j20L68n36J34L24
$$ plain form
4952 88 -302 -210 -40 -233 -155 -220 239 121 183 164 194 -88 -162 228 -41 287 -263 280 381 -146 75 9 98
4975 98 392 292 18 -67 130 64 87 67 172 17 -170 89 -108 -51 -240 -168 -120 -58 -262 -263 13 -82 -143 390
4999 390 274 -105 56 106 -39 -237 77 208 -374 5 305 -247 97 -43 -201 -25 81 -252 65 -18 106
5020 106 7 -126 86 314 -43 77 -12 5 10 38 -80 91 228 -141 -42 -33 124 21 -49 279 -114 20 -118
5043 -118 -233 117 -216 -240 65 139 33 346 158 1 143 13 158 -70 -130 335 -3 76 33 -31 -293 12
5065 12 -421 293 99 -124 105 -101 -443 230 -94 -183 -83 12 19 -188 289 63 -35 -42 32 -119 251 142 -106
5088 -106 0 115 -110 -2 -191 226 -26 72 -29 207 48 45 -107 -105 -23 -26 -24 -52 -85 157 -10 -216 -63 57
5112 57 205 -19 -118 -51 -2 -146 -25 317 -227 -15 -67 -61 269 -167 342 -34 190 11 -5 -12 -125 -118 11 -5
$$ packed form
4952H8l90R2J70j93P8o5M59j18O2j9L0k82p4L90k69L28n50N43J01n27K21o6Q9
4975I8K94j00k74q5J97o6K3k0J05j55j87K59j97N7j89P2M8O2k04jK76r5o1N33
4999C90j16l79J61N0j45j98L14J31n82L79L00n52L44j40j58J76J06l33L17q3J24
5020A06r9j33K12K28l57J20q9J7NK8j18J71J37l69R9RJ57j03p0L28l93J34j38
5043a18j15L50l33k4L05P4j06L13j88j57J42j30J45k28o0M65l38P9m3o4k62L05
5065A2m33P14j94k23K29k06l42O73l24q9J00R5Pk07M77k26r8pP4j51L70j09k48
5088a06J06J15k25J08j89M17k52R8j01K36j59lj52KQ2lKk8l3K42j67k06J53J20
5112E7J48k24r9O7M9j44J21L42n44K12n2OL30m36N09l76K24j79j6pj13PJ29j6
$$ plain form
5136 -5 -74 216 178 95 -169 194 -104 235 118 3 149 93 192 75 254 172 -58 -204 113 -326 -143 163 -49
5159 -49 -36 225 -79 -112 -182 -19 155 -273 176 -320 276 306 204 161 185 -57 64 12 -40 -240 66 11 -188
5182 -188 -280 155 105 -77 22 110 175 168 -105 -43 98 24 93 -87 -148 -105 94 -270 130 53 67 52 -117 -94 270
5207 270 245 -90 26 3 175 -135 313 204 64 348 132 -82 164 -133 48 -302 166 82 0 56 194 370
5229 370 -17 -70 36 -191 253 276 108 -109 -52 118 207 59 -122 -46 -86 -135 192 -92 -244 115 189 -148 -59
5252 -59 -182 121 47 73 -67 189 -188 -33 42 -47 -9 -67 -188 61 -49 -1 -19 265 -192 145 -6 121 132
5275 132 -82 -44 -45 51 20 185 59 -343 -43 4 -154 70 -12 89 216 -11 42 47 -36 11 197 41 -128 148
5299 148 -9 202 -52 -135 184 -26 -164 -120 -45 69 331 65 34 -106 150 -193 -259 28 -226 50 -73 -102
$$ packed form
5136eo9K90l8q3k64L63k98L39j17j15J46n6R9j17J79q2k30j46L17m39J83L06k12
5159d9J3K61l04l3p0J63J74m28M49m96N96L0j02m3K4k42J21n2n2k00L06n5j99
5182a88r2M35n0j82R9Q8O5pk73O2J41p4O9j80o1M3J99l64M00p7J4j5j69K3L64
5207B70k5l35J16k3J72l10M48j09j40K84k16k14K46k97J81l50M68q4q2N6J38J76
5229C70l87n3J06k27M44K3j68k17N7J70Q9j48j81P6m0m9L27k84j52L59P4l37Q9
5252e9j23L03p4K6j40K56l77J55P5q9L8n8j21K49j10M8j8K84m57L37j51J27J1
5275A32k14L8jR6l1J65j26m02L00M7j58K24q2J01J27k27N3Nq3M7J86j56j69K76
5299A48j57K11k54q3L19k10j38M4P5J14K62k66l1j40K56l43o6K87k54K76j23k9
$$ plain form
5321 -102 -193 -89 -78 117 328 141 -135 -217 98 -116 -242 5 138 -218 -22 -310 189 21 -105 -96 -22 350
5343 350 47 -164 192 295 -10 53 53 126 -222 172 122 22 -62 42 -359 141 94 -145 262 158 540 108
5365 108 177 -385 113 -344 218 -56 84 -42 -95 -87 -129 136 202 261 294 116 60 49 -75 -113 343 -289 81 -69
5389 -69 427 18 -356 90 -88 37 201 133 312 -280 -301 27 135 130 -277 -206 -204 180 -131 -25 251 126 185
5412 185 278 16 136 -77 89 97 -43 152 37 -60 -369 -489 202 -187 -204 -161 -66 -205 -44 -191 -144 -183 -265
5435 -265 -73 -160 -13 111 -46 72 -105 7 -105 -39 8 120 -27 47 160 -431 117 216 -120 160 127 -90
5457 -90 18 -297 132 -155 -278 -182 12 -191 27 -73 8 70 27 37 -85 103 253 -61 -178 21 -124 27
5479 27 274 -102 -282 150 73 98 -371 -98 118 -60 31 -87 -73 -2 -190 14 -227 -292 -150 -113 335 -149 -113
$$ packed form
5321a02r1J04J1J95K11j87k76q2L15k14j26K47J33l56J96k88M99j68j26RP4L72
5343C50l03k11L56J03l05O3%P3l48L94n0j00q4J04m01N00m7k39M07j04L82m32
5365A08O9n62M98m57N62k74J40j26n3Qm2K65O6N9L3j78n6j1j24l8M56o32L70j50
5389f9M96m09l74M46j78J25J64o8J79n92k1L28J08nm07P1KL84l11J06K76j25N9
5412A85R3k62J20k13J66Qj40J95j15r7l09j20O91l89j7M3R5j39J61j47M7l9q2
5435b65J92q7J47J24j57J18j77J12j12O6M7J12j47P4J13n91N48R9l36K80l3k17
5457i0J08l15M29k87j23R6J94k03K18j00Q1O2m3J0j22J88J50l14j17J99j45J51
5479B7K47l76j80M32p7K5m69K73K16j78R1j18J4P1j88K04k41o5J42L7M48m84L6
$$ plain form
5502 -113 -125 -186 -279 -42 -208 -11 -185 -34 -161 188 -113 15 -19 182 42 -69 203 -14 -129 -55 190 -92
5524 -92 62 -94 32 -302 -119 -48 177 348 108 -136 332 70 -6 -124 -196 -191 -20 -311 289 -90 77 -125
5546 -125 77 -244 20 -36 -237 75 -102 110 130 283 7 72 118 60 260 15 -234 -9 158 214 47 102
5568 102 20 51 -250 -16 38 43 -373 -56 25 51 62 -12 131 133 -5 179 69 131 -225 -131 -296 -209 -73 -323 48
5593 48 339 197 -129 -386 -93 -40 -142 -302 154 -52 -217 -258 -401 -77 177 -151 79 76 -23 324 144 351
5615 351 41 -17 238 137 72 -238 -189 204 177 68 179 312 104 -343 206 -62 137 -51 -113 -111 -34 72 101
5638 101 -159 125 72 108 19 96 -155 87 -22 -324 34 105 15 13 161 -111 -40 -207 314 33 267 -23 -212
5661 -212 258 -269 123 118 -214 2 51 -353 40 -55 5 88 98 -24 -21 129 -130 -274 -4 -211 -291 192 290 -191
$$ packed form
5502a13j2o1r3K37j66J97j74J51j27L49l01J28l4K01j40j11K72k17j15P4K45k82
5524i2J54j56J26l34J83P1K25J71k40k44M68k62p6j18p2NJ71k91O00l79J67k02
5546a25K02l21K64n6k01L12j77K12K0J53k76O5M6n8K00k45k49K25J67N6j67N5
5568A02q2L1l01K34N4Nm16L17Q1K6J1p4J43Kj38J84j10O2l56R4j65Q7J36k50L71
5593D8K91j42l26k57K93N3j02j60M56k06j65m1j43L24K54l28K30lr9L47j80K07
5615C51l10n8K55j01o5l10M9L93k7j09J11J33k08m47N49k68J99j88o2KP7J06K9
5638A01k60K84n3L6q9P7k51K42j09l02L58P1r0kJ48k72P1j67N21k81K34k90j89
5661b12M70n27L92nl32K16M9m04L93r5O0Q3J0j22LJ50k59j44K70k07q0M83R8m81
$$ plain form
5685 -191 -281 159 -14 13 -25 46 134 -149 -16 -354 12 80 -79 78 141 27 130 169 129 10 -221 -80 189
5708 189 -162 -370 154 112 -33 27 154 29 -182 -106 265 172 -162 -409 111 196 -105 -46 -72 -76 -76 -1 -190 -200
5732 -200 -245 45 8 -62 165 -326 46 84 -44 51 32 43 -105 -59 154 194 -194 342 -67 42 -129 81 -47
5755 -47 -13 55 174 -111 -251 317 -93 66 20 64 -37 244 -25 130 -179 -29 257 -13 181 43 143 -112
5777 -112 -46 -39 183 -137 -54 -34 -136 -75 -11 -140 131 148 76 -232 -40 125 126 -78 -295 301 185 240 44 -57
5801 -57 177 28 -11 -307 33 141 208 198 25 232 -54 190 -164 -174 122 -121 -169 -35 -81 109 -123 -16
5823 -16 -141 125 19 48 -45 53 287 58 270 -110 -204 -157 157 -71 -73 -177 107 226 -285 -184 12 194 89
5846 89 299 -45 264 -213 -5 87 2 66 96 -89 -242 56 273 55 -248 -85 -164 -166 146 3 260 5 -39
$$ packed form
5685a91r0M40j73K7l8P1Q8k83J33l38L66O8j59J57O3j14J03L9m0j19k31J41K69
5708A89l51k08N24m2j45O0J27j25k11P6L71r3l34k47N20Q5l01N9k6m%P5j89j0
5732b00m5K90l7p0K27m91L72L8j28R5j9J1j48M6K13M0l88N36m09J09j71K10j28
5755d7L4O8J19k85j40N68m10J59m6M4j01K81k69J55l09J50K86k70J94j38J00k55
5777a12O6PK22l20Q3K0j02O1O4j29K71J7p2l08J92J65Jk04k17N96j16N5j96j01
5801e7K34j49l9k96L40J08O7j0j73K07k86K44l54j0K96k43m8J34m6J90k32J07
5823a6j25K66j06K9r3R8K34k29K12l80r4M7L14k28kj04K84J19n11J01J96J82j05
5846H9K10l44L09m77K08R2q5O4L0j85j53K98K17k18l03J63p9kL12j43K57k55m4
$$ plain form
5869 -39 -97 62 -108 -245 152 244 -20 -40 234 80 -65 -9 116 345 102 107 187 -49 -5 108 81 -163 -141 7
5893 7 21 -190 -138 -53 -13 241 -173 -59 -203 103 219 -281 56 62 -36 -5 192 -157 139 -183 122 4 3 256
5917 256 134 -95 -65 65 37 -183 88 94 -192 178 -104 15 151 -11 93 161 -115 -150 -57 209 -45 48 -26
5940 -26 -186 30 59 9 -114 226 -178 52 138 -232 -87 161 -102 -9 6 259 173 125 -153 227 -308 37 -4
5963 -4 318 211 295 4 -309 175 64 -103 -92 -590 139 -146 -1 69 36 200 -53 15 19 -80 3 54 135 186 -170
5988 -170 -183 2 409 -25 118 -209 49 -152 -90 -101 -65 118 -29 325 -82 -91 149 135 139 312 -23 -131 115
6011 115 -55 137 -32 -163 -200 -259 68 149 -79 -204 220 129 110 -146 23 211 -198 190 85 8 204 177
6033 177 -147 -235 165 -87 -162 156 -239 -120 -6 -102 455 387 124 55 522 52 -84 -181 -169 -57 -167 97
$$ packed form
5869c9n8J59j70j37L97R2k64k0K74j54j45N6J25K29k43NQ0k36M4J13k7k44K2J48
5893GJ4k11N2Q5M0K54m14J14j44L06J16n00L37Or8L1J97l49K96l22L05j18jK53
5917B56j22k29L0J30k8k20K71Ok86L70k82J19J36j62J04O8k76l5R3K66k54R3p4
5940b6j60K16K9n0j23L40m04K30Q6l70J45K48k63R3J5K53q6m8k78L80n35L45m1
5963dL22j07Q4k91l13M84j11j67J1m98P29k85J45P0l3J64k53O8Mr9Q3N1Q1N1l56
5988a70j3J85M07m34J43l27K58k01O2j1L6J83j47L54m07rK40j4MJ73l35j08K46
6011A15j70J92j69j31l7n9L27Q1k28j25M24r1j9k56J69J88m09L88j05p7J96k7
6033A77l24q8M00k52p5L18l95J19J14r6N57o8k63o9M67m70j36r7J2J12j10K64
$$ plain form
6055 97 -89 -31 45 -122 346 183 -167 -50 -199 -368 37 73 -60 -67 116 -77 -247 12 -29 -14 -419 166 -125
6078 -125 4 257 92 -36 460 -340 130 -59 -36 -30 153 245 -74 -75 53 19 161 -88 -70 -17 -33 309 -88
6101 -88 75 -77 61 235 -81 70 -376 -153 -220 48 166 5 165 -70 225 3 159 190 -269 77 202
6122 202 -92 -331 35 -330 24 -184 -95 225 -215 -145 -73 -242 308 72 -270 -11 -160 -164 -95 157 133 5
6144 5 -119 -165 -326 -71 -97 187 128 -133 231 -10 -62 41 -372 -166 -176 459 25 -207 -225 329 103 -85 69
6167 69 62 -52 114 82 5 -329 -262 94 -65 -174 -60 -18 65 47 -87 -134 5 201 -90 326 50 452 -44
6190 -44 -22 205 -192 -18 165 72 -63 66 67 -10 114 284 392 -130 -215 -190 -58 85 -187 41 89 111 222
6213 222 -165 226 81 -165 -220 151 57 -107 86 -51 -41 235 53 -10 -35 -280 -303 272 43 -339 169 -40
$$ packed form
6055I7j86N8P6j67M68j63l50J17j49j69M05L6j33pJ83j93j70K59m1J5m05N85k91
6078a25J29K53j65j28M96q00M70j89K3OJ83R2l19jJ28l4J42k49J8N3j6L42l97
6101h8J63j52J38J74l16J51m46K23o7K68J18j61J60k35K95k22J56L1m59L46J25
6122B02k94k39L66l65L54k08Q9L20m40P0P2j69N50k36l42K59j49mO9K52k4j28
6144Ej24m6j61K55k6K84n9k61L64k41n2J03m13K06j0O35m34k32j8N54k26j88J54
6167F9pj14J66l2p7l34O7L56j59j09J14M2Q3j8j34m7J39J96k91M16k76M02m96
6190d4K2K27l97J74J83r3j35J29Jp7J24J70J08n22q5K5J32J43k72K28M8K2J11
6213B22l87L91j45k46n5L71r4j64J93j37J0K76j82o3k5k45k3N75k29l82N08k09
$$ plain form
6235 -40 -162 -73 281 187 -17 -166 207 118 23 -166 -12 -53 -86 -237 215 -35 -33 157 492 53 188 -134 -425
6258 -425 -205 -4 190 -427 -29 -10 49 222 152 177 -385 292 114 -11 48 32 -87 72 11 -121 127 -155
6280 -155 8 210 81 163 103 102 66 118 -16 -68 82 -2 131 -134 67 27 261 61 -227 221 339 198 495
6303 495 -165 -257 -50 -19 -48 12 -241 -82 109 -169 -77 38 -1 173 -132 -26 85 57 -250 -28 70 319 -372
6326 -372 -179 136 44 122 -147 55 -226 15 401 -333 137 209 -41 78 -233 147 -116 53 -41 58 147 361
6348 361 226 -4 -49 -33 108 -6 -97 -77 12 128 64 246 -41 174 80 211 -241 -199 29 -76 173 18 -157
6371 -157 24 -228 -235 494 -186 -33 15 -349 -13 25 191 -2 464 13 -160 -145 -300 -212 271 -347 168 191
6393 191 183 61 228 56 -101 39 17 61 -287 184 17 -191 -49 -346 -83 122 -28 -16 134 -67 52 192
$$ packed form
6235d0j22Q9L54r4k04j49L73q9r5j89J54m1l3j51M52k50KJ90L35m39J35l22k91
6258d25K20K01J94o17L98J9N9J73p0K5n62O77j78j25N9j6j19J59o1j32K48k82
6280a55J63K02j29Q2o0jl6N2j34n2J50q4J33k65K01m0K34k00k88M48J18j41K97
6303D95o60r2K07L1k9O0k53J59J91k78R2J15l9J74l05J06J11k8l07K22R8K49o91
6326c72J93L15r2P8k69K02k81K41L86p34M70P2k50J19l11L80k63J69r4R9Q9K14
6348C61j35k30m5J6J41j14r1K0Q9J16o4J82k87K15r4J31m52M2K28j05K49j55j75
6371a57J81k52pP29o80J53M8l64L36L8J66j93M66m51j73J5j55Q8M83o18N15K3
6393A91qj22J67j72j57J40k2M4l48M71j67k08J42k97K63K05j50J2J50k01J19J40
$$ plain form
6415 192 -200 351 -112 218 14 -192 82 -9 -31 197 -44 96 72 -233 -33 -107 49 -32 67 34 -156 -130 144
6438 144 162 93 108 -129 -350 208 122 45 56 94 22 15 214 310 -124 210 -27 198 45 -67 182 105 -7 -89
6462 -89 -127 2 102 -85 87 193 63 444 156 -63 250 0 -34 -188 145 30 -143 315 82 -39 -106
6483 -106 163 12 12 3 24 90 -155 -33 1 -25 -72 -88 -10 -164 -47 -71 19 79 236 -109 -23 228 -12 -214 11
6508 11 75 51 -76 -133 207 -142 -165 70 67 55 -180 -53 -100 0 -178 -45 -88 -106 -100 -110 56 -6 100 69 -219
6533 -219 171 -294 -1 201 28 -33 -63 81 94 -143 -20 -282 -109 -7 -2 0 9 372 83 -34 193 -83 12
6556 12 33 26 119 -208 -25 60 -48 9 374 397 -148 157 44 95 -108 233 69 -101 -353 122 -19 -150 -220
6579 -220 -258 -68 -70 31 -39 206 -206 76 88 -52 -194 -36 -46 -332 -71 159 -108 306 196 -204 -340 -41
$$ packed form
6415A92l92N51m63L30k04k06K74r1k2K28k41J40k4l05K00p4J56q1R9l3j90K6K74
6438A44J8o9J5k37k21N58q6p7J1L8p2pJ99R6m34L34k37K25j53j12K49p7j12q2
6462h9l8J29J00j87J72J06j30L81k88k19L13k50l4j54L33j15j73M58k33j21o7
6483a06K69j51%rK1O6k45J22L4k6m7j6P8j54J17k4R0O0J57l45Q6K51k40k02K25
6508A1O4k4j27n7L40l49k3K35lj2k35J27m7J00j78J33m3j8Oj0J66o2J06l1k88
6533b19L90m65K93K02j73o1l0J44J3k37J23k62J73J02NKRL63k89j17K27k76R5
6556A2K1pR3l27J83Q5j08N7L65K3n45L05j13N1k03L41j64j70k52M75j41j31p0
6579b20l8J90kJ01p0K45m12K82J2j40j42J58j0k86K61K30k67M14j10m00j36K99
$$ plain form
6601 -41 276 -39 105 -166 244 23 -95 -199 -225 51 157 139 -38 -53 -233 -238 -256 -94 75 -27 314 -29
6623 -29 -36 -169 46 -187 97 -107 175 174 15 -208 65 122 303 37 294 -149 150 130 357 3 -58 -33 116
6646 116 93 -227 109 168 31 152 78 -375 213 51 -105 -281 47 105 -80 -144 -93 5 -430 0 -7 -127 -113
6669 -113 -66 -274 -66 137 183 -293 163 116 -283 -145 191 237 80 267 239 -10 242 21 46 -186 -213 -214 46
6692 46 -28 104 -321 99 -170 -12 -171 -204 -175 -291 132 220 -24 24 -271 144 185 -113 294 -25 -91 -143 -524
6715 -524 -265 -239 -95 87 181 211 107 154 43 -150 176 -146 -38 181 -131 -141 -173 -91 331 -3 -152 -134 -217
6738 -217 -2 -14 96 17 312 163 -122 193 39 -186 195 -78 -80 161 40 181 -88 -77 -29 -161 308 63
6760 63 -134 -265 -7 225 -7 15 16 179 8 9 -96 301 -194 -273 230 -177 264 30 223 -136 148 -189
$$ packed form
6601d1L17l15J44k71M10k21j18j04k6K76J06j8j77j5j80nj8J62J69j02L41l43
6623b9pj33K15k33K84k04K82jj59k23K73N7J81k66K57m43K99k0K27l54o1K5J49
6646A16k3l20L36N9j37J21p4m53N88j62j56j76L28N8j85o4N1R8m35M30pj20J4
6669a13M7k08K08K03M6m76M56m7l99J38L36M6j57J87k8k49K52k21K5k32k7jK60
6692D6p4J32m25M20k69J58j59l3K9j16M23Q8k44M8k95M15M1k98M07l19o6n2l81
6715e24K59K6J44J82R4L0j04M7j11j93L26l22J08K19l12j0l2Q2M22l34j49J8q3
6738b17K15j2J10p9K95j49k85L15j54k25L81k73kK41j21J41k69J1M8j32M69k45
6760F3j97j31K58K32k32K2JJ63j71Jj05L97m95p9N03m07M41k34J93l59K84l37
$$ plain form
6782 -189 -24 -142 41 55 -18 -280 -2 -103 243 -250 -37 384 -34 19 -35 368 -149 282 156 88 12 67
6804 67 -285 -149 43 2 -213 -118 188 65 309 25 -24 -10 -83 -343 -45 108 -255 -201 -40 -72 32 -83 67
6827 67 -262 -342 20 116 -171 75 -14 50 -58 -185 -42 -130 302 -214 13 -153 -246 -111 -23 141 34 17 -183
6850 -183 -189 -59 191 -254 191 -77 -229 -206 -104 145 171 206 -295 -101 122 -70 138 113 37 -60 -77 213 78
6873 78 129 -337 -287 -150 146 -82 320 275 -101 95 -41 -188 -76 56 0 96 2 -141 -29 -166 138 -91
6895 -91 45 91 363 -134 29 162 69 -152 -336 159 -302 161 -171 -15 111 -78 179 247 111 118 25 93 -77
6918 -77 183 212 38 163 -91 191 -184 -70 -197 1 -353 -106 -46 -20 -263 -274 -239 -240 188 -339 88 -4 199
6941 199 224 -32 91 200 156 -481 32 94 -54 65 -123 89 6 -70 -32 82 404 54 -263 18 7 -133
$$ packed form
6782a89J65j18J83J4p3k62K78j01L46m93K13M21m18N3n4M03n17M31j26o8p6N5
6804F7l52J36J92m1k15R5L06j23K44k84m9J4p3k60K98J53l63N4J61l2J04j15J50
6827F7l29q0L62R6k87K46q9O4j08j27J43q8M32n16K27j66r3J35Q8J64j07j7k00
6850a83oJ30K50m45M45k68j52K3J02K49K6L5n01J94K23j92K08k5p6r7j7K90j35
6873G8N1m66N0J37K96k28M02m5l76J96j36j47J12J32n6R6r4j43J12j37L04k29
6895i1J36M6K72m97J63J33r3k21j84M95m61M63l32J56J26j89K57O8j36Pr3O8j70
6918g7K60K9j74J25k54K82l75J14j27J98l54K47O0K6k43j1L5jM28n27M27r2K03
6941A99K5k56J23J09m4o37N13O2j48J19j88K12q3p6L8J14L22l50l17K81j1j40
$$ plain form
6963 -133 17 258 -203 234 40 8 209 280 69 -41 -261 108 -313 -119 -142 -90 17 -178 156 -198 322
6984 322 82 -138 112 -139 229 -197 19 110 -348 -228 39 -156 -35 -184 257 120 -177 -72 -180 -18
7004 -18 -143 96 148 -313 -105 107 359 97 255 21 -170 152 331 -77 158 -226 -4 224 49 -6 -298
7025 -298 6 12 198 -336 19 12 500 -260 96 -12 -339 -118 -167 -34 327 18 -180 -198 -87 107 15 104 -262
7048 -262 163 -318 -440 302 165 -27 -149 -308 -46 -41 -149 250 -166 31 -349 -414 130 -4 -257 85 -180
7069 -180 -363 -80 261 177 122 -61 -308 58 345 -50 -120 77 2 112 72 154 60 200 -2 95 141 -247 120
7092 120 -334 -159 -56 -360 40 -123 57 -287 63 -123 131 120 25 -39 -59 327 -151 -77 200 -19 -122 228
7114 228 -224 31 -145 260 13 4 -155 284 204 -102 -9 227 141 173 272 200 -107 -117 101 -171 261 -125 -125 53
$$ packed form
6963a33J50K41m61M37j94l2K01P1k11j10k20L69m21J94k3N2J07j95L34l54N20
6984C22k40k20K50k51L68m26K16R1m58J20K67j95J21j49M41j37k97J05j08J62
7004a8j25K39N2m61K08K12K52k62J58k34j91L22J79m08K35l84K22K28j75n5k92
7025b98L04OJ86n34L55pM88p60L56j08l27K21m9J33L61l09j98j8J11J94r2Q9l66
7048b62M25m81j22P42j37j92j22j59K62Nj08L99m16J97l80o5N44j34k53L42k65
7069a80j83K83L41q4n5j83k47L66K87l95p0J97p5J10m0Q2r4J40k02R7M6l88L67
7092A20m54J75J03l04M00j63J80l44L50j86K54j1r5o4k0L86m78P4K77k19j03L50
7114B28m52K55j76M05k47rj59M39q0l06R3K36q6L2R9p2l07j0K18k72M32l86%J78
$$ plain form
7138 53 97 11 -21 -188 190 6 -49 123 327 -10 -120 -138 114 -36 -215 -136 389 -161 148 -23 -17 -44 -297
7161 -297 11 148 -152 -75 -199 -236 -259 5 233 440 37 -188 -10 457 36 319 56 199 -196 303 48
7182 48 -115 201 -16 199 -91 99 -185 256 -60 151 38 -304 87 101 -49 -32 2 -108 -12 273 -23 4
7204 4 -110 -228 -255 111 -94 -291 143 -260 11 -165 211 9 -114 -58 -1 231 -318 353 202 111 -234 24
7226 24 217 -35 -75 72 94 -155 -28 -90 -35 -63 -258 -116 -221 98 11 38 232 130 125 257 363 -140 -194 -371
7250 -371 -146 -19 -29 -271 38 -6 -28 -195 -129 -109 -54 58 141 29 -29 221 29 11 180 -87 27 78 -322
7273 -322 23 136 13 -255 -115 -121 -35 -69 -359 188 136 -187 -10 -26 54 202 -110 147 -199 66 -173 223
7295 223 -306 -53 71 -310 127 -93 -202 114 251 315 -120 198 19 -46 -233 -116 120 -28 -275 58 -133
$$ packed form
7138E3M4q6l2j67L78j84n5J72K04l37j10j8K52j50j79P9N25n50L09j71Ok7k53
7161b97L08J37l00P7j24l7k3K64K28K07m03k25J78M67m21K83k63J43l95M99k55
7182D8j63L16k17K15k90J90k84M41l16K11j13l42L91J4j50J7L4j10R6K85k96K7
7204Dj14j18k7L66k05j97M34m03K71j76L76k02j23N6N7K32n49O71j51r1l45K58
7226B4J93k52m0J47K2k49J27o2N5k8j95J42j05L19q7K7J94j02nJ32J06n03n4j77
7250c71K25J27j0k42L09m4k2j67O6K0N5J12Q3j12n8K50j92j8J69k67J14N1m00
7273c22L45J13j23k68J40oQ6l4k90N47n2l23J77j6Q0J48l12K57l46K65k39L96
7295B23n29K53J24l81M37k20j09L16J37O4m35L18j79o5j87J17K36j48k47L33j91
$$ plain form
7316 -133 166 -81 -57 12 140 4 25 217 -83 -181 -107 117 156 -1 -5 30 -279 -182 -217 90 -85 -45 -287 -29
7340 -29 11 265 66 -88 -312 -50 60 31 -56 -7 118 -107 81 -3 2 51 -197 -175 -42 -160 -277 353 -70
7363 -70 67 -180 -77 365 -133 35 -134 -85 99 43 -114 -191 307 112 -141 151 -40 37 -121 -285 -134 43
7385 43 14 4 -110 -279 -131 -194 -105 -199 -19 -13 66 -109 -31 -7 72 128 94 -274 248 188 132 -76 77 -22 -102 46
7411 46 -82 261 -297 -378 -212 -226 94 -182 -185 137 -174 95 128 40 -14 41 -130 7 -67 -8 259 288 -354 -142
7435 -142 -291 -182 -67 91 274 282 186 -77 -50 107 30 10 -6 301 -203 223 322 92 -200 -49 -137 138 224
7458 224 -42 -22 146 6 19 28 52 -146 112 -92 210 104 -185 -207 -164 7 -69 -99 -40 44 17 168 -247 208
7482 208 9 106 -26 -40 -169 351 129 -56 37 1 6 -79 -184 -71 204 -105 176 148 -259 -56 -104 -1 98
$$ packed form
7316a33K99k47K4O9J28j36K1J92l00r8P4K24L9j57mL5l09R7l5L07j75M0k42K58
7340b9M0K54j99j54k24K62J10k9q7M9J25k25J88q4NM9k48K2J33j18j17O30m23
7363g0J37k47J03M42m98J68j69M9J84n6j57p7M98j95k53K92j91P7j58j64J51J77
7385D3k9j0j14j69J48o3Q9r4J80OP9j75P8K4P9N6l4l68N22o0n6k08J53r9q0J48
7411D6j28L43n58q1J66j4L20k76lL22l11K69L3q8n4N5j71J37p4N9K67K9o42K12
7435a42j49J09J15J58J83Qr6k63K7J57p7k0j6L07n04M26R9k30k92J51q8K75Q6
7458B24k66K0J68j40J3RK4j98K58k04L02j06k89k2M3J71p6l0N9Q4k7J51m15M55
7482B08j99R7j32j4j29N20k22j85R3l6Nq5j05J13K75l09K81k8m07K03m8J03R9
$$ plain form
7505 98 -159 -161 131 227 -99 89 108 -135 -159 -324 200 -23 -255 60 -4 -32 -386 -260 270 -306 -101 86 154
7528 154 -45 144 120 -215 -98 122 -23 73 -140 -117 -70 -256 87 202 176 -121 0 192 23 -226 269 71
7550 71 63 15 125 -117 -64 -136 154 30 -20 135 -41 182 -167 100 -69 187 -157 -223 12 327 -214 -62 20
7573 20 -222 -23 -141 99 -49 -190 -73 -229 -157 53 -10 -99 365 38 -4 -76 -9 -348 393 284 -83 -163 -7
7596 -7 52 47 74 -6 240 -30 21 -140 216 -352 135 -32 -125 -485 122 -143 32 128 39 429 19 69 192 4
7620 4 -329 11 -243 -146 155 4 -159 279 249 -196 179 -165 132 -164 -127 212 79 -153 -71 -290 -95 0
7642 0 -28 -50 -343 104 -140 131 -230 43 7 160 -25 -215 -126 -31 -70 -219 -81 366 163 -75 -130 225 -44
7665 -44 -246 -48 34 6 105 138 191 -98 -33 146 -220 1 -90 82 -201 -214 224 35 -58 56 81 -257 111 -57
$$ packed form
7505I8k57kK92R6l26J88J9k43k4j65N24k23k32L15o4k8l54J26N30n76K05J87O8
7528A54j99J89k4l35J17K20j45R6k13K3M7j86L43J15k6k97J21J92j69k49M95j98
7550G1qm8J10k42N3p2K90j24n0J55j76K23l49K67j69K56l44o6K35L15n41J52Q2
7573B0k42J99j18K40j48j41J17j56P2K10o3q9M64l27m2p2O7l39P41j09l67q0J56
7596gN9nK7q0K46k70N1j61L56n68M87j67r3l60O07k65J75R6q9L90m10N0J23j88
7620Dl33L40k54R7L01j51j63M38l0m45L75l44K97k96L7L39j33k32Q2k19J95R5
7642@k8k2k93M47k44K71l61K73l6J53j85j90Q9R5l9j49J38M47k03k38n5L55k69
7665d4k02J98Q2k8R9L3N3k89O5J79l66K21r1J72k83j3M38j89r3J14K5l38L68j68
$$ plain form
7689 -57 -149 77 55 -59 116 90 177 131 -42 149 214 -76 -76 80 85 -105 -50 39 -61 42 -194 -50 246 -13
7713 -13 -146 -33 -121 178 11 -201 5 41 -59 31 -14 -74 -86 151 84 -358 -79 45 -5 321 -101 -187 119
7736 119 246 -62 -205 89 -115 -385 -39 -69 -111 49 -85 -19 14 -182 118 59 -4 125 -327 -224 34 -83
7758 -83 192 -141 -46 69 -137 -193 -110 -307 -1 -92 30 182 87 -177 93 -128 6 -56 -291 71 8 100 -117
7781 -117 141 46 -177 140 -28 -197 167 149 156 -31 -98 -168 -54 14 -457 -205 -128 71 191 -159 -143 93 244
7804 244 -46 33 136 170 48 -108 175 96 -111 163 47 22 267 -301 331 -11 51 187 -7 -5 -25 -26 -65 -174
7828 -174 67 120 96 251 -48 -119 127 -185 -58 114 -106 -90 24 -70 128 -142 50 -248 -335 77 94 109 -129
7851 -129 -41 99 -103 203 36 -44 145 26 -14 -135 24 -294 111 88 -119 34 163 269 38 51 24 354
$$ packed form
7689e7r2K26k2j14J75k6Q7m6j73J91O5k90%J56Nj90N5Q9j00J03k36J44K96k59
7713a3j33J13q8K99j67k12K06L6j00R0m5o0j2K37o7m42K79J24n0L26m22q6L06
7736A19J27l08j43K94k04k70L46l0m2J60j34O6L3j96L00n9o3J29m52J03K58j17
7758h3K75l33R5J15k06n6Q3j97L06r1J22J52r5k64K70k21J34o2k35L62o3R2k17
7781a17K58r5k23L17j68j69L64j8Pj87o7p0J14O8m71K52P7J99J20l50J6K36J51
7804B44k90P9J03L4j22j56K83p9k07K74j16k5K45n68O32l42O2J36j94Kk0jl9j09
7828a74K41N3k4J55k99p1K46l12J27J72k20J6J14r4J98k70J92k98q7M12J7J5k38
7851a29Q8J40k02L06j67q0J89j19m0j21J59l18M05k3k07J53J29J06k31J3k7L30
$$ plain form
7873 354 -27 -337 -77 175 179 90 171 45 169 -22 -50 82 86 -75 -149 -51 73 88 -179 2 -285 -124 -44 105
7897 105 -69 115 210 358 125 27 -296 218 -278 -227 127 -408 192 136 300 22 -38 -214 193 -162 167 158
7919 158 122 141 -96 93 204 -110 -89 -27 162 -102 95 -17 -76 130 437 203 62 276 -169 -167 104 49 -122
7942 -122 -20 -274 55 180 85 -96 173 -139 5 70 -8 286 39 9 -26 -102 -234 48 242 262 158 -6
7964 -6 53 305 18 200 56 336 105 -107 4 -48 -69 -287 37 22 32 94 114 62 68 -43 147 12 -60 -169
7988 -169 -180 -109 -96 -32 124 77 -154 85 355 224 139 6 -58 -157 -72 225 13 -226 257 -169 145 43 -29
8011 -29 -55 -223 158 170 111 380 -162 119 187 168 70 -32 -345 164 63 -73 -124 3 164 129 -52 25 239
8034 239 -465 147 86 60 -417 263 160 157 -115 163 53 26 163 31 17 173 290 298 129 -263 31 5 -30
$$ packed form
7873C54l81l10K60K52Mq9Q1j26J24j91k8J32Mj61p4R8J24J5k67J81k87J61Q0J49
7897A05j74J84R5J48k33r8l23N14m96N1L54n35O00n6J64k78o0j76M07l55L29r
7919A58l6J9k37J89J11l14K1O2J89k64J97j12n9K06L07k34j41K14m45KK71n5j71
7942a22J02k54L29J25r5j81K69l12J44O5p8K94k47l0l5p6j32K82J94K0j04j64
7964fN9K52k87J82j44K80k31k12J11n2k1k18L24j5J0O2K0n2Oj11J90j35p2j09
7988a69j1P1J3O4J56m7k31K39K70j31q5j33o4r9Q5K97k12k39M83m26L14j02p2
8011b9k6j68L81J2n9K69n42K81O8j9r8j02l13N09j01j36n1J27J61l5j81P7K14
8034B39p04O12o1k6m77O80j03lk72K78j10k7J37j32j4J56J17Qj69l92K94k6l5
$$ plain form
8057 -30 130 217 61 13 -108 -44 -390 276 -251 -26 -12 -152 -71 24 18 80 91 -287 -138 -53 131 -149 -30 -128
8081 -128 168 16 91 -45 -170 568 -42 123 -66 -113 -46 -158 44 -105 -103 -133 -98 -356 -23 -200 -58 48
8103 48 180 88 -34 51 -181 -24 -84 -438 -110 -225 -113 -88 31 439 112 145 -147 22 290 -92 -185 -71
8125 -71 114 -17 121 -244 -362 -9 -82 -210 -72 8 75 236 -14 -151 -177 318 -50 -11 -91 171 146 164 -206
8148 -206 47 -301 -136 -105 85 -178 -168 53 -40 -191 -64 24 3 82 -79 54 -96 95 -90 201 131 -153
8170 -153 30 179 -86 105 -74 363 -377 267 -13 12 178 -118 81 -58 -278 -270 260 344 99 97 76
$$ packed form
8057c0J60Q7j56m8j21O4l46O66n27K25J4j40Q1R5oO2J1l78J49Q5J84k80J19r8
8081a28K96j52P5j36j25P38o10J65j89m7O7j12K02j49Kl0L5k58L33j77J42J06
8103D8J32r2j22Q5k32J57o0l54L28j15J12K5J19M08l27L3k92J69K68l82r3J14
8125g1J85j31J38l65j18L53p3j28J38Q0O7J61k50j37k6M95l68L9q0K62k5J8l70
8148b06K53l48J65L1J90k63J0K21r3j51J27Q8k1P9j61J33j50J91j85K91p0k84
8170a53J83J49k65J91j79M37p40O44k80K5J66k96J99j39k20QN30Q4k45kk1
8191G6
$$ Imaginary data points
##PAGE= N=2
##DATA TABLE= (X++(I..I)), XYDATA
$$ plain form
0 0 0 0 0 0 0 0 5 -8 8 -8 16 -16 16 -24 27 -32 40 -48 56 -67 80 -91 106 -122 140 -162 185 -209 236 -267
30 -267 300 -338 379 -422 472 -526 582 -648 721 -800 885 -979 1082 -1201 1330 -1475 1640
47 1640 -1829 2043 -2295 2592 -2951 3391 -3949 4682 -5688 7171 -9569 14095 -25622 112620
61 112620 185883 -105052 -116861 -59457 15949 126992 108963 -92852 -138778 -28795 82240
72 82240 115222 29958 -110233 -102093 8303 96791 97707 -16145 -131994 -71789 57690 106292
84 106292 61237 -62280 -137242 -22133 109848 85577 -3835 -80583 -101107 14746 125954
95 125954 62952 -57715 -93628 -47115 57666 106190 19590 -76376 -79443 -15472 78901 95337
107 95337 -19738 -101619 -53002 30357 84465 62282 -51906 -105558 -20749 67574 78963 18556
$$ packed form
0@%%%%%%Nj3J6j6K4l2L2m0N1n9P2q8J04j23J47j71J97k28K62l02L47l94M45n03
30b67N67o38P17q01Q94r98J108j230J369j521J685j864K061k283K531k805L115
47A640l469L872m338M887n543O342p340Q631j0370J2859j6740K3664l9717J38242
61A12620P3263k90935j1809N7404P5406J11043j8029k01815m5926J09983J11035
72H2240L2982q5264j40191Q140J10396Q8488R16j13852j15849O0205J29479M8602
84A06292m5055j23517p4962J15109J31981k4271q9412p6748k0524J15853J11208
95A25954o3002j20667l5913M6513J04781M8524q6600r5966l067O3971R4373J6436
107I5337j15075q1881M8617Q3359N4108k2183j14188n3652Q4809Q8323J1389o0407
$$ plain form
119 18556 -79208 -87464 22634 87685 48131 -22791 -79877 -55840 49163 88423 19109 -52713
131 -52713 -71905 -20673 69199 75130 -12209 -70175 -54265 11634 78998 54093 -43142 -78388
143 -78388 -26584 44837 76325 18085 -67689 -62383 8358 56687 57192 -7837 -79505 -46043 41891
156 41891 63267 25030 -32280 -69704 -22013 58933 58794 -1791 -51450 -56269 6876 70802 40818
169 40818 -30970 -56194 -31326 29111 68049 19433 -52134 -53111 -3078 47514 54646 -8281 -63139
182 -63139 -35594 22986 50703 33651 -27260 -63181 -16224 43927 47063 8775 -41847 -52212
194 -52212 5479 54322 34734 -14329 -48880 -35427 26708 57570 14816 -35591 -43995 -12492
206 -12492 39662 49484 -5536 -47196 -32961 9675 45565 33900 -24093 -50543 -16052 27481
$$ packed form
119A8556r7764q256J10098O5051l9554p0922n7086K4037J05003L9260o9314p1822
131e2713j9192N1232Q9872N931q7339n7966J5910O5899O7364k4905r7235l5246
143g8388N1804P1421L1488n8240q5774N306P0741M8329N05o5029p1668L3462Q7934
156D1891K1376l8237n7310l7424M7691Q0946j39o0585m9659m819O3145O3926k9984
169D0818p1788k5224K4868O0437L8938m8616p1567r77N0033N0592P132o2927n4858
182f3139K7545N8580K7717j7052o0911l5921M6957O0151L136l8288n0622j0365
194e2212N7691M8843j9588m9063l4551J3453O2135L0862m2754n0407q404L1503
206a2492N2154R822n5020m1660J4235M2636L5890j1665n7993k6450L4491M3533
$$ plain form
218 27481 43328 14733 -37912 -44782 3397 39671 32744 -5411 -43698 -32093 21123 43911
230 43911 17764 -22396 -42583 -14886 34530 39518 -548 -33646 -33824 2166 41573 29644 -18189
243 -18189 -38319 -18840 18085 40386 14959 -30367 -35655 -3259 29363 33368 -1396 -38375
255 -38375 -27085 13589 34039 20684 -15866 -38779 -13724 26665 32236 5872 -26568 -33268
267 -33268 1239 34939 24663 -9723 -30695 -22169 14070 36725 12989 -23073 -29872 -7476
279 -7476 23933 31160 -393 -30604 -23386 6736 28660 21727 -12777 -32799 -12961 18699 28423
292 28423 9629 -22771 -29723 -107 26581 22112 -3714 -27078 -21849 11456 29866 12822 -15355
305 -15355 -26420 -10084 20121 27209 1763 -23407 -22098 2127 25878 19841 -9774 -26316 -13043
$$ packed form
218B7481J5847k8595n2645o870M8179L6274o927l8155l8287J1605N3216K2788
230D3911k6147m0160k0187K7697M9416M988m0066l3098j78L5990L9407j1929m7833
243a8189k0130J9479L6925K2301k5427m5326n288L2396L2622M005l4764l6979
255c8375J1290M0674K0450j3355l6550k2913K5055M0389N571k6364l2440o700
267c3268L4507L3700j0276l4386k0972Q526L6239K2655k3736l6062o799K2396
279g476L1409P227l1553l0211P218L0122K1924o933l4504k0022J9838L1660R724
292B8423j8794l2400o952K9616K6688m469k5826k3364N229L3305J8410j7044k8177
305a5355j1065J6336L0205P088k5446k5170J309K4225K3751o037k9615j6542J3273
$$ plain form
318 -13043 12355 25898 10744 -18584 -25119 -2533 20363 21251 -481 -23382 -19043 7463 23708
331 23708 13644 -10475 -24656 -10257 16231 22822 3941 -17995 -21018 52 21644 17483 -5798
344 -5798 -21265 -14019 8865 23299 9697 -14406 -21142 -4826 15917 20064 976 -19248 -16897
357 -16897 4347 20146 13560 -7820 -21081 -9476 12332 19283 5929 -14338 -19290 -1526 17624
370 17624 15753 -2929 -17877 -13746 6417 19511 9981 -11036 -18523 -5884 12816 17435 2277
383 2277 -15448 -15195 1836 16971 12906 -5907 -17135 -9648 8404 17169 6810 -11785 -16452
396 -16452 -2097 13539 14141 -349 -15061 -12575 4523 16409 9341 -7703 -15558 -6686 9693
409 9693 15211 3158 -12500 -13545 501 13812 11728 -3337 -14487 -9116 6702 14831 6521
$$ packed form
318a3043K5398J3543j5154k9328o535K2586K2896Q88k1732k2901M339K6506J6245
331B3708j0064k4119j4181J4399K6488O591j8881k1936l023K1070K1592m161k3281
344e798j5467P246K2884J4434j3602k4103o736J6316K0743M147j9088k0224K351
357a6897K1244J5799o586k1380j3261J1605K1808O951j3354k0267m952J7764J9150
370A7624j871j8682j4948M131K0163J3094r530k1017p487J2639J8700M619j5158
383B277j7725K53J7031J5135m065j8813j1228P487J8052Q765j0359j8595m667
396a6452J4355J5636O02j4490j4712K486J7098J1886p068j7044p855Q872J6379
409I693N518j2053j5658j045J4046J3311k084j5065j1150N371J5818Q129q310
$$ plain form
422 6521 -8993 -14047 -3334 10971 12970 569 -12523 -11105 2570 13167 8899 -5233 -13597
435 -13597 -6438 7728 13262 3593 -9928 -12103 -975 11121 10942 -2138 -12089 -8218 4650 12176
449 12176 6433 -6658 -12318 -3682 8860 10971 1370 -9761 -10297 1333 11277 8568 -4144 -11639
463 -11639 -6113 5891 11620 4186 -8022 -10492 -1373 9132 9222 -1102 -10173 -7544 2894 10175
477 10175 6242 -5134 -10195 -3570 6394 9219 2416 -7936 -9179 562 9374 7214 -2109 -9553
491 -9553 -6163 4684 9890 3847 -5768 -9069 -2211 7806 8528 -419 -7547 -6787 1376 8929 5827
506 5827 -3860 -8405 -3783 4686 8923 2479 -6629 -7547 -197 6826 6960 -1035 -8446 -5662 3469 8088
522 8088 3600 -4580 -8057 -2221 5843 7178 463 -6240 -6668 930 7588 4907 -2628 -6657 -3758
$$ packed form
422F521j5514n054J0713J4305J999j2401j3092J418J3675J0597m268j4132q364
435a3597P159J4166N534r669j3521k175J1128J2096j79j3080r951L871J2868P526
449A2176n743j3091n660Q636J2542K111r601j1131n36J1630R944k709j2712p495
463a1639N526J2004N729p434j2208k470R119J0505R0j0324r071K629J0438P281
477A0175l933j1376n061O625R964K825o803j0352j243R741Q812k160r323p444
491i553L390J0847N206o043r615l301O858J0017P22q947p128P60Q163P553l102
506E827r687m545M622Q469M237o444r108r18P350P023J34p995p411K784R131M619
522H088m488q180l477N836Q064J335o715o703m28P598O658k681p535m029K899
$$ plain form
537 -3758 3417 7637 2221 -5483 -6589 -1074 5736 6423 -423 -6865 -4645 2071 6548 3889 -3508
552 -3508 -6871 -2129 4445 5948 1151 -5193 -6141 534 6093 4759 -1591 -5769 -4179 3226 6146
567 6146 2016 -3745 -5478 -1614 5055 5295 -328 -5256 -4393 1160 5443 3964 -2882 -5608 -2065 3311
583 3311 5430 1774 -4788 -5194 390 4990 3929 -840 -5621 -3530 2805 5107 2420 -2911 -5255
598 -5255 -1533 4190 4398 -242 -4031 -4299 612 5306 3125 -1913 -4599 -2525 2304 5014 1666 -3697
614 -3697 -4179 -507 3492 3805 -588 -4616 -2793 1621 4115 2390 -2538 -4377 -1324 3141 4013 443
630 443 -3101 -3721 202 4116 2735 -1208 -3830 -2654 1702 4167 1469 -3089 -3448 -681 3199 3758
646 3758 -204 -3856 -3039 898 3142 2379 -1628 -3591 -1075 2504 3517 869 -2896 -3198 164 3193
$$ packed form
537c758P175M220n416p704j106N515O810O87o846o442K220O716M477k659p397
552c508l363M742O574J503m797o344r48O675N559j334o350m178J590P405K920
567F146m130n761j733L864O669K40n623m928Q63N553M283j479o846k726L543N376
583C311K119l656o562m06N584M600j061m769m781K091O335K302k687n331k344
598e255L722N723K08m640l789k68M911M694k181n038k686K074M829K710l348n363
614c697m82L672L999L13m393m028J823M414K494j725m928j839L053M465Q72l570
630D43l544o20L923L914j381l943k622J176M356K465k698m558l59K767L880N59
646C758l962l652Q17L937K244p63m007j963K516L579J013k648l765l02L362L029
$$ plain form
662 3193 2437 -463 -3533 -2437 1943 3375 1022 -1507 -3157 -1215 2871 3134 -344 -2912 -2541 151
678 151 3285 2394 -1498 -3099 -1049 1624 3326 993 -2511 -2883 -133 2574 2541 -226 -2782 -1782
694 -1782 1065 2619 1550 -1310 -2782 -529 2480 2451 -124 -2170 -2197 245 2614 1960 -1250 -2540
710 -2540 -1542 888 2904 835 -2026 -2146 -209 1951 2045 -192 -2359 -1768 687 2041 1483 -1113 -2570
727 -2570 -877 1466 1795 755 -1331 -2107 226 1871 1635 -599 -2138 -1688 1092 2261 727 -1305
743 -1305 -1936 -610 1464 1965 -226 -1715 -1444 220 1827 1559 -938 -2047 -863 1262 1780 709
759 709 -1543 -1852 9 1365 1200 -216 -1975 -1121 626 1739 584 -1020 -1616 -705 1796 1366 165
776 165 -1444 -1431 255 1327 823 -826 -1646 -691 631 1630 800 -1407 -1117 -149 883 1314 -87 -1518
$$ packed form
662C193p56k900l070J096M380J432k353k529j650J942M086K63l478k568L71K692
678A51L134q91l892j601K050K673J702k333l504l72K750K707l3k767k556J000
694a782K847J554j069k860j472K253L009k9k575k046k7K442K369o54l210j290
710b540R98K430K016k069k861j20J937K160R4k237k167N91K455J354n58k596j457
727b570J693K343L29j040k086p76K333J645k36k234j539M50K780J169j534k032
743a305o31J326K074N01k191j489K71J664J607k68k497j109J184K125N18j071
759G09k252l09J861J356j65j416j759Q54J747J113j155j604n96R11K501m30j201
776A65j609J3J686J072n04j649q20R55J322R99q30k207K90R68J032M31j401j431
$$ plain form
794 -1518 -1152 512 1794 824 -541 -1315 -653 885 956 484 -1308 -1036 -37 1263 837 -337 -1055 -978
812 -978 704 1336 376 -932 -1243 -38 1079 1419 -157 -1140 -929 160 1101 983 -752 -1357 -451 463
830 463 990 531 -736 -1109 -205 728 972 -327 -1131 -1073 256 1184 283 -816 -1074 -523 930 831 215
849 215 -763 -970 191 762 822 -347 -807 -530 338 767 304 -705 -813 -117 883 856 159 -749 -460 374
869 374 537 302 -102 -852 -32 252 780 -144 -555 -721 31 910 553 -190 -739 -396 338 621 279 -394
889 -394 -811 -175 460 782 -188 -771 -549 308 670 190 -194 -831 -185 708 290 249 -508 -428 379 781 262
910 262 -160 -564 -210 -50 642 307 -374 -517 -58 556 665 109 -301 -254 -81 520 466 -113 -520 -166 109
931 109 547 -72 -401 -338 249 441 438 -38 -551 -354 65 402 124 55 -473 5 267 378 265 -645 -654 154
$$ packed form
794a518L66J664J282r70j365p74O62J538P1m72j792K72R99J300m26j174p18P7
812i78J682O32r60j308l11J205J117L40j576r83K11J089R41j18j735o05R06R14
830D63N27m59j267l73R04R33K44j299q04N8J329R28r01j099k58N51J453r9o16
849B15r78k07J161N71O0j169m60K77Q68M29m63j009j08O96J000k7o97r08K89Q34
869C74J63k35m04p50Q20K84N28r24m11j66P52Q79l57p43n49L43P34K83l42o73
889c94m17O36O35L22r70n83K22Q57L62m80l84o37O46Q93m18m1p57Q0Q07M02n19
910B62m22m04L54J60O92l35o81j43M59O14J09n56m10M7J73O01n4n79m07L54K75
931A09M38o19l29O3N87J92lm76n13J97M19L37k78o9n28M78K62J11j13r10rQ08
$$ plain form
953 154 66 347 -93 -328 -139 149 166 195 -382 -247 169 324 294 258 -59 -415 -125 -6 -125 -42 -263 -186 115
976 115 136 73 -100 -197 125 201 243 -95 -248 74 229 125 -1 -194 -181 176 264 87 71 -27 -484 66 84 11
1000 11 -332 -253 -28 141 448 -56 93 -370 128 24 76 200 -293 -129 1 125 144 18 -231 -114 40
1021 40 297 -90 150 31 12 309 264 -167 -359 -188 159 170 560 -284 -430 -139 253 4 80 -323 26 -107
1043 -107 46 109 -134 -29 -62 -7 -10 -48 32 -188 271 -149 29 50 -143 128 84 -343 -41 -33 166 42 -393 -304
1067 -304 -211 -522 -242 -129 -88 107 822 -241 255 -185 -156 -160 103 -68 -62 181 135 -255 -82 -277 176 -26
1089 -26 143 223 -31 -211 -62 113 152 -11 213 38 -92 7 -40 5 -268 54 -105 164 -152 -271 -100 -108 -135
1112 -135 -78 -215 113 66 134 28 195 299 -262 -56 30 176 207 -198 13 -419 -175 -154 147 -114 104 258
$$ packed form
953A54q8K81m40k35J89K88J7K9n77J35M16J55l0l6l17l56K90J19j19Q3k21P7L01
976A15K1o3j73r7L22P6M2l38j53L22J55j04j26j93J3L57Q8j77j6r8m57N50J8p3
1000A1l43P9K25J69L07n04J49m63M98j04N2J24m93J64J30J24J9j26k49J17J54
1021D0K57l87K40j19j9K97m5m31j92J71L47J1L90q44j46K91L92k49P6m03L49j33
1043a07J53O3k43J05l3N5ll8Q0k20M59m20J78K1j93K71m4m27L02QJ99j24m35Q9
1067c04R3l11K80J13M1J95P15j063M96m40K9mK63j71OK43m6l90J73j95M53k02
1089b6J69Q0k54j80J49J75L9j63K24j75j30R9m7M5k73L22j59K69l16j19J71qk7
1112a35N7j37L28m7O8j06J67J04n61K06Q6J46L1m05K11m32K44K1L01k61K18J54
$$ plain form
1134 258 -123 237 197 135 -119 170 -282 -17 -6 -127 -177 -222 59 -11 119 -80 267 162 -152 -263 -130 -255
1156 -255 -239 96 191 160 442 -54 45 -18 -152 11 66 50 -34 1 -38 223 -203 -40 -82 -138 -9 1 74 -68 304
1181 304 -410 73 148 -46 -287 87 123 -183 97 -300 276 -210 -92 266 -319 -62 393 -26 -152 52 -1
1202 -1 -75 128 52 -172 8 -7 309 -371 -195 -149 29 413 294 -18 129 172 48 -5 -115 408 55 111 316
1225 316 96 -66 47 -72 -71 180 -143 -99 -205 -415 -286 -62 98 -116 125 -18 113 270 -150 266 -87
1246 -87 111 -283 68 109 -195 -62 164 -118 -72 -151 -373 -248 217 16 -148 90 94 190 -86 -246 -35 -111 -60
1269 -60 213 -78 246 -145 -225 -21 251 -79 178 -7 -81 -122 296 24 -68 -95 -84 233 278 100 -269 26 -137
1292 -137 -44 120 -134 -157 -123 243 -118 -73 -297 -390 136 -163 -126 161 119 -11 51 218 -86 63 86 -94 113
$$ packed form
1134B58l81L60m0o2k54K89m52K65J1j21n0m5K81p0J30j99L47j05l14j11J33j25
1156b55J6L35R5l1K82m96R9o3j34J63N5j6q4L5l9K61m26J63m2n6J29J0P3j42L72
1181C04p14M83P5j94k41L74L6l06K80l97N76m86J18L58n85K57M55m19j26K04n3
1202ap4K03p6k24J80j5L16o80J76M6J78L84j19l12J47M3j24n3j10N23l53N6K05
1225C16k20j62J13j19JK51l23M4j06k10J29K24J60k14K41j43J31J57m20M16l53
1246h7J98l94L51M1l04J33K26k82M6p9k22J25M65k01j64K38MR6k76j60K11p6N1
1269f0K73k91L24l91q0K04K72l30K57j85p4m1M18k72r2k7J1L17M5j78l69K95j63
1292a37R3J64k54k3L4L66l61M5k24r3N26k99L7K87m2j30O2J67l04J49K3j80K07
$$ plain form
1315 113 258 -157 -36 108 -111 -14 261 -195 -77 -36 -175 118 61 -98 -138 -378 259 -115 -181 -252 -371 -1
1337 -1 59 -214 -113 -174 -14 -225 -86 50 -270 -339 28 143 -101 140 -437 -22 -322 71 -75 -389 -155 250
1359 250 -307 15 -143 152 -364 -207 -33 -12 -211 -158 -162 -144 -134 17 -84 -212 -8 146 -51 -360 -78 -85 76
1382 76 213 208 33 -111 171 57 401 154 -21 -29 -118 177 275 -169 -3 -148 -80 140 128 -67 67 -274 208
1405 208 21 -36 -168 155 50 -32 283 171 -101 -272 -152 -320 -52 12 -103 17 -14 20 48 -76 109 165
1427 165 8 230 48 55 -154 -6 73 112 -257 229 56 225 -184 -95 171 181 -47 -114 -191 -148 65 181 -27
1450 -27 -1 -111 151 -38 -172 282 -17 -138 -219 -365 168 97 -250 -13 76 -87 -463 -140 77 123 25 -144
1472 -144 -113 112 -153 112 -212 39 117 107 -390 -114 -119 273 29 154 -177 -253 -102 163 -73 -103 -43 -81 -30
$$ packed form
1315A13J45m15J21J44k19R7K75m56J18M1j39K93n7j59m0k40O37l74o6p1j19L70
1337aO0k73J01o1J60k11J39J36l20o9L67J15k44K41n77M15l00L93j46l14K34M05
1359B50n57L22j58K95n16J57J74K1j99N3mJ8J0J51j01j28K04J54j97l09K82pJ61
1382G6J37nj75j44K82j14L44k47j75qq9K95R8m44J66j45O8K20j2j95J34l41M82
1405B08j87n7j32L23j05q2L15j12k72j71J20j68K68O4j15J20l1L4K8j24J85N6
1427A65j57K22j82Pk09J48P9L9l69M86j73J69m09Q9K66J0k28o7p7M3K13J16k08
1450b7K6j10K62j89j34M54k99j21q1j46N33p1l47K37Q9j63l76L23K17M6r8j69
1472a44L1K25k65K65l24K51P8j0m97K76nL92k44J25l31p6J51K65k36l0O0l8N1
$$ plain form
1495 -30 354 -85 399 -27 266 8 76 166 143 13 143 145 -70 101 -99 89 136 -38 -152 23 -371 -7
1517 -7 215 -34 -183 -46 0 125 11 -49 -48 260 -24 279 -210 -430 -111 349 43 -97 2 -266 102 -100
1539 -100 134 -133 1 -4 112 -47 105 268 -237 38 -222 -209 273 -315 -16 -111 -190 150 -13 -30 40 171
1561 171 241 -36 53 -247 -145 -223 -95 158 -186 70 58 80 -199 4 -251 254 220 -169 114 -386 -28 129
1583 129 -249 182 174 -66 2 133 -22 17 63 118 353 -216 162 -69 43 55 187 112 179 -139 17 -38 224
1606 224 -13 80 -64 -325 -304 -65 123 187 11 20 -43 348 -101 -334 99 -224 22 -38 -78 142 28 360 -272
1629 -272 13 -141 81 117 -191 -299 -213 -94 -376 -144 -16 -77 -6 -139 -377 357 96 -138 -1 318 -81
1650 -81 28 -16 -18 325 -260 -72 -125 256 46 175 228 -163 349 -41 172 -298 -98 74 23 132 -89 126
$$ packed form
1495c0L84m39M84m26K93k58O8R0k3j30J30Kk15J71k00J88M7j74j14J75l94L64
1517gK22k49j49J37M6J25j14o0JL08k84L03m89k20L19M60l06j40R9k68L68k02
1539a00K34k67J34nJ16j59J52J63n05K75k60J3M82n88K99r5p9L40j63j7P0J31
1561A71P0k77Q9l00J02p8J28K53l44K56j2K2k79K03k55N05l4l89K83n00L58J57
1583A29l78M31qk40O8J31j55L9M6N5K35n69L78k31J12J2J32p5O7l18J56n5K62
1606B24k37R3j44k61K1K39J88O4j76Ro3L91m49k33M33l23K46o0m0K20j14L32o32
1629b72K85j54K22L6l08j08Q6J19k82K32J28o1P1j33k38P34k61k34J37L19l99
1650h1J09m4kL43n85J88n3L81k10J29N3l91N12l90K13m70K00J72n1J09k21K15
$$ plain form
1672 126 10 44 84 -131 -240 -28 434 -92 -9 -35 -304 -83 64 5 -52 -224 -60 144 91 125 228 -267 -69
1695 -69 122 -111 0 -10 -105 117 6 7 -172 -128 -89 114 -96 -239 208 11 -90 187 245 129 29 -215 10
1718 10 3 9 -90 -61 159 223 95 -69 17 -247 433 485 38 -84 -132 119 -16 -17 84 -260 -337 32 15 -172 175
1743 175 -53 43 84 87 284 145 -109 88 -178 172 -112 -175 3 65 69 196 66 -306 158 -312 24 -151 -159
1766 -159 53 -199 228 93 25 71 -92 362 86 -272 49 -206 -100 67 -56 -51 9 -15 -72 -91 20 236 -10
1789 -10 148 28 548 24 30 -59 -240 434 -14 4 -110 54 -240 300 299 98 100 -47 -198 100 -11 -233 250
1812 250 -82 -51 188 -162 30 -1 394 -240 -38 -246 -277 -114 -187 -316 -200 -178 10 -34 -196 252 -50 -109
1834 -109 -241 147 124 171 -453 -155 70 328 62 -153 -82 44 -23 71 -254 -210 64 -106 193 -405 92 225
$$ packed form
1672A26j16L4M0k15j09K12M62n26Q3k6k69K21J47n9n7j72J64K04n3L4J03m95J98
1695f9J91k33J11j0r5K22j11Jj79M4L9K03k10j43M47j97j01K77N8j16j00k44K25
1718A0pOr9K9K20O4j28j64Q6k64O80N2m47j22m8K51j35jJ01l44p7L69j7j87L47
1743A75k28R6M1LJ97j39k54J97k66L50k84o3J78O2MJ27j30l72M64m70L36j75q
1766a59K12k52M27j35o8M6j63M54k76l58L21k55J06J67j23NO0k4n7j9J11K16k46
1789a0J58j20N20n24Oq9j81O74m48J8j14J64k94N40jk01Kj47j51K98j11k22M83
1812B50l32L1K39l50J92l1L95o34K02k08l1J63p3j29J16K2J88m4j62M48l02n9
1834a09j32L88k3M7o24K98K25K58k66k15P1J26o7R4l25M4K74j70K99n98M97J33
$$ plain form
1856 225 -118 124 -99 -88 127 213 222 -121 -32 38 -185 55 6 137 51 502 -172 -113 234 41 -200 -247 -249 197
1880 197 258 50 77 286 -30 214 344 -144 -278 84 -176 107 239 -44 78 -32 187 -112 -76 -375 -152
1901 -152 -21 -118 33 -5 188 6 21 122 128 169 0 115 -93 315 208 47 15 -130 -45 -48 75 202 115 -248
1925 -248 5 -142 183 234 -36 -22 197 129 -210 -23 25 -235 120 270 66 -83 -208 5 113 -36 309
1946 309 -131 -80 233 45 -223 -178 207 305 -117 7 17 133 45 -162 0 256 -121 63 76 6 31 131 184
1969 184 -164 41 274 -116 1 -118 -27 240 20 -29 -96 199 54 -206 210 39 -35 -108 -12 -92 -221 107
1991 107 -7 -205 -72 -6 18 197 -155 499 -93 -120 -15 -179 15 -78 26 -6 206 -109 -150 178 -171 -3
2013 -3 -176 -100 38 66 -138 -135 154 -26 268 25 377 89 -175 -255 -6 -232 -40 -141 237 87 -130 210
$$ packed form
1856B25l43K42k23J1K15Q6Rl43Q9P0k23K40m9J31q6M51o74N9L47j93k41m7kM46
1880A97O1k08K7K09l16K44J30m88j34L62k60K83J32k83J22j10K19k99L6k99K23
1901a52J31r7J51l8J93j82J5J01OM1j69J15k08M08j07j61l2j45Q5lJ23J27q7l63
1925b48K53j47L25N1k70J4K19o8l39J87M8k60L55J50k04j49j25K13J08j49L45
1946C09m40N1L13j88k68M5L85R8m22J24J0J16q8k07J62K56l77J84J3p0K5J00N3
1969A84l48K05K33l90J17j19R1K67k20m9o7K95j45k60M16j71p4p3R6q0j29L28
1991A07j14j98J33O6K4J79l52O54n92k7J05j64J94r3J04l2K12l15m1L28l49J68
2013cj73P6J38K8k04LK89j80K94k43L52k88k64q0K49k26J92j01L78j50k17L40
$$ plain form
2035 210 -96 70 79 350 -118 -247 -72 39 -9 293 232 -202 -187 19 172 -116 -336 -137 -176 436 -525 153
2057 153 141 -30 191 -13 289 -210 -55 -282 -113 -72 -6 -299 32 -132 -191 -152 173 -163 178 92 10 -197
2079 -197 -159 308 71 195 -54 255 131 18 150 79 125 185 -118 41 376 400 -155 139 -236 42 -274 -102
2101 -102 -39 -93 -39 111 359 -129 -51 120 76 -72 -13 29 -127 288 516 205 -170 45 -87 200 116 144 -225
2124 -225 53 -42 242 151 112 157 -120 -36 -160 64 120 -143 82 -22 12 21 -352 -191 153 14 -61 336 228
2147 228 -93 -110 266 68 105 -54 166 433 236 -44 125 -61 -79 105 202 73 166 -275 192 224 231 -297 -91
2170 -91 248 233 65 -12 20 -1 207 117 160 180 -282 -356 -309 124 -67 -235 -361 -356 329 -258 76 -331 47 -166
2194 -166 137 133 146 3 -220 41 272 364 -82 156 -66 128 100 14 118 -243 -137 -143 -96 -127 201 -35 104
$$ packed form
2035B10l06J66RK71m68j29J75J11m8L02o1m34J5K06J53k88k20J99l9O12r61O78
2057A53j2j71K21k04L02m99J55k27J69M1O6k93L31j64n9L9L25l36L41q6q2k07
2079a97L8M67k37J24k49L09j24j13J32p1M6O0l03J59L35K4n55K94l75K78l16J72
2101a02O3n4N4J50K48m88P8J71m4j48N9M2j56M15K28l11l75K15j32K87q4K8l69
2124b25K78r5K84r1l9M5k77Q4j24K24N6k63K25j04L4Rl73J61L44j39p5L97j08
2147B28l21j7L76j98L7j59K20K67j97k80J69j86j8J84R7j29R3m41M67L2Pn28K06
2170i1L39j5j68p7L2k1K08r0M3K0m62p4M7M33j91j68j26NO85n87L34m07L78k13
2194a66L03mJ3j43k23K61K31R2m46K38k22J94k8q6J04l61J06oM7l1L28k36J39
$$ plain form
2217 104 -38 -9 104 -261 154 -117 9 -73 -194 -235 -200 13 108 118 333 -244 39 184 56 89 -25 313
2239 313 -79 41 -285 242 94 -120 -223 32 -43 67 26 -5 104 79 -22 130 72 -109 76 -514 197 320
2261 320 -259 103 245 36 104 -134 215 79 -80 -310 49 -50 9 -17 43 13 -168 170 24 -12 137 -112
2283 -112 111 5 296 81 206 62 78 124 118 182 -147 121 -101 222 35 103 96 49 -203 14 192 -91 34
2306 34 470 375 361 -4 -337 129 -242 18 -213 -333 38 343 234 196 54 103 -165 123 -68 -7 99 -67
2328 -67 -284 153 -173 -243 268 -119 221 83 -16 -82 16 -44 116 -254 -110 -150 -289 121 -169 -97 -116 -160 89
2351 89 -140 292 -38 -470 58 -64 30 -99 57 173 74 59 66 -125 235 170 170 -186 112 -131 -101 -48 -151 -52
2375 -52 166 145 -89 -116 -28 189 -162 -119 5 -10 -74 -137 81 -153 -12 243 113 134 108 37 -231 123 249 -235
$$ packed form
2217A04j42K9J13l65M15k71J26q2j21m1L5K13R5J0K15n77K83J45j28L3j14L38
2239C13l92J20l26N27j48k14j03K55p5J10m1l1J09k5j01J52n8j81J85n90P11J23
2261C20n79L62J42k09O8k38L49j36j59k30L59r9N9k6O0l0j81L38j46l6J49k49
2283a12K23j06K91k15J25j44J6M6oO4l29K68k22L23j87O8pm7k52K17J78k83J25
2306C4M36r5j4l65l33M66l71K60k31j20L71L05j09l8j42M9k68K88j91O1J06j66
2328f7k17M37l26p0N11l87L40j38r9o6R8o0J60l70J44m0j39M10k90P2j9m4K49
2351H9k29M32l30m32N28j22R4j29J56J16r9j5Pj91L60o5%l56K98k43L0N3j03R9
2375e2K18k1k34k7Q8K17l51M3J24j5o4o3K18k34J41K55j30K1k6p1k68L54J26m84
$$ plain form
2399 -235 -273 72 18 -51 60 31 235 120 30 -126 163 99 209 -151 157 -93 -87 169 -127 -137 -184 55 -108
2422 -108 82 -143 58 -180 15 55 -17 -131 48 -97 46 298 -205 -67 140 202 159 4 372 -370 179
2443 179 212 0 -61 161 -306 51 -201 -11 133 -28 -10 258 -213 -56 -61 -40 -23 92 66 -206 -51 88 37
2466 37 297 76 -187 -245 -367 -79 213 -66 -50 101 -499 50 122 145 -100 -99 123 80 -29 -298 142 245 -30
2489 -30 183 74 -31 -216 48 -114 71 167 13 25 264 222 -91 94 -116 193 72 -159 213 -165 318
2510 318 120 136 153 -26 -291 -136 -102 70 98 57 -54 -74 -7 -100 -150 -247 -129 136 182 -56 88 11 29 1 148
2535 148 21 -246 235 -76 -102 19 227 -140 83 139 42 82 296 -114 -261 232 -78 -125 -262 -31 -72 -134
2557 -134 -143 98 -275 3 115 -173 104 171 -168 111 -173 179 -6 -41 -56 378 82 -136 -110 -358 -56 41
$$ packed form
2399b35l8L45n4o9J11k9K04j15r0j56K89o4J10l60L08k50OK56k96j0m7K39j63
2422a08J90k25K01k38J95M0p2j14J79j45J43K52n03J38K07O2m3j55L68p42N49
2443A79L3k12o1K22m67L57k52J90J44j61J8K68m71J57nK1J7J15k6k72J55J39n1
2466C7K60k21k63n8j22K88K92k79J6J51o00N49P2K3k45JK22m3j09k69M40J03k75
2489c0K13j09j05j85K64j62J85R6j54J2K39m2l13J85k10L09j21k31L72l78M83
2510C18j98J6J7j79k65J55L4J72K8m1j11k0O7r3n0r7J18K65M6k38J44p7J8k8J47
2535A48j27k67M81l11k6J21K08l67K23N6r7M0K14m10j47M93l10m7j37K31m1o2
2557a34rK41l73K78J12k88K77O7l39K79k84L52j85l5j5M34k96k18K6k48L02R7
$$ plain form
2579 41 -251 -218 -100 -2 -70 92 -92 -12 -57 29 107 161 14 309 419 -271 -166 163 -47 151 15 -182 -46
2602 -46 -354 -161 21 -347 -137 -189 89 24 192 -10 -207 130 -117 210 -28 -225 -238 60 90 -14 164 -320
2624 -320 399 258 -11 129 -85 73 -109 104 91 24 -40 131 216 -139 175 -96 -266 -145 -111 392 19 167
2646 167 -93 -269 109 236 -190 295 255 -171 120 115 -171 -113 103 176 58 -24 61 -68 116 -250 177 -36
2668 -36 -346 -283 -38 -233 12 172 -46 -27 190 -126 -153 -289 11 -25 -235 -303 142 -4 -224 -88 54 -166
2690 -166 91 -41 -219 -168 279 -214 -154 -186 -188 -253 40 197 -207 -326 -145 -61 295 53 -6 46 -19 78 -27 -92
2714 -92 -83 134 -188 -29 -393 7 -89 80 101 28 -265 22 106 2 166 -5 -427 240 71 -108 122 1
2736 1 -410 44 196 -287 9 26 -26 -240 37 31 -123 -30 73 -117 2 -122 -355 152 206 14 -141 30 -70
$$ packed form
2579D1k92L3J18R8o8J62j84Q0m5Q6P8N4j47K95J10o90J05L29k10J98j36j97J36
2602d6l08J93J82l68K10n2K78o5J68k02j97L37k47L27k38j97j3K98L0j04J78m84
2624c20P19j41k69J40k14J58j82K13j3o7o4J71Q5l55L14k71j70J21L4N03l73J48
2646A67k60j76L78J27m26M85m0m26K91nk86N8K16P3j18q2Q5j29J84l66M27k13
2668c6l10O3K45j95K45J60k18J9K17l16k7j36L00l6k10o8M45j46k20J36J42k20
2690a66K57j32j78N1M47m93O0l2ko5K93J57m04j19J81Q4L56k42n9N2o5R7j05o5
2714i2RK17l22J59l64M00r6J69K1p3k93K87Q4j04J64j71m22O67j69j79K30j21
2736Am11M54J52m83K96J7n2k14K77oj54R3J03j90J19j24k33N07N4j92j55J71j00
$$ plain form
2759 -70 111 -185 152 88 -397 -363 64 -14 47 256 46 66 99 -117 -477 -270 -214 -87 179 -144 -85 -5 172
2782 172 -305 81 -109 -511 89 8 87 -61 69 -290 56 117 62 217 -190 -55 241 295 106 211 -20 -11
2804 -11 184 118 -151 -84 260 -340 -239 -122 -181 146 12 -80 -110 35 -103 197 -41 -303 -115 70 94 59 129
2827 129 -110 102 218 426 -402 -197 40 -75 -36 -64 -71 73 8 -112 -27 -44 52 38 -17 -13 243 -65 -154 -76 132
2852 132 108 208 -38 73 0 -274 35 21 -137 253 410 38 23 -142 -12 4 161 -41 -2 -231 -301 -218 -193
2875 -193 226 128 -62 -256 -9 -1 -66 -111 -193 69 -216 -231 7 -3 -27 -103 99 -27 -234 -36 87 157 147 -162
2899 -162 -189 -34 199 -249 -58 -35 192 -473 -55 276 101 -141 -245 41 -46 316 0 59 273 -254 -39
2920 -39 -92 -189 163 -129 85 292 15 -80 110 10 105 375 -241 -24 -163 -96 -290 -137 -125 142 -17 239
$$ packed form
2759g0J81k96L37o4m85L4M27p8O1K09k10K0L3k16l60K07N6J27K66l23N9Q0J77
2782A72m77L86j90m02O00q1P9j48J30l59L46O1n5J55m07J35K96N4j89J05k31R
2804a1J95o6k69O7L44o00J01J17n9L27j34r2l0J45j38L00k38k62J88J85K4l5P0
2827A29k39K12J16K08q28K05K37j15L9k8pJ44o5j20Q5j7R6j4n5MK56l08q9P8K08
2852A32k4J00k46J11p3k74L09j4j58L90J57l72j5j65J30J6J57k02L9k29p0Q3K5
2875a93M19r8j90j94K47Qo5m5q2K62k85j5K38j0k4p6K02j26k07J98J23P0j0l09
2899a62k7J55K33m48J91K3K27o65M18L31j75k42j04K86q7L62l16N9K14n27K15
2920c9n3r7L52k92K14K07k77r5J90j00R5K70o16K17j39O7j94J53J2K67j59K56
$$ plain form
2942 239 -119 -201 -96 -22 69 2 -161 260 206 63 31 -9 70 -140 64 -292 106 162 150 -56 -55 -96 -173 -51 187
2967 187 -102 -359 -143 114 -86 26 82 -67 386 138 -95 133 121 42 200 -111 184 -188 156 -86 36
2988 36 20 -5 -367 -208 -195 96 -536 -78 79 -16 -55 318 -122 -10 -82 -133 -59 218 193 -9 60 154 -50 29
3012 29 -147 -81 83 118 -171 66 215 -22 11 -187 125 -60 207 157 -405 111 45 -143 22 -88 103 59
3034 59 -124 -46 15 -129 54 62 6 94 -8 -2 199 -248 16 13 123 -37 -115 -463 121 -160 -61 -109 85 -169 -59
3059 -59 26 -75 136 25 158 -153 -205 185 -24 333 39 100 72 -200 35 22 -67 -38 -21 29 112 -7 -5 37 -37
3084 -37 -287 -70 109 108 130 37 25 -53 -39 222 76 170 66 -42 -407 -169 -133 -56 -177 119 -229 49 122 -38
3108 -38 -146 -74 -43 -518 56 55 15 -32 76 -74 -260 4 353 167 -137 243 74 101 281 -302 13 -14 70
$$ packed form
2942B39l58q2J05P4R1o7j63M21n4j43l2m0P9k10K04l56L98N6j2k06Jm1p7J22K38
2967A87k89k57K16K57k00J12N6j49M53k48k33K28j2p9J58l11K95l72L44k42J22
2988C6j6k5l62J59J3K91o32M58J57r5l9L73m40J12p2n1P4K77k5k02O9R4k04P9
3012B9j76O6J64L5k89K37J49k37L3j98L12j85K67n0n62N16o6j88J65j10J91m4
3034E9j83P8O1j44J83Qn6Q8j02OK01m47K64lJ10j60p8l48N84k81R9m8J94k54J10
3059e9Q5j01K11j11J33l11n2L90k09L57k94O1k8k72K35j3q9K9J7N0Q3j19KM2p4
3084c7k50K17J79jK2r3j2p8J4K61j46R4j04j08l65K38L6P7j21K96l48K78P3j60
3108c8j08P2L1m75N74jm0m7J08j50j86K64L49j86l04L80j69K7J80n83L15k7Q4
$$ plain form
3131 70 23 61 137 248 -27 54 92 0 126 233 -218 -178 169 199 -240 95 -175 -13 126 -96 -324 -1 69
3154 69 -76 21 65 -11 -167 18 -136 -231 -383 -38 -115 129 282 -40 -176 7 137 192 -47 189 -71 -76 -182
3177 -182 -137 -101 56 142 213 -88 45 -217 -78 -75 143 -21 319 -244 141 3 67 -157 -65 41 -61 -108 227
3200 227 -174 68 -79 -154 351 -384 -125 50 77 102 -130 2 90 -142 41 -41 61 91 -28 -104 -169 67 -246
3223 -246 -24 -64 -140 115 -38 44 -43 35 122 41 -254 277 226 -180 40 -35 282 70 147 -62 29 -213 10 291
3247 291 -88 -191 -226 81 142 -223 -179 73 -24 -165 -13 138 -141 -221 -156 9 208 31 -226 -103 96 -237
3269 -237 -193 67 -12 -117 145 -81 237 -377 11 33 30 340 -73 -32 -108 -54 -52 104 26 428 144 441 191 274
3293 274 -207 -8 -10 -83 -84 -418 -44 -225 135 -9 233 -388 -6 -58 -86 -268 -45 -367 6 -201 278 216 -254
$$ packed form
3131G0m7L8P6J11k75Q1L8r2J26J07m51M0L47L0m39L35k70J62J39k22k28L23P0
3154F9j45R7M4p6j56J85j54r5j52L45p7K44J53l22j36J83J30N5k39K36k60nj06
3177a82M5L6J57Q6P1l01J33k62J39LK18j64L40n63L85j38O4k24R2J06j02m7L35
3200B27m01K42j47p5N05p35K59J75K7K5k32J32Q8k32J83q2J02L0j19p6o5K36l13
3223b46K22m0p6K55j53Q2q7P8Q7q1k95N31n1m06K20p5L17k12P7k09R1k42K23K81
3247B91l79j03l5L07O1l65M4K52r7j41J52J51k79q0O5J65J99j77k57J23J99l33
3269b37M4K60p9j05K62k26L18o14L88K2lL10m13M1p6N4KJ56p8M02k84K97k50Q3
3293B74m81J99kp3jl34L74j81L60j44K42o21L82n2k8j82K23l22L73k07M79o2m70
$$ plain form
3316 -254 190 -177 78 -329 -28 -122 10 -106 -131 284 138 9 -98 176 -26 -38 195 -225 405 253 -48
3337 -48 247 112 -116 230 96 188 21 122 -136 -61 97 -96 173 -66 258 -52 416 -95 45 -114 33
3358 33 36 11 176 -22 0 391 170 -63 457 -32 121 136 -256 179 286 99 137 5 -63 -227 -250 -80 -232
3381 -232 147 -18 -46 49 -104 89 -242 -358 -354 -89 137 -33 -47 -106 135 113 188 73 -99 481 124 -150 -178
3404 -178 218 -69 -122 125 -43 99 -79 -253 104 -171 101 -197 -9 -3 -60 -138 -129 33 -5 -107 34 -3 -94
3427 -94 -51 110 -295 -85 -24 317 -73 -348 -89 -2 -407 72 -77 167 -8 21 -55 8 -41 -199 335 25 83
3450 83 31 -78 -278 -118 121 -191 27 -180 -148 -194 21 21 -145 -67 29 166 -109 -257 -70 144 -228 -237 -113
3473 -113 -159 228 -67 194 -125 -35 -7 -25 199 -209 -301 80 147 -189 -137 205 269 -149 227 -196 -26 -8 -296
$$ packed form
3316b54M44l67K55m07L01r4J32j16k5M15j46j29j07K74k02j2K33m20O30j52l01
3337d8K95j35k28L46j34R2j67J01k58P5J58j93K69k39L24l10M68n11J40j59J47
3358C3Lk5J65j98K2L91k21k33N20m89J53J5l92M35J07j87L8j32o8j64k3J70j52
3381b32L79j65k8R5j53J93l31j16MK65K26j70j4n9K41k2P5j15j72N80l57k74k8
3404a78L96k87n3K47j68J42j78j74L57k75K72k98J88On7p8RJ62l8j02J41l7r1
3427i4M3J61m05K10O1L41l90k75K59Q7m05M79j49K44j75K9p6O3m9j58N34l10N8
3450H3n2j09k00J60K39l12K18k07L2m6K15%j66P8R6J37k75j48J87K14l72rJ24
3473a13m6L87k95K61l19R0K8j8K24m08r2L81O7l36N2L42O4m18L76m23J70J8k88
$$ plain form
3496 -296 259 -157 -8 390 -80 276 49 51 -106 -107 -54 140 157 -69 79 88 291 168 109 199 67 122 16 187
3520 187 109 -3 171 -37 131 69 190 123 311 62 140 33 -50 85 47 310 265 138 -66 -56 -17 -15 -240 -258
3544 -258 79 -208 -61 184 114 -155 129 465 -116 -120 98 1 -184 65 233 7 233 -25 79 -345 195
3565 195 99 -100 110 18 -42 16 -306 -231 326 -166 -297 -183 -237 -73 -46 -111 164 -74 29 -50 -325 12 -201
3588 -201 205 114 149 332 83 13 3 -64 -207 95 -118 -323 17 338 303 288 -42 -27 119 -42 19 404 181
3611 181 48 125 -80 56 -294 -156 402 41 289 167 -174 -293 19 368 -40 514 -209 5 -236 -64
3631 -64 54 -104 63 -89 124 -403 189 238 -114 233 -148 -104 110 230 50 -2 -155 -59 -77 162 -76 -65
$$ packed form
3496b96N55m16J49L98m70L56k27Kj57jN3J94J7k26J48RK03j23n9R0j32N5j06J71
3520A87p8j12J74k08J68o2J21o7J88k49P8j07q3J35l8K63m5j27k04J0L9Kk25j8
3544b58L37k87J47K45p0k69K84L36n81mK18r7j85K49J68k26K26k58J04m24N40
3565A95r6j99K10r2o0N8l22P5N57m92j31J14n4J64K7o5K75k38J03p9k75L37k13
3588b01M06r1L5J83k49p0j0o7j43L02k13k05L40L21l5j5l30J5J46j61O1L85k23
3611A81j33P7k05J36l50J38N58l61K48j22l41j19L12L49m08N54p23K14k41J72
3631f4J18j58J67j52K13n27N92M9l52L47l81M4K14J20j80n2j53R6j8K39k38J1
$$ [...]
8191b08
##END NTUPLES=NMR FID
##END=
