##TITLE=1H_DE-70_oil2
 CDCl3
 8 sc, 
 29.10.2024
##JCAMPDX= 6.0         $$ Bruker NMR JCAMP-DX V2.0
##DATA TYPE= NMR FID
##DATA CLASS= NTUPLES
##ORIGIN= UXNMR, Bruker Analytische Messtechnik GmbH
##OWNER= root
$$ XWIN-NMR		Version 3.5
$$ Tue Oct 29 15:57:43 2024 Russian Standard Time (UT+4h)  she@DPX200
##.OBSERVE FREQUENCY= 200.1318
##.OBSERVE NUCLEUS= ^1H
##.DELAY= (6, 6)
##.ACQUISITION MODE= SIMULTANEOUS
##.ACQUISITION SCHEME= undefined
##.AVERAGES= 8
##.DIGITISER RES= 18
##SPECTROMETER/DATA SYSTEM= spect
##.PULSE SEQUENCE= zg30
##.SOLVENT NAME= CDCl3
##.SHIFT REFERENCE= (INTERNAL, CDCl3, 0, 15.7039)
##AUDIT TRAIL= $$ (NUMBER, WHEN, WHO, WHERE, WHAT)
$$ ##TITLE= Audit trail, XWIN-NMR		Version 3.5
$$ ##JCAMPDX= 5.01
$$ ##ORIGIN= Bruker BioSpin GmbH
$$ ##OWNER= she
$$ F:/spectra/data/she/nmr/H-F/1/audita.txt
$$ ##AUDIT TRAIL=  $$ (NUMBER, WHEN, WHO, WHERE, WHAT)
(   1,<2024-10-29 15:56:28.09 +0400>,<she>,<DPX200>,
      <created by zg, POWCHK disabled, PULCHK disabled
       configuration hash MD5:
       00 E9 B6 7A A2 85 ED C7 34 08 36 98 17 FE 4E 26
       data hash MD5: 16K
       E2 F5 DA A8 2D 88 85 73 2C 4D 83 0D BE 11 B6 51>)
$$ ##END=
$$ 
$$ hash MD5
$$ 55 51 80 4E F7 4C 52 1E 78 BD F2 6B 7F B7 0F A6
##$RELAX= 
##$RELAX= 
##$RELAX= 
##$RELAX= 
##$RELAX= 
##$RELAX= 
$$ Bruker specific parameters
$$ --------------------------
##$DU= <F:/spectra>
##$EXPNO= 1
##$NAME= <H-F>
##$PROCNO= 1
##$TYPE= <nmr>
##$USER= <she>
##$AMP= (0..31)
100 100 100 100 100 100 100 100 100 100 100 100 100 100 100 100 100 100 
100 100 100 100 100 100 100 100 100 100 100 100 100 100 
##$AQSEQ= 0
##$AQ_mod= 1
##$AUNM= <au_zg>
##$AUTOPOS= <>
##$BF1= 200.13
##$BF2= 200.13
##$BF3= 200.13
##$BF4= 200.13
##$BF5= 200.13
##$BF6= 200.13
##$BF7= 200.13
##$BF8= 200.13
##$BYTORDA= 1
##$CFDGTYP= 0
##$CFRGTYP= 5
##$CHEMSTR= <none>
##$CNST= (0..31)
1 1 145 1 1 1 1 1 1 1 1 1 1 1 1 1 1 1 1 1 1 1 1 1 1 1 1 1 1 1 1 1 
##$CPDPRG= <>
##$CPDPRG1= <>
##$CPDPRG2= <>
##$CPDPRG3= <>
##$CPDPRG4= <mlev>
##$CPDPRG5= <mlev>
##$CPDPRG6= <mlev>
##$CPDPRG7= <mlev>
##$CPDPRG8= <mlev>
##$CPDPRGB= <>
##$CPDPRGT= <>
##$D= (0..31)
0 1.2 0 0 0 0 0 0 0 0.06 0 0.03 0 0 0 0 0.0002 0 0 0 0 0 0 0 0 0 0 0 0 
0 0 0 
##$DATE= 1730202987
##$DBL= (0..7)
120 120 120 120 120 120 120 120 
##$DBP= (0..7)
150 150 150 150 150 150 150 150 
##$DBP07= 0
##$DBPNAM0= <>
##$DBPNAM1= <>
##$DBPNAM2= <>
##$DBPNAM3= <>
##$DBPNAM4= <>
##$DBPNAM5= <>
##$DBPNAM6= <>
##$DBPNAM7= <>
##$DBPOAL= (0..7)
0.5 0.5 0.5 0.5 0.5 0.5 0.5 0.5 
##$DBPOFFS= (0..7)
0 0 0 0 0 0 0 0 
##$DE= 6
##$DECBNUC= <off>
##$DECIM= 24
##$DECNUC= <off>
##$DECSTAT= 4
##$DIGMOD= 1
##$DIGTYP= 9
##$DL= (0..7)
0 120 120 120 120 120 120 120 
##$DP= (0..7)
150 150 150 150 150 150 150 150 
##$DP07= 0
##$DPNAME0= <>
##$DPNAME1= <>
##$DPNAME2= <>
##$DPNAME3= <>
##$DPNAME4= <>
##$DPNAME5= <>
##$DPNAME6= <>
##$DPNAME7= <>
##$DPOAL= (0..7)
0.5 0.5 0.5 0.5 0.5 0.5 0.5 0.5 
##$DPOFFS= (0..7)
0 0 0 0 0 0 0 0 
##$DQDMODE= 0
##$DR= 18
##$DS= 0
##$DSLIST= <SSSSSSSSSSSSSSS>
$$ [...]
##$SUBNAM2= <"">
##$SUBNAM3= <"">
##$SUBNAM4= <"">
##$SUBNAM5= <"">
##$SUBNAM6= <"">
##$SUBNAM7= <"">
##$SUBNAM8= <"">
##$SUBNAM9= <"">
##$SW= 24.0689170037331
##$SWIBOX= (0..15)
0 0 2 0 0 0 0 0 0 0 0 0 0 0 0 0 
##$SW_h= 4816.95568400771
##$TD= 16384
##$TD0= 1
##$TE= 0
##$TE2= 300
##$TE3= 300
##$TEG= 300
##$TL= (0..7)
0 120 120 120 120 120 120 120 
##$TP= (0..7)
150 150 150 150 150 150 150 150 
##$TP07= 0
##$TPNAME0= <>
##$TPNAME1= <>
##$TPNAME2= <>
##$TPNAME3= <>
##$TPNAME4= <>
##$TPNAME5= <>
##$TPNAME6= <>
##$TPNAME7= <>
##$TPOAL= (0..7)
0.5 0.5 0.5 0.5 0.5 0.5 0.5 0.5 
##$TPOFFS= (0..7)
0 0 0 0 0 0 0 0 
##$TUNHIN= 0
##$TUNHOUT= 0
##$TUNXOUT= 0
##$USERA1= <user>
##$USERA2= <user>
##$USERA3= <user>
##$USERA4= <user>
##$USERA5= <user>
##$V9= 5
##$VALIST= <valist>
##$VCLIST= <CCCCCCCCCCCCCCC>
##$VD= 0
##$VDLIST= <DDDDDDDDDDDDDDD>
##$VPLIST= <PPPPPPPPPPPPPPP>
##$VTLIST= <TTTTTTTTTTTTTTT>
##$WBST= 1024
##$WBSW= 4
##$XGAIN= (0..3)
0 0 0 0 
##$XL= 0
##$YL= 0
##$YMAX_a= 204119
##$YMIN_a= -217963
##$ZGOPTNS= <>
##$ZL1= 120
##$ZL2= 120
##$ZL3= 120
##$ZL4= 120
##$ABSF1= 10
##$ABSF2= 0
##$ABSG= 5
##$ABSL= 3
##$ALPHA= 0
##$AQORDER= 0
##$ASSFAC= 0
##$ASSFACI= 0
##$ASSFACX= 0
##$ASSWID= 0
##$AUNMP= <proc_1d>
##$AZFE= 0.1
##$AZFW= 0.1
##$BCFW= 1
##$BC_mod= 2
##$BYTORDP= 1
##$COROFFS= 0
##$CY= 11.3945322036743
##$DATMOD= 1
##$DC= 2
##$DFILT= <>
##$DTYPP= 0
##$F1P= 15.6554695791079
##$F2P= 12.8336369535428
##$FCOR= 0.5
##$FTSIZE= 0
##$FT_mod= 4
##$GAMMA= 1
##$GB= 0.15
##$INTBC= 1
##$INTSCL= 1
##$ISEN= 128
##$LB= 0.24
##$LEV0= 0
##$LPBIN= 0
##$MAXI= 10000
##$MC2= 0
##$MEAN= 0
##$ME_mod= 0
##$MI= 1.114404
##$NCOEF= 0
##$NC_proc= 0
##$NLEV= 6
##$NOISF1= 3.799351
##$NOISF2= 2.8
##$NSP= 1
##$NTH_PI= 0
##$NZP= 0
##$OFFSET= 15.70392
##$PC= 1
##$PHC0= -26336.8
##$PHC1= 0.1874294
##$PH_mod= 1
##$PKNL= yes
##$PPARMOD= 0
##$PSCAL= 0
##$PSIGN= 0
##$REVERSE= no
##$SF= 200.130013532006
##$SI= 16384
##$SIGF1= 3
##$SIGF2= 2
##$SINO= 400
##$SIOLD= 16384
##$SREGLST= <1H.CDCl3>
##$SSB= 0
##$STSI= 0
##$STSR= 0
##$SW_p= 3612.71676300578
##$SYMM= 0
##$S_DEV= 0
##$TDeff= 0
##$TDoff= 0
##$TI= <>
##$TILT= no
##$TM1= 0
##$TM2= 0
##$TOPLEV= 0
##$USERP1= <user>
##$USERP2= <user>
##$USERP3= <user>
##$USERP4= <user>
##$USERP5= <user>
##$WDW= 1
##$XDIM= 8192
##$YMAX_p= 0
##$YMIN_p= 0
$$ End of Bruker specific parameters
$$ ---------------------------------
##NTUPLES= NMR FID
##VAR_NAME=  TIME,          FID/REAL,        FID/IMAG
##SYMBOL=    X,             R,               I
##VAR_TYPE=  INDEPENDENT,   DEPENDENT,       DEPENDENT
##VAR_FORM=  AFFN,          ASDF,            ASDF
##VAR_DIM=   8192,          8192,            8192
##UNITS=     SECONDS,       ARBITRARY UNITS, ARBITRARY UNITS
##FACTOR=    0.0002076,     1,               1
##FIRST=     0,             0,               0
##LAST=      1.7004516,     0,               0
##MIN=       0,             -217963,         0
##MAX=       1.7004516,     204119,          0
$$ Real data points
##PAGE= N=1
##DATA TABLE= (X++(R..R)), XYDATA
0@%%%%%%%%qJ6j6J8k6L2l7M5n6P1q2R4j11J32j55J80k07K37k74L14l57M05m57
31b42N15n80O51p28Q11r02J004j117J240j376J525j687J868k069K292k540K820
48A485l138L499l919M410m992N698o576P702r201J1308j4492J9967m5337K37705
62B04119j52283k21758K69688q2963j14066K16201q4377j94340K27694J3016j84993
73a04062J18454K7579j30485J47070J3834j88298J21416J05697j84067M0906J21638
84H9682j41305j975J32656j09390k9067J40065q7459q0647J58652k1148j30401
95h0337R9470K7868j05572Q1475K5994j35204P8550R8393j35226k109R8068p3471
107b2101J8344P5212j28511J747J50343r8612p1190J29223n4962o5426J31103
$$ y = [0, 0, 0, 0, 0, 0, 0, 0, 0, -8, 8, -8, 10, -16, 16, -21, 24, -32, 39, -43, 51, -60, 72, -83, 97, -110, 127, -147, 167, -190, 215, -242, 273, -307, 344, -384, 427, -475, 529, -588, 652, -724, 801, -886, 982, -1087, 1205, -1335, 1485, -1653, 1846, -2073, 2337, -2655, 3043, -3533, 4169, -5032, 6276, -8216, 11751, -33586, 204119, 51836, -169922, 99766, 16803, -97263, 118938, 34561, -159779, 67915, 80931, -104062, 14392, 41971, -88514, 58556, 72390, -115908, 5508, 111205, -72862, -31956, 89682, -51623, -53598, 79058, -30332, -59399, 80666, -6793, -87440, 71212, 50064, -80337, 19133, 47001, -58571, 22904, 48898, -86306, -7756, 90637, -44589, -46698, 51370, -22101, -3757, 71455, -57056, -55309, 95034, -3578, -74768, 54455, -507, -65933, 65170]
118F5170n2713j00531J44750L35j36960R4101L8735j11456P0154M2267j15930
129f2078N0694O9051j01682K2311Q1283q1313q236P2401n3478q571O2219n9146
141a6545k1487P9376l8443m7157P0028j1065m9680N8503l399o2272N8533K8329
153D4721q0863J8317N4537n1557l449M5990m4085n796N5864l9066k4056O0930
165C1487k0985l7749M5486j3344l1697N2016j4555n1820N4952R698n7506M1536
177G519K1743n6169L1802K5270o1906K6462M6679o2656m126N2342l6642j0104
189a9786M3662k9399j2449M3735k4797k3055L9987r186k3860K4698j1724j6823
201a8997L5488r476l2010L3542R088l3751J8083J4461k8807J4236J6053l6171
$$ y = [65170, 12457, -88074, 56676, 57011, -79949, 14152, 52887, -58569, 11585, 53852, -62078, -11384, 57667, -44015, -21704, 59579, -21734, -29970, 42431, -11047, -19618, 42601, -16545, -38032, 41344, 2901, -44256, 25772, 14707, -34973, 23530, 20131, -42141, 16392, 44721, -36142, -17825, 36712, -14845, -18294, 27696, -16389, -22185, 33679, -5387, -29443, 31487, 10502, -27247, 18239, 4895, -26802, 25214, 10659, -41161, 13791, 23489, -34017, 7519, 29262, -26907, 4895, 30165, -31741, -5279, 41400, -21256, -25382, 26960, -9682, -19786, 23876, -5523, -17972, 25763, 966, -22089, 17898, 8712, -15148, 9550, -2174, -18997, 16491, 7015, -24995, 8547, 17635, -16116, 1967, 16428, -12379, 1857, 17910, -18261]
213a8261M706L4448k3516j5088K6855r124j0367K4128j0159j6977K5504l046k5286
226a6183J8758O339k0189J3863K131k2482K2355J2507l0570J1637K0487k8218
238i565K816K2914k4943n17K5701k5039j1235L4268q916j8525K2332m926j4773
251a0408K0569l602j8589J7760J218j9685J2128M459j2669J4290K218k0180J4270
264A779J2080k1326M996J4502j9109j048J7616j5291n203K2469r927j4735K0084
277F887J517j5803J2716K346j6400R994N922j6245P036R434j5226L799J1490j1949
291d482M175J2442j6867k287J7886j2523p388J7517r051j2699J8651j959j4244
304a0829J7207L252j8395R584Q455j4336N399P406j4304J859Q788r904K836J0183
$$ y = [-18261, -13555, 20893, -2623, -17711, 9144, 20, -10347, 13781, 3622, -13355, 12149, 9103, -16183, 2575, 8914, -11275, 2588, 4719, -17763, 4592, 17099, -13471, -1834, 18653, -9565, -6749, 16165, -8778, -9295, 16406, -8633, -19868, 14400, 5484, -13041, 9291, 4365, -10408, 10161, 6559, -12030, 5730, 6948, -12737, -609, 3850, -8819, 5471, 7689, -12491, 1779, 13859, -7467, -2471, 12031, -7078, -8126, 9490, -5801, -11004, 11465, 1538, -13197, 6887, 8404, -7399, 5317, 7663, -8737, 1257, 7179, -9066, -2030, 7404, -7822, -4023, 7467, -4482, -307, 12135, -4732, -7019, 10867, -1656, -9044, 8473, -578, -13277, 5374, 3415, -10829, 6378, 9630, -8765, 819, 9274, -5062, 337, 7743, -6561, -4702, 4086, -5818, -2982, 7201]
318G201r804o5R159q524o79J1872r937o824J2699n441r356J4462q46j2942J1305
333B280M848j3468Q216Q499j4502J288R274r945j549J0838q100m633J0572l761
347a43m331J1384m078p210Q473k176q194J0254m18j1725P767L318r886P403Q463
362H901j2510J886Q992r909m84J0677q125n460Q351l824n065R644r12n715O468
377B915r70n442P117O8p443N609l12q398O693M080r195M844O442j0222K652R867
393H305q664l044R152o955n912J0762k599p495Q088q7p205Q337K531p678M355
408A891J604p481M547L366p892K515M296q148L083Q020p162j82P627p188l163
423d267R317l602o300P018k051p215P210K706o026N005J809o418L649L147n111
$$ y = [7201, -2603, -2668, 6491, -2033, -2712, 9160, -777, -7601, 5098, -343, -9699, 4763, 3917, -9025, 2280, 7128, -6340, 1876, 10375, -4127, -2839, 6435, -3510, -5059, 5779, -2321, -6954, 3618, -143, -4474, 6910, 2832, -4378, 4095, 1919, -6275, 3979, 3561, -8164, -397, 2921, -6965, 438, 8901, -3609, -1723, 7269, -2640, -3124, 7553, -572, -6032, 2319, -1505, -6570, 3074, 2162, -3553, 2915, 1945, -3497, 3620, 3688, -3755, 1854, 1542, -6856, -163, 3917, -5278, -434, 6008, -4214, -1562, 8305, -359, -3403, 5749, -1206, -7118, 3644, 1045, -6450, 1638, 1551, -5654, 2683, 5214, -2464, 1891, 3495, -3986, 561, 3927, -3965, -1450, 2846, -5302, -2219, 5801, -1361, -1543, 6084, -1104, -4267, 5050, 1448, -4852, 2166, 115, -7100, 110, 2816, -3210, 1795, 3604, -2814, 835, 3982, -1129]
438a129K255J687p238J987N185o033J406O570p098n63Q655n079l504P950m465
453E86o606P827j54p275O443J460p631N662M283o588L349L828p437M71N234n361
469a909r7M703o019n28O738l522p99O130m124l665O206j908m355N998j560o917
485e628M803K553m809L783K880n576K201L489m557R68L891n119j625L226k621
500b141O51M809m551j390N862k468k686N946k512m382M788j709n391N914K227
515B967o991K536M639m481K075L776n407r7M093m236j230L870j939j663K152k171
531b107J036N245l138l124M565j296k749L397j016l350L061m13m131L911L823
546C714l991N0J793j979J194J757l614j69K577l479r68L536m01l30J950k895K8
$$ y = [-1129, 1126, 2813, -4425, -2438, 2747, -3286, -1880, 4690, -2408, -2971, 5684, 605, -2899, 5051, 586, -6020, 1807, 1653, -5622, 821, 2281, -5350, 312, 4595, -1993, 1356, 5184, -2253, -1782, 3452, -1909, -2006, 2697, -3322, -3850, 2888, -634, -1433, 4697, 573, -3092, 3114, 1206, -3149, 2849, 1289, -5628, -825, 1728, -3081, 702, 3582, -1994, 207, 3696, -861, 107, 3998, -1121, -2746, 480, -2141, -1490, 3319, -1232, -2622, 3240, 772, -1914, 4032, 1520, -2862, 1926, 217, -5174, 740, 2967, -4024, -1488, 3151, -1330, 745, 4521, -886, -983, 3110, -1126, -2356, 1514, -425, -2088, 64, -2107, -1071, 4174, 1036, -2088, 2477, 1181, -1568, 1829, 813, -2537, 524, 111, -4020, -109, 3714, -277, -227, 1566, -413, 781, 2538, -1076, -1245, 1332, -2147, -3115, 421, 20, -310, 1640, -1255, -1227]
563a227N192j918l846K765k14k940J979Q2j767K866P74m212J832M241k023j638
579e4O83j656J274J023l411N0L050j949p56K148M48O50J116l534o18L933j001
596A396l315J450N7j037J699j101n76M525n44m795J363K739p74m11j476k092K658
613b34J369l670P47L488m64j144m85k25K988J017m749j741L640K53k303M05K41
630h67J379J417k901j124M168J597l489k589J058K159N08l097j709L622K021k722
646e69o91J822J557M27k776k923L288M141n204l434L810J262j84J06j911J410
662A31L757l205m447L830L547l017k411j600J729N017j957n369L412M323k638
677A102j880J91L86L357j619o795J987O531j614l669R4J261L134P14n097M07N093
$$ y = [-1227, 3965, 2047, -1799, 966, 752, -2188, -209, -127, -1894, 972, 1746, -2466, -634, 3607, 1584, -54, 629, -1027, 247, 1270, -2141, -2091, 959, -990, -1746, 402, 850, 1500, 2616, -918, -1536, 2397, 1396, -1919, -469, -412, -1449, 250, -851, -1427, 3098, 2554, -2241, -878, 1861, 1087, 676, -800, -2892, -234, 1135, -2535, -1788, 1700, 1236, 92, -393, -618, 2370, 3387, -1362, -3103, 537, 790, -1513, -1108, -867, 512, 1929, -972, -2096, 2072, 3669, 180, -2409, -1351, 808, 1316, -1781, -3490, 132, 2153, -569, -1260, 562, 2119, 2546, -230, -3153, 135, 4276, -928, -4362, -552, 710, 526, 632, -1279, 131, 3888, 683, -3764, 66, 3613, 596, -1815, -3415, -1686, 3331, 1374, -3995, -583, 3740, 1102, -778, -587, -201, 3156, 1537, -5258, -3271, 3260, 1646, -2023, -1929, -668, 2466, 3180, -1917, -1510, 3583]
694C583j725m479N42J529J746N67m780m96O874L54n904J041L722j207q82j556
710a071j579M169J592o439j455O005J856k045j952r85L139K690m615l030M830
725A110J581m464p30J154J460L470k851m718M437M073m259j731J948p94N15m77
741b76l771L193M968m835k852M587O68o15P07m033R19N218m096m761N146J783
757A950k321P03j979L17O000k177o673L162L814k811o51m63j409L379R00m916
773c175J410N646k284k966J290N7J135O79l812m55M199j120l731K678K574p56
789A369k97j605j546M944O01o212J78L669j041j317Q91j456K683K994n485j167
805b797N885m94l484J235j588k82M229l736k990N672Q37m854K282J414j502K404
$$ y = [3583, 1858, -2621, -2079, -550, 1196, 1763, -3017, -3513, 3361, 3715, -2189, -1148, 2574, 1367, 485, -1071, -2650, 1519, 3111, -3328, -4783, 1222, 3078, 1033, -919, -1904, 1235, 3925, -690, -3720, 1110, 2691, -1773, -2503, -1349, 111, 3581, 730, -3988, 449, 4522, 263, -1468, 480, -314, 201, -276, -4047, -854, 4114, -721, -3573, 1014, 1682, 1067, 1774, -2259, -1340, 3878, -218, -4979, 167, 1950, -371, 332, -1647, -1330, 4670, 2493, -4180, -1018, 2796, -15, -666, -1129, -2538, 841, 1741, -3175, -1765, 3881, 1597, -1369, -79, -22, 1113, 1792, -2020, -2475, 1724, 604, -3127, -449, 2125, 1369, 1072, -533, -2079, 2865, 3466, -2746, -2568, 1101, 60, -1257, -366, -1822, 861, 3855, -1630, -2797, 3088, 2594, -890, 345, -1243, -1525, 2704, -1032, -4022, 1650, 2487, -2367, -85, 1329, -173, 2231]
821B231j314m943M615K769n985K5L469j714O49J605l186J975L972m697k231M477
837A717k85j821K37k301Q60M056j993l182L558J312k697K50M54p49K172q00m675
854c887K145M227k517j522K325p54M63J280k491k36L907j801l851K178Q98j114
870g50J285o87k428L971J143m723K554K621m017K01J318k683K343J791m483L11
886b233M512j660j270K310j512p44K993k823j681L745j139k923J694J18K37K407
902B031j879j501K743J90k304R30P06j728Q78j07j818J653K128k342p34K245l39
919G52m04P36j210n80J142p63j924J942R27j479M51N68o38K000K00l019J355J358
937A414k342l29J725j214L58J099k002N13K812j688j263J816j216JJ389k074n10
$$ y = [2231, 917, -4026, 589, 3358, -2627, -2602, 867, -847, -198, 1407, -1779, 196, 4168, -529, -2760, 1717, 1432, -389, -152, -2453, -1593, 2463, 470, -2712, 846, 2158, -539, -289, 165, -584, 1588, 788, -3887, -1742, 2485, -32, -1554, 771, 17, 480, 1760, -731, -967, 2940, 1139, -2712, -534, 364, -750, 535, -152, -2580, 1391, 2534, -2189, 365, 2986, -1031, -830, 488, -2195, 148, 1939, -2544, -2233, 2279, 619, -651, 1659, 147, -597, 2396, -427, -2108, 1637, 498, -2425, -731, -613, -376, 2031, 152, -1349, 1394, 1584, -720, 210, 916, -812, 66, -41, -1859, -206, 1922, -420, -1154, 1091, 752, 348, 1084, -126, -706, 436, -327, -2251, -309, 618, -861, -410, 158, -480, 1520, 1720, -1299, 56, 1414, -928, -1257, 468, -746, -388, 711, -1291, -778, 2034, 346, -917, 899, -317, -316, 1073, -1001, -1511]
954a511J859q70p05K264m81q94J374q11j123K010k2j965Q85L6j920J753O89j485
972i17J096R65j989N41J951j390n21J366j903n49J246k23k69R35k43m09J068Q0
990H35q03P86l97j577J227Q8j346J020P29j656P38J511j198p5J056r39q45J928
1008A082j028j123J378j111l06J510j64r87J928o49r86J189L23j848J623j23k354
1025a646J564L41j339J161J387k060L25J459j197J09J391j777j231J456m70m99
1041a026J869q49o94J311j95m92R11kj551N42K98j137R80M84j655P47Q57n82N20
1060C36J052j243p32J145p13o44R79m12j216J368l8l98J115N78j525R11J46j269
1078e60O61O98j611L1P73j125P21J368r85l15J316j276j98K033j160j142R83o76
$$ y = [-1511, 348, -522, -1227, 1037, 556, -338, 1036, 225, -898, 1112, 1090, -875, 10, 46, -1874, -121, 568, -917, 179, 1144, -845, -304, 1647, 257, -264, 1102, -801, -1350, -104, -327, -596, 339, 96, -313, 755, 835, 32, 818, 421, -1156, 71, 159, -1187, -167, 562, -1094, -356, 1155, -43, -118, 938, -1, -846, 1082, 54, -1069, 309, -802, -1108, 402, 238, -749, 1179, 530, -456, 733, 1056, -792, 831, 708, -1646, -82, 259, -1080, 81, 1468, -592, -267, 1192, -5, 104, 1495, -282, -1513, -57, -527, -1026, 843, -6, -700, 611, 416, -76, 835, 833, -718, -176, 122, -1015, -35, 449, -1206, -459, 398, -184, 336, 1388, 145, -587, 558, -155, -799, 180, -232, -1448, -80, -118, -516, 599, 1177, -348, 563, 709, -560, 101, 799, -812, -781, -8, -1133, -412, 956, -29, -344, 972, -304, -502, 1531, 371, -771, 212, -464]
1096d64j047J659M89j345P94M29j197J120P42j257K13p4j134L18J036p89m1J204
1114F56j103M1J476m50p07Q10n23j360J451l0j589J237K90j332J240O76p62K46
1132B67Q19j373J4R72j245m1O61j062L4J618o12n99J641q41j006J441j33q79O08
1151B84m4j839Q96J481j347M76J032j457M53J163q02l31R62j343o10J270n16l65
1169f37J311o56j352K185J07j156Q44J74j247L10O19j414Q69P58j623J69J761
1186A022o59n94J344q40p28J847j126j498J869l40j357R32K79o58J104N27k175
1203a051J110J342k122N38J314j815r4J426j802N15K214j911j289K780q40p43
1219d28K073j291j942K077N0k200K028N12j709O24P81q85J373N53k815R30J466
$$ y = [-464, -1511, 148, 637, -708, 86, 515, -682, 438, 1180, -77, 136, 62, -1072, -754, 282, -507, -548, 656, -447, -406, 1070, 620, -87, 723, 200, -1160, 291, 261, -1328, -91, 199, -1133, 107, 783, 21, 267, 1086, -287, -273, 699, -546, -587, 74, -988, -954, 664, 52, -547, 1094, 253, -753, 688, 555, -324, 284, 240, -1599, -703, 778, -569, -93, 939, -518, -65, 1098, 296, -35, 927, -416, -1026, 244, -272, -637, 674, 18, -1334, 851, 958, -198, 646, 820, -427, -117, 502, -912, -43, 715, -908, -739, 1022, 363, -231, 1113, 273, -455, 1392, 266, -1232, 637, 297, -1060, -128, 151, -507, 597, 1124, -1051, 59, 1401, -721, -183, 1131, -684, -778, 648, -1154, -639, 1575, -336, -1625, 1155, 315, -428, 1645, 354, -1588, 489, 539, -1661, 367, 879, -830, -206, 575, -310, 1063, 1616, -1199, -269, 1197]
1236A197j863m10J873j547j41J866j825j51L228j299j795J500O9j706J352o6k159
1253a877K271R17k768Q20K257j954O45N51j780J190J550k669p49K655j628r62
1269a531K930j313j001K468j265j905K812M48l214J533P13k057J765N00k819K400
1285D64J640l368N98K788k284L71J029l072R03L293k530k082L340p94j599K551
1301A248j346r16L327j317l590K539K191l509J146R55k184J690J852l477O52L136
1317B397k784j032K371j098o23K249k707j212M278j001l236K982Q46k411J946
1332I65k80k652L564M67m921J122L590j985m67J412k056P93L276l320j148L962
1348B322j430k492K244j406o03L332k166k922M239J281m240K150Q84k605K207
$$ y = [1197, -666, -1076, 797, -750, -891, 975, -850, -1001, 2227, 928, -867, 633, 702, -1004, 348, 282, -1877, 394, 1311, -1457, -637, 1620, -334, 311, 862, -918, 272, 1822, -847, -1596, 1059, -569, -1531, 1399, 86, -915, 1553, 288, -1617, 1195, 1643, -1571, -38, 675, -1382, 383, 883, -1936, 464, 2104, -1264, -666, 2122, -162, 209, 1238, -1834, -931, 2362, -168, -2250, 1090, 296, -1303, 1248, -98, -1014, 2313, 996, -2594, -55, 2136, -1373, -227, 728, -1456, 234, 2086, -1391, -739, 2397, -387, -1419, 952, -146, -769, 1480, -1227, -2439, 1839, 838, -2398, 584, 1430, -981, 965, 685, -1967, 1597, 2064, -2857, -1735, 1855, -130, -597, 815, -1241, -448, 2828, -492, -1640, 2322, 892, -1600, 644, -762, -1365, 1967, -199, -3121, 1118, 2399, -1841, 309, 1193, -1412, 795]
1363G95M05m025K359L231m466m52L641j331n58J893k546LL535k069k778L111O09
1380A357k506J175m04j375L811l61m273K543K743k992j80J499k165Q59J907l762
1396b124L88M220j953k559K642j63p55K394k322k109L685l2l882K346J355k045
1412i14J257k41k115L190J413m187N47K850k235j80J687k491R17K089k491j050
1428a954L836n72k130J279m81q05K186j236k094K475R09l119J110J289o76O99
1444G16m9k101J434K353l381m17J999r17l77J511j900%L111j603k152K771N69
1461A567j953O05l18j415K161j31k222J787J152j918L46J127j276J176M54k511
1477a369M41K487k028p09J766p75j59J323j282l38K358j212j899J490O71j087
$$ y = [795, 1200, -2825, -466, 2765, -1701, -2153, 1488, 157, -401, 1492, -1054, -1051, 2484, 415, -2363, 748, 1357, -1149, 26, -378, -1753, 2058, 1697, -2576, -33, 2710, -282, -462, 1037, -1128, -269, 1638, -2124, -1736, 2484, 531, -2028, 614, 451, -304, 2090, -232, -2341, 1344, 1312, -2570, -224, 1131, -914, 343, 102, -2013, 1177, 2590, -1597, -1050, 1800, -435, -615, 1072, -1419, -502, 1587, -904, -1954, 1882, 1310, -820, 459, -22, -827, 1359, 123, -1971, 504, 1413, -1706, -596, 693, 17, 716, 667, -1434, 0, 2353, -1028, -1445, 554, -363, -740, 771, -1129, -1129, 1982, 379, -1773, 998, 1567, -386, 219, -99, -1514, 647, 516, -1706, 81, 1233, -685, -339, 788, -488, 688, 1142, -1369, -928, 1559, -469, -1178, 588, -187, -346, 977, -305, -643, 1715, 503, -1396, 94, 765, -322]
1493c22P46p38r72J881J77k108J302J365j447k2K92j082J170R05k339j28K226
1510I06p38j191J281k20k60J442j265p18J898o8k745R83J039p00N01J76j620J653
1528C54R75j760p5J759j216o35Q11j185Q09J379j934j008K390j9j118J215n06
1545B36q71J435m65j902J749R88k171L20R20l91O63L26j427L59J566j130r33J619
1563H91q73R9N48j526l63K604j289j271J215O26r96J063m10r97R67j17j202O48
1581c83J111j078J20L63o56O16J004j193n99J151o58n76J213n77m87J121o21r08
1599a037J803K17j285M50L24o80O34N6j267N05N59j038K18R93m20PL75o20O6Q08
1619F68q39l99J057n48o80J193m72j78N06P7q31N62L21p49K87K85q13L9Q90o21
$$ y = [-322, 424, -314, -1286, 595, 772, -1336, -34, 1331, -116, -138, 154, -928, 242, 1147, -1192, -1320, 906, 168, -1023, 258, 38, -222, 1220, -45, -763, 1135, 1067, -1678, -695, 344, -356, 145, 321, -1299, 354, 1329, -431, -506, 1253, 37, -598, 213, -972, -163, 1216, -718, -1726, 664, 645, -473, 742, 236, -635, 800, 335, -1567, 182, 1170, -1001, -681, 239, -152, 511, 837, -590, -231, 1335, 205, -728, 891, 18, 117, 665, -861, -1224, 1380, 91, -1180, 35, 661, -335, 728, 318, -679, 288, 171, -1031, -383, 728, -350, -230, 133, -523, 93, 1097, -96, -695, 456, -202, -778, 435, -142, -629, 492, -129, -1037, 766, 983, -302, 148, 472, -208, 426, 482, -785, -280, 279, -759, -541, 452, 32, 39, 414, -206, -140, 668, -171, -570, 487, -61, -741, 452, -20, -198, 308, 385, -446, 116, 437, -312, -25, 260, -553, -514, 376, -245]
1639b45N1N34m90j46Q68l46l3K89k57p86N31p9k51M19K13o11N23K64k45J47L74
1660G24j028J30O63o40j10N35m97l32J006k16m46O44J7m56J69J54o68L99l46l83
1680f81M96M50l6j11m7l64L07K97q1k82O35o86o33M58K00k20Q31k42n92O05n1
1701B53q8R6j31m54M56N9l78j59N61m42j60N37k89L72L23l90l89K69j49j54J72
1722h5K01m81K27K83l97M48K84l15l6J65m76j3K99n09L5J80J98k17M96l79j6L77
1744B69R7m84J88Q5l36j5P6k27K61P2j63K04M48n05lO84n00q9j89j48j65P68m01
1767g3k25L77l23K47M03J93p88M2L72m31p3L44r3p3j0j32M46J76m73J85J12l33
1789a30k2K05p8l34L41j21k02M34M61l65j90L21m96L42Nk46q7Q7k45K79Rl1J3
$$ y = [-245, -194, 340, -150, -296, 572, 226, 193, 482, 225, -561, -30, -109, -360, 59, 272, -339, 184, 448, 203, 350, 724, -304, -174, 489, -151, -261, 274, -223, -555, 451, 235, -211, 433, 450, -6, 163, 317, -351, 48, -298, -681, -185, 265, 229, 118, 71, -293, 14, 311, 230, -52, 583, -103, -736, -278, -78, -298, 533, 291, -301, 304, 253, 165, 261, 130, -324, 132, 191, -187, -346, 215, -227, -387, 150, -139, 233, 556, 166, -223, 46, -103, -257, -85, 116, -365, -138, 145, -252, 196, 480, 165, 129, 294, -182, -195, 104, -405, -370, -190, 8, -209, 287, -92, -108, 269, 366, -118, 70, 155, -181, -196, -120, -347, -86, -14, -177, 27, 475, -30, -33, 651, 151, 62, -127, -275, -440, 328, -73, -298, 79, -244, 3, 406, 599, -189, -147, 225, -206, -279, 65, -28, -101, -111, -243, 203, 379, -94, 91, 203, -130, -152, 53, -25, -359, -18, -139, -341, 93, 554, 189, -1, 320, -176, 166, 171, -75, -162, -75, -320, -41, -32, -63, -50]
1812e0J41k90n0O02l12l40L01k85j08L90L2J20k13l39L77K12M5o5n3j65R3n1Q4
1835G6m4n7j0k35L02M32l32M18j11n69L05j20l46kL26M3n34K19K86jJ49l34M16
1858B77j51j84M68l71k18J15M0j28j16N94j91l83M83Oj02L94l63k71l75J38m0
1879c78J77L61p7P2J69n48N44K39p31M2L06n06L74K5j77J74L7m67k2Q28j2k70
1901A60j32L6m11K21P2k73L68J69n51L20K35l8J62j01o89M45O42o33l81N38l13
1922a54K06M37m12k96P29k68m63O75j14m62n7K16o91R49j27m96K24M29o13K53
1942c5N12m66K59K72j209M16Q86o97p56J032l23j36P62m39n01J154l35j150Q72
1961A18J50k61qK42j207J241J55j189O76Q29p61M9J46o11N35P17j552j33J784
$$ y = [-50, 91, -199, -249, 353, 41, -299, 2, -283, -391, -1, 31, 151, -62, -401, -24, 188, 233, 168, 115, -50, 43, -8, 76, 32, -25, -35, -270, 32, 464, 132, 550, 439, -130, 175, 55, -291, -293, 33, 76, -458, -239, 47, 46, 195, -139, 277, 126, -58, 410, 39, -179, -64, -24, -152, -268, 326, 135, -248, 235, 241, 139, 533, 170, -101, -476, -338, -378, -201, 160, 83, 155, 324, -224, 320, 559, -172, -130, 176, -330, 44, 69, -108, 66, 103, -364, -386, 442, 430, 160, 28, 64, -347, -126, -54, -327, 41, 210, -341, -21, 214, 176, 338, 237, -452, -7, 635, 2, -379, 159, -154, 52, 489, 77, -219, 510, 242, -221, 454, 340, -122, -179, 37, -654, 295, 168, -328, -104, 325, -288, -35, 477, 11, 270, 542, -667, -251, 635, -62, -818, 214, -109, -245, 517, 78, -423, 731, 396, -754, 118, 268, 7, -1, 241, -966, 275, 430, -759, -83, 746, -15, 34, 180, -431, 104, 821, -731, -864, 920]
1980I20q84p78R08k50j78J081o68j164J738L84j980M41P89m01M73K0j355Q39J208
1999A143j097n21Q27m02l96O18r06L62J450q92j055J170J59q24J001m93n77J006
2017E73p8j878J540Q25j742l9P27l33P94L87j533J32K005j335r84J310j92m84
2035c05J040j431o89K514l66j790J032O80j012P78m87q96R06Q48j707J58J857
2052A130j499J77N61j004O75Q40j004p77J511n20j204J383n11k06R43o15r51J449
2070C78M19j336L32M29j192J016O86j890J110Q50j369n42J827m48j27M40j350
2087g67L01J318j000j008J500qj253J087j7r43J433j42j317J026R94j798QJ288
2105G02j473K80J063j207L24R90j276j71J470m54l17R69j423NJ332n15j171Q07
$$ y = [920, 36, -742, 166, -84, -262, 819, 151, -1013, 725, 1109, -871, -430, 359, -42, 431, 451, -904, -65, 1143, 46, -475, 352, -50, -446, 172, -734, -372, 1078, 186, -869, 301, 460, -364, 637, 144, -433, 573, 495, -1383, 157, 982, -760, -799, -72, -405, 389, 776, -757, -625, 1380, 45, -939, 371, 179, -305, 735, -696, -1385, 1129, 763, -1027, 5, 685, -327, 451, -36, -932, -26, 822, -885, -727, 1130, -369, -192, 369, -635, 40, 880, -124, -901, 610, 90, -1114, 269, -242, -448, 495, -120, -1071, 378, 797, -539, -207, 222, -970, 46, 732, -1158, -48, 802, -567, -1109, 718, 270, 143, 583, -767, -466, 852, -148, -1156, 344, 336, -917, 170, 153, -790, 643, 501, -816, 210, 1204, -594, -586, 702, -771, -491, 572, -635, -311, 679, -597, -768, 702, 248, -69, 900, -523, -518, 814, 299, -872, -65]
2123f5K98p35P47N2o52J114J05k030Q60J196j066m73P52n96M84O05j351J56J332
2142G33l96j001O28L56q20J098j090m41K051m62j299L90J165r73p6O98j143O29
2160D7J210j986J17Q39l06k74Q21r64L06J211j181o51J392q1q99M22ll98P03k15
2180A10j013J039R22q63j1M66q25L28K80j046J19J476j215n16P56l26J0J108r89
2199a90k22J129n39r61O23N87p49L98k06k64P99L25j481P48L57k11k63J22k49
2218b47J64Q73j160m54J369m80o06P43j6k30N62l4r04O75j54r23Q57L46l82L63
2238C62L4r46O32O88j029J91M97n81l43P52l95l2O51p79m47J145j18j88K61k47
2258A08n72N92J1j76KK13n52L28J01k91O02K0o42K63K32o35L45J30l17l5N13m86
$$ y = [-65, 233, -502, 245, 297, -355, 759, 864, -1166, -306, 890, -176, -649, 103, -493, -9, 596, -755, -599, 733, 337, -664, -36, 320, -500, 598, -492, -933, 1118, 656, -643, -253, 912, -61, -137, 561, -582, 47, 1257, -729, -612, 227, -79, -353, 468, -496, -190, 1021, -160, -811, 581, 500, -399, 23, 20, -378, 325, 110, -903, 136, 1058, 195, 184, 650, -175, 153, 433, -613, -494, 982, -233, -749, 7, -319, -309, 799, -190, -412, 717, 178, -783, -160, 427, -322, 76, -130, -394, 405, 730, -751, -3, 354, 143, -120, 2, -247, -83, 790, -370, -824, 545, 65, -541, 202, 186, -44, 518, 484, -420, 255, 101, -822, 35, 381, -1, 362, 396, -550, 82, 770, -259, -68, 429, -152, -495, 257, -138, -170, 481, -298, -745, 400, 282, 94, 355, 108, -464, 128, 139, -37, -35, 178, -374, -46, 55, -236, 366, 386, -256, 7, 239, -396, -51, 79, -238, -273, 240, -246]
2280b46k27O04lj96K59J70k88k88K36l82M42j33k35L63J26k39J48J65m86L53J76
2301C19m35j88J59n3J6K48O0m85N95km47N11j27p33K97R2K25lK55o24L23K6J19
2324A48K36J4j26n5j65k75J37L61p41K63J27k56K56O3J61j10J65k86k9K26L0M7
2346A91n1j83l76N17j6j68K49K9l03J41N54o96qK51l28j17Q05p22r1O10n51J61
2368a02N24k53j23L27l98k55J53n9J48k56L07m25K84nK58ml88J96L4J04k81J25
2390h9J39J22l38K00J07J42J54n67%O2O9J8j26j12n7J19K5L01j82P9J68R4oj29
2414A93j07k86K37j38K17k09j28K27j98K04r6L63J1o0o0j34j21q2j69OK76k52
2436c06N73j13P3j34jk26K18k2j51q3K52J80m39m8JK2L27m3K59j71P8m32L90j70
$$ y = [-246, -473, 131, 128, -68, 191, 361, 73, -215, 21, -361, 81, -52, -287, 76, 202, -37, 111, 276, -210, 143, 319, -116, -304, -145, -198, -182, 66, 126, -359, 236, 234, -213, 298, 171, -562, -265, -173, 52, 49, 304, -320, 3, 29, 148, 384, 398, 272, 217, 52, -223, -86, 275, -466, -203, -76, -332, -76, -13, 148, 38, 203, -83, -112, 114, 144, 191, 140, -43, -419, 98, 82, -86, 163, 192, -111, 30, 584, -112, -120, 131, -197, -314, 491, -231, -322, 288, -263, -102, 422, 169, 46, 373, -25, -280, -127, -186, -38, -294, 13, -412, -128, -133, 125, 121, -267, -71, -37, 67, -214, -89, 50, 172, -166, 34, 141, 283, 437, -130, -130, -68, 1, 19, -107, -219, -276, -157, -132, 169, -13, 66, 234, 328, 322, 193, 86, -200, 37, -101, 116, -93, -221, 6, -192, 12, -84, 279, 290, 230, 170, 36, -85, -167, -336, -330, -54, -306, 267, 154, 227, 93, 92, -134, 84, 62, -89, -172, 80, 260, -179, -227, -226, -204, 123, 80, 339, 168, 246, -186, 204, 34]
2460C4j17R4k70L95o2J30m75M13J15k70J75r8j17J27l23R6j60L93m32J10L66J0
2482A34j32K04j45j47R4J70m25R5L8r1L64n38M95k30J75p1j60L05l70n4J9O6n3
2505b57K46k92K02K82K04l17J38J36l87J87l8l88J07R7q3K50m3P1k85L59K17j83
2527B23k75j95R7j3J31j76M04O7m65L99K5l23M31o1l71j17J12J13j72k1K11k4
2549@l9n8j6L77j44k16K05k20p3N13l91J11Q4jk88K28K15k17J17L9r7l71M38m28
2573b32P6J15J25l31L93l95o8M17l63O0K12k0n9J14j20j52N45m57k2J28J26k33
2595a41K79N3l11J23j26j13J36M64l91l93O63j91j38j0J73l44O79j26n67M74l94
2616b01K24N2J98o42K52J06l88M54R6k54q1M90n06J9J25l78K04K51j54o2L97j02
$$ y = [34, -83, 11, -259, 136, 74, 204, -271, 142, 257, -13, 162, 64, -53, 74, -249, -153, -313, 80, -352, -242, 124, 134, 2, 206, 61, -86, 8, 178, -247, -152, -114, -205, 159, -379, 116, -114, 61, -10, -170, 135, -235, -289, -270, -204, -257, -11, -303, -101, 181, 385, 68, 206, 342, -45, 142, 104, -284, -177, -80, -163, 87, 44, 115, -170, 189, 406, 223, -52, -247, -150, -163, -32, -208, 196, 263, -202, 197, 222, -101, 330, 269, -102, -219, -107, 6, -166, -187, 24, 0, -39, -97, -113, 264, 120, -96, 109, -111, -184, 329, -62, 49, 133, 132, -156, 72, 287, 70, 187, 226, 129, -242, 196, -232, -156, -41, 84, -247, 146, -249, -317, 100, -263, -203, 9, -11, -70, 44, -76, -228, 317, -140, -162, -34, 92, -141, 138, 191, -120, 3, -123, -236, -100, 364, -27, -420, 243, 52, -86, -96, 77, -267, 412, 286, -281, 193, -201, 23, 75, 273, -369, -117, -11, -399, 55, 151, -103, -184, 306, -200, -181, -56, -434, -230, 21, -133, -195, 202, 100]
2638A00k79O49m60n66P52k67p3r2K48k47M95K9n07J24N39p94K79J51l43L75N7
2659A70m13j48O07n3p24R38j38m72K87l7j88J45J06l81J32L76o6j36K77p55O99
2680B26L04o91k81J166q16k19O39o04Q1L52l24j76M00K03q68R19q3m03K05l3m18
2701d21K06P09r88M03L02n37M29K29o98L89M01o09j3N63k67m18K31j63q4N65l52
2722a23l59M93k6j13L09l6l59K20L44q65L66N13p20j21N82j46q4P85o53n52J479
2743I34r68o42J000l53m17L62O1l63R88l12o61M65K00l49k4L26o28M74N29j008
2763c86M75O52q49j60L91j4l50P12p21n22J061np69N87j03n0O89l47p42R39j31
2784C57p11j19N58l61J87R1l31K64N43l15n73R30l11m33L88k1p05R91m17q97R04
$$ y = [100, -179, 470, 10, -556, 196, -71, -144, -236, 12, -235, 260, 289, -218, -94, 445, -349, -70, 81, -262, 113, 170, -243, -391, 216, 163, -561, 377, 239, -233, 54, 17, -171, -26, 80, -301, -169, 207, 141, 5, 282, -473, 226, 530, -161, -442, 724, -92, -311, 328, -276, -195, 157, -167, -343, 57, 260, -608, 311, 228, -175, 30, -3, -421, -215, 494, -494, -91, 211, -326, 103, 332, -366, 23, 424, -185, -198, 365, 98, -320, -89, -252, -336, 229, -123, -482, 11, -15, -128, 181, 145, -214, 6, 350, -515, -149, 364, -356, -477, 105, -41, -125, 660, 7, -545, 934, -34, -676, 324, -29, -446, -84, -23, -386, 602, 290, -371, 94, 294, -55, -79, 247, -381, 93, 622, -386, 89, 741, -108, -268, 123, 109, -241, 471, -250, -772, 289, 284, -485, 102, -1, -51, 638, 291, -451, 488, 357, -354, -473, 85, -276, -89, 2, -329, -65, 478, 163, -410, 520, 209, -224, 164, 143, -562, 429, 12, -885, 19]
2805A9L43n05k81M64J3K84m6p42J72Q24p39p4M61j70l9K09n74K50Q39p18l22O22
2827B90k04m53M03k87n1P76m23m95K50N82n45L09P0k21O0L06o89R7P20n72j15
2848a92J89k82p4R30l27l95N34j96m25M7N36l40J32l37k28M80L56o06O5P02o09
2869d0J09om22K94M90q69K7N86j06Q8N2j33k40M77n12O8L36j07l66QM80r4j08
2892A2K30n93R48j80j54k24J36j11R7J16m76m9M41k86p1L23J63l18K48j86m86
2913d20R18l21r77Q35Q6m94L97K0j66K82J44m96K01R7j62j39K23n33L62J97j30
2934g6n4L76j45k17q7J38L04k43J77j49J01j07k73O7J44k31L17O27o63R8M38n02
2956D0lN7k54L8L72k86k71O02o27J60L68J84p17J59J75j0N0M2l88K00L31l00L90
$$ y = [19, 362, -143, -424, 40, 53, 337, 291, -451, -279, 545, -194, -268, 193, 23, -16, 193, -381, -131, 708, -10, -332, 290, 86, -367, 36, -251, -302, 474, 51, -444, -194, 388, -157, 152, 222, 1, 61, 367, -322, -225, 495, -77, -192, -3, -285, -359, 571, 244, -151, 383, 187, -238, -191, 345, 5, 137, -200, -428, 52, 408, -198, -133, 569, -40, 69, 63, -359, -65, 425, -444, -417, 169, 63, 151, 203, 70, -170, 307, -205, -137, 199, 92, -274, -266, 214, 120, 12, 242, -351, 597, 417, 263, 39, 175, 64, 161, 277, -199, -248, 193, -93, -164, 159, 322, 4, 252, 66, -420, 498, 177, -800, 35, 121, -373, 24, 44, -122, 160, 304, -192, 9, 106, -56, -195, 28, -505, -143, 54, -76, -130, 246, 101, -116, -203, -65, 239, -4, 173, 24, 125, 18, -255, -188, -44, -275, 42, 669, 6, 104, 542, 40, 37, 94, -160, -122, 250, -36, -307, 295, -332, -172, 196, 380, -337, -178, -3, -13, 37, 79, -309, -109, 222, -78, 312]
2979C12K46n46j35R0p2j92L02l28L61r8j24J93J2Q1j79K79j90K05o0J07m66L90
3001A88K21q05N05j8k84J2K70m6r1N84m33k7K87k73j44j86L55l42J54O3k43L59
3023A06J8l72O48m08k48K55r0Q0j30J79J56k49K12j63L67j86k44m98N74q0j46
3044b19q5L67l10L20K41k60j51j60J56k05M08j02o9L40P9k83m1j10J74J47k28
3065In3P2J07q9R1l58j66M91N8k85K90l10J47R7q0n6L52k08j57j16K8J50O4l01
3089b23N79n67J66K45lj3m73L14k54K32M1Q5J41l03j37K46J6k25J70O3j22K01
3111A79j41l5qJ78j25l3m7j27M91j67j95j24L32l99J33K92l01J64k06p2M06k00
3133eP6K05k61k30K05J34L3L3l24J78k21N0Q2lo7m2K75m0P4l38K54j58J2L0J81
$$ y = [312, 558, 12, -123, -33, -105, -297, 5, -323, 38, -60, -184, 9, 21, 102, -77, 202, 12, 217, 157, 264, -202, 188, 409, -396, 109, 91, -193, -181, 89, 43, -48, 536, 103, 76, 363, 90, -54, -240, 115, -227, -73, -10, -253, 106, 124, -248, 400, -8, -256, -1, -91, -11, -141, 38, 194, -55, 157, -6, 361, 175, -69, -567, 7, -73, -219, -304, 63, -247, 73, 314, 54, -97, -257, -101, -306, 102, 0, -69, 271, 350, 67, 26, -84, 90, 237, 9, -44, 28, 135, 46, 137, -221, -387, 104, 162, -123, 167, -143, 4, 101, 21, -35, 317, 109, -48, -164, -136, 14, 78, -223, 356, -211, -45, 200, 197, 184, -289, 25, -229, 3, 44, 129, 270, -33, -170, 76, 92, -133, 37, 100, -22, 179, 38, 3, -5, 173, 48, 15, -32, -159, 332, 165, -30, -154, 178, -221, -88, 204, -97, 67, -139, -211, 195, -5, 71, 276, 15, -215, -10, 124, 157, 190, -134, 44, -177, -127, -45, -48, -115, -157, 118, 78, 152, -186, 68, -90, -78, -48, 133]
3158A33Nn55N17l57M52l65L19Ok03J65k14J3m5J05J41J88k27p4J25k8J20K24n43
3181i8M10j72k26L87m33jM8K76k22k3J89k55K86k99j7J78j77m9K39q7J70k86K05
3204D3K01k3R0l60L71q9M2m46Q8J45k51K08l4k19K30K34R2j66O2m64J78K73l68
3227a63N50k50k62K51k43J96o4j1Nj70M65l36k37K67jm76N39J73K37m49k17K84
3249H8j44Q4RR2Mj53J34l92J69o7J43j07j58N76j96j08L29m79M3L39l26J96J66
3272B42j95j82J26L35l31K24J0j88j21L25j21k44M1j78j05L78m7K22j50j99K54
3293I6J49j64j65J34M5k14m5K77j79J79K26n34K55J88k07l60J99p5J81K46j18
3314A14m64L79K62o26K62L32k78K24j75k63L41R3m38K6K35m20O03l58K44n8L71
$$ y = [133, 138, -417, 100, -257, 195, -170, 149, 155, -48, 117, -97, -84, -129, -24, 117, 305, 78, 4, 129, 101, 221, 445, -98, 312, 140, -86, 301, -132, -133, -85, 191, -31, -54, 135, -120, 166, -133, -150, 28, -149, -198, 41, -46, 124, -162, 43, 244, 221, 311, -49, 322, 233, 275, -171, -83, 62, -189, 19, -15, -234, -4, 230, 322, 156, 218, -246, -68, 205, -163, 387, 137, -125, 126, -117, 79, 15, 4, 9, -161, 304, -32, -269, -2, -3, -479, 60, 233, 470, 21, -196, 88, -56, 28, 37, 129, 133, -20, 114, -278, -109, -176, -33, -140, -298, 278, 82, -26, 303, -176, -133, 206, -120, 76, 242, 47, -135, -9, 326, -5, 219, 229, 41, -80, 245, 124, -120, -79, -257, -362, 16, -31, 191, 41, -158, 96, 245, 81, -84, 50, 95, -119, -164, 113, -66, 113, 339, -195, 60, 248, 41, -319, -120, -195, -14, 232, 114, -350, 29, 291, -335, -73, 259, -19, 205, 30, -233, 108, 201, -237, -211, 24, -396, 207, -151, 93, 35, 406]
3335D06l20k18L75m16m4J85O1jo2j90RK79J79m44K85j10J53J12k99j7k8M47p33
3358c91K93J56k8J62l26L7j61Q05m82j06QK53j82l42M06k22J02K0l50M63J81m24
3380a28J76l3J66J11j53o41O15k45L06j36Kl59O74j15n1m99M16l56j0L00J15m72
3402c17J89L1J58L43l68k12k04N52r9k79J2j10J19K21j00m6N44n58q2L52k33L1
3424e6M58n53p2O81n11p1J14m6O1K01k02k9J02J04k81K0J64N2j12k6K41q7q8L8
3448A02j34N1K01j32K0j44J17J99j80n84N56k12J25J50K40o07J40nL7r7N9L78
3470B80j26n1p2N9mq2J9K86j57k95J56j95K7J17k56n3J39M23p2M4k57J35P6k56
3494a15R3l57M45j43q9K57j31j5K03J69j30l74LJ42J46J04k90M1J64k91L16l99
$$ y = [406, 86, -132, 243, -173, -217, -32, 29, 28, -34, -224, -215, 64, 243, -201, 84, -26, 127, 239, -60, -77, -105, 342, -391, -98, 58, 30, 192, -134, -97, -258, 547, 65, -41, -33, 220, 38, -304, 102, -120, -18, 2, -348, 115, 296, -128, 48, 15, 181, 292, 139, -502, 113, -132, 174, 38, 40, -319, 355, 240, 189, -310, 106, -250, -260, 40, 155, -317, -128, -97, 61, 404, 36, -176, -380, 172, 73, -206, -194, -304, -185, 36, -64, -110, 434, -124, -206, 146, -87, -56, 402, -151, -223, 458, -53, -124, -10, -56, 5, 206, 4, -25, 77, 181, -100, -80, 84, 136, 24, -2, 239, 152, 64, 102, -32, 19, 220, 88, 108, -36, 81, 280, 100, -484, 72, -140, -15, 135, 375, -232, -92, -97, -60, -157, -98, 280, 154, 103, 31, 90, 86, 4, 23, 309, 152, -143, 13, -182, -155, -38, -294, -347, -208, 215, 143, 187, -70, 65, 141, -115, -22, -379, 66, -77, -166, 91, -40, -55, 148, 317, 187, -187, -184, -42, 104, 208, -82, -41, 123, -168, 148, -251]
3516b51l5J32K37q9k18J62K25J97l36j35J92J25k99k80K69J6K49k27m2K82j78
3537dL49m66J80j94R8M8l74M15J13o7k27j73K30N2k61K87p6j80J50j44J87J21
3559F4RN2k08K07j92J36r7K84r6j15j24kJ70M4rl48K22J57P1l31oK0J4j18J13
3584h3O1j08L5J50k7k40K82j64J14m6M1M0k07o0N2J16j04j4M28l59K36l2q9M5
3608F7q3O7l20K23Q6Q3j79o0q2L73j69k91L02J35m0k8j28k76J77j0R3M7j69L75
3632A93N5k53k22M30p9k46p4K89r9j36L86j09k00L0Jm6r4J52m6L38j12j69q0J15
3656B4j50N8j57M39j81K07q9j97j60J31J48j44J6j92N43j69r9r8K52j43l73K31
3678a03J80q9l7o8n1Q0J86j94K90k37P2J02j85n2J4O7J49L38k91k46K02j18O6
$$ y = [-251, -286, -154, 83, -6, -224, -62, 163, 360, 24, -111, 81, 206, -93, -373, -104, -88, 161, -66, -108, 174, -4, 345, -121, 59, -135, -37, 11, -363, 52, 165, 98, -129, -302, -72, -20, -281, 6, -70, -250, -100, -244, -57, 64, 73, 125, -83, 124, -68, 68, -29, 255, 159, 44, -80, -82, 88, 132, 123, -225, -3, 154, 225, -106, -112, -92, -78, -196, -83, -22, -130, -95, 55, 28, -212, 70, -94, 20, -26, 15, 55, -152, -212, -160, -44, -148, -162, 266, -93, 143, 111, 22, 67, -16, 51, -269, -46, 40, 123, -56, -116, -198, 175, 6, -285, 17, 152, 112, 84, -44, -320, -143, -153, -60, -13, -182, 193, 248, -5, -227, 203, 124, -122, -196, 93, -6, -142, 244, 135, -65, -35, -34, -80, -174, -22, -68, 270, 158, -11, -91, 24, -126, -68, -225, 214, 33, 240, 151, -46, -206, -75, 73, -71, -55, -247, 296, 127, 28, -70, 182, 39, -334, -103, 77, -12, -49, -117, -168, -88, 98, -96, 194, -43, 29, 131, -54, -106, -92, -25, 124, 462, 171, -75, 127, 9, 75]
3701G5P4j53j7L75j26k47M4n8l64O80J67m83P5r0l15L96M5Q1j68k5M82o07j12
3724b71J15M14k79Q8j93L29O1l99K94mQk08j05pn1J68N5J61j31Ql29N9N15m23
3748a25P1k1J18r0M6M07n20j9N3K17l34L20K8q5K41l36K19l93J44k0P1j0m7L16
3772B51m27J77L45m59L50k70k12M04m81K18O7l39M54J10k51J77J2p1k59K69j04
3793c9K70l12k88L96l51N31l76K06M5r5o1k37K48J14R4k45N3K73k43L66l26m5
3815b2J09p3K18k68mJ09rj15k3K33l72O49n47M73l40j82K16K23j94m04M11J00
3837A88l75K21J18k16L95j34m0k68L84n60M07j61K88j69k09k30L27L88l46Q7m8
3858D7J15k25R5J02j68J2j12L15R5k39N0o3N8m06M54n44J38M07j94N4j3L79m49
$$ y = [75, 149, -4, -21, 354, 228, -19, 25, -33, -397, 283, 450, -33, 42, -48, -363, 33, 78, 159, -9, -34, 448, -159, -271, -156, 258, -21, 67, -126, 203, 264, -135, 159, 155, 163, -45, -150, -157, -208, -40, 15, 176, 45, 53, -276, -217, 298, -125, -54, -75, 43, -47, -1, 406, -114, -133, -80, 137, -197, 123, 151, 66, 307, -29, 190, -203, -59, -79, -8, -18, -65, 251, -176, 1, 346, -113, 237, -33, -245, 159, -322, -104, -37, -376, 78, 188, -63, 114, 126, 55, -204, 65, -39, 231, -81, -369, 27, -324, 207, -169, 37, 82, -13, -74, -311, -63, 51, 145, -100, -47, 226, -17, 349, 23, -22, 87, 14, 232, -36, -40, 69, 60, -55, -78, 155, -217, 432, -115, 358, 18, -164, 52, 275, 81, -323, 88, 188, -187, 34, 152, -64, 331, 197, 157, -111, 273, -287, 120, -41, 247, 78, -131, -361, -34, 354, 8, 95, 47, 162, -63, 32, 134, -34, -22, -134, 181, 276, 37, 87, 24, 82, -324, 130, -414, -276, 131, -63, -9, -22, 357, -92]
3881i2PL51l93J91K63n09P1L67o0j56j11J2m0J12N0%j55k2J0K35p0j35j55K04
3905b5K39r9k6j96K58j45k31J88J7O0o3j68O2Q5o1K55l40J37L90l99P4j5K04k83
3929h2R0K5m6l5P1k61N1M18l03K31n5j22j45J85M4j57L37j89j81K56j54k15M45
3952B08k87Kk7o4n7K62j52j15M08j80p4K8k86L60J92j02k97J45n7k08L75K6j2
3975H8K39k18J70Nm97J88J14j63j08M73l23k65M5Q8J04k6K4K31M5j16l03N8J56
3998Ij15J13j31K04j69J37j60L7K95l24J50j02q1r4M71K9k60Q5J35m1j48J22l6
4021A26l8k73J32K74M5m07L88k19r8o3L83k44j23L18r2j77r0J17l2o9R6L47m41
4044a40J84J37m9N8Qp8J12k94K63m06mK15j30J96q2K53rl97J20o1P2qM6j62K74
$$ y = [-92, -85, 266, -127, 64, 327, -182, -111, 256, 196, 40, -71, -59, -99, 13, 63, 63, -92, -114, -104, 131, 61, -74, -229, -25, 214, 115, 89, -107, 151, 6, -225, -37, -20, 40, -23, -191, -129, -44, -105, 150, -190, -53, 337, -62, 12, -3, 201, -82, 8, 33, -13, -48, 23, -238, -187, 231, -72, 159, 104, -18, -163, 22, 66, -91, 246, 57, -124, 132, -22, -237, 208, -79, -77, -104, -168, -225, 37, -115, -230, 178, -2, -76, -48, -334, 26, 218, 116, -181, -36, -93, -301, 74, 100, 88, 327, 109, 279, 284, -213, -25, 89, -74, -182, 291, -32, -297, -252, -164, -60, -86, -62, 169, 214, 98, -205, -147, 9, -106, 7, -124, 80, -89, 48, -112, -75, 220, -104, 46, -56, -137, -231, 240, 269, 9, 94, 229, 188, 40, 162, 126, 88, -185, -53, 221, 266, -141, 247, 28, -70, -133, 250, 6, -117, 201, 109, -68, -158, -41, -73, -142, -46, 301, -140, 44, 181, 132, 190, 198, 120, 232, -62, 201, -205, -209, 6, -124, 72, -10, 243, 234, -163, -43, -104, -32, -40, 6, -156, 118]
4069A18k62j46Q2K32j6j83L79j43J57l55j59L9J66QK09N3m8k93J77N7k90J20J27
4092B9j20J84j79j1M10m22p9K28K21j35j77Q1K6n08N40j45K84j1k25MM6%O5nJ39
4117B40j64j11K92k37N4k05J73P9j21Q4k34J89K50k34m4j79J72ok23O80m17k93
4139b55L74K84p54n0L30J24j44q1J07l8L07r7k47l0J70k50L06k68j06qN47l33
4161a12Q4K17J95m40q0QK43L8m08L58n9L2j34M2K61r6M4J18m90K55k16K00r3l71
4185d04K65J50R9K16k96P9M6j04L62m58p4J64q0J77k2R5q3j59N4j18J61o5J07
4208A12k37K04k68K72j5N6k34J02P0k40L6K7J4P7L8N9L16k64j57J77O2l97J64
4231b6J00q2j5R9Jj78j3L68R5n22J20K18k18j84Q9j5LJ72k18L78j75j17J41l06
$$ y = [118, -144, -290, -208, 24, 8, -175, 204, 61, 218, -137, -296, -257, -91, -83, 126, 179, 131, -162, 15, 72, -218, -98, 29, -91, 93, -86, -97, 313, -109, -188, 40, 261, 126, -51, 30, 56, -452, 88, -57, 227, 216, -9, -5, 41, 41, 106, 101, 240, 76, -35, 257, 20, 74, -131, 42, 121, 0, 84, -150, 39, 289, 55, 11, -168, 4, -2, -225, 455, 38, -255, 119, 403, -351, -401, -71, 53, -91, -172, -65, -103, 204, 107, -140, -170, 0, -250, 56, -212, -318, -326, 221, -112, -28, 189, 384, -56, -136, -128, 115, 153, -255, 103, 44, 76, -58, -16, 245, 149, 193, 311, -179, 76, -140, 60, -33, -404, -139, 11, 110, 326, 30, 109, 155, 51, 413, -45, -119, 45, -35, 142, 120, 215, 132, -27, 27, -91, 70, 5, 112, -125, 79, -189, 83, 68, 124, -110, -8, 62, -178, -142, -115, -101, -24, 14, 73, 389, 125, -32, 145, 207, -190, -26, 74, -8, -23, 76, 77, -101, -114, 254, 349, -173, -53, 165, -53, -237, -148, -163, -160, 12, -206, 172, -3, -120, 21, -285]
4255b85J26q2N01k64qk27M18J03n11K62k4p2j90K28j02L90k80M0J1mj81O0J44
4278E3R6r0l53O15o33L28M3m2j16J22k37L38qk46m6J31j37n6K18J19l51J12j2
4301a52Q7J6P1NJ74j05Kr7j30K77m03M89j43P6J61k79j83K31j67N4k6K41l05L5
4325g1J31m52M07p0j72M57j82p1j64L10k02K65j15L6J33k64l9k49L03m3R3K40
4347B81m89L28Q7j48j49J28j40J14N8j42J46K2k61J80M6j70L14k77J75j8m3o8
4369b6K39k29J16j71j41L06p5Q9K5k26%o3p4L22j46j7L1j91J13Q2R6m29M40l0
4393D1j89J61P1k45M6L42k51KK32o14N60p1J54Qj28Rn0nk27k1P8OJ77l85K20J55
4419G6j01J00j46R7j08K69N4r6l57K33k78J37Q5L52l33L1k56L46N0k38M7J33j39
$$ y = [-285, -159, -241, 260, -4, -12, -239, 179, 282, -229, 33, 9, -63, -253, -25, -127, 263, -17, 23, 34, 30, -151, -91, 53, 149, 59, -294, 321, -312, 16, 59, 17, -99, 23, -214, 124, 116, -130, -176, -45, -182, -238, -20, 99, -252, -140, -152, -65, -49, 22, 27, 201, 96, 98, 1, -129, 148, -255, 234, 91, 167, 328, 49, -134, 97, -70, -16, -42, 199, -106, -71, 60, -392, 15, -55, -227, 230, 48, -23, -187, 123, -79, 186, 71, 107, 240, -24, -63, -312, -9, -52, 41, 281, -208, 120, 207, 59, -90, 38, -102, 12, 70, -72, 74, 96, -165, 15, 61, -109, 205, -72, 103, 85, 42, -26, 213, -16, 100, -71, -212, 94, 19, 108, 133, -93, -93, -156, -230, 92, -54, -71, -40, -231, -118, -36, 60, -369, 71, 41, -148, 13, 84, -161, -115, 227, -24, -22, 210, -404, 156, 85, 239, 247, 119, 128, 78, 73, -154, -175, -97, -91, 86, -299, -79, 76, -25, 75, -71, 26, -82, 187, 241, 145, -212, 21, -257, -120, -35, 317, -16, 15, -241, 105, 155, -83, -36, 97, -42]
4442d2K74m64J12M2K96k16r0K0K13N7J93m86L5K20k86K20J16k17k64L56p4j06
4464i1o8J42k58L13lK5k8l11K24n6p7K40Nl01L83m35K25P2j40j95L18L1j07k3
4488a15L98j22l88N2l7J39k92L0L22k44N18j04k97M81l99kK81j79J85l85K00o7
4510b5qj53K17m3Q2k78N9K39j25J87j89n0q1J22K98m03M25m85RN01k45N8J13k54
4534b9M7n6R5M7m02J37J05M4j07K33k12K75o30O36J17k33k60J64j14K68k16J0
4556h1R0k42L74l74J85K47j51p4j58J09K84m06P8K61k28n8M24k76l1j0n9K21j78
4579e3j98M88m61K80j6j5k22J93j75M1j88K84j09l3J83j02R1k30J17j11M8l3L40
4602A19k74R1J22k27M69m44J20Q9r0K13Om75l2M59n12P09k24l71K57r9J1L75k7
$$ y = [-42, 232, -232, -120, -78, 218, 2, -88, -68, 145, 202, 395, -91, -56, 164, -122, 98, 214, -3, -267, 89, 15, -91, -159, -17, -275, 38, 35, 60, 32, -279, -55, -111, -188, 52, 57, -244, 139, -296, -71, 1, -139, -334, -16, 15, -92, -115, 283, 161, -227, -175, -212, -73, -365, -335, -13, -257, 261, 157, -140, 341, -58, -60, 221, 42, 227, -158, 42, -25, -33, -186, 31, -12, 70, -208, -149, 90, -35, 152, -37, -87, -168, -46, 252, -151, 274, -211, -202, 299, 54, 112, 225, -29, 18, -38, 57, 104, -298, -161, -56, -12, -119, 114, -98, 177, -453, 183, 300, 67, -193, -29, -143, 125, -91, -81, 9, -233, 141, -233, -48, 199, 48, -26, -184, -75, 209, -197, -119, 142, -86, -144, 280, 4, -27, -37, -96, 125, -53, -251, 237, -224, 56, 40, 25, -197, -4, -179, -138, -326, -42, -151, -184, -1, -103, -12, -242, -125, -236, -188, -221, 119, -155, -64, 58, -169, 300, -144, -24, 65, -25, 188, 194, -281, -313, 146, -366, 343, 119, -252, 5, -94, -83, 292, 265]
4625B65p6k20j26j50K83j0j49J89N3PK2k3o2j15L8q0J40R8k56k6L05o2K34k47
4649C2K30k61j25K72k79J26O0J81k64K57m28L88N8k75p9or3K37p4j86K28K96k19
4672G6J11k52L1J27m12r8K59M60j28j23p9J7K8K26q1M8p6l72K08K4M7K31k16j74
4696a18J05j98K36n2Rr1n6m3M16l89K9N9j21J58k14M01M5k23K19l92K85l29K52
4719a2L00J76n65L63k40N2J00m1N0m8mk63l7OK94q7k43N13l55K57k01K74o20L21
4743a0k5K98j69k51k4J97j41K60m07K85j90K64j44J7K31k2po1Nl36J19q5K33K82
4767C19j77l01M14n04K70P5L49l00J05l2k30J76j02n4Q8l60L15k68M45j42q4R0
4789I2M0j43L5M9N4k03M6M2Jj24o5J54k20R0L49k76J28K82j14l34L55k32J42k03
$$ y = [265, 189, -31, -157, -307, -24, -34, -183, 6, 59, 66, 88, 65, 3, -112, -74, -154, -14, 84, -172, -198, 107, 45, 279, 32, 262, 1, -124, 148, -131, -5, 55, 236, -28, 229, -199, 189, 247, -28, -107, -113, -206, 31, -43, -229, -1, 295, 76, 187, -65, -34, 93, -319, -417, -158, 302, 174, 51, -28, -11, 17, 243, 162, 210, 134, -238, -30, -6, 41, 272, 56, -118, -13, -211, 25, -27, -18, -109, -165, -208, 208, -181, -152, -93, -214, -56, -270, 131, 176, -47, 172, -220, 65, -264, -12, 288, 464, -101, 262, 22, 74, 174, 133, 183, 135, 131, -132, -169, -163, 131, 44, -199, 314, -41, 216, 15, 289, -331, -10, -35, 263, 94, -157, -181, 16, -125, 135, -272, 13, -177, 87, -57, -40, 191, 169, 162, 101, 106, -230, -111, -196, 37, 319, 142, -159, 255, -249, 21, 96, 445, 145, 250, 218, -12, 164, 62, 8, 96, -264, 51, -217, 228, 86, 2, 92, 132, -11, 24, 73, 127, -76, -30, 12, 13, -111, -176, -22, -242, -152, 197, -79, 49, 331, 217, -117, 238, 6, 148, -55]
4813e5j36L2q6K15J43m4J49n01P48o58J87L67l98K65n48K97K28j62k16M9M0J38
4835E4o4j05J71K19l55M11n26M18k7q2j41J07k18o8J38k03J32J42m9o9lK00Nk5
4859F2k30K17n4l8J5R2Jr0J51n2lm67L92Q2j46m8J67O0R8k31k39K79m6M6m6K77
4885B49n2k7l84K04j30L38l33J03P0j89P2L0J72k15k5K2N1J49J04l49L31m06N10
4908B95k60pm4K54j29k7l22M96j76k08J49o3J11j44L78l32q5M04m10Q0J10j44
4930g4M3j0K04k24n1M5o9K62n1k31L94k47R9j48J65J38l21r6M06j44p6k41N58
4953C31J9j74k34qJ90j56O6J24k86J22j27L08J07k73N2j2j90k43L21j2J5p7J44
4976Gj13J12j03J6k28K76k72r9L59J55k10M07k16J16j01m83J49J45O5m3P9N4j81
$$ y = [-55, -191, -159, -245, -30, 113, 69, 218, -283, 465, -193, -6, 361, -37, 228, -320, -23, 205, 43, -173, -124, -84, 54, -10, -115, 56, 275, -80, 331, -195, 223, 196, 114, -27, 80, -138, -206, -68, -271, -139, 3, -46, -115, -118, 82, 87, 62, -168, 49, -5, -43, -28, 64, 65, -25, 126, 74, 71, -396, -4, 78, -68, -116, 51, 111, 209, -22, -261, 18, -28, 18, -28, 249, 197, 170, -214, -10, -140, 198, -135, -32, 38, -151, -79, -49, 123, -92, -117, -95, -44, 105, 209, -140, 191, -215, 295, 35, 28, -16, 238, 109, 82, -240, 256, 80, -128, 21, -42, 69, -75, 303, -29, -114, 290, -120, -40, 70, -74, -31, -41, 163, -61, -112, -67, -136, 126, 75, -156, 238, -9, 90, -58, 107, 245, -76, -172, 234, 90, 14, -227, 331, 350, 176, -58, -66, 124, -32, 34, 158, -128, -6, -133, 175, 282, 9, 61, 49, -141, -384, -63, -75, -60, -137, 7, -106, 6, -97, -81, -309, -33, -305, -404, -45, 110, -100, 307, 91, 207, 106, -377, -228, -83, -18, -61, 18, 72, -109]
4999a09N8o7j50N08l50L08l96N18p12N10j35M5Jl97K70K02J28l53J87j32J57n11
5021d20N98k09J16j87J12O3J45j5j35q0J92N3k98p3K98j83K15p9j2J8j88J04J28
5044A63o5o4n5L67m28R3j25p0K75j9l05K41J15k80N7j71J48K73j66J66q1q1R8
5067H6K59k83L11m57K59k65K54%k58L94j31K0m66N30k98k5j84R6J87M5l65K10
5089h1O3Q7p5j83J39N7j88o6K42j72J57o6j35J12O4P8j12L56l39M9l14L15J40
5112A28pJ2l04J52J3j81O01n97K54m04K29K53MJ62q0l15L60j32M1J85k72k6J0
5135H6p3M3PK08r1k22k6J88L7k39n9L38m39N39k09j06M45k43m95L23j18K03N1
5158A48qk97J36K18j83M10k67k77j9K36j51j07nL09j31p1%K67k90K83m07O5J4
$$ y = [-109, -51, -118, -268, 240, -110, 198, -198, 320, -392, 118, -17, 28, 29, -368, -98, 104, 232, -121, 66, -66, 91, -420, 178, -31, 85, -102, 10, 73, 218, 203, 68, -12, 180, 233, -65, -138, 160, -23, 192, 113, 101, 119, -69, 35, 163, 98, 34, -21, 346, -82, 11, -114, -184, 91, 72, -233, 8, 123, -157, -100, -271, -123, 150, -16, 150, 69, -12, 86, 345, 62, 373, -84, 175, -90, 164, 164, -94, 300, 169, 189, -277, 253, -45, -70, -254, -158, 29, 74, -291, -81, -18, 69, -6, -189, -50, 7, -181, -247, -5, -177, -20, -86, -221, -109, -45, 33, -79, 277, -62, -13, -327, -12, 128, 121, 133, -171, -19, -6, -187, 414, -183, 71, -333, -104, 149, 153, 315, 235, -80, 280, 148, 189, 374, 102, 76, 86, 13, 56, 63, 271, 180, -42, -68, 120, 157, -82, -141, 197, -242, 297, 88, -18, 427, 184, -311, 12, -106, 97, 148, 140, -157, -21, 197, 14, 424, 157, -120, -139, 97, -54, -161, -166, 143, 12, -59, -59, 208, -82, 201, -206, -141, -127]
5181a27l9J37J92k43L02k83K02L2L8n6l47r5k3N99k87K3m39M09k9M1PQ9o9J45
5205A79l27L99k02L59n18J39l0L08j97k09j06L95K8k54J76l40M95l61p3l26N83
5226A18k92J69o2L03o3l25L90m31L65k77P4K5l7L5Q9J12p9J1l01J16J50j51K77
5249B16l55j73L77R1l98R0K97j36k5LJ59l20Q2L02J12k72J01L3j05J39r9j2j3
5272I4q2K06mk86J96j41r2O6j04J55K07j1k02J96j81l60L23K15J6j19m2n9r5M0
5296f4L2L5J51L1l86k9L12k01L24k00j67L61l88K83j20k41M73r8k30M34m95J92
5318IK70P9k15OLo3o0k16J18p9J09j35J42R4M31o60K05k30O9J54J72k75RK22m11
5343b52K70m1K0K21p5k59L55m53p5N26j52j25N3K41p1l62K22K83n37L32j3Qj49
$$ y = [-127, -166, -29, 163, -80, 222, -61, 141, 173, 211, 155, -192, -287, -310, 289, 2, 25, -414, -5, -34, 7, 14, 103, 34, 179, -148, 251, 49, 408, -110, 29, -1, 307, 110, -99, -205, 190, 218, -36, 140, -200, 295, -66, -139, -465, 118, -174, -5, -67, 236, 173, -152, 238, -193, 172, -105, -31, -6, -43, -8, 81, 193, 114, 125, -176, -60, 90, -61, 216, -139, -312, 65, 156, -242, -152, 145, 9, -16, -13, 146, -174, -92, 210, 322, 50, 151, 184, 79, 218, 119, 107, 94, 12, 218, 214, -72, 124, -17, -109, -43, -147, 8, 215, 204, 2, 198, 17, -343, -20, 195, 211, 92, 50, -9, -104, -64, -32, 3, 154, 185, -201, -230, 82, -119, 205, 5, -162, 199, -189, 94, -26, -267, 206, 108, -122, 312, -183, 9, 279, 358, 143, 149, 152, 89, 29, -187, -69, -148, -39, -174, -32, 62, 493, -167, 38, -192, -123, 31, 203, -72, -63, 159, -252, 18, -23, -3, 218, 143, -116, 239, -214, -289, 237, 85, -40, 13, 254, 183, -179, 43, 326, -211, 121, 108, 116, -33]
5366c3P3PJ26m22M15j51k1J30j12M8j79O5L43k58l68O31k75J20k50J55J79p1N0
5389B02j90n4P7j50L9p0J05K64n55N18k09o7L24n0r4j96K33J25l10L3MJ48o0j59
5413i2J8M4jq3k91M96q3K5J4L7J04m1Q6k54M1n6k66k01K86K5K8K10K71l78J80
5438A19n1P9j32J87n6j05mk08rK94j00J23Q0k67j56L52j30k78M58p2k63M1J41
5461D3J45N7j45k95K90k23K04j81j08K05p7j36M25k53j08J12m4J52j28J79j29
5482a5o9L09j92O2o7j04K27k08l76N81j55L43m00M6J04j29j02P4Q1n4Q2Mk34J50
5506d2l6k16K19J90k44O5k7O5l4j89L02R8j10k82M06K32k30l69K67k37J98J52
5528A78j72j7J78l06K60r5k99K47J52m40K18K18l22r3L26k83L12N0Q8J85o47L14
$$ y = [-33, 40, 47, 173, -249, 166, 15, -6, 124, 12, 60, -119, -54, 289, 31, -337, 294, 19, 139, -111, 44, 223, 152, 202, 12, -42, 35, -115, -76, -146, -41, 223, -332, 186, -23, -90, 234, 184, 90, -106, 127, 252, -58, -25, -21, 127, 67, -92, -74, -30, -31, -114, -405, 91, 8, 33, 47, 84, 188, 147, 233, -21, 20, -36, -302, -503, -217, -192, -164, 46, 317, -61, 119, 68, 147, 15, 202, 146, 41, 37, -171, -180, 114, 14, 137, 217, -50, -206, 146, 16, -262, 196, 124, -139, -98, 43, 188, 245, 100, -195, 95, -128, 76, -105, -213, -8, -85, -221, 204, -49, -157, -45, -89, 63, -65, 114, -15, -84, 225, 33, 95, 28, -76, 151, -57, -433, 148, -7, 336, -64, -18, 86, -43, -145, -71, 10, -44, 38, 42, -192, -42, -78, -294, -75, 115, -129, -64, -91, -26, -60, -249, 53, 151, 41, -241, 165, 397, 167, -202, 65, -172, 26, 178, 6, -11, 167, -139, 121, 26, -273, -26, 126, -314, -96, 122, -200, -293, 33, -250, 62, 112, 200, 385, -262, 52]
5550E2J72l64J80j22J59O8l90L71j38k73K69P0m33M33o3j9k07J01M53j65k26J99
5572A27j23q2L7O3j51lO0J38K00k87r5K09j34nR7K15k50k9J33J19r7k72K32j20
5596a8J12j16k04M03k46k48J94l0J20lO8k83L98k36o8L88j61L47k81P1l1k61J26
5619D1KJ27j8K42n83J81p6K50k9j95R7q3R9J80m67L65j51K77q5k62J22L3N5m2
5643H0R1o7K63j77k79K45j1m53P3K94q3K04m48K06j09J02N2R1j07r0J76j26l14
5666c87M21J78l85M05m98P6n4K80j6P6k17O1J06o3O4J01n0R6k1j35j54m9J72l16
5690c09L55m1r5k38L47K5O1nk4m0r7J09M7k31K16j16k9P9l47L42roj60J58j08
5715a16j74M60j07k32L36Kj84J16l7L60l51k36q9P3o7K65r9N6n5j7K0L09j63M8
$$ y = [52, 224, -140, 40, -82, 77, 145, -245, 126, -12, -285, -16, 54, -379, 54, -9, -28, -235, -134, 319, 154, -72, 127, 4, -78, -41, 22, -129, -132, -72, 66, 266, -21, -116, 93, -41, -46, 51, 266, 16, -13, 120, 239, 142, -130, 102, -18, 94, -22, -226, 177, -69, -317, -123, -153, -33, -36, 32, -251, 147, -89, -157, 231, 70, 417, 136, 207, 176, -85, 41, 43, 170, 152, 394, -189, -8, -84, 166, 137, -58, 39, -44, 55, 235, -232, 133, -18, 259, 174, -88, 34, 67, 122, 80, 171, 104, 367, 190, -89, 156, 145, -308, -235, 59, -24, 180, -268, -62, -171, -69, -17, 74, -33, -123, 53, -73, -387, 34, 212, -173, 232, -266, -190, -244, 36, 20, 96, -121, -60, 46, -17, 47, 148, 98, 194, 173, 38, -116, -165, 7, -309, 46, 5, -90, -328, 19, 44, 105, 100, 76, 36, -61, 48, 95, -136, 80, -36, -65, 14, -333, 9, 0, -6, -166, -8, -116, -290, 170, 63, -169, 167, 169, -15, 101, 64, 424, 73, -163, -252, -179, -246, 19, -80, -24, -79, -96, -76, 233, 70, 118]
5739A18q8j50Q4J89l24L56p6k32L85n01Q2j7J84k3j6Q6J96l46K58j44N3J05l36
5762a57j65M71k83j95J59L8K5J58m1pkN01n79j60K86K19k33j69K95j48j42R6j72
5785b05L01p1J67j82k75pK08L09l00P1j25L02l32j93L91l04L95l30J91j71L41
5806A81r6j72M65k23j34J34j63j94K65L39l63L81m19L3K02k82m0N8J17p0k19J04
5828i6N5j86RM7L7O9L82j48k68K96k93lK91l44K22k09L36l44K70j19l53P83n86
5851a52M39n51K71r9L38l63L06M1k50P9P7k97P6rJ70l73K90K29J1J2k7j32k29
5874a43M82o43K69j83J47J74k26L4L13m11J10j23L91m10K17j25K03k44R4N9J54
5895A39j00L2r9J65q5m4j48J36j8J11j22j17K71j91K23l43M09k82n9K04k29J70
$$ y = [118, 30, -120, -36, 153, -171, 185, 109, -123, 262, -239, -157, -174, 10, -13, -29, 57, 253, -93, 165, 21, 74, 179, -157, -322, 149, -134, -329, -170, -132, -107, 51, 10, 3, 1, 502, -77, -237, 49, 268, 35, -134, 161, 13, -129, -33, -205, 96, 25, 192, 10, -265, -272, -64, 245, -55, 16, -109, 193, -139, -332, 59, -245, 150, -180, 11, -160, 181, 85, -87, 378, 155, 21, 155, -8, -202, 63, 402, 39, 420, 1, 34, 236, -46, -86, -28, 89, 19, -200, -96, -41, -227, -218, -171, -134, -65, 317, 169, -99, 197, -96, -99, 192, -152, 70, -139, 197, -147, 123, 4, -349, 434, -152, 287, -264, 7, -92, 246, -117, 189, 230, -20, 59, 136, -161, -85, -94, 76, -297, -7, 222, 233, 245, 218, 86, -143, 339, -304, -35, -218, -71, 103, -123, -89, 224, -187, -77, -200, 191, -219, -2, -127, 76, -168, -74, -15, 139, 39, 71, -28, 137, 52, 8, -140, -4, -22, 89, -33, -150, 121, -70, 153, -190, 219, -63, -122, 82, -147, 23]
5917B3j05L26m44L93n8k92K21O3j05J58k04j32o0L62k27r0J88l8J8k5J75j80K0
5940a3O7J35j04p0n0j62J52k18K57K68m28J44R6j27n8j16L64Jk72M9l3R2J21J01
5964A96l22M03k98J42N9m9P4m69K71j75J86m7k96L35J26l2j87P7n1K1Q6J1P9n
5988A35k29K89k49oJ5j02L4K29Jk04l05K55l1P6Q9k94L94j36k4K2J27j19l7K00
6012A30l92L41r5k22J86M3l23L05J66k52J54nj96J07M8l2q7J94j39N4o1J0R3m1
6036a4j07M52j82j79J81j39j04k26M95j50Kmk00rJ57J75q4o79P11l05J37k9J42
6059D1j34J76J58j48m20K02J96q9K37l20J46p4Q6K91l60N2J53j12j53L79m94J86
6081aK56k77k11K4L75L7l43K06j07K36o0l67K00N6j90K58l2p1k05r1K06j1K59
$$ y = [23, -82, 244, -200, 193, 135, -157, 64, 127, 22, 180, -24, -156, -216, 146, -81, -171, 17, -21, -3, -28, 147, -33, -13, 54, 189, 85, 15, -35, -197, -45, -263, -6, 262, -166, -22, 74, -53, -111, -227, 137, 138, -134, -85, -118, -26, 95, 196, -126, 277, -21, 121, 180, 131, 205, -264, 7, -168, 18, -29, -325, 10, 136, 104, -83, -6, -57, -36, 50, 61, 140, 135, -94, 195, -54, -60, -45, -147, -113, 116, 117, -87, -392, -137, -168, -92, -3, -297, 97, -39, -63, -41, 86, -33, -70, 130, -262, 79, -16, -238, -52, -9, -332, -27, 139, -113, 41, 36, -160, -53, -5, -37, -124, 70, -69, -15, -76, -66, 27, -14, -121, 331, 149, -30, 151, 12, -92, -318, 177, 27, 29, 25, -175, -184, -27, 148, 64, -615, 96, -209, -72, -101, 41, -93, 83, 241, 93, -327, -125, 71, -18, 219, -101, 45, -29, 57, 348, -12, 40, 193, 81, -72, 307, -187, -1, 255, -22, -233, -209, 166, 203, -140, 66, -41, 195, 135, -232, -32, 24, -166, 92, 60, -11, -216, -307, -101, -112, 147]
6104A47k30K64m84K77J82o20N27o6L6N5j4j48J51l26M31N9j22K0P0k38Q5O0j04
6127A2k29J87l5r9K14o4L49m60Q1k7K9O3p2J47j81k12N89o10J62N3Q4k18J58o1
6151a40J8O5q8J24Rp2J07J3j09mN0l12L7K23j09L38l76J03K85j64K1k1Q7n7J02
6176A30j61J41Q4N5l88J7L63m10Q7K54k78o7J69L0P6p3o0J29k2M36m34q5K2J88
6200B03j99R5mJ20j45l2J45k59J78j04J76K00n67K56K37m54J15m7J04j27j45L90
6222A36k73J27K66j98k00K21On7nL00k34m8k78M71k73K9j16L13j59j95K17J95
6244B45%j04m36N87l57j00K00j99L78j97L17O9k71l28K78j26l20L72q2K39l1j37
6266cj61l59N66K71j92j29K37j15Q8n2j46M7j81O6l20L43R0J23k85J73J58k28
$$ y = [147, -83, 181, -303, -26, 156, -464, 63, -3, 33, 88, 74, -74, 77, -249, 182, 241, 119, 139, 209, -29, 56, 116, 12, -217, -30, -65, -164, 50, -14, 335, -125, -44, -71, -42, 21, -51, 96, -85, -297, 292, -318, -156, -103, -19, -237, -79, -140, -122, -57, -145, -21, -12, -84, 23, 36, -73, -77, -27, -339, -302, -79, -188, 150, -226, -123, 162, -2, 19, -2, 85, 28, 130, -31, 110, 194, 249, -139, -122, 241, -169, -82, 172, -106, -173, -4, 26, 102, 29, -31, 98, 76, 512, 78, -7, 15, 203, 4, 99, 95, 215, 70, 38, 183, -76, 102, -2, 174, 374, -193, 63, 300, -154, -39, -86, 18, -109, -254, 136, -137, -10, 256, 58, -142, 79, 85, 28, 23, 323, 89, 41, -237, 234, -39, -10, -126, 187, 28, -167, 50, 245, 245, 141, -295, 292, -65, -165, 35, -164, 214, 17, 334, 403, 132, -196, 82, -44, -364, 8, -74, 165, 134, -3, -164, -523, 43, 314, 122, -7, 230, 115, 203, 151, 5, 52, -129, -63, -383, -40, 50, 173, -112, 61, 219, -9]
6288iJ99k78m9L11k9J15j62J14J7k43j03J73k3j58Pn7J55k48K89p1J72j41J05
6311H6l33J56J25j20OJ01k11K4K24nl93M41j10q9j18J77J78o5l8l0M7p0j63rK19
6336C0k76L41j14J27j98K37k34n3J17L9j34L88k42j6K14r8or0l8j07K93k88M89
6359C81k33l26K45J81j83J27Q3k37O5J64m43J16j36L91k74p1K27j76J26lJ5M8
6381H7j75K11K3l10p6K32K79Nk52n7M00o95K84j01J31j9r4j04J88j19R9m4n6Q7
6405g6J05L99l46j41K68Kj41J08k79J74j28K47l29r9K89J51qn6j1k97m2J09M75
6428C74j70k54M3p9k94J20L29q6P1k75N5J6K8M04n41K42K25j28Or4k99M47l58
6451b18L93l90J36L77o0l30J39k1k04O8K97m12M00k65j35L44k09q5N3K43L4j22
$$ y = [-9, 190, -88, -137, 174, 145, 260, 98, 212, 229, -14, -117, 56, 33, -125, -118, -175, -20, -268, 21, -50, 122, -19, 86, -247, -91, 34, -86, -80, 21, -190, -166, 58, 53, -340, 101, -9, -98, -216, -39, 139, 74, 36, 6, 53, -17, -180, -189, 30, -246, 95, -19, 108, -90, 147, -87, -140, -23, 16, -118, 270, 28, 12, 226, 128, 122, 32, -6, -113, 180, -108, 381, 148, -178, 67, 248, 65, 192, 275, 38, 103, 267, -176, -60, -196, 195, -79, -150, 77, -99, 27, 24, 39, 87, -88, 123, 146, -164, -240, -8, 271, 276, 24, -33, 367, -328, -44, -145, -14, -33, -127, -231, -43, -162, -63, -107, -163, -76, 29, 428, 82, -59, 209, 211, 70, 178, -101, 73, -55, 192, -137, -236, 53, 204, 196, 140, 129, -168, -210, -101, 374, 204, -50, -7, -86, -380, -260, 69, -17, 54, -221, -166, -150, -122, 282, -259, -17, 208, 80, 86, -8, -307, 140, -218, 175, -215, -79, 298, 238, -92, 47, 26, -178, -110, 187, -225, 175, -90, -225, 119, -90, -175, -122, 121, 155, 33]
6473C3j99N9n5j06M68k81K62K3r3J29k78j40R9k8j01J58k7k10L22l46K90J57l45
6496b09j65J90J55N4O0J47k80K54PJ1l65M04l40o8J8l4R9J46m73M64l11K83J7
6519F4Q3k13Q6j40l8P7N9L57k02l57L03m36L26j62K74l5P0l97K98l38J53J44n0
6542g4jO2M98l82k76j49L19o2K65j95n2q3j91L33P3m58L42O1r2J44j15N1R2o2
6566D8p4J12k08J84J09n21L07nm8j18L84n92P02o73N29l88J94J81k17R7l3j33
6588a63K80K13l04K8j31PO7J06j18J9Q0n7L6n17O69k30L16l34RQ6l3K08p30L80
6612a13P6M7M0pl01M06k99j33M04l43K93O2j6j46L3j05q3M60k59O0q8J43J22l11
6636e8j40K1M4K98n3l49M16mj96O7k03J32K88j74J13j90K57K9j51n30M20l35J86
$$ y = [33, -166, -107, -162, -268, 200, -81, 181, 204, 111, 240, -38, -178, -79, -107, -208, -50, -77, -287, 35, -311, -21, 136, -209, -374, -184, -29, 25, 85, 232, -48, 206, 213, 224, -141, 263, -77, -145, -127, -161, -62, 84, -389, 75, -236, 47, 64, 147, -66, 20, -120, -158, -81, -22, 335, 133, -224, 79, -357, -31, -193, 81, 46, 116, -281, 17, -321, -168, -24, -74, -75, -13, 485, 103, -173, -322, -3, -65, 200, 5, -47, -130, -321, 12, 85, -373, -31, 30, -62, 82, -33, 18, 110, 48, -26, 86, -122, 62, 171, -350, -43, -48, -96, -214, 170, -422, 280, -393, 136, -252, -58, 123, -94, 3, -30, -163, 117, 330, 26, 54, -77, -70, -3, 103, -15, 4, 84, 27, 63, -454, 215, -15, 301, -33, -24, 62, 29, 237, -493, -113, -37, 10, 50, 43, -258, 148, -151, -284, 120, -223, 70, 132, 116, -30, 3, -102, -185, 275, 16, 76, -12, 131, 253, -58, -198, -177, -133, 165, 112, -237, 179, 175, -21, 46, -157, -25, 263, 89, 202, 12, 269, 298, 147, -383, 37, -298, -112]
6659a12OM24k70m26J99K56J11l05L0L74l91J6M9l0K31k01q0J65l26m5M12K31n45
6682b27K34k15L69pPr9K06k71k0k74k0K30LM3J2j65K22J95lj55k8p8J00p8k33
6707b52L3K23l9J41j98L0J59j06o5l23K51M1M4K48k85RJ67j3lKq4l1q6j89N26
6732B00k48N9j61l52K08K59l1p6O8r0K29k5k87K83K55m8j59r4O0j84j23M48k30
6755c9o5J97k28K59j33r6N62q59N84J03j86J82l11p7l86N72o1J5M4Q9k73K79J19
6778B91K1k83k57K76m61K15J51M1M6mn4L27k97o4P2j39J31K27l25o5K03k82J96
6801c4K34l91J48k48L13J39k02M6j44M7QK46k11N2K08j49j12M9J09ml52L10j32
6824g0r0L90j59J14k51J21J02j42J5K9j15J54P9l61O5R1On6K20l46K03mj70J49
$$ y = [-112, -106, 318, 48, -378, -179, 77, 188, -117, -87, 287, -104, -88, -39, -69, 162, -39, -119, 46, -280, -325, 87, 318, -227, 7, -208, 161, 154, 161, 62, 268, -3, -23, -297, -317, -87, -84, -41, -29, -194, 28, 223, 220, 65, 37, -41, 59, -19, -252, -219, 4, -35, 106, -92, -62, 97, -9, -74, -397, -146, -105, -61, 187, -98, -89, 78, 65, 62, 64, -20, -51, -137, -326, 200, -48, 11, -150, -502, -294, -35, -66, -142, -74, -164, 65, 40, -247, 36, 291, 243, 84, -10, 50, -134, -257, 191, -39, -104, 93, -135, 124, -9, -105, 457, -402, 182, 285, 99, 281, -30, -107, -493, 79, 18, 33, 77, 166, -107, 172, 291, 312, 29, -228, 48, -413, -198, -47, -6, 40, 36, -18, 309, 12, -52, 20, -119, 12, 239, -86, -151, 52, -230, -34, 200, -191, -43, -291, 22, 161, -41, 5, -139, -92, -84, 162, -49, 3, 211, 62, -50, -1, 108, 104, -248, 62, -70, -160, 230, 71, 185, -66, 55, 157, 15, 30, 59, -56, 98, 177, -184, -119, -28, -22, -78, 142, -204, -1, -5, -175, -26]
6848b6l44M02J36nJ61l97J19J28J04l02o4J5o8L7K36k00L33j40k81K05j2l3R1
6871I5l17L25l3p5R5m93P76m59J07L6k90l9l0M58l01J61K37j46j73p4J23l6L27
6894B74j40k43m25O84p1J74r0m07k06Q54l37mP3n8L5k17M09K8k47J01m0j9J21
6917B49k39m9j6K40l16K49oj78m6P5J33k07j32MK4J99p3q7J25K01l6j70j15r0
6941b61N74l93J19K89j31j08p3O7L7K78m63J72N9j17j50L41k48J13p5J38l3k62
6963a27J20n4J13n47M40L22j5k73oJ33m7l66L65j54j4q1O3J66J07m13K24R0k9
6986A7n1K15j04m3K91m16j39J30K19J17j39Q9l3k06J52K8J8m51K70K37j92n5K00
7009A54l60J93J39J06k25k80M83j92J71j35K49k77l5J77o7J67l50P4K89k98J03
$$ y = [-26, -370, 32, 168, 163, 324, -73, 46, 174, 278, -24, -88, -73, -141, -104, 132, -68, 265, 125, -156, 49, 37, 4, 95, -222, 103, 70, -5, 90, -403, 373, -86, 21, 57, -233, -272, -302, 156, -145, 16, 253, 107, -66, -140, -17, -53, 274, 134, -109, -534, 150, 79, 253, 163, -244, -450, 404, 67, 63, 136, 78, 113, -104, 305, 333, 86, 187, 147, 128, 249, 10, -39, -55, 185, -131, 118, 112, -66, -112, -37, 96, -111, -243, -239, -215, -16, -89, -176, -51, 150, 114, -56, -171, -261, 313, -80, 39, 328, 197, 89, 16, 83, 120, 398, -65, 107, 166, 49, -101, 240, -8, 105, 30, 168, 135, -127, -7, -61, 52, -495, -55, 267, 252, -21, -27, 106, 59, -307, 58, -96, -110, -191, -128, 38, 145, -268, -44, 46, 17, -34, 181, 77, 34, 325, -91, -230, -100, 119, 236, 97, 186, 153, -53, 99, 127, 145, -306, -36, 201, 9, -46, 154, -206, -13, 126, 232, 7, -273, 210, 18, 189, 54, 303, 26, -9, 168, 101, 268, -82, -8, 281, -17, 86]
7030H6J06k88q7L11k50K76p7j12j07j21K57O3K49l32j63J07N7n7Q9k92K60K97
7052B72l75j37j43L55K24q5%j43P7L6J27l4qo6J47j32n02P9M55m32J69k70N26
7075A40J59j27m39L94J76n01k8j63M72K12k42k04L45l65J58j7J17k7q7K85n8j52
7097D8K9k04J24l55J36K79j11K1RM1N4l82K35J37j19j89K99j32o6j47L91j70k5
7120i7K13k16J42k36j0l2M14j18r4K48K26o12K9J92K95k32j86K0j14P3M6J63k25
7143a11R3k67M05K18l99m2J04k19K68P4l80N59n87J31K71j59j64L77k00j26Q6
7164f8L38n64L65j46j54N88l96J24r7k3j32K8J47K71m01K37l89r9K92p8k1K78
7186A00j43K6r6J44r9m8Q5j95N4K68j49J77J22l31K92j91J02l70L83K23n52K14
$$ y = [86, 192, -96, -183, 128, -122, 154, 77, -35, -142, -263, -6, 57, 306, -26, -189, -82, -25, -82, 7, -285, -25, 272, -103, -240, -383, -28, 196, 111, 111, -32, 45, 81, 208, 174, 166, 100, 247, 115, -387, -308, 147, -285, -116, -386, 140, 299, 172, -267, 127, 303, -198, -226, -389, 83, 295, 53, -151, 194, -171, -13, -30, 87, 60, -27, 258, 200, 48, 77, -127, -3, -358, -222, 57, -54, -33, -24, 17, 71, -311, -76, 61, -58, -247, 52, -80, -146, -293, 98, -72, -97, 116, -100, 42, -194, -204, -236, 178, 60, -34, 214, 440, -172, -143, 49, 344, 112, -74, -54, -168, -95, -49, 114, -111, -18, -285, 120, 338, -61, -103, 1, -218, 50, 124, -256, 303, -284, -153, 118, -41, -205, 172, -28, -154, -68, 270, -294, 71, -75, -229, 359, -37, 87, -10, -33, -165, -137, 10, 281, -120, 117, -272, -371, -79, -157, -178, 100, -43, -17, -113, 31, -68, -116, -31, -226, -172, 96, -53, 124, 246, -85, 207, 16, 118, -252, 131, 354, -198, 16]
7208A6k23Q0p1L57k80R6m3k68K87r4J14K1j62M77j25j59Q2j20p9J21K41l90L63
7231B41k85J93q1K98j00m02L64k81J33p8J22k43J33N1j97K22N0j10M2q3N3K9q9
7254a8R9o4k15M42k99K16l72j17M94j08J59k4k43Oq8k58O61r3l7l18k2K60n8J50
7278A53k04K07j02j9j42k78J54N31k88k4O3k28K05o8j31J39j55K45j64L08m33
7299b31K32p7P6J57j02k39k1L59j93L09j67k02l4k47L06k39K68J2m6j71j56K09
7321a97J3PJ24L66p0j9l00m8NL34r1j8l4o7r6M44k54j36j60L50k02o4K16l02L33
7346A34n70N20j44r5m02N48J45k27J28rJ15k34J02R4n07K33j85K64J95j26k08
7367b29K42J76m2k60j25M04j65n2J4j52J10J20m7kJ08k22O4l19L90n3qJ02j11
$$ y = [16, -207, -127, -198, 159, -121, -25, -68, -336, -49, -143, -29, -8, -170, 307, 182, 23, 105, -15, -94, 27, 268, -122, 241, -44, 149, 68, 366, 266, -136, 228, -53, 80, 2, 124, -119, 14, 65, -132, 90, 140, 30, 72, -11, 42, 71, -18, 81, 17, -198, 244, -55, 161, -211, -328, 166, 58, 217, 193, -50, -44, -132, -390, 271, 178, 141, -177, -199, 61, 3, 153, -51, 156, 54, 35, -107, -385, -231, 300, 12, -12, 51, -177, 28, -40, -171, -32, -187, 58, -106, 202, -231, 1, -76, 0, 157, 55, -184, -205, 154, -39, 270, 103, -99, -133, -380, -74, -313, -45, -33, -79, -250, -406, -197, -184, -177, -53, 313, 243, 224, -76, -124, -119, 215, 124, 106, 72, 5, -91, 353, 99, -37, -197, 153, -49, -113, 103, -199, 134, -436, 84, -60, -155, -557, -9, 136, -91, 37, 28, 143, -91, 11, 105, -402, -169, -354, -90, 105, -21, -229, 13, 189, 147, -113, -238, 166, 1, -51, -37, -189, -79, 41, -6, -8, 100, -122, -58, -377, 13, -40, -48, 54, -57]
7390e7J06K16N0l83L5N8k34K69j89N1m1O7j0L92n47M33l8j00j31K9r6Kk7L87m28
7415a86M41Q3m24K1Q5j22j17M25j05k10l3J35l3M33Pn20K78K93k76k80J53P1k63
7438a44j67M41m4j55k1J54j19N9J81k50j47K9J25J69k4m06M22l7K7k51K70j62
7460e0K2J70O0k68k95M04j42O6m0k26J66J99k81L6r5L4K23j88L54o9j36M61k25
7483A80l94K45K59l45j29K35l80M42J60k14j02J69k9Q6l59K63L04p31L65jk56
7504b32J98O4J86j68n7J29J36l73J31p1Q1j83J45l32L37P1j07M7N3p8j53J76L20
7527C20m12K27o3j88O6J12l67K53N6Mq0l49K52K42J11n31N52k40p2RJ03K8j67
7550a34J11O0K13k44l6j20J14p8J10J06l7m5L21l81j3o9p4K6M31l49k55J21K69
$$ y = [-57, 49, 265, 315, -68, -33, 25, -209, 60, -129, -78, -119, -52, -62, 330, -217, 216, 178, 78, -53, -24, -120, -118, -145, 242, -186, 255, 338, -86, -65, 20, -102, -219, 206, 101, -109, -142, -7, -40, 393, 400, -120, 158, 451, 175, -105, 48, 119, -144, -311, 130, 86, -69, -90, 64, -55, 4, 185, -65, -212, -183, -58, 111, 87, -319, 103, 66, 93, -158, 112, -50, -28, 142, 202, -66, -361, 43, -99, -33, -73, -299, -133, 66, -215, -179, -274, -240, -17, -205, 149, 80, -56, 405, 180, -214, 31, 290, -55, -184, 51, -329, 113, 273, 59, -43, 126, 97, 183, -176, 87, 391, -340, 25, 24, -232, -34, 30, 216, 48, -9, 120, 256, -117, 14, -57, 24, -159, -14, -346, -9, 62, -45, 2, 55, -23, -176, 0, 320, -92, 135, 72, -116, -50, 62, -305, -52, 4, 8, -72, -421, -169, 73, 184, -347, 205, -35, -107, -98, 5, 33, -134, -23, 37, 250, 6, -30, -150, -36, -114, -4, 102, 65, 20, 341, -40, -53, -122, -196, -170, 261, -88, -343, -222, 47]
7573D7KM8j67M6J18k39J13j04oL82l35K9L46n00J27K1P4J33k98K16j87J00K21
7596A87k46p9J9K20j00J51j07r2J8l8%K03j49j30K94k56L9J99j59J21j26jk2m
7620e8M43n2p40L98J10k05j34j59P20k43k94K67j69j71L14q8L40m03J52J62o09
7641d19M88j57J98m17K19K43j17J74K3l07k6o1j51J51J4L19o0l7n45K34J72Q2
7663B0J83m17K42j36L1k36K40J5N8n2j06L79j50j09K35J18j67k51j8L68k90P3
7685C0k93N23k83P7j07j74P3o2J49K63p9m87K00K15N1l88J47q9M93k29q6jj27
7708a84L77k98j97L71P5j43jl5j0j29j8k5O03l19K27o10N48j76MQ3J57j59l20
7731a79M02o7j67J55l67J78J01j21j18J59J53N4Rl76M04j19Kj12R4n4k05j9L71
$$ y = [47, 49, 97, -70, -24, 94, -145, -32, -136, -142, 240, -95, -66, 280, -220, -93, -72, 2, 135, -163, 53, -134, -34, 187, -59, -138, -119, 101, 1, 152, 45, -47, -29, -67, -67, 136, -13, -143, 151, -105, -66, 133, -26, 95, -31, -32, -54, -58, 385, 333, -407, -9, 101, -104, -238, -397, 323, 80, -214, 53, -116, -287, 27, -61, 279, -124, 28, 190, -419, 69, -88, 110, -307, -88, 155, 38, 212, 235, -72, -98, -159, -310, -159, -145, 174, 114, 77, -468, -234, -62, 20, 203, -214, 28, -108, -77, -313, -73, -58, 0, -52, -158, 221, 71, -38, 197, 315, 148, -103, -121, 247, -43, 30, -263, 260, -23, 54, -53, -227, -154, -216, -67, 196, 117, -370, -170, 45, 96, -292, -145, -234, 259, 30, -56, -57, -184, 193, -105, -302, 69, 144, 1, 0, -35, -45, -174, -192, -217, 386, 67, 294, -316, 232, 56, 60, 143, 300, 141, -179, 223, 156, -11, 144, -223, -45, 56, -65, -183, -24, 129, 183, 192, -184, 220, 101, 103, -9, 85, 31, -174, -193, 178]
7754A78l3l2O0j34k14K91P6J08j74n6l99K06J09m03J27J99JK25m7l4L17j83M9
7777B37m8k67Q5R7l75J21j0J97M1j08K8Q8L8l77N22k91j2J35p4j12J6K4n9l7L
7802a38L88j25j88O8O4j07K45j07k4j18M37k40j03o9J50j37m7p0J7J14m39L77
7824e2j57J09nJ4O6L0l3J45J4k03j92K92L0k71K10P3j76L93k27J25k6r7r3J31
7848A00J47k09r0Q6J64j9n8L6K5m79M69Q1k57j13O3r8M68j93m6j08k4o7Q1K84
7872B43k74P9o9J17j12j52j33K52K73k68J22L2j7m28J26J84J55q2mK36k23q5P4
7895D6k43O7J78J84j80l76J89k05M45J7j83K37j6j56R6j39J94L4k18J59j22J46
7917A54M3k99L12o08M67J37k99M94m74K72l76K35j81k1j35j07J92J96R7k22J38
$$ y = [178, 145, 113, 173, 39, -175, 116, 192, 300, 126, 70, -329, -123, -14, -417, -290, -91, -90, 135, 88, 54, 371, 188, 237, 189, -78, 7, 104, -271, -150, -160, 37, 78, -30, -2, 86, 124, -253, 269, -22, -34, 101, 27, -85, -69, -45, -104, -141, -138, 250, 125, -63, 5, 69, -38, 207, 100, 76, -42, 395, 155, 52, -17, 133, -4, -51, -121, -104, 10, -429, -52, -209, -100, -105, -91, -25, 5, -28, 117, 131, -72, -264, 28, 58, -213, -3, 70, -106, 287, 60, 185, 159, 62, -31, 100, 247, 38, -52, 34, 198, 179, 121, 157, 182, -297, 172, 253, -4, -117, -54, -152, 316, 123, 77, -31, -55, -122, -41, 243, -31, 48, -21, 96, -16, -168, -301, -49, 224, -44, 78, 110, 93, -335, -209, -25, 130, 48, 44, 280, 57, -28, 46, -197, -130, 48, 232, 52, -324, -135, -340, 105, 122, -61, 176, 160, 4, 100, -39, 155, 189, -29, 130, 8, 154, 197, -102, 210, -398, 69, 206, -93, 401, -73, 199, -177, 58, -123, -144, -279, -386, -194, 2, 99, -123, 15]
7938A5j30N9O3J46o2j76K19l26K07j58L50l69L05l80K36J45l05M70l39J55m18
7959b93J34J78l0J95k10K29l70K06J27k02K61m9l73P1K01j08l9l2q4K21K65j86
7981A12k0k65L2L65n17J74K49k19j00k9r4M90l33J75j03J99j75P9r0J16k36K26
8003C6o6p8L08l40K95k53J82p0j0K5J2k10K19J7j19L03l65O7l8o5K31l8K8m5J84
8028B10j21k18M28m47J64K85o48L48J00k31L3L6n7J2q0K74n8L09n24K13j01K5
8050d8R7J59n6p37M86j63L37m7K04m03J45J86m21M67j99m9n2K40l70J25M24j94
8072A31j3j76k69L76NRn0J8K2o8n0j2k96M17j78L14j93l18N67k83j47L82k58J2
8096e8m90M25J11K29Nk99K42j45l43N69l67K95k21m9L07k67K90l55N15n03J24
$$ y = [15, -115, -56, 7, 153, 91, -85, 134, -192, 15, -143, 207, -162, 143, -237, -1, 144, -161, 309, -30, 125, -293, -159, 19, -11, 184, -26, 203, -167, 39, 166, -36, 225, 176, -197, -126, 75, -33, -72, -104, -188, 33, 298, 112, 92, -173, -141, 224, -293, -119, 130, -89, -189, -218, -312, 178, -155, 20, -83, 116, -59, 20, -70, 46, -190, 36, -30, -108, 200, -140, 155, -98, 84, 14, 4, 29, 41, -169, 50, 67, -52, 251, -114, -47, -85, -150, 81, 43, 71, 26, 210, 89, -129, 299, -148, 16, 301, -347, 1, 101, -130, -97, -61, -118, -106, -186, 88, 30, 339, -185, 28, -73, -48, 49, 208, 152, -585, -99, -262, 75, 28, 232, -171, -26, 160, -261, 206, 7, -42, -94, 146, -224, -99, 325, 131, 118, -58, -327, 49, 54, 63, 13, 31, 53, -15, -65, -77, -373, 44, -134, 180, -13, -331, 236, -47, -194, 188, -70, -58, -548, -123, -12, 217, 222, -77, 165, 20, -323, 246, -121, 174, -47, -96, 211, -56, 234, -121, 394, -109, 15]
8117A5M1m1k82R2P7J99M0L1k18L08l7j90Q8Q8m19J30K03m19M65qn0j76L72P7o46
8142b60N6L29m56L48K37l55L08j41k0l16K41K79k77J53k26O8K13m46M59M3l32
8163i5L9j66L51j28l4r3Q8k22J83K82l30L70l19P2k26M43k6r6N9j55J57K70l43
8186H1K1K10k71l91J26
$$ y = [15, 56, 15, -267, -175, -98, 101, 141, 172, -46, 262, 225, 35, 123, 211, -208, -78, 125, -294, 171, 163, 113, -63, 309, 386, -260, -204, 125, -331, 17, 254, -101, 207, 66, 46, -270, -29, 250, -27, 126, -100, -32, 181, -265, 194, 237, -95, -56, -222, 129, 1, -33, -126, -38, -260, -77, 205, -125, 245, -74, -2, -228, 215, 189, 93, 152, -3, 154, 424, 81, 102, 312, 41, -350, -224]
8191b24
$$ Imaginary data points
##PAGE= N=2
##DATA TABLE= (X++(I..I)), XYDATA
0@%%%%Qj6J6j6J6k4L2l5M3n6P2q6J01j19J36j60J91k23K57k93L36l87M44n06N71
29C02o43P27q19R19j028J148j277J420j580J754j945K151k380K637k922L237l587
46a886L983m433M949n549O253p095Q120r404J1068j3310J6517k1497L0316n0350
60c2318J66468O529l58642K69025M0363j96275J57140K5236k38491J82188J03732
71A24955k20665O0391J21583j46853P2819P9200j83627N4049J62783j70737l1416
82g7518J63511r9985o6560J53514o0461q7137J36740l0350j20860J33981K9722
93G4597j56526O5461Q4977j14405L0153P3672j18192K8608J27830j16849n2467
104g3141J29741m3046m6145Q5790q0461m5207J53196n3186j21619J25895Q051
$$ y = [0, 0, 0, 0, 0, 8, -8, 8, -8, 8, -16, 16, -19, 24, -32, 40, -46, 55, -64, 72, -88, 103, -120, 137, -156, 180, -207, 237, -269, 302, -341, 386, -433, 486, -542, 606, -671, 749, -831, 923, -1022, 1129, -1251, 1386, -1536, 1701, -1886, 2097, -2336, 2613, -2936, 3317, -3778, 4342, -5062, 6006, -7304, 9213, -12284, 18032, -32318, 134150, 140679, -217963, 51062, 91425, -104850, 52290, 77526, -160965, 21223, 124955, -95710, -35319, 86264, -60589, 12230, 91430, -92197, -38148, 124635, -46102, -77518, 85993, -13992, -80552, 72962, 12501, -74636, 62104, 31754, -89106, 44875, 74597, -81929, -16468, 68509, -45896, -15743, 57929, -60263, -31655, 96175, -20674, -73141, 56600, 13554, -32591, 53199, -27262, -72469, 80727, 27541, -94078, 31817, 39868]
115C9868j07466J05051Q754j28308J07581N4450j55300N3049R4311j14710J9183
126b3537Q4608j04127O020J03175q4604k3330J00025n9001m7899Q5836k7895m4949
138c5678O5022k8331m7055P6788q637o8699O0512J9042o5603L8829K5529o6590
150c4871L2428M8515p5634n326P3001l8871k9709N4136k2674k8323N6322j8335
162A0659m4116N4435J193n5069L7624J3078m4301L6494J0874n7765L8798L4232
174C6136o1410J7630M3904n4983N051M5249n1909k46N9483m9433k6935O3843j8811
187G569l2807M5670j1725l1084M1073p702l7210L6277O422l5908J9788O484k3840
200a6993K7016N041l6758K3386K2448l7203N308K6258k6861q15K4262k7219n798
$$ y = [39868, -67598, 37453, 46207, -82101, 25480, 79930, -75370, -22321, 71990, -42720, -23537, 61071, -43056, -37036, 66139, -18465, -41795, 58230, -771, -48670, 37166, 9271, -35678, 29344, 1013, -46042, 30746, 22109, -46590, 13922, 32964, -32639, 6190, 31719, -34871, -2443, 46072, -29562, -34888, 38113, -758, -30467, 23669, 995, -27328, 28994, 10659, -33457, 20978, 22171, -32898, 4726, 17804, -26497, 9997, 20871, -36894, 1904, 36136, -25274, -7644, 36260, -18723, -13672, 31577, -20332, -20578, 38905, -10528, -37463, 26380, 7569, -25238, 20432, 8707, -22377, 18696, 10994, -26216, 10061, 16483, -19425, 363, 6847, -16993, 10023, 15064, -21694, 1692, 24140, -13063, -7755, 18503, -8358, -9173, 15089, -12130, -17928]
213a7928L8641j5401k5750K8297K740k0612J8949L83k3936J9195P351k8543J2527
226d087J7228k1700M839J2805j9715J0799K0377k8936j606K7499k2028j0287K8298
239A3486j5602j3668K9051j2995k0122L3484J091k8701J7886O667k1625J4548
251C500N833k2286J1685J0273k0335P013J3656j3642N727Q700j9050O186J7488
264A4748k0029m204J9267j3501q189K0472p814j1801K1093k431j9779J6282Q236
277A2350j9403N710R022j6500M308J1843j4034J302J4504j2284l014J5370q350
290H24m347J3048j1626q728J8726n424j4656J6877o41j6080J5697O272j8133J0840
304B649R236k0065L777J4341j4035j544J1875j1200k755J3382o264k911J1264
$$ y = [-17928, 20713, 5312, -20438, 7859, 10599, -10013, 8936, 9319, -14617, 4578, 11929, -16614, -4087, 13141, -8559, -3720, 9085, -10630, 169, 20546, -8390, -9996, 17503, -4525, -14812, 13486, -2116, -15784, 13267, 272, -19850, 13634, 14725, -13976, 3910, 10577, -11048, 3500, 9333, -12953, -1268, 9005, -11330, -4317, 9339, -4303, 1424, 10124, -8926, -2740, 14748, -5281, -9485, 9782, -3719, -11908, 8564, 750, -11051, 10042, 7611, -12168, 4114, 12350, -7053, -1343, 7679, -8821, -4513, 7330, -6704, -5402, 9102, -3182, -6196, 9174, 824, -3523, 9525, -2101, -10829, 7897, 2473, -12183, 4694, 4053, -12027, 3670, 9942, -8191, 2649, 11885, -8180, -4403, 9938, -4097, -5641, 6234, -4966, -7721, 5661, -603, -3514, 7750]
317G750o719o131J0753m860n989J1446n302j1017J2763R96j1700J0639N060j4385
331f696O420R839j3354J460J1034j2218m579J3326o453n981J2231l940p884J0961
345D166K5q133Q724l05j0954P058K836r929P025M486j2405N040Q735r730K796
360e65R853j0945l516J1099o786n376J0958m010r207R588P40o673Q457K010q886
375c259M455K234o631M489K460q486K796M391p412L818O990q386P65Q665q573
390a684j856J0982o915p469R698k245q194R680K136r815O342M590q457M704N115
405F612q815N73M834p080J743O325p227m27P004n700l26R198n141n293P828l662
421D46o192Q167m0q033N349K280p103N508N265o896J360M332o522Q20N469n523
$$ y = [7750, 1031, -5100, 5653, 793, -5196, 6250, 948, -10069, 2694, 3690, -8010, 2629, 7689, -6696, -276, 9563, -3791, -2331, 8703, -3515, -8094, 5232, -1221, -7202, 5029, 1089, -6795, 4166, 4191, -3942, 4782, 4477, -6477, 581, 3417, -6512, 513, 4999, -7406, -2366, 6369, -3361, -565, 9288, -1657, -5173, 5926, -860, -6236, 4722, 712, -8495, 1093, 1833, -4840, 3617, 5627, -3259, 1196, 3430, -3201, 1288, 3748, -4738, -1942, 2449, -4963, -1145, 5845, -2541, -1776, 6889, -1684, -3540, 7442, 527, -6942, 2756, 511, -7683, 1997, 4133, -5682, 660, 5250, -3207, 1497, 6612, -2203, -1630, 3204, -3876, -2133, 4192, -3035, -3462, 3542, -2158, -2484, 6714, 1573, -3720, 4108, 446, -5746, 2421, 2381, -5652, -303, 1977, -5126, 382, 5647, -1249, 111, 4443, -2079, -1259, 4210, -1313]
437a313j085M372n425l36P332m165j734P258m565m365Q608k539o827O877p36q217
453f860O714L887q181M135N045p473K461O522p054p22N450o305j976P081l555
468h31k820N740l038l079P784j194m686N664k107n711N036J345n780M324J153
483A800o958L801N490m808R68M337n757n06N057m294j249M462l799l126N275p02
499ij293M763k711l437N560p08m963M796j91o410M141J926n584M595L903o779
515b401N93O137l876j045L825m305k227M827k359k527M599j009k531K858%j052
531d93M366k483m513M222O04m294K866M46l464K391J616l792L033M185m463j754
547a527L153j978n8J605l234j84K948j757j568M474qj891J334j556j096M433j712
$$ y = [-1313, -2398, 1974, -3451, -3787, 3545, -620, -2354, 4904, 339, -4026, 4582, 2043, -4784, 2093, 1357, -6860, -146, 3741, -4440, -305, 4740, -2733, -272, 6250, -804, -1526, 3924, -2381, -4357, 2724, -831, -3651, 2089, -949, -4028, 3756, 2562, -2124, 3540, 1433, -4278, 758, 2103, -3677, 647, 1800, -5158, -1357, 4133, -675, 293, 4630, -1127, -1633, 3424, -870, -2119, 2343, -1456, -4582, 693, -9, -1302, 3461, 750, -2687, 2873, 2165, -2798, 1998, 1807, -4603, -462, 1464, -4120, 475, 4378, -2401, -1808, 4329, 453, -592, 3233, -1072, -3299, 1528, -831, -3358, 1241, 232, -2299, 559, 559, -493, 3873, 1390, -3123, 1099, 1703, -2591, 275, 721, -2743, -352, 1264, -2528, 505, 4690, 227, -1527, 1626, -352, -410, 1195, -2039, -2223, 725, -1032, -2600, 1874, 1866, -25, 1309, -247, -1343, 3090, 1378]
564A378m568K015J762k866J589K037k374K123J719m498Q21M419k374l379J612
579e84r70P00J780j896p95L397r04k056K495P17q87M90k752r84L756k30m289J867
597a145J506r56J175l9r97K690K35n045M74M410j762j811r6j110K204K385k911
614g93j17L448l08k885Q0O20J575K55m186j626M508J147k510J44J107O40K22j703
632c82j407L269J490m860j673K412K401o6k551j274L769K614l623j471K360P34
648A742q82k150j806K987L241m338l576M585L328k093j105p2j19L059k687m361
664d247L740M072l576l410R33K766L697j545n899K749M787k828l367J363N86J445
680A266o79n717J691P619j723n153J642K010J446J60m372o47M568n54n595K009
$$ y = [1378, -3190, -1175, 587, -2279, -690, 1347, -1027, 1096, 2815, -1683, -862, 3557, 1183, -2196, -584, -1554, -854, 926, -970, -1765, 1632, 728, -1328, 1167, 1884, 997, 1487, -1265, -2249, 1507, 1277, -3012, -1145, 361, -595, 580, 541, -456, 2234, 2469, -2576, -2102, 2308, 546, -1265, -1361, -2471, -267, 2118, -793, -910, 2538, 2230, -655, -575, 45, 1620, 1875, -2311, -3937, 571, 1718, -792, -648, 459, 1099, 1321, -382, -1789, 1480, 2970, -1890, -3563, -1151, 1250, 1184, -1367, -2641, 1128, 3742, 119, -1352, 1008, 1742, 860, -1290, -3096, -109, 3132, -1206, -4782, -197, 3131, 1038, -67, -139, -258, 2801, 114, -4247, -507, 3565, -11, -3421, -2488, 278, 3975, 2430, -3469, -720, 4067, 1239, -2128, -765, -179, 1266, 587, -5130, -3439, 4180, 2457, -2696, -1054, 956, 2402, 2562, -1810, -2457, 2111, 1557, -4038, -2029]
696b029L018mM50l122k64N682M22o582K39M399j442k258k59j77K759J973n404
713b599j463O742J974m797j466N19K071J774l708l565M933K486m675q06K997J241
729A658J297j911m760L640M473m660l205L246O49j196M19j727J627N170m778l773
745c831N191J708k486q46j818K27M968k853n152N135L213l718n09L47j02M080
761C554j363o916K597N226l435k196J703k37J952J543m281Q18M947k148m545K137
777f44J432J1m95j949j163M353J70m255K092L678k280j409j32j094L348R87n843
794c193n44N797r11k992K063m2N43K575m203k594O285J07n320O35J166m87L139
811B024j554l959M812K211n402Q20L566k772N92K8m005L207M391n775r87M874
$$ y = [-2029, 989, 985, 1435, -1687, -1951, 3731, 4153, -2429, -2190, 2209, 767, -1491, -1750, -1927, 832, 2805, -2599, -4062, 2680, 4654, -143, -1609, -1090, 981, 2755, -953, -4518, 415, 2901, -1774, -2580, 417, 1658, 2955, 1044, -3716, -76, 4397, -263, -3468, -222, 427, -769, -350, -2077, -450, 4720, -58, -3831, 1360, 3068, 582, -264, -2082, -1855, 3113, 260, -4892, 243, 3456, -262, -771, -424, -526, 3554, 2191, -4725, -2128, 3098, -337, -2533, -830, -1067, 885, 2428, -1853, -1035, 3912, 1764, -2781, -644, 788, 799, 304, -1645, -2808, 1545, 1715, -2540, -448, 3230, 950, -459, -591, -1685, 1663, 2650, -3193, -3737, 2060, 1149, -1843, 220, 178, 721, 3296, -907, -3501, 2784, 2891, -2429, -1794, -628, -1115, 2024, 470, -3489, 1323, 3534, -1868, -1048, 2518, -254, 338, 366, -3639, -432, 3959, -1816, -2803, 2071]
827B071j435r35K166k378L09L233l634l184N080N47l239M13l12P13L144j275l676
844b392L073K111l567l15J580p78N89L70l541J200M693j996k697K226Q17j426
860e3J324j527j350L262q58l974J885K973k091M75M97k137K775J706m589Q76L311
877B505l437j564L048j628P28K947l597j391N401j339k909K262p87j806K649j202
893a20k323L316J25l215J603J738n38R02j159j995K172J585l390L62J645j648
909i40o0J378j072R96K306k537j483K398L37j608K32j00j478J362P5j712K080
926A74J510k117P9J202o73O45O14k614j27K389k106l35K173q11j20J477j469l09
944d18K447j157k148J018K05j004J128m05j274K076K3j585J970Q40k162R81j80
$$ y = [2071, 636, -299, 1867, -511, -202, 3031, -603, -3787, 1293, 1840, -1399, -986, -1298, -585, 2559, 1284, -2392, 681, 2792, -775, -1090, 490, -288, 301, 671, -2870, -1670, 3023, 1027, -1670, 556, 1373, -53, 1271, -256, -1606, 1656, 798, -3176, -1291, 1682, -409, 66, 563, -1574, 1201, 2907, -1682, -806, 2505, -932, -2496, 552, -1076, -348, 2599, -998, -2389, 3012, 1673, -1236, 1026, 239, -1567, 1082, -120, -2443, 873, 998, -2217, -614, 1124, 586, 1488, 329, -1666, 506, 2091, -1299, -937, 708, -940, -1000, 378, -694, 302, 2608, 71, -1412, 986, 1323, -285, -53, -153, -1631, -269, -194, -1906, 174, 1684, -433, -354, 848, 175, 820, 1434, -1180, -1307, 1082, -1024, -1359, 814, 3, -117, 1360, -109, -418, 2029, 872, -1276, -258, -53, -1057, 71, -334, -1608, 468, 491, -1094, 876, 1716, -446, 535, 355]
961C55j483J887K75k783R53J113j573J199J447j359m0J528j888l00K052j510r52
978a079J063n98n17J543L4o49R03J3j446J166M89j007L58l44j243P41J079q38
996c32n36J732j092m22K100j044j094J690j246j302J784J09j576J384J16j383
1012a112J964N18j464J049j79k061J418M86j596Q84N45k264P91K498j506K43J296
1029A510j725n45J874j047p60J284j084r71J368K49m20Q07P6j279J237O4r35O91
1047C94J43j573K41J008q15N10J302j553Q9J136n83n92J460q85j497J097n5r45
1065a118J288K75j298J229N93j086P87N52j707L77Q43j117k15J078j422K04J239
1082E02p36J02J801j366q44J637p29j103J064l9j605Q90N22q86J165O26j185N39
$$ y = [355, -1128, 759, 1034, -1749, -796, 317, -1256, -57, 1390, 31, -9, 1519, -369, -669, 1383, -127, -1079, -16, -614, -1131, 412, 446, -203, 700, 713, -733, 433, 922, -85, 273, -71, -1314, -573, 506, -332, -868, 864, -228, -650, 1450, 406, -688, 1002, -244, -1546, 238, 347, -1229, 155, 271, -1112, 852, 1370, -94, 955, 776, -1285, 133, 619, -977, -93, 452, -1812, -1021, 1477, -29, 214, 1510, -215, -760, 1114, 67, -693, 591, -493, -1464, -96, 153, -267, 540, 616, -663, 574, 638, -297, 394, 537, -1036, -795, 213, -602, -92, 1210, -343, -254, 882, 299, -293, 1167, 282, -1215, -118, -173, -1118, 170, 445, -853, 376, 969, -117, 670, 1222, -485, -108, 735, -382, -597, 481, -941, -737, 502, -234, -132, 1669, 303, -541, 1096, 367, -736, 328, 289, -1316, -426, 96, -790, 375, 1001, -184, 355]
1100C55L97q05J10R71j142m45N70p82L14J353q46o12J426r36j60J267k80j442
1118f87P86Rj408J203P45j491Q34P24r40K62J163q07o98J124j329k58J087n74
1136b55q13J120l30p0J311n7j380J032P3j649J266O05j924O68O47j359N81J931
1154A397j546J01Q85r76k24J390o23j156R96o41j171J881mj087J406k35j255J737
1172H75P18j748J39P65k050N63J640j197n58J488j028n46K186o30p70Q74o30j237
1190a146J671k34j833J631L18j419R40Q78j046O32R32k166L53J743j706n49J432
1207D31r75o13J851n65o22K200j083j868K229r9j742J316M3j987J644N73k081
1224a348J500J361j784j8J268j241J79J677k832K3J889j381q44K478r70o78J513
$$ y = [355, 752, -53, 57, 1028, -114, -559, 11, -771, -457, 896, 50, -562, 864, -72, -232, 1035, 755, -687, 99, 108, -1300, -97, 648, -843, -9, 715, -225, 37, 1200, 393, -305, 819, -510, -768, 319, -255, -1068, 52, -278, -348, 963, 906, -474, 558, 631, -1018, 248, 853, -1071, -403, 244, -1115, -534, 1397, -149, -48, 837, -139, -363, 1027, 404, -752, 244, -397, -1568, 313, 309, -778, 628, 393, -862, 875, 1593, -155, -16, 749, -1301, -738, 902, -295, -853, 635, -393, -939, 1247, 617, -153, 721, 91, -1146, 525, 291, -1542, 89, 407, -1012, -72, 806, -240, 392, 1324, -842, -489, 1254, -452, -1001, 431, -544, -1157, 694, 129, -493, 1707, 624, -1244, 985, 886, -856, 460, 503, -1484, 160, 733, -1348, 152, 1513, -271, -289, 979, -262, -83, 1594, -1238, -1215, 674, -707, -1551, 927, -43, -721, 792]
1241G92m78j263K588m07k991J531R84j859J202N83j860J217J567k382K8K565j808
1258Iq24J706j547k9J887k005j422L362m42j838K134j27j998K178r7l124K809
1275F32J229l390K23K197j642Q78J058k281Q62K378k848r40L551j333j984K000
1291E90j562r03L831j582k994L507M52k547J788K08j882K125L60m011J834L153
1307B367l228q22K663j693P58K013k766l57L340k125k417L146j81j896J696j122
1323f24j487M015ol727J637K343k860L18J278k512J723J921m169j93M892j849
1339G00j837J930q06m08K953k453k350L907k27m050K322O22j402K632n82l612
1355b661L488K220m438N51K433k402K23J637k794P74L934l551k326M698m85k346
$$ y = [792, 314, -949, 1639, 1232, -1759, -228, 756, -1103, 99, 682, -1178, 39, 1606, -776, -748, 1817, 9, -815, 891, -656, -685, 1202, -803, -2225, 1137, 695, -1143, 991, 864, -1134, 1044, 947, -2177, 632, 1861, -1529, -1306, 891, -751, 127, 1185, -1096, -234, 2144, -704, -1644, 1907, 574, -1410, 590, -972, -1875, 1956, 374, -2620, 887, 1339, -1208, 580, 788, -1094, 1031, 1391, -2620, -786, 2367, -861, -1683, 980, -713, 45, 2058, -708, -1065, 2275, 150, -2267, 879, 698, -1198, 498, -624, -2111, 1904, 1898, -1829, -192, 2151, -709, -391, 887, -1625, 98, 2019, -2150, -2343, 2549, 700, -1137, 793, -13, -421, 2532, 79, -2271, 1636, 1409, -2641, -319, 303, -1099, 1533, 951, -2661, 827, 3047, -1391, -840, 1593, -809, -586, 1051, -1743, -969, 2965, -586, -2912, 1786, 1301, -1045]
1371a045K131j318j361L662j272l563L109J571l084P01J057j463K173M30l865
1386b137J280L737l225j100K163j242o83K804k742r20M599j501l449K644J310
1401A538j734J026r14k195K831J074l925J553K698k417O92P74k001J506J919l870
1417a445r25M027j233j883J768p39p05K912j897k198M117L9l498J504R91j814
1433i79J554k97k456J986J855k430L61J942q79p86R28k182R48K496k897j437K888
1450F15m45o72J263o54r92K348p47k540K203J237k323J23O81j025J423O56k267
1467a116O91J967j588m62J594q46l06O88j794j99K771j266j564K077J55j465J249
1484E86o34m95J652n46k348J648J123j667K85N46j125J709N66k076N57J617j611
$$ y = [-1045, 1086, -232, -1593, 2069, 797, -2766, 343, 1914, -1170, -469, 588, -875, 1298, 1728, -2137, -857, 2880, -345, -1445, 718, -524, -1207, 1597, -1145, -2065, 2534, 1033, -2416, 228, 1538, -196, 830, -84, -2279, 552, 1626, -2299, -746, 1952, -465, 227, 1001, -1000, 506, 2425, -1445, -2370, 1657, 424, -1459, 309, -430, -1135, 1777, -120, -2318, 1799, 1838, -1660, -156, 835, -979, 575, 278, -2178, -192, 1663, -767, -406, 1536, 657, -129, 799, -1383, -435, 2061, -836, -2273, 615, 170, -502, 761, 107, -885, 1463, 716, -1824, 379, 1616, -707, -584, 97, -928, 495, 1151, -1116, -425, 1542, -46, -508, 1086, 240, -66, 622, -1172, -1371, 1400, 134, -1430, 647, 802, -663, 586, -48, -543, 1109, 563, -1785, -137, 986, -681, -396, 150, -975, 734, 1300, -776, -219, 1398, -213]
1501b13o88J522r28J68J094j895m78K622m68j504J154m9p22Q16o11q62J499K87
1519G44k189L86K228j411J65J41p15R61J081j796m13J654q26j149R41P1k88J677
1537A262j199j657J986J134k031P81J41p65P05jj930J411J589k127K45J010o08
1554e4L45O54j816K32J816j129j141J287k80n14P30j78q42K254o88j615J043Q63
1572I67j195L86J49j133O43O95r80j56J520n55p30N90j46M7P88j392m17J132l6
1591A77j235J165J52o68R33j53j124J435L52j458j96O84n72K47M02r26K3J206
1609D44n56j15R73n28o31O62l33l61Q92k28j091Q05M71j089N62P48r80N88M82
1628G15j123K5J194j280j77P35m99N0P73k60m64P66m48j69O57k89n04K92k51o80
$$ y = [-213, -901, 621, -307, -139, 955, -940, -1418, 1204, 736, -768, 386, 337, -385, 431, -180, -1042, 457, 744, -1445, -1059, 1169, -242, -77, 64, -651, 310, 1391, -405, -818, 836, 10, -1139, -198, -127, -415, 1262, 63, -1594, 392, 1526, -505, 276, 417, -348, 357, 356, -1574, -163, 1426, -701, -456, 554, -54, 291, 945, -871, -639, 1177, 48, -1093, 194, -86, -600, 130, -48, -890, 1364, 676, -939, 104, 967, -228, 158, 307, -826, -183, 512, -468, -624, 896, 341, -389, 201, 55, 102, 890, -502, -919, 213, 177, -1058, 107, 259, -409, 524, 371, -753, 682, 1034, -424, -620, 64, -508, -261, 141, -785, -762, 444, -112, -227, 746, 218, -413, 249, -84, -445, 447, 219, -872, -67, 404, -685, -123, 625, -355, 233, 715, -408, -383, 811, -469, -646, 89, -410, -360, 413, 153, -311, 455, 7, -162, 495, 206, -298, -6, -257, -937]
1648i37R00K96o85Q05l0m02j45N78m1m98P71p37m26P53l17k48M55j79l90P65J65
1669D53o95N06j13m13M7K60j77l70N79m40L27M11k36J10L32n87m94P72k37m21
1689c86M54k37m40P68N1k80L85j50p9L1L74j30n86K13j92m75P92L8m7J48l04J33
1711H1M7jj43L39m97PK49j87k72O78j72o09Q39m5M7j52L6j5m33J70O1k69K99j10
1735e2J39K11K6k92J51J11o21N89j73r5q2J32n18M99j44l01O91J0j83m25P82o24
1757a69J67L4k38O8m59N77q4J34K42m52n4L49MK35k66m06k45N71m22J13O6J85
1779e0J05l4J83k72Q62m50l74J8Ro62O51J95l00r2L79J8J44J39l00J52l34q2o9
1802a64J60j99n2l07J69L97M56l79j50J22J70l98O6q0l60L25l0j26K08L84l41
$$ y = [-937, -37, 259, -426, 379, 349, -53, -198, 380, 339, -159, 612, -125, -551, 202, -115, -363, 92, -87, -477, 288, 453, -242, 264, 151, -262, -215, 45, -132, -502, 77, -363, -36, 375, 139, 249, 581, -6, -500, 272, 35, -386, 68, -169, -609, 159, 210, -70, 315, 165, 86, 117, 491, 361, -225, -12, -204, -679, 113, 151, 104, 252, -52, 81, 128, 127, -16, 323, -174, -167, 82, -105, -377, 301, 129, -480, 359, 314, 361, 209, 245, 230, -203, -33, 28, -241, 58, -52, 87, 298, 324, 32, 183, 294, -327, 262, 89, -6, -88, 44, -474, 25, -119, -420, 271, 281, 98, -327, 455, -169, -2, 32, -206, -138, -597, -20, -104, 30, 272, -180, -234, 115, 119, 354, 88, -318, -563, 8, -414, -301, -235, -50, 55, 21, 204, -68, 794, 344, -30, -12, -3, -665, -14, 181, -119, -211, 168, 186, 330, 469, 169, 321, -13, -95, -164, -4, -203, -255, -562, -393, 4, 460, 81, -69, 53, 223, -175, -109, -189, -549, -224, -254, -380, -172, 212, -129]
1823a29nL10j21J84q6j16k54j11J86j11L82k15Q9j18J75q9M49l83J1J36n01j42
1845d59M26q5K3P0j71K41J6J58K18l22o9j59L30m21K45k11O7Q5n0J70m14P71l96
1868F3o4J51q2j26j58L57o56L50J83j12J81L19m19J52K35j59Q8J4o72m7M19m58
1890d41K70O5J29k03N05k07o80R59j29p18K29P1l51O73L03j094J18O82n40N19
1910A60JM7l67M10p88M28N81o45l57Q95k82k83M85m08n9P14l47n13M03p8m83J18
1932c68M20l00L50L18o81RN68n29K8M25k6j20L6p67O4J106o07m69R76k02n26N56
1954B61Nr11J087q8j337O16Q05p26k0N40q49P51Q50j439K26Q52n58j026J204l68
1974a25k51J003j174m74J958k88j273R58K57p06M30j44j237J181M56j391M5J368
$$ y = [-129, -134, 176, 55, 239, 153, 37, -217, -328, -142, -253, 129, -86, 3, -115, 60, -29, 420, 37, 48, 184, -317, -459, -33, -118, -95, -25, -196, 45, 61, 219, 437, 115, 46, -113, 217, -204, 41, -170, -103, -18, -68, 102, -312, 459, 63, -1, 150, 68, -58, -216, 141, -515, -165, 18, -94, 87, 406, -13, 139, 374, 215, 303, 317, -355, -402, 17, -441, -171, -106, 23, -180, 325, 118, -562, 397, 268, -450, -221, -150, -501, 172, 475, -619, -501, 181, -359, 160, 161, 208, -159, 251, -537, -109, 472, -173, -530, 365, 83, -200, 285, -123, -182, 532, 185, -328, 75, -3, -486, -368, 52, -248, 102, 420, -261, -252, 316, -213, -185, 240, 214, 94, 130, -637, -573, 533, -74, -543, 433, 231, -295, 261, 266, -645, 442, 354, -983, -367, 438, -288, -308, 232, -617, 134, 984, -455, -229, 623, 65, -961, 243, -125, -376, 627, -547, -1021, 937, 649, -624, 334, 591, -115, 315, 171, -1066, 115, 571, -820, -775, 593]
1992E93p38J07L66q86M49J093j131n22J041m80l84O62m21k80J297n95j293J500
2010C78L65r19N8M97r87N47L63j233N31J075j216j68J102n22p3J003j364k56J831
2029A012o99j530J054K59o61O90l97m80J699J84j443N62N15q21J4L30j158N76
2047b94R61j256l3J274m55q36J102p80J78R62j107o77J200L39j219M59Q49r38
2065b71N43m11n16J209Q16j980j9J234p78j07Q37r49n6J286p95q14J242Q6j136
2084e79O64n81l18J432m23j402J170R36j514O62O18j075P91L19j577Q25J137j556
2102d71J1R00q31p2J150j250L37J587j203j156J386j75o54M77l19l83J338K5j374
2121f77O99N65r74L7O43p02O02P05j987J71J819j120n12J074l93L7L21o56m74
$$ y = [593, -145, -38, 328, -558, -109, 984, -147, -669, 372, -108, -492, 170, -251, -531, 766, 171, -1122, 378, 743, -176, -118, 379, -608, -61, 302, -931, -400, 675, -541, -709, 393, -129, -202, 801, -563, -819, 1012, 313, -1217, -163, 96, -565, 125, -272, -752, 947, 1131, -312, 250, 765, -56, -42, 288, -870, -294, 667, -589, -622, 652, 197, -639, 463, -317, -139, 823, -284, -961, 239, 578, -641, -182, 667, -271, 272, -139, -655, 554, 1370, -610, -629, 605, -173, -280, 557, -392, -448, 838, 43, -771, 471, 557, -579, 85, -496, -814, 618, 195, -1207, -37, 899, -615, 47, 665, -410, 381, 700, -877, -52, 1085, -471, -460, 440, -391, -463, 687, -563, -226, 1361, 158, -998, 388, 213, -441, 36, -283, -666, 672, 697, -677, 22, 587, -387, -350, 293, -409, 193, 898, -1089, -918, 901, -219, -731, 343, -50, -13, 308, -348, -822]
2140h22J413k75j294J049M19p04M46k06r12J261N23j385J66J372j164l54N73o67
2158e61K33J228j457o02J648l03p21Q53n31l0O79k38j375J605J17j476O82L51
2176A02k92Q45j33j591J323N21r39l59Q57j15p58P91q44K12J561j189r95J149
2194A46M19m81R3j54q05R04J79j072M03R36n72k15M17n83P31L91j218J89P69k31
2214B46l84J40j30k56Q58p80m03J324p1j091O63L05o88M74R8q40N43N95q92R1
2234a98P25m59j09N99o94K49N43n86n14O23j13j89K01k76j94Q88m07m73M16N99
2254F31r07M18j17l27L30n0n66M85M36o43n5P21j41o8J93o19K24N1j35j04L97
2275A54Nl40M60L5o19O72o5p46K51M62j96m12L29m19K37O47q59L51M21n20J97
$$ y = [-822, 591, 316, -978, 71, 490, -214, 232, 26, -886, 375, 898, -487, -321, 1051, -113, -467, 106, -561, -328, 900, -557, -1159, 489, 186, -535, 318, -213, -243, 436, 198, -1177, 428, 545, -931, -249, 102, -190, 655, 522, -1069, 254, 775, -164, -523, 334, 219, -539, 252, -592, -380, 1181, -8, -1003, 146, 565, 84, 177, 23, -782, 122, 301, -771, -368, 568, -4, -219, 198, -385, 346, 737, -481, -292, 477, 246, -138, 2, -128, -384, 474, -306, -709, 615, 544, -547, 116, 421, -267, 207, 305, -535, 8, 603, -289, -198, 527, 68, -41, 558, -136, 113, 656, 70, -444, 179, 66, -123, 78, -198, -392, 496, 89, -384, 32, 631, -276, 142, 25, -302, 28, -22, -588, -103, 333, -310, -365, 356, 215, 147, 340, -279, -55, -4, -139, -243, 154, 159, -181, 279, 314, -305, 367, 302, -444, -193, 269, 73, -339, -10, -429, -192, 455, -404, -53, 368, -152, 45]
2296D5K63l31p7K26l44p0K25J96M9r3K19m22K76j16j87K25K0n26j56L43J97K9
2318iJ83l28J85j13L11k74J58J40l84K9j81M35l86J17l31N42J1n1K9K12m94L18
2340A19r7j88RK93n35Q1K93l11K39k9K06K66l34k8O7N1k13r2J61j49q8K56P9J52
2364B08J07n42K91K07O2m74J60k96J51K92j55J24J56l56j13N54l27J36j73j02
2384i0k71K55L28j78j77J31k7p8N03o02M82M2l69Q6j24J96j37j80k67L11J36j74
2406b04N48p5L2n80L50k95K0K23k42L53j99J3j50Q3L89k5j92L3J14j51M8K44o77
2429c40Q6J27P0J45j06j61M16j78J32j11O2k53j38L31l34L27j44j94K33L33k19
2450H4J34o6L0k27j46L01j65K57l32k07L08k45N7K52K12k25M0j8k25N0K44l46
$$ y = [45, 308, -23, -100, 126, -218, -288, -63, 133, 182, 89, 308, -114, 162, 46, -141, 84, 104, -422, -578, -235, -38, -9, 174, -154, 31, -82, 229, -45, 113, 253, -131, -102, -283, 152, -234, -117, -448, 94, 105, 54, 83, 295, -199, 119, 22, -166, -157, 136, -399, -318, -25, -336, -97, -126, 80, 346, 12, -16, 51, 102, -111, -203, -42, -191, -279, -23, 56, 208, 315, -227, 64, 271, 333, -141, 19, -277, -126, 166, 11, 135, 291, -65, -178, 376, 49, 185, 12, -90, -361, -106, 222, 44, -133, -2, -29, -107, 396, -206, 276, 318, -51, 35, -89, 107, -30, -210, -477, -166, -30, -204, 344, 269, 301, -279, 71, -224, -204, 19, -223, 130, -69, -56, -206, -123, 266, 241, 49, 82, 196, 45, 93, 337, -340, -254, -127, -57, 88, -18, -179, 237, 59, 191, 80, 142, -111, -249, 82, -252, 75, -69, -263, -30, 303, 84, 218, 152, 182, -45, -191, 110, -55, 202, -130, -337, -29, -274, -217, 35, 247, 22, 62, 44, -181, -131, 113, -233]
2472b33Q8J71k44K75L7k57K92j96J63Q3l57p2o3K03k01J7K06P9J40N9o9j55K43
2495B09P1l10j26J48R8j24J59L1k33J50o8M08k35l20J70J37O4m32l2L49k21r0
2517a97LN1L68k84K65l17M4J70j57L99m39Jk32K51K43N5J23k28J62m9o26N25p1
2540F0qm2m9J37o0L21n49K30O5j2k91M30K21l70j32M2l3N99m07l09r2N26n63P3
2564b13N74k34j38Q2j64p1P4K05k35J49l19j60Q05m24o6N23k39o07Q46m48k71
2585c31M08L4n60M88r9j67L61K98l30k3k10n7R6J01m4n63N60J34l63K48Q6k10
2607a43m0J21L7K33q2k59j49M79l48L8N3k00M8M44l17L13j0j69j79M08j74m58
2629c54R28m63n44M30L54m69M64l21m10O60k51r35J133q0m77K72K74n40M64M91
$$ y = [-233, -145, 26, -218, 57, 94, -163, 129, -67, 96, 179, -178, -250, -313, -110, -311, -294, -88, -9, 131, 190, 121, -34, 209, 280, -30, -156, -8, 90, -34, 125, 156, -77, 73, 5, 413, 178, -142, 28, 165, 229, -203, -235, 114, -107, -197, -194, -143, 225, -59, 206, -111, -67, 103, -54, 345, -94, -93, -325, -74, 169, 224, 347, 119, 281, 232, -394, 131, 60, 52, 10, -39, 98, 38, 359, -190, 40, 105, 93, -198, 232, 453, 83, -49, -7, -40, 559, 152, -157, -249, 277, -286, -213, 361, 127, -11, 71, -93, -164, -90, 115, -120, 29, -290, -450, 355, -69, -135, 388, 149, -458, 388, -60, -331, 77, 111, -449, 39, -60, -227, 134, 432, 102, 79, -131, -188, -92, 9, -35, -598, -38, 96, -267, -19, 67, -143, -183, -62, -25, 208, 126, -133, -282, 197, -151, -113, -60, -260, -212, 232, -85, 228, 218, 49, -130, 278, 104, -354, 574, 111, -433, -3, 351, -118, 346, 25, -385, 275, 24, -911, 222, 142, -335, -63, 211, -329, 135, 626]
2649F26j125J22M26J01p73Q08l20k74M07j06n01J238l56n94K63M33k87O0o6m31
2669c49P25k5p11J35O02o01k53N09k04L62K61p34j68O12J26j027R63j09k57L30
2689A87k94m60R07J67q06L48K41l72k82Q78n43O5K53o07Q3N00k34M1q1m2j06P25
2711E68m72o35O61j71n28L22J66m04R30J19j110R58J87p41K3L12n04R3L05k42
2731a63K5P29p86Q0M11j54l14M36m61j63R79m83o09P18P2n17L66j38j56M80l2
2752C20q00O80L08o71k76O82j78j6L02o95q5R49k42r08R45k4o74P32m76m36N92
2773B9L65q47N67J31n32L36R0o61O92L02p18q5M71k92o6N23o11o7J117r20k96
2794d72J074k90m28o2J20l69O76l89n18J103J12r34J45N96m85j21L24o53J89Q43
$$ y = [626, -499, -377, 49, 150, -623, 185, -135, -409, -2, -108, -609, 629, 273, -321, -58, 375, 88, 148, 82, -349, 376, 351, -360, -225, 377, -224, -477, 32, -172, 190, 451, -283, -451, 161, 287, -740, 223, 114, -143, 187, -107, -567, 340, 507, -299, 49, 290, -82, -364, 514, -29, 36, 289, -318, -235, 265, 31, 72, -9, -51, -157, 568, 96, -539, 122, -49, -577, -255, -89, -493, 437, 556, -554, 404, 591, -150, -127, 185, -319, -226, 79, -163, -138, 591, -195, -115, 296, 142, -172, 264, -197, -360, 619, 136, -473, 245, 317, -200, 166, 28, -128, 352, 320, -480, 200, 508, -163, -439, 243, 65, 49, 351, -344, -429, 520, 278, -630, 315, 291, -383, 349, -127, -563, 29, 394, -453, 114, 245, -287, 49, 139, -522, 170, 472, -246, -331, 140, -152, -218, 305, -306, -373, 744, -176, -472, 602, 312, -116, -178, -58, -427, 249, -140, -658, 445, 557, -377, -232, 364, -121, -242, 82, -571, -382, 461]
2814D61o48m00Q30Om82N80l09k59N78m1m96M72j7o98M39k14l69O76L04p01J76
2835a12P34o93j12M08l23j31O70o43j44Q55n11l33L07O1k30M05j33k16Q8L58p07
2856d02P9J126q19M9L15q35M18N35l05p37P05j74k05L89k5l49N06m9p20O96J29
2877C27l23J24Rk10L94k99l06L49R5j16r2K11j2j20K29l57k35O65l24j51L51j84
2899B5p0K17l50K7K80J58n40K68J09q6k47R4m44O55jn78N29L9l80L53M73n94K53
2922A90L18p37k40P05k6l98M3l8K3J40j24P8M24j65k89k9O41o44M5J09j08R3J12
2945A23q5q6N08o60L59j91J43L3J16l84k18M08M6k10L95k96n2L02l44J43l5J48
2967A63k10m16M02J41j58L85m58J30q4R9p6M50l05j05L91k55k89Q8J68k78K94
$$ y = [461, -187, -587, 243, 249, -233, 347, 38, -221, 357, 316, -180, 292, 275, -423, 16, -198, -567, 109, 413, -288, -112, 622, -71, -183, 225, -98, -229, 441, -202, -346, 509, -2, -335, -28, 33, -197, 208, 75, -141, -53, 305, -402, -323, 803, -16, 33, 348, -487, -69, 466, 161, -576, 129, -45, -250, 139, 114, -235, 271, 222, -498, 198, 327, 4, 128, 137, -73, 321, 22, -284, 65, 160, 44, -48, 163, 151, 31, 260, -97, -332, 333, 9, -142, 209, 25, -45, 172, -178, -151, 129, 287, -253, 15, 124, 38, -209, -115, -559, 96, 95, -483, 46, 85, -295, 58, 531, -63, 190, 508, -229, -469, 236, 210, -188, -145, -183, -160, -20, -144, -66, 358, 193, -96, -125, 516, -128, -83, 26, -82, 11, 123, 38, -48, 460, -200, 159, -32, 111, 144, 260, -124, -342, 66, 112, -98, 297, 1, -51, 251, -93, 50, 15, 163, -47, -463, -61, 80, -78, 307, -151, -21, -105, -6, -82, 368, 63, -42, 349, 94, -195, -107, 61, -217, 77]
2988G7j79j76K80K7R7J39o7m49J75j5l00J83K9L53N4j40r4J58k62j3K16k57J27
3011c7k12K57n5L39k64L4k76j40N60m05L95K0k12k0j25L30j91O5q9O9j8L05j43
3034A87j02J9m7j85M89j32j67n8J47k57m8m0J15L8J01k62M86m34J11j46m6J78
3056e3p2J18j22k2L99m9l2oo95P37p7k04J39p1M5j54M37l89J74K4n1j92m7L70
3080B07l45J88j66R7J88m01N1p7P9J78j7j42J63j31Q4J33j83k17L70J15o0m5j93
3103a24J99r5L05l19L45m43M13l31j84J79p5j10M15m27K94l36P8m7r8K84j6P3
3125b0K36m17L01J1k52L3J96J0l27L80j75K47j25k04P3j92K36K88o0j11j49j93
3147b14L06K06k81M9l68M29j77N54n43L15l89J84k94L63j61L60j87k24L52l33
$$ y = [77, -102, -278, 2, 29, 126, 265, 198, -251, -76, -91, -391, -208, -179, 174, 228, 88, -6, 152, -110, -123, 93, -164, -37, -249, 8, -47, 292, 28, 62, -214, -354, 206, -199, 196, 216, 4, -16, -141, 189, -2, 63, -26, 43, 25, 330, 187, 85, 104, 57, -128, 361, 229, 62, 4, 151, -106, -154, -194, -79, -41, 60, -202, 284, -150, -39, -185, -231, -53, -125, -7, -129, -151, 248, 199, 167, 161, -534, 203, 126, -78, 61, -10, 35, -119, 318, -71, 103, 127, 76, -116, -163, 207, -138, 50, -116, -19, 169, -232, -181, -258, -179, -1, -18, -160, 3, -128, -44, 89, -94, -311, 59, 174, 114, 69, -124, 75, -20, 285, -34, 311, -132, 281, -50, -234, -55, -130, -240, 175, -252, 42, -294, -216, -263, -361, -77, -93, -20, 216, -201, 100, 111, -141, -108, 88, 98, -229, 151, -24, 223, 98, -106, -33, -225, 11, 299, 239, 128, -21, -214, 92, 298, 17, 66, -302, 127, -50, 504, -39, 276, -113, 71, -223, 140, -21, 339, 152, -72, 280, -53]
$$ [...]
8191A31
##END NTUPLES=NMR FID
##END=
