##TITLE=1H_DE-70_2
 CDCl3
 8 sc, 
 30.10.2024
##JCAMPDX= 6.0         $$ Bruker NMR JCAMP-DX V2.0
##DATA TYPE= NMR FID
##DATA CLASS= NTUPLES
##ORIGIN= UXNMR, Bruker Analytische Messtechnik GmbH
##OWNER= root
$$ XWIN-NMR		Version 3.5
$$ Wed Oct 30 14:55:20 2024 Russian Standard Time (UT+4h)  she@DPX200
##.OBSERVE FREQUENCY= 200.1318
##.OBSERVE NUCLEUS= ^1H
##.DELAY= (6, 6)
##.ACQUISITION MODE= SIMULTANEOUS
##.ACQUISITION SCHEME= undefined
##.AVERAGES= 8
##.DIGITISER RES= 18
##SPECTROMETER/DATA SYSTEM= spect
##.PULSE SEQUENCE= zg30
##.SOLVENT NAME= DMSO
##.SHIFT REFERENCE= (INTERNAL, DMSO, 0, 15.7039)
##AUDIT TRAIL= $$ (NUMBER, WHEN, WHO, WHERE, WHAT)
$$ ##TITLE= Audit trail, XWIN-NMR		Version 3.5
$$ ##JCAMPDX= 5.01
$$ ##ORIGIN= Bruker BioSpin GmbH
$$ ##OWNER= she
$$ F:/spectra/data/she/nmr/H-F/1/audita.txt
$$ ##AUDIT TRAIL=  $$ (NUMBER, WHEN, WHO, WHERE, WHAT)
(   1,<2024-10-30 14:54:23.85 +0400>,<she>,<DPX200>,
      <created by zg, POWCHK disabled, PULCHK disabled
       configuration hash MD5:
       00 E9 B6 7A A2 85 ED C7 34 08 36 98 17 FE 4E 26
       data hash MD5: 16K
       97 63 A1 9D 7C CA 8C 70 AC 05 83 43 65 15 95 9D>)
$$ ##END=
$$ 
$$ hash MD5
$$ 81 F0 F4 6A 94 20 C3 E3 AD E1 27 56 43 ED EB 4D
##$RELAX= 
##$RELAX= 
##$RELAX= 
##$RELAX= 
##$RELAX= 
##$RELAX= 
$$ Bruker specific parameters
$$ --------------------------
##$DU= <F:/spectra>
##$EXPNO= 1
##$NAME= <H-F>
##$PROCNO= 1
##$TYPE= <nmr>
##$USER= <she>
##$AMP= (0..31)
100 100 100 100 100 100 100 100 100 100 100 100 100 100 100 100 100 100 
100 100 100 100 100 100 100 100 100 100 100 100 100 100 
##$AQSEQ= 0
##$AQ_mod= 1
##$AUNM= <au_zg>
##$AUTOPOS= <>
##$BF1= 200.13
##$BF2= 200.13
##$BF3= 200.13
##$BF4= 200.13
##$BF5= 200.13
##$BF6= 200.13
##$BF7= 200.13
##$BF8= 200.13
##$BYTORDA= 1
##$CFDGTYP= 0
##$CFRGTYP= 5
##$CHEMSTR= <none>
##$CNST= (0..31)
1 1 145 1 1 1 1 1 1 1 1 1 1 1 1 1 1 1 1 1 1 1 1 1 1 1 1 1 1 1 1 1 
##$CPDPRG= <>
##$CPDPRG1= <>
##$CPDPRG2= <>
##$CPDPRG3= <>
##$CPDPRG4= <mlev>
##$CPDPRG5= <mlev>
##$CPDPRG6= <mlev>
##$CPDPRG7= <mlev>
##$CPDPRG8= <mlev>
##$CPDPRGB= <>
##$CPDPRGT= <>
##$D= (0..31)
0 1.2 0 0 0 0 0 0 0 0.06 0 0.03 0 0 0 0 0.0002 0 0 0 0 0 0 0 0 0 0 0 0 
0 0 0 
##$DATE= 1730285663
##$DBL= (0..7)
120 120 120 120 120 120 120 120 
##$DBP= (0..7)
150 150 150 150 150 150 150 150 
##$DBP07= 0
##$DBPNAM0= <>
##$DBPNAM1= <>
##$DBPNAM2= <>
##$DBPNAM3= <>
##$DBPNAM4= <>
##$DBPNAM5= <>
##$DBPNAM6= <>
##$DBPNAM7= <>
##$DBPOAL= (0..7)
0.5 0.5 0.5 0.5 0.5 0.5 0.5 0.5 
##$DBPOFFS= (0..7)
0 0 0 0 0 0 0 0 
##$DE= 6
##$DECBNUC= <off>
##$DECIM= 24
##$DECNUC= <off>
##$DECSTAT= 4
##$DIGMOD= 1
##$DIGTYP= 9
##$DL= (0..7)
0 120 120 120 120 120 120 120 
##$DP= (0..7)
150 150 150 150 150 150 150 150 
##$DP07= 0
##$DPNAME0= <>
##$DPNAME1= <>
##$DPNAME2= <>
##$DPNAME3= <>
##$DPNAME4= <>
##$DPNAME5= <>
##$DPNAME6= <>
##$DPNAME7= <>
##$DPOAL= (0..7)
0.5 0.5 0.5 0.5 0.5 0.5 0.5 0.5 
##$DPOFFS= (0..7)
0 0 0 0 0 0 0 0 
##$DQDMODE= 0
##$DR= 18
##$DS= 0
##$DSLIST= <SSSSSSSSSSSSSSS>
$$ [...]
##$SUBNAM2= <"">
##$SUBNAM3= <"">
##$SUBNAM4= <"">
##$SUBNAM5= <"">
##$SUBNAM6= <"">
##$SUBNAM7= <"">
##$SUBNAM8= <"">
##$SUBNAM9= <"">
##$SW= 24.0689170037331
##$SWIBOX= (0..15)
0 0 2 0 0 0 0 0 0 0 0 0 0 0 0 0 
##$SW_h= 4816.95568400771
##$TD= 16384
##$TD0= 1
##$TE= 0
##$TE2= 300
##$TE3= 300
##$TEG= 300
##$TL= (0..7)
0 120 120 120 120 120 120 120 
##$TP= (0..7)
150 150 150 150 150 150 150 150 
##$TP07= 0
##$TPNAME0= <>
##$TPNAME1= <>
##$TPNAME2= <>
##$TPNAME3= <>
##$TPNAME4= <>
##$TPNAME5= <>
##$TPNAME6= <>
##$TPNAME7= <>
##$TPOAL= (0..7)
0.5 0.5 0.5 0.5 0.5 0.5 0.5 0.5 
##$TPOFFS= (0..7)
0 0 0 0 0 0 0 0 
##$TUNHIN= 0
##$TUNHOUT= 0
##$TUNXOUT= 0
##$USERA1= <user>
##$USERA2= <user>
##$USERA3= <user>
##$USERA4= <user>
##$USERA5= <user>
##$V9= 5
##$VALIST= <valist>
##$VCLIST= <CCCCCCCCCCCCCCC>
##$VD= 0
##$VDLIST= <DDDDDDDDDDDDDDD>
##$VPLIST= <PPPPPPPPPPPPPPP>
##$VTLIST= <TTTTTTTTTTTTTTT>
##$WBST= 1024
##$WBSW= 4
##$XGAIN= (0..3)
0 0 0 0 
##$XL= 0
##$YL= 0
##$YMAX_a= 91852
##$YMIN_a= -98134
##$ZGOPTNS= <>
##$ZL1= 120
##$ZL2= 120
##$ZL3= 120
##$ZL4= 120
##$ABSF1= 10
##$ABSF2= 0
##$ABSG= 5
##$ABSL= 3
##$ALPHA= 0
##$AQORDER= 0
##$ASSFAC= 0
##$ASSFACI= 0
##$ASSFACX= 0
##$ASSWID= 0
##$AUNMP= <proc_1d>
##$AZFE= 0.1
##$AZFW= 0.1
##$BCFW= 1
##$BC_mod= 2
##$BYTORDP= 1
##$COROFFS= 0
##$CY= 11.3945322036743
##$DATMOD= 1
##$DC= 2
##$DFILT= <>
##$DTYPP= 0
##$F1P= 15.6554695791079
##$F2P= 12.8336369535428
##$FCOR= 0.5
##$FTSIZE= 0
##$FT_mod= 4
##$GAMMA= 1
##$GB= 0.15
##$INTBC= 1
##$INTSCL= 1
##$ISEN= 128
##$LB= 0.24
##$LEV0= 0
##$LPBIN= 0
##$MAXI= 10000
##$MC2= 0
##$MEAN= 0
##$ME_mod= 0
##$MI= 1.114404
##$NCOEF= 0
##$NC_proc= 0
##$NLEV= 6
##$NOISF1= 3.799351
##$NOISF2= 2.8
##$NSP= 1
##$NTH_PI= 0
##$NZP= 0
##$OFFSET= 15.70392
##$PC= 1
##$PHC0= -26374.09
##$PHC1= 47.78743
##$PH_mod= 1
##$PKNL= yes
##$PPARMOD= 0
##$PSCAL= 0
##$PSIGN= 0
##$REVERSE= no
##$SF= 200.130013532006
##$SI= 16384
##$SIGF1= 3
##$SIGF2= 2
##$SINO= 400
##$SIOLD= 16384
##$SREGLST= <1H.CDCl3>
##$SSB= 0
##$STSI= 0
##$STSR= 0
##$SW_p= 3612.71676300578
##$SYMM= 0
##$S_DEV= 0
##$TDeff= 0
##$TDoff= 0
##$TI= <>
##$TILT= no
##$TM1= 0
##$TM2= 0
##$TOPLEV= 0
##$USERP1= <user>
##$USERP2= <user>
##$USERP3= <user>
##$USERP4= <user>
##$USERP5= <user>
##$WDW= 1
##$XDIM= 8192
##$YMAX_p= 0
##$YMIN_p= 0
$$ End of Bruker specific parameters
$$ ---------------------------------
##NTUPLES= NMR FID
##VAR_NAME=  TIME,          FID/REAL,        FID/IMAG
##SYMBOL=    X,             R,               I
##VAR_TYPE=  INDEPENDENT,   DEPENDENT,       DEPENDENT
##VAR_FORM=  AFFN,          ASDF,            ASDF
##VAR_DIM=   8192,          8192,            8192
##UNITS=     SECONDS,       ARBITRARY UNITS, ARBITRARY UNITS
##FACTOR=    0.0002076,     1,               1
##FIRST=     0,             0,               0
##LAST=      1.7004516,     0,               0
##MIN=       0,             -98134,          0
##MAX=       1.7004516,     91852,           0
$$ Real data points
##PAGE= N=1
##DATA TABLE= (X++(R..R)), XYDATA
0@%%%%%%%%%%qJ6j6J6j6K3l1L2m0M8n6O7p5Q8j03J18j35J55j77K01k28K56k88
33a53L22l59M01m48M98n53O16o81P54q37R26j026J137j259J399j556J735j944
51a028K189k480K833l276L843m602N678p333J0293k4693J10428o2008j08116J21174
65D2902k7009n8405Q9226k2182r2538Q1872J9245o6759L8378N415n2177O7054
77B5022J3367q1122M0899M6448o9878J6322M6552o4546k607O6512m3260k5418
89c1709N7691k4968l2647O2841q910n8443M3157K1028n0368K2610J7978n0898
101c2638K4882M3029n1228o011M4170k6149j60L3240m4822p454N8637l3208l5065
114c2777M8899j4698l0039N0964j0779m7821N0195J4326n1383K6020J8389m2985
$$ plain form
0 0 0 0 0 0 0 0 0 0 0 0 -8 8 -8 8 -8 15 -16 16 -24 24 -32 35 -40 48 -55 63 -72 83 -94 107 -121 135 -153
33 -153 169 -190 211 -237 261 -292 324 -357 397 -440 486 -540 597 -662 737 -819 916 -1028
51 -1028 1161 -1319 1514 -1762 2081 -2521 3157 -4176 6117 -18576 91852 29844 -78272 42902
65 42902 15893 -42512 46714 24532 -68006 13866 33111 -33648 4730 10145 -42032 25022
77 25022 38389 -42733 -1834 44614 -25264 -8942 37610 -26936 -29543 36969 -6291 -31709
89 -31709 25982 1014 -31633 31208 22298 -36145 7012 28040 -22328 282 18260 -32638
101 -32638 -7756 35273 -15955 -21966 22204 -3945 -4105 29135 -15687 -23141 35496 2288 -32777
114 -32777 16122 1424 -28615 22349 11570 -36251 13944 28270 -23113 2907 21296 -21689
126b1689K1390K4132m5240P353L3925l0356j049L0970k3911p827L0356j3947j4140
139a0033K0570j1296j1794K1896q348j8713K2523K882j9116J6008P006k1806J2923
152B702J5491k6151k342K1964j4141r245J8339q769r062K0224m084j4347J6507
165G086R88j4551J1684R9j5688J1958L499j7134J1066Q313j6407J0153J0884j7730
179e780M709J3801j7662K93J5515j6031o164J7829p706q407J4991k795p487J1290
193F396j528q436P126k24p546M556j172n752P896q50o575P705M157p799L994M521
209F469q103Q82N552q177k913Q640l426m972P199O13m495O218R40o122M012J553
225C870p443K345K936o298K089L781n100L498N251o878J855P121p534j738P580
$$ plain form
126 -21689 -299 23833 -21407 -14054 19871 -10485 -11534 19436 -4475 -12302 18054 4107 -10033
139 -10033 10537 -759 -12553 9343 995 -17718 4805 7687 -11429 4579 11585 -10221 2702
152 2702 18193 -7958 -10300 11664 -2477 -11722 6617 -2152 -11214 9010 4926 -9421 7086
165 7086 8074 -6477 5207 5306 -10382 1576 5075 -12059 -993 7320 -9087 1066 11950 -5780
179 -5780 -1071 12730 -4932 -4639 10876 -5155 -11319 6510 -1196 -9603 5388 2593 -4894 6396
193 6396 4868 -3568 3558 3334 -4212 344 -828 -6580 1316 466 -6109 1596 5753 -2046 1948 6469
209 6469 -1634 -752 4800 -3377 -6290 2350 -1076 -6048 1151 1764 -2731 3487 4427 -1695 2317 3870
225 3870 -3573 -1228 1708 -4590 -2501 1280 -3820 -322 4929 -1949 -94 7027 -507 -2245 5335
240E335p555l418Q795n159n471R973m54o324P155J317o120M713J183p154K892
255b92J774n455K069J794l397L593L024m937L326L911o201K30M721o039j528N684
271B277m334l835P392j81n312O531K201n842K697K981o230O97K845n077k27M428
287A011l516L7N254l248J06N354m203k618O124l740m840N721j783n830O477J563
303A869o022N500L281n582J749L896n636j23L672m726o28L270k630m63M759k024
319A62q23M471k870j620M018k608l901M250j566m488M497J661m834L832L938n075
335i56J584L955m758j426M299l797k482M212j831k408M751j49k579M148M2l444
351h39L146j10m595K488Q29m940K180K875l921K377M204m084j57M528l414j960
$$ plain form
240 5335 -2220 -5638 3157 -2002 -7473 2500 2046 -4278 2877 4194 -1926 2787 3970 -3184 -292
255 -292 1482 -3973 -1904 -110 -3507 86 3110 -1827 1499 5410 -791 -561 4160 -1879 -3407 2277
271 2277 -2057 -5892 1500 1319 -3993 2538 4739 -1103 1594 4575 -1655 -958 1887 -3190 -3417 1011
287 1011 -2505 -2468 2786 -462 -356 4998 795 -1823 4301 561 -4279 1442 -341 -6171 306 1869
303 1869 -4153 1347 4628 -954 795 4691 -945 -1068 2604 -2122 -2750 520 -2110 -2573 2186 162
319 162 -661 3810 940 -680 3338 730 -3171 1079 -487 -4975 -478 1183 -3651 181 4119 -956
335 -956 628 4583 -175 -1601 2698 -1099 -3581 631 -1200 -3608 1143 994 -1585 2563 2605 -839
351 -839 2307 2197 -2398 90 919 -4021 -1841 1034 -2887 -510 3694 -390 -547 3981 567 -1393
367a393L868k524l345L625j040k557L534P75k140K533J434k556J478L89l362P37
383e44P98l160J272K022k849J266L751l118K91M198k344k942L853k100m131L542
399a95K88l863L273J497l089K436K848l130J372J136l528L69J790l460R5K540
415C79k359L70L858k318o48M138j932k699L182q02l819K230M76l227J844J868
431E41j680J200K157j973P52J313k490j10J184k409p35K516k087k08L633j435
447A69j102L678o25k982L418j172l772J898J001l471J466K500k739J567K778k345
463B67M50K207k435j387K524k681j717K524j023r26K765j49j360K622P3k134J960
480A580k6k959J335L18k775Q91J989j848Q20K651j717j3K540k045j320J824j439
$$ plain form
367 -1393 2475 -49 -3394 231 -809 -3366 168 943 -1197 1336 2770 214 1692 2081 -1281 -544
383 -544 254 -2906 -1634 388 -2461 -1195 2556 -562 -271 3927 1583 -1359 2494 394 -3737 -195
399 -195 93 -3770 -497 1000 -2089 347 3195 65 1437 2573 -955 -586 1204 -2256 -2161 379
415 379 -1980 -1610 2248 -70 -718 3420 1488 -1211 1971 1169 -2650 -420 56 -3171 -1327 541
431 541 -1139 61 2218 245 997 2310 -180 -290 894 -1515 -2250 266 -1821 -2029 1604 169
447 169 -933 2745 2120 -862 2556 1384 -2388 -490 511 -2960 -1494 1006 -1733 -166 2612 267
463 267 717 2924 489 -898 1626 -1055 -2772 -248 -1271 -2197 568 419 -941 1681 1754 -380 1580
480 1580 1554 -1405 -70 248 -2527 -1636 353 -1495 -675 1976 259 246 2786 741 -579 1245 -194
497a94j853J572m42j184K276L46j135K352j1j788J735K17l317Q39J265l363J076
514a609K345k295Q7L331j124p16K378r60k451K523j011k549J795j37j493J472
530d14M19r39J960R10k046J233Q54k831M50J042k368k4J688j696L17K803n94q77
548a13J787n08j110J323j214j500Q84k09j432J423Q47p83J070J052j708J342J066
565B217k473l14J663k123j502K809j370m20K443k38j571K636P8j959J122m88j443
582i33M83J56j515P86R60j152R95J684r88R8J178j456p10R28j249r54J390m92
600g91m38J277K34n85J547L37j337J061r1k031K23O09j574J07J462j113N74K013
618A484q32o34J461l74j124M80r68j115J299m22j022J330J280j084R19J059j318
$$ plain form
497 -194 -2047 -475 -917 -2101 175 521 -614 1738 1727 -61 1674 1891 -1426 -587 678 -2685 -1609
514 -1609 736 -1559 -1472 1859 735 19 2397 1437 -1014 1509 498 -2051 -256 -393 -1886 -414
530 -414 5 -934 1026 1936 -110 1123 1977 -854 -404 638 -1730 -1754 -66 -1762 -1445 1358 764 -113
548 -113 1674 1166 56 1379 165 -1335 -451 -660 -2092 -669 178 -605 465 1517 -191 1151 2217
565 2217 -256 -570 1093 -1030 -2532 277 -1093 -1513 930 692 -879 1757 1835 -124 998 510 -933
582 -933 -450 -294 -1809 -1023 -63 -1215 -220 1464 476 574 1752 296 -414 514 -735 -1689 -299 -791
600 -791 -1229 48 282 -303 1244 1581 244 1305 1214 -817 -594 15 -1559 -1452 10 -1103 -529 1484
618 1484 652 18 1479 1105 -19 461 -507 -1622 -323 -745 -1767 -437 843 -241 678 1737 419
635D19N90N94k279l43J613j717n58J362l26k40J623L9n79J234J99j890N83l13
653A1r21M40m71n13J131P33r35Q23J259m96j67J99j395K16P43j491r96J183N66
672h1l47O68J10MR21K51j686M32L98q89o43j87n56J166O63r82M57J861q67n95
692I8J012n16j076O51o50j404J282M90j093P28J503n45K67J41o70N20Q6j697j4
711h87O68q08J53M44m81J108J465r28m80J347q35q10J59j077j70N05P8q59P78
730f30J242k62K45M04l12K48o01o46k53L38p42l76P90K90J48M83j42N7J160n74
750H67j264L67K48j149k40N15j95O11P92n74k97K316p64p43J73r17o7P12j017
769f26q78P09M03n9R01j32j75J214m38q45M56m83r63L11N48j270N14J199q21J027
$$ plain form
635 419 1009 1603 -676 -1019 594 -1123 -1681 -319 -645 -885 738 777 198 1432 1631 -259 324 11
653 11 -910 -470 -941 -1454 -323 410 -525 298 1557 1061 894 1093 -302 -86 657 -834 -1830 -647 -81
672 -81 -428 240 350 354 1275 1526 -160 272 670 -219 -862 -1049 -1605 -439 224 -758 -301 1560 693 98
692 98 1110 594 -482 169 -481 -1885 -603 -113 -1206 -478 1025 480 747 888 218 738 824 -873 -887
711 -887 -219 -1027 -874 -430 -911 197 1662 734 254 1601 766 -44 115 -962 -1132 -627 -549 -1408 -630
730 -630 612 350 595 999 687 935 334 -312 -565 -227 -969 -1345 -555 -265 -117 366 224 281 1441 867
750 867 -397 -30 218 -931 -1171 -656 -851 -240 552 -22 -319 1997 1233 490 663 -254 -321 391 -626
769 -626 -1504 -795 -392 -451 450 318 143 1357 919 74 530 47 -916 -605 -57 -1327 -813 386 -435 592
789E92N70o40l42Q94q41l77l60q5n02O63j84l54J244L49j02L22J47l12l78k9j231
810i56q5J204o88l12P89J38j77J087k93n82Q09k2j534N38o0q48L7O27o84P02P13
831D03o09J192M87j536J6Q07j359O00j27r78j43J380o51p2J376nm19Q94j329l88
851d61N33n0j311L27O54l23O01N18n40O24M01j61m58M49k84j034M3o33M67L54
871b84q2j71J120J15j92N88j04j035l2rr05K86M69m37rJ034j49j27R23m71m36
892I2Q19p57q69J111o84q09O44Jj15J149r5m89J265k79q59J85p5j070K89J64o06
913i88L34N26P3J05O34j35J70J39p25n24L11m14m66N40J71r4O58Q1J79J11J85
934H71q61N5L46p32k28R0m14J64O89j73P6R48R8p40Q52n38o33P05q35q13Q37j78
$$ plain form
789 592 1162 522 180 1074 233 -144 -504 -589 -1091 -428 -612 -966 278 627 525 847 994 682 304 275 -956
810 -956 -1041 163 -525 -837 -48 90 -87 1000 707 125 934 912 -622 -84 -144 -992 -955 -328 -1012 -310 403
831 403 -206 986 1473 -63 -47 760 -599 1 -126 -1104 -1247 133 -518 -590 786 781 362 1256 -73 -461
851 -461 72 22 -1289 -962 -308 -631 -30 488 -52 572 973 812 354 803 519 -515 -472 -1105 -638 -284
871 -284 -366 -537 583 698 506 1094 990 -45 -77 -86 -991 -705 -236 -673 -682 352 203 76 999 528 92
892 92 911 154 -715 396 -288 -1097 -453 -452 -567 582 487 -2 1263 984 125 310 235 -835 -546 -382 -988
913 -988 -654 -128 -55 50 684 549 719 858 133 -391 -80 -494 -960 -420 -249 -343 315 396 575 686 871
934 871 10 65 411 -321 -549 -459 -873 -709 -20 -193 -117 831 929 189 1041 503 -130 575 -260 -1073 -236 -414
956d14p12J214L10l43J010j0q62N03k24r34J77K18j086N79L93o94Q05J053o91
975B92L4N98n48j98P3l17q29N25q4k53Q04k3K08L01K52m16k2q9o09M7N9n49n0
998g94N65q6k6J125m81k12J018n24n80M28m89p93M93N02p70N19j41j56P38P06
1018A042q01N16r9o50k00O4r73J11R21n28K60J025n95L47O47m12q09O98k00j250
1038h86P46r4n36P23q0m24Q92L52l07L57N4o27l45K49n01m43P02m03OQ41o4j35
1060G7N85K1n82L14l6q29Q5K75o11J98Q07q67O54P90o40j50O86j99n31j5o54k48
1082h70O25m74m15J511k60k62J049k7p43M58n3r29J36M12j025J57O00j60L53L79
1102D62M1k01N93p96o9R1l99l09Q1K5k51L28M04j74P39O06r51o8L00r42J47O4
$$ plain form
956 -414 -1126 88 398 55 1065 1055 193 696 472 -462 -285 -67 -1153 -574 -181 -875 -70 983 292
975 292 326 924 376 178 251 -66 -895 -370 -454 -707 97 74 282 583 835 419 397 308 -301 -254 -195 -744 -794
998 -794 -229 -315 -341 784 303 91 1109 585 5 433 -56 -849 -356 146 -624 -105 -246 -402 336 1042
1018 1042 241 757 658 8 -192 -128 -1101 -990 -69 -597 -337 688 93 440 1087 675 -134 564 364 -886
1038 -886 -140 -234 -770 -47 -127 -551 341 693 386 743 797 170 -175 74 -427 -870 -168 -571 -565 276 212 77
1060 77 662 683 101 415 379 -450 -365 -90 -701 -503 304 -563 91 881 241 91 777 578 47 32 -622 -870
1082 -870 -245 -719 -1134 377 117 -145 904 877 134 592 539 -390 -254 158 -867 -710 -110 -270 83 462
1102 462 503 302 895 99 30 121 -278 -587 -506 -481 -732 -404 0 -174 565 1171 220 152 452 -490 -343 -279
1124b79l08k4K96l7j60R45p4M9K90J00r21J36j55p38O77k07m04O75K97m51O72
1145C79N42m77K9L46n56p29N77p96j28R82l24j74P15j00j84L83J81q23L53j91
1165En18j53J85l90P38N03p72M32O11l86L03M52j005m48N27m78l27N76m73K43
1185c75M75K09M2M49n41j69m3K71q32K93M6m50J49K61l5K10N32l63K6O19p49l79
1207c54K54k10n88J08O89n15R63J31n20J46O05m76j39P9m43j55L62n42l0P83o72
1228e24J88R05l28J24M95n97o06L13j22q12N59j06k88P25L67m79P79P0m43J78
1248C98L39q35r6K54r35L80K94j43J32M37J43J24K64n39k99N50n53m27J75j79
1268e16K4M62K77k34L37L11o14Q5N68r03OM72q22K06M89k81n34R35j98k08R70
$$ plain form
1124 -279 -587 -611 -315 -352 -512 433 359 408 698 798 -123 13 -142 -880 -203 -410 -814 -139 158 -293 379
1145 379 921 444 473 819 263 -466 111 -685 -813 169 -155 -329 386 286 102 485 666 -157 196 5
1165 5 -513 -666 -481 -871 -133 370 -402 30 641 255 558 1010 5 -443 84 -394 -721 -145 -618 -375
1185 -375 100 309 351 800 259 90 47 318 -514 -221 -175 -625 -476 -215 -250 -40 492 129 155 774 25 -354
1207 -354 -100 -310 -898 -790 -101 -616 347 478 -42 104 709 233 94 173 -270 -425 -63 -605 -635 148 -524
1228 -524 -336 569 241 365 860 263 -343 -30 -152 -964 -405 -511 -799 -74 293 -186 593 663 220 398
1248 398 737 -98 -194 60 -875 -495 -201 -344 -212 225 368 492 756 217 -82 468 -85 -512 -337 -516
1268 -516 -492 -30 247 13 350 661 47 132 700 -203 -197 275 -547 -341 148 -133 -667 268 70 -138 832
1289H32j76p03O95p45o84Q82m55n61L83J127r55O60M21j042N93L82r71L42L4o00
1309e41k22L63l71L29R82n47j27Q30k53p12R28l47r84P41lr75L34Q55q17O91P70
1330I24r09L54K97q74j33Q91r63q91J423m05l46Q27q6l96R46J25q28N54k81m54
1350b25j32J62o22N83Q43j133M69R59p30J46Q68j218m15R00o23p01P50K35r15
1369g99J007N2n27M70M37n63J9P99j308oL49o09o1P20k11k40J068r0p63J141k77
1390F08p29N79n70o13R52n43o12Q21L28k77M41J77l35LO04r89j81L36r3p02P69
1411b6k78j24J041m80k97Q45R5j020M10O6r07L65L22n40L61N41q66Q50L64n11
1431B11J8K06n23N8K60n94j33O11k47k07L16M89k53K03m17n2L13n6n66j46M09
$$ plain form
1289 832 656 -47 648 -97 -781 101 -354 -915 -532 595 -360 300 721 -321 272 654 -317 25 59 -541
1309 -541 -763 -400 -771 -442 540 -7 -134 696 443 -269 659 312 -672 69 66 -909 -575 280 -537 154 924
1330 924 15 369 666 -208 -341 550 -413 -1304 119 -286 -632 195 109 -287 659 784 -44 510 229 -225
1350 -225 -357 -195 -817 -234 609 -524 -55 904 174 320 1188 -30 -445 455 -168 -869 -119 116 -799
1369 -799 208 260 -267 203 640 77 96 895 -413 -419 -70 -679 -740 -20 -231 -471 597 507 -256 885 608
1390 608 -121 458 -112 -725 227 -316 -928 -107 221 -56 385 562 227 230 834 -155 -336 0 -93 -795 -26
1411 -26 -304 -428 613 133 -164 681 776 -244 166 232 -675 -310 12 -528 -167 374 -492 358 722 211
1431 211 229 435 -88 -30 230 -364 -497 114 -133 -340 -24 465 212 415 -2 -54 259 203 -363 -509 -100
1452a00k64L33O5l23J32M41O9j99M01l96j87N4o9j34k58J42K16K01J29j43L39
1473D49j08j62J98l15q50O63L42j172R50m08K89K37K76k01j7M18k39k24jn14K49
1494a40l63j4L6N28j66R5L18J25O4L0m10k22J98k51m29J71L08k48L07L49m41M15
1516B60M04o78J50K86p64q1k86J00J40N14n7l39Q61l20l64Q93n19o11L61Ml27
1537c73J11M58o04K98M66l43K60Q7j91q3J90l54m38K62j47M59n4k36R5O73k35
1558C01j15J83k13Pk35L53p79j04M02l99N88M36j91m3M74l62j28L41l30p71N22
1579f3k04n01N92j91L1N73m4O1l24M92Nl04J6l61k61J33J40J26N49n11J07N60
1601F21l86r2L7k0n85L87K28q55R2M23j09R4L91Q0j13J64j08l53O1j94j1J51j91
$$ plain form
1452 -100 -364 -31 34 -289 -157 284 353 154 555 159 -28 26 -43 -177 -435 -293 -77 124 253 110 449
1473 449 341 179 377 62 -788 -125 217 -955 -5 -413 -124 113 389 188 171 589 350 126 125 -389 -140
1494 -140 -503 -517 -481 47 -119 -24 294 419 483 513 103 -119 79 -172 -601 -430 -122 -370 -63 286 -155 260
1516 260 664 -14 136 422 -342 -423 -709 -609 -469 45 -12 -351 510 190 -174 719 200 -411 -50 -46 -373
1537 -373 -262 196 -408 -110 356 13 273 360 169 86 276 -78 -516 -254 -401 58 4 -232 -137 536 301
1558 301 186 369 156 163 -72 281 -498 -602 -200 -599 -11 425 234 191 665 303 175 516 186 -585 -63
1579 -63 -267 -768 -176 -367 -336 237 193 254 -70 422 427 123 139 -222 -483 -350 -210 -84 465 -46 61 621
1601 621 235 143 180 160 -425 -38 190 -665 -573 -150 -259 -165 226 306 193 357 249 -104 -43 -237 -248 -97 -288
1624b88O1P7L39k82N68j35j23n0J75p43k7J65O2k63K11M05m26O80j27k85J79p8
1646I5k53O72o86j57j07j96L48J87L13k93O51k38k01K53r5l97l52O92j012M73
1666c03K67l03O1M79P5l81J56K24l86R1Rk34P6J6j06n1J52L04n51Q34n5j07K70
1689E37n47k07L22j99k25p9K18J90M36N5l80L95m43P4k6N9k88n3j00O9J94R9l76
1712b75K59J72k99O13l61l12L73q3q09N59n3J24j42N22K82p74N00K96l41k5k46
1733b0K65k91L2j00o0N4J64M0J67mr1Pj79L2j33J10k17M82p15r8O86O7k11J43
1757A30L03m80j6N79o46K55j21n93J43L72j98L71JK48q8r4L15k38l61N3l51J25
1779b91N8j71J74L28l20M23Q8j11p9K08n86M29l35J13j80K86L2l03N36J75k07
$$ plain form
1624 -288 -227 -150 189 -93 475 340 217 167 342 -401 -428 -263 -201 -464 -253 152 -274 406 279 -6 173 95
1646 95 -158 514 -172 -329 -436 -632 -284 -97 216 -77 574 336 135 388 293 -104 -456 236 -776 -303
1666 -303 -36 -339 -278 201 276 -105 51 275 -111 -20 -11 -245 -169 -153 -259 -310 -158 146 -405 429 374 267 537
1689 537 -10 -217 105 -94 -319 -398 -180 10 446 501 121 516 73 147 121 180 -108 -161 -261 -192 2 101 -275
1712 -275 -16 156 -143 470 109 -203 170 87 -722 -163 -216 -92 -234 288 570 -204 296 592 251 226 -20
1733 -20 245 -46 -14 -114 -174 -120 44 84 251 247 156 163 -16 16 -117 -7 -224 258 -457 -555 131 198 -13 130
1757 130 433 -47 -63 516 -130 125 4 -589 -446 -74 -272 99 100 348 260 166 481 243 -118 -65 -416 -291
1779 -291 -233 -404 -230 98 -222 201 289 178 99 307 -279 150 -185 -72 -252 34 66 -237 299 474 267
1800B67k06J68O4m5J00n91p5K2l15K54J54K03k75N84k55J56j43J42m05J9n50M45
1822b82K22o2J58O1j2J08mP4k3p6k37j35k66J93J25k16L95j18K43P8M2j87L89
1845D70m04K32j89l49J95j80K92l11K26J3L14O8J95l21j02k18J18l8l86k19L36
1866b58j45J66K11K57Q2k00J19k54J11L5k76j24J81o4j83J73J06L90k03J29l1
1887B22k6O0M2k66l45l4J4p2M75l0J54L8l88M72m12M79j0o37k35O82o49K68j15
1910c13K36J92M1j28l8J28J22l69M5l24K12J03n19L8P44J0O9Q4p5k83j8K7J14
1933I8q1j75J45J5k35K23k48M30O6k51K55P1l7j57l44l34K88N8J1K46j87j3N03
1956C47Lm33K94j39l1Nq0l92K70P0N2L9M7R2O4K72j69k63j8J2K01l80p3Q6J75
$$ plain form
1800 267 61 229 293 248 348 -243 -318 -296 -611 -357 -203 0 -275 309 54 210 67 209 -196 -177 -727 -282
1822 -282 -60 -122 36 97 85 193 189 263 240 164 -73 -208 -474 -281 -156 -372 23 -95 148 226 268 81 470
1845 470 66 298 109 -240 -45 -225 67 -244 -18 -5 309 377 572 251 149 -69 49 11 -375 -594 -258
1866 -258 -403 -237 -26 231 313 113 232 -22 89 124 -152 -276 -95 -159 -342 -169 -63 327 124 253 222
1887 222 196 256 298 32 -313 -347 -333 -405 70 40 194 232 -156 316 -96 383 373 -264 -499 183 -466 -198 -313
1910 -313 -77 115 156 28 -10 118 240 -129 -84 -408 -196 -93 -612 -574 170 180 249 333 258 -25 -43 -16 98
1933 98 17 -158 -13 2 -233 -10 -258 172 238 -13 242 313 276 119 -225 -559 -271 -213 -202 44 -143 -156 347
1956 347 350 -83 211 72 41 46 -34 -426 -156 -86 -34 5 52 144 208 480 311 48 30 42 243 -137 -210 -124 51
1981E1p2r9K94l0P6K55m25l80J36L43k78k11L31k67N19j26r7k60M44O7Jl48J31
2004E5k18p0M1j35L18J38j8K28r0K32n61J09J87l51J61m2m50M55r2J23k50L99
2026A69q8J35p4j85J7K00j25m0k11L06k8p70L09P66N4k61k09J51J87k91k4j16
2048a28p1J91j55K7Q3j60L38NK8l02L57PMk36J17k83J95oj48K28k05J72L61k34
2072A85m0l18J35J4j65J05m87P14n3K00o6j11J9P9j49k16J83k83K11j3j04J8o4
2095b06J88L02l30L51j79J88p1K09o55J27j7k19q5L78k4L46j21n72M40LJ42O7
2117B62m08k20l8J57O8K34o24N36j8J85K3j01L9k17N7o3K88l21R5Rk36L49J04
2140A60l13O9K33K98om96J48J17k40k94R1K06K38k00J73K91m56M26l80l05mM39
$$ plain form
1981 51 -21 -120 174 144 220 475 50 -330 -194 149 -129 -340 -9 -276 243 117 20 -240 204 271 272 -76 55
2004 55 -163 -233 -192 -327 -9 129 111 339 249 481 -80 29 216 -135 26 -16 -466 -11 -103 20 -230 169
2026 169 81 216 142 -43 -26 174 49 9 -202 104 76 -694 -385 381 435 174 -35 116 303 12 -12 -128
2048 -128 -199 -8 -163 -136 -53 -213 125 130 158 -144 213 220 224 -12 105 -178 17 11 -137 91 -114 58 419 185
2072 185 145 -173 -38 -24 -189 -84 -571 143 90 290 224 113 132 211 62 -154 29 -254 -43 -56 -160 -142 -206
2095 -206 -18 284 -46 305 126 314 243 452 -203 -76 -93 -312 -397 -19 -43 303 182 -390 50 53 195 262
2117 262 -146 -366 -404 -247 -179 55 -569 -33 -51 134 157 56 95 -122 -65 -128 160 -161 -66 -57 -293 56 160
2140 160 -153 -84 149 447 441 -55 93 210 -30 -324 -233 -27 211 11 184 475 19 445 65 -240 -244 195
2162A95m81n3L13Qj0K45j1k57M08k62l47R2J25J73j69k64K14p4J62o6M30k44k7
2185A00R8k69M0m82M77l10K12j84P8k3O47m36K51L85m79M1L0n9l56L95k57mK95
2208A90mj18K24k03L66k49J4k25l5J16n28J66l0j2J07L09j06k48J54K12j1J94
2230B83m92j0N9l9l5K58j47k32M53r5J28k43K20K94l91J11j58k23K17p5K13kP9
2253A73M2j56j24K97j71L8k7k69l14K78K31p7M0J3J52q4K27j55k3K22l38K02m88
2276c11R0r6L97N7l22L10j87J02K15n2n9jj22r9j1J49l37J81j53J93L37j28L57
2299E10m10Lj56l4j26J62o15O55L5p0J82J15rk98L13p7k55k83J60R3J92m13K81
2322d5j04j29O8N38k08L25n1k61m10N14k96l72m2J72N9K25J59n6K73j04l92K72
$$ plain form
2162 195 -286 -339 -26 -18 -28 217 206 -51 357 95 -252 -160 -35 138 -31 -295 -81 -155 7 -59 371 127 100
2185 100 198 -71 -31 -513 -36 -346 -134 -318 -240 -263 384 -52 199 584 105 146 176 117 -239 156 -101 -105 190
2208 190 186 68 292 89 455 206 220 -5 -40 76 -452 -286 -316 -328 -221 88 -18 -266 -112 100 89 283
2230 283 -209 -219 -160 -199 -234 24 -123 -355 98 3 131 -112 108 402 11 122 -36 -259 -42 -117 96 94 173
2253 173 215 59 -65 232 61 99 72 -197 -511 -233 -2 -79 -39 -26 126 42 269 114 91 313 -25 177 -311
2276 -311 -221 -317 80 137 -185 125 -62 40 255 203 144 143 21 -78 -89 60 -277 -96 -249 -56 281 153 510
2299 510 100 103 -53 -87 -213 -51 -666 -11 24 -46 136 251 242 -56 257 180 -75 -358 -198 -105 87 -326 -45
2322 -45 -149 -278 -210 328 120 445 394 133 -277 237 -59 -431 -473 -301 -242 -17 142 86 359 255 -137 135
2344A35q3l17L8k74M26J32k43n2L19J08m6k31M33l67Q9j95j63J39l09N27j22J79
2366A23j32J25l9j96K94m1j95N5k03m8k66M51q5j9O2N24j23k60K09j56p2J46K6
2389A80k72j26J80l63K21J01O9M9L9LK8K72l93k1j68J7j3J98l22K11L03J99j56
2412B36m64N14n64J44j34J08r5K67J67l43N8j3O43l35k83J49R2l18J50M0k83M0
2434b24J58j11j58L81N2k96K91M5R7l9k66L27m54K91k51J25n5K84n3J83j67J47
2456C07j45r1j23r0K34m9k34j11J51k29M43K55r1P3m27Q9P3k61l80M92M0Q2j50
2479a42j05L05j51M08o57L00M17m14r0j1Q1J17l38K9L21r9L19m16M94k15j09n3
2501iM6j91J51r9J70j63l0L12j12oK01n6J44m20N5j43R8o3M9J29n08L44J80R8
$$ plain form
2344 135 52 -265 -227 -501 -75 57 -186 -238 81 189 143 -88 345 -22 67 -128 -291 -152 -461 66 -56 123
2366 123 -9 116 77 -119 175 134 -61 -6 -209 -257 -523 -72 -157 -176 -114 410 287 27 236 80 8 154 180
2389 180 -92 -218 -38 -401 -180 -79 -10 39 78 81 109 381 -12 -33 -201 -184 -197 1 -321 -110 193 392 236
2412 236 -228 286 -278 -134 -268 -160 -255 12 179 -164 -106 -119 524 189 -94 55 147 -171 -21 19 -264 -224
2434 -224 -66 -177 -335 46 98 -198 93 138 235 196 -70 257 -197 94 -157 -32 -87 197 144 327 160 307
2456 307 162 71 -52 -142 92 43 -191 -302 -151 -380 63 318 227 300 -127 -38 35 -226 -606 -114 -74 8 -142
2479 -142 -247 58 -93 315 -342 -42 375 -39 -129 -140 -59 58 -280 -251 70 -29 290 -126 368 153 44 -9
2501 -9 37 -154 -3 -102 68 -95 -125 187 75 69 270 214 358 -62 -7 -150 -52 -115 -66 63 -445 -101 79 177
2525A77k69Q9K65l11rK77l17o6Q5J84J21o16M46J84l28M38j53k21P2K0j81K96
2547A83l22R8j71j05L20K91k59K64j00j85K1J61j36J50l84j6J41M8J14j4j27J00
2569G2j01J22r5o2j11K72j23p6R5J32J00l71J19K07k83J0K26m8q6j3j43j79J42
2592a94J83O3k81N23l84j74J94J55j33q4p2L5pJ50k88M07j31J00jK24j18j93p0
2615i6J2N6r5J59L7l46J8j63O14O5RN3k00M5k25P6P8pl28J45o1q7K27J58j8L5
2641A61o5k00L1p0Q5J20Ql29n4K86J05J56q8k75M92m4n04K13j01K29m36L59j03
2664b4j29j6K60J02k34K17j73L62n71J12j75N20k81l41L68l79M40k2Q2n0L7j91
2686h6R2Q0Q7o15KM35J6N0l04M61k6r6J5k41K69M1j79J58o2l68K10K09j72L36
$$ plain form
2525 177 -92 -3 262 -49 -58 219 -98 -164 -79 105 226 -390 56 240 -88 350 197 -24 48 68 -113 183
2547 183 -139 -41 -212 -317 3 294 35 299 199 14 35 196 60 210 -174 -190 -49 -1 113 99 -28 72
2569 72 -29 93 -2 -64 -175 97 -26 -102 -7 125 225 -146 -27 180 -103 -93 133 85 -1 -14 -157 -336 -194
2592 -194 -11 52 -229 294 -90 -264 -70 85 -48 -132 -204 -169 -176 -26 -314 93 -38 62 61 285 167 -26 -96
2615 -96 -84 -28 -123 36 73 -273 -255 -418 196 261 270 323 123 168 -57 19 97 90 -238 -93 -154 -241 -14 144 126 161
2641 161 96 -104 -73 -143 -58 62 70 -259 -313 -27 78 234 146 -129 363 319 -185 28 -73 156 -280 79 -24
2664 -24 -153 -169 91 193 -41 176 3 365 -206 -94 -269 251 -30 -371 -3 -382 58 36 118 68 105 -86
2686 -86 6 86 173 -442 -440 -5 11 61 -243 218 192 96 111 -130 139 180 1 159 97 -271 -61 148 -24 312
2710C12j29J47m18j1l30L67K99k31n9l34K55K11K84l98K77k70j07M60n04o4K61
2731A8j32j35J97K79j0l73K8Q1J86O9j65J17m9O7n75N47j61j58L9K43O8j05R7
2754A73k44M51l99j94K51n9j3J05j73J61k61J23P8j04M4J05L2N1j70J47n4k4l56
2777c30j02N56l23M28N27p57K60k88J33k48q5J16j42P6K73j03j39K16l15J71M02
2798C26p9k87K02m05O36m29q6J74o4L11n42L77k65P8L67j54j96k42K85n48M04
2819a37O8k7J04L27l62JN8L16k95k35l2j53J33j10J48J56o0j86N41j13j31J57
2841A68l34M92n87K33j49J13m9J1j1J35o5J30K12n55J29R7J48j61j65J41J61k79
2863a85K51J37k3J35j83j89L41j68Q4m68j90L05N4n5K50J40j08P8K01l33kl16
$$ plain form
2710 312 183 330 -88 -99 -429 -62 237 6 -53 -387 -132 79 363 -35 242 -28 -135 325 -179 -243 18
2731 18 -114 -249 -52 227 217 -156 -128 -47 139 208 43 160 111 178 -397 150 -11 -169 -130 113 181 76 173
2754 173 -71 380 -19 -213 38 -21 -34 71 -102 59 -202 -79 -1 -105 -61 44 76 127 -43 104 50 26 -330
2777 -330 -432 124 -199 229 756 -1 259 -29 104 -144 -229 -113 -255 -179 94 -9 -148 68 -247 -76 326
2798 326 247 -40 162 -243 393 -36 -122 52 -12 299 -243 134 -131 -53 314 160 -36 -278 7 -541 -137
2819 -137 -69 -96 8 335 -27 -26 32 348 53 -182 -214 -367 -234 -344 -196 -40 -100 -286 255 142 11 168
2841 168 -166 326 -261 -28 -177 -64 -113 -102 -113 22 -43 87 299 -256 -127 -30 118 -43 -208 -67 94 -185
2863 -185 66 203 180 315 132 -57 284 116 200 -268 -458 -153 -99 -154 96 236 128 206 407 74 72 -244
2885b44J8J32R7k59K01l5J39j31K02LJ82k61L1K59m67J22j06O2j17p7R5L78l42
2908a18K09m8K69p9n2L0m32K81r1L3k0K09k08K20r1j66K34l47J06j90M59j41M3
2931A10k59K6J43l42K24M21j29j32k32M2J57J04l1k10P5j05Q8j4M7o8N0L18j2
2954B71k52q0J41K17k92k70kO8P05n53k9L09l40J77l8J7j70L18j13K9m08p3J96
2977a72J73J19j77M1K67l7j61p5p2m7m1J02J9L7j25L9J62r9K69Q2Mn40J18J95
3001H1j30O5n1qM14n61K64J54j04k55K92k11o7k16M03k47k55N24o21M31M06m34
3023a26L31r6n3JJ23n77J93J08j07L51j85o1L76m22P4J57J26l56J49J5Q7l68q7
3046c47J22K77j31L33l71j46L62j7k07K75m97K24n2Q1j97L3N65k46M06o37K89
$$ plain form
2885 -244 -226 -94 3 -256 -55 -90 49 -82 120 123 305 44 75 334 -133 -11 -117 -55 -172 -249 -154 224 -118
2908 -118 91 43 312 233 181 211 -221 60 -31 2 -18 191 -17 203 112 -54 180 -167 -61 -251 208 67 110
2931 110 -149 -123 20 -322 -98 323 194 62 -170 -128 29 133 102 -108 -33 -138 -50 -64 -17 -85 -35 283 271
2954 271 19 -61 80 297 5 -265 -267 -199 506 -47 -76 233 -107 70 32 49 -121 197 84 113 -295 -368 -172
2977 -172 1 120 -57 -16 251 214 53 -22 -94 -141 -182 -80 -61 -24 -149 -110 52 -47 222 304 308 -232 -114 81
3001 81 -49 16 -35 -43 371 -190 74 228 124 -131 161 -50 -117 -333 70 -177 -432 92 -529 -98 308 -126
3023 -126 205 109 56 57 180 -397 -204 -96 -203 148 -37 -98 278 -144 -70 87 213 -143 6 21 108 -260 -347
3046 -347 -225 52 -79 254 -117 -263 99 82 -125 150 -347 -123 -175 -94 -291 -258 307 61 467 -170 119
3067A19K0M1j61O6k78M67l65K72l19P2R4n4O9K96k76o8k1K17P7k01k49O8O4k39
3091b89rL79J77j66k84K50m1j61R9k53L19J78r3J78j45L7n9j2o0R7k15j43J53
3114f3L0K02k43J27k88P9J4K22J65L5L8l92M21k34j85J08j8J16j19j32P3J27o6
3137A7M5l3L33k24k57J98k52P9O9j34K45L2j65O2L49l48k73R5O5l56J74J81R9
3160AJ12j05k55L14m4L01l11J41j22J05n40L33l4J01m4lm6O2r4M1L48m04K76J22
3184B55n1j38Q1l01J97k70J53J39J12Qj20k38J98K85l91l44O01m32K06k11L56
3205I5p2j2J14j51O9j19J91q0j34r4m3K14j52J52m2N5q5L11J74l95k03K4L7J96
3229E0k01N7K22%p5j41O6J22K54n23J43M0l1j5J37J03j03j41J76l33J94j08K64
$$ plain form
3067 119 139 180 19 85 -193 274 -91 181 -138 -66 28 -26 43 339 63 -5 -26 191 268 67 -182 -114 -50 -289
3091 -289 -298 81 258 92 -192 58 17 -144 -45 -298 21 199 106 284 139 176 117 105 45 142 -73 -216 -63
3114 -63 -33 169 -74 53 -235 -156 -142 80 245 280 318 -74 347 113 -72 36 18 134 15 -117 -44 83 17
3137 17 62 29 362 138 -119 79 -173 -94 -25 -159 86 118 -47 15 364 16 -257 -162 -97 -453 -279 -98 1
3160 1 113 8 -247 67 23 324 13 154 32 137 -403 -70 -104 -3 -47 -50 -96 -34 -128 -87 261 -143 133 255
3184 255 204 66 147 -154 43 -227 -74 65 177 185 65 -173 25 310 -81 -425 176 -256 -50 -261 95
3205 95 23 11 125 -26 43 -76 115 35 -99 -193 -236 -22 -174 -22 -64 -9 -94 217 391 -4 -207 -183 -146 50
3229 50 -151 -94 128 128 53 -88 -22 100 354 -169 -26 14 -17 -32 105 208 105 -36 140 -193 1 -107 157
3252A57J32m63J04L0k96M41k12k45J95k4K13j01qK0P0j59M51l43j62Q1M8R7l8
3275a2k2m0K77k65J33J10k27J33n4j15j45P5RJ35ql32K40l8J79l6M63m02L6k33
3299a39K39l56L26J14kj01l32J31O3K56R6n61K20J41j41m7o7J82LM5L76m90O2
3322A8n9N3n0K44k6j30j11L1Nk75J99m4j25K23L82p09O86j91j13L33m34j6p1J48
3346c2j93L11Q4k89M05m60K2K81m36K09O5J48lk11K7j20M2Q2K65K42o98N04m16
3369a71J29Q7J7j01JJ01j1M5K03m29P3J34r8N5K01m66n3K55N9j72K83p4P9j01
3393D6l0j24K00m21K10K52j79R0k23J91j23L3R7j48K43M1J8m4N5q1J18k39m40
3416d58N28k85J84l31L22n5M14l51k08L43m66K28k6K23k7o8o6J99l9k2K18k17
$$ plain form
3252 157 289 -174 -70 -40 -336 105 -107 -352 -157 -181 32 -69 -77 -57 13 -146 305 -38 -200 -119 -71 26 -12
3275 -12 -34 -74 203 -62 71 181 -46 87 33 -82 -227 -152 -143 -8 -16 -348 -108 -146 33 -3 460 58 94 -139
3299 -139 100 -256 70 184 182 81 -251 -120 -57 199 295 -266 -46 95 -46 -93 -160 22 25 70 446 -44 18
3322 18 -41 12 -38 206 180 50 -61 -30 -25 -300 -101 -145 -270 -47 335 -374 312 121 8 341 -93 -109 -180 -32
3346 -32 -225 86 170 -119 286 -174 -152 129 -307 -98 -33 115 112 -99 -72 -192 -150 -68 197 439 -259 245 -171
3369 -171 -42 45 62 -39 -38 63 52 97 300 -129 -56 78 -20 35 236 -230 -283 -28 31 -141 142 68 147 46
3393 46 16 -108 92 -329 -119 133 -46 44 -179 12 -111 -78 19 -129 114 155 173 129 184 103 221 -18 -458
3416 -458 70 -215 -31 -362 -40 -95 319 -32 -240 103 -363 -135 -161 62 35 -33 -99 100 61 39 257 40
3438D0J87k39j03J96PJ6k83K72q5l14N11k67l3M1J35m7k86J57K41N5r9l69n2J70
3462a49K92J34m27m3L12k5r8k08o6K74j23j30P54q32O11j67k09N02r3m61L47l82
3484a87L86j07j99K10n7j14O2j35K63p4M34k60l17k59L43k5k03m3L35J0k81O20
3506D02n36M36l48R7J12l02J69M5r1j06M7j07J58r3K45j82K59j31m30N52j56j33
3528i3J12j28K3J74m59J48L10J26q7O1p4l35K94l76L67o9l28K48k9J57j25J13
3550C0j26J00j48k07L44J74l13J85l29PK75J36p6J28j30O3j8k90L36K32n44K82
3572A11KO1k67K79J8q7j0J18l37j27J51N9j23o7M4J69J11J19j69P3J02k61j1J37
3596I5m5Q1r7j50J16p4j38j63M70q8N9m0J55k18P3N9j67R2k56j20L44j79K63L6
$$ plain form
3438 40 227 -12 -115 81 88 104 -179 93 8 -306 205 -62 -95 -54 81 34 -252 -95 146 201 102 -267 -319 -149
3462 -149 143 277 -150 -193 119 94 -4 -212 -278 -4 -127 -257 497 -335 276 109 -100 402 309 -152 195 -187
3484 -187 199 92 -107 103 46 -68 -6 -141 122 48 482 222 -95 -354 -11 -36 -239 -282 53 63 -218 402
3506 402 -134 302 -46 51 163 -139 30 75 -16 -122 -75 -182 -24 -117 128 -54 205 74 -356 196 40 -93
3528 -93 19 -109 -86 88 -371 -223 87 213 126 187 113 -222 72 -304 63 -6 -334 -86 -115 42 -83 30
3550 30 -96 4 -144 -351 -7 167 -146 39 -290 -283 -8 128 52 180 50 113 95 -195 141 373 -171 111
3572 111 113 174 -93 186 204 117 107 225 -112 -239 -88 -29 -152 -219 -175 -6 105 224 55 128 230 -31 -42 95
3596 95 50 131 34 -116 0 -74 -212 -375 95 7 66 26 181 -37 36 95 -72 20 -236 -356 -12 -191 72 108
3620A08P5K24k99R1p9j23K28k12k7J41l30N08o7O9m0k36J73k83j1o4L35p53L09
3643b63K21P6r4NM7K48n78K51j7L17l17Rq8J78J81j00l01P9L43k04J14j80j27
3666b00K85j68K76J56j10l35m3j20K10J06n0o6L64j88k58L34k00n1Q1l18L85p7
3688A3j30Ql88N60L21k48r4m2J68m56L5K7J31M77m26j40J47O9k98L37l76QN8K21
3712a8k07J57k48R5J45K1J15j88K32R4k53q2N17o94J02J05p8K16k2KK58m4k25
3735@p3K3J2J90p6k20J07j81L45j85J88l45J36R8Q9N5r2l59L68N8k18J38K20k46
3759C2n3j91J93K26j07j0L7j64mM4J94n03J40r7j67N38k45J42p4K61l11J62j2
3782C1l32l2J97j84O0K95k18L07k09j95P11n27M13qj77l73J15L6j32R2q6R8J91
$$ plain form
3620 108 183 407 108 199 120 -3 225 13 -14 127 -203 305 238 307 267 31 204 -79 -90 -154 181 -572 -263
3643 -263 -42 34 -60 -55 -8 240 -338 -87 -104 213 -104 -95 -183 -5 176 76 -225 -146 197 -7 107 -73 -200
3666 -200 85 -83 193 349 239 -96 -139 -259 -49 57 7 -59 305 117 -141 193 -7 -58 23 -295 90 13
3688 13 -117 -109 -497 63 384 136 42 0 168 -288 -253 -226 -95 382 -44 -184 -37 32 -266 71 -305 -297 -239 -18
3712 -18 -225 -68 -316 -221 -76 -55 60 -128 104 198 -55 -137 380 -314 -212 -107 -185 31 9 11 269 225 0
3735 0 -73 -50 -38 152 76 -144 -37 -218 127 -58 130 -215 -79 19 108 163 71 -288 80 138 -80 58 278 32
3759 32 -21 -212 -19 207 100 90 127 -37 -41 3 197 -306 -166 -263 -430 108 -137 5 -69 192 -119 43 31
3782 31 -301 -333 -136 -320 -260 35 -183 124 -85 -280 431 -96 317 309 132 -241 -126 -90 -222 -130 -216 -118 73
3805G3J7P8p9k21j04O1L01k95N1J64k33K56l1J28j47K54j39k70j07J00k09K92
3827f0%k41J16P2L99l70J93J49j61M9k80q2N45k95j51j0K84K42k99j17j51M11
3849B43m09K92l46K05r6K9K96l97k38L82j37N7J52J79p9l8l89K17O8j51J58k19
3871b21J01K97j51or8j04K13k81L41k3j39J85l02L3L57k97N9O4K5l5o3J5L3kJ48
3896A49J27m77M3j07r9N12j81J32r3K57m48K62p9k69Q9J08K18l03J59m0J7j38
3918a61J89QL1P9j85J21l10L53j23M8p1k18M03l38K92l50L61j06K80l20K29l50
3940a38M14l29J23k71Q3R4p6N9j72K19j11O3R1l03K17n3l5M72l36K73m51K48r1
3963a0J98l79J45L6J54Jj85J41k30j23O3O5L71l13P2j4l4J13M43j97l92m36N72
$$ plain form
3805 73 90 168 89 -132 -236 -175 126 -169 -118 46 -187 69 38 166 19 273 134 -136 -243 -143 -352 -60
3827 -60 -60 -301 -185 -113 286 -84 109 258 97 146 -134 -216 329 34 -117 -127 157 399 100 -17 -168 243
3849 243 -166 126 -220 -15 -111 -82 214 -183 -421 -39 -176 -119 33 212 133 95 -294 -77 -9 -160 -2 -221
3871 -221 -120 177 26 20 -78 -182 31 -250 91 68 -71 114 -188 -155 202 -95 -36 28 53 18 -45 -30 3 1 149
3896 149 276 -201 -158 -265 -364 148 -33 99 6 263 -185 77 -2 -271 -182 -74 144 -159 0 -40 -23 -161
3918 -161 28 36 67 146 -39 82 -228 125 2 50 -21 -239 164 -174 118 -232 129 23 303 -17 212 -138
3940 -138 276 -53 70 -201 -118 -24 -100 -41 -213 6 -105 -42 49 -254 -37 -90 -125 347 11 284 -167 81 -10
3963 -10 188 -191 -46 -10 144 145 -40 101 -129 -252 -189 -124 247 -66 6 -8 -42 71 514 317 -75 -511 61
3986F1j52M13l21j4nj1l6J40q5P1J6k79L86o0j74J74K08r17P32m7M2O5k35q2P7
4011c3j91J39M00l58P1l2M3r8J53K41n97M52k06K8k05K31J33k04J21k45J69lJ46
4034A55j14r9J66k71p3J79j37R5K60l21K42j21L0L08k56K20L6m50M38k8m51M44
4056B52l86J44J68l59O6O7K8j5j2O1K12l87J15m27O46j9l95M58k29K37l44K73
4078A54l23J62R7M4o7K5J47j18m05R8J89k19L46j43l12K97K01K22m42K16k03l9
4100g3j04K12k00O5K00k33K89k29K15j3q6K44k01j58K99j20p4j17M51k89P2L4
4122A84k26L5o1l8l4K43J55n17K12O5j5J3l3J31l60L29k13j25j89N15M9j07J55
4145A68r3Kj0j31L56k89j67L4J96p6O5J59k37O6J45m18K39O2l4P1J47k15L1J94
$$ plain form
3986 61 -91 322 1 -13 -18 -29 -65 75 -10 61 77 -202 184 124 -50 124 332 -585 147 100 142 207 -28 -110 -33
4011 -33 -224 -85 315 -43 28 -4 39 -59 94 335 -262 190 -16 12 -193 38 171 -33 88 -157 12 9 155
4034 155 41 -58 108 -163 -236 -57 -194 -99 161 -160 82 -39 -9 299 43 263 299 -151 287 259 -192 252
4056 252 -134 10 178 -181 -115 -48 -20 -35 -47 14 226 -161 -46 -473 173 154 -241 217 -12 225 -119 154
4078 154 -169 -7 90 134 67 92 239 121 -284 -186 3 -216 130 -13 -325 -28 173 395 -47 169 -34 -73
4100 -73 -177 35 -165 -100 100 -133 156 -73 142 129 43 287 86 -72 227 107 33 -84 367 78 150 184
4122 184 -42 -7 -68 -106 -140 103 258 -259 -47 18 3 16 -17 114 -246 83 -130 -255 -444 71 120 13 168
4145 168 75 77 67 -64 292 3 -164 -130 66 -10 55 214 -23 43 188 -230 9 71 37 108 255 40 71 265
4169B65j34m8j14J30k29L65P0j85L8r1j49M6J16L9k06q5m6K00p5j65J01K91N0
4192A84k22l8L8rrJ39j67Kj74L46j85J23m38L53K28j07%l23L02k17L88k97N5k2
4216e0J97j03J06k13j55L36k86J72K6r8K60k41n7N9J4j72M54m67r1M62j21K10
4238B42k34m4J61J06l60K30j8o1p9j21K23K80l65J12j4J99l77L76k14m45O35j84
4260D8K2k31n3J81j22K72m55J42N5J89k15L34M2j73k45L18J08j85j21M13k01j57
4282c4N4M3j37j73L07l4J70k01R5m22L05Q9O0jm5J86l56J83j3n6j37J18R0l34
4306b43J89j26J6J92l28K29j19K28J69k66oq1M5K32J42k06j19M9K97l17P6k01
4328a48J80q8L1k3j19L03j04n1K20J28j28O1m30K94K80m67J40Ok44J02N06l32
$$ plain form
4169 265 131 83 -31 99 -130 235 305 120 158 67 -82 -36 80 119 -87 -172 -218 -18 -93 -258 -157 134 184
4192 184 -38 -76 -38 -47 -56 83 -84 -82 -256 90 -95 28 -410 -57 171 64 64 -259 43 -174 214 -83 -28 -50
4216 -50 147 44 150 -63 -218 118 -168 4 30 -68 192 -49 -106 -47 -33 -205 249 -218 -309 153 32 242
4238 242 8 -36 125 231 -129 101 83 22 -57 -178 45 325 -40 72 58 257 -120 256 42 -403 232 48
4260 48 70 -161 -214 -33 -155 117 -338 -196 -141 48 -167 167 209 36 -209 109 217 32 -89 324 123 -34
4282 -34 20 63 -74 -247 60 26 196 -5 90 -332 -27 62 122 121 76 262 -94 89 76 20 -117 1 91 -243
4306 -243 -54 -180 -164 28 -300 -71 -190 38 207 -59 -65 -146 -101 131 273 67 -52 -3 294 -23 53 -148
4328 -148 32 -56 -25 -48 -167 136 32 -19 201 329 201 262 -168 126 406 -61 79 85 -159 -57 449 117
4350A17Q7k83K18l13P9j09K69Q0n4j10J97N3k14q5J17j61K57j98J19l16K88K21
4372B59m83K58K2J79j0l02K06l38N60j2m33j49L35nn03N96o5L9j43K04j47r0J15
4395I3n8K0j42j73K26K53k19J93j25k55K96j55K23q6q9K10k20p5N7l62L72J87
4417A71m7m26N40n02Q0L65k9m25J51j30J76K24k87K10j71j38K8N33m99L89q3m94
4439c64M98k26j65K91J94n87N16j25P2N0p2k00j27K46k46J63J97p7J00j61J09
4460H6J52k24o6L21m19J20j59K13K28j22l3j70j00j34N72k74q8J8l8M15k78L4
4482E4j65J7O00o71K60k04k3L24q4J52j06l12l3J21J92k17Q5j58M57m17M57k77
4504E2n7J35j86QP5J89R5m33k19O28m10J49%L63j6m32j94K32K32k87j99Q3j10
$$ plain form
4350 117 204 -79 139 -174 -95 -204 65 145 91 -19 178 231 17 -68 49 -112 145 -53 66 -250 38 259
4372 259 -224 34 56 235 225 -77 129 -209 351 339 -94 -243 92 87 -416 180 115 154 11 215 68 -22 93
4395 93 35 55 -87 -260 -34 219 0 193 68 -187 109 -46 177 91 2 212 -8 -83 -26 -388 -16 171
4417 171 124 -302 238 -264 -184 181 152 -273 -122 -252 -76 148 -139 71 -100 -238 -210 323 -176 213 130 -364
4439 -364 134 -92 -257 34 228 -359 157 32 104 154 82 -118 -245 1 -245 -82 115 38 138 -23 86
4460 86 238 14 -52 269 -150 -30 -189 24 252 130 97 -73 -173 -307 265 -9 -97 -79 -117 298 20 54
4482 54 -111 -94 506 -165 95 -109 -132 192 108 260 154 -158 -191 -70 122 -95 -10 -168 289 -128 329 52
4504 52 -5 130 -56 -48 27 216 311 -122 -341 287 -123 26 26 389 373 -59 -253 -21 211 -76 -275 -192 -302
4527c02M36j72m1K00l31K24l83N33n2j11k44K6J52j9K57j92J8l0n5PL1R1J91r1
4551A43j74j58K43L1j19M6o6r8K2N75l65J74n6J1n1k02L87l10j78J33K16k96J75
4574H3l54L33K9k43K89r9l5o5Ok98M67q0Qk49K14J92j26o7q3j5Q8R8p7O5Q5m88
4600c22L54r2M06j89k54J63Ok07k5O3J35r0N0k06K37K06l78J47K2k06L23J07l46
4623i6J91J6j53O4j40O7j86K36j09n6J71l3q9n8K51o2O3l6J8K73l93k5K0J75k57
4648a48O8j03J21m9J29l20J64j33M33M7k34L90m40N8j39n1L79k34L44l34j9q2
4670a53O1J25P4j38J39k55J51J01R6k73J89J6j68L60l18LO1j33ql87L53r8J74
4693b8M4j10L2J2J8J12m8N6k44K44l07J49J91m9J53k30j15L47k89k8o2M25j12
$$ plain form
4527 -302 134 -38 -79 121 -210 14 -369 164 112 1 -243 -217 -65 -84 173 -19 -1 -31 -86 -79 -48 43 234 143
4551 143 -31 -189 54 85 -34 12 -54 -152 -130 445 80 254 198 209 158 -44 343 33 -145 -12 204 -92 83
4574 83 -271 62 91 -152 137 38 3 -62 -56 -354 113 33 41 -208 6 198 72 5 -78 -93 -5 93 16 81 166 -322
4600 -322 32 -60 346 157 -97 66 72 -135 -160 -97 38 -52 -2 -208 29 235 -143 4 26 -180 143 250 -96
4623 -96 95 111 -42 22 -118 -51 -237 -1 -110 -166 5 -28 -117 -175 76 14 77 41 59 332 -61 -86 -66 109 -148
4648 -148 -80 -183 -62 -111 18 -302 -138 -271 162 209 -25 365 -75 -17 -156 -207 172 -62 282 -52 -71 -153
4670 -153 -92 33 107 -31 108 -147 4 105 201 -72 117 133 -35 325 7 10 71 -62 -70 -457 -104 -202 -28
4693 -28 16 -94 -62 -50 -32 80 32 88 -156 88 -219 -70 121 72 225 -5 -120 227 -62 -90 -152 273 161
4716A61j22Rj8j89M92k70k64N63k66j60j34K45j0K6L6J91k83J23k45K57j32J06
4738A16r7mj5L8K00k9j91j60J33K06k02l5K23m01K43K76k85J52k32J65O6l03J24
4761a2J90k55J61k68K48K0N3k46J60j41K36R2m49M09l35K36k19J00O0j17P9M46
4783D48p96L16K68j48j80J70j10n0J51%m0%k18K17j59o7K18J73j69Q9k54m4pQ6
4807a06J98q6K01l67J54J25p1j09J36J07j69r8J26o3Q6m44K85k3M7l7o2J74R2
4830I6K39o47N4K51J12k08J4O8j78J74qO8n9P7l1j07k30L41J35k81K42l3J4k14
4854a11K0O3j79o9K9L03K57l79j85M3L22j1j24j7j92J92K73m84J70J02p5J52k41
4877a41Q9j91K04J76Pp9r3j29M2j00J70k3K7J32J02m36L59Mq8K52k60k32L3J66
$$ plain form
4716 161 39 48 30 -159 333 63 -201 362 96 -64 -198 47 37 63 99 290 7 130 -115 142 10 116
4738 116 19 15 0 38 238 209 18 -142 -9 197 -5 -40 183 -218 25 301 16 168 -64 101 167 -136 -12
4761 -12 178 -77 84 -184 64 84 137 -109 51 -90 146 238 -211 198 -137 99 -120 -20 40 -77 2 448
4783 448 -348 -32 236 88 -92 78 -32 -82 69 69 29 29 -189 28 -131 -198 20 193 24 113 -141 -185 -192 -106
4807 -106 92 6 207 -160 -6 119 48 -61 75 182 13 -85 41 -22 64 -380 -95 -118 -71 -108 -170 4 96
4830 96 335 -312 -258 -7 105 -103 -89 -21 -199 -25 -33 35 -24 53 22 -85 -315 26 161 -120 122 89 103 -111
4854 -111 -91 -28 -207 -276 -247 56 313 -66 -251 -208 114 103 -21 -38 -230 -38 235 -249 -79 23 -52 100 -141
4877 -141 -52 -243 -39 137 144 65 -28 -157 -115 -215 -45 -68 -41 91 193 -243 116 120 32 284 24 -208 -175 -9
4901iJ46J50l89M12P8m64J6J95j47q8Q9K45n22J38O7j55M09k24J41k69K84k85
4923a82J45O2o9m2kJ88r4O9K77m87K04J37J1k08J20k85L5K72k64j9J98K90k36
4946A20o8J03l30j5K42J19j71J36J77m78J06l7Q7Q0j89L84j51l87K79j17P1K10
4968A71j95j30K34m67K57L9j13L64L2j38k23l1K20k03L35m0J31k77j36K82j26
4989a4j66L39K4k13m0r3J67j83J40l0J49o6n0n0K00j52L92n40L54R9m9o5L2m1
5013A44j73M0K02P3l83N0P9m94N20k9J39j70K22l58L10m9q6oJ53k31J22j52k28
5036c05K77q3L09j76j17j22j1J28r6K09J75k96L0Q9k27J43l25K61j10K7o3N51
5058B68l28J35k89K51K01j98J77j84J42n7n0k62L50q0r5K56l78R1M9m3N5j54M14
$$ plain form
4901 -9 137 287 -102 310 388 -76 -60 135 -12 -100 -11 234 -288 -150 -83 -238 171 -53 88 -181 103 -182
4923 -182 -37 25 -44 -86 -88 100 6 75 352 -135 69 206 217 9 129 -156 -121 151 -113 -132 66 356 120
4946 120 52 155 -175 -190 52 171 0 136 313 -165 -59 -96 -9 71 -118 266 115 -272 7 -110 -39 171
4968 171 -24 -154 80 -387 -130 -91 -204 160 192 54 -169 -200 20 -183 152 112 243 -34 -170 112 -14
4989 -14 -180 159 183 -30 -70 -163 4 -179 -39 -69 80 14 -36 -86 114 -38 354 -186 168 267 218 153 185 144
5013 144 -29 11 213 286 -97 -47 32 -462 58 29 168 -2 220 -138 172 123 37 31 184 -47 75 -77 -305
5036 -305 -28 -111 198 22 -95 -217 -228 -100 -196 13 188 -108 -78 11 -216 -73 -398 -137 -247 -220 -283 268
5058 268 -60 75 -214 37 238 40 217 33 175 118 68 -194 156 76 -19 237 -141 -50 -1 -44 11 -143 271
5081B71l55L55k55j03M2k1J54j14j35P6K90m53J48j82M42k19k03L08n7J53Q9j59
5103G2k43M09Pn03J16J42M7j08j31J59J29K8K83n28k36L07K51k76j01J19J84l99
5125b72r7N54l5nm9JN2k71j10K31O8R0q1n5m33L78J40j18j40K7RJ47j18P9J99
5150A91l03K25k69P3j44J24L62k46j03j17J85J73l64J03OK64j97J71l29J97M9
5171E1O4o8j06L17n44K03l7L27j49k65K01n2k60N43j42j62K70O4l95m1L03j42
5193b0o3L64m53J35O7K00k21l12J60J50P0r3o7J02L6k70K3K73J7j15KM2n1r7J91
5218G0k6k6k17J03K31j58l52J63J29J66k02M02k27K5j47K2J61k58N11n31J76J1
5240B6k74J49J52k66L00l0j11L82j98l40o9M66K2j81j7j73J62J44j16j37p3J98
$$ plain form
5081 271 -84 271 16 -87 -45 -66 88 -26 -161 -85 205 -248 -100 -282 160 -59 -262 46 -11 142 231 72
5103 72 -171 238 245 -258 -142 0 47 -61 -192 -33 96 124 407 -121 -357 -50 201 -75 -176 -57 127 -272
5125 -272 -369 185 150 145 96 97 149 -122 -232 -1 67 157 76 21 -412 -34 106 -12 -152 -125 -116 31 -87 -8 191
5150 191 -112 113 -156 -83 -227 -103 259 13 -90 -207 -22 151 -213 -110 -104 160 -37 134 -195 2 51
5171 51 115 47 -59 258 -286 -83 -120 207 58 -207 -6 -58 -318 225 83 -79 191 255 -140 -181 122 -20
5193 -20 -83 281 -172 -37 30 230 9 -303 -143 7 77 -16 -83 19 55 -215 -192 81 98 -17 -15 27 -24 -121 70
5218 70 44 18 -199 -96 135 -23 -375 -212 -83 83 -119 283 56 81 -66 -44 117 -141 370 -161 15 26
5240 26 -248 -99 53 -213 87 57 -54 328 130 -210 -279 187 209 28 11 -162 0 144 28 -109 -182 16
5262A6J0L13m58J41J10o7j55JpJ30K0k57K32k7l08J93Q5KL4J61k34L80o6j57l38
5287b46j96N20m29O51l92r3j05L22J29j14k77L37M4j08K6M0R7m3J58l21QJ21j11
5310A8J33j86j61L5O1K4j41L46j11l76K19l3L32m20L63k50L90j98j31J44O8m07
5332b81l8L98j42O9L02k35j45j81K32L01k22k2j47n8J61q2j9J20j35L8J9K6l2
5355g3o5P00m23j64K1j50J70q3k0L4Q4Mj72j38K82j98R9L08Q1j39k83R0J22k33
5379a46L41j69l7n9K05j85j6j01j13K30o8K59J30k59l04J65n4P0M72m71J22J04
5401A16l9j02K17k59K24n9J7l3j83k90N61j57R4j00J37n11N01k51J44M8J17q8
5423A04l20J50L1k21M94k78J59j82k20J91O2O4n3o6j1M07l28k90J29M94n24K50
$$ plain form
5262 16 26 339 -119 22 132 65 -90 -89 -96 34 54 -203 29 2 -306 -113 -28 -26 8 169 -65 315 249 92 -246
5287 -246 -442 78 -351 300 -92 -185 -290 32 161 47 -230 107 151 43 69 109 206 163 321 0 8 129 18
5310 18 151 -35 -196 -161 -100 -76 -217 129 18 -358 -139 -172 160 -260 103 -147 243 45 -86 58 126 -281
5332 -281 -319 79 -63 6 308 73 -72 -253 -21 280 58 36 -111 -169 -8 -90 -109 11 -124 -86 -67 -41 -73
5355 -73 -138 562 139 -25 -4 -154 16 -67 -87 -53 31 35 -137 -275 7 -191 -92 216 297 158 -125 -35 87 -146
5379 -146 195 26 -11 -70 135 -50 -66 -167 -280 -50 -118 141 271 12 -292 -127 -181 -111 361 -110 12 116
5401 116 77 -25 192 -67 157 98 115 82 -101 -391 170 13 107 7 144 -367 134 -117 27 75 192 104
5423 104 -216 -66 -35 -256 238 -40 119 -63 -283 -92 -30 34 -19 -85 -96 311 -17 -307 -178 316 -208 42
5445D2J06l96M52q4j52n4M12n45J1K93j25l2j53J10j8J84j43N1J98k91J82rn4
5468a5L76k04k70k1k4l7N5l06J44L82j66r6L28j74L5k06J65r2K81m12K79jl05
5491b84J55K8J43m5J99m00L45q4k02j26L81j5j73K3r0m7l7R5m2J08k15L12K86
5514C15l58r6N05n62j37O30j6m26M83j71j84k4o2O3N5q3K87n05K81n4k55M23q8
5537B1j53L7L80m49M48l58P9J75r2j59L9K6K0K5k73L94m90M91j89L89l42M7j41
5560g5L23l15%J04Ok32l8K48J26k58L37j10Q8j10n6j48j23K50R1K04j01R6l14
5583gM4K05m87K72j05J77j80J60Qj47L74n98J75k3L54N6n79J2L65O2J72k78j17
5606h5K68M3N2m40K13j83J0M7j49mL17j01K23k18L17j50k71J05K54k64J70k13
$$ plain form
5445 42 148 -248 204 120 -32 -86 326 -219 -208 85 -40 -72 -225 -115 -133 51 -92 -41 157 -134 48 39 -15
5468 -15 361 157 -113 -134 -158 -195 -140 -446 -302 80 -86 -182 146 -28 7 -199 -34 -126 155 -257 22 21 -284
5491 -284 -129 -101 42 -3 196 -204 141 57 -145 -271 110 95 -78 -55 -145 -192 -229 -134 -176 -68 -283 29 315
5514 315 -43 -139 366 -196 -333 297 281 -145 338 167 -17 -41 -103 -40 15 -68 219 -286 -5 -59 -314 109 21
5537 21 -132 -95 285 -164 284 -74 5 180 88 -71 -32 -6 14 39 -234 160 -330 161 -28 361 19 66 -75
5560 -75 248 -67 -67 37 43 -189 -227 21 147 -111 226 116 204 94 38 -110 -233 17 108 312 211 307 -7
5583 -7 37 242 -245 27 -78 99 -81 79 87 -60 314 -284 -109 -132 222 278 -301 -289 76 138 310 32 -85
5606 -85 183 226 278 -162 51 -132 -122 -75 -224 -228 89 -12 211 -7 310 160 -111 -6 248 -16 154 -59
5628e9L6o5r0K5J13J84j74K53l46K20r8J5J23l54L12M8k05JK24n30N94k99K00
5651A28l14j0K15p1k31O40j45j32k53J57N8q8j52K01l3J6k77L1M06j90J43k39
5673a40m8J15o6J46j9J92m82K46L21K83n75k34J44M38j11k89n1K41k77o6K59j17
5695i0K14n12N47k91K47k9J62j31j87K5L9j13j66K74M3k43L19J3l32K53l04N6
5717b06j62K27J39kk32J57K7j07J10L89P1o32J72j01O2L32j90O2j88o6L78k95
5739e5J97l81K15J20l18M59l11Q4K45j80k36j0k96N28M7j43J75R1l42J11J68j74
5761fk35R8k7m4K69J02p2n6R6j86K28j95l04L63k30K15l70L14J39K97k57n8J25
5784B06m19Q4P5k3q9m0L4mJ08O2K24m71L21M7j35J39k7l26L04N1j47J46J5j94
$$ plain form
5628 -59 -23 -88 -178 -153 -40 144 -30 223 -123 97 -1 14 137 -217 95 143 -62 -61 163 -367 227 -72 128
5651 128 -186 -196 19 -52 -283 357 212 80 -173 -16 42 -46 -198 3 -30 -14 -291 -260 146 -44 99 -140
5673 -140 -188 -73 -139 7 -12 180 -302 -56 265 548 -27 -261 -117 321 210 -79 -130 111 -166 -232 27 -90
5695 -90 124 -388 159 -132 115 86 248 117 -70 -45 -6 -119 -285 -11 32 -211 108 121 -211 42 -262 -206
5717 -206 -368 -141 -2 -4 -236 -79 -52 -159 -49 340 411 -221 -49 -150 -88 244 54 116 -72 -138 240 -55
5739 -55 142 -239 -24 96 -222 237 -74 10 255 75 -161 -171 -467 61 108 -35 140 231 -111 0 168 -6
5761 -6 -241 -143 -170 -214 55 157 85 29 125 -61 167 -28 -332 31 -199 16 -354 -40 99 396 139 81 206
5784 206 -213 -129 -54 -77 -166 -206 -172 -176 -68 -6 218 -253 68 115 -20 119 92 -234 70 121 -26 120 135 -59
5808e9K4R2L8r7l4o1j17K81j71o8K81j55j45K03K33m25J05J63J1p5l21N25j36
5831I2k9N4j97L45j58k17o2K70L10m88q9J75k8j82L2J76J11J81k30j82J85ln6
5854A0m5j52L40p48M55K07k3L1P2mj3o0N2m80O19l34K04k17K23R5m62j5L17k79
5878b07L34j81M1J37l7M34k05n40M30M09q00K07O5j04J0L20l51J74l96M30k74
5899a04K65j80J18j15J19Q7k79j73K78O9m0Q8m62M45j97P8P5l41K43J09j18j64
5921a99j7J36k97M42l81K1m0J77M3J77m4n2j47j03L60j35J3R2l04L3K83J15j84
5944a1o4L92k30K76k49k27k67K62K48o8J40J2l25K94n27K78l7M9J31K1k08J98
5966H8j60j61L13j05J0K81j94K07l0l2j49J05n5j06oJ63l4j60n2K73j36n7L6M
$$ plain form
5808 -59 -35 57 95 -2 -36 -97 -214 67 -104 -172 109 -46 -191 12 245 -180 -75 88 99 24 -297 228 92
5831 92 63 117 -80 265 107 -110 -172 98 408 -80 -169 6 -22 -204 -172 4 115 296 66 -116 69 66 10
5854 10 -35 -187 153 -595 -140 67 44 75 147 143 130 70 122 -358 261 -73 131 -86 137 232 -230 -245 72 -207
5878 -207 127 -54 -13 124 87 521 316 -224 206 615 -185 22 87 -17 -7 313 -38 136 -260 170 -104
5899 -104 161 -19 99 -16 103 190 -89 -262 16 85 45 133 -329 116 -81 -3 72 -269 -26 83 -35 -199
5921 -199 -216 -80 -377 65 -316 -295 -335 -158 -115 62 18 -34 -181 -284 76 -59 -46 46 -258 -225 58 173 -11
5944 -11 -75 317 87 363 114 -113 -380 -118 130 62 202 214 -111 183 -344 -66 -103 -54 77 98 -110 88
5966 88 -72 -233 80 -25 -15 266 72 279 249 217 68 173 118 12 6 169 135 -25 -77 196 60 3 39 43
5990D3K64k09K6m86K07ML75l13j64K89J26p7l23O22j34l92PO4OJ72j98j12L48
6013A45m58J7N24k21J58j67M5rk46P7j68J45K31K92J6k86k39L88q8j81j69L47
6035A53q3j94J67j30j03M15j99J5k21K81j91J09L88l54l58K93l83N09k84M3J70
6056D3J27l93J34J23J94j81MM1m03M71m8J53l32j19L97k96R4j9J5O8K4K4m2l41
6080b62K40J34p2k2j17J84j57l4L64j25j99o8j95M22mPQ4k48L8P5j59K96Q3k96
6104c1q0l6O7K79k73K8L53l82K03J70k70L7q7R9k65M23k03j7k5K80l14Lj5o7K27
6129A04j31j83J13k29K96R7K34k74j11K18j87K49k65k49L87m9j01M12o14J07q4
6150b60J01L25r5j14k2j62L6M31l04o8J10J20q1r9K90L4n35K58p1J53j82ML9J78
$$ plain form
5990 43 307 98 124 -362 -155 -151 224 -89 -253 36 162 85 -238 384 250 -142 -135 -71 -65 107 -91 -203 145
6013 145 -313 -296 228 7 165 -2 43 34 -212 -135 -303 -158 73 365 381 95 -144 244 156 -25 -194 153
6035 153 70 -124 43 -87 -190 225 26 41 -180 101 -90 19 407 53 -305 -12 -395 114 -170 -127 43
6056 43 170 -223 -89 34 228 47 51 92 -311 160 112 265 -67 -186 211 -85 9 -10 5 73 97 121 79 -262
6080 -262 -22 112 40 18 -99 85 -72 -106 258 133 -66 -134 -329 93 89 96 180 -68 -30 45 -114 182 265 -31
6104 -31 -111 -147 -80 199 -74 -46 307 -75 128 298 28 65 -22 77 -188 235 32 15 -10 270 -44 -41 -56 -123 104
6129 104 -27 -210 -97 -326 -30 67 301 27 -84 134 -53 196 -69 -318 69 20 -81 331 -283 -176 -260
6150 -260 -159 166 71 -43 -65 -227 -191 240 -64 -132 -22 98 17 -82 208 242 -293 -35 -106 47 -135 -131 -92 86
6174H6m5j42L76l51J42J82k90J19k5j72p9L1LK67j46P0l1J45L10n30M0J27Nj09
6198a7J78j57K4K8K5j59q9K08O7m3j52K53n7j4m50j45N13k79O36m79J58r5R3n3
6222fQ9L5j54L6J70l76K76R5j73k05K69J94j18j26k91L76O4m53L75j89L58l7l57
6245a48J81o6K3j63J28n0L37p78N61M1l1o4j69K61pP5l6j36J40N1l11k4L73j25
6269F3J4j74K47m03K29M90o42o1p3L54K9j08K92m67L9L9K49n7l24M06m12J89K60
6292A79k41J68r1j64M10j44KL01l59j82l3J98k3k29K87qq0l9k09L78P7j76J29
6315A51M5j89j83K02R8n27O72p8l68L8P8K40j36Rj46L7Nl7p8K50k34j68J04K05
6339a0O9N0Op9R3j54j15L13j62o1j4K60k05k7L30k82Oq8J97O1K9k91r4M05k23
$$ plain form
6174 86 41 -101 275 -76 66 248 -42 77 52 -120 -199 -168 -165 102 -44 26 -5 140 450 -80 -40 87 92 -17
6198 -17 161 4 28 56 81 -78 -167 41 108 65 -87 166 109 95 -355 -500 13 -266 370 -109 49 -46 47 -6
6222 -6 83 118 -36 0 170 -206 70 165 -8 -213 56 250 132 6 -285 91 155 -298 77 -112 246 209 -148
6245 -148 33 -33 -10 -173 -45 -95 242 -536 25 66 35 -29 -198 63 56 131 95 -41 99 150 -161 -185 188 63
6269 63 77 -97 150 -253 -24 466 -176 -237 -310 44 73 -35 257 -210 -171 -132 117 60 -264 142 -270 -81 179
6292 179 -62 106 15 -149 261 117 119 420 61 -121 -154 44 21 -208 79 71 -9 -48 -257 121 198 22 151
6315 151 196 7 -176 26 124 -403 269 191 -177 -139 -61 179 43 52 -94 -57 -52 -89 -167 83 -151 -319 -215 -10
6339 -10 59 109 115 36 129 -25 -140 173 11 -50 -64 196 -9 -36 294 12 18 -70 127 188 217 -74 -168 237 14
6364A4o6K54m19J90KO7q3JL2m8m1K04j56K7n6K36j71P6J21j49Q6N1m8J10k29k38
6390b33L61k56J71J6J30j75l0r0p3J9K%j40L6r6L57J35rj59n1r5K44J41o1l22
6415a78K56k00J76r1O2K14l08P7K10l37r9L31o5k00P5L8K64j23p8k88N21o25O40
6438B72j96m79L69P9j66l3L27k53J68mK4j30N7j08K52m52p6M77k99J30J6j1l00
6461c36K38M21m59K73j25j19O9K0ll6J75q8k48K00J00k16J65q4j89M29k47O7l7
6484c0O4J00j41r0K70l29K90O3j9l07K66k35K79Ql38J04j04l6N9rJ22j29J66P1
6508I5k98J28K71j98M4k94K83L63k57j9p7j36j01K30J99k18J46j82l00J95k60
6529c86K82J04L07m24K87l46L15k80P5N12m77R8l54L20K0J60j77J30j16R9Mk24
$$ plain form
6364 14 -52 202 -217 -27 -25 42 -41 -40 -8 -56 -97 107 -49 -22 -78 158 -13 63 184 35 121 172 124 234 5 -233
6390 -233 128 -128 43 59 189 14 -16 -106 -179 -160 -158 -158 -298 -262 -358 -1 134 125 -34 -85 -180 64 205 144 -178
6415 -178 78 -122 54 -37 25 239 -69 8 218 -119 -218 113 48 -152 -77 -39 225 102 24 -264 257 -368 272
6438 272 76 -403 -34 45 -121 -154 173 -80 88 84 108 -22 35 -73 179 -273 -349 128 -171 -41 -25 -36 -336
6461 -336 -98 323 -136 137 12 -107 -38 -18 -21 -57 118 30 -218 -18 82 -134 31 -53 -242 187 -60 7 -30
6484 -30 34 134 -7 -97 173 -156 134 197 178 -129 137 -98 181 189 -149 -45 -149 -185 -126 -135 -13 -142 24 95
6508 95 -203 -75 196 -2 42 -252 31 394 137 118 41 -95 -196 34 233 15 161 -21 -321 -126 -386
6529 -386 -104 0 307 -117 170 -176 139 -141 -66 446 -31 67 -287 33 53 213 36 166 50 149 153 -71
6551g1j82J07J59j40j28L13l0j25J01j2N1k63M37L3l30j30J43j04N6J32O7R0m19
6574b45L42q7j8L41o38O13l02k2j39L62l56L28k18K89j67K2k02K5k4M45j82j59
6596Hj79J48J47l37L71n88O37Pl67J25K55j15j89J07j35J30k03K19j79j6M36m42
6618a60K63j22J92j75J57k79J71k05J67k67L78l06K36K4K9j76j4O3n3J63j33k96
6640c43M98k77j20K42o8o1K03j60K16k29k0P3j19M53n13J24J98kp1k61J97j6L79
6663C23k57l17J14K03K24k44j36K4mq0j21K01R2j9K2j38K97r8l0Q5j72K0M9J24
6687A62j47K36o78N71l9k45K21j98K7R2J57p6j33j6J09p9k98J97K66l03JK47p6
6710bnk2J41j86J95j32J04k28K7L8k80L89o7J36q2K64p7p9k76K31l15N09l92K40
$$ plain form
6551 -71 -253 -146 13 -127 -255 58 28 -97 4 -8 43 -220 217 250 -80 -210 -67 -171 -115 17 84 174 -245
6574 -245 97 10 -8 333 -305 308 6 -16 -155 207 -149 179 -39 250 83 105 -97 -72 -96 349 167 8
6596 8 -171 -23 124 -213 158 -430 207 214 -153 -28 227 112 -77 30 -105 25 -178 41 -138 -154 282 -160
6618 -160 103 -19 173 -2 155 -124 47 -158 9 -258 120 -186 50 74 103 -73 -87 -24 -77 86 -47 -343
6640 -343 155 -122 -242 0 -68 -129 74 -86 130 -99 -119 -46 -165 288 -225 -101 97 95 24 -237 -40 -56 323
6663 323 66 -251 -137 66 290 46 -90 -66 -70 -150 -271 -70 22 3 25 -113 184 86 56 141 -31 -11 38 162
6687 162 15 251 -427 144 105 -140 81 -117 -90 2 159 83 -50 -66 43 -36 -334 -137 129 -174 -173 74 -2
6710 -2 -7 -29 112 -74 121 -11 93 -135 -108 -70 -350 39 -28 108 26 290 213 134 -142 89 -226 283 -109 131
6734A31k1J18N1j42Jj30l9l6P9J3N2j63L12j52j22J48j79M7N4j56M4M9j4J42k03
6759a16J6j75J05K04kJ70q5k90l2J37l6m9J01j11K96k73J15J71j72J67o3K3P2
6782A73ql6p9m9n4j35J92j65k46M91o1K7l2J45j23j53O4M47l10kl20J97L39m13
6806a11r6M53j53r0j09K84m39J77K18j29j9J87k48j7o6J17O2J58k98L15m73Q3
6828a94L98j60J07l15K47r4j86J37M59n93K1J12k47L23k6j03Q6J48R0l31J59j14
6850g6J01j12K50p1k2k30j8J64j39L14m35L27J21j81J1k0p1j7N7j44N0J93LR0
6874A45r3N9j76M12k29m3q8l7J4j62j43l4L21K77j40k35J02n4N9J16P6l34L79
6897A92l8J05o05L12j47M6M4K84l69J70N6j53M8J36R3L2l86q8L62m52K90J19J6
$$ plain form
6734 131 110 228 279 137 138 8 -31 -67 12 25 77 -86 226 74 -48 100 -79 -32 22 -134 -90 -41 -55 87 -116
6759 -116 -100 -275 -170 34 32 202 117 -173 -205 -68 -104 -153 -52 -163 133 -140 -25 146 -26 141 78 101 173
6782 173 165 129 50 1 -53 -188 4 -161 -407 84 23 50 18 163 40 -113 -49 398 88 86 -234 -37 302 -111
6806 -111 -207 246 93 3 -106 178 -261 -84 134 5 -14 173 -75 -92 -158 -41 21 179 -119 196 -277 -194
6828 -194 204 44 151 -164 83 -11 -197 -60 399 -194 -173 -61 -308 15 -11 -114 -28 120 210 -121 38 -76
6850 -76 25 -87 163 92 70 -160 -178 -14 -153 161 -274 53 174 -7 4 -16 -87 -104 -47 -191 -141 52 55 145
6874 145 52 111 -65 347 118 75 -13 -50 -36 -198 -341 -375 -54 223 83 -152 -50 -104 -45 71 147 -187 192
6897 192 154 259 -346 -34 -181 -135 -91 193 -176 -6 50 -103 -55 81 174 206 -180 -268 94 -358 -68 51 67
6920F7p4K36m35J48J21m5n9J60R7j91K95l40j02O2k96N33l79J88j70P69m82k6
6942G7k86J81K15l66P9M09n07K55q3l7N6k04J22l0J01N4pj44M00k89k21J90O0
6965B5mj5m2J19n2j24q0J10k07L38j49K05l38K81l37K37r0K84l67M48L8n12M12
6988A80j73J22j95J12j65R7j03j06kO50l61K24k99J23J3j23j43Q3J59J91l95J51
7010D0j77L13j22j10K24LK8p2o2J61m21M08k30K56m1K0n65K86O9J17o9K87m79
7033a36K48J35m80L49j62r7J45j20j03J33K07k85J53QJ83q9Ml9L5j44j39K56j51
7056h9J26k9N4J23m78J39O1K18k34N11p14K11J23k09O3M4J84j89J05j7k5l0J54
7079A02j19K21m33L13J34m09K60J49l36J48m31Q5R3L10l10K41m21M10k3Q8n3m14
$$ plain form
6920 67 -7 229 -206 -58 63 18 -41 119 216 25 320 -20 -122 -60 -356 177 -202 -14 -184 585 103 77
6942 77 -209 -28 187 -179 -100 309 -198 57 -26 -63 -7 -211 -89 -119 -18 36 29 -115 285 -4 -225 -35 25
6965 25 21 6 -36 83 31 -93 -173 -63 -270 68 -81 124 -214 67 -270 -33 -123 161 -206 242 280 -232 180
6988 180 7 129 -66 46 -119 -22 -125 -231 -233 417 56 280 -19 104 117 -6 -149 -66 93 284 -111 40
7010 40 -137 176 54 -56 168 171 199 127 65 226 -195 213 -17 239 198 218 -347 -61 8 125 56 343 -136
7033 -136 112 247 -233 116 -46 -143 2 -118 -221 -88 119 -166 -13 -5 178 89 93 54 89 -55 -194 62 -89
7056 -89 37 8 62 185 -293 -154 -93 125 -109 402 -312 -101 22 -187 -124 -80 104 -85 20 3 -22 -52 102
7079 102 -17 204 -229 84 218 -191 69 218 -118 30 -401 -316 -223 87 -223 18 -403 7 -16 72 19 -395
7101c95N39q2o0J63j31n5R3n3P5j70jn9Q0o9J46J05q5l2K5k1J29k29M6K06k10
7126d5QPN8L54n2l85J63j50J09J50j97j71P0j13L15k96L24m9k50j40k54R57n90
7149a77K9K66j69J69N3j45j04J33J03O3k21J41k45K17L91n04K39k92N8J34j13
7170B6l71K84j05K64N7l76J59j04K6O2Q0r8Q6J02n0J97j64k34L38J31j47m9j10
7193DO6J5j91m7R1L75l30J09J2r4L15l50m8l1M12j67J48j74k76J78l53K94Qj46
7217a80qM02j82j61k15M19n6K73j91l38L93k06J16j40L1J0j90N36k7l39P0q5l6
7240a04J18j30j26J65J09K11j32J05o3l07O3r7O76k14n14M09K5l50J33L59o33
7261b97L08Om21J41K23J63j12j08J99m10J29M89k30R6j14Lk16l6L16m19J14K02
$$ plain form
7101 -395 144 62 2 165 34 -21 72 19 94 -76 -77 -136 -56 -125 21 126 41 9 34 13 142 -87 -41 165 -45
7126 -45 -37 -30 28 382 330 -55 108 -42 67 217 20 -151 -81 -194 121 -175 149 100 -150 -290 -544 413 -177
7149 -177 -148 118 -51 118 171 26 -78 55 158 221 0 141 -104 113 504 0 239 -53 5 139 26
7170 26 -345 -61 -166 98 155 -221 -62 -166 -140 -78 2 -96 -10 92 42 239 75 -159 179 310 163 114 4
7193 4 70 85 -106 -153 -62 313 -17 92 104 10 325 -25 -73 -104 308 141 289 115 -161 17 -336 -42 -34 -180
7217 -180 -188 214 32 -129 -344 75 19 292 101 -237 156 -50 66 -74 -43 -33 -223 313 286 -53 17 -68 -104
7240 -104 14 -116 -242 -77 32 243 111 216 153 -154 -91 -188 488 274 -240 169 194 -156 -23 336 -297
7261 -297 11 17 -404 -263 -40 123 11 -97 102 -308 -179 310 80 176 62 65 -151 -187 129 -290 -176 26
7283B6J08k74L0o2q0L18l75L20O0J44Q9j63q4j85k13M79k9k26l2j18L83k29J34
7306B1J31j46k79L3L79l18K45k11k48M35k22L63k85M4R2k21K88j41rN4J27j26
7328Fm46J89q6J4M17O1k48J00j20n6L58j96R6m2j50L09j94j44M1J57j89O8J52
7351I7r1j03P3J00l51J08J62J2j61J34j22J12l7L10j02N7Q9m12L0j49K97j04l06
7374c57J73k8L80L3l9Rk88l59P66j99k84K79k03K60j66J72l09J61r2k1J59l44
7396b97PL14j55J13P3j12P7k31N05j85j55L16l69L54k47q5j82J43K66l72K55j23
7418i0j33L2J66NP0J45l12L17j15QK24n05L0K66l26L53j7m5k55J83k05L6rL35
7442A58j89%n6m9M15l52l2Ol3j1M35qr7n6k32M0k87M48M5j74p9K10o8p1r3J18
$$ plain form
7283 26 134 -140 -110 -172 -252 66 -309 11 71 215 304 141 57 -128 -341 138 109 -117 -149 -267 116 -113 21
7306 21 152 6 -273 -240 139 -179 66 -145 -393 42 -180 183 -102 -58 34 -187 101 -40 -49 5 132 6
7328 6 -440 -251 -337 -323 94 155 -93 7 -113 -169 189 -7 89 47 -103 206 12 -132 -91 66 -123 -55 97
7351 97 6 -97 -24 76 -275 -167 -5 7 -154 -20 -142 -30 -67 243 141 198 287 -125 -95 -244 53 -51 -357
7374 -357 -184 -212 168 201 162 171 -117 -476 290 91 -193 86 -117 143 -23 149 -160 1 -91 -112 47 -297
7396 -297 -290 24 -131 -18 55 -57 20 -211 294 109 -46 270 -99 255 8 -77 -259 -116 150 -222 33 -90
7418 -90 -223 -191 -25 -20 50 195 -117 200 85 93 317 -188 -158 108 -218 135 118 73 -182 1 -204 -168 -177 158
7442 158 -31 -31 -87 -136 279 -73 -105 -99 -132 -143 292 284 187 131 -101 -61 -348 100 145 -29 -108 102 34 -37 -130 -12
7468a2N6l87K44o1L76j49q8L2k67L40o5j19L19J1k91L1J11N2j60K85m16J61RK81
7492B93k05J26K5k03k80L01R3k70j04L00j2l18L02J25P5j31l44J22K63k12K54
7513B00o4j96j08L40n45L38Q7j46k2L15P5m71K91k9j7k6q9k15L45n5L3J38l85
7536b06j6J04M01l03Q7r1j90L98k67J68J28o0j7Q1r5j35J64j24R6o21P02m69r
7559b74K18M9P0l04p3J53j49N01n5r3k54N46j21j03k88o6P12l43j14o9K10j71
7581a8L4J34j33k03R2J13K1J55j79n9Q4m2J74J3l21O2o0J39K06l35J84k11J22
7604b8P4Lj78K47m13Q3N7R6m5N9J11p0J87k93O9L68l25R4PL55l28j62J16j96k0
7629a32L6J10L5p5oJ37n07N76j74Q8J1Q0j31k36K29k5K00m58J06J38Q8Mj02k65
$$ plain form
7468 -12 44 -343 -99 -160 216 67 -21 11 -256 84 19 -100 219 230 -61 -30 81 133 -27 258 -158 3 12 293
7492 293 88 214 239 36 -244 57 150 -120 -224 76 64 -254 48 173 248 117 -227 -105 158 -54 200
7513 200 136 -60 -168 172 -373 -35 52 -94 -116 199 274 -197 94 65 48 22 -67 -282 63 8 41 179 -206
7536 -206 -222 -118 283 -20 67 -24 -214 184 -83 85 213 153 136 217 122 -13 151 27 123 -498 204 -265 -274
7559 -274 -56 -7 63 -241 -314 -161 -310 191 136 43 -211 335 214 111 -177 -243 469 126 12 -57 153 -18
7581 -18 16 150 17 -186 -94 19 40 195 16 -43 41 -1 173 186 -135 -73 -133 6 212 -123 61 -150 -28
7604 -28 46 49 -129 118 -295 -212 -155 -59 -104 -45 66 -4 183 -110 -41 327 2 96 103 458 130 -32 84 -112 -132
7629 -132 -96 14 49 -26 -32 105 -402 174 0 88 99 179 48 -188 41 16 216 -242 -136 2 90 94 -8 -273
7653b73L90j75k14L63j66J61j27J09j68l6j15J18K84k42n1R4m9k8J72j52q0L34
7675A49m59j21O47l57K86L3j56O7o6q9K37l03K47R1k75J28J9J18m08R5L27l85
7697a75K86j13Q6M4J04J32n67L51J11l10j20J03Q8k30J82L89l28K9o11O58m3n1
7719A5l94J51J75j4K30L5m86M41k4j9j38K8m2j13K5L0K54n9j16j76M42o2n2j43
7743a2J17k62L00j99o6K58k40k10M48k29j32L01j42j80m7N16k79J01p7K59k61
7764c6q6K16j56o4J78J85k08k30K24NJ53l35M24l14O2k16L35N1J55l01K8J45l07
7787i2L70j99J54k10P9o4j67J15K06l19J33O0r6R5j47J13l66K65L3j48J00R0j63
7810a58L20l68J77j02J68K05l0r3r6P6r1o7j26J01J9OJ74k2k88K97m98L70j14
$$ plain form
7653 -273 117 -58 -272 91 -75 86 -41 68 -100 -136 -251 -133 151 -91 -142 -48 -97 -125 47 -105 -185 149
7675 149 -310 -431 216 -141 145 178 22 89 23 -66 171 -132 115 206 -69 59 78 196 -212 -117 210 -175
7697 -175 111 -2 84 128 232 364 -203 148 259 -51 -171 -68 20 -210 -28 361 33 62 -549 109 66 15
7719 15 -379 -228 -53 -67 163 198 -288 153 129 110 -28 0 -42 -155 -130 -100 154 95 -21 -197 245 183 131 -12
7743 -12 105 -157 143 -56 -122 136 -104 -314 134 -95 -227 74 -68 -248 -295 221 -58 43 -34 225 -36
7764 -36 -122 94 -62 -126 52 237 29 -201 23 28 181 -154 270 -44 18 -198 137 188 343 42 70 215 -92
7787 -92 278 79 233 23 102 38 -129 -14 192 -127 6 66 -30 65 -82 31 -335 -70 -37 -185 -85 5 -158
7810 -158 162 -206 -29 -131 37 242 212 119 23 99 8 -59 -185 -84 -65 -59 115 93 -195 102 -396 -26 -140
7833a40P4o2O6R4k97K04j04N62m30qL01n07K89j7op4K92m12J07N87n85K33lk33
7857f9J16j22K12k68K94k94j51L6M90O3k66j18M9P6j42J18p8K33J38k10m29L16
7879fL67o24J05o5m0K47J15Kk59L7O6r3L57M9m31Q9j50P1P1N9Q6J67m33j01N99
7904B85Q0l82k11L23k59J12J75j06Ro1Oj12L06J68l52j9K0Q9%j30J78Oj11k1J41
7929A34k24K2j75K27K25r0k1j67k83K41j94L68J26l14Q1j20J46r1L54n2m34L60
7951A19o9J17m68K98nl0O1K08r7m57M18k83N47l52j8j12n4j35M28%q8q9J96k21
7975h6J94k7n5m6p7j29J74Ok31M01J27l9k29n8J97j08K91o6Rl73J02P4J55l5r8
8000G3k45L03J45j90K17n25L03l11k64O90j43q1K05o6K8j90K52j20mj05J01R6
$$ plain form
7833 -140 -66 -128 -62 32 -265 -61 -165 397 -33 -41 260 -247 42 25 19 -55 237 -175 -68 519 -66 167 164 -69
7857 -69 47 -75 137 -131 163 -131 -282 -246 244 307 41 -77 -28 48 -94 24 -54 179 317 107 -322 -6
7879 -6 361 -263 -158 -223 -263 -16 99 101 -158 -121 -55 -148 209 258 -173 -84 -234 -163 -92 -33 53 220 -213 -314 285
7904 285 365 -17 -228 95 -164 -52 123 17 26 -35 -29 -141 165 333 -19 -38 -18 71 71 -59 119 125 14 -7 134
7929 134 -90 -68 -243 -16 209 119 98 -69 -352 -111 -305 63 189 -125 -44 -164 -18 -109 245 193 -241 119
7951 119 50 167 -301 -3 -8 -38 23 231 134 -323 95 -188 359 7 -11 -123 -177 -312 116 116 28 -61 135 -86
7975 -86 108 81 26 -20 -97 -226 -52 -46 -277 124 251 212 -17 -75 122 14 305 239 248 -125 -23 51 206 171 73
8000 73 -172 131 276 86 303 -222 81 -230 -494 196 53 -28 177 111 139 -51 201 81 77 -28 73 169
8022A69J91n25Q4J88j46n7L27j96L46l38n1K33M6m7k51j60L43k31L49m47K07k12
8044a78j07M57k45J19j44K98o0j93pj14K26L0m3j1l66M75R7k24N3m1J92l53J22
8067a7Q7l24J77RM14J18k72L4k91J04j0k45M95k55M2n4R6k11N5R1q2J91k00J12
8091F4L76l67r4L0J68j35l00J53K38j41j39L3l23M58Q9l4j17j29J51l15j0K32
8113a12j56L75j13N7j74n3L39l63PK66o4J27J5j7j02o8Q5j28K5K79m46k27M67
8136A9p4K37m9k42R7l2J54l0N1n7j3j63M57j67j27K11k44j20R2PN1J13o5k24J36
8161A8j64k04K90L12n57J84K25J5o0R4k16J45m92L93j5J29K20j15o0j12K2k56
8183b04J90l3Q1L40j96l25L72k07
$$ plain form
8022 169 360 -165 -81 107 -39 -96 231 35 381 43 -8 225 271 224 -27 -187 156 -75 274 -173 34 -178
8044 -178 -285 172 -73 46 -98 200 140 -53 -60 -174 52 82 39 28 -338 137 234 10 63 22 214 -139 -17
8067 -17 70 -254 -77 -68 346 464 192 226 -65 39 29 -216 279 24 66 12 108 -103 -48 43 -39 152 -48 64
8091 64 440 73 -21 9 177 42 -258 -105 133 -8 -147 -114 -437 21 110 76 -41 -170 -19 -334 -344 -112
8113 -112 -268 107 -6 51 -123 -176 163 -200 -193 73 9 136 151 134 32 -36 49 -79 -54 225 -221 -448 19
8136 19 -55 182 133 -109 -12 -44 110 80 131 74 61 -102 355 188 61 272 28 -92 0 7 58 171 106 -118 18
8161 18 -146 -350 -60 252 -305 -121 104 119 59 153 -63 82 -410 -17 -32 97 317 202 142 30 52 -204
8183 -204 -14 -47 34 374 178 -147 225 18
8191A8
$$ Imaginary data points
##PAGE= N=2
##DATA TABLE= (X++(I..I)), XYDATA
0@%%%%%%%%Qj6J6j6J7k5L2m0M8n6O7p6Q9j05J24j43J65j89K15k46K78l12L52l98
32b11M46m99N59o22O93p72Q56r48J048j161J288j425J575j746J941k161K412k704
50a431L048l457L956m580N387o474Q026j0441J4714k4432Q0186Q284j70920J18418
64B0284K6107r1322N9844K3446j06484O3349N6562p9315J2271M2884n4369L7507
76A0764L5337q0475J2365O9759o2684j5830O2801m4007k6464P2879k2533m8140
88c6228N5232O08m9222M7258J2262o6080K7422M2380n1874J214L8041l9843M071
101a4759N2294m1292k5519N2508j2164k5360L3133k4553k4529N5955j3474n1423
113c9183M5817J1996m3595L7444J0874n3994L3747L2693n6434O919L7502l9269
$$ plain form
0 0 0 0 0 0 0 0 0 0 8 -8 8 -8 9 -16 16 -24 24 -32 35 -41 48 -57 67 -76 89 -100 115 -131 147 -165 187 -211
32 -211 235 -264 295 -327 366 -406 450 -498 550 -611 677 -748 827 -919 1022 -1139 1273 -1431
50 -1431 1617 -1840 2116 -2464 2923 -3551 4475 -5966 8748 -15684 64502 72786 -98134 20284
64 20284 46391 -44931 14913 38359 -68125 -4776 51786 -27529 -15258 27626 -26743 10764
76 10764 46101 -34374 -22009 47750 -14934 -30764 32037 -11970 -38434 34445 11912 -36228
88 -36228 19004 19612 -29610 17648 29910 -36170 -8748 33632 -18242 -17028 21013 -18830 -14759
101 -14759 37535 -3757 -29276 23232 11068 -14292 18841 -5712 -30241 25714 12240 -39183
113 -39183 6634 18630 -24965 12479 23353 -30641 3106 35799 -20635 -13716 23786 -15483
125a5483J849L7366l6653q631M3967k0238j7885L4107j3698k1217L0019m915k4917
138a6329J9372N25j8257J9159K110k1493J7814J2074k2592P056J4595k1353K943
151d376J9047k1367r620K5815p348j6090J8833P58j4470J6329K883j9098J1125
164B421P925j8498N479Q308j5720O706J1408j6125N073J4907j5111N91J5467j5625
178b794l794J7107j3315p957J8017q955j1462J9520r49j3613J3152L101j2372
191d314P325K689j1390M998L835q805K995L675n388N253L679p445M806N865q828
206a050n70O559p299k541P082m837m126R066M79o967O508L170o655L075L074p429
222b461J054M049o795K86N678m434K84O227m084L41O025n765k422P148n893n289
$$ plain form
125 -15483 -13634 23732 -12921 -21552 22415 2177 -15708 18399 4701 -16516 13503 8588 -16329
138 -16329 3043 3568 -14689 4470 6580 -14913 2901 14975 -7617 -561 14034 -7319 -4376
151 -4376 14671 -6696 -16316 9499 2151 -13939 4894 5652 -8818 7511 10394 -8704 2421
164 2421 10346 -8152 -2673 5635 -10085 -3379 8029 -8096 -3023 11884 -3227 -2636 12831 -2794
178 -2794 -6588 10519 -2796 -10753 7264 -1691 -13153 6367 5418 -8195 4957 8058 -4314
191 -4314 3011 5700 -5690 -692 3143 -5662 -2667 1008 -4380 873 4552 -2893 1913 7778 -1050
206 -1050 -1620 4939 -2360 -4901 2181 -2656 -6782 2284 2763 -4204 2304 5474 -1181 1894 4968 -2461
222 -2461 -1407 2642 -4153 -3867 1811 -2623 -2339 3888 -196 145 6170 405 -2017 5131 -762 -6051
238f051Q053k985n960R460q99p478R096K773q670M206L942p731J637L054o607
253d160P67M623m236P61M689k738R85M067m830k40N068n783k769N527l569l966
269e804P297j279m568O913J852o488L563L578o520k9M386n358j930N583l400j275
285c479N874j739j947N185j866k604L851k373m986N136p69n917N380K150o034
300d138M876M048o409K269N107o514j132N121m716k434M845k557k078N138j017
315D09j800M761r61k874L011j546l304L392r61m590L997J464m180L230L709m652
331h95Q78N302n173j606M823m205l168M318j248l320M906O64l710M426Q29l558
347g37K666P90m744J767J386m675J524L372l734P06M301k634k89M594l033k733
$$ plain form
238 -6051 2002 -983 -6943 2517 1618 -5860 3236 6009 -2661 1545 5487 -2244 -607 2447 -4160
253 -4160 -3393 1230 -3006 -2245 2444 -294 691 4758 -72 -312 4756 -1027 -3796 1731 -1838 -5804
269 -5804 1493 214 -4354 2559 4411 -2077 1486 5064 -1456 -1485 2901 -2457 -4387 1196 -2204 -3479
285 -3479 2395 656 -1291 3894 2028 -576 3275 902 -4084 1052 283 -5634 -254 1896 -4138
300 -4138 738 4786 -1623 646 5753 -761 -1893 3228 -1488 -3922 923 -1634 -3712 1426 409
315 409 -1391 3370 2409 -465 2546 1000 -2304 1088 127 -4463 -466 998 -3182 48 3757 -895
331 -895 -17 5285 112 -1494 3329 -876 -4044 274 -974 -4294 612 1276 -2434 1992 2821 -737
347 -737 1929 2719 -2025 -258 1128 -3547 -2023 1349 -2385 -1679 2622 -12 -301 4293 1260 -1473
363a473M236k502l610L570m05l751L662J358l018K669K399l138J234J583l558
378g44K02J474l552O02K398k820Q81L846k033l91L855k214k619M104k137m367
394c515L815k43m207L635K012l659K479L119l227L36L054l415j003J737k566n24
410b172K832k250m18L508j206j145L827j201k603K931p18m172K337R69m050K329
426a202K348k776R89L549k518N0J946k071j175J886k155j191K471j927o48L306
442H82l76j401L276o15k792L047O9m268J877J304m093J374K677k706Q93L480k244
459C84p11L359k441j440K707k258k200K638q73j826K838O04k493L347P45k702
475c22J466O62l157R87Q46k799O43K204k286P52K552j342k5K381j467j532J982
$$ plain form
363 -1473 2763 261 -3349 221 -184 -3935 -273 1085 -1933 736 3135 -3 1231 2814 -744
378 -744 -542 932 -2620 -2018 380 -2440 -1559 2287 254 -137 3718 1504 -1115 2989 852 -3515
394 -3515 300 57 -4150 -515 1497 -2162 317 3436 209 545 3599 184 -819 918 -1648 -2172
410 -2172 660 -1590 -2008 1500 294 -851 2976 1775 -828 2103 1385 -2787 -450 519 -3531 -1202
426 -1202 1146 -1630 -641 2908 390 440 2386 315 -860 1026 -1129 -2320 151 -1776 -2424 882
442 882 506 -895 2381 1766 -1026 2021 2090 -2178 -301 1003 -3090 -1716 961 -1745 -852 2628 384
459 384 -327 3032 591 -849 1858 -400 -2600 38 -835 -2661 177 781 -1712 1635 2380 -322
475 -322 1144 1806 -1351 -364 482 -2317 -1674 530 -1756 -1004 1548 206 181 2562 1095 -437 1545
492A545j657j687J744l46k151K123R68j489J798J125j917J212Q76l084O99J198
508I57l147M95J982k071M66L348j425j095K851q92k073K303j136k667J338N51
524b15k106J537J493j422R95J433j583J214R78k823q2J347k135o09K249j153r99
541a881K795m34j005K217J65k196J467l60j981Q82K08j949J246P78r73J025J619
558A623j336O28P89j638j28J148j911j068K119j013j267K664J09j234K157J49
574A791k338J549O64k692N11N21j789N98J407j217M31J714p15o2J826j628q30
591b59J225j150j242J272p18q23J853K22r95R48J087q01N49N0k085O09N84k119
609a793M40J126r14M95J804j024n6J709o61j373O79k50o76r6o3p27J273L05q95
$$ plain form
492 1545 -112 -1799 -55 -401 -2552 -429 539 -950 848 1973 56 1268 2144 -940 -241 957
508 957 -2190 -1695 287 -1784 -1318 2030 605 -490 2361 1469 -604 1699 563 -2104 -766 -215
524 -215 -2321 -784 709 -713 282 1715 132 1346 2324 -499 -581 766 -1369 -1978 271 -882 -1881
541 -1881 914 480 -525 1692 1857 -339 1128 768 -1213 -331 -123 -2072 -826 -48 -1021 4 1623
558 1623 287 915 1704 66 -62 1086 -825 -1893 226 -787 -2054 610 719 -515 1642 1791
574 1791 -547 1002 1666 -1026 -515 6 -1783 -1185 222 -995 -564 1150 435 373 2199 571 -259
591 -259 966 -184 -1426 -154 -872 -1695 158 380 -615 333 1420 619 1168 1218 -867 -258 326 -1793
609 -1793 -1353 -227 -1141 -646 1158 134 78 1787 1126 -247 432 182 -494 -590 -653 -1380 -107 198 -697
628f97J006J721j624K10P86j389l88P55j584r64K398o08r63J878J81n50J105k30
646A043j173Q72K67k151J61O00n20L48K57q30J510R88j021J08J359j273p52R0
664a17q67k71J055m58j229K141O51o13J61N86m35K63n65j325K64N59p02j05O74
683c33k3N24J249j274L5J362m63j726J147m69j135M15j57p14J614P64j250P31
701B97J317q57m43L11q63Q6k03p66l04J213J2l82J012l04R72Q04j839m74R68m20
721A37j002l5Q5j67J329l07n20J038J045j012j47J42o61L6o29m12K99J85k12K40
741e68J135o9Q2J58K15l89L61n14j502K85N75r42Q0J055K1M75R23j005l53J297
761A320l76j698K77R6m42O22j59p99J284P66p01Q03j39m61L64k42j577P67r1q97
$$ plain form
628 -697 309 2030 406 616 1402 13 -375 380 -1204 -2168 230 -378 -1341 537 718 168 1273 1043
646 1043 -130 742 1009 -1142 -981 -381 -901 -553 -296 -1126 384 1372 351 459 1818 545 -207 -117
664 -117 -984 -1255 -200 -658 -1887 254 905 292 453 1039 604 867 302 -1023 -759 -200 -902 -1007 -333
683 -333 -356 168 1417 143 178 1540 1077 -649 498 29 -1106 -691 -848 -1562 52 816 -434 297
701 297 1614 757 314 625 -238 -152 -355 -1121 -1425 -212 -200 -582 430 126 1098 1902 63 -411 557 137
721 137 -865 -900 -815 -982 347 40 -480 558 1603 591 444 586 -75 -39 -668 -1080 -781 -596 -808 -568
741 -568 567 498 580 738 953 564 925 411 -1091 -806 -231 -1173 -1093 -38 -17 458 1381 376 23 1320
761 1320 944 -754 -477 -381 -823 -201 -360 -1159 125 891 190 993 854 393 757 515 -1062 -295 -386 -1283
781a283R88M74p30P25J060o19J48K64q51k76M94p16q22K22J85K61Q88l18j96O38
801E36J221j265o30K7n9l81N9p79J75J500p41k09J352K18j171J224l10p61l01
820b95N44j470M86P21r13L26J299o02J80J210j194L82M73j632l41P02p97r6Q49
839a68o37j1J756j10q22Q75J93j041K19k99j169M18M26o30M41J052l51j9R61n96
859D88J51L13j065k60K02p4n12k30Q38m14R71M39o84O47J41p40k24L53p71o05
879a036R96r88L13R00k20q5J173j17k53P7m56m53O00j219q89J569k81o3J86O00
899C54n54J400k91o72j2N86j228j77L44q52P91L75q01P56J226r24O3K53q4n65
919a2M8m03o35L24K98m65P78J82K00M23P7m66o1n1q15m0K38n69J7N20j0L55N97
$$ plain form
781 -1283 -295 179 -551 174 1234 615 763 1027 176 -100 394 -322 -1144 -922 -737 -476 412 94 -102 536
801 536 1757 492 -138 -111 -170 -551 -492 -1271 -1096 404 -337 -546 806 1024 -147 1077 767 6 -295
820 -295 249 -1221 -735 -14 -927 -601 698 96 276 1486 292 674 1147 -485 -826 -124 -921 -1017 -168
839 -168 -805 -816 940 830 8 883 1076 35 254 -45 -1214 -796 -370 -1000 -559 493 142 123 1084 488
859 488 639 952 -113 -373 -171 -245 -757 -987 -149 -563 408 847 163 810 951 211 -13 340 -431 -1036
879 -1036 -40 -1028 -715 185 -35 -120 1053 936 683 760 304 -149 451 -768 -1657 -88 -369 -432 -246 354
899 354 -200 1200 909 237 225 811 -417 -594 -250 -1102 -311 64 -737 19 1245 321 384 637 553 -12
919 -12 36 -367 -1002 -678 -380 -845 -67 115 315 738 815 349 288 237 -578 -618 -380 -949 -932 -412 -422 -67 530
942E30L60o99M74j53p50L62j64r24N62L01p37P98N98p51Q09K87q75O08N64j902
962g02N35J45q74m7P14k66J14J197n02k3Q40p70l11M20l82n57j40O2o35P28N06
983E2j84M12O24n12N6O0l65l60L2o16O3K85O2J01Q47j71r4M76j42k84M1q8j184
1006h89O13J09r40N23Q74r13Q37R62n70k13N45j396K65O77j033j0M26m39j91J310
1026E47k06l04R46j38j003N90j23j284Q16l33o69Q39N88q11O82N29k20J6M31o83
1046B10l19J45m55l43Q03l78l51J008m15r2Q72ln64L8O48j250N0L81p69j37J020
1067I9o96O52Q86o78J5O40n33o14L04k55n71Q43n72o81J202J84l21L94K91l93
1087A96J14J33j004J14K69o74L45J93n27P0J592r59L09O25j39q40N34p4j074L78
$$ plain form
942 530 890 191 665 512 -238 124 -40 -964 -402 -101 -838 -40 558 -193 616 903 28 636 1200 -702
962 -702 -167 -22 -896 -943 -229 -495 -381 816 314 291 1131 361 50 470 88 -469 -609 -547 -1182 -454 52
983 52 -132 280 904 392 448 508 143 -217 -185 -801 -738 -453 -391 -290 557 386 292 768 626 342 383 295 -889
1006 -889 -276 -167 -1107 -584 290 -623 214 1176 606 393 938 -458 -193 484 -549 -559 -133 -572 -763 547
1026 547 341 37 983 845 -158 432 309 -975 -159 -492 -1161 -322 266 -545 137 666 446 462 893 210
1046 210 -109 36 -419 -762 41 -337 -688 320 -95 -187 685 682 118 156 804 -446 -396 -15 -784 -921 99
1067 99 -597 55 941 263 278 918 385 -229 75 -180 -751 92 -480 -1161 41 225 -96 298 589 196
1087 196 310 443 -561 -447 -178 -852 -507 -314 -841 -771 821 -138 171 796 657 -183 351 277 -797 -419
1107d19O9j80N27J57k09L12L92k65K6K12r90J48M43o47m86R88n76l14J419j48
1127D59k19L82l52j24K67m72p80M42mk71L95J59k03O13L52m35L4O74q09n18P89
1148C79p35n14M79K04l01O43K39k96N11l41O5J31k79n46L36O2j095O65K45k36
1168c84K35J007o39J07N93r32k21K66r8j177R87k78J1P88N3l76M81J97q53O29
1188C96j45n50J59L0m83K05O69n29nR26n02K26M37o95l93M22n49j00K70kn28O79
1210f2K26l44P99K05n36NJ87p08k17L37l77o1M54l75K57P42j02J80K07k18n01
1231I8J40l67r65Q51j61n86Q25J16j8P21l29R6P2K1o40j75O43q58l42R76j84k49
1253c15Q56j32q9L46k45k54j25no94M23p2n11O49K67l80M55M80m85M73L30j098
$$ plain form
1107 -419 -350 -530 -3 154 -55 257 649 384 410 622 -368 -220 223 -424 -910 78 -498 -812 607 459
1127 459 240 622 270 146 413 -59 -839 -397 -401 -672 -277 -118 -321 292 644 209 243 917 108 -410 379
1148 379 -356 -870 -391 -187 -488 155 394 98 609 268 333 464 185 -361 -25 37 -1058 -393 -148 -384
1168 -384 -149 858 219 326 919 -13 -234 32 -66 -1243 -256 -534 -523 265 318 -58 423 620 -233 396
1188 396 251 -299 -140 -110 -593 -388 281 -248 -253 673 171 397 834 139 -254 168 -381 -481 -211 -213 -741 -62
1210 -62 164 -180 619 824 288 293 480 -228 -445 -108 -485 -546 -92 -467 -210 532 430 610 817 599 98
1231 98 238 -129 -1094 -243 -404 -990 -165 -49 -67 654 325 421 493 514 -126 -301 342 -516 -858 118 -66 -315
1253 -315 541 409 320 666 421 167 42 37 -657 -234 -306 -817 -168 99 -281 174 654 169 642 972 -126
1274a26K04K46j093k5M69p7J83N08k79j79J004m64m79K74L07q74K43j0p39Q51
1294e6M05q42J58J316j000K83P45q25m52O32r08l30P30j18k44P57p4m69Q38J27
1314F73n03K38P8j076J58M46j059N15N92m33L90O44m73j71P35n48k85M65p86l84
1334g84R45k76q40P16Q30r33Q26K81r41N59N00j423Q7J101j252K29L28m66N09
1353dJ073r76n00J557q05n97R90n70j282J216k74o88O56P84q23L84O80q27O59
1372F53m7j004J34O88o57p52J139p51K38Q89l04l45J136o37o86P99j61j075M23
1391c20N30q14L61O08p59K22R72l67k18K81o18n7N95r68m7L08N44r99Q13K08k17
1412E8R16m97j86J2K93j205K12L94r54N14Q58m77j4M38k15j47P16l15n77K56M4
$$ plain form
1274 -126 78 324 -769 -794 -325 -402 -219 289 10 -169 835 371 -108 166 473 -401 -158 -168 -907 -56
1294 -56 349 -493 -335 981 -19 264 1009 184 -268 364 -544 -874 -144 -262 -506 251 177 -292 546 673
1314 673 170 408 486 -590 -432 14 -1045 -530 62 -371 19 663 190 19 754 206 -79 386 -400 -784
1334 -784 161 -115 -955 -239 591 -342 484 765 -176 383 883 -540 -453 648 -604 -375 -47 -513 -4
1353 -4 1069 93 -407 1150 345 -252 738 168 -1114 102 -172 -860 -204 580 -243 141 821 -6 653
1372 653 606 -398 -264 424 -233 -985 154 -597 -359 530 226 -119 1017 380 -306 493 332 -743 -320
1391 -320 210 -604 -243 365 -394 -172 800 433 215 496 -122 -179 416 -552 -599 -291 253 -746 67 275 58
1412 58 974 477 291 303 596 -609 -397 -3 -957 -443 415 -62 -76 362 147 0 716 401 -176 80 124
1433A24m54K32J5n45P99J47j07K38K24n91K35k5q17N42j01k34l29L81p4L78L92
1454D30k51J80k8L2n84L57l8m55L03j96J21m55L97J83M12J27n60M88K6o95j09
1475c15J23k43kP88o14K31L22j67J12M34l14k73K71l99n13M02k82J9J92L45k12
1496i5K18K08n22R79p17k67J86k90k85J16K59j59J44N60n56K09N62l34k04K50
1516B62l90k00K28l7n89M11N07k31L81jk67K01K08q78K30m0j21k91N88o32Q49
1537A88M89p55P4O55k15n25L46l04l18P5P0l60K30J53j88O35L3j23J44J39n56
1558a13J60K88o75M0j07J1l61R26m35M09Q38m97o81R32n11n80M05l48k99O20j75
1579a53J09P4N06k33l6oj00K37l15m58j29L46j76m6Q7M99m22P70l11l43L59J53
$$ plain form
1433 124 -330 -98 -83 -628 171 318 211 449 673 82 317 292 -525 17 -84 -318 -647 -266 -340 38 430
1454 430 179 359 331 363 -221 136 98 -357 -54 -250 -129 -584 -187 -4 408 535 -25 463 489 -206 -315
1475 -315 -192 -435 -437 351 -263 -32 290 123 235 669 355 82 353 -46 -559 -157 -439 -420 -228 117 -95
1496 -95 123 331 -191 788 71 -196 -10 -300 -585 -469 -210 -369 -225 335 -221 -12 550 216 12 262
1516 262 -128 -328 -100 -137 -726 -315 192 -39 342 341 74 275 483 -395 -165 -205 -326 -617 -29 -661 188
1537 188 677 -78 -4 651 436 -89 257 -47 -365 -290 -220 -580 -350 -197 -385 250 283 160 304 443 -113
1558 -113 47 335 -340 -300 -407 -396 -757 169 -266 143 981 484 -197 735 224 -356 49 -299 -598 22 -153
1579 -153 -44 30 536 303 267 261 161 398 83 -375 -504 -158 -334 -380 -293 206 -216 554 243 -100 259 412
1601D12p31K90j02m33M02K16l23j47P75o7k43R5r3J00j34q5k46J15k49J13K78
1622e7J30j18J65M30o45N47j97o32L01K54o44j3M76l98K46L79j35M8M30n14L27
1643C80j24k64k93L3M9j72K58J39J2K52J65P7m01L54l70j3J99m19j71K36k64n0
1665c87N18Np9j11K62l70N49n16m00J98K14l22N10j80J01K97j1J30m2k8m8k48
1687D2k77j14J80k32j15K72L26j6l44N29K90m53J19k41k34J81M5O7p24N80j06
1708b25Q8J52n5K96k86O41k84k2k59n72K99J14l29J86J49n4L28N87r92J79M19
1729C60l07k91n6R9n0j48O92j10j91M5Q8J75l92n1L90p48L83M9l50r4K56J25L7
1752h9O27l39K53k08J26m88J25r9k78J03L48k18K73M8J10j87M89j25j27k15j11
$$ plain form
1601 412 -319 -29 -131 -564 -162 54 -269 -416 359 292 49 144 51 151 17 -68 -314 -199 -448 -335 -57
1622 -57 73 -45 120 550 -95 452 255 -377 -76 178 -466 -479 -3 -401 -155 224 89 137 567 53 380
1643 380 256 -8 -301 -268 -219 -391 -133 6 18 270 435 512 111 465 95 82 281 -138 -309 -73 -337 -387
1665 -387 131 136 57 -54 208 -162 387 -129 -529 -331 -117 -439 71 -109 -8 289 278 408 366 338 290 42
1687 42 -235 -349 -169 -401 -516 -244 82 66 -278 251 541 88 207 -34 -268 -87 -42 25 -699 -119 -225
1708 -225 -137 15 -40 256 -30 611 327 305 46 -526 -227 -113 -442 -256 -107 -161 167 754 -238 -59 360
1729 360 53 -238 -294 -195 -245 -393 299 189 -2 43 131 306 -86 -137 253 -495 -112 -63 -413 -507 -251 -126 -89
1752 -89 538 199 452 244 370 -118 7 -92 -370 -267 81 -137 136 184 294 107 596 471 344 129 18
1773A8l19j45J98J48l53K59J35K22K13r8j8m3n2l08J90j74l32L99k91J89K14R1
1795A43K54j52j1j29j34j63p1J23p7k01O0L79J77j24J40l6R9J36l82k92L80k28
1817a09l67L77j24Q8J63J88m27K48J73k72K84k53K5l81K99m66R5J92L24j50L83
1838B90k76L15m8k32r8N9O2p63M58j57n4M05q4Q0J82J87q5j94k9J77k9k29l07
1861c70L29l82%M18M6L74k72O1j83o0J36k30k27l2L07r5J21N9J09l7J26K60l68
1884I0J79k74m6m15J0L83q2L3Q3N8J36R8j4L1j33k67J54j20J62l56j48K74k62
1907d26L57K39l1o7jJ26k90O9KJ17m09qR6J41m40M75M74l49J51N2k17l41j39L07
1931a12j30j20J94J49K44l0k30L54l22J09k1j12j54Pj41k3N0L72m8j76K03K70
$$ plain form
1773 18 -301 -446 -248 -100 -453 -194 -59 163 376 278 260 217 165 -143 47 -127 -459 -60 -351 -162 52 143
1795 143 397 245 234 105 -29 -192 -263 -140 -217 -418 -358 21 198 74 214 178 277 413 31 -261 119 -109
1817 -109 -476 -99 -223 -135 28 216 -211 37 210 -62 222 -31 -6 -387 -88 -554 -459 -267 57 -93 290
1838 290 14 329 281 49 -49 10 72 -691 -233 -390 -444 -39 -123 -43 139 326 241 47 18 195 166 -63 -370
1861 -370 -41 -423 -423 -5 41 415 143 204 21 -39 97 -133 -360 -392 -85 -180 -59 0 109 72 198 458 90
1884 90 269 -5 -51 -466 -456 -73 -155 -122 -39 19 155 253 239 270 137 -130 24 -96 66 -290 -438 -164 -426
1907 -426 -69 170 139 72 71 197 -93 -24 -22 95 -314 -322 -226 -85 -525 -50 424 75 226 278 61 -280 -419 -112
1931 -112 -242 -362 -168 -19 225 195 -35 319 -3 106 85 -27 -181 -174 -315 -338 -288 84 36 -140 63 333
1953C33l20M95k44k19O3j80k55j29N23k50J99O9J21k5r1K19mk34o7k30K23L7j15
1976h1p0Q7q7L04r3n8J05qL0L9k44k96L22k02o0J06M14j95L25P6m50oJ25j21l46
2001c84j25K66k89L50K73j66K26Qj71M89l44j30L8J91l45k66J27Q8k0K89L00m28
2023b3L08p5k4R5j89j89J33j91k36j30J47N18j84l5P9N40k37k80j28J68j44O4
2045a3K9m05Q6L95j80N4K32k00O8K90k32k8O6k16j00l2r8o6L88K32j69n7J41j28
2069E7m4J06j02o81L12K65k78K95K78k74L36L56m23j47J19j74N4l42N1J41L93
2090B98m53j19M70j93K55J14l05J8M9o35P82k63j52j76L49m81J90O50j33l26N12
2111D51l03m75J98j53J18J90p3m5j45L16n7R5J00q6M78n19L0O0n46j52N9J88Q0
$$ plain form
1953 333 13 508 264 45 108 -72 -327 -456 67 -183 16 85 206 181 90 309 305 71 4 -226 -3 34 -81
1976 -81 -151 -64 -151 153 60 2 107 99 129 168 -76 -372 -50 -252 -312 -206 208 13 338 414 -36 -42 83 -38 -384
2001 -384 -509 -243 -532 -182 91 -75 151 159 -12 477 133 3 41 232 -113 -379 -252 -164 -184 105 405 -23
2023 -23 285 210 186 281 92 -97 36 -155 -391 -521 -374 144 -40 -75 4 544 307 27 -101 67 -77 -13
2045 -13 16 -389 -303 92 -88 -34 198 -2 66 356 124 96 162 -54 -154 -186 -284 -350 38 270 101 44 185 57
2069 57 13 119 17 -664 -352 -87 -365 -70 208 -66 270 626 203 56 175 1 55 -287 -236 -95 298
2090 298 -155 -274 196 3 258 372 67 85 134 -501 281 18 -134 -310 39 -442 -252 398 265 -61 451
2111 451 148 -327 -129 -282 -164 26 -47 -92 -237 79 22 117 217 131 609 90 120 180 -366 -518 -459 -271 -191
2134a91J31NJ5J36o6Q6Q8j39m50K36O0J70m71L92l7m0L57J60j79l26J24J45M7
2157B53k44m14j9J32K7jK33O69m65M32p70K16M4L31o90L38k94J24k84j55N32J52
2179A47K5l42M71m63J94r4j85q0O5K02j95Q7M40Q7m71K22J44j16nR2k61l32L84
2202A6k97J42K12J74j75p3J3K96o1j28n3M9j53r0k82M75k4R3r3J11J19J67n26
2225h8J87K01j95k77J22k94L44L7j27K00N3Lj70K64m4m02L62k55m48M29J40j60
2247a18M47j84n22Q03j80l27M13l57j28lK37j04m1Q1J80J20l94L31j0o1j8q6N9
2270A38m92N89m11j97N12k77K04r3J07L35k26j20K59k29l8n0k45o9j53M62m75
2291d69M96J51q3l6j6J42j87j57%P8j51J9n3K55rM12k42p8J21l26K49J60k43j6
$$ plain form
2134 -191 -60 -55 -40 96 30 116 204 65 -385 -149 -89 81 -390 2 -35 -75 282 442 263 -63 61 206 253
2157 253 9 -405 -424 -292 -265 -266 -33 636 171 603 -167 49 93 424 -266 72 -222 -98 -382 -537 -5 147
2179 147 172 -170 301 -162 32 -62 -247 -327 -262 -60 -255 -168 272 359 -112 110 254 138 133 225 -36 -368 16
2202 16 -281 -139 73 247 72 -1 12 308 247 119 66 115 -38 -128 -410 65 41 134 41 152 271 438 -88
2225 -88 99 300 105 -172 -50 -344 0 37 -90 110 163 166 -4 260 216 -186 176 -79 -527 -98 42 -118
2247 -118 329 145 -377 426 246 -81 332 -25 -153 -156 81 -23 -64 17 197 317 -77 254 244 183 165 79 138
2270 138 -354 235 -176 -373 139 -138 66 -27 80 415 189 69 328 99 61 11 -234 -303 -456 6 -469
2291 -469 27 178 95 59 43 185 -2 -159 -159 -81 -232 -213 -266 -11 -20 392 150 72 193 -133 116 276 33 17
2315A7J41l62L9j89J43J08J90J88o8R0l11j05L30l61O8j12L67k19K1J24L48n23
2337g6K14m4K89o12J19Kj65q4J18K23k46K63q0o7N9K30m59J88J07k40N4l9J27
2360a19j92RJ81oK29J92k25o7J97j1k33m4j40K38l00M11m0N2J53J9o2m1Q2m48
2384a65L94q3k76Ol39O8M41q8J62K01m5k33k1R6l65J88J37m21Jl9L85M3j31K04
2408A20K82m92MoJ23j64J64j92q6K7L87k27J46J23k6k87O2K36k50j95J77r8j18
2431b90L57n7J90p1o0O0j78J23J84j70j13Q1k43o3J93J56l13K07Q5P8k6N4On70
2455c80M98k97j01Q3j50k9J16K17n2j92L95L59m51k09K33j15j89M32m82K42l91
2476d63M68k33L12J05K03k50l05p5K05l65L52j71P9q7L35Q4K21m15k48J43J09
$$ plain form
2315 17 158 -204 -165 -354 -211 -103 87 275 207 297 -14 -119 211 -150 -82 -194 173 -46 -25 99 447 -76
2337 -76 138 94 383 -229 -110 -108 -273 -357 -239 -16 -262 1 -79 -146 -87 143 -316 -128 -21 -261 -207 -246 -119
2360 -119 -311 -302 -121 -127 102 294 69 2 199 188 -45 -89 -229 9 -291 120 80 132 285 304 242 201 283 -165
2384 -165 229 146 -130 -124 -463 -395 46 -42 120 321 276 43 22 118 -247 -59 78 -343 -342 -381 4 47 -84 120
2408 120 402 -90 -86 -92 31 -133 31 -161 -247 -220 167 -60 86 209 183 -104 -42 194 -56 -251 -74 -172 -290
2431 -290 67 10 200 129 69 129 -49 74 258 88 -25 56 -187 -250 -57 99 -214 -7 78 156 130 184 190 -380
2455 -380 118 -179 -280 -197 -347 -376 -260 -43 -95 -287 108 467 16 -193 40 -75 -264 168 -314 -72 -463
2476 -463 5 -228 84 189 392 142 -163 -238 -33 -398 -46 -217 -138 -225 110 194 415 0 -248 -105 4
2497DJ80O2l11j30J41k73N78l91J41Q9l6l19M55j7q3j80J44n58J55J05K21o8%
2520i1K31j27J56k53L52l31J1j69L88k84j03K87Kj76K41jPK0J00j95JJ93l47K7
2544f1j25K3N00n03L33j77M59j52k17J22j67p5kR8Q6m9j18P6N0r7QL19m74K98
2568A55O0j15l47K57k52L96l28j63K03J94M34l50r9J59j6j98j11K66j63j18K90
2589A54R2l46L11jJ46j89j09k58L70j39k52K59k32J33K11k58Q1J19J2L13m00J67
2611A84j05P4k67n7k98N8R3M12j73K69r3j5K5L90n42j51K38n55N68J18k17k94
2633c38M53k06L92l22j56k7L07J34l41lj8m3J04K26J07j79%K30k56K71k31l1m04
2656c31J98J67j95L5J8K83J05k20P7j72K5k06J39Mj10l9J47k28R4M00rp3k54L48
$$ plain form
2497 4 184 246 -65 -195 -54 -327 251 -140 1 90 54 -265 190 173 90 -90 54 -504 -349 -244 -23 -91 -91
2520 -91 140 13 169 -84 268 -63 -52 -221 167 -117 -220 67 69 -107 134 133 140 160 260 65 66 259 -88 -61
2544 -61 -186 -163 337 -166 167 -10 449 297 80 202 35 -40 -42 56 142 93 -25 51 101 4 12 331 -143 155
2568 155 215 100 -247 10 -242 154 -174 -337 -134 60 494 144 45 204 188 -10 -121 145 -18 -136 154
2589 154 246 -100 211 210 356 167 58 -200 170 31 -221 38 -194 -61 150 -108 -27 92 104 417 17 184
2611 184 79 153 -114 -171 -469 -411 -318 94 -79 190 97 82 107 497 -45 -196 42 -513 55 173 -44 -338
2633 -338 115 -91 301 -21 -177 -204 103 237 -104 -107 -125 -168 -64 162 269 90 90 320 64 335 104 73 -331
2656 -331 -133 34 -161 -126 -108 175 280 60 137 -35 -10 -216 -77 -73 -183 -222 -75 -303 -209 191 182 109 -145 203
2680B03l95N35j04l43j59K20j3n8L4Q5o3l51P47j01l73J77k23j13K52J72l46m8
2702b65O4K23j0L07l04l0r5J8M9J49m94q2O07k31Q3k84L39n2N01j61M8l38M67
2725E09q94L20r6j41J52L95l35R8L13o13L92k05L2J54p2kJ5k43J28k01n0L66k
2748B0j32K67k54J62N3J82m39L04k21j95L4Q3K41RK47l51m3K58J25k23J35l39
2770g7j20K21k7M53n29J35P1n5j7R9k13K03j25k9j74q2K47l7J79p6L1j26K14J35
2794C01k21j67n8P5P1K60k60j15nJ99P2k34K08r4j45L94j08j94j09Q5j41L55k30
2817f1k47N38j02l16K29M0n0K10n92J81J50p3J05J32j06K88l12J11K44k33k99
2838a63L7J37j75r8j02K60k30M53J07k88J38l0J22J50l17j59N5J0k12K09r4L40
$$ plain form
2680 203 -192 343 239 -104 -263 -43 -56 -114 -80 5 -58 -409 338 237 -136 41 -182 -295 -43 129 -217 -265
2702 -265 -201 22 12 319 15 -15 -110 -92 -43 106 -388 -470 137 -94 -11 -295 44 -8 493 332 380 42 509
2725 509 -385 -65 -161 -302 -150 245 -90 8 321 -292 100 -105 -73 81 9 7 22 -221 -93 -294 -344 22 20
2748 20 -112 155 -99 63 116 298 -141 163 -58 -253 -219 -136 105 114 361 10 -33 225 350 127 262 -77
2770 -77 -197 24 -3 450 -79 56 127 72 55 154 -59 144 19 -10 -184 -266 -19 -56 123 47 78 -48 166 301
2794 301 80 -87 -145 -70 1 261 1 -114 -119 80 152 -82 126 32 -113 281 173 -21 -130 -45 -186 169 -61
2817 -61 -308 230 128 -188 41 81 31 241 -351 -170 -20 -93 12 144 38 326 14 125 369 136 -163
2838 -163 -126 11 -164 -262 -364 -104 -334 119 226 -62 76 46 168 318 1 -158 -103 -93 -305 -96 -190 150
2860A50p4k78L21o4n2J8J46j94O8M29o91K50N8k02K37j98L91n2k51J52j58o4L85
2883C27n68J70p3M4J57k22P0K3L5K23k2Q5l06K70l97J00k3Q2j04J85k5p2K19j97
2907a9j19L61j84p3K2OK8nk58qK97j20l4j26O61m28n7N20n82k0j04N46k10k05
2931a11K97m23N9J01K12k0j45MN4k32j39L69L7K08j30n5K11k03j82P7k28K14L45
2954C20r0k81q6Q7K19n4j11n6J58j57K14J00k27k91L67m91L17P3J07l58K14J21
2976I5j76K89j28k06L78m16j02O07l62l7r4M0O6Q4P2j79P9MO6k11K05k87L41l9
3000H9l38J91K92N2l9l84K03K54n83K89J9O0k28j9J26J73j68M9J2k08Q0R7P2m0
3024E1j05J18l05K75j81K97q9l07K22K17P8m37K91l34R5j75J27j87J59L9r4M01
$$ plain form
2860 150 76 -202 119 55 3 21 167 -27 41 470 -221 29 87 -115 122 -76 315 263 12 164 6 -58 327
2883 327 -241 -71 -144 -100 57 -165 -95 -72 -37 186 164 249 -57 213 -184 -84 -107 -25 -129 56 31 -41 178 -19
2907 -19 -138 223 39 -34 -12 -6 22 17 -241 -249 48 -72 -106 -232 429 1 -56 464 -118 -138 -242 304 94 -111
2931 -111 186 -237 -178 -77 135 115 -30 -26 28 -204 -343 26 63 271 141 86 297 94 -88 -11 -239 -25 320
2954 320 230 -51 -137 -50 169 115 4 -52 106 -51 163 263 36 -255 112 -379 -62 11 118 -240 -26 95
2976 95 -81 208 80 -126 252 -164 -266 341 -21 -58 -152 -112 -46 38 110 -69 10 14 80 -131 74 -213 128 89
3000 89 -249 -58 234 286 247 -137 66 320 -263 26 45 105 -123 -142 -16 157 -11 38 50 -158 -78 19 91 51
3024 51 -54 64 -241 34 -147 150 61 -246 -24 193 271 -166 125 -209 -114 -289 -162 -349 -190 -151 -245 156
3046A56k65L9M24l52KP7J42n24L93k38J58j98L11Q4q9k69J95L7r5J00m58M00k34
3069b04J65k91M78k96K49P0K24m21j01K75K22k13l63J0K27Q9k08Q1r9M21q2r0
3091A43M7j08p0J28n3j51j82M77l83Q1k0K82m20K18J02k86K88j8n5J27k93K7M7
3114g2mJ28J1N2J38l89J13K06J31l67j95J53j94J58JM41o16J98K17j96pjK67l52
3138a79K37N2k98L4M54m80R2L5j49M10j69L70k09k70K80l60k6j51L37l01J76J85
3160G0K7Q4k47K33P4n4K17k00k50k6k49k2J34Q0L0L26P1qk64q8j82L22R7m68J22
3185a71L81l18K02k78K30M24n53J22N3J47l11J20j82K10j96J68RL3R2j88n7J58
3207I5k56J64K11j57r7j02p1R6R0J20KJ11P4n16K78K11l74L01k28L08j78k06k7
$$ plain form
3046 156 -109 -70 354 2 4 81 223 -301 92 -146 12 -186 125 209 120 -149 46 83 -12 88 -370 30 -204
3069 -204 -39 -330 148 -148 101 171 395 -26 -127 148 370 157 -206 -196 31 120 -88 -7 -106 315 233 143
3091 143 190 82 12 140 87 -64 -246 231 -152 -71 -91 191 -229 -11 91 -195 93 75 20 147 -146 -119 -72
3114 -72 -76 52 63 115 253 -136 -23 183 314 -53 -248 -95 -289 -131 -130 311 -305 -107 110 -86 -93 -94 173 -179
3138 -179 58 110 -188 -154 300 -180 -88 -53 -202 208 39 409 200 -70 210 -150 -176 -327 10 -291 -115 70
3160 70 97 181 -66 167 241 187 404 204 -46 -72 -321 -343 -209 -129 -99 227 298 290 26 -62 -244 78 175 -293 -171
3185 -171 210 -108 94 -184 46 470 -83 39 92 239 -72 48 -134 76 -120 48 57 90 182 -6 -63 95
3207 95 -161 3 214 57 -40 -142 -213 -117 -27 93 95 206 280 -236 42 253 -121 180 -48 260 82 -124 -151
3230a51n3K56K23k49M8k95L31k22M49n58J01o2J07j62M15J96m08K60k44L3j5L28
3252C28l37n3Q8M2j30k34J99J40k8L26k00J9k40k6L10o96K80K29J07j61Q7n8M
3275dJ67K64k85j47j95M68k30R6p4pJ00l74N1J30K40k45O5O9K0Jk76J12L8L5M1
3300F0P4N5m6o3M8o9p3L48l89k87J9L68KPj91P3K97l37kJ08R8m9J02l29k1K61
3326F4k73K07j86P7K61k1k15K36OJ07j73N3j86k6R2k76L95K8j15jj24n3K25Lq4
3351B1J43j04k65p4K3J59L4m2L04Pk60J19p5K72l61J44L1o9j66j05O71l38o2o5
3375e8k1J57k24K2K76j95J03j10J41j07k7q4L27k09k17M14p7p4M3J33j19o1R4
3398A27k30K95l40M67k00j63K67j74K9J46k3k95J49k59J07K23j50m8j32L45l04
$$ plain form
3230 -151 -204 52 275 26 74 -221 110 -112 337 -221 -120 -182 -75 -237 178 374 -34 226 -18 15 0 328
3252 328 -9 -62 26 68 -62 -296 -97 43 15 341 141 160 -80 -106 204 -492 -212 17 124 -37 50 -8 -4
3275 -4 163 427 142 -5 -200 268 38 134 60 53 153 -221 -170 -40 200 -45 20 89 109 110 -166 -54 -16 19 60
3300 60 134 189 143 80 128 59 -14 334 -55 -342 -323 45 47 54 -137 -64 233 -104 -106 2 100 51 153 -176 -197 64
3326 64 -209 -2 -188 -111 150 129 -86 150 156 263 90 143 -43 -69 23 -253 142 170 55 54 -70 -123 102 105 21
3351 21 164 60 -205 -279 -256 -97 -63 -105 199 206 -54 65 -10 262 -99 45 76 7 -159 -264 407 69 7 -58
3375 -58 -79 78 -146 -124 152 -43 60 -50 91 -16 -43 -127 200 -9 -226 188 111 37 80 213 94 33 127
3398 127 -103 192 -148 319 119 -44 223 49 78 224 201 -94 55 -204 -97 126 -24 -72 -204 141 -163
3419a63R7K42j64Rp5J34n1j61p0K00K76o54O27L7l51k4J63M2j24j27j99N39j70
3442C3m7k8P0k54M58q5p6J2m6l37K96K11n25J19K87j94J81j33J47R8J1P0n18J65
3466h5K19j04J38l52rL29j56J54j46J61k48J61m47L2J87K08P7O4l04J08K4j28
3488a17P2J10L20k34m42L60J33r3k5l57J37l34R91n20J94M2p7N8r4p9QM4j97l33
3512d33L09L34k12K70l25J86J64j14k63J9J69L4k46J08O7j69J28k40J05L15j05
3533A01l6j06k03M39j38j17J43k17n6K06R8l53N54k81M03m76K17j78K8J11j22
3554A7q7N3nK02k91M17m89M81k65K01k7l19l2O5k54J90n6K74q6j46K56m03N17
3577B13l71Q7J54J83j90k43J28O7N0k19j7K85j68L85l67J43k10M5j10P8J12J47
$$ plain form
3419 -163 -66 176 12 21 -54 80 29 -132 -202 -2 274 -380 247 284 -67 -91 72 114 -10 -137 -336 203 33
3442 33 -14 -42 28 -226 232 147 71 83 37 -300 -4 207 -318 -199 88 -106 75 -58 89 187 198 268 -250 -85
3466 -85 134 30 168 -184 -193 136 -20 134 -12 149 -99 62 -385 -353 -166 42 119 183 -121 -13 11 -117
3488 -117 -45 65 385 151 -291 69 202 109 84 -273 -136 -470 521 1 195 237 160 218 124 45 53 97 -100 -433
3512 -433 -124 210 -2 268 -57 129 293 179 -84 -65 104 138 -108 0 67 -102 26 -214 -109 206 101
3533 101 65 -41 -244 195 57 -60 83 -134 -190 16 114 -239 315 34 437 -39 178 0 28 139 17
3554 17 -70 -17 -22 180 -111 306 -183 298 33 234 207 -112 -144 -79 -333 -143 -199 75 -11 -157 99 -304 213
3577 213 -158 -71 83 266 76 -167 -39 28 78 -141 -158 127 -41 344 -23 120 -90 -45 -155 -77 35 182
3599A82L63o86K60k22O7k01J15l6ML76j36j33jP9k59K95O3N5j63k8k06K75j82
3622a19j24L13k57P7J69k77L42p5J82j64l5j9l09J08j65L48J04N3j69J06n41P79
3644C27k73J79j22K0n1k39PR3L34k82j68K09j30P0K39l45pj31J50J17m3R4l61
3667c13M34L8l48P2K71k26J05J27l83M1K82k34O5J70l44J22o1K66J18k36Q8Q5
3689A39j44lL66k88p1K1j79R7l9P6K40n8O5k62K86j79l4j79J87k41N0L08N8k40
3713b4j38j69L64L8n9P8J52j55p4j23j52R1J90j92J85K20j52j67j46K47l12J70
3735a28j5R8j95K65j06J5j96O41j18K8k82l41M57l73J81o6j73L28k29n6J71o7
3757a61M22k83m7m1K0r5J49j32l8K15j90j99L91k04J87J45J07r7j1j48J46n6q9
$$ plain form
3599 182 545 -141 119 -103 -36 -237 -122 -158 -154 222 86 -47 -48 31 -228 67 130 185 22 -6 -212 63 -119
3622 -119 -243 70 -187 -110 59 -218 124 49 231 67 32 13 -296 -188 -353 -5 99 152 -17 89 -452 327
3644 327 54 233 111 131 80 -159 -152 -59 275 -7 -175 34 -96 -26 213 -132 -139 -270 -120 -3 -46 48 -313
3667 -313 121 159 -189 -117 154 -72 33 160 -223 -182 100 -134 -69 101 -243 -121 -182 84 202 -34 54 139
3689 139 -5 -8 358 70 -1 20 -159 -62 -101 -25 215 157 222 -40 246 67 33 -146 41 -200 -150 158 216 -24
3713 -24 -162 -331 33 71 12 90 242 87 13 -110 -262 -171 19 -173 12 232 80 -87 -233 14 -298 -128
3735 -128 -143 -45 -240 25 -81 -66 -262 379 261 289 7 -334 123 -250 -69 -135 -308 20 -209 -265 -94 -161
3757 -161 261 -22 -69 -110 -90 -185 -36 -168 -206 9 -181 -380 11 -193 -6 139 246 149 138 -10 136 80 -9
3780iMp6l13K41NJ21J59n37L29K28R3j36k01J07j96J92J62l37o8J44J75j3p7l1
3804c4j58K36J11l47Pj36M95j79l2o6J88n2j70J45k5J29O9k71J24N2j72o9J60
$$ plain form
3780 -9 -5 -81 -394 -153 -148 -27 132 -405 -76 152 245 109 -92 15 -181 11 173 -164 -232 -88 87 74 -3 -34
3804 -34 -192 44 155 -192 -185 -321 174 -5 -37 -103 85 33 -137 8 -17 112 181 -90 34 86 -86 -155 5
$$ [...]
8191A27
##END NTUPLES=NMR FID
##END=
