##TITLE=1H_DE-70H_oil
 D2O
 8 sc, 
 2.11.2024
##JCAMPDX= 6.0         $$ Bruker NMR JCAMP-DX V2.0
##DATA TYPE= NMR FID
##DATA CLASS= NTUPLES
##ORIGIN= UXNMR, Bruker Analytische Messtechnik GmbH
##OWNER= root
$$ XWIN-NMR		Version 3.5
$$ Sat Nov  2 14:49:21 2024 Russian Standard Time (UT+4h)  she@DPX200
##.OBSERVE FREQUENCY= 200.1318
##.OBSERVE NUCLEUS= ^1H
##.DELAY= (6, 6)
##.ACQUISITION MODE= SIMULTANEOUS
##.ACQUISITION SCHEME= undefined
##.AVERAGES= 8
##.DIGITISER RES= 18
##SPECTROMETER/DATA SYSTEM= spect
##.PULSE SEQUENCE= zg30
##.SOLVENT NAME= D2O
##.SHIFT REFERENCE= (INTERNAL, D2O, 0, 15.7039)
##AUDIT TRAIL= $$ (NUMBER, WHEN, WHO, WHERE, WHAT)
$$ ##TITLE= Audit trail, XWIN-NMR		Version 3.5
$$ ##JCAMPDX= 5.01
$$ ##ORIGIN= Bruker BioSpin GmbH
$$ ##OWNER= she
$$ F:/spectra/data/she/nmr/H-F/1/audita.txt
$$ ##AUDIT TRAIL=  $$ (NUMBER, WHEN, WHO, WHERE, WHAT)
(   1,<2024-11-02 14:48:23.45 +0400>,<she>,<DPX200>,
      <created by zg, POWCHK disabled, PULCHK disabled
       configuration hash MD5:
       00 E9 B6 7A A2 85 ED C7 34 08 36 98 17 FE 4E 26
       data hash MD5: 16K
       BC AD F7 05 0E FF DE D9 A2 2A 1D 06 7C EE 2C 67>)
$$ ##END=
$$ 
$$ hash MD5
$$ 47 27 EC DA A3 E8 47 79 BF 39 E2 F1 89 07 2A 46
##$RELAX= 
##$RELAX= 
##$RELAX= 
##$RELAX= 
##$RELAX= 
##$RELAX= 
$$ Bruker specific parameters
$$ --------------------------
##$DU= <F:/spectra>
##$EXPNO= 1
##$NAME= <H-F>
##$PROCNO= 1
##$TYPE= <nmr>
##$USER= <she>
##$AMP= (0..31)
100 100 100 100 100 100 100 100 100 100 100 100 100 100 100 100 100 100 
100 100 100 100 100 100 100 100 100 100 100 100 100 100 
##$AQSEQ= 0
##$AQ_mod= 1
##$AUNM= <au_zg>
##$AUTOPOS= <>
##$BF1= 200.13
##$BF2= 200.13
##$BF3= 200.13
##$BF4= 200.13
##$BF5= 200.13
##$BF6= 200.13
##$BF7= 200.13
##$BF8= 200.13
##$BYTORDA= 1
##$CFDGTYP= 0
##$CFRGTYP= 5
##$CHEMSTR= <none>
##$CNST= (0..31)
1 1 145 1 1 1 1 1 1 1 1 1 1 1 1 1 1 1 1 1 1 1 1 1 1 1 1 1 1 1 1 1 
##$CPDPRG= <>
##$CPDPRG1= <>
##$CPDPRG2= <>
##$CPDPRG3= <>
##$CPDPRG4= <mlev>
##$CPDPRG5= <mlev>
##$CPDPRG6= <mlev>
##$CPDPRG7= <mlev>
##$CPDPRG8= <mlev>
##$CPDPRGB= <>
##$CPDPRGT= <>
##$D= (0..31)
0 1.2 0 0 0 0 0 0 0 0.06 0 0.03 0 0 0 0 0.0002 0 0 0 0 0 0 0 0 0 0 0 0 
0 0 0 
##$DATE= 1730544502
##$DBL= (0..7)
120 120 120 120 120 120 120 120 
##$DBP= (0..7)
150 150 150 150 150 150 150 150 
##$DBP07= 0
##$DBPNAM0= <>
##$DBPNAM1= <>
##$DBPNAM2= <>
##$DBPNAM3= <>
##$DBPNAM4= <>
##$DBPNAM5= <>
##$DBPNAM6= <>
##$DBPNAM7= <>
##$DBPOAL= (0..7)
0.5 0.5 0.5 0.5 0.5 0.5 0.5 0.5 
##$DBPOFFS= (0..7)
0 0 0 0 0 0 0 0 
##$DE= 6
##$DECBNUC= <off>
##$DECIM= 24
##$DECNUC= <off>
##$DECSTAT= 4
##$DIGMOD= 1
##$DIGTYP= 9
##$DL= (0..7)
0 120 120 120 120 120 120 120 
##$DP= (0..7)
150 150 150 150 150 150 150 150 
##$DP07= 0
##$DPNAME0= <>
##$DPNAME1= <>
##$DPNAME2= <>
##$DPNAME3= <>
##$DPNAME4= <>
##$DPNAME5= <>
##$DPNAME6= <>
##$DPNAME7= <>
##$DPOAL= (0..7)
0.5 0.5 0.5 0.5 0.5 0.5 0.5 0.5 
##$DPOFFS= (0..7)
0 0 0 0 0 0 0 0 
##$DQDMODE= 0
##$DR= 18
##$DS= 0
##$DSLIST= <SSSSSSSSSSSSSSS>
##$DSPFIRM= 0
$$ [...]
##$SUBNAM2= <"">
##$SUBNAM3= <"">
##$SUBNAM4= <"">
##$SUBNAM5= <"">
##$SUBNAM6= <"">
##$SUBNAM7= <"">
##$SUBNAM8= <"">
##$SUBNAM9= <"">
##$SW= 24.0689170037331
##$SWIBOX= (0..15)
0 0 2 0 0 0 0 0 0 0 0 0 0 0 0 0 
##$SW_h= 4816.95568400771
##$TD= 16384
##$TD0= 1
##$TE= 0
##$TE2= 300
##$TE3= 300
##$TEG= 300
##$TL= (0..7)
0 120 120 120 120 120 120 120 
##$TP= (0..7)
150 150 150 150 150 150 150 150 
##$TP07= 0
##$TPNAME0= <>
##$TPNAME1= <>
##$TPNAME2= <>
##$TPNAME3= <>
##$TPNAME4= <>
##$TPNAME5= <>
##$TPNAME6= <>
##$TPNAME7= <>
##$TPOAL= (0..7)
0.5 0.5 0.5 0.5 0.5 0.5 0.5 0.5 
##$TPOFFS= (0..7)
0 0 0 0 0 0 0 0 
##$TUNHIN= 0
##$TUNHOUT= 0
##$TUNXOUT= 0
##$USERA1= <user>
##$USERA2= <user>
##$USERA3= <user>
##$USERA4= <user>
##$USERA5= <user>
##$V9= 5
##$VALIST= <valist>
##$VCLIST= <CCCCCCCCCCCCCCC>
##$VD= 0
##$VDLIST= <DDDDDDDDDDDDDDD>
##$VPLIST= <PPPPPPPPPPPPPPP>
##$VTLIST= <TTTTTTTTTTTTTTT>
##$WBST= 1024
##$WBSW= 4
##$XGAIN= (0..3)
0 0 0 0 
##$XL= 0
##$YL= 0
##$YMAX_a= 143333
##$YMIN_a= -136143
##$ZGOPTNS= <>
##$ZL1= 120
##$ZL2= 120
##$ZL3= 120
##$ZL4= 120
##$ABSF1= 10
##$ABSF2= 0
##$ABSG= 5
##$ABSL= 3
##$ALPHA= 0
##$AQORDER= 0
##$ASSFAC= 0
##$ASSFACI= 0
##$ASSFACX= 0
##$ASSWID= 0
##$AUNMP= <proc_1d>
##$AZFE= 0.1
##$AZFW= 0.1
##$BCFW= 1
##$BC_mod= 2
##$BYTORDP= 1
##$COROFFS= 0
##$CY= 11.3945322036743
##$DATMOD= 1
##$DC= 2
##$DFILT= <>
##$DTYPP= 0
##$F1P= 15.6554695791079
##$F2P= 12.8336369535428
##$FCOR= 0.5
##$FTSIZE= 0
##$FT_mod= 4
##$GAMMA= 1
##$GB= 0.15
##$INTBC= 1
##$INTSCL= 1
##$ISEN= 128
##$LB= 0.24
##$LEV0= 0
##$LPBIN= 0
##$MAXI= 10000
##$MC2= 0
##$MEAN= 0
##$ME_mod= 0
##$MI= 1.114404
##$NCOEF= 0
##$NC_proc= 0
##$NLEV= 6
##$NOISF1= 3.799351
##$NOISF2= 2.8
##$NSP= 1
##$NTH_PI= 0
##$NZP= 0
##$OFFSET= 15.70392
##$PC= 1
##$PHC0= -26355.63
##$PHC1= 18.18743
##$PH_mod= 1
##$PKNL= yes
##$PPARMOD= 0
##$PSCAL= 0
##$PSIGN= 0
##$REVERSE= no
##$SF= 200.130013532006
##$SI= 16384
##$SIGF1= 3
##$SIGF2= 2
##$SINO= 400
##$SIOLD= 16384
##$SREGLST= <1H.CDCl3>
##$SSB= 0
##$STSI= 0
##$STSR= 0
##$SW_p= 3612.71676300578
##$SYMM= 0
##$S_DEV= 0
##$TDeff= 0
##$TDoff= 0
##$TI= <>
##$TILT= no
##$TM1= 0
##$TM2= 0
##$TOPLEV= 0
##$USERP1= <user>
##$USERP2= <user>
##$USERP3= <user>
##$USERP4= <user>
##$USERP5= <user>
##$WDW= 1
##$XDIM= 8192
##$YMAX_p= 0
##$YMIN_p= 0
$$ End of Bruker specific parameters
$$ ---------------------------------
##NTUPLES= NMR FID
##VAR_NAME=  TIME,          FID/REAL,        FID/IMAG
##SYMBOL=    X,             R,               I
##VAR_TYPE=  INDEPENDENT,   DEPENDENT,       DEPENDENT
##VAR_FORM=  AFFN,          ASDF,            ASDF
##VAR_DIM=   8192,          8192,            8192
##UNITS=     SECONDS,       ARBITRARY UNITS, ARBITRARY UNITS
##FACTOR=    0.0002076,     1,               1
##FIRST=     0,             0,               0
##LAST=      1.7004516,     0,               0
##MIN=       0,             -136143,         0
##MAX=       1.7004516,     143333,          0
$$ Real data points
##PAGE= N=1
##DATA TABLE= (X++(R..R)), XYDATA
0@%%%%%%%%%%qJ6j6J6j6K3l1L3m1M8n6O8p6Q8j04J20j39J59j77K01k30K57k88
33a53L24l62M04m50N01n57O18o83P55q37R27j026J138j263J403j564J747j959
51a037K210k510K879l346L952m779N989p942J1746l3392J25888L9876j47565o4880
65g2911j3214N4574J20009L6410j44502j07026N7937J16886M6033l5489r9760
76d1053o8941N6938J28260L5564r0189j07856j2950R6255J10404j5826j24460
87c3854p5282M8911J02452O4914m8100j32842m5727J09555J04135j6750q1121
98c709p3355r276R6845R8487m0160j20738m5517N9421Q9301M1292n6556j06059
110g0024k8257Q9372R7397m965r6545q2765K4788J09844O1453n6581r7021l5381
$$ plain form
0 0 0 0 0 0 0 0 0 0 0 0 -8 8 -8 8 -8 15 -16 17 -24 24 -32 36 -40 48 -56 64 -75 84 -93 108 -122 135 -153
33 -153 171 -191 213 -237 264 -293 325 -358 397 -440 487 -539 599 -664 739 -825 922 -1037
51 -1037 1173 -1337 1542 -1804 2148 -2631 3358 -4584 7162 -26230 99658 139534 -8031 -72911
65 -72911 -86125 -31551 88458 124868 -19634 -126660 -68723 48163 94196 58707 -41053
76 -41053 -109994 -53056 75204 110768 20579 -87277 -100227 -3972 106432 90606 -33854
87 -33854 -109136 -60225 42227 107141 59041 -73801 -119528 -9973 94162 77412 -3709
98 -3709 -77064 -86340 10505 108992 68832 -51906 -97423 -38002 51299 92591 36035 -70024
110 -70024 -98281 -8909 88488 83523 -13022 -95787 -70999 38845 100298 43717 -53304 -88685
122h8685N4307R7989L4469q8696j00499J9147R2778N3329j5128p2553p4856K4566
134f3832J12737M9135p1706q8873j3812N9105P9762K0402p8425r1580J4641J00748
146B8302N9249m1170q5471m1497M3592Q7539L3033o3745q6074r103P4906P4136
158G3697r701q0493n9909K5567P8516N0296l4402q7858l8957O0404Q4955R185
170G1300o6804o8185q75P0574O8095j6473q4876n1188L9319Q0496L2084m9233
182B4234p4320j9516N7304P2182N345o9907o4299J5295P4720M8539k8188p2784
194c1395l8579L8953P5449K6005n5305p2462n459O5093N9404r321o6218n1640
206f5475K0232P3600M1234l9602p1742k2746M7833O4728J1952n5113o1699J940
$$ plain form
122 -88685 -34378 63611 98080 9384 -91115 -71968 20810 74139 59011 -13542 -88398 -63832
134 -63832 48905 98040 26334 -62539 -76351 -17246 62516 82918 4493 -87087 -72446 28302
146 28302 87551 46381 -39090 -80587 -36995 50544 83577 19832 -66242 -75345 -439 73697
158 73697 63996 -16497 -76406 -50839 27677 77973 43571 -44287 -83244 -22840 62115 71300
170 71300 4496 -63689 -64564 6010 74105 57632 -27244 -78432 -39113 41383 73467 24234
182 24234 -50086 -69602 -12298 59884 65229 -4678 -68977 -53682 21038 69577 41389 -31395
194 -31395 -69974 -31021 44428 70433 15128 -57334 -62793 2300 61704 52383 -13835 -65475
206 -65475 -45243 28357 69591 29989 -41753 -64499 -16666 48062 60014 4901 -56798 -54858
218e4858O4973N2855j8775o8130l9479L0739O6942K8438m1567o5839j5304N2563
230g442O0761J26o0136n1138J4083O2248M0884k4691o4261l1387L8089O3332J6837
243E7305m7250n7249m683N3863N2041r353n8706m2822K1447O0534L2348l3201
255B4274o0017j9353M2000N6613P688n0048n0547N471N4379M2712j6785n8073
267b1686l3586K9156N7595K1116l6754n5041j1294M6495N0598k664n0862m2586
279d9513J2938N4041L4105k3703n4856k4013L3326N3546J2612m1682m8777j523
291d3499M6865M3495r521n1392l5432K0919N2483K5029k9187n1283j5815L7839
303i499M8864L748m4674m1480O736M6831L5572j5992n0234k7311K6535N0005J6094
$$ plain form
218 -54858 10115 62970 44195 -23935 -63414 -32675 34267 62705 21138 -44701 -60005 -7442
230 -7442 53319 53445 -6691 -57829 -43746 18502 59386 34695 -29566 -60953 -22864 40468 57305
243 57305 10055 -47194 -51877 1986 54027 44674 -14032 -56854 -35407 25127 57475 24274
255 24274 -35743 -55096 -13096 43517 51205 1157 -49390 -43919 10460 53172 36387 -21686
267 -21686 -55272 -26116 31479 52595 15841 -39200 -50494 -3999 46599 43935 -6927 -49513
279 -49513 -36575 17466 51571 27868 -26988 -51001 -17675 35871 48483 6801 -41976 -43499
291 -43499 3366 46861 37340 -14052 -49484 -28565 23918 48947 19760 -31523 -47338 -9499
303 -9499 39365 43113 -1561 -43041 -36305 10526 46098 30106 -20128 -47439 -20904 29101 45195
316D5195l4447m5790o431L9427M2021k432m5458l6210J3870M7673K6721k1815
328B2324m6758j9925L0255M6867Q882l8024m0591P91M0713L6339r163m5440k9811
341d3541K0847M5163J9387k7085m3104j2187L2875M2653K494m0944l5219Q813
353b9848M0927K8622j4928m3666k2659K4984M3545J1914l1150l8927m275L5017
365d44L5985l733m0367l0571J4257M1631K2263k1396m0281j5324K7562M0452N982
378C6016l4735l5389L794L7199K8501j0241l8372k4493J8190M0347J6665k6819
390A0663l7317p374K9713L4637J244l5099l1391Q699L8247K3345j5804l7051j8417
403c5905K1956L8490J0457k9621l4910n99L2235K9870n204l5505k6091J4320L7015
$$ plain form
316 45195 10748 -35042 -41473 -2046 39975 37543 -7915 -44125 -30255 17418 44139 22324
328 22324 -24434 -44359 -14104 32763 41645 3621 -36970 -36179 4534 40873 31710 -13730 -43541
341 -43541 -22694 22469 41856 14771 -28333 -40520 -7645 35008 37502 -3442 -38661 -29848
353 -29848 11079 39701 24773 -18893 -41552 -16568 26977 38891 7741 -31186 -35461 -444
365 -444 35541 31808 -8559 -39130 -24873 16758 39021 17625 -22656 -37980 -10418 30034 36016
378 36016 1281 -34108 -30314 6885 35386 25145 -13227 -37720 -19530 20817 37482 10663
390 10663 -26654 -34028 -4315 30322 31566 -3533 -34924 -26225 12022 35367 19563 -17488 -35905
403 -35905 -13949 24541 34998 5377 -29533 -30132 2103 31973 26769 -8736 -34827 -20507 16508
416A6508J7621k0355l4818j1710K4649L4396M961l0823l0702L749L2789K5789
428C2054r812l5181k0999J7856L5998J2870k4005l3211n581K7784L0307j079l1868
441d867k6131R001L3098K0146j4668l3247j4841K0677L2883Q379k5991l0591r83
454b7135K9604K6660n992l1739k2377J3151L3005J6242j9512l2465q565K3539
466e584K9813K386k7202k6797M478L0162K1804j0998l0862j6160J5662L0579J1729
479B9010k1223l0210m545K5529K6594k124k7497k3355P869L1043J8005j5244l0615
492a6763j1029J9653K8247N857k3142k6387l76K7312K2831p062k8158j7619J1603
505a5033K8481J3578j6701k8482p851K1587K6332K056k5390k3419N073K6780J8810
$$ plain form
416 16508 34129 13774 -21044 -32754 -8105 26291 31252 429 -30273 -26524 6265 32054
428 32054 22242 -12939 -33938 -16082 19916 32786 8781 -24430 -30011 -2227 28080 27001 -4867
441 -4867 -30998 -21997 11101 31247 16579 -16668 -31509 -10832 22051 30430 4439 -26152 -27135
454 -27135 2469 29129 23137 -8602 -30979 -17828 15177 31419 11907 -20558 -29123 -5584
466 -5584 24229 26615 -587 -27384 -22906 7256 29060 18062 -12800 -28960 -13298 17281 29010
479 29010 7787 -22423 -26968 -1439 25155 23031 -4466 -27821 -19952 11091 29096 13852 -16763
492 -16763 -27792 -8139 20108 25965 2823 -23564 -23940 3372 26203 19141 -9017 -26636 -15033
505 -15033 13448 27026 10325 -18157 -26008 -4421 21911 23967 -1423 -24842 -19769 7011 25821
518B5821r740k8185j4776J5564K8684P998k0437k5058k553K2221K3018k252k4977
531d672k0577Q671K7380J4311j3553k6173r383J6338K5868N373k1402k4162J336
544b0645K4732J9498p110k4843j5772J0967K6054J1509j6510k5077n264K0092
556b369K2340K96k2363j9353L924K3985J6894r341k5516j2018J4751K4330O405
569B1965j7724k2164k790K0615K1075k581k3827j6720R041K3172J1887j2233k2600
582a2884r175J5998K3491L257k0335k0182K474K0894J7431o168k2743j4280J1193
595a1029K3566Q899j4969k2150m112J7880J9572J16j9679j7955M616K1899J4581
608B1235j0202k1916r570J3047K0970O326j6225k0709j383J9831J7812m212k0522
$$ plain form
518 25821 16081 -12104 -26880 -11316 17368 25366 4929 -20129 -22682 -461 22557 20305 -4672
531 -4672 -25249 -16578 10802 25113 11560 -14613 -23996 -7658 18210 23583 2181 -21981 -20645
544 -20645 4087 23585 16475 -8368 -24140 -13173 12881 24390 7880 -17197 -22461 -2369
556 -2369 19971 20267 -2096 -21449 -17525 6460 23354 14013 -11503 -23521 -8770 15560 21965
569 21965 4241 -17923 -20713 -98 20977 18396 -5431 -22151 -13110 10062 21949 9716 -12884
582 -12884 -22059 -6061 17430 20687 352 -19830 -17356 3538 20969 14801 -7942 -22222 -11029
595 -11029 12537 21436 6467 -15683 -19795 -1915 17657 17773 -1906 -19861 -15245 6654 21235
608 21235 11033 -10883 -20453 -7406 13564 19890 3665 -17044 -18427 1404 19216 15004 -5518
621e518j3795P293K0751J1374j1145k1838o675J5652J9601J837j7194j7709J507
634a5859J9635J5202o315k0656j1342J0025K1058P275j3984j9090l262J5620J7755
647A6062N0j8896j5789N971J9655J1328q854j8905r249J2082J9428M903j5564
660B222j7815O20J6659J4774l104j8367j2820P201J9406R133j0764j8637n867
673a7359J3834J7946J241j6339j5347K643J7205J3414o290j8619r650R658J8158
686A0495O130j2223j7384k879J5146J6050j364j7173j2999N319J7123J0337q251
699H327j7799p302J2064J6947K789j3667j5282J46J5934J3241m183j6611j0670
712a6066P136J7230P869j0766j6370m046J2865J4787Q67j4118j3916K405J6492
$$ plain form
621 -5518 -19313 -12020 8731 20105 8960 -12878 -19553 -3901 15700 17537 343 -17366 -15859
634 -15859 3776 18978 12663 -7993 -19335 -9310 11748 19023 5039 -14051 -17313 -1693 16062
647 16062 16112 -2784 -18573 -12602 7053 18381 9527 -9378 -18627 -6545 12883 17786 2222
660 2222 -15593 -14973 1686 16460 13356 -5011 -17831 -10630 8776 17909 7145 -11492 -17359
673 -17359 -3525 14421 15662 -677 -16024 -13381 3824 17238 10948 -7671 -17321 -7663 10495
686 10495 16625 4402 -12982 -15861 -715 15335 13971 -3202 -16201 -10882 6241 16578 8327
699 8327 -9472 -16774 -4710 12237 15026 1359 -13923 -13777 2157 15398 11215 -5396 -16066
712 -16066 -8930 8300 16169 5403 -10967 -15013 -2148 12639 13506 -612 -14528 -12123 4369
725D369J1427o823j6244q094Q972J5700N495j1431j5711j702J4443J3103j578
738A1926j4770j2070N065J6517Q269q055j5429n476R750J5273K890j3344j3361
751a2815J058J4077J1488l671j4923r948P247J5494O445r955j4729k894J1227
764a899J3673N21j3469j2304L537J3910R612n518j4712p112Q435J4636L802j0638
778B474j3560j487J2786J2076j807j3873j0053N049J4089P496p158j3889n214
791a3071R682J3736J764j1513j2284J037J3110J0104l470j4009q302O736J3744
804G264N242q473j3444k648J0805J2022K52j2396j0804L365J2709Q875o191j2968
818f390o496Q505J2791L328r619j2148r21J1939J0570k221j2589q573M534J2746
$$ plain form
725 4369 15796 8973 -7271 -15365 -6393 9307 14802 3371 -12340 -14042 401 13504 11926
738 11926 -2844 -14914 -9849 6668 14937 6882 -8547 -14023 -4273 11000 13890 546 -12815
751 -12815 -11757 2320 13808 10137 -4786 -14734 -7487 8007 14452 4497 -10232 -13126 -1899
764 -1899 11774 12295 -1174 -13478 -9941 3969 13581 8063 -6649 -13761 -5326 9310 13112 2474
778 2474 -11086 -12573 213 12289 10482 -3391 -13444 -8395 5694 13190 6032 -7857 -13071
791 -13071 -3389 10347 12111 598 -11686 -10649 2461 12565 9095 -4914 -13216 -6480 7264
804 7264 12506 4033 -9411 -12059 -1254 10768 11020 -1376 -12180 -8815 3894 12769 6578 -6390
818 -6390 -12886 -4381 8410 11738 2119 -10029 -10950 989 11559 9338 -3251 -11824 -7290 5456
832E456O801o843j3282m327R653J1772J791j0734j1058J142J2071R061m192j2060
846d749o991O060J2484M569q156j1502k533R764J0753j40j0628j0059K865J2102
860C839P731n604j2130m772P245J1306L110r218j1094k3J0591R326k118j1597
874c408p375M275J1690O123o626j1681l573Q419J1130Q37r992r569J445J0840
888B535P788l574j1248o044N607J1251M002p586j0459k120R380R446n23r958q365
903i868K834J0801O403m543j1373m003O584J0278K369q344r868L5R877Q003j730
918G455j0505p119M362J0659N153o283j0539l030Q463R408M82q845q488J407R444
933B024P743l895j0044n277N330J0201L251p040r406j526P983R208j076r313p428
$$ plain form
832 5456 12257 5414 -7868 -12195 -2542 9230 11021 287 -10771 -9629 2442 11503 7311 -4749
846 -4749 -11740 -5680 6804 11373 3217 -8285 -10818 -1054 9699 9559 -1069 -11128 -8263 3839
860 3839 11570 5966 -6164 -10936 -3691 7615 10725 1507 -9587 -9610 981 10307 8189 -3408
874 -3408 -10783 -6508 5182 11305 4679 -7002 -10575 -2156 8974 9811 -181 -9750 -8305 2535
888 2535 10323 6749 -4499 -10543 -4936 6315 10317 2731 -7728 -9848 -468 8978 8455 -1503 -9868
903 -9868 -7034 3767 10170 5627 -5746 -9749 -3165 7113 9482 1138 -8730 -8695 1182 9185 7455
918 7455 -3050 -10169 -5807 4852 10005 3722 -6817 -9847 -1384 8024 8506 -339 -8827 -7420 2024
933 2024 9767 5872 -4172 -9449 -4119 6082 9333 2293 -7113 -8639 -656 8552 7476 -1837 -9265
948i265L215R102O106m304r800m431O720R706J391p508q399O0Q184P839k145r567
964c096o074M319R516M007n350r187k433O819Q717L94p943p486J156R063O187
979H609l500r265m427M790R150L048o379q948q92P905P380q75q281o202K390Q759
995C262N219m474r120k706N724Q212J640o794q127N12P948O735k248q470n226
1010g913L484Q836L253m928q507j683O434P384O91p986o476J802Q020M881k807
1025D485q400l775M320Q544K411o096p895l03P057O408p09p895n643K706Q106
1040C321M195m005p922k863N520P371R56o201p114N61P471N644j835p645m673
1055g219L579P601L215m693p707j694O374O835L5p105n764J106P600M929l054
$$ plain form
948 -9265 -6050 3052 9158 4854 -4946 -9377 -2657 7049 8440 932 -7467 -7407 777 8616 6471 -3096
964 -3096 -9170 -4851 4665 8672 3322 -5865 -8298 -1479 7238 7632 -311 -7797 -6641 2422 8609
979 8609 5109 -4156 -8583 -3793 5357 8405 2026 -6922 -7814 91 7471 6596 -1685 -7887 -5497 3262
995 3262 8481 4007 -5113 -7819 -2095 6117 7757 963 -7164 -6652 1296 8031 5783 -2687 -7913
1010 -7913 -4429 4407 7660 2732 -5775 -7458 -1024 6360 7051 -935 -7411 -5609 2411 7292 4485
1025 4485 -3915 -7690 -3370 5174 7585 1489 -6406 -6709 348 6756 6047 -1848 -7491 -4785 3321
1040 3321 7516 3511 -4411 -7274 -1754 5617 6573 372 -6742 -6181 1290 6934 5099 -2546 -7219
1055 -7219 -3640 3961 7176 2483 -5224 -6918 -544 6291 6326 -779 -6543 -5437 2163 7092 4038
1070D038p543l589M372P354K105n454o687p85O580N735r00o885n256K590P431
1085C106L503l822o658k935N138P101M85n755n974O06O521N230j948p375l639
1100f416L145P089K781m685o888j256N574N961k35n886n041J567O202M659l010
1115C561o850l041M181O598J438m956o064k9N580N399j264o400m421K652O312
1130B696L857l912o526k046M564O082R51n576n424K58O220M224j741o155l507
1145f035L367O180K016l718o116j313N174N433l89n338m812J592N884L539k240
1160C224o440k503L886N589J767m666n739J40N034N276j446n735l896K239O022
1175B752K569l254n504k009M781N161L57m744n035M34N622M098k141n496k730
$$ plain form
1070 4038 -3505 -7094 -2722 4632 6737 1283 -5404 -6189 391 6126 5226 -1659 -6915 -4325 3106
1085 3106 6609 2787 -3871 -6806 -1668 5433 5918 163 -5811 -5205 1316 6546 4598 -2777 -6416
1100 -6416 -3271 3818 6599 1914 -4974 -6230 -656 5305 5070 -816 -5857 -4290 1912 6571 3561
1115 3561 -3289 -6330 -2149 4449 5887 931 -5133 -5162 418 5817 4553 -1847 -6268 -3616 2696
1130 2696 6553 2641 -3885 -5931 -1367 4715 5666 90 -5334 -5076 1144 5368 3627 -2528 -6035
1145 -6035 -2668 3512 5528 1810 -4306 -5619 -445 4988 4599 -739 -5551 -3959 1925 5464 3224
1160 3224 -3216 -5719 -1833 3756 5523 857 -4882 -4742 292 5568 4122 -1613 -5509 -3270 2752
1175 2752 5321 2067 -3437 -5446 -665 4496 4853 109 -4926 -4492 1130 5228 3087 -2409 -5139
1190e139K852N376K076l898n226r90M886M801n68n272l774J158N406L389k572
1205B505n289k630L914M984J474m585m398n24N040M501j509n020l434K400N004
1220B433K573l130n143j419L687M857L77m152m739J005M788L579j973m896k607
1235d760K805M725J952l467m808n82L949M391l83m961l740K124M511K986k261
1250B481n218j909L440M541Q95l712m469O5M496L431o93m880k991J947M901K337
1266D662k842m597j485L278N056k88m057l717O81M315L234j401m895k097K153
1281b000M624J420l209m113l78L757L575j89m398l164J390M259K734k331m110
1296b133j910K856L977Q46l530l617M7L854L447r05m336k635K083L989J842k407
$$ plain form
1190 -5139 -2287 3089 5165 1267 -3959 -4949 -63 4738 4170 -1102 -4876 -3718 1688 5077 2505
1205 2505 -2784 -5414 -1500 3484 4958 373 -4025 -4549 491 4992 3483 -1537 -4971 -2571 2433
1220 2433 5006 1876 -3267 -4686 -999 3858 4235 83 -4656 -3651 1137 4716 2743 -2153 -4760
1235 -4760 -1955 2770 4722 1255 -3553 -4135 -186 4205 3822 -1139 -4879 -2755 1756 4742 2481
1250 2481 -2737 -4646 -1206 3335 4230 518 -3951 -3886 610 4041 3348 -1532 -4523 -2576 2325 4662
1266 4662 1820 -2777 -4262 -984 4072 3784 -273 -3990 -3309 1006 4240 2839 -2056 -4153 -2000
1281 -2000 2624 4044 835 -3278 -3656 101 3676 3487 -911 -4075 -2685 1574 4308 1977 -2133
1296 -2133 -4043 -1187 2790 3636 106 -3511 -3464 390 3837 2932 -1404 -4039 -1956 2033 3875 1468
1312A468m172j039K987M055M6l586l118J11M195K779j677l765k309K230M450J293
1328C948l269l724m42L241L674m35l690k825J299L561K323j777m297j192K439
1343a166L980Q40l384l306Q6L446K817p75l771k300J601L637J946k742l523j070
1359c684K941L934p4l217l361P26L775K235j300l380j987K017L623R35k494l670
1375b981JL094K914k35l208k905J088L235K082j528l308j780K763L244M65k414
1391E27l510J78K948L027j111l155k019J389L590J549k427l414l79K155L486j21
1407B713k668k989O62L070K237j338l175j841K168L203J208k554l335m4K711K673
1423B701n6l557k113Q78L638J651j454l423r91J728L631K3k680k479%K898K408
$$ plain form
1312 1468 -2704 -3743 -756 3299 3345 -241 -3359 -3248 947 3726 2049 -1716 -4025 -1795 2655 3948
1328 3948 679 -3045 -3487 -246 3428 2993 -697 -3522 -2223 1338 3661 1884 -2413 -3605 -1166
1343 -1166 2814 3654 270 -3036 -2950 496 3313 2538 -1233 -3533 -1932 1705 3651 909 -2614 -3684
1359 -3684 -743 3191 3117 -100 -3461 -2735 1040 3275 1975 -1405 -3392 -1375 2248 3183 689 -2981
1375 -2981 -2980 114 3028 2793 -415 -3320 -2232 1003 3085 1557 -1751 -3531 -768 2476 2941 527
1391 527 -2983 -2805 143 3170 2059 -1096 -3115 -1726 1864 3413 986 -2428 -2807 -652 2834 2713
1407 2713 45 -2944 -2282 788 3025 1687 -1488 -3329 -1161 2042 3250 696 -2639 -2683 28 2701
1423 2701 2645 -912 -3025 -2147 1491 3142 1688 -1735 -2726 -998 2633 2656 -24 -2503 -2503 395 2803
1440B803o55l052k169J389K992J525j523l352n58J829L172K24k597k769K82K959
1456E00K566j075l387j686K112K723J248k231k775m97K280K615l10k694k074J053
1472a632K425J726j052k991j051J697K791O84k019k653j82K653K200o60k623j705
1488b392J108K639R62j582k495m53J675K621L65k654k323M00K858J979q06k922
1504a020j340J030K697J404k192k480k53K368J995j65k425k037M91L056J295j089
1520A335k438j415J581K640N59k215k085j15K282K282n63k513j701R85K782J068
1536B469j583k374p42J789K392k15k056j859N58K191J460r47k307j275J300K764
1552A565O38j816k094l74J616K409j61k267j703N68K539J578r65k475j643J969
$$ plain form
1440 2803 2148 -904 -3073 -1684 1308 2833 1310 -2042 -2600 -771 2401 2625 28 -2741 -2459 500
1456 500 3066 1991 -1396 -3082 -970 1753 3001 770 -2005 -2502 -222 2393 2083 -611 -2685 -1632
1472 -1632 793 2519 1467 -1524 -2575 -878 1913 2597 578 -2075 -2257 396 2596 1936 -687 -2392
1488 -2392 -1284 1355 2317 735 -1760 -2213 -538 2083 2448 -206 -2529 -2129 729 2708 1902 -1020
1504 -1020 -2360 -1330 1367 2771 579 -1901 -2154 214 2209 2044 -381 -2418 -1927 1129 2424 1335
1520 1335 -1103 -2518 -937 1703 2262 47 -2038 -2153 129 2411 1848 -665 -2366 -1381 1401 2469
1536 2469 886 -1488 -2230 -441 1951 1736 -320 -2179 -1621 570 2030 1083 -1224 -2499 -1199 1565
1552 1565 2203 387 -1707 -2081 -465 1944 1783 -484 -2187 -1619 920 2498 1533 -942 -2585 -616
1568f16K495K40j729k100j24K100J958o58k187j514Q66K384R84j051k434n41J520
1585d07K284j47j616j853k27K450J530m48k557j187J224K216R42j501k481K68
1601a510J415J997P1j920k281N84K316J468j171k168r77J391J947R90k080j893
1617a821j78K206J595j53k311j352J030J911R45j339j524r56J455K147J84j786
1633E3j890L14J848J303r7k315j307J146K218K03m73k394p19K087J485J7j843
1650c64j617O09K073J437q72k110j122J306J696P01j428k034N6J635J909l26k112
1667e63j457Q76J754R96n06k082q38J205J841O36j905j725M23J819J165n60j777
1684f98r48O25K168N83q81j982r43J755J997l82j051k096O83J840J106o15j988
$$ plain form
1568 -616 1879 2119 390 -1710 -1834 266 2224 1566 -621 -2135 -1269 1115 2099 1048 -1386 -1927 -407
1585 -407 1877 1730 114 -1739 -1966 484 2014 1566 -991 -2178 -954 1262 2204 703 -1778 -1510
1601 -1510 -95 1902 1973 53 -2228 -1644 672 2140 969 -1199 -2176 -785 1162 2152 72 -1821
1617 -1821 -1999 207 1802 1649 -662 -2014 -984 927 1872 533 -991 -1947 -492 1655 1839 53
1633 53 -1837 -1523 325 1628 1531 -784 -2091 -945 1273 1476 1003 -1391 -2110 -23 1462 1479 -364
1650 -364 -1981 -1372 701 2138 1266 -844 -1966 -660 1036 1737 309 -1725 -1669 -34 1875 1549 -563
1667 -563 -2020 -1144 610 1606 1100 -982 -1820 -615 1226 1862 -43 -1768 -1345 474 1639 1079 -698
1684 -698 -1646 -1021 1147 1730 849 -1133 -2076 -321 1676 1294 243 -1853 -1170 670 1776 1161 -827
1701h27p69J089J683K47j112j848l80K088J646m02j632j421J84J930J235r35k125
1718a349l65J401J616L18j499j966O89J250J378k24j632j459J115J606N74r41
1734E12j633o41J563J476oj673j232N10J848R90o77j860r16J300J556N31j519
1751A29j298k4J160J445K27j788j307O56J555P37n13j953n29J141J492J26j046
1768B10j543l63J621J716m34j637r68K55K117L90q58j699n84J320J534L32j798
1785c89j267Q86J050J196o09j672q24J351J160N87j091j674l52J729J401m87j302
1802c07j171L92J742R10o19j933l92J154J137O21j566r59k0R89J823r25j381o75
1820a180L10J577P23r98j095q91J213J313M02j290j426J13J515J002m92j286r59
$$ plain form
1701 -827 -1596 -507 1176 1423 311 -1537 -1917 171 1817 1415 -217 -1638 -1454 476 1711 776 -1349
1718 -1349 -1714 -313 1303 1621 122 -1844 -1155 95 1473 1249 -383 -1842 -727 879 1453 512
1734 512 -1121 -1762 -199 1277 1271 -402 -1634 -1124 724 1714 1037 -823 -1739 -439 1117 1648 129
1751 129 -1169 -1193 -33 1412 1639 -149 -1456 -800 755 1492 979 -974 -1503 -362 1130 1256 210
1768 210 -1333 -1696 -75 1641 1207 -430 -1398 -1143 974 1364 506 -1193 -1777 -457 1077 1409 -389
1785 -389 -1656 -770 280 1476 867 -805 -1629 -278 882 1469 378 -1296 -1648 81 1482 995 -307
1802 -307 -1478 -1086 656 1566 947 -986 -1378 -224 913 1534 -32 -991 -1011 -22 1801 876 -505 -1180
1820 -1180 -870 707 1430 432 -663 -1554 -341 972 1374 84 -1342 -1229 286 1288 796 -490 -1449
1837a449O44J610P32j116j736j20J632J087j09j451j104M74J395P84o38j368n13
1854a246O28J706J94j016j007l44J110J514l85j543j242P97J427P38q63j676j17
1871a325R93J418J25j301j150J91J452Q01l67j418n83O98J266P98j427j182j82
1888a193J126J267k43r26j329N32J226O30l56j327q21J150Q04R71j165j389M52
1905e91M56J368l36j446o19M24J305P44q11j240n34P38J772l19j020r13J55Q59
1923hJ310n74j409n50M24J543M08o66j630k3J154J145k73o20j534K70J511Q59
1941A337q47j136l73L94J673L88r78j502k4Q47J468j12j812n12L90J261N70j41
1959H91j613k84P95Q37M58j005j216L1J445R14m89j261o65P82J286L30q78j229
$$ plain form
1837 -1449 -805 805 1537 421 -1315 -1435 197 1284 1175 -276 -1380 -906 489 1273 635 -733 -1246
1854 -1246 -618 1088 1282 266 -741 -1085 25 1539 1154 -389 -1631 -834 593 1331 468 -1208 -1325
1871 -1325 -332 1086 1211 -90 -1240 -1049 403 1204 837 -581 -1164 -466 800 1598 171 -1011 -1193
1888 -1193 -67 1200 957 31 -1298 -766 460 1090 734 -593 -1414 -264 540 1511 346 -1043 -591
1905 -591 -135 1233 897 -549 -1168 -744 561 1305 494 -746 -1280 -542 1230 911 -109 -1022 -867 -8
1923 -8 1302 728 -681 -1231 -807 736 1144 478 -1152 -1175 -21 1124 851 231 -1303 -1033 478 1337
1941 1337 490 -646 -1019 -625 1048 1436 458 -1044 -1068 -221 1247 1135 -677 -1189 -799 462 1032 891
1959 891 -722 -1006 -211 626 1084 79 -1137 -1106 339 1253 764 -497 -1162 -380 906 1236 358 -871
1977h71j77N05J596k67o88j287K08J154P61k48j036q67Q84J206N07j130j244O5
1995i29R03R59L6j083j266O24J223M76n14j023k33N39J306k7q79j189l6J487P76
2014A150m80j067q04P67Q90M74n35j206k90J057R24L9j034o49r0J444P00n29j287
2033e26p45O69J449J03p89j289J29J088Q75k68j330j66J60J287L37m38j047n74
2051a075O34J671m11o77j080J71J012P30k21q81r54L64J306L29o47q75o31O62
2069e73J280K52j170p65L24J093N59n08j098m80N60Q68P88j088q69M6R07J133
2087A259m81j224n98K08J056O78l51j214j92O64O60M82p76j021J90J273L81l70
2105F24q84p55N04J092K79k75j441k80J198P40L29j150q05p3R56P00P9j315j94
$$ plain form
1977 -871 -1048 -543 1053 786 98 -1189 -981 173 934 686 -350 -1217 -333 873 1380 250 -994 -929
1995 -929 -26 933 969 -114 -1380 -756 467 943 429 -594 -827 -288 1018 991 112 -1077 -1113 374 1150
2014 1150 670 -397 -1201 -434 456 930 395 -811 -1101 -44 880 919 -115 -764 -854 590 1290 761 -526
2033 -526 -1271 -602 847 950 161 -1128 -999 89 964 696 -634 -800 -640 647 984 546 -501 -1075
2051 -1075 -441 1230 819 142 -938 -767 245 975 754 -127 -1081 -717 589 918 271 -604 -1235 -573
2069 -573 707 959 -211 -976 -652 441 1000 492 -606 -1086 -526 342 1130 42 -827 -781 126 1259
2087 1259 778 -446 -1044 -836 220 898 547 -667 -859 -195 465 947 171 -850 -660 613 994 624
2105 624 -260 -1015 -511 581 860 585 -856 -1136 62 802 1131 -19 -824 -897 59 759 838 -477 -671
2124f71L73J038M15p40j011m53J154J080m47p90p10j25J219M48l01j030%K36J029
2143G14K17q65q25J49P40J131p17r28k80K71Q20N93p13j120j48N79R84J02o03
2162A01j025J22R41P81l73r91l98M32J026J37p34o23n55R07J144j98j032n43M65
2181d16P36N39n6j322k49N58J114j08q39m95pQ53L51j71m97n97p3J621j22o67
2201A53o00n79J059Q29L11j222j080N15N43J008n81q02l09M90P54M03o45r74j30
2220h57J114M94J98j095m44QQ78M14k70p37m89Q08O88nr13j98l75O27J162l15
2240F93l45j359M01R73J27k08p10l38M29Q70K82o83r97L25O37P41l54r95j61R7
2260e75Q57O25j006o22mN71R93j95q93l45l5J245P9j50r16k29K79P63K60p70m76
$$ plain form
2124 -671 -298 740 1155 415 -596 -1049 105 1185 738 -52 -762 -887 332 780 479 -551 -551 -315 714
2143 714 931 66 -759 -610 130 1261 544 -384 -664 -393 427 1020 307 -813 -961 -382 602 704 101
2162 101 -924 -802 139 920 547 -444 -842 -410 616 753 19 -604 -1159 -252 892 694 -338 -881 -416
2181 -416 320 859 803 -519 -768 -210 904 796 -43 -538 -545 308 659 488 -9 -606 -679 942 820 153
2201 153 -447 -1026 33 862 1173 -49 -1129 -614 -71 937 356 -446 -755 -265 489 892 247 -727 -857
2220 -857 257 751 949 -146 -590 -582 296 710 440 -297 -786 22 710 705 -208 -406 -781 -154 1008 693
2240 693 348 -1011 -610 363 490 282 -428 -766 -337 533 815 132 -865 -540 97 838 484 -511 -672 -575
2260 -575 282 907 -99 -721 -725 -154 839 644 -249 -594 -629 616 695 545 -371 -600 -321 442 702 -68 -544
2281e44m36J089R27o00q39o33P95M55M79o09o87j15P01P84K67r79j008M24P60
2300B31L98L6j007r28R95R75O4q19n34k11N14O57K63r79n48L02Q00O08l26r40
2320d49k22M28P92l0p00k79k09P78N34j21p25l50J16P56M80m93j061k3M96P87
2340E05M4n98q95K46J108K35j58l99o88O51M66L55n70j094K51M73P16j94m73p41
2360g60K65N94M12n5q91k79N17O80J77m89q58p8Q48R43l38r03m52K16O50K09j99
2381B09q53L24J65Q48J58q44o50L20N45L20kn29p19R5J226J45m50j018L37P40
2401C67N26k01q28n37L91O71L01j97q73m09L50J075k27l11r23J77M80P75q3q19
2421b95k81J27Q98K89m39o11n05O31J003k59p18n62M02M83M80k70n74k62L83N74
$$ plain form
2281 -544 -980 109 1036 436 -403 -1036 -241 214 693 84 -603 -718 -17 767 1034 55 -953 -529 231
2300 231 629 665 -342 -1270 -275 700 764 -55 -589 -800 -286 371 634 -345 -893 -591 209 817 491 -449
2320 -449 -671 -243 549 519 -181 -460 -669 109 643 522 -203 -553 -437 319 799 306 -755 -778 -282 505
2340 505 549 -49 -944 -698 410 645 487 88 -600 51 517 872 302 -792 -541 -68 648 454 -19 -760
2360 -760 -495 99 511 456 -435 -714 -197 483 660 171 -687 -765 83 1026 688 -215 -667 -451 199 408 209
2381 209 -644 -320 -155 693 851 7 -643 -323 222 542 540 11 -708 -613 613 758 308 -710 -373 367
2401 367 893 692 -136 -673 -282 389 690 493 -380 -789 -439 636 409 98 -825 -648 -168 607 524 -295
2421 -295 -576 -449 449 738 299 -312 -817 -186 817 558 -160 -722 -320 163 643 373 -201 -463 -80 494
2441D94K08o12n57j11O54N90M0p72o92M62O37M07n38n71j62N52Q35j83p87n98
2461g04J30Q89K80k77o17l28j26J093L19l84m23n27L58R76P4m78p32j38P79L14
2481D78K5p89k82P8R72J31k92r25J19L66N99R8n41p89L43P16O39n69p30l17K02
2502d68J033M1n65n20n10J302M63n78k97l87J6R58J18n00n63k51M93R51M9m09
2522C76r19K64L68M62q0r52k84M06O72J92k55m21l72P25L61Q5r16l02O47K46O56
2543I59p65j181L32N95K92J77o48l97J72N87N78k31m84n50M23N82Lk05o18l97
2563g76Q15O28l84m00m39m4R47O7j36l04o62O39N28rl73n39r0K57J063k3j198
2584d33l64L98O41K60l19n61j38K90P56k3o84m49O1P40N49k43r12j74L27M76N41
$$ plain form
2441 494 702 90 -467 -578 76 666 706 -66 -758 -296 341 748 210 -361 -523 29 864 681 -106 -704
2461 -704 -574 315 595 318 -299 -627 -753 340 659 275 -148 -675 -317 659 733 255 -477 -615 164 478
2481 478 503 -286 -568 -490 482 613 321 -604 -485 -119 480 578 37 -752 -409 307 946 377 -353 -670 -468
2502 -468 565 606 41 -479 -989 313 776 198 -99 -486 -470 488 606 106 -457 -708 -215 736 785 376
2522 376 -543 -279 89 551 471 -481 -765 -359 313 505 250 -171 -543 182 543 628 -288 -590 57 303 959
2543 959 194 -987 -655 -60 232 409 -239 -636 -464 123 701 470 -14 -564 -141 441 444 239 -379 -776
2563 -776 39 667 283 -117 -556 -600 347 414 278 -26 -688 -49 479 470 97 -442 -532 -275 788 765 -433
2584 -433 -797 -399 242 502 183 -378 -516 -226 530 507 -177 -626 -565 175 724 481 -431 -605 -278 198 739
2605G39p00n44kO87J92M9l27p96Q9J073k30l27m37m1N36L29K59m43o95j11N91
2626a09O79k4n39n07j70Q85L25k39o07QJ93P56l05j94o39p9P17K49ro66J25k26
2648c76R08j31j63n64l73P84R1L16m32l82N1N98j85O03j197l5L93L35N6m01k81
2669c85j83M70N67k57l56l00K75L07K11j7q19n3L87P30j09q75J07J84K14M84k41
2690C41m52l60L57M51N8l68n78L76M11L49j26m98k41J20K58N0J39j023J23K72
2710c41N78L90p75l62L8P35M37o23l17k8j80O13L14k32m97j74J22P71K51p21n66
2731e67l5N43N17p0o66l27N45M05J65o31k59l29Q92L41j82m74k64J16M23M3j16
2752G0l48M4L2O13K45p78j07j77M95K17k59k57NL34K83p4l02k62O9R8L14L20k25
$$ plain form
2605 739 39 -505 -507 180 372 421 94 -702 -613 460 230 -97 -534 -575 -39 290 549 106 -589 -700 -109
2626 -109 570 546 7 -500 -670 215 540 301 -306 -298 -105 651 346 152 -487 -566 151 400 391 -275 -150 -376
2648 -376 532 401 238 -326 -699 85 176 492 60 -322 -271 327 142 745 -452 -487 -94 241 297 -104 -385
2669 -385 -568 -98 469 212 -144 -444 -169 138 349 332 -487 -540 -153 577 468 -407 -300 -116 98 582 341
2690 341 -111 -471 -114 337 395 27 -551 -175 236 585 459 -39 -280 -160 98 148 287 -736 -613 -341
2710 -341 237 627 -148 -510 -472 263 700 77 -240 -268 -448 165 479 247 -250 -424 -302 469 720 -1 -567
2731 -567 -602 -59 458 388 -278 -605 -60 345 510 -121 -380 -709 183 524 342 -132 -396 -280 143 186 70
2752 70 -278 -234 -202 411 656 -122 -229 -406 89 306 47 -210 -205 129 412 338 36 -226 -157 -59 255 575 350
2775C50o98k52O96J67J7l73n26O88J17K46m43l56J3N21L23M0n69n29L42N22K54
2796E50j76p16K77n2L61Q7m80k73J97L11L92j04o74k14L09M18K70k35m75m08P91
2817A56K51k9n66j54J27K70M17m92j77j56J57N16N1n44k86N7J39O47Mm67k64L98
2839E5K32J74l37m36k02O79J13R1m48l63K06J93O13l06k04m13M17N05m44m1m27
2860c43r8K69L81P9m06o32P96L44j12J15m17l97J92O27j41k13m49j53M60N79O3
2881E44p00l35M14M94J44l38n96j74P54Q4l5k79j60o2N21L5J3l94k91Q2O48q4
2903B85q4l52l50M23N68L5o66k01R9M97J34j75o31M7K32K14L70l76j96o8J90%
2925eM93p66j57L0L33L70j00n67j13M82L88k49k4o39J66R15j90l66q4k75J42L23
$$ plain form
2775 350 -348 -600 96 263 280 -93 -619 69 186 432 -11 -367 -354 167 490 530 -39 -568 -226 296 550
2796 550 374 -342 -65 -117 244 331 -149 -422 -225 86 478 374 -300 -514 -205 213 483 248 -227 -635 156
2817 156 407 378 -188 -342 -215 55 472 -20 -197 -353 -196 320 371 -173 -459 -402 -263 384 388 -79 -343 55
2839 55 287 461 124 -312 -514 165 278 369 -79 -442 -236 -43 570 264 60 -353 64 569 125 84 -343
2860 -343 -441 -172 209 288 -118 -750 46 390 278 393 -24 -421 -229 398 257 44 -405 -558 -98 481 544
2881 544 -156 -491 -77 417 561 223 -373 -547 207 291 256 -23 -183 -245 276 311 324 -70 -361 -279 369 285
2903 285 201 -151 -501 -78 490 525 -141 -342 -243 254 388 213 -418 -371 -139 75 445 69 -127 -195 -5 -5
2925 -5 488 -278 -435 -405 -72 298 198 -369 -482 0 388 139 115 -524 -358 557 367 1 -83 -358 -216 107
2947A07K29k59n1k09j43O75k15k60K34k86K7O75m69k68l16M60K67J33j13p62J34
2968d10L57M05l08j6n60M47M55J66l48m81j9L74K79P1m55k56J80L7N89m6q20j90
2990e49L18K02J68j5m46K64p9M59J98m96j56q3O88q7n07j3m20N60K00k3j59p7
3012e3O5K9J07M90q01j40M43J41L19m34l52k6N31k01J53l74j51j61J85Q72n45
3033I7k96k53K28O05K19m92m82mN30o0Q9m26L5K59J07pr2m05p2J33L60L05m44
3056f6J0k73K01L04n7m59L31M12k40K79j7m54j41K44J85j4m54n4J68J8L93k36
3078H0j84j56j52N43J09j67n28rO22J67m87P9k72q2P20o6j77j96k18N82K79K1
3100E08o29m47M78K52J41m76K72n05pO40K01l30k63qJ36M47m87j31o8Q3N59o1
$$ plain form
2947 107 336 77 26 -183 -326 349 134 -126 108 -178 -151 524 55 -213 -529 -69 198 331 218 -544 -410
2968 -410 -53 352 44 28 -532 -85 370 536 188 -293 -312 62 341 412 -43 -299 -119 -82 507 461 -359 -549
2990 -549 -231 -29 139 124 -322 -58 -137 322 520 24 -132 -215 473 386 -121 -134 -554 6 206 183 24 -53
3012 -53 12 41 148 638 -163 -303 140 281 600 166 -186 -212 319 118 271 -103 -254 -415 -230 642 97
3033 97 -199 -452 -224 381 600 108 -374 -378 152 92 181 -245 -210 49 156 149 57 -348 -420 -287 73 378 -66
3056 -66 -56 -329 -128 176 119 -340 -9 403 163 442 425 -29 -170 74 259 245 -209 -263 -95 -77 316 80
3078 80 -104 -260 -412 131 240 73 -455 -464 158 325 -162 -83 -355 -437 283 217 40 -156 -374 208 487 508
3100 508 -121 -568 -90 162 303 -173 99 -406 -413 227 428 98 -165 -173 -37 410 -77 -208 -276 -193 366 305
3122C05m4n58J22J63K47q7Q7n42K71J07J36Q4k70n30L94Q1M29m13K2j39L0L28
3144B23O6l96J22k65k75O80J02k99l49L59L00K6m31n1J4lM79l38J30k99j79L38
3166d6L01j88P3l88Q9L70j80K34l74l11K97M36r9m53q2L04L9L39m97q7O2L83n
3189B17k37Q1m85K26Q0P08n17m53J15L44r5M87k56m84J90j73L55K4k82J3rK23
3211G2K90m40K75l70K72J83l58j41l7j62N74M8N5k45l53L17j90M03j4k36k16L18
3233D5l1K64n02j31K87L26r9J11l14k83O9K78M32k31m59J37L32Q9J2o51K02p0
3255a87L24L93m98j28J47j02o1K82l4l13k77Q16j45j47k59k97N03M3NJ99n26j21
3277c83K74K71m5k09o9J75N8N6J14l79k41L23K71j16nm40K56O4J05m7m80J52J59
$$ plain form
3122 305 261 -297 -175 -12 235 148 235 -307 -36 71 207 291 21 -509 -115 -34 395 -18 4 -135 -105 223
3144 223 289 -107 15 -250 -525 155 257 -42 -391 -32 268 294 -137 -188 -174 -177 302 -36 94 -205 -384 -46
3166 -46 255 67 140 -248 -159 211 31 265 -109 -420 -123 313 214 -239 -321 -17 22 361 -136 -223 -161 222 217
3189 217 -20 61 -424 -198 -118 590 73 -380 -265 79 -16 471 215 -269 -79 -252 103 127 -155 -142 -151 72
3211 72 362 -78 197 -173 99 282 -76 -217 -254 -416 158 206 261 16 -337 -20 -210 193 179 -57 -273 45
3233 45 14 278 -224 -355 -68 258 159 270 -44 -327 -258 20 452 221 -238 -101 231 320 332 -319 -117 -187
3255 -187 137 530 32 -96 51 -51 -112 170 136 -177 -454 362 217 70 -189 -486 17 60 65 264 -262 -383
3277 -383 -109 162 117 -92 -161 14 72 128 242 -137 -378 -55 216 100 95 -345 -89 -25 80 33 -447 -295 -136
3300a36J5N14n79k28K05K16L39j64j36l62J44J13N19l56k31l02O94j51J06l84
3320a64j61J31L42m6J66j15j92m40N76Mmo94K94K15L55k63j08nr3J41O88o49m33
3343d55P02j31K19l2m1l85K04j42L84n9k86j88J90J97J86k02l80J0o9N62O5j6
3365C33j09n59L01M01l58J0l16J39N24l22O4k52j42K46K85m2j50k64J33L11k3
3386B10k51Kk6j36L81R9j43l98J39L7M14k19n44J41N31k66%J5k29K16l38P48l59
3409B4kl51r6M60K53l03m8j15L18j41L23j17n81K11k31L88Q9j72o4j31L58l2k9
3432A1L11m83j4J43L29j30k64o3p5K27J08j92l41M28Q1M0J36m65M5L57l45J61
3454Eq8l07R8L33K5J75j82k79l2L05L43k54l95j23O47Jj16l22P7R0%J41Q1l59
$$ plain form
3300 -136 -121 393 -186 -414 -209 7 346 182 46 -316 -172 -59 460 104 -127 -429 265 114 220 -164
3320 -164 -325 -194 148 102 268 153 -39 -479 97 101 97 -597 -303 -88 267 4 -104 -109 -202 -61 627 -22 -455
3343 -455 247 116 335 303 262 -123 81 -61 323 264 -22 -210 -20 177 363 161 -219 -209 -278 284 349 333
3365 333 224 -335 -34 367 9 19 -297 -158 366 44 108 -144 -286 -40 245 203 53 -211 -78 233 210
3386 210 -41 -39 -65 -201 180 279 136 -262 -123 -86 328 109 -435 -294 237 -29 -29 -14 -243 -27 -365 383 24
3409 24 22 -329 -425 35 288 -15 -63 -178 140 -1 322 205 -376 -165 -396 -8 81 -91 -155 -286 72 40 11
3432 11 322 -161 -175 -32 297 167 -97 -160 -235 -8 100 -92 -433 -5 76 116 252 -213 -168 189 -156 5
3454 5 -83 -390 -292 41 66 241 59 -220 -252 53 396 142 -253 -376 271 272 156 -166 -89 1 1 142 223 -136
3478a36o2M8L41L33k66n51L7K58J39j16P1j49K02k52L39l95q4M0K09P2q5l31J06
3501b32R1J91m7j00j55L6K61l6K73J1o26L91j01l0M02k20l80L91l89J72J22j43
3523a18R5J17J35k47j7j80j65K33L89k56r2j51n6M68L2o4j11k36K81J55l04M2
3545e0J13n90Q36k17J16j66K8l46M94j06k0J57k53J12l04K71p6k58O3K02P8J31
3567B15l18L34n72N15K86o94L21r4J89j62k48J2K66o8J73M1m9k95J09j38K36o4
3589ej74j96r4L19J20J79j51j93L42m1N0l54K68j19K43K9l1l24O1L2K21m23J81
3612f0j40l41M45K11Rq5j72J34r6O3Q1P7n43L71N1k13M12k91Q4J00l25M00M1l98
3636a85L43l15L1L23l04M8n8J22K43j14k54J4mK47M2j56q1l3q9O23k17r3l09J04
$$ plain form
3478 -136 -198 -150 191 524 258 -293 -256 2 141 25 96 -53 149 -103 236 -159 -243 -203 6 78 -7 -338 -232
3501 -232 -141 50 3 -97 -252 -216 45 9 282 293 -333 58 -43 -73 329 109 -271 120 -269 -97 25 -118
3523 -118 -23 94 229 -18 -35 -215 -380 -147 242 -14 -106 -257 -313 155 187 123 12 -224 57 212 -92 -50
3545 -50 63 -527 309 92 208 42 70 -276 218 112 92 249 -4 108 -196 75 -1 -259 -196 6 84 215
3567 215 -103 231 -341 174 460 -234 87 -7 182 20 -228 -216 50 -18 155 196 147 -148 -39 -177 59 -5
3589 -5 -179 -375 -469 -150 -30 149 -2 -195 147 106 156 -198 70 -49 194 223 192 -132 -71 -39 182 -241 -60
3612 -60 -200 -541 -96 115 124 39 -133 1 -95 -32 49 126 -417 -46 5 -208 204 -87 -3 97 -228 172 213 -185
3636 -185 158 -157 -126 197 -107 -59 -117 5 248 134 -120 -106 -110 137 179 23 -58 -91 -180 443 226 133 -176 -72
3660g2K85k70J68j81Q4J73m8o2j31k8J1K35j96j92L24k42O5PL2j27K28J21m9J23
3684B58n67M50k75J17L48J12m31n7l28M06l13O97n72L2J9K45J20k23k87R6J12
3705d1K93r4j57k39J8K12J18L75l19l53J79j00L70k21p7j01J90j62K77J39l82
3726g5J75j91K33J62n74K48L25j48M2r7m56K29J43L84l04j87K24k05J06r6J41
3747G9L2k32K05J09j10o3p6J56k32Q5L88j19k70J8L07J98m21k28q8K21O6O9K53
3770C47m69J12j50N74m36pj12J09K7K39n16K3l2L35K55j06l06J67J05m1J24j92
3792E0J51m22M7L18J68m22m9M4K55M0k25j93L18j56L30l68J02LN4j69J93m3j32
3815a06P5o0j96M28m7k99M78o06M23j57J80j19R1k66L19Q9l57J42l2Q6L2q7n8
$$ plain form
3660 -72 213 -57 111 -70 14 187 139 77 -54 -82 -71 164 -32 -224 100 -142 -77 -70 -38 -165 63 184 135 258
3684 258 -309 141 -134 -17 331 443 12 -45 -373 33 -280 417 -155 -123 -104 141 261 38 -249 -153 -41
3705 -41 252 158 1 -238 -220 -8 110 485 166 -187 -8 -108 262 41 -36 -137 53 -109 168 307 -75
3726 -75 100 -91 142 304 -270 -22 303 155 197 100 -356 -127 16 400 96 -91 133 -72 34 -62 79
3747 79 111 -121 84 193 83 20 -56 100 -132 -47 341 222 -48 -30 277 475 54 -174 -262 -41 25 94 347
3770 347 -122 -10 -160 414 -22 -29 -141 -32 -5 234 -282 -259 -291 44 299 193 -113 54 159 118 242 50
3792 50 201 -221 -174 144 312 -110 -159 -115 140 180 -45 -238 80 -76 254 -114 -12 -9 45 -124 69 26 -106
3815 -106 -31 -91 -287 141 94 -205 273 -333 90 -67 113 -6 85 -181 138 227 -130 12 -20 66 98 11 -47
3838d7l03K71o0K8O8J62j96K61k60L12P6p4k27J92k13j10K58N2o5K41L1j11l74
3861h8J90n5j22o4J35j46L07o31N91k84K12j52J78R9k51l02l6P67k44Q8j88j95
3883a91K42k6J20j6j24J10j88L3j8M70q35L63l07K66K25Kr9J88l11Q2J12j65J22
3906E5k48K84k5M7n13N58q6L92k53l33J29k84J08J28K63k92M5J8j65j3n6r6N91
3929B54m25K77r7J19n9J78k96j02L6j9K84o5K49l60k23K36K7k12J74J41l66L24
3951G5k9K33j75k22J81J00k96L10J25k18l65J72j53J31O3R2r9j52K64O2J78m49
3973a72L04m89J39L99k82R0j66O8K90k90m3M14l29k33N26l42N6j78M53M1m24N38
3995C70m52L6L9j4M2k30M47l76O7L38k88l2K02k54N59n03j48K94j13J04Pk32j02
$$ plain form
3838 -47 -350 -79 -139 -111 -43 119 -77 184 -76 236 312 238 11 203 -10 -120 138 190 125 366 397 286 -88
3861 -88 102 47 -75 -139 -4 -150 157 -474 117 -167 45 -107 71 170 -81 -383 -419 348 104 192 4 -191
3883 -191 51 25 145 129 5 115 -73 -40 -58 412 -423 -60 -367 -101 124 126 27 215 -96 -14 98 -67 55
3906 55 -193 91 66 113 -400 158 72 464 211 -122 7 -277 -169 -41 222 -70 -25 -7 -172 -185 -241 -337 254
3929 254 -171 106 9 128 69 247 -49 -151 -115 -134 150 85 334 -26 -249 -13 14 -198 -24 117 -249 75
3951 75 46 279 104 -118 63 163 -133 177 302 84 -281 -109 -262 -131 -68 24 -75 -227 37 99 277 -172
3973 -172 132 -357 -218 181 -101 -11 -177 -109 181 -109 -152 262 -67 -300 226 -116 -60 -238 215 256 -168 370
3995 370 -82 -46 -7 -21 21 -209 238 -138 -71 267 -21 -53 149 -105 454 -49 -197 97 -16 88 95 -137 -239
4018b39M9K01k01L21j96K99j19m57O48m31k5J20M60n54LR0J90l71J29J04K54j29
4040A46k27L32k87J93O0k46o5j69J09J58K35K9l89J38r1K43n00K62J27J30r6K87
4062C79o02J99p5r1K93M1k99m7j76P45r1j70k0j84J7M74m47o3K43j77j06l8K62
4085F7m0j24J88n9j38N4l66N76m09J80J11J09j3r8J50k73J76l27L78k8q6k03J36
4108c9J56k09j69K94k35J3K73k53M40l97M76m28nL03k85o4M6K67k54J28L02l77
4130a7K40k74j4j26M23j73m8j02J02j05K26j85L21l80L33k53P1k31l12P62k80
4151b2k17Q3R6o5Qn3P4j35K56k5j49M2K14k86L41k66QJ81k0k22L92j45j21J82
4175A51q3n6R4j1L02n71M95l55Jr0J61l3l16N89n04K66J4N8m0j08K6j04r7L25
$$ plain form
4018 -239 -190 11 -190 131 -65 234 115 -342 306 -125 -150 -30 430 -124 -121 -31 159 -212 -83 21 275 146
4040 146 -81 251 -36 157 217 -29 -94 -263 -154 4 239 268 -121 17 -74 169 -331 -69 58 188 92 379
4062 379 -223 -24 -99 -190 103 144 -155 -202 -378 367 276 106 86 -98 -81 393 -54 -117 126 -51 -157 -195 67
4085 67 27 -97 91 32 -106 -52 -418 158 -251 -71 40 149 136 38 188 -85 91 -236 142 114 28 -175 -39
4108 -39 117 -92 -261 33 -202 -189 84 -169 271 -126 350 -78 -83 220 -65 -129 -83 184 -70 58 360 -17
4130 -17 223 -51 -65 -191 232 59 11 -91 11 -94 132 -53 268 -112 221 -32 39 -192 -504 258 -22
4151 -22 -239 -156 -60 -125 -117 -170 -96 -231 25 0 -149 -107 107 -179 162 -104 -96 85 65 -157 235 90 -31 151
4175 151 68 12 106 95 397 -174 321 -34 -33 -123 38 5 -311 278 -226 40 54 112 72 -36 -10 -114 -211 114
4199A14m21M22r5K11j02k30J41L43l14k5Qn4j6j97M16l51O5j32l0L04l1K0J29
4222A75j89K31J9j65l46K14K27J35n48L85k33L1K4j52L37k59p4K01M9K4o0J05
4244A31k63K60r8N7N2n6r9k30K72j43M33p0j71k21K75k99J94k53J30J13j22N1
4266e7j27M59k64k87N88j29m47K82J71J4l11M21l96P4Q1o9m4J12QQ8m98M41j43
4289c3l26K89J91n5k09P3K11Km0q2k52N04k51J94j53l53J32M5J87R3j9jm20J72
4313a01k4J03j36J84j09j32M68j87K36n73M3L69j80J48j50J59k26j28o0K97k6
4334b5j19o3K28j62M3J50l65O46k81j52K54m06J98K76O8m31K25K15l28K61k56
4355b4J98k14J45l4k66N01o5l93K31K6j13o5n5j52M58m9p0k08K16l1j12J22M5
$$ plain form
4199 114 -307 115 20 231 129 -101 40 383 69 44 52 -2 -18 -215 201 -150 -85 -217 -247 57 26 46 175
4222 175 -14 217 236 71 -275 -61 166 301 -247 138 -95 -64 -40 -192 145 -114 -188 13 62 86 26 131
4244 131 -132 128 30 87 139 83 -16 -246 26 -117 316 246 75 -146 129 -170 24 -229 -99 14 -108 -57
4266 -57 -184 275 11 -276 312 183 -264 18 189 203 -108 313 -83 -9 72 3 -41 71 79 167 -331 110 -33
4289 -33 -359 -70 121 66 -143 -70 141 143 103 21 -231 273 22 216 63 -290 -158 -113 74 167 148 147 -273 -101
4313 -101 -125 -22 -158 26 -83 -215 253 66 302 -271 -228 141 -39 109 -41 118 -108 -236 -296 1 -25
4334 -25 -144 -207 21 -141 -98 52 -313 333 52 -100 154 -252 -54 222 290 -141 84 299 -29 232 -24
4355 -24 174 -40 105 71 -195 306 241 -152 79 105 -8 -73 -128 -280 178 129 59 -149 67 36 -76 46 91
4378I1k98J29j6J24J29m47K73J75k02p8N7J69k23J70P0k51J83k91j3J89J40R8
4400A78k95J39j23J12K91l31J33K0j58J13k58L29l07R4J27j8k76K79l7j31K97
4421A78l64L26j76j14N39l74q3J63j06K02k45j14Q0L47j73j08j38k32J76J0J36
4442g0K2P5l0k03M3R8P7j72J71Q0L8k17L40k95m45P25o3n7Kl20P6j66K00K8l3
4467i6J25j50K13k38J55L3j28k5qL61k29j91K48L4j05J47k94K44m09O02J81m47
4489B3K53k31pm5J57J04j15l9r8q6J14K0j6k3k08J98k0l4L49k20L1k83J69k7O1
4514B7K34J65n47N1jm1K02R0j75o2r5L00m95L37K40j70l37j55M28J92k59N3OJ84
4538A72k37j28m3K69n0j68P4N0j54rk64M29n5L24k00p2k07L05K1P7r2J51j63m8
$$ plain form
4378 91 -207 -78 -94 30 159 -288 -15 160 -42 -120 -63 106 -117 53 123 -128 55 -236 -249 -60 80 178
4400 178 -117 22 -101 11 302 -29 104 124 -34 79 -179 150 -157 -63 64 46 -230 49 12 -119 178
4421 178 -186 140 -36 -150 389 15 -68 95 -11 191 -54 -168 -88 259 86 -22 -160 -392 -216 -206 -70
4442 -70 -48 27 -3 -206 -163 -65 12 -160 11 91 129 -88 252 -43 -488 237 174 117 119 -201 -125 -291 -91 -63 -96
4467 -96 29 -121 92 -146 9 42 -86 -111 -119 242 13 -178 70 104 -1 146 -148 96 -313 289 470 23
4489 23 276 45 38 -7 150 254 139 100 2 -84 30 50 34 11 -197 1 -19 -53 296 76 107 -176 -7 -34 27
4514 27 261 426 -121 -70 -71 -112 90 180 5 -57 -152 148 -347 -10 230 60 -277 -432 -4 188 -71 -18 -12 172
4538 172 -65 -193 -236 33 -17 -185 -111 -61 -215 -224 -488 -59 -114 210 10 -62 -269 36 57 134 42 193 30 -18
4562a8o7k8K38j08jJ97m61L33k0j99J64L55m18k5M1K46J1k20q7K90p2j15K67k35
4586F8j72l0K1j1l9K17k4m0k71K59P2J69j36p5K94q0k89J18k63K16k40J26L09
4609A99k62L44k12L45l21k6J14j01m13M82j36k87L67O2m4k5O8j24J4J01Q8m05
4631a72J02M47n50J49J7k2j44J39N5KJ80k92K4L3J30l26L22j86K85n9l58j7J82
4654e9K6J39o7K32q6l66J76j00Q5K42k69L01k5j22l3l7j5J83j57J38m40M20o2
4677A04L1j58m5j27K98p7j44p0L18N0l13K36J13k66K56k24J23k11J15j56L1J65
4699D9J06l22L61k74K94l82J80J46l75K59k97K09k14N66m72M23N3l22L4j20J0
4720h8j06J15J82N4k07Q0j72M92m19J06M7O7l05J29j16j3m0L3K62j8K5l28K07
$$ plain form
4562 -18 -85 -113 125 17 16 213 -248 85 65 -134 30 385 -33 -58 -17 229 240 20 -67 223 151 36 303 68
4586 68 -104 -134 -113 -124 -163 54 30 -10 -281 -22 50 219 83 8 302 222 -67 51 -212 4 -236 -110 199
4609 199 -63 281 69 414 93 67 181 80 -333 149 13 -274 93 155 111 86 154 30 44 145 233 -172
4631 -172 -70 377 -173 -24 -7 -29 -173 -34 21 23 203 -89 -65 -32 98 -228 94 -92 193 134 -224 -241 -59
4654 -59 -33 106 39 271 185 -181 -5 -105 -20 222 -47 254 229 107 74 37 22 205 48 186 -254 166 104
4677 104 135 -23 -68 -195 103 26 -118 -188 130 180 -133 103 216 -50 206 -18 105 -106 9 -147 -116 49
4699 49 155 -167 194 -80 214 -168 12 158 -217 42 -255 -46 -260 306 -166 257 310 -12 22 -98 -88
4720 -88 -194 -79 103 157 -50 30 -142 350 -69 37 84 151 -154 -25 -141 -154 -194 -161 101 83 108 -220 -13
4743a3J80k2j41J27k95J67q8JK01J7k27L37k31jp8J42m68L93%k65K93Q2j79j32
4767b00L60k20q7K26m01O09l3l46K92m98K33J42j00j38M66p0k16q2J03J42n6k23
4789i7R1l08J56L54l43j69N63m33LK86J9k28J46J04k37L25k70m7P3J37k17P9j15
4812a28m8M5K60j53K48l65J48K28l70M02l83J05L11j96j84oK4Q4J39l44K0N87
4834D24m06J7K7l68L46j44j15L10k58K66O2J20k07k8j60P2K21m96J87L18k64K46
4856A70R0n34J19L59k04m22L06J81M2k43P6K44j54k97K5M09k90J32R5j26J73j92
4878d1L82k22M2j29j80L72j79j2K42m2l54L72l82K30o6k08J69J09j41P9J59k11
4900a1n2R7J32l32j2J27KKK37M1l45J30k88L52Q0j67K38l77L48k54p2M59k82r7
$$ plain form
4743 -13 167 145 4 131 -164 3 -85 -84 117 134 -93 244 13 12 -66 76 -392 1 1 -264 29 111 -68 -200
4767 -200 160 -60 -147 79 -322 287 254 -92 200 -298 -65 77 -23 -161 305 235 19 -63 40 182 126 -97
4789 -97 -6 -314 -158 196 -147 -316 247 -186 -183 103 122 -106 40 144 -93 232 -38 -85 -12 125 -92 -13 -128
4812 -128 -176 -131 129 -24 224 -141 7 235 -135 267 -116 -11 300 104 -80 -86 -62 22 161 -183 -163 424
4834 424 18 35 62 -306 40 -104 -219 91 -167 99 161 281 74 46 -114 -42 179 -317 -130 188 -76 170
4856 170 260 -274 -155 204 0 -422 -116 65 107 -136 -60 184 30 -267 -242 167 -123 9 104 -22 151 -41
4878 -41 341 119 161 32 -148 224 45 33 275 233 -121 251 -131 99 33 -175 -6 103 -38 41 200 -11
4900 -11 -63 34 166 -166 -178 -51 -49 -47 190 231 -114 16 -272 80 160 -7 231 -146 202 -52 -124 335 53 -44
4924d4j55Q8m3R8J48j00q1L56k33n0P9k27Q04o73Mk03q2O28m39L08l8J38k33k9
4948B1l48M73r6j54L39j81j64J35R6K86k88m7P2p4j81O4J53L7J23k02j33J95Q5
4971B11k33J67k49L33j23R8j44j43J76R3k68J32J7o2K5K09m03J81J38Q2k63j24
4993a50K49j09RK86N6n92M15n48M12J4J32M8oJk49j0L28j98k46L22j33k50L78
5016A59k34L80k64j13K99l33o1K70M1j87N7j95K03J54j12j66J77m3j20p5L26j72
5038ik13K44qj88L06j22J53q9j89K48p1j32J35k00J93J97l37N3j47O9j30L38q0
5061B1n5J9j16L81m24L40l13K72k4m39L74N0j07L56k45L6l62L16p1R2j42k7K93
5084B25m91J22j41K82p2n8L30k70J83k98K73n8j43N0j68o5L52j1mM1k55N3O5j
$$ plain form
4924 -44 -199 -111 -154 -56 92 -8 -89 267 34 -16 63 -164 640 -33 -29 -232 -314 314 -125 183 145 283 50 21
4948 21 -327 146 50 -104 235 54 -110 25 121 407 119 72 144 70 -111 -47 106 143 266 64 -69 126 211
4971 211 -22 145 -104 229 106 204 60 -83 93 186 -82 50 67 5 30 239 -164 17 155 237 -26 -150
4993 -150 99 -10 -1 285 341 -251 164 -384 28 42 174 222 216 217 -32 -42 286 88 -158 164 31 -219 159
5016 159 -75 305 41 -72 227 -106 -167 103 144 -43 14 -181 22 176 64 -102 75 32 -88 -163 163 -9
5038 -9 -222 22 14 -174 132 10 163 74 -115 133 62 -70 65 -135 58 255 -82 -29 -176 -107 -237 101 21
5061 21 -34 -15 -131 250 -174 166 -147 125 101 -338 36 86 -21 335 90 126 -236 80 9 101 -41 -68 225
5084 225 -266 -144 -285 -3 -75 -133 197 -73 110 -188 85 27 -116 -66 -234 -299 53 42 38 79 -176 -123 -58 -59
5108e9K24k92k3M10m57J90O8k59O9J55K1J12kk84J18j18O2k13K65P0j96l5r9N64
5132B91l34j46M1R8P1K02j79J61j56j06m5N0j67k1L69j10j62j38M02j50J25q2
5154A4l20Q9K62J57m01O86n01P0o8K57l11J29o0J6K06l81M4Q7J09p6j47K25j41
5177e5K4l26j14M77j73M7o7L40r9n2K89l77k43N13l02J97J8j93m8J76j34k9K67
5200A36o6J40k31J85o3r6p1L17m0k63j68L70k76j13K64Q2j33j95m2L12K13j65
5222I7j19L2m8J40qj54K69m0j60J91n0m01RJ75n2m0K69j27j30J44O4j98L47n71
5246c61L53j6P8J10k88J14j59K89n7j47M75r2j57j58K38j51l11N6J83J52l71J67
5268e3J40l40Q0N2L2J06R4n1l80K44J52j3k89M43k63P7j26o4K80j56j30R1L60
$$ plain form
5108 -59 165 -127 -150 260 -197 -7 61 -198 -129 26 47 159 157 -127 -9 -127 -65 -278 -13 57 -139 -174 -273 291
5132 291 -43 -189 -148 -50 21 223 44 205 49 -57 -102 -52 -219 -240 129 19 -143 -281 121 -29 96 14
5154 14 -306 -217 45 202 -199 487 -14 56 -12 245 -66 63 3 19 225 -156 -112 -25 84 8 -139 86 -55
5177 -55 -31 -357 -471 6 -167 -120 -187 153 54 2 291 -86 -329 184 -118 79 97 -96 -144 32 -102 -131 136
5200 136 70 210 -21 164 101 5 -66 251 211 -52 -220 150 -126 -239 25 107 -26 -221 -263 49 262 97
5222 97 -22 10 -38 102 94 -60 209 169 9 200 150 -251 -242 -67 -119 -159 110 -17 -147 -3 61 -137 210 -361
5246 -361 -8 -24 54 164 -124 -10 -169 120 63 -84 391 299 142 -16 222 71 -240 -184 -1 151 -220 -53
5268 -53 87 -253 -173 -121 -89 17 111 60 -320 -76 76 63 -226 217 -46 31 -95 -159 121 -35 -165 -74 286
5291B86k26Qr6M6J72o5j82O8N5k46J34K65k79K67P6m66J59J4l58J62M9M57l99
5314i9J00j04R5K10j37j4p9K28J07j65l44J98j11L9K37p1j48j22K37j52J43k49
5336b01K28J83J3l02j11O21m61m4j40L68k28j35L92j16l0j85J97j32P0K3K3m47
5358d14L25J64q5j96j54M33J52n9l09n7M42k61N6J98m32J39K11J32k35o9K31k02
5380A0l2J26j93p4J15L18m71J50P5j54Q7l33K93k60O29m29j2K22J19k73J45J23
5402A81l94L35j94k7j04n2N9M12j35N7l11K40p3J19jj3J95l18Q6k03N7K97r7k24
5426a08J21j79q0M61k07R8Q7P6k56K9k50K49q7L3L60m95n5L45J25om06J91k0p3
5450d7J15k68J19M44m28j76O66n46J28j47J45m2L78k93o4K95k50j37J18m38L34
$$ plain form
5291 286 60 68 -28 18 190 125 -57 11 66 -180 -46 219 -60 207 283 -183 -24 -10 -368 -206 -157 300 -99
5314 -99 1 -103 -8 202 65 51 -28 200 307 142 -202 -4 -115 -76 161 90 -58 -180 57 -95 48 -201
5336 -201 27 210 223 -79 -190 431 -30 -74 -214 154 -74 -209 183 67 37 -148 49 -83 -13 10 33 -414
5358 -414 -89 75 -10 -206 -360 73 225 166 -143 -200 242 -19 37 235 -197 -58 153 285 50 -19 212 10
5380 10 -22 104 -89 -163 -48 270 -201 -51 24 -130 -43 -376 -83 -343 286 -143 -155 67 186 -87 58 181
5402 181 -213 122 -72 -99 -203 -255 -196 216 81 138 -173 67 -6 113 112 99 294 -24 62 -141 -84 213 116 -108
5426 -108 13 -166 -246 215 8 106 193 269 13 42 -208 41 -46 -13 347 -148 -203 142 267 261 -145 46 26 -47
5450 -47 68 -200 -81 363 -65 -241 425 -121 7 -140 5 -37 341 48 -16 279 29 -108 10 -428 -94
5471i4L0J92j55j9Q5l3j65K27L0m1k59L64k95j53J75K35n35L78J57m3j38j23K83
5494A03M3n6Oj82NJ4k02L78m25N30j23j98N4R3K35o38K88j20Q6k14N34l38L0j18
5518b15on3O04m65L6K31l75L25k42M89l65O8M5O5j52l60L30Q1J6o2J01K62k9k27
5542A02Ml63L99j4P3n0j72N0k47L45j99O5j98K03r8L72k14k3j69P9P9j70J17J11
5566H2j75Q6K68j70J40k15N8N5l40J66j25J18r4J35n2Q4K48m77L9J04N68m73n4
5589b4Qq5K73q1r8J2J97j37j43J54R7k22K57r1J20p7k20n5j20P43m94J28j01J32
5613A73k3j77J89k25n4o5K45j35P1r5j7Q3J78k2k08K24j25k06o2L69N0j55L3j25
5637g9K6Q3J24k34K85m14J18J23n5K7J19j97J65j3l41K49K15n94J72K01l2O5o0
$$ plain form
5471 -94 -64 128 -27 -46 39 6 -159 68 98 57 -202 162 -133 -286 -111 124 -411 -33 124 81 -57 -180 103
5494 103 146 90 96 -86 -81 -67 -269 109 -316 214 91 -107 -53 40 275 -363 -75 -195 -109 -323 211 -127 -97 -215
5518 -215 -221 -274 330 -135 -99 132 -243 82 -160 329 -36 32 77 142 -10 -370 -40 41 57 -5 96 358 329 102
5542 102 106 -257 142 128 201 151 -21 29 -218 127 -72 -7 -205 -2 -100 272 58 35 -134 -55 24 -146 -29 82
5566 82 -93 -7 261 91 231 16 74 129 -211 -45 -170 -52 -146 -11 -63 21 269 -208 -169 -65 503 30 -24
5589 -24 -16 -101 172 91 -7 5 202 65 -78 76 173 -49 208 117 237 160 -60 -115 -235 508 14 142 41 173
5613 173 150 -27 162 -63 -117 -182 63 -72 -1 -96 -113 -30 148 126 -82 142 17 -189 -251 118 168 13 46 -79
5637 -79 -53 30 154 -80 205 -209 -91 32 -23 4 123 -74 91 78 -263 -14 201 -393 -221 -20 -52 13 -47
5660d7m0J71m38L08K57j78P7J28k35K41j21k08M04o61L44k3J13r4j55J71J53l64
5682a97O2R0j9L38l16J61j19l7l7qL1p4o6J81K65l05P6l13L68j99J11j07N6J81
5706A23R1K4m71J21K70k38o6L40j71j83O3K88k5j68L14r1N1n49K07K64l10J62
5728D6J22k36j3K0r4L00j86j10J90L9M0m1J66n4o7l62q6M10j89M95k66m2m5k13
5752a76L36o8k27J94K7n1j57K5o3J07%K28k42R5J04k22J27k94J34R9l2K90k76
5775d2j84K50j01j74K53J7K17m26J48J03j02J12j47J09k39Q1j0J28j39J37N76
5796E67l99k40k5R8p8R5k53J80p1k5L19j39r1OJ75j86j55L88j20k2L97j53m5l88
5820a65K52r0R8k58K15J04k29J79J13j72k68K58L2J52K17m63k05L46l47P7k5K04
$$ plain form
5660 -47 -87 84 -354 -46 211 33 110 238 3 244 123 -85 319 -342 2 -21 92 -2 -157 14 167 -197
5682 -197 -135 -45 -64 274 -42 119 0 -37 -74 -82 -51 -125 -191 -10 255 -50 26 -287 81 -118 -7 -114 -58 123
5706 123 214 238 -233 -112 158 -80 -146 194 23 -160 -97 191 166 -2 312 221 272 -277 -70 194 -116 46
5728 46 168 -68 -81 -61 -155 145 -41 -151 39 78 118 77 243 189 122 -240 -326 84 -105 390 124 82 37 -176
5752 -176 160 92 -135 59 86 35 -122 -97 -160 -53 -53 175 -67 28 132 -90 37 -257 -123 -24 -56 234 -42
5775 -42 -226 24 -77 -251 2 19 236 -190 -42 61 -41 71 -76 33 -206 -125 -135 -7 -146 -9 567
5796 567 168 -72 -97 1 -77 18 -235 -55 -126 -151 168 29 -62 -56 119 -67 -222 166 46 24 421 268 223 -165
5820 -165 87 -3 95 -163 52 156 -73 106 219 47 -221 37 69 221 438 -25 -230 116 -231 -154 -179 25
5842B5k36K06j4N8q5j08J91j37L51l37k56M14K09r6o4k86J07j28J63j18K98l7
5864A20p6J73k38J66l61K83j41K57N4j85j34j11K47L5J32k10J04l1j12Q6k40J11
5886g1K33l83K48k99k94L90M4K58R8l5j09l3M9p2J79Qo0l23J78k94M35l41J67
5909b7K59m81N48m94K41k83J66j09j09J58m8L58k58L63n34J54R2p8J11m5n5J16
5931D5j83K59P0k26J51l20K42j4q5k6J04j01O0K35J28k00l94J67j4N34n26K1O3
5954a0j93j24J18N73l71k76K56jK7j48J17j46Nj7K80k06Q1K76j64m40N34J4l44
5977a59L67l6J87k5l72J12j61n1J63K18n52M19o7q0J21J09m74L95L4q4j10K06
5999A60q4J96l81N9J83q8q6MK4K75j39m52L76j8k69J38K41J21k48j92M68o89N91
$$ plain form
5842 25 -211 -5 -19 39 -46 -154 37 -100 251 -86 -342 72 281 185 121 -165 -58 -186 -23 -141 157 120
5864 120 44 217 -21 145 -216 67 -74 183 237 52 -82 -193 54 89 221 11 115 84 -28 58 -182 -71
5886 -71 162 -221 27 -272 -566 -176 -132 126 224 189 80 47 96 24 203 211 151 -172 6 -288 147 -194 -27
5909 -27 232 -249 299 -195 46 -237 -71 -180 -289 -131 -179 179 -79 284 -250 -96 -4 -82 29 -16 -71 45
5931 45 -138 121 191 -35 116 -204 38 24 -61 -87 17 -84 -24 211 339 139 -255 -88 -102 432 -94 -73 -10
5954 -10 -203 -327 -209 364 -7 -283 -27 -28 -1 -149 -32 -178 -173 -190 90 -116 -35 241 77 -363 171 185 -159
5977 -159 208 172 359 334 -38 74 -87 -138 25 243 -309 110 43 -37 84 193 -281 114 148 64 -46 160
5999 160 76 272 -109 -50 133 45 -41 -37 -13 262 123 -329 47 29 -240 -102 139 260 12 -180 288 -401 190
6022A90J42l44n4K90j02jn1J0r0j09K97l64o8J87j16J41l24M39k23q6L4N90m80
6045i2l0K65%j51m65R79m34j18k36K68R3Q7j04J50j26m19M62k13N3j59R9M03l18
6068fr4O8j83J53j51K37q0n3J51K23m51M98m06l08M20j29K09K07k43j94J74l04
6090b62K94j81J22qn4N1k19M11o6L24o76K01L00j87n7j2J66k07K0qL6J14m50K85
6114f3K41j48j41J21PP5j71K2O0j49Q5K60M7l21J61j96k03M22n0R0l8o1j29p3
6138a52Q3K3N8R0m34N0M04j98r9J97Q9Q9J28k46q4K5K76k17l44J91P4k31L67k84
6162a45M48o49J91j5Q3K19m33K37O7L5J41k66P1l9J88ll51p7K33J06j79mQ3j74
6186b33K51J70k8R6m95K72q0R0k36m1K91J08n17L78J13o6l7J27j14k12L81l31
$$ plain form
6022 190 332 -12 -66 224 122 121 70 80 -10 -119 178 -186 -254 -67 -183 -42 -366 73 -150 -236 -202 388 -92
6045 -92 -122 143 143 -8 -473 506 72 -46 -282 -14 79 166 62 212 86 -333 129 -84 -31 -190 -91 312 -6
6068 -6 -100 -32 -215 -62 -213 24 -56 -109 42 265 -186 312 -94 -402 18 -111 98 305 62 -132 42 -262
6090 -262 32 -149 -27 -35 -89 -38 -257 154 88 412 -264 -63 237 50 -7 -19 147 -60 -40 -48 -12 102 -348 -63
6114 -63 178 30 -111 10 17 92 -79 -57 3 -146 -61 199 246 -75 86 -110 -313 109 59 149 111 50 -79 -152
6138 -152 -69 -46 12 102 -332 -282 122 -76 -175 22 111 200 328 82 -2 23 299 82 -262 -71 3 -228 139 -145
6162 -145 303 -346 -155 -170 -87 132 -301 -64 3 38 179 -87 -16 -55 133 130 -221 -298 -65 41 -138 -142 -59 -233
6186 -233 18 188 160 256 -239 33 -47 43 -193 -234 57 165 -352 26 139 73 36 163 49 -163 218 -113
6208a13M11o24L65j33J56k81N14k74k1J45n8m34M93J2n49O42l42O6j2q2M5K95
6230B21l14M9l76O30o8K6k88K22j10J10k69M15j20n2q9j17J08k60m17J050l99
6251d8K30m28M00j16k29J44k5k53J44p6n0L50q7L4j97K00L78l54k7J49k19N1K99
6274B70n67K29J32j3l49L24M5PJ28k28Q2K71n78K26J47j09m3J18K03l89K20P5
6296B01j88j22K37k55J8J17r2K71j15j15L98k95k58K17o8j14L75J10n87P1R6J35
6318C7k1K0l2j7j64L80k77p9J89O1q7M3k75L64j53J38k56l6L43j67K78l20J02
6341G1j48jK16m32L86J9O8N1m15N2L59l32K52j92P1m0o6k3J4L95j19j90k57j68
6365d29N00K9k71K61l31M98m87K62k62K05K03k30K64l72N7L32o46L04K31j62j25
$$ plain form
6208 -113 298 -326 39 -94 62 -219 295 21 0 145 87 -347 146 158 -391 251 -91 -25 -37 -119 -74 221
6230 221 -93 -44 -420 210 142 168 -120 102 -8 102 -167 248 128 76 -13 -130 -22 -282 -699 351 -48
6251 -48 182 -246 154 38 -191 -47 -72 -325 -181 -257 -307 43 -44 -10 -207 -7 371 17 -10 139 -80 -29 270
6274 270 -297 -68 64 51 -298 26 71 78 206 -22 60 331 -247 -21 126 17 -26 92 295 -94 126 201
6296 201 13 -109 128 -127 -109 8 -84 187 72 -43 355 60 -198 19 -49 -163 212 322 -265 -194 -98 37
6318 37 16 36 4 -13 -177 203 -74 -153 36 97 10 53 -222 142 -11 127 -129 -165 178 11 289 -31 71
6341 71 -77 -78 138 -294 92 111 179 230 -185 -133 226 -106 146 -46 25 -15 -81 -104 -90 305 186 -4 -261 -429
6365 -429 71 100 -171 90 -241 257 -230 32 -230 -25 178 -52 212 -160 -103 229 -417 -113 118 -44 -169
6386a69j74K12j82O7M46k94K52K1l6K7k28K81l35J32k53J24O4J30lo6l2J11J35
6409B30n55M55j95o1Q8j88K25J39N2j78j06o2J25K8j47J72k63M42n4N8n17M08
6431I6n0o2J07k76K33k15O3J58K61l52j37r8L38k38M51n14N02k14j26m4K66p9
6453G0l40K96M3l84N1K96jK71n82K87L15m14pK99m10L97m5j6k05K47n4l40J65
6476f1j32K66J12k70J90j2l48K6L36j28K8N5j72L57m97J30Q7r3Q6j03J71J42m55
6499b85L08J00l9J4Q0J70j38j90J52j74k37P7n0K10k42K30j47L84k69m6K16n7
6521F7k19K07k29K87m47M99j63o5L06k12K2N3K7M7K6k36L24l28n9J71j64K63j29
6544D8l54K19J54j18K05l87M03L2j61J21m37M17m10O18k62j39L13m58J16O9q1
$$ plain form
6386 -169 -343 -131 -313 -246 200 -94 158 179 143 170 -58 223 -112 20 -233 -109 -45 85 82 16 -16 95 230
6409 230 -325 130 -65 -126 -38 -226 -1 138 190 12 -94 -156 -31 -3 -150 22 -241 201 147 205 -312 96
6431 96 46 -16 91 -185 48 -167 -104 54 315 -37 -174 -272 66 -172 279 -235 267 53 -73 -117 149 70
6453 70 -270 26 69 -315 -264 32 31 302 -280 7 322 -92 -99 200 -210 187 142 126 -79 168 114 -226 -61
6476 -61 -193 73 185 -85 105 93 -255 -229 107 -21 7 62 -110 247 -250 -120 -33 -126 -40 -143 28 170 -285
6499 -285 23 123 84 98 178 348 210 20 172 -2 -239 -162 -212 -2 -244 -14 -161 223 -46 -92 124 67
6521 67 -152 55 -174 113 -334 165 2 -63 243 31 53 106 133 180 206 -30 294 -34 -93 78 -86 177 48
6544 48 -306 -87 67 -51 154 -233 170 202 41 162 -275 142 -268 350 88 -51 262 -196 -80 -11 -92
6565i2J4J80ql33J69L37j00k01K40j81p5j19J66k17R8K55j60N5k12k3K17n9K29
6588A80n1l45L03P4k02K25j2K03j94l32M00m17k2M15j80k83M66k63k37l4M56j4
6610A36oj98j85L56l17N35l68O1N5N4k18MK25l19K88n4m8J97k44o9L6K31l20M2
6634a26J39P9j82K23N3m03K5J85K53n29L41k66L73J87k25l03K12j62K83k73J75
6655E9j39O8l4J58l78K27M73q8q1k80Nj65L52j31jj10n5K52k03l4q6J39R7j66
6679a21j63M67j28n9O8k79J94R5Qm3J54l60J69J69k3o9j75J89j5r0j43j39L03
6702IJ32r9l05L20J30l68J25J85j68j27N43l47j03K79j78R9m79L01J82m11L75
6723I5k74K15j33J49r0J44R5k56j46lL4J23J11K79j98m3j71L26l74j37L89j33
$$ plain form
6565 -92 -78 102 94 -239 -70 267 167 -34 206 25 -50 -169 -3 -220 -122 133 -27 28 -184 -207 10 -49 180
6588 180 129 -216 87 161 -41 184 172 375 181 -151 249 -168 -190 225 45 -238 228 -35 -272 -306 150 136
6610 136 130 -68 -253 103 -214 321 -47 14 69 123 -95 -91 134 -185 103 49 1 198 -46 -115 -79 152 -168 -126
6634 -126 13 92 -90 133 186 -217 -192 -7 246 -283 58 -208 165 352 127 -176 36 -126 157 -116 59
6655 59 -80 -12 -46 112 -266 -39 434 346 265 -15 -10 -175 177 46 45 -65 -120 132 -71 -105 -191 -52 45 -121
6679 -121 -284 183 55 -4 64 -215 -21 74 82 39 193 -167 2 171 148 79 -96 93 78 -12 -155 -294 9
6702 9 141 42 -263 57 187 -181 -56 129 -39 -166 377 30 -73 206 28 127 -352 -51 131 -280 95
6723 95 -179 36 -97 52 -38 106 201 -55 -201 -204 -170 -47 64 343 145 102 -69 257 -117 -254 135 2
6745BJ2K18Jl20L61l06k86M39q7k3j30J74m5l63K81Ql37L57j00j02J29Q0j01J55
6769A7k9k1r9L65l87K82p0j9n6KJ37kj61r7j4J40J02r5j19K06K5l66M48l89k7
6794b27K09k51M31k53J96k66J00j2K54k0j65j00L26m18N0j52J18J66l0J81l0l5
6816G2M7k92K23k16m1P1M5K86l67M4J03P4K52k72j80l0J65J11l9K30j99l3j00
6839d6q3O3kL87m57k09L99n7J17k57P9pl8L22j07l48L46l31M4J07J25J70j56j04
6863d3K05m56m1L51j21j94K59L47q3m6j66Kp5ON4O1j40J16l3O3O8J36O1l96J5
6888e0r6K08k75K6J33M38n08Q6J33k39O1P7l4R7N3k42q2J26LJ83R6j58k10Q7K09
6913A22n8j66L12k52K3l15M11j47O0j09K23Rj17P7l7Q8L6j23N7j55K29r2k45L58
$$ plain form
6745 2 14 232 233 -87 274 -32 -318 121 34 11 -119 55 10 -353 -72 -64 -401 -44 -144 -246 -117 -37 -138 17
6769 17 -12 -33 -132 233 -154 128 58 39 -17 -15 122 120 -41 -138 -152 -12 90 -5 -124 82 107 -259 189 -200 -227
6794 -227 -18 -269 162 -91 105 -161 -61 -73 181 161 -4 -104 222 -196 -146 -298 -180 -14 -44 137 107 72
6816 72 119 -173 50 -166 -207 -136 -91 195 -172 -128 -25 49 301 29 -151 -181 -16 95 56 286 87 54 -46
6839 -46 -129 -66 -68 319 -138 -347 52 -5 112 -145 -66 -73 -111 211 104 -244 102 -229 -185 -78 47 217 61 -43
6863 -43 162 -294 -335 16 -105 -299 -40 307 224 178 12 14 -61 -55 -1 60 -80 36 3 66 134 270 331 -65 -50
6888 -50 -146 62 -213 -187 -54 384 -124 -38 95 -144 -83 -6 -40 57 110 -132 -214 -88 -85 98 194 36 -174 -87 122
6913 122 64 -102 210 -42 -19 -334 77 -70 -10 -119 104 113 -4 73 36 124 160 37 94 -61 168 76 -169 189
6937A89K8l8n08J26L72K45m67j37L02K38r3k12n2j12n37R25k72r7o4J36Q4J30
6959A86j69P0j07k78L40r0r6L21j47j64P3Nk9r3L46p3k72j97O57r5n24L59L67
6982C90k92k40j4L94n18N98k8Nn48J02K52J00k50l6K65k71L7K01k1J38J15k16
7004A63m82J63K70J60l22N4K11j97j73K46k38L2L9L77ll81m3N7K72j19k79K09
7026A6K38j28J40j61q0QM3j58k7M20k13J22k52k20J24J46k87L14j02j1K40j54
7048A8j83K91l93N48l73k11M16J83l96O1o7K6J77n2o3j6R6o2k33J41J46j57K17
7071A14l4p5O8R3l71L42K71o39L4J45j57L29l67K76L48n79M23l78K4K20j35j74
7093b22J51J8J15l2o8j99J70L6L34k85j05L57k86J39j43k52O64k73l87R1J79K5
$$ plain form
6937 189 217 179 -329 -203 169 414 -53 -190 112 350 257 45 -7 -119 -656 269 -3 -100 -164 -28 56 186
6959 186 17 87 -20 -298 42 -48 -144 177 30 -134 -61 -56 -85 -178 168 95 -177 -374 283 188 -336 23 390
6982 390 98 -142 -156 238 -280 318 290 295 -253 -151 101 201 -49 -85 180 -91 -54 147 126 264 379 163
7004 163 -319 -156 114 274 -48 6 217 20 -153 93 -145 -113 -74 303 300 -81 -124 -67 205 86 -193 16
7026 16 254 126 266 105 25 33 76 -82 -109 311 98 220 -32 -252 -128 18 -269 45 -57 -68 172 18
7048 18 -165 126 -267 281 -92 -303 113 296 -100 -39 -106 -80 97 45 -18 -34 62 0 -233 -92 54 -103 114
7071 114 80 5 73 166 -205 137 408 -231 -197 -52 -209 120 -247 29 377 -202 221 -157 -133 87 -48 -222
7093 -222 -71 -53 62 30 -38 -237 -67 -31 303 18 -87 270 -16 123 -20 -272 392 119 -268 -177 2 27
7115B7k37L70p0k29K15K22l97k0r3K09m7M08m43l78N17m9j13L08m79L38L4j61
7137f8L5Q6j84K86J11j93j28k50J65MK43q0L17n90N33k14K0j62n0M18J4l80j77
7160b44K96j33J24K24l5M3k12m32N03R2O3l91J03j77L76k86p4K19j81oj12Q9K15
7183F4m9q3l4j43J56j4Q9J75l13K67n62N88j90J34j43R3K00l57K54k32k62M71
7205A09j77k6M2K83j37J29j46l9l65M22q1k83J50M65o26J61Jo3K66l55J19K30
7227G9m77O9M57j11j79J59rl63N41Q8k90L39m38L3L96N4m29K75j53j78L47j43
7249F7q4J03m59K72K47k62J81p1j67L61k82K11j42p5J18J5m49M48j08K86k98J23
7271C5k39K15K62l43K16l23L15l50J87k12Q5J71n0j26J42J33N9k34N7j83J58Q2
$$ plain form
7115 27 -210 160 90 -139 76 298 -99 -119 -212 -3 -50 358 -85 -463 54 5 -108 200 -279 59 93 -68
7137 -68 -33 53 -131 155 266 73 -55 -305 -140 -136 107 27 344 -246 287 73 93 -69 -119 299 313 -67 -244
7160 -244 52 -81 43 267 232 275 63 -369 134 226 289 -102 1 -176 200 -86 -160 59 -122 -128 -240 -151 64
7183 64 15 -68 -102 -245 -89 -103 -14 161 -152 115 -447 141 -49 85 -58 35 235 -122 132 -100 -362 109
7205 109 -68 -94 -52 231 94 223 77 38 -327 95 14 -269 -119 346 -280 -119 -118 -181 85 -270 -151 79
7227 79 -398 -329 128 17 -162 -3 -12 -375 166 254 -36 303 -135 -102 294 348 -81 194 41 -137 210 67
7249 67 -17 86 -373 -101 146 -116 65 -6 -173 188 -94 117 -25 -100 18 33 -416 32 -76 210 -88 35
7271 35 -204 11 273 -70 146 -177 138 -212 -25 -237 -152 19 -31 -157 -15 118 177 -57 0 -183 -25 57
7293E7j56j16J88J67j85r3K92J13k01q2l54M11Q0k55R5J26k61Q7P8r7j95M27p0
7316E6k60J49L30j51j98j04L28k26p6K09m3J73n27N19n12K51O9r2rR5L55k38l42
7339b44M89l93J95k05M21m93J75J27j3j28j26M37n36M56l13K17l16L51k17pL43
7360B20l16K09R1j47J56m23L66k88J66J65N7l08J57J2o6j08k83M20j59K39j18
7381D2k0r9J4k3j2M18j16j08j0j44L5M1j23M4p0O2O0K91k79m8o6J67o8j83K35
7406D0R3r0M6k19%R1j58J63J3m1j24J64J28j03n9J40k14P9m9J49j4M8K0K08j43
7431A68k88K66j69m8J12K40l44j32K6m2J49r7L56J94n14K10J62l87r8j64J19N53
7453B72k44j79L62j86Q4R8r1j31J75k66J24j56l13N47J25j2m87L00L6J15J07k34
$$ plain form
7293 57 -99 -215 -27 140 -45 -138 154 267 66 -16 -370 41 121 -134 -39 87 -174 -87 -9 -106 -301 126 56
7316 56 -204 -55 275 124 -74 -178 150 -76 -152 57 14 187 -340 179 -333 -82 -13 -105 -114 -19 336 98 -244
7339 -244 245 -148 47 -158 263 -230 -55 72 59 -69 -195 242 -294 162 -151 66 -250 101 -116 -123 220
7360 220 -96 113 204 57 213 -210 156 -132 34 199 256 -52 105 117 51 -57 -340 80 -79 160 42
7381 42 22 -77 -63 -86 -98 320 204 96 86 -58 -23 18 -105 -61 -131 -69 -9 282 3 -45 -111 56 -12 -195 40
7406 40 133 43 89 -130 -130 -39 -197 -34 -21 -62 -186 -22 106 3 -56 84 -130 -51 -100 49 35 83 103 311 168
7431 168 -120 146 -23 -71 41 281 -63 -195 -169 -211 -62 -159 197 391 -123 87 249 -138 -236 -400 -281 272
7453 272 28 -151 211 25 109 207 116 -15 160 -106 18 -138 -451 96 221 209 -278 22 58 173 280 46
7475D6j62L8J42j87J21q2K44q6l5j99J01J09k22j08M71k95K37j08K4k11j91J58
7497a95O6p9M5L20j89J11k67L61j16n11N67j41k42N11j49Q5l36K80q1L8J95k93
7519b0J91q2P1q2r0N4pJ36j64J27M5l50R6K15m5k1o20Q01k32K12j84J43j59k33
7543a98K92j64K55j96j41J49j40n8K44K9r2K95o21N32k14r8k37L56J07j89K30
7564A41j85J06j48K60m00L69m00K71j88r1L78l8K3j34%k60K06j55J09j15K90j12
7586g3K6M92m04k26J8Q4R3n6L0r3k58O05m10J41k1J62l32N46m10J5K27l50K55
7609F1Q9j78M28k50M8J85n41M9J06L5m4N8M8ok68K86J27k00l25L44j24J60j00
7632a2j71L78n94L36R7J54l86K53l49M13j38J54J6k70J85N12m07M6mk31j73L36
$$ plain form
7475 46 -116 -78 64 -123 -2 -84 160 74 39 -160 -59 50 -172 -280 191 -104 133 25 49 -162 -353 -195
7497 -195 -129 -208 -163 157 -32 79 -188 173 57 -454 113 -28 -270 241 92 177 -159 121 40 78 273 -20
7519 -20 171 89 160 78 -12 42 35 171 7 134 179 -171 -75 140 95 74 -546 255 23 235 51 194 35 -198
7543 -198 94 -70 185 -11 -152 -3 -143 -201 43 72 -20 275 -346 186 -28 -126 -363 -7 100 -89 141
7564 141 -44 62 -86 174 -226 143 -257 14 -174 -265 113 75 98 -36 -36 -296 -90 -245 -136 -251 39 -73
7586 -73 -47 445 41 -185 -167 -83 10 -46 -16 -109 -367 238 -172 -31 -52 110 -222 324 -86 -71 156 -194 61
7609 61 150 -28 400 150 198 383 -158 -109 -3 32 -12 46 94 88 -180 106 233 33 -292 52 -72 88 -12
7632 -12 -183 195 -399 -63 34 188 -198 55 -294 119 -19 135 151 -119 66 578 171 217 213 -18 -191 145
7654A45k54J18J15Q8l61L9R2l19L43j20J30l1j41Q2r7J87M9k60J19L43k05P1j56
7677b3j15J80l9O4j53L18R9l66MN0k68K86J63k00L43l33j7p3L34k61k71L77k79
7700a80j89K31j44n7L91m05K59K57m53P1K96J99P1l41m8J07Q3k09N5J02K3k33
7722a14K79m63J57L58j69k12K32M0K4k11O9J65j32r0N5J01P8k23R2m8o2K81l01
7745i4K09L1j25j50K62k38J77q0m9q6Q5k09L3L2J95n6J03j04KJ36j11l08N65m32
7769b12p2K53k22L32Q0j75j7k07K07L66k53K0K33J14l98lP7k33J80j01J64k84
7791a51K38Lk23k0L5J22j27L80k06j19k47J45L64j66N6k4j20L29l65K05j79M6
7813b4K31j09J30n4j69K07j94p9l0QK78j26R6l83O21j48j5m02L07k05J3R8J27
$$ plain form
7654 145 -109 9 124 212 -149 -110 -18 -337 6 -114 16 -15 -156 -74 -171 16 65 -195 -76 267 62 133 -23
7677 -23 -138 42 3 67 -86 232 331 -35 -31 19 -249 37 200 0 343 10 -7 -80 254 -7 -278 99 -180
7700 -180 -369 -138 -282 -339 52 -353 -94 163 -290 -219 77 276 347 6 -42 65 148 -61 -6 96 119 -114
7722 -114 165 -298 -141 217 48 -164 68 108 132 -79 -10 155 23 -67 -12 89 167 -56 36 -12 -74 207 -94
7745 -94 115 146 21 -129 133 -105 72 -8 -57 -143 -58 -267 -234 -202 -7 -63 40 -64 -62 74 -37 -345 220 -212
7769 -212 -284 -31 -253 79 159 -16 -33 -240 -33 333 80 100 333 447 49 46 123 -110 70 -31 133 -151
7791 -151 87 90 -133 -153 -118 4 -123 257 51 -68 -315 -170 194 28 84 60 -60 269 -96 109 -70 -24
7813 -24 207 98 228 174 5 212 18 -61 -91 -83 195 69 165 -218 403 255 240 -162 145 -60 -47 51 178
7836A78j73J04J75n07M40m14J6J96n2M2j1k92N35pk13j27l9O6j30K97J06j60q7
7859e7K60q9q0oJ43l06J25l3j23K24m9J53j33k7J87n2k99L15j78J55j55k7J50
7882I8j00K90p4j00j52R6r8K5K48k10KoR1R2R0N1l64l29N38J30n71K21l41J73
7906b00M87j91J08l16L6L59k56m8K5L4Q2m3j99l1j29K10L14Oj65j06K65J61k83
7929A20J58k42J9l40L17J43m85K91k8O2j55K83k49K3P9k67J91n9J36K6l65L39
7951cK77j97o2k6J18l05K05k09L79m44K93r0j21L63k60J22M20n21q7L7K13M1j74
7974c1l5K53r4m8N1J16j60j27m8L7K22j06j10p6K59k60K10k91Q7J70j6j83M10
7997B30K5o40M56O5p3J27j56j20Q1J05n9k64K72J46l22J40j01J53L8k63K27j15
$$ plain form
7836 178 5 109 284 -223 217 -197 -181 15 -37 5 -6 -298 237 230 17 -110 -149 -83 -213 84 190 30 -57
7859 -57 203 114 34 28 171 -135 -10 -43 -166 58 9 162 29 2 189 137 -162 153 -25 130 -25 -52 98
7882 98 -2 288 214 114 -38 58 -40 -15 233 23 25 19 110 202 292 343 -21 -350 188 318 -253 -32 -373 -200
7906 -200 287 96 204 -112 -76 283 27 -21 4 38 120 77 -122 -153 -282 -72 242 248 83 -23 242 403 120
7929 120 278 36 55 -285 32 175 -310 -19 -47 15 -140 143 -106 -83 -4 -271 -80 -139 -3 23 -342 -3
7951 -3 274 77 15 -11 107 -198 7 -202 177 -267 26 -64 -185 178 -82 40 460 -61 -148 -111 102 143 -31
7974 -31 -66 187 93 45 96 212 52 -75 -123 -86 136 30 -80 -156 103 -157 53 -238 -151 19 3 -180 230
7997 230 255 -385 71 136 63 190 34 -86 -5 100 41 -223 49 195 -127 13 -88 65 103 -160 67 -48
8019d8n4Q3j7k58N34k78K1l00M04M8p2j89K7J07k87K72q9K91l06J39j1k0l51L77
8043B3J25r0J99m07L36l10j05N08m19K57Lk30J80k96P0j14K12M8j04R4K91k34
8065C7j47M8L05J69l62q6P6k33K87j08J19K46m72J34L33l66M8o9J69P4m58N79
8087C23m59L42l65L12k30L3K57J51k21j82J87k39L99k34j02k11M21l56L18p1j21
8108d8k08J58j25l09M37l7K72k10J4L31j6m85L32Kl74J13K28l97K98j18K39m30
8130c33J59rk1r0K17J07J49j02N4m05N24l09o7J21l1P5l58K05j71Q5rL3m1K72
8154E5j23R0j7q0K01j80K10J54l68J20j20L98l68k12L59j91J53nj40K35l47NL14
8177A43k03P3j93M73n98P1L78l0j54M06k05J08k17m07
$$ plain form
8019 -48 -102 -19 -36 -294 240 -38 -17 -317 87 135 63 -126 -99 8 -279 -7 -96 195 -111 28 17 -3 -354 23
8043 23 148 58 257 -150 186 -124 -229 279 -140 117 120 -110 70 -226 -156 -270 -58 -10 -114 -20 271 37
8065 37 -110 -62 243 412 50 -36 40 -193 94 -14 105 351 -121 13 346 -20 28 -41 128 202 -256 323
8087 323 -136 206 -159 153 -77 -44 213 364 143 -39 148 -91 308 74 -28 -239 182 -174 144 73 -48
8108 -48 -256 -98 -223 -532 -95 -132 140 -70 -56 275 259 -226 106 108 -266 -153 75 -322 -24 -142 97 -333
8130 -333 -174 -183 -204 -294 -77 30 179 77 131 -274 250 -59 -126 -5 -36 39 -319 -114 -285 -200 -209 -176 -217 55
8154 55 -68 22 5 -75 126 -54 156 310 -58 62 -58 340 -28 -240 119 -72 81 76 -64 171 -176 -171 143
8177 143 -60 13 -180 293 -305 -234 144 114 -40 366 161 269 52 -355
8191c55
$$ Imaginary data points
##PAGE= N=2
##DATA TABLE= (X++(I..I)), XYDATA
0@%%%%%%%qJ6j6J6j6K4l2L4m2N6o4P2q8J04j20J39j63J87k13K44k77L15l56L99
31B11m50N07n66O32p06P85q72R69j073J188j317J458j613J785j980K200k449K734
49A443l064L453l916M479n184O097p330R096j1851J6783k8300J00191O1436k12359
63f9026l9383N6466P9722O7598o320j52708p2492J06425J26711o433q1514q6552
75g7506j6417Q7046J10717j4482j19288q0906M4323J12301O9013o2846j28662
86g6707l4956R6556R9187R130q4594j08429J095J33251Q3225o7538j03468l4061
98h7309M0739R6457N8513p6274j20786l771R8930P6375r391q2231q2506J6757
110g4497J08835O9436n2835j07096m3421O7206J06848K0782r1885q9096J1300
$$ plain form
0 0 0 0 0 0 0 0 0 -8 8 -8 8 -8 16 -16 18 -24 32 -32 40 -48 56 -64 75 -88 99 -114 130 -147 168 -188 211
31 211 -239 268 -298 334 -372 413 -459 510 -563 625 -692 766 -847 938 -1042 1158 -1291 1443
49 1443 -1621 1832 -2084 2395 -2789 3308 -4022 5074 -6777 10006 -18294 81897 143333 -69026
63 -69026 -108409 -51943 27779 95377 89057 -63651 -136143 -29718 96993 90560 9046 -77506
75 -77506 -93923 -6877 103840 89358 -29930 -110836 -66513 45788 114801 51955 -76707
86 -76707 -111663 -15107 84080 93210 8616 -99813 -98718 34533 117758 50220 -53248 -87309
98 -87309 -46570 49887 108400 32126 -88660 -92431 6499 82874 73483 -8748 -91254 -74497
110 -74497 34338 103774 50939 -56157 -99578 -32372 74476 95258 3373 -85723 -74423
121g4423Q5053P4045j1382j02831p4643N8149J06948K0881n9608p1719l2740N5264
133b7006J02960J3019j01226p6000L0814Q2258N3155k2322q8813o0898N2078J05340
145F3359K5265p8303q0462q71P1747P2045n394q4670o6202L0813Q9043M6545m6337
158C6578q6452k8786N9331P7359J3817o3441p6871k001Q2519O8178k7642q4360
170c1771m3589L6857P7583L7960m8520q4502j9118O8112P3302l773p1911n9421
182f8791J6041P4183N0575k8974p8910l8387M6699P7037J9102n6854o7882n883
194f2044O2331O3687p539p3005n4160K7477P5855L6599m0972p0033k3947M8089
206a7662O9644J1466o2347o2730Q836O6794M8314j9489o6882m0826L1727O9886
$$ plain form
121 -74423 10630 84675 73293 -29538 -104181 -46032 60916 81797 22189 -49530 -82270 -27006
133 -27006 75954 88973 -12253 -88253 -57439 24819 77974 55652 -33161 -94059 -41981 63359
145 63359 88624 10321 -70141 -71012 735 72780 67386 -17284 -83486 -52673 36370 82915 36578
158 36578 -49874 -78660 -19329 58030 71847 8406 -68465 -70466 12053 80231 52589 -31771
170 -31771 -75360 -38503 39080 77040 28520 -55982 -75100 -6988 66314 62541 -9370 -68791
182 -68791 -52750 21433 72008 43034 -35876 -74263 -27564 49473 68575 11721 -56161 -62044
194 -62044 287 63974 56435 -16570 -70730 -43253 32602 69201 28229 -41804 -65751 -17662
206 -17662 51982 63448 1101 -61629 -52793 14001 62315 42826 -24056 -64882 -33155 36731
218C6731K8324m6107o6673j2235N4938N9292j384o0274n2247J4692O5507M2277
230F2841k9121o6993k8247M0800O3378J4915m8749n8315l650N6587N2839j1946
242D4339o1350m1309K4038O1553L1445l4438o2152j8721M4592N7759N956n2265
254e53n1532Q207N6377M2612j9318n9504l2258L0548N8493K0922l9614n5986r439
267e1045M8599N0393m005n2569m2668J4299N6489L4143k6680n6630k2942L6453
279a6163N3529J1896m3523m9509j96M9333M2927j1291n3001l4153K2004N3212
291B5065K5300l1391n2807j4311M0180M8778K501m5548m2478P473M9470L5569
303D7801j8297n1901k5699K8382M9269J6715l5271m7600o341M2145M3372n463
$$ plain form
218 36731 65055 18948 -47725 -59960 -5022 54270 52886 -7388 -59635 -44943 20564 62841
230 62841 33720 -33273 -61520 -20720 42658 57573 8824 -49491 -53141 3446 56285 44339
242 44339 -17011 -58320 -34282 27271 58716 24278 -37874 -56595 -12003 45756 51712 -553
254 -553 -52085 -43878 12499 55111 35793 -23711 -55969 -25421 33072 53994 14380 -41606 -51045
267 -51045 -2446 47947 43942 -8627 -51295 -36996 19493 53636 26956 -29674 -52616 -16163
279 -16163 37366 49262 5739 -43770 -43966 5367 48294 37003 -15998 -50151 -28147 25065
291 25065 50365 18974 -33833 -48144 -7964 40814 43315 -2233 -44711 -37238 12232 47801
303 47801 29504 -22397 -48096 -19714 29555 46270 10999 -36601 -42942 -797 42575 37112
315C7112m7105l4725J5516M7422K7350k3250m9096j8639L3256M6242O924l8469
327B538m0390J047M2434L7330j2027m6963k8133K1793M5294K0027k7949m5623
339c0622j1166L6871M1735m10m0726l4689Q233M2406L0416j7605m5751k1065K7590
352a4783M2163J1381l0842m0570m027L7917L7002p608m1144k8716J4964M1375
364A7112K2449k1672m2652j4854L0538M0235M270l4684l5064K811L8278L0820
376C7587j1635m1751k2795K0837M0592J3926k6218l8296p091L1551L5893r06l7328
389e634k9934J0093L8102K3196j5829l8754j8405K4237L9111Q326l0147l4096
401b9734j014L2824L1433o410l7824k5296J5823L7812J7001k0810l6298j1245
$$ plain form
315 37112 -9993 -44718 -29202 18220 45570 22320 -26776 -45415 -12159 34083 41007 2538
327 2538 -37852 -36805 5629 42959 30932 -16031 -44164 -22371 22923 42950 15001 -30622
339 -30622 -41788 -4917 36818 36408 -4318 -39007 -30774 11632 42048 24443 -21308 -42373 -14783
352 -14783 27380 38761 7919 -32651 -36678 1239 38241 30633 -10511 -39227 -24263 17112
364 17112 39561 17889 -24763 -39617 -9079 31156 35426 742 -34322 -31511 6767 37587
376 37587 25952 -15799 -38594 -17757 22835 36761 10543 -27753 -34844 -3293 32600 31694 -5634
389 -5634 -35568 -25475 12627 35823 19994 -18760 -37165 -12928 26183 34509 4362 -29734
401 -29734 -30748 2076 33509 27099 -10725 -36021 -20198 17614 34615 13805 -22493 -33738
413c3738K7080L5130K026l1922k9211M568L3484K5376j0979l6435j9537J9325
425a4833L4945J2350k3619l3958o061K9130L2410l538l2994k5881J0505L4032
437A2488J9999j5799l5084j3679K2491L2741O365k6385k9742j94K9989K6798p152
450B2836l2842k0980J3251L3530J5681j9697l2565r201K4773L0798J429k8854
462a841k6697N821L0998K1255j1465l1751j6239J7373L1699R683k3056k9296k632
475b6148K5603K6218k290k8635k2880Q956L1111J7109j5478l0306j1736K0033
487h443L0055N536k5270k7080K043K7706K2215p648k8662j8237J3190K9747J2220
500B7372j8429k8261o152K2068K5807R35k5135k3431N279K7274J9361j0851k8813
$$ plain form
413 -33738 -6658 28472 30498 -1424 -30635 -26067 7417 32793 21814 -14621 -34158 -14833
425 -14833 20112 32462 8843 -25115 -31176 -2046 30364 26826 -6168 -32049 -21544 12488
437 12488 32487 16688 -18396 -32075 -9584 23157 29522 3137 -26605 -26799 3190 29988 22836
450 22836 -10006 -30986 -17735 15795 31476 11779 -20786 -29987 -5214 25584 27013 -1841
462 -1841 -28538 -22717 8281 29536 18071 -13680 -29919 -12546 19153 28836 5780 -23516 -26148
475 -26148 -545 25673 23383 -5252 -28132 -19176 11935 29044 13566 -16740 -28476 -8443
487 -8443 21612 27148 1878 -25202 -23159 4547 26762 19114 -9548 -27785 -14595 15152 27372
500 27372 8943 -19318 -25470 -3402 22405 23340 -1795 -25226 -19947 7327 26688 15837 -12976
513a2976j4185J6549K8769P321k0621k5719l184K4579K4231m365k7484j8221R625
526a5681K6906J4251j3566k7193j0033J8896K6025L796k2965k2599K412K3256
538C505K0065o375k6210j6568J3221K6692J0265j7419k5072m541J9979K3035J99
551B0776k3697k0353O153K5334J5703j1021k4858j1343J4813K4328O641j8309
563D167k3481j504K2485K0068m258k3676j6169Q473K3702J3333j2696k5237p824
576b2617J8032K2497K121k0029j9749K013K1528J8231o954k4573j2962J2706K2737
589A2981Q280j5005k2096m673J9058K0925j534k1402j7276N767K2601J3288r943
602A0971k2015j0152J3918K2175N414j7780k0353K32J9530J6886l895k0531j4600
$$ plain form
513 -12976 -27161 -10612 18157 25478 4857 -20862 -24046 533 24764 20399 -7085 -25306 -15681
526 -15681 11225 25476 11910 -15283 -25316 -6420 19605 23401 436 -22163 -19751 3505
538 3505 23570 17195 -9015 -25583 -12362 14330 24595 7176 -17896 -22437 -2458 20577 20776
551 20776 -2921 -23274 -17121 8213 23916 12895 -11963 -23306 -8493 15835 22476 4167
563 4167 -19314 -20818 1667 21735 17477 -6199 -22368 -13895 9807 23140 10444 -14793 -22617
576 -22617 -4585 17912 20033 4 -19745 -17732 3796 22027 15073 -9500 -22462 -9756 12981
589 12981 21261 6256 -15840 -20513 -1455 19470 17936 -3466 -20742 -14975 7626 20914 10971
602 10971 -11044 -21196 -7278 14897 20311 2531 -17822 -17590 1940 18826 14931 -5600 -20200
615b0200P861K2765J0306j3289k1056n341J5483J9109K327j7796j8553K771K0825
628E212J4367p469k0858j0933J0822K0803P338j4475j9880k700J7254J7735j354
641A5862j9587j4846N929J9326J2079q921k0493q751J3795J9798K993j5204j7698
654a5718K91J7297J5468l637j9796j2356Q459J9356Q429j1471j8056n465J3814
667c385J8429P66j6889j5409L530J7766J3075p405j8636r636J0492J8484O004
680A7186j3372j7695j651J5691J5354j913j6759j3460N556J7836J0382q954j8400
693a0199o616J2465J6507L086j4063j5679L50J7109J3222n160j6830j0106P461
706h453J7018P644j0570j7201l491J3103J5315R79j5769j3498L541J5936J1204
$$ plain form
615 -20200 -12339 10426 20732 7443 -13613 -18954 -3471 15638 17965 169 -18384 -15613 5212
628 5212 19579 12110 -8748 -19681 -8859 11944 19282 4807 -15073 -17773 -519 17216 15862
641 15862 -3725 -18571 -12642 6684 18763 9842 -10651 -19402 -5607 14191 17184 1980 -15718
654 -15718 -15427 1870 17338 13701 -6095 -18451 -9992 9364 17793 6322 -11734 -17199 -3385
667 -3385 15044 15810 -1079 -16488 -12958 4808 17883 10478 -8158 -17794 -7302 11182 17186
680 17186 3814 -13881 -15532 159 15513 13600 -3159 -16619 -11063 6773 17155 8201 -10199
693 -10199 -16815 -4350 12157 15243 1180 -14499 -14149 2960 16182 11022 -5808 -15914 -8453
706 -8453 8565 16209 5639 -11562 -15053 -1950 13365 14344 -1425 -14923 -11382 4554 15758
719A5758o786j6564p477Q807J6748M910j2530j5734q09J4403J2787j576j5085
732c148j2179N828J6478Q065q283j5803n845J1139J5661K096j3818j3324J678
745a1455J4059J1467m023j5634r123P443J5800N717j0067j4849k811J1805J4225
758A2554j46j4584j1461L659J4520R295n903j5511o613R449J4527L431j0818j3684
772a1285r90J2975J2149k404j4210r854N551J4499P166p457j5093m240J0312J3560
786A0679J324j1869j2147J435J3419J0486m668j3897q084O818J3865N616r300
799C677j3547k376J1147J2310q28j2192j0388L286J3081Q662n993j3724n798Q528
813d155J2979L208j0428j2212m01J2155J0593k654j2772q533N053J3134O464p638
$$ plain form
719 15758 8972 -7592 -15069 -6262 10486 15396 2866 -12868 -13677 726 13513 11937 -3148
732 -3148 -15327 -9499 6979 15044 6761 -9042 -14887 -3748 11913 14009 191 -13133 -11455
745 -11455 2604 14071 10048 -5586 -14709 -7266 8534 14251 4184 -10665 -13476 -1671 12554
758 12554 12408 -2176 -13637 -9978 4542 13837 7934 -7577 -14190 -4741 9786 13217 2399 -11285
772 -11285 -12275 700 12849 10445 -3765 -13619 -8068 6431 13597 6140 -8953 -13193 -2881 10679
786 10679 12003 134 -12013 -10578 2841 13327 8659 -5238 -13322 -6504 7361 12977 3677
799 3677 -9870 -12246 -1099 11211 10383 -1809 -12197 -8911 4170 12832 6839 -6885 -12683 -4155
813 -4155 8824 12032 1604 -10608 -11009 1146 11739 9085 -3687 -12220 -7167 5967 12431 4793
827D793j3037l692R830J1824R52j0876j0950J556J2259R241m592j2485o740O442
841e475J2631M484q523j2245j821J0421J1083j069j1746q881L091J2415P306n845
855E826j2295m926P690J1801K576r599j1030J22J0818R664k710j0897q239N038
869f161J1944N280o874j1753l027Q622J0737O92r706r585J428J1041Q303m581
883F360j0974o015N958J1356L779q055j0235j650R193R997j395j0302q309L378
897f914J0932O263n030j1393m108P316J0623J654q616r570N82R495Q547k369j0570
912c158p058M701J1011M006n978j0416k485Q215R615M81r598q596J816J0295O875
927I726l611j0562n411N873J0140L529p714r365j516Q815Q643q91r568p017K787
$$ plain form
827 4793 -8244 -11936 -2106 9718 10670 -206 -11156 -9600 2659 11900 7308 -5177 -11917 -5475
841 -5475 7156 11640 3117 -9128 -10949 -528 10555 9486 -2260 -11141 -8050 4365 11671 5826
855 5826 -6469 -11395 -3705 8096 10672 1073 -9957 -9835 983 10647 7937 -2960 -11199 -6161
869 -6161 5783 11063 4189 -7564 -10591 -1969 8768 9460 -246 -9831 -8403 2638 10941 6360
883 6360 -4614 -10629 -4671 6685 10464 2409 -7826 -9476 -283 9714 8319 -1983 -10292 -6914
897 -6914 4018 10281 5251 -6142 -10250 -2934 7689 9343 727 -8843 -8261 1234 9781 7412 -3158
912 -3158 -10216 -5515 5496 9502 3524 -6892 -9377 -1162 8453 8934 -664 -9260 -7444 2851 9726
927 9726 6115 -4447 -9858 -3985 6155 9684 1970 -7395 -8911 -96 8547 7656 -1912 -8929 -6142
942f142R910N801m889j0060l840O718R418J604p779q606K7R285P829k853r870
957c447n468M298R345M210o057r157k600Q265Q363j58q008p965J884R281N978
972H764l694r197m451M927R104L429p395r003j65P849P651j247q144o964K750
987e786R649M642m829q790k811N322R003J491p852p340P10Q075O356k298q364
1002b822n215M090Q791L353n841q163j765O697P658L00q081o243J789Q083N325
1017G956l392q488m202N317Q686J455n971p976l46P070P272j149q360n699L231
1032d596P898M258m378p996k766N577P702J142p068o474Q36P306N723k006q048
1047b890m473M045P736K477m674p551j401O024O957k08o934o010J657P478N058
$$ plain form
942 -6142 3768 9569 4680 -5380 -9220 -2502 6916 8520 741 -7865 -7838 1447 9276 6423 -3447
957 -3447 -8915 -4617 4728 8938 2881 -6276 -8876 -611 7752 7594 -414 -8379 -6495 2786 8764
972 8764 5070 -4127 -8578 -3651 5453 8882 1487 -7516 -7681 168 7819 6572 -1572 -8536 -5786
987 -5786 3863 8505 3676 -5114 -7925 -2603 6400 7891 39 -7301 -6591 1484 7840 5542 -2822
1002 -2822 -8037 -3947 4844 8197 2356 -5807 -7572 -875 6783 7083 -998 -7241 -5452 2631 7956
1017 7956 4564 -3924 -8126 -2809 5877 7332 1361 -6615 -6961 109 7381 6232 -2128 -7827 -4596
1032 -4596 3302 7560 3182 -4814 -7580 -2003 5699 6841 -227 -6701 -5865 1441 7164 5158 -2890
1047 -2890 -7363 -3318 4418 6895 2221 -5330 -6731 -707 6250 6042 -892 -6902 -5245 2233 7291
1062G291l646p361l083M600O877J992n220p075m50O593N972j404p276m761L223
1077c728O698L933m252p211j998N168P108M96o095o382J112O615N202k546o864
1092b744l860L604O701K676m653o675j005N815N681j04o564n145K050O330M367
1107F474l197o771k680M051O908J459n634n771m79O395N133j356o614m369K952
1122c499O928K754l819o452j619M319N827Q89n546n394J010O082M427k270o473
1137b836l514L558O526J986m364n963j046N456N418l89n922m596J797O065L813
1152E989l146o132k383L886N825J206m507n487j90N537N022j687o147l106K233
1167c087O063K384l436n758j487M259N463O4m932m720J004N451M346k116n722
$$ plain form
1062 7291 3645 -3716 -6799 -2199 4678 6670 1450 -5625 -6075 518 6490 5086 -2190 -6951 -3728
1077 -3728 2970 6903 2651 -4560 -6558 -1390 5718 6214 119 -6263 -5151 1464 6666 4120 -2744
1092 -2744 -6604 -3000 3701 6377 1724 -4951 -5956 -141 5540 5436 -1128 -6273 -4223 2107 6474
1107 6474 3277 -3494 -6174 -2123 4785 6244 610 -5161 -5640 755 5888 4532 -2082 -6451 -3499
1122 -3499 3429 6183 2364 -4088 -5707 -1388 4439 5328 -218 -5612 -4602 1480 5907 3637 -2836
1137 -2836 -6350 -2792 3734 5720 1356 -4607 -5653 -197 5221 4832 -1090 -5686 -3889 2176 5989
1152 5989 2843 -3289 -5672 -1786 4039 5245 738 -4749 -4939 598 5620 3933 -2214 -5320 -3087
1167 -3087 2976 5360 1924 -3834 -5321 -1062 4401 4465 -467 -5187 -4183 1268 5614 3498 -2224
1182b224l445L283N851K080m163n803k96M697M536j89n447m365K028N685L216
1197E444l095n177j973L617M908J108m327n027L91M920L942r84n476l472K280
1212b921N601K394l509m859j392M082M657M55m797m414J134M672L792k366m372
1227a843l102K771N368J562l723m686m79M421M202o05m972l542J485M941L152
1242D950k928m870j781L268M999O44l928m412J13M489M007j507m964k527K031
1257b416M547K479l015m801j024L619M461o9l864l969P20M519L250j663n068j911
1273d205K461M676J257l319m309n99M316L678l31m342l249J381M432K217k274
1288A790m483j235K919M360M10l483l917J53M267L185j369m363k406J667M873
$$ plain form
1182 -2224 -5669 -2386 3465 5545 1382 -4421 -4717 -20 4516 4327 -1120 -5485 -3457 2228 5444
1197 5444 2349 -2828 -4801 -1184 3724 4832 505 -4522 -4131 789 4731 3747 -1729 -5201 -2921
1212 -2921 2680 5074 1565 -3294 -4686 -604 4053 4508 -289 -4703 -3569 1103 4895 2529 -1843
1227 -1843 -4945 -2174 3194 4756 1033 -3653 -4132 289 4491 3886 -1086 -4628 -3143 1798 4950
1242 4950 2022 -2848 -4629 -1361 3638 4282 354 -4058 -3945 544 4551 3044 -1920 -4447 -2416
1257 -2416 2131 4610 1595 -3206 -4230 -611 3850 3781 -83 -4052 -3332 1187 4437 2774 -2294 -4205
1273 -4205 -1744 2932 4189 870 -3439 -4038 278 3956 3625 -717 -3966 -2585 1847 4064 1790
1288 1790 -2693 -3928 -1009 3351 3761 278 -3639 -3486 781 3966 2597 -1766 -4172 -2505 2368
1303B368J442k811l884r09L231L797J29l764l330R13L573L232j746m394j962K648
1319a467M099J185k995m008k71L674L375o55l758k895J418L956K410k475l927
1334b334j433K766L976N21l220l531M68L229L311j099m239k069J698M043J428
1349C515k395l625r20L208L244j13l449k764P08L277K732j212l898k053K335L901
1365B491P99k658l541j11L413K912p99l257l114J924L441J730j930l569j064K569
1381g64L289O08k912l092K23L120K593q68l453k121J873L296J615k364l300r41
1397c198K870L306P8l667k578M84L393K426j173l646j679K107L528P78k172l303
1413b446n52K873L307j062k779k179R45L299J801j632l523r49J762L507O39k953
$$ plain form
1303 2368 3810 999 -2885 -3794 -563 3234 3363 -401 -3731 -2818 755 3987 2241 -2153 -4115 -1467
1319 -1467 2632 3817 822 -3186 -3457 217 3592 2937 -821 -3716 -2298 1658 4068 1593 -2334
1334 -2334 -3767 -1001 2975 3496 276 -3255 -2787 442 3753 2654 -1585 -3654 -1956 2087 3515
1349 3515 1120 -2505 -3425 -217 3027 2914 -535 -3299 -2591 686 3418 2206 -1692 -3745 -1410 2491
1365 2491 3290 632 -2909 -3020 393 3305 2506 -751 -3865 -1941 1500 3230 1300 -2269 -3333 -764
1381 -764 2525 3133 221 -2871 -2648 472 3065 2197 -1256 -3377 -1504 1792 3407 1043 -2257 -3198
1397 -3198 -328 2978 3056 -611 -3189 -2705 688 3114 1941 -1705 -3384 -1277 2251 3029 857 -2446
1413 -2446 -2998 -125 3182 2120 -659 -2838 -1893 1406 3207 1575 -1948 -2897 -1135 2372 3011 58
1429E8k724K36K950K478p71k896k218J473L072J335k433k878m03K137K943J92
1445B551k650k487N52K817K294j568k909j615K049K945P45k117l112q2K688K417
1461B518l80k761k104R25L008J588j521k807r51J747K662P68k571k520N0K812
1477D63J937p16k830j516J166K971R90j671k613n78K066K314N54k729k271J81
1493b282L154J725r41k458j963J689K985N92j747k740k55K368K530r71k175k039
1509b528O32L346J099j268k453j282K070K364J39k016k317L97J837K042n53k405
1525h96j554R29K695J543k123k290m63J915K045L91k499j581j3K403J622o51k737
1542a264j277J710K000J213j931k299o59K503K087j60k389j826P79K495J608j285
$$ plain form
1429 58 -2666 -2430 520 2998 2227 -669 -2887 -1414 1658 2993 560 -2318 -2721 -584 2359 2551
1445 2551 -99 -2586 -2034 783 3077 1509 -1400 -3015 -966 1979 2724 607 -2505 -2587 101 2518
1461 2518 2138 -623 -2727 -1802 1206 2794 1273 -1534 -2485 -738 1924 2692 121 -2399 -2349 463
1477 463 2400 1684 -1146 -2662 -1496 1475 2465 794 -1819 -2397 -331 1983 2537 -192 -2463 -2282
1493 -2282 872 2597 1656 -802 -2765 -1076 1909 2501 754 -1986 -2241 127 2657 1686 -489 -2528
1509 -2528 -1896 1450 2549 1281 -1172 -2454 -384 1980 2119 103 -2214 -1817 20 2062 1509 -896
1525 -896 -2450 -1521 1174 2717 594 -1696 -2159 -244 1801 2192 -307 -1888 -1901 502 2124 1473 -1264
1542 -1264 -2541 -831 1169 2382 451 -1848 -2507 -4 2083 1923 -466 -2292 -1513 982 2590 1305
1558A305k870o20J633K024K90j337j992n37K437J890n43k328j304N24K681J170
1574B423j610k314j011J978K366n2k021j811L67K401J534q52k043j695J622K182
1590A464P51j950j911j92J816J937j1k611j527P70K175J661j825j576j062J308
1606g83K461J83j500j883l50K044J923m62k208j160R00J733J201j396k119n08
1622a924J585J783P27k297j530K08K252J098n63k332r89J076K161O14j537j874
1638a542k21J543J681K01k073j715Q03J836J010m15j856r63R86J725O42j601j491
1655a450LJ416J254K40j753j209L01K024J221j064k079o69J462J798M03j972j385
1672a459n1J862J243l32k033j047J057J554J193j589j860N4J291J656Q0j643j517
$$ plain form
1558 1305 -1565 -2185 -552 1472 1762 425 -1567 -2104 333 2223 1680 -648 -1952 -1428 1253 2423
1574 2423 813 -1501 -2512 -534 1832 1780 -241 -2052 -1685 716 2250 1398 -645 -2340 -718 1464
1590 1464 2215 265 -1646 -1838 -22 1915 1904 -707 -2234 -1464 711 2372 547 -1029 -2091 -783
1606 -783 1678 1861 361 -1522 -1872 172 2095 1633 -575 -1735 -835 898 2099 703 -1416 -1924
1622 -1924 -339 1444 2171 -126 -1656 -1448 804 1902 1339 -993 -1982 -906 1255 1869 332 -1542
1638 -1542 -1763 -220 1461 1662 -411 -2126 -1323 513 1523 1108 -748 -1711 -725 1000 1642 41 -1450
1655 -1450 -1447 -31 1223 1463 -290 -1499 -1198 826 2047 983 -1096 -1765 -303 1495 1898 -74 -1459
1672 -1459 -1510 352 1595 1263 -770 -1817 -760 794 1987 398 -1462 -1408 -117 1539 1619 -24 -1541
1689a541j19K232J614j157j986r69J260J818L86j038j963K32J525J282k31j688
1705c43j453O88J858Q53p28k277m28J575J333P98j796j564j07J940J513o08j675
1722d21j515R12K113N25j090j667n14J167J936J83j653j554J67K122J271j417
1738E65j658l55O19K064M65j240j853N9J652P53n2j500j102K20K143P63o55j967
1756a079n01J326J154N75j087k097M03J392J404n66j423r20N18J700Q08j027j914
1773a334L8R67J687j04j398j286L74J205J504j010j126j280J320J377M36j160
1789B10j543pJ437J496j46j491j524O23J602P81q13j660m82Q25J773L66j347j345
1807a245J74J148J243j08j534j114N98J705O46p32j800l45J184J472l09j213j280
$$ plain form
1689 -1541 -1660 572 2186 1029 -957 -1926 -666 1152 1538 500 -1463 -1231 294 1576 1345 -343
1705 -343 -1796 -1108 750 1603 875 -1402 -1830 -255 1078 1876 80 -1484 -1591 349 1862 1254 -421
1722 -421 -1936 -1024 1089 1614 524 -1143 -1657 -490 1446 1629 -24 -1578 -1411 711 1982 565
1738 565 -1093 -1448 -829 1235 1700 460 -1393 -1334 318 1071 1019 -481 -1583 -1363 780 1543 888 -1079
1756 -1079 -1580 -254 900 1475 388 -1709 -1306 86 1490 924 -499 -1419 -901 799 1607 580 -1334
1773 -1334 -1296 -329 1358 1254 -144 -1430 -1056 149 1653 643 -483 -1763 -443 934 1370 210
1789 210 -1333 -1340 97 1593 1447 -44 -1568 -945 657 1438 625 -1035 -1517 -692 1081 1447 100 -1245
1807 -1245 -1071 77 1320 1212 -322 -1436 -838 867 1513 781 -1019 -1364 -180 1292 983 -230 -1510
1824a510M48J387J226r98j120o24N88J442N76j114j570J91J046J506j84j266j332
1841a308L22J753Q28p40j684n51P87J808M6j010j417lJ328J000j73r44j205M80
1859f83J478M20q00j268m48R81J375L20j509q69R5J366P58o44j286n62R55J227
1877I06P21j300j257k83P79J804j96j585r22Q00J175M90l62j597m50R35J373K19
1895A250j137j397J23J434Q67l31j091p88M82R32Q19r10j272k2P33J376K68j467
1913a31r08j28J703P55k25j621q88Q15J287M51l84j515n85J262J114J99j462r07
1931a168L04J416M33k94j273o29O93J670m4r25j109K09O80J157N9j384r19N68
1949e56J436P02r07j625j84P62J256J79j282q63j39J325R65l04j333o68M70J701
$$ plain form
1824 -1510 -1062 325 1551 553 -567 -1191 -603 839 1415 301 -1269 -1078 -32 1474 1290 24 -1308
1841 -1308 -986 767 1595 855 -829 -1380 -593 1215 1261 251 -1166 -1169 159 1159 986 42 -1163 -683
1859 -683 795 1215 415 -853 -1301 -320 1055 1375 -134 -1003 -908 458 1216 572 -714 -1276 -321 906
1877 906 1627 327 -930 -1213 -434 1370 1174 -411 -1333 -533 642 1132 770 -827 -1277 -342 1031 1250
1895 1250 113 -1284 -1161 273 1140 809 -282 -1070 -588 344 1163 253 -1019 -1041 -308 1068 1336 -131
1913 -131 -1039 -1167 536 1291 1066 -555 -1443 -628 659 1110 726 -789 -1374 -112 1002 1201 -261 -1168
1931 -1168 -864 552 985 691 -582 -1211 -518 1152 1108 183 -926 -717 -37 1120 1179 -205 -1124 -556
1949 -556 880 1582 675 -950 -1134 -372 884 1063 -219 -1082 -1221 104 1069 765 -568 -1236 -766 935
1967I35P30j410j035j00Q10J066j75o12j436L24J150Q31m70j180m94O16J263J55
1985I68r62r18l13J169J203n1j551p47M52J345Q33j028j042k29O96J103K48j257
2003h1j094L59R09P83j23j183o95R32R17K85q80q62m78J029J127K11j226j271
2021a341N30J113N97k3j402n59J154O94L15q79j129N4J287R23o45r92o57K83J285
2040F08O63q96r35o42R53J368l32r29q69L64O52R90l06j083m58L02J066N83n54
2059E45j129j18P88P58k34l76j382L86J263P48n90j386l74P92J230j49o51r76
2077h55j11Q25R68j50q22r21M57J203M55m08j272j68N77R86K96r32q90J64R13
2096C15K29K42j080m89N2J273K96n90q14l72Q54R47P6j140j037N71Q47O70j12
$$ plain form
1967 935 1665 255 -780 -880 -70 996 821 209 -1227 -903 247 1078 608 -572 -1066 -450 813 968
1985 968 6 -912 -1225 -56 1147 1096 -455 -1202 -750 595 1428 400 -642 -871 -175 928 1176 -81
2003 -81 -1175 -816 93 876 753 -430 -1125 -193 724 1009 129 -733 -1211 -182 945 1156 -70 -1341
2021 -1341 -811 302 899 876 -526 -1085 69 763 1078 199 -930 -876 411 1334 689 -303 -960 -677 608
2040 608 1271 375 -560 -1202 -249 1119 787 -142 -1011 -647 5 995 689 -394 -852 -550 516 1099 545
2059 545 -584 -702 86 844 610 234 -1148 -762 501 1249 659 -727 -1101 -309 921 772 121 -855
2077 -855 -966 -141 827 677 -145 -1066 -609 594 1049 641 -631 -799 -222 764 1060 128 -762 -598 315
2096 315 544 786 -294 -783 -731 542 838 248 -566 -938 -84 863 939 -201 -1238 -667 180 850 738
2115G38r89o76N86Q59O42q87j207n8R19P53m63o01o14O97Q72N08m70j085l49N75
2135b50Q58J80n62j110O9J316M25l56j002m20M31P16N53n36j266j96J122Q94J64
2154A030j103q47j26J191R30l73j227j60J10J237J57n40j100J97M35J054j0j089
2172b34p56L86J075M26m24j272O3L50J248J15j035o65K5N70J137q1j214r47Q97
2191c36J157L65r05q38J34M26O01L48j135p13K25O77R42l58j151k38O43R16K46
2210A006p01j016J39O28M43M1o82o57J53J054P12j007o91m09J035O62R5q64o43
2229g02j68O47P46m14k09j198P55O88N59o05p14l78J090P36k17o71o73J21Q84
2248B77M65j31j023n89L53J451M08j216n27n00J431L75J69r95o65L25Q10O70n68
$$ plain form
2115 738 -251 -927 -341 518 1160 273 -934 -992 -73 680 217 -384 -998 -301 571 1079 609 -476 -825 -250
2135 -250 608 788 226 -884 -815 501 926 570 -432 -852 -421 295 848 312 -954 -1150 -28 866 1030
2154 1030 -73 -920 -1046 145 1075 702 -525 -685 -575 662 819 279 -821 -624 -189 865 855 -234
2172 -234 -990 -604 471 897 473 -799 -736 -386 862 977 -58 -723 -698 -128 1009 928 -286 -1233 -336
2191 -336 821 1186 281 -557 -423 3 604 952 -183 -896 -671 6 948 590 -561 -799 -156 760 1006
2210 1006 305 -711 -572 56 499 540 -142 -799 -646 408 1120 113 -578 -987 48 710 805 -59 -702
2229 -702 -870 -223 523 109 -100 -1298 -543 145 704 99 -615 -993 97 833 616 -55 -728 -607 277
2248 277 742 611 -412 -1001 -648 803 1211 -5 -532 -1032 399 774 943 -52 -717 -392 418 1088 520
2267E20j106m50Q35J176m10n49p74L94N55O20l87p68k66M0Q72N66q88n99L8L95
2287a86Q79N4r73n83L43Q50M05k97r28m25L76J106K51n82q84o7O16Q24j31j230
2307e82l85M59J111O12r74p47k97M31J155Q4q00p21j65O72P60Nr86k59L4O50N20
2328E77k03r25J02M28O01K31j005p93R01L95Q3K5o42n95M09J075l9m56q70J49
2348e52N03O73m66m17n76M68P35K57m21p53j57M84J024m4q47o42L17N40M87q0
$$ plain form
2267 520 -586 -1036 -201 975 565 16 -758 -364 191 811 424 -344 -610 -570 302 868 -20 -619 -581 -186
2287 -186 693 747 -226 -809 -466 384 789 492 -436 -861 -485 621 872 290 -594 -661 -45 779 648 -582
2307 -582 -967 -508 603 1215 241 -506 -803 -372 783 867 67 -654 -819 -147 613 618 -368 -627 -593 57 577
2328 577 374 -551 -449 -21 580 811 -194 -987 -86 309 392 417 -225 -820 -411 664 625 169 -701 -552
2348 -552 -49 624 158 -259 -835 -367 368 625 204 -549 -706 -222 802 758 -89 -731 -414 126 613 533
$$ [...]
8191b51
##END NTUPLES=NMR FID
##END=
