##TITLE=1H_DE-68_oil
 D2O
 8 sc, 
 8.10.2024
##JCAMPDX= 6.0         $$ Bruker NMR JCAMP-DX V2.0
##DATA TYPE= NMR FID
##DATA CLASS= NTUPLES
##ORIGIN= UXNMR, Bruker Analytische Messtechnik GmbH
##OWNER= root
$$ XWIN-NMR		Version 3.5
$$ Tue Oct  8 14:53:44 2024 Russian Standard Time (UT+4h)  she@DPX200
##.OBSERVE FREQUENCY= 200.1318
##.OBSERVE NUCLEUS= ^1H
##.DELAY= (6, 6)
##.ACQUISITION MODE= SIMULTANEOUS
##.ACQUISITION SCHEME= undefined
##.AVERAGES= 8
##.DIGITISER RES= 18
##SPECTROMETER/DATA SYSTEM= spect
##.PULSE SEQUENCE= zg30
##.SOLVENT NAME= CDCl3
##.SHIFT REFERENCE= (INTERNAL, CDCl3, 0, 15.7039)
##AUDIT TRAIL= $$ (NUMBER, WHEN, WHO, WHERE, WHAT)
$$ ##TITLE= Audit trail, XWIN-NMR		Version 3.5
$$ ##JCAMPDX= 5.01
$$ ##ORIGIN= Bruker BioSpin GmbH
$$ ##OWNER= she
$$ F:/spectra/data/she/nmr/H-F/1/audita.txt
$$ ##AUDIT TRAIL=  $$ (NUMBER, WHEN, WHO, WHERE, WHAT)
(   1,<2024-10-08 14:52:36.53 +0400>,<she>,<DPX200>,
      <created by zg, POWCHK disabled, PULCHK disabled
       configuration hash MD5:
       00 E9 B6 7A A2 85 ED C7 34 08 36 98 17 FE 4E 26
       data hash MD5: 16K
       5D C7 0C 71 3C B8 D1 19 BC 29 6B 59 8E 1A F4 FA>)
$$ ##END=
$$ 
$$ hash MD5
$$ 7E 2E EE 47 ED C0 BD 83 26 6F B5 63 D0 9E B9 2B
##$RELAX= 
##$RELAX= 
##$RELAX= 
##$RELAX= 
##$RELAX= 
##$RELAX= 
$$ Bruker specific parameters
$$ --------------------------
##$DU= <F:/spectra>
##$EXPNO= 1
##$NAME= <H-F>
##$PROCNO= 1
##$TYPE= <nmr>
##$USER= <she>
##$AMP= (0..31)
100 100 100 100 100 100 100 100 100 100 100 100 100 100 100 100 100 100 
100 100 100 100 100 100 100 100 100 100 100 100 100 100 
##$AQSEQ= 0
##$AQ_mod= 1
##$AUNM= <au_zg>
##$AUTOPOS= <>
##$BF1= 200.13
##$BF2= 200.13
##$BF3= 200.13
##$BF4= 200.13
##$BF5= 200.13
##$BF6= 200.13
##$BF7= 200.13
##$BF8= 200.13
##$BYTORDA= 1
##$CFDGTYP= 0
##$CFRGTYP= 5
##$CHEMSTR= <none>
##$CNST= (0..31)
1 1 145 1 1 1 1 1 1 1 1 1 1 1 1 1 1 1 1 1 1 1 1 1 1 1 1 1 1 1 1 1 
##$CPDPRG= <>
##$CPDPRG1= <>
##$CPDPRG2= <>
##$CPDPRG3= <>
##$CPDPRG4= <mlev>
##$CPDPRG5= <mlev>
##$CPDPRG6= <mlev>
##$CPDPRG7= <mlev>
##$CPDPRG8= <mlev>
##$CPDPRGB= <>
##$CPDPRGT= <>
##$D= (0..31)
0 1.2 0 0 0 0 0 0 0 0.06 0 0.03 0 0 0 0 0.0002 0 0 0 0 0 0 0 0 0 0 0 0 
0 0 0 
##$DATE= 1728384756
##$DBL= (0..7)
120 120 120 120 120 120 120 120 
##$DBP= (0..7)
150 150 150 150 150 150 150 150 
##$DBP07= 0
##$DBPNAM0= <>
##$DBPNAM1= <>
##$DBPNAM2= <>
##$DBPNAM3= <>
##$DBPNAM4= <>
##$DBPNAM5= <>
##$DBPNAM6= <>
##$DBPNAM7= <>
##$DBPOAL= (0..7)
0.5 0.5 0.5 0.5 0.5 0.5 0.5 0.5 
##$DBPOFFS= (0..7)
0 0 0 0 0 0 0 0 
##$DE= 6
##$DECBNUC= <off>
##$DECIM= 24
##$DECNUC= <off>
##$DECSTAT= 4
##$DIGMOD= 1
##$DIGTYP= 9
##$DL= (0..7)
0 120 120 120 120 120 120 120 
##$DP= (0..7)
150 150 150 150 150 150 150 150 
##$DP07= 0
##$DPNAME0= <>
##$DPNAME1= <>
##$DPNAME2= <>
##$DPNAME3= <>
##$DPNAME4= <>
##$DPNAME5= <>
##$DPNAME6= <>
##$DPNAME7= <>
##$DPOAL= (0..7)
0.5 0.5 0.5 0.5 0.5 0.5 0.5 0.5 
##$DPOFFS= (0..7)
0 0 0 0 0 0 0 0 
##$DQDMODE= 0
##$DR= 18
##$DS= 0
##$DSLIST= <SSSSSSSSSSSSSSS>
$$ [...]
##$SUBNAM2= <"">
##$SUBNAM3= <"">
##$SUBNAM4= <"">
##$SUBNAM5= <"">
##$SUBNAM6= <"">
##$SUBNAM7= <"">
##$SUBNAM8= <"">
##$SUBNAM9= <"">
##$SW= 24.0689170037331
##$SWIBOX= (0..15)
0 0 2 0 0 0 0 0 0 0 0 0 0 0 0 0 
##$SW_h= 4816.95568400771
##$TD= 16384
##$TD0= 1
##$TE= 0
##$TE2= 300
##$TE3= 300
##$TEG= 300
##$TL= (0..7)
0 120 120 120 120 120 120 120 
##$TP= (0..7)
150 150 150 150 150 150 150 150 
##$TP07= 0
##$TPNAME0= <>
##$TPNAME1= <>
##$TPNAME2= <>
##$TPNAME3= <>
##$TPNAME4= <>
##$TPNAME5= <>
##$TPNAME6= <>
##$TPNAME7= <>
##$TPOAL= (0..7)
0.5 0.5 0.5 0.5 0.5 0.5 0.5 0.5 
##$TPOFFS= (0..7)
0 0 0 0 0 0 0 0 
##$TUNHIN= 0
##$TUNHOUT= 0
##$TUNXOUT= 0
##$USERA1= <user>
##$USERA2= <user>
##$USERA3= <user>
##$USERA4= <user>
##$USERA5= <user>
##$V9= 5
##$VALIST= <valist>
##$VCLIST= <CCCCCCCCCCCCCCC>
##$VD= 0
##$VDLIST= <DDDDDDDDDDDDDDD>
##$VPLIST= <PPPPPPPPPPPPPPP>
##$VTLIST= <TTTTTTTTTTTTTTT>
##$WBST= 1024
##$WBSW= 4
##$XGAIN= (0..3)
0 0 0 0 
##$XL= 0
##$YL= 0
##$YMAX_a= 39377
##$YMIN_a= -36771
##$ZGOPTNS= <>
##$ZL1= 120
##$ZL2= 120
##$ZL3= 120
##$ZL4= 120
##$ABSF1= 10
##$ABSF2= 0
##$ABSG= 5
##$ABSL= 3
##$ALPHA= 0
##$AQORDER= 0
##$ASSFAC= 0
##$ASSFACI= 0
##$ASSFACX= 0
##$ASSWID= 0
##$AUNMP= <proc_1d>
##$AZFE= 0.1
##$AZFW= 0.1
##$BCFW= 1
##$BC_mod= 2
##$BYTORDP= 1
##$COROFFS= 0
##$CY= 11.3945322036743
##$DATMOD= 1
##$DC= 2
##$DFILT= <>
##$DTYPP= 0
##$F1P= 15.6554695791079
##$F2P= 12.8336369535428
##$FCOR= 0.5
##$FTSIZE= 0
##$FT_mod= 4
##$GAMMA= 1
##$GB= 0.15
##$INTBC= 1
##$INTSCL= 1
##$ISEN= 128
##$LB= 0.24
##$LEV0= 0
##$LPBIN= 0
##$MAXI= 10000
##$MC2= 0
##$MEAN= 0
##$ME_mod= 0
##$MI= 1.114404
##$NCOEF= 0
##$NC_proc= 0
##$NLEV= 6
##$NOISF1= 3.799351
##$NOISF2= 2.8
##$NSP= 1
##$NTH_PI= 0
##$NZP= 0
##$OFFSET= 15.70392
##$PC= 1
##$PHC0= -26520.82
##$PHC1= 26.38747
##$PH_mod= 1
##$PKNL= yes
##$PPARMOD= 0
##$PSCAL= 0
##$PSIGN= 0
##$REVERSE= no
##$SF= 200.130013532006
##$SI= 16384
##$SIGF1= 3
##$SIGF2= 2
##$SINO= 400
##$SIOLD= 16384
##$SREGLST= <1H.CDCl3>
##$SSB= 0
##$STSI= 0
##$STSR= 0
##$SW_p= 3612.71676300578
##$SYMM= 0
##$S_DEV= 0
##$TDeff= 0
##$TDoff= 0
##$TI= <>
##$TILT= no
##$TM1= 0
##$TM2= 0
##$TOPLEV= 0
##$USERP1= <user>
##$USERP2= <user>
##$USERP3= <user>
##$USERP4= <user>
##$USERP5= <user>
##$WDW= 1
##$XDIM= 8192
##$YMAX_p= 0
##$YMIN_p= 0
$$ End of Bruker specific parameters
$$ ---------------------------------
##NTUPLES= NMR FID
##VAR_NAME=  TIME,          FID/REAL,        FID/IMAG
##SYMBOL=    X,             R,               I
##VAR_TYPE=  INDEPENDENT,   DEPENDENT,       DEPENDENT
##VAR_FORM=  AFFN,          ASDF,            ASDF
##VAR_DIM=   8192,          8192,            8192
##UNITS=     SECONDS,       ARBITRARY UNITS, ARBITRARY UNITS
##FACTOR=    0.0002076,     1,               1
##FIRST=     0,             0,               0
##LAST=      1.7004516,     0,               0
##MIN=       0,             -36771,          0
##MAX=       1.7004516,     39377,           0
$$ Real data points
##PAGE= N=1
##DATA TABLE= (X++(R..R)), XYDATA
0@%%%%%%%%%%%jRj6J6j6J6k4L2l2M0m8N6o5P3q8J04j19J34j51J69j90K14k41K72
35A44l04L36l73M15m59N09n65O25o92P67q49R41j044J160j293J447j625J837k094
54a117K411k817L356m111N270p379J7890n0274L3081K5400k5574P58j7420N3810
68C3284m2016p224K7089j1049O369k0836J6427R044j1480j0135M011L4950m6656
81a8222O939K6458j1011o926j9731N0590k7046k7642M5615k1877R090j7844Q926
94b681K2697l6150J8154m755J0743k770k6914L5453p084j3392l597J8786N952
107A4442l6053K4801O488r317r707N072K3975l2433J0341N847k591P013k7779
120a9901L1650m772j6405J0493o103K2977l1001K869K9275k3446k15j366J8665
$$ y = [0, 0, 0, 0, 0, 0, 0, 0, 0, 0, 0, 0, -1, 8, -8, 8, -8, 8, -16, 16, -16, 24, -24, 32, -33, 40, -48, 56, -63, 71, -80, 89, -101, 113, -128, 144, -160, 176, -197, 218, -241, 268, -297, 328, -364, 403, -446, 495, -549, 611, -682, 765, -860, 977, -1117, 1294, -1523, 1833, -2278, 2992, -4387, 13503, -36771, -3690, 21710, -3864, -3106, -20526, 33284, -8732, -15956, 11133, 84, 6453, -14383, 2044, 11088, -392, -10527, -6516, 28434, -18222, -11283, 15175, 4164, -2762, -22493, 28097, 1051, -26591, 19024, -2853, 6237, -11607, -2681, 20016, -16134, 2020, -2735, 8008, 5238, -21676, 13777, 6693, -6699, -10296, 8490, 14442, -21611, 3190, 9678, 361, -9346, -4274, 19701, -12732, -2391, 3456, 865, 7878, -19901, 11749, 6977, -9428, 1065, -5038, 17939, -13062, -10193, 19082, -4364, -4579, -5945, 12720]
133A2720j0504j9147K4422p23o736j2862J8131P195k4103Q632M219J1813k2224
146i167k934L1735k4068j102J543J1341J749k9873K9012Q61j5214J665J676J8416
160A5640k3995j181J9662n715r486n278K2760q541j4891J0175Q485k011k1521
173a5897J9245P890j7135J659J589J7243k0525o795K4786j0014m419p224J7286
186G689K930k6714J6917O880n643j0428M877J7959j9605k569J0303M942r009j0252
200a1723K0540l882j0083o13R731O229k3110J1627J0542r329n017p33J9117j5681
214b385q537J7425k360m017r712J3403N443j7547M874P461K640j3181N06J5192
228I205q012p051K091J2984p809j2210J5001O80n369o780Q505R326j8215L702
$$ y = [12720, 2216, -16931, 7491, 6768, 32, -12830, 5301, 12496, -11607, -2975, 1244, 13057, -9167, -12101, 19634, -4434, -5536, -3993, 7348, 9097, -20776, 8236, 9097, -6117, -4452, -2776, 15640, -8355, -9536, 10126, 4411, -5075, -10353, 12407, 3866, -11025, -850, 7635, 5624, -15897, 3348, 11238, -5897, -4238, -2649, 14594, -5931, -12726, 12060, 2046, -2373, -9597, 7689, 10619, -16095, 822, 7702, 2059, -8369, -3492, 14467, -5138, -7707, 2596, 7538, -1471, -11723, 8817, 4935, -5148, -5761, 3970, 10199, -12911, -1284, 9258, -71, -5088, -5821, 13296, -2385, -10922, 6503, 4143, 126, -9586, 3817, 9260, -8287, -3413, 4048, 6688, -6493, -5987, 9205, 1193, -5858, -3767, 9217, 1408, -10802, 4199, 4879, -490, -7270, 1235, 10561, -7654, -3952]
242c952Q557r91o253n082J6191m991j1284O469P048k606j2263R424Q051r759n573
257g014P763Q581j4218j870J2084o74p427m985J4819j899j3900P649O168j228
271C849j1454N042J2740j2701m307Q268N693q650p147J4136K84j1098J48J0497
285E300K49j3058M928R395m867r011N030J1102j0337o010R346M167p599p083J2828
300D380K380j2617J928Q503J65j0576J492J1615n349q601N761P581o744o613P347
315F52N845p725n916J0831K094j0575Q16P216J811r776o8J2199n884p713N287
330i06N974l097q873O808P739r920l886Q656K923p843l299R314K338j1300R05
345d467J0483l573p490K639P888k724j0302P369P172q854l246O276M708p465n352
$$ y = [-3952, 4605, 3614, -2639, -7721, 8470, 3479, -7805, -1336, 5712, 3106, -9157, 267, 8318, -1441, -7014, 749, 9330, -4888, -6758, 5326, 4652, -2775, -7760, 7059, 5160, -8740, -1091, 5077, 3849, -7605, -2563, 10177, -2524, -6831, 1437, 7130, -1520, -8667, 5469, 5753, -5345, -5197, 5300, 5549, -7509, -2581, 6814, 1947, -7064, -2034, 9068, -1269, -7279, 2067, 6234, -1365, -8448, 4380, 6760, -5857, -3929, 4574, 4739, -5837, -4345, 7270, 1921, -6680, -919, 6662, -82, -6695, 652, 6497, -1228, -7144, 3687, 5781, -4794, -3978, 3238, 5049, -4727, -4795, 7404, 1520, -6193, -906, 5068, 1971, -6902, -94, 7645, -2275, -6161, 2495, 5418, -2425, -5724, 3590, 5928, -5372, -4467, 6016, 2443, -5047, -2408, 5480, 2756, -7546, -177, 6995, -1859, -5105, 1171, 5879, -1586, -6938]
360f938J1191R57j0228J672P631n19q837J365J0398n261q105O894N498n648o165
375f095O489O565r587l275R781P06p875j429Q560Q67j0418K728R100m644o572
390e099L556O957m381p736P720N361q800k382O888K699p223l102J0069q8r964
405e525L394O592k403o574J753R487n996p529Q500L007n908l581N473N995r871
420c186k354J0479k103o528N39O579Q13r992L532Q692o919m232M760M352l785
435F47o793P649M550j0069L82O722J12n542k369R296j117r641N373N437l935m708
451d006K372P597o176o110Q748K104o668j716N438L357q164j649R961k576o858
466d346K755N083q05p915L540Q144p531l374N526K766m115n460Q002L047r329
$$ y = [-6938, 4253, 5210, -5018, -3346, 4285, 3766, -5071, -3706, 6692, 1431, -6674, 220, 5718, 70, -6095, 394, 6959, -2628, -5903, 3878, 4584, -3291, -4720, 3840, 4707, -5711, -2983, 6117, 1473, -5099, -1543, 5414, 1033, -6703, 1017, 6378, -2422, -4804, 2084, 4783, -2440, -5542, 4527, 4439, -5525, -2131, 4461, 2058, -4516, -2763, 6724, 728, -6801, 1699, 4706, -1202, -4783, 690, 6685, -3186, -5540, 4939, 2836, -3692, -3153, 3426, 4239, -5753, -2221, 6471, -448, -4680, 80, 4432, 647, -6146, 1503, 6053, -4016, -3634, 3088, 3200, -2342, -4711, 4585, 3468, -6173, -800, 4637, 702, -4006, -1634, 5963, -213, -6323, 2425, 4529, -2139, -3855, 1583, 4940, -3224, -4873, 5088, 2512, -4346, -1591, 3492, 2687, -5228, -1688, 6456, -1075, -4449, 1077, 3843, -272, -5732, 2270, 5317, -4012]
481d012R26O513m69o352j95Q325k238q063M900N922n455m285M308N135n315n668
497f023Q789J899q150L94N081K381p716j047J0123m096o287L618M713j890p095
512e306N110N830p133k866N929K337n533k468O391K111p961k8Q096k857n121J395
528b074O055j447q723O534M834o832j441L276M609o069l924Q725p85n276k43N055
544B274J445p546J222O884k674o097L651N471m720m217M576M610o599k948P966
559C298p43m662p59M825J962q303K536N919k918m119O55P251m095o435O776L284
575D472n728l184O570J962p051l21O405m9o942K247M985k041m015K32P063l618
591I87n844N625K595l135n030N684M618q987L51O164l34n779J62P068k751m795
$$ y = [-4012, -3086, 3427, 2958, -3394, -3589, 4736, 2498, -5565, -665, 5257, -198, -4483, -175, 4960, -355, -6023, 2766, 4665, -3485, -3091, 1990, 4371, -3345, -4392, 5731, 1635, -4652, -1034, 3679, 1789, -5306, -196, 5634, -1499, -4365, 1564, 3901, -1632, -4100, 2291, 4402, -3559, -3587, 4509, 1652, -3469, -2074, 3981, 2534, -6189, 345, 5179, -1653, -3094, 182, 4791, -1278, -5202, 3523, 2738, -2538, -2781, 2274, 3719, -3827, -2605, 4279, 1605, -4492, -841, 4630, -90, -4307, 269, 4879, -1720, -4668, 3298, 2555, -2107, -2866, 1959, 3921, -4382, -1846, 4073, 1155, -2964, -2309, 4942, 847, -5588, 1188, 4472, -1256, -4440, 2130, 4092, -2959, -3280, 3125, 3076, -3866, -1619, 3366, 1325, -2690, -2458, 4605, 987, -4857, 768, 3363, 228, -4802, 882, 5500, -3487, -3136, 3028, 2694, -3085, -2923, 4145, 1394, -3401]
607c401K062M989k524n642M823K956k705m719M013O027r002l59O181j22m107k875
623d405Q807k217o738M310K525m71n480K654N280m709k882K918M784n311l318
638d253O598O78m586k694P788m03p948M518K728n94n254J528P032o388j461K807
654I6K800k121o117P477J365n680p81M647K507q406K222N584k499l880O65O951
670D830n179l426M716J165r93n926O223K862p207R94K745L178o681j021Q654m276
686F58l580J312N117j999o624O355J908l437l226L957M146p347L63M000J370m649
702a676k544Q764l478m256K459K881N19p707N224L948n713m94J552M624n138l005
718d040O715l46m097j398O284q16n807K542L353k58o463M005M491n700N8N17M484
$$ y = [-3401, -1339, 3650, 1126, -4516, 307, 3263, 558, -4161, -148, 5879, -3123, -3482, 2699, 2577, -1530, -4405, 4402, 2185, -4553, -243, 2282, 1811, -3669, -1015, 4265, -444, -3326, -408, 4376, -935, -4253, 2345, 3023, -1563, -4257, 3531, 3128, -4820, -302, 2426, 1832, -3422, -1894, 5138, -1250, -2711, 96, 2896, 775, -5342, 2135, 3500, -2180, -2961, 1686, 4193, -4213, -1991, 3593, 1094, -2786, -2121, 4830, -349, -3775, 941, 2106, 1113, -4813, 1410, 4272, -2935, -1941, 804, 3982, -2699, -3720, 4934, 658, -2922, -1610, 3507, 1508, -5116, 1239, 3147, -290, -3516, 441, 4587, -2760, -2397, 1603, 2973, -1676, -4220, 4544, 1066, -3190, -731, 2150, 2669, -5038, 186, 4134, -1579, -2073, -521, 4103, -1035, -4040, 2675, 2329, -1768, -3166, 3118, 2302, -3505, -963, 2390, 2132, -4331, -326, 4165, -1535, -1477, -960, 3524]
735C524l411n072Q068j272l020j219L195L496q199K063N346k450l773J032N944
750D252m641k692L281K607k448m651O484N2l711m25J888M528p734O36O340l252
766E14k151j174O616k235o505O196J399k772l256L794L560o080k88L603J828n069
782b020r80O227j946l166n68N634j018p276O108J647k638k706J965N886p771j63
798b785N318j260j937k737O183m68n809K640L155n68n182K764M183l528k942K452
814e21M932o122j431N539r23j871l315O179N01p225M361J391K6l630l96P065n216
831f56k226L457J665j918m144N310J379m672m61M078P99n576J916L059o98l299
847a987j25O150m259k478L090J149q4n504M862K909o023P69K193K081m343j419
$$ y = [3524, 113, -4959, 3109, 1837, -1183, -2402, 793, 4289, -3910, -1847, 3499, 1049, -2724, -1692, 4252, -389, -3081, 200, 2807, 359, -4292, 2192, 2244, -1467, -1892, -4, 4524, -3210, -2574, 3766, 514, -1637, -2811, 3805, 1570, -4935, 1261, 2660, -112, -3368, 426, 3986, -2094, -2382, 1221, 3049, -2020, -3000, 3227, 1281, -1885, -2453, 3181, 2163, -5113, 995, 2642, 4, -2702, -737, 5149, -2622, -2785, 2533, 1273, -664, -3401, 2782, 2314, -3495, -855, 2300, 1732, -3450, -686, 3497, -31, -2973, -521, 4411, -1711, -3142, 2397, 1474, -397, -3712, 2467, 2968, -4257, 104, 1495, 1521, -2109, -2505, 4560, -656, -2882, 575, 2240, 322, -3822, 1488, 2867, -1805, -2266, 1812, 2611, -2965, -1049, 2010, 1312, -1987, -2112, 4038, -221, -2699, 391, 1540, 1456, -4048, 814, 3723, -2300, -1531, 662, 2743, -1600, -3019]
863c019O254k108l454J054L780j414m226L119K300j662l834L371L298n295N5K285
879E04K301l846k663P258k547l400J426K460J000o268L296L888m220j195J494
894e12L666l531l025M919R27l759j452M983q0m661J053L536J2n579K832M222m305
911g54j023J140L651k987m026O276l61l373l06K539K364n849P43M990k279l074
927b329J325L742k197l413K827K970l347k618M470O62l124j143L013K133n437
942b466O80M377j875k239k04M311j436m559L867J819k553j906K211K836l845j502
958b484L939N95l582l81L689j57l419J10M189j358m073K914K138j808k658J948
974c98L756m427j446L930J97k303j687L846R43m870J102L626j385l002J147L360
$$ y = [-3019, 3235, 1127, -2327, -1273, 2507, 1093, -3133, -14, 2286, 624, -3210, 161, 3459, -1836, -1781, 504, 2805, -1041, -3704, 3554, 1007, -2393, -967, 1493, 2493, -3775, -479, 3409, -811, -2006, -512, 3154, -377, -3402, 1517, 2444, -1315, -2767, 2216, 2136, -2525, -1472, 2064, 2076, -3503, -671, 3551, -754, -1777, -637, 3014, 27, -3999, 2277, 1916, -1457, -1763, 776, 3140, -2709, -1966, 3024, 745, -2329, -1004, 2738, 541, -2872, -45, 2925, -422, -3040, 1430, 2092, -1032, -2175, 838, 2971, -2466, -1786, 2591, 716, -1523, -1727, 2584, 1148, -3411, 456, 2275, -278, -2184, 27, 2863, -982, -2484, 1455, 2050, -1532, -1913, 1776, 1619, -1800, -1690, 2499, 1141, -2932, -18, 2120, 312, -2346, -398, 3358, -1069, -2515, 1415, 1612, -691, -2378, 1468, 2411, -2459, -1357, 2269, 884, -2118, -971, 2389]
990B389j585l687K978K812l891j182K988J260k758k048M528L54m606J357K997
1005A906o58l201M17M555k563l377L333J933k545k229K853K331l923j312M308
1020A828kl691L59L296j29l915J039M094k604k695K372K288k031l095L566K102
1036B782m221n07L252N80l320p01M208n44l986J627L069j541l036J784L224k679
1052ik664L322J656l148j263L007J363l647o73M010n86l319Q32K978p08l408J483
1069g74L407k624k298K528J846k303k030K855J754l746m40L372j53k707k07L214
1085A694j42l980J777K885k026k078J376K782k199k765L418J360l105p61K692
1100I28J029l325n72L840n14l456J196K780j115k970J554L125k455k515L113J447
$$ y = [2389, 804, -2883, 95, 2907, -984, -2166, 822, 2082, -676, -2724, 1804, 2158, -2448, -1091, 1906, 1248, -1953, -1536, 3019, 456, -2921, 412, 2345, -200, -2429, 424, 2755, -1168, -2480, 1828, 1826, -1865, -1506, 1790, 1661, -2254, -1215, 2879, 275, -2420, -48, 2240, 209, -2886, 680, 2782, -1439, -1946, 1306, 1886, -1434, -2135, 2073, 1529, -2457, -830, 2239, 698, -2338, -554, 2670, -9, -2673, 649, 2305, -843, -2106, 901, 2264, -1383, -2056, 1954, 1368, -1951, -1119, 1859, 1151, -2257, -774, 2633, 9, -2289, 239, 2085, -218, -2248, 607, 2361, -1385, -1825, 1547, 1394, -1313, -1520, 1694, 1552, -2428, -651, 2234, 208, -1870, -494, 2288, 89, -2676, 742, 2102, -1003, -1764, 928, 1957, -1368, -1940, 1900, 1386, -2070, -874, 1906, 791, -2179, -625, 2500, 45, -2470, 643, 2090]
1116B090k805j289K839J417l842k95L832p16k939M98L250r29l662K248K827k693
1132a69k061K499K014k909j755L528R63l632j87L385k66l154L51L583j257l417
1148b484K312K296k130k097K125K489l269j454L417L96k720o37L167K96l557O82
1164a168L089j008k988J527K601j752k391J930K527k884j615L117O58k249j307
1179a913K878R81l750P42K664p64k278K26L313j394k925K216J948j898k094K422
1195C74J688k672j419L015R02l409K57K606j25k510k18L725j633k747K059J702
1211A595j007k819K202K479l327r32K556J053k754r34L477l80k732K56L099r27
1227I05l046J897J976j288k575J889K777l435q43K489R46k335j680M164m70l144
$$ y = [2090, -715, -2004, 835, 2252, -1590, -1885, 1947, 1231, -1708, -1210, 2040, 1111, -2551, -303, 2524, -169, -2230, 269, 2283, -626, -2381, 1147, 2110, -1522, -1709, 1676, 1410, -1744, -1393, 2190, 933, -2484, -172, 2124, -6, -2103, 22, 2511, -758, -2212, 1205, 1601, -1119, -1756, 1411, 1707, -1850, -1168, 1921, 913, -2075, -548, 2053, 301, -2090, -160, 2367, -517, -2132, 985, 1643, -606, -1913, 965, 1946, -1804, -1062, 1602, 838, -1440, -1214, 2099, 705, -2220, -4, 1944, 46, -2048, 374, 2062, -610, -2029, 986, 1888, -1521, -1264, 1342, 1217, -1293, -1511, 2214, 581, -2166, -107, 1595, 588, -2231, -29, 2450, -877, -1809, 747, 1800, -954, -1888, 1589, 1209, -1523, -1267, 1832, 905, -2141, -244, 1732, 444, -2131, -242, 2535, -900, -1743, 746, 1692, -643, -2323, 1841, 1371, -1773]
1243a773J031K070K5l550J628K787k317j571J414K463k498j873L005P14k191j350
1259a986L384K97l617J083K081Kl164R87L466k839j098J200J767j196k918L574
1275A023O15k459n31J796J594l490P8K940n50k515K73L401j808k127J574J735
1291A549j066l025L329J002k817O8R85K184l399o43L894j642j344l15K677m6l819
1308b428K443J652j534j835J538K463l117o64J986J148k398j288L826j003j882
1323a093n4K157Q28m450K444K065k043r87L00L394l127j622L490k29j537j423
1339a887L051M95l459J050J912J39l184J149K753k151j102M74K966k182k450L804
1355A378m87j106j419K064J955m556J482J978o43j501p60L822j847k245J815J558
$$ y = [-1773, -742, 1328, 1353, -2197, -569, 2218, -99, -1670, -256, 2207, -291, -2164, 841, 1555, -636, -1986, 1398, 1695, -1922, -839, 1242, 1244, -1920, -933, 2533, -306, -1404, -204, 1563, 367, -2551, 1023, 1638, -821, -1352, 444, 2038, -1452, -1374, 1566, 1016, -1499, -1226, 2175, 367, -1760, -186, 1549, 483, -2542, 787, 1789, -1028, -960, 25, 2209, -1190, -1833, 2061, 419, -925, -1240, 1437, 1391, -2428, 15, 1667, 133, -1702, -164, 2299, -818, -1482, 504, 1652, -746, -2034, 1792, 789, -1093, -1147, 1010, 1838, -2612, -168, 1897, -146, -1133, -833, 2561, -566, -2188, 1302, 1073, -464, -1887, 1164, 1659, -1800, -750, 1162, 1301, -1883, -734, 2019, -132, -1234, -760, 2206, 24, -2426, 1378, 891, -215, -1634, 430, 2385, -2171, -689, 1289, 646, -855, -1615, 2207, 360, -1885, -70, 1488]
1371A488r94k894K990J189k521o68J782J956m133P75K708j306r22j185L777j285
1387G57l151K959J78n0k421J277K997l682j63J838Q78j894j528L637o53k235K15
1404a041K444l47l219K125J272p96j902Q45L203l431o03K141L49r61k445L909
1420A543r3l307J564J076N47l047R06K837k151j106P53K296j930j779K672L56
1436A137j252j876K957O82l382J291J130O29k592o4L741k732q45R67J392m41l162
1453b420L125Q35k334l94J489J567l268K10K706p13j943n8L182j769j735J552
1469C2J001k11l022K527J450k713J93N82K198k870j135L904j438j457k9K234r6
1486A150l296K187J346j221j622J202K172k537o56J497J316j981j628L635o69
$$ y = [1488, 494, -2400, 590, 1779, -742, -1410, 372, 2328, -1805, -1030, 1678, 372, -550, -1735, 2042, 757, -2394, 565, 743, 693, -1728, -451, 2546, -1136, -1299, 539, 1417, -477, -2005, 1632, 979, -1256, -1041, 1403, 1056, -2163, -38, 1234, 438, -1464, -619, 2584, -847, -1450, 691, 1040, 79, -2366, 1543, 1450, -1857, -293, 783, 1330, -1717, -811, 2026, -125, -1231, -478, 1818, -112, -1891, 781, 1137, -115, -1991, 966, 1648, -1734, -443, 687, 1316, -1276, -1340, 2401, -331, -1176, -209, 1183, 742, -2420, 705, 1540, -794, -1188, 301, 1868, -1400, -1190, 1516, 803, -1140, -1198, 1984, 215, -1520, 32, 1033, 822, -2200, 327, 1777, -936, -743, -161, 2037, -833, -1968, 1936, 498, -959, -988, 1246, 1150, -2146, 41, 1387, 166, -1456, -254, 1918, -619, -1275, 222, 1538, -443, -2071, 1564, 895]
1501H95j930M3J950O67l939K120J878j993o21K46K666k235j495K645l2r42j563
1518a640K278J053l050M20J886L80k980P28K933k023j230Q26K207j754k055L033
1534A012j69j131q15J259J714l161L16K055k93j579o19L163j089k511J747J533
1550A432j295j935K241J028k152m69J608J030k595J65K009m57j174o67K583m06
1566I46k677J732J126p15j894J256K202k727n44J921N03j716p04K313q5j840q
1583i11K050l41k294J188J430n69j894R10K406k449r81J990N63j314j487K707
1599A004K91k628O21J674n2k153M78K246j128j777J154J789j593j466J877J012
1615A349j732j191K355O94k668K90J820J08k186J86K612j339j753J267J554j065
$$ y = [895, -1035, -992, 958, 1625, -2314, -194, 1684, -309, -930, -684, 1982, -253, -1748, 897, 865, -77, -1640, 638, 1691, -1359, -939, 947, 1327, -1653, -925, 2008, -15, -1245, -419, 1788, 34, -2021, 1012, 843, -288, -1103, 156, 1870, -1291, -975, 1080, 787, -792, -1411, 1752, 663, -1848, -101, 1432, 137, -1798, 443, 1471, -681, -1150, 458, 1488, -1107, -942, 1067, 610, -564, -1231, 1352, 946, -1731, 1, 1127, 412, -1482, -226, 1976, -751, -1295, 626, 1129, -587, -1291, 1022, 937, -903, -911, 1139, 798, -1496, -308, 1122, 553, -1341, -431, 1975, -474, -1455, 535, 1098, -216, -1703, 1004, 1295, -1333, -712, 962, 910, -1243, -765, 1481, 353, -1424, -270, 1519, -74, -1540, 337, 1349, -383, -1574, 781, 1475, -1193, -903, 917, 1025, -1161, -975, 1637, 298, -1455, -188, 1366, 301]
1631C01j958J835J377k020q93J933P94k303j45K022O2k164J77K429j070j643J084
1648a82J472q94k094J875J315k089n35J542Q41j910p32K423j31k045M11J884m12
1665G39k009P86J835j082j768J562J303j661q23J343J121j942p26K328q4j877
1681i55K37J591j6k204P87K020j326j317J043J407j221j462J686J122j976n65
1697a149J792L82j809k65K049jk288P24J811r10j461O85J823j270j683J927R19
1714A276j714p31J519R18k046m08K221j36j975L41J839n01j827P63J972j462j449
1731a400J634J006j427j167J707J096k296l00K178j39j766k6K023k41k444J175
1747c87J813j406j218J058J543j456j465K039Q03k049k08J572M33j918k34K323
$$ y = [301, -1657, 178, 1555, -465, -1358, 575, 1369, -934, -1079, 943, 1005, -1159, -982, 1447, 377, -1266, -182, 1290, 396, -1698, 177, 1492, -597, -1132, 410, 1251, -659, -1391, 1032, 901, -1144, -733, 1151, 739, -1270, -484, 1351, 269, -1499, 63, 1366, -295, -1118, 225, 1346, -596, -1322, 1006, 922, -955, -718, 873, 857, -1347, -560, 1460, 134, -1183, -140, 1267, 46, -1416, 270, 1392, -584, -1149, 643, 1025, -784, -1049, 1000, 999, -1289, -565, 1246, 336, -1125, -440, 1383, 113, -1570, 357, 1276, -438, -1169, 350, 1268, -778, -1186, 1035, 899, -1076, -735, 1104, 603, -1224, -461, 1511, 49, -1400, 234, 1240, -187, -1354, 353, 1449, -847, -1147, 1031, 892, -874, -900, 1123, 882, -1562, -387, 1426, 20, -1198, -140, 1403, -53, -1518, 521, 1324, -725, -933, 639, 1072, -846, -1080, 1243]
1763A243o22j968J080J342o99j608J004J761j827j042J846M83j449o78J692O68
1779A226k292K08K041o85j500M46J633n19j979J207J619j682p86J205R64j265
1795a59j187K038M36k101K74J402M7j612O0K081r06j639J155J127q46j369J197
1812bJ308j618q74J728M02j547l14J528L93j995J70J972p48j394O31J353n64j803
1830a374J361J301j743n15J186R04j460r36K066J54j956L61J503j66j652L65J847
1847A246r10j704J408J066j269q49J024J335j764q33K299l07j412q8J418L38k249
1864a251O74J971j318j114Q14J365r69j557J664R88j812m35J618J63j414k83J692
1881G96P7k115P67J551r58r87L46J816j222j469J886M18j268n17J281Q12j986
$$ y = [1243, 621, -1347, -267, 1075, 376, -1232, -228, 1533, -294, -1336, 510, 993, -456, -1134, 558, 1226, -1066, -858, 1183, 498, -1002, -556, 1077, 558, -1421, -214, 1405, -277, -1063, 142, 1106, -159, -1346, 692, 1128, -973, -699, 703, 750, -862, -802, 1279, 373, -1266, -111, 1016, 170, -1199, -2, 1306, -312, -1186, 542, 944, -603, -917, 611, 1004, -991, -821, 1151, 403, -991, -360, 993, 429, -1374, -13, 1288, -455, -970, 216, 1120, -340, -1276, 790, 944, -1012, -651, 852, 686, -966, -601, 1246, 336, -1368, 40, 1106, -163, -1012, 12, 1347, -417, -1250, 1049, 742, -670, -758, 660, 998, -1251, -577, 1394, 76, -1038, -224, 1141, 172, -1385, 279, 1267, -545, -980, 638, 801, -613, -896, 796, 873, -1242, -475, 1076, 118, -869, -523, 1293, 71, -1398, 488, 906, -362, -879, 402, 1214, -772]
1898g72p6J759l15j383K06J533m97j466O22J576j088j294J364Q22j138r02J270
1915B21J082k064m6J544j00j136l93J913m51j725J063Q82m64j282O73J577j448
1932a54r15J325P88j426n91J607R0j275m59K005l51j915J119Q87k46j495N25K012
1950A531j870o28J248N37p74j296J914L27j826K30J306K9j635L30J605o68j371
1967a011O45J667j390j003J331N77q33j261J896L97j932M43Q56M53j656l5K167
1984A311j224r25N14J238n57j741J692O82j207p13J231P40j883L05J133N9j279
2001f24k38J967q82j087O30R13j22j827J339R96j418l75O99J295j806n26K004
2018I38m26j113k09J683l61j610J008P40k19j402P21J402j455l68N92J103j218
$$ y = [-772, -848, 911, 596, -787, -581, 952, 455, -1011, -389, 1187, 99, -1195, 169, 991, -147, -1049, 221, 1303, -761, -807, 737, 637, -499, -892, 1021, 570, -1155, -92, 790, 326, -956, -283, 1294, -154, -1069, 256, 1044, -382, -973, 634, 724, -551, -1010, 995, 644, -1271, -152, 735, 489, -1006, -481, 1531, -339, -967, 281, 818, 44, -1252, 662, 989, -837, -607, 699, 728, -907, -577, 1028, 360, -1011, -366, 1301, -89, -1092, 239, 816, -17, -1278, 618, 1015, -917, -474, 382, 835, -821, -856, 1311, 87, -838, -324, 914, 357, -1384, 308, 990, -217, -930, 301, 1041, -842, -537, 596, 655, -624, -862, 1105, 223, -864, -234, 679, 557, -1270, 69, 1065, -353, -728, -29, 1266, -540, -1066, 938, 512, -601, -810, 873, 512, -1098, -90, 650, 431, -971, -250, 1152, -303, -671, -79, 1024, -194]
2035a94j190K302l21j181j38J357K28k161J210R93p94p56J77J633j326o63R37
2052A13N98m86j499J785M43j600m7J061P51k282N88J762j261o03K47J529j001
2069I8j271J563J06m17r69Q90J166j791Q9P85O70j450n68K338r37j162N00J244
2087H84m14j951J881M55j241j64N24J182j772j33J397j71p69o72J963m00j611
2104a012P54J014k25j795J234J162j615j27O21R74j452m89J875o94m72m93J284
2121E44K77j932R91O74k12j037K12J734j470n98J085M37q28q98J740j21j195P7
2139e20R56M59j873P15J017n62o23k62J893j112j076J350J18k80j247J221R54
2156A128j904K95Q37K54j230j29J804q59r10L48J231o11j339J321M12n43j035
$$ y = [-194, -1384, 918, 597, -584, -722, 635, 863, -1298, -88, 905, 111, -645, -468, 1165, -161, -824, 113, 711, 225, -1274, 511, 954, -646, -693, 368, 1119, -1163, -575, 1187, -74, -677, -430, 1099, 98, -1173, 390, 496, 79, -890, 0, 1166, -625, -536, 249, 919, -531, -1099, 1239, 302, -860, -360, 884, 470, -1481, 400, 855, -386, -550, -26, 1156, -616, -749, 648, 477, -292, -964, 999, 599, -1012, -258, 756, 531, -1264, -30, 1132, -483, -610, 11, 985, -467, -956, 919, 225, -247, -740, 544, 821, -1111, -120, 554, 342, -695, -483, 1251, -219, -817, 268, 705, -123, -1021, 719, 598, -597, -520, 436, 895, -978, -263, 754, 192, -431, -693, 1200, 88, -988, 362, 480, 200, -1047, 174, 1128, -776, -481, 356, 610, -620, -749, 1055, 196, -714, -366, 865, 254, -1085, 236, 648, 105, -930]
2173i30R67J135j925J99R61J87r96o30K121p49j233P77P54j21j648J127R96j247
2191b55m30O60R38j296m29J387q8q25n12J588j44j455O53O97J24j671Q31J439
2209A212j647p1M65Q29q04j126J891l03r63Q1P71M64j558L19J229n04r75K78J449
2228A037j078q09Q45Q50q60j190J839Lj201J45O50O22j671L23J527j072m28L2
2246d36J155m26j406J336N47r23o21R32P36j393j85J163K07j376J34J388o49p61
2264e78K22J028k48j592J358M77p55m47M38J146j474m39J476j55q10l03J271%
2282F15j431O26R52m89j054P15Q43p60p52O63R15j184m51J304J2p57n17J325K02
2301G77j710O77Q30l13r04K75J360r39r52J155M11p62p25J101M66j214j22J141
$$ y = [-930, 37, 1172, -753, -554, 407, 594, -402, -1032, 1089, 340, -893, -116, 638, 517, -1131, -4, 992, -255, -685, -25, 913, -383, -812, 575, 487, -338, -850, 738, 594, -861, -208, 489, 613, -1058, -227, 1212, -435, -506, -41, 788, -16, -1142, 749, 446, -517, -436, 335, 799, -759, -440, 789, 285, -690, -412, 1037, -41, -850, -5, 845, -15, -1205, 634, 637, -564, -419, 231, 853, -818, -495, 1032, -40, -468, -436, 719, 293, -1113, 223, 770, -153, -774, 158, 894, -499, -684, 479, 686, -690, -556, 832, 183, -578, -356, 672, 424, -1168, 190, 667, -88, -535, -97, 1049, -425, -864, 612, 457, -353, -656, 615, 615, -816, -190, 762, 273, -781, -66, 777, 17, -735, -72, 843, -341, -792, 512, 524, -233, -750, 575, 777, -933, -256, 574, 261, -643, -368, 992, 53, -899, 256, 667, -95, -820, 281, 747, -467, -589, 552]
2319E52R0j353L95Q82j66j106L50J344r66q76R73N14o22q66J087N87j375J4R38
2338C96J19r37j53J269l36j137N71R20n81r56P42Q34p09q39J039N28j097k68R48
2357C53K84r56l87J425l40j093M05Q85k35j157P01R84r58o67R11N06q61n16J090
2376C74L01j125j14J173j69j020J77J024j90j193O11R85q29p11P09P38q66o72
2394g97J160L23j162p4R88O2j130K30J101m38j009O25Q80o51q08O77P66q87n78
2413g22J058K83r58j79R18J92j127Q6R84l03p37K22R25m70r08P36P34q10o18Q58
2433A64M61q82l09R94J46r82j21J024j30q80K12R31m52r03O30P71p63n43O85O65
2453G18q81n84J122K07r99j80J148q4j086K02J016l32j015O13Q36o55p57P43O58
$$ y = [552, 642, -711, -316, 566, 400, -706, -356, 988, 22, -854, 119, 633, 11, -855, 232, 819, -556, -542, 396, 515, -422, -575, 694, 358, -779, -208, 712, 131, -825, -83, 751, 42, -797, 242, 770, -327, -595, 353, 637, -319, -706, 719, 379, -714, -309, 576, 341, -816, -115, 869, -89, -756, 155, 661, -200, -716, 374, 675, -450, -564, 609, 440, -580, -403, 621, 431, -762, -151, 834, 5, -706, 3, 741, -125, -797, 363, 686, -476, -550, 438, 500, -630, -400, 701, 263, -746, -121, 759, 108, -700, -23, 743, -144, -722, 336, 619, -339, -518, 400, 592, -535, -449, 535, 232, -505, -283, 642, 172, -736, 0, 734, -76, -694, 164, 625, -257, -566, 428, 574, -408, -529, 495, 365, -515, -303, 628, 176, -727, -97, 674, -89, -632, 53, 718, -163, -747, 375, 582, -417, -597, 551, 467, -619, -417, 599, 267, -748, -135, 701, 46, -711, 32, 690]
2472F90q64n47J058K61r63k12J018N1j109J94J071l61r13M03R09o35o82O87P30
2491G86r74m98R82K84r42k22R54J71j105J79J035l66q78K72J008n36r31P66O38
2510F23o90n92P52N61r29k72R69K1r07k0R60r2r40K59R61n78p52O77N56n18o93
2531f44P09P10j129j49Q48J00o47l76J066j08r53K68Q56k63q89M84P78o25p18
2550f82P01N98q78l19P79K85p41l49J091o1j042M37O11j07q96K88J013q20n14
2569f06O77M34n20o77R99K76r33j58R19Q8j005Q6Q82j89q48L17R10o35n73O42
2589H6M36l90q99J022M55j132M2O29K83r61q2J193m80p96L85P84l23r39O39O93
2609F45p13n36P38L58p59k26P18M08j070l4J136m74o36J69P63j56j114Q14O02
$$ y = [690, -174, -721, 337, 598, -365, -577, 441, 492, -617, -423, 648, 287, -626, -223, 686, 51, -631, 56, 786, -188, -686, 296, 580, -362, -584, 370, 541, -564, -385, 650, 284, -594, -322, 686, 150, -781, -15, 623, -67, -659, 93, 654, -275, -547, 422, 443, -464, -484, 476, 384, -556, -297, 664, 86, -666, 11, 567, 49, -644, 65, 775, -354, -503, 345, 445, -202, -578, 488, 380, -573, -305, 551, 288, -601, -117, 661, 36, -682, 19, 617, -261, -580, 199, 484, -257, -606, 485, 424, -618, -181, 430, 323, -573, -285, 728, -92, -606, 71, 505, -15, -692, 307, 583, -350, -508, 411, 499, -506, -420, 462, 273, -575, -258, 652, 17, -556, 86, 522, 132, -767, 255, 710, -422, -380, 249, 532, -429, -511, 682, 202, -594, -209, 575, 252, -687, -48, 645, -68, -604, 134, 492, -267, -493, 225, 633, -437, -471, 665, 191, -445, -276, 487, 331, -783, 31, 633]
2628F33q15k40L69O32p20m79J027Mp44n3P71k8q10J52Q17k34r04O04O22o52l74
2649d22L22P40p55n12J011m9m95k50O25M45j279L23P28k72n08KR94n40p23O43
2669B8N42o34n87Q57K70o43l39P19M05j167K03Q64l93m35j05J153n29r96R81K54
2689D48l61o44N68P59j186L4O88O7o89r9J021l37p44J93Q92l65r12P45L26l77
2709B7n39M87P40j191j0P78Om56m82J187j43j020M96M96j45q16M18Q33p70l74
2729d78N11N03p47k68P32J10o27k03Q80J1r62M43M34l8q35K95J015r07l76M88
2749a9M71m25p02R58J71p39l3N44K05q44P9Q23l07n47J07P99l75o44M84M41l80
2770F7p32R20K40p47j20M88L97r01k1R45m26m60N8P37k33p92N88M88n18m86M84
$$ y = [633, -182, -422, -53, 579, -141, -620, 407, 411, -333, -386, 385, 357, -453, -301, 516, 282, -622, -18, 604, -48, -422, -100, 640, -115, -627, 384, 335, -160, -410, 215, 660, -619, -296, 432, 160, -348, -346, 648, 108, -615, 28, 570, -64, -651, 206, 476, -167, -506, 213, 618, -549, -346, 518, 125, -310, -415, 738, 209, -787, 194, 448, 87, -557, 11, 770, -416, -382, 306, 373, -316, -415, 606, 269, -475, -282, 610, 245, -667, 78, 404, 27, -512, -25, 715, -476, -486, 292, 298, -158, -640, 547, 404, -616, -120, 376, 231, -585, -167, 666, -104, -478, 33, 536, -211, -479, 253, 363, -264, -467, 413, 424, -538, -95, 339, 301, -534, -239, 776, -131, -507, -19, 452, 27, -675, 283, 454, -285, -318, 226, 431, -413, -334, 489, 182, -365, -258, 541, 166, -478, 6, 447, 67, -665, 255, 495, -252, -372, 116, 513, -388, -409, 536, 110, -350, -292, 445, 212, -580, 8, 496, -22, -508, -24]
2791b4N42p45k06O14L01p85j10R04k74n71M3P45j42r31O36N13n12m42L39O92p60
2812a73l41Q91j3n93k40P77N9q63K28P23j77q58M95O44n86m05K84P14p39m02Q53
2833B78Pm04l34P62J64j048M25N42j99n52R4Q99o77m41M85M04l94o14Q38J86o47
2854b26l5N05J95q03P1P64k53n82M4P78l76n44N60K77l00o03O50M07p54j31M98
2875A42K15n97j80P92j25n81Q1P73l45p56N34M14l57m21M37N43p59k37O67J76
2895D16n62k73Q09j45o32J95N45n6p65M24N49n30m50M20N17o29k94O33J35m48
2915a41l09P89L1q21K59N23r7o28J84O84m88l93M04M49m94m43O44K29n99j72O01
2936B12J51p40R4O28j37o32K40P01m59o05N72L73m27m25N80L15o88p6N53J34o54
$$ y = [-24, 518, -227, -433, 181, 482, -303, -413, 491, 217, -354, -311, 434, 292, -639, -3, 510, -2, -444, -105, 587, -173, -514, 377, 364, -229, -469, 308, 367, -496, -268, 455, 278, -580, -85, 559, -27, -432, -148, 566, -173, -575, 278, 285, -119, -453, 309, 473, -575, -150, 392, 193, -359, -265, 634, -43, -484, 1, 405, 11, -603, 235, 421, -226, -261, 244, 439, -364, -293, 471, 218, -364, -320, 458, 82, -462, 98, 375, 75, -528, 122, 529, -225, -356, 142, 357, -240, -420, 372, 247, -334, -253, 520, 175, -581, -47, 367, 10, -411, 26, 569, -190, -427, 240, 416, -146, -419, 390, 245, -387, -192, 353, 297, -468, -44, 505, -25, -475, -55, 462, -167, -461, 172, 307, -141, -450, 339, 370, -451, -192, 331, 234, -394, -210, 474, -14, -407, -3, 446, -48, -491, 153, 382, -217, -389, 212, 363, -377, -283, 345, 208, -424, -184, 517, 58, -547, 25, 398, -29, -454, 126, 441, -247, -323, 230, 364, -290]
2957b90p2P06j13n70J39O32l49m69M00K37k08m75N20L73o64j06M51K61n44k61
2977d02P80k05n09K32M51q4p17L44N40m87l60M67L62n62l20O14K50o51r7O37p4
2998B09n22J58M61l1q04L66O21m83l52L74L97m44m01P05J45o87j5N15J14o48J7
3019c05O84j93n75L22N08l74m47L22N13n34l77O14J44m72k07N56K16p38LP16j77
3040A99n17K06N01k08o61M22M93m75l64N17K95o18k21N87J91o43K3N77l4o74J34
3061b70O82k30o55M74L72l49m24L72M34n02l10O04J59n66q7N36J02o59O4P03k81
3082A69o20L94M69k94m96L91M30n52k37N16J55n18j60O30J3o20J43N15j44n27
3102c43J63N82l16m70M38L87m86l10M48K82n83j24O03K2n79J33M46l9o79L01N85
$$ y = [-290, -362, 344, 231, -339, -200, 432, 83, -386, 14, 251, 43, -432, 88, 461, -203, -309, 142, 403, -141, -402, 378, 173, -336, -104, 347, 263, -454, -110, 430, -57, -417, 50, 412, -150, -470, 144, 394, -257, -354, 283, 209, -313, -155, 306, 275, -529, -163, 458, -25, -377, -3, 394, -50, -451, 254, 399, -288, -303, 212, 326, -322, -305, 379, 186, -389, -67, 441, 67, -380, -58, 455, -79, -456, 158, 302, -170, -377, 179, 395, -343, -340, 376, 199, -318, -112, 389, 181, -480, -58, 435, -40, -404, 113, 408, -210, -431, 156, 347, -296, -273, 304, 270, -404, -270, 412, 182, -473, 1, 373, 24, -400, -28, 406, -96, -406, 198, 357, -209, -296, 240, 342, -317, -253, 450, 169, -451, -57, 412, 118, -378, 13, 443, -109, -346, 170, 325, -193, -353, 277, 290, -330, -187, 328, 184, -343, -180, 402, 86, -384, 54, 441, -45, -355, 93, 375, -208, -332, 271, 293, -286, -153, 293, 254, -425, -124, 461]
3123D61m50l93L64L81m17k85M68L07n95j72M98R5n03k2N74r3o01J91N45k29n19
3144c95K95M88l78m24N35J96m76j64N00J73n30j73O67n5n47Q2N60j51n54L14M88
3165D51m79l69M31L55m44l30N50K31n87q6N78j12m57J8N83j49o10L18N16m16k80
3186b88K76L85m72l79P06M7m70r6M35J62o31N1O24j70n11J38M93j76n21L23M62
3207C88m13l93M93K20l98k75N33J77o30J01N06q7m97Q0N32k12n45M07L63l86k81
3228c17M14L14n01k53M69J72n35qN07p2m66R6M78j91n25M24K78k60m06L77M60
3249D55n91j72M06J19m32j08N52l5m40J13M63k14m03J82M38k85l56K74M47n00
3269h7k15M01J71l93k06O31l4o20K30L77p3m64J34M96k91m29L24L86l47l48M54
$$ y = [461, 11, -382, -18, 363, -54, -339, 129, 436, -159, -331, 167, 262, -241, -263, 311, 218, -383, -192, 353, 124, -395, -100, 388, 10, -414, 121, 317, -159, -323, 177, 350, -180, -353, 314, 259, -288, -206, 354, 203, -351, -37, 451, -28, -397, 34, 389, -55, -385, 165, 396, -191, -277, 301, 189, -268, -250, 333, 184, -426, -108, 408, -8, -288, -12, 373, -99, -478, 228, 275, -195, -291, 144, 306, -325, -274, 350, 180, -331, -193, 300, 124, -397, -74, 388, -25, -418, 75, 295, -103, -378, 155, 332, -298, -197, 309, 222, -275, -195, 337, 125, -420, -13, 350, -36, -317, 97, 411, -90, -343, 126, 298, -237, -245, 262, 190, -276, -180, 298, 107, -418, 6, 284, 24, -382, -5, 455, -136, -308, 98, 217, -215, -323, 229, 194, -246, -133, 330, 116, -287, -105, 333, 48, -308, -34, 413, -87, -302, 99, 270, -123, -329, 302, 268, -352, -122, 255, 182, -282, -148, 348, 57, -372, -48, 338, -9, -357, 97]
3290I7J33l99j50N02R9o37J37M81j53l30JO18l59k93L10K66j77n09M65K29n15
3311a84r1L79K02n46M5M93j49l93J3O15k75m83L53K44j43l80L27L27n63n5L83
3332A19J83m46j60N96j30m28J50L51p7n54L58L65k88l02K49L63m24k73M66J17
3352B35l65j74N49kn22J46M01r4m98K34M81l56j88J86K75l13m31N42J60m61q6
3373b81M41R2m72L5M28m5m94R7M78l14k52J91L78k29m46M86J25l78j44L63K55
3394C14n44j9M95j40l54L7N46k60m24L55L12l24l62M90J68m14q2L36J63m88o1
3415b56N85k60k57PM04o6n19L33L03k60l14L00L83n32j11L99R6l95k03O26j64
3436I9l68O0M17L9o45L15L17k61k36K35L40m60j23M84l8k74j45M40J19o22J84
$$ y = [97, 230, -169, -319, 183, 282, -355, -218, 263, 110, -220, -219, 399, 40, -253, 57, 323, 146, -363, 102, 331, -184, -275, 104, 306, -240, -195, 298, 149, -244, -231, 384, 109, -374, -21, 223, 80, -300, 27, 354, -209, -264, 119, 302, -144, -304, 292, 162, -266, -116, 235, 158, -396, -38, 327, 39, -263, -14, 349, -75, -348, 118, 235, -130, -304, 245, 243, -279, -133, 268, 174, -324, -90, 391, 35, -153, 33, 308, -5, -436, 106, 266, -195, -281, 160, 252, -220, -185, 243, 198, -296, -199, 279, -35, -287, -96, 282, 53, -393, 93, 218, -160, -304, 59, 314, -230, -249, 246, 106, -248, -211, 335, 75, -349, 6, 318, -6, -368, 122, 290, -124, -206, 130, 293, -195, -256, 329, 69, -188, -181, 223, 157, -362, -29, 274, 14, -300, 0, 383, -149, -260, 139, 235, -160, -363, 263, 99, -269, -209, 208, 247, -398, -83, 234, -27, -263, -28, 312, -148, -271, 213, 175, -99, -244, 196, 315, -307, -123]
3457a23L52q7m40J84M15k60l31K05M07l45k80M10J17l17j63L83K13o42J73L43
3477B14l7l89QO05l72k62K76J99k19l15L52K23m16p4L32J13l82j32M66r6k13n8
3499a77L76j48l61K96K42j46m09L75K28m47k4K33J92l73j30N18o5l92N3L58j7
3520A82m73K02L15k00l08K52L38l41k05L63J01l21j33N12j36l99J28K92O8n01
3540b64J65N04m44j10J33K77k48l76M44J75l97o7L34O1m47J23L41p0l96J26M20
3561B84l31j77Q8L69j51m90N49O1l37p2K28K51m60K4M14q9l66O1L42r2l56J98
3583e2K82k25l23L51J85l40j15K87K79m80kM02r7l58R2L17l5m43K35K82k50k12
3605b20J83L18m28p6L46J47l98q3L65K9l60K0L83r6m47K34L66k47k52J64L64m36
$$ y = [-123, 229, 142, -298, -114, 301, 41, -290, -85, 322, -23, -303, 107, 224, -93, -256, 127, 340, -302, -129, 214, 177, -212, -204, 401, 29, -233, 43, 242, 23, -292, 60, 283, -133, -207, 125, 238, -144, -276, 190, 94, -119, -177, 199, 51, -310, -14, 228, 82, -327, 48, 276, -171, -195, 38, 230, -143, -273, 245, 180, -212, -159, 199, 182, -291, -89, 226, 26, -282, -30, 308, -33, -238, 125, 226, -95, -228, 284, 148, -251, -123, 169, 237, -264, -99, 405, -39, -149, -16, 261, 13, -363, 81, 256, -141, -208, 126, 187, -260, -137, 204, 134, -262, -136, 284, -47, -224, -136, 233, 82, -408, 141, 202, -135, -207, 21, 272, -188, -164, 250, 161, -205, -144, 198, 106, -250, -52, 230, 5, -318, 33, 218, -122, -237, 50, 329, -151, -153, 249, 152, -206, -114, 203, 168, -275, -40, 242, -8, -220, -37, 281, -147, -223, 123, 270, -128, -211, 154, 183, -177, -157, 226, 130, -317, -83, 283, 36, -216, -52, 312, -124]
3627a24j48M35J5k68j91L59J53l97J9L26p4l31J21L84j28l63J50L15l23j72L40
3648I8R3k16j56L09J08m02M5L09l5l52pN16k27l58K32K33j70l45L25K60l59j20
3670b19L77M8l58k6L63ql64P6L67k23l04K28L14k20l31L00K96l93j25K76J87l44
3692h3j10L97l5l81J00K96n8m02J87L37j98k84K98J57k22k44K88J88k76k24L70
3713A01R2l18lL17n9l36J30L24k32k12J56K23j59l11K93K46l33j29L31J10l79
3734a48j4L03M7l33J7L36j01l19J41L02k02k80L09J91k93j19K14J80l53n7L35
3755A56k0l10N2L60j18k85J19L53k47k53K04K09k27k28L73Q7l69l8K96K7l07l7
3777b03M58j63k97J13K63j55k46K34K54l08j92K35J96k82j43L79N1l90J12K88
$$ y = [-124, -272, 163, 178, -90, -281, 78, 231, -166, -147, 179, 105, -226, -105, 279, 151, -212, -62, 253, -70, -242, 98, 191, -25, -181, 128, 236, -166, -121, 188, 153, -199, -206, 310, 83, -275, -43, 190, 20, -325, 0, 260, -99, -219, 158, 206, -152, -178, 185, 177, -187, -111, 256, 33, -271, -43, 271, 51, -280, 20, 316, -77, -202, 74, 261, -83, -193, 204, 169, -212, -112, 184, 126, -276, -89, 248, 50, -234, 64, 221, -1, -245, 43, 231, -45, -269, 101, 193, -125, -128, 189, 130, -206, -76, 248, 16, -196, -40, 183, 24, -287, 6, 252, -81, -210, 121, 231, -148, -162, 141, 188, -145, -128, 208, 107, -212, -71, 231, 29, -251, 58, 249, -44, -163, 51, 231, -122, -179, 156, 136, -174, -122, 238, 120, -165, -46, 307, 60, -193, 11, 220, -7, -235, 138, 225, -144, -182, 114, 141, -166, -203, 255, 92, -205, -92, 171, 16, -230, 4, 258, -50, -242, -7, 189, -93, -236, 143, 194, -196, -84, 204]
3797B04o6l97J64L42k47k25J50L01k33k26K84J36k88j30K93O7k30p6K80J7l11
3818a91N8L55j51k73J25L65k44l82L74J07j64j99K98J29l47q4L49m0k73Q7K44
3839A43r6l07J20L49j97j94K12J38j89j61K08J77l62K8K82J0k53p8L87j25k60
3860a68J70J75j33k74J39L26k63j99K69J36k60j00K88l1j95j04M01o1l05J27K08
3881A46j02k32K06K80l31j74K15J21k18r0L47M5l45l8L21l7l34J38K97j61k53
3902a99J99J50j78k21K75J93l57r0L00J07l61M0K91J6l46N0L81j48j79M5K97k12
3924E3k87K25K33l46m8L10L1j82j86K88P0l31P1L21j42k13O9K86k04k37K27K22
3946B30k85l9J25K04k88k21L95pk29m8K45O5l83J34L02j96k51J59K97j78j99J65
$$ y = [204, 138, -259, -95, 247, 0, -225, -75, 226, -7, -233, 51, 187, -101, -231, 62, 129, -101, -177, 103, 120, -191, -133, 222, 71, -202, -77, 288, 44, -338, 36, 143, -21, -220, 78, 207, -140, -224, 125, 85, -188, -101, 143, 47, -260, -140, 209, 12, -182, 30, 168, -21, -182, 26, 203, -159, -131, 151, 161, -92, -170, 217, 92, -168, 2, 177, 44, -230, -91, 235, -28, -227, 42, 178, -82, -182, 106, 75, -120, -224, 177, 116, -189, -62, 146, 44, -188, 18, 298, -33, -207, 8, 129, -89, -179, 168, 213, -132, -170, 151, 114, -220, -82, 215, 54, -199, 0, 150, -28, -249, 26, 219, -138, -228, 72, 179, -182, -142, 149, 165, -181, -131, 250, 102, -77, -32, 265, 53, -234, -9, 224, -122, -170, 140, 171, -11, -197, 91, 161, -170, -99, 222, 80, -133, -64, 222, 18, -219, 8, 230, -55, -94, 31, 235, -53, -274, 121, 114, -115, -163, 82, 147, -236, -102, 200, 4, -247, -88, 209, 31, -168, -3]
3968cJ88k86n6K97o9j60k7K44M3l86J50K78j68k48J71K25j46k41K57J33l34m8
3990a86K51J27l58P0K79p1k65Q4J99q2j98Q9K76j89k79K41J79k00j66K43J87m05
4012a74K7K73o5j65j7K82r8k24J50J94j47k50K29J71k27j35K27J76k85r5K52O2
4034A61k11r0L30j00k94J76J70q7k55J71K21k27j21K18K7r5k12L73K8k92JK20
4056A12J4l00J16K23o7k83J82K32k65j00J71J31j78k00L22L9k76NJ99O5k91R3
4078e6K16j04j57J6K90j76k31K33J03j96j85L48O4l07O7J67n6j76M0L11j86j65
4100a40R9J82j24k52K49J81k32j28K41Q2k39n8K74m5k26N3K88j32k80J52J45k0
4122G0k74K05K08k14j19J10K06l07j27L89Lj91q5K21O4l20O1K70j56j83J33K59
$$ y = [-3, 185, -101, -157, 140, 71, -89, -116, 128, 171, -215, -65, 213, 45, -203, -32, 193, 47, -194, 63, 196, -138, -186, 65, 192, -166, -96, 183, 112, -153, -69, 130, 48, -150, -61, 215, 26, -253, -12, 167, -33, -199, 44, 231, -174, -147, 126, 61, -104, -121, 161, 63, -161, -11, 183, 36, -214, 15, 186, -41, -176, 51, 227, -58, -153, 99, 161, -50, -140, 190, 90, -204, -28, 142, 55, -200, -29, 192, -35, -156, 62, 89, -6, -218, 155, 183, -109, -108, 112, 126, -174, -58, 165, 98, -185, -3, 229, -36, -136, 35, 166, -12, -212, 110, 149, -127, -122, 77, 142, -149, -56, 160, 56, -101, -85, 205, 29, -202, 31, 134, -62, -247, 101, 165, -142, -75, 92, 36, -140, -100, 211, 25, -140, -41, 141, 17, -235, 14, 195, -37, -165, 76, 158, -81, -139, 135, 90, -136, -83, 205, 73, -207, -55, 90, 70, -204, 1, 209, -5, -124, -14, 192, -115, -242, 147, 150, -41, -126, 95, 159, -161, -100, 170, 14, -169, -36, 223]
4144B23j92j53J58J52j80k14L02P9k53j06K87O9l38J29J70r3j55K5K74k11j16
4165a43J63R7j60j63L47J6k64o2K48Q1k70l6L31j26k28J30K42j76k30K52J52k54
4187e3r2J52K16l09JK21Jk58j17M61j34k05J24J24o8k37K00J42j67j09J39J64
4209A96k39j58L42ok15p4L00o3k77J49J94j33j67J00K67k25j47J59J66j99j65
4230a95K92M7k11m6K81o8k78J08J90q2j39Q9J86k20r8J51J31j58j11K95J5k64
4252h5l4K20N8l15P6K62j57j68J44J63j75j77K16O1j13j24J91J49k37j01K51j3
4274I2k21J5K99j24j67O2K02j30j96K25Q7j43j54J91J50k64j21L03l1j83l1K70
4296A31j8k90J57J10o0j65J35J95k28j14K36O0j90j29K45L1k24M2J71Kk57M9K10
$$ y = [223, 31, -122, 36, 188, 8, -206, 96, 175, -78, -184, 103, 172, -166, -37, 133, 40, -115, -90, 184, -27, -143, 20, 117, -43, -206, 141, 157, -107, -169, 79, 160, -110, -146, 185, 59, -169, -39, 203, 27, -203, 49, 201, -53, -145, 7, 223, -86, -85, 136, 137, -121, -238, 223, 89, -116, 8, 132, 64, -173, 27, 169, 2, -107, 32, 196, -43, -201, 141, 135, -80, -154, 146, 83, -194, -45, 149, 16, -151, -51, 216, -9, -156, 3, 169, -30, -195, 97, 144, -67, -113, 168, 100, -178, -70, 120, 38, -101, -12, 174, -46, -144, 7, 138, -20, -131, 164, 179, -85, -119, 101, 159, -156, -80, 182, 25, -143, 1, 164, -11, -188, 28, 89, -24, -148, 43, 192, -45, -146, 105, 92, -129, -114, 185, 61, -106, -44, 158, 28, -168, 57, 144, 1, -153, 38, 188, -76, -197, 106, 75, -108, -139, 131, 113, -177, -20, 90, 30, -135, 0, 195, -33, -147, 89, 149, -41, -170, 75, 106, -118, -76, 95, 97, -160, -111, 99]
4319I9l1j33L1K43k25n6O5J27k13j20L62k6k61j8K25J8k21O8K16j08j67P7J59
4342A11j11j42J40R2k00k4J17J59k20m1K59q3j83M0K39j59j52Q2K63j21k37K24
4364E3J11j80r5J76J41k84j07K82K5k30pK11Kj91k0L19j83j75J66R6o5j79J64
4387C0Q1j75o7K13j4j38l6K34l4k42R5K07j14j98Q6J73j11j66J77P2j45l4J62
4410E6J34k84o5K82M0k82R6J32k9j89M4K37j54j98K61K7j25j61K94J00l17j8K52
4433A33pk49j4K31l5k86J97K11k04j47J18J95j28j09J06J61k25j31K15M1k02M7
4455h2K28r8k10R5J45o3j58Q3K76j98j17J38O8j43j20K00P6j81l0J76l9j75M6
4478h3K48q0k18J63J39j50j36J93J03k62j08K55Q0k48K6J93l5k86J23K14j15j25
$$ y = [99, 68, -65, -34, 209, -16, -72, -7, 120, -93, -213, 149, 123, -138, -156, 69, 87, -134, -66, 150, 42, -125, -48, 111, 0, -142, -2, 90, -110, -134, -17, 142, -78, -119, 140, 57, -126, -86, 153, -6, -158, -76, 187, 66, -171, 53, 164, -16, -111, 65, 206, -78, -185, 97, 122, -108, -115, 96, 98, -93, -113, 206, 23, -152, 14, 110, 45, -134, 30, 111, -64, -131, 82, 68, -70, -106, 128, 94, -148, -53, 154, 40, -158, -72, 101, -10, -176, 1, 73, -72, -106, 56, 190, -94, -159, 123, 163, -119, -23, 109, 80, -109, -65, 172, 18, -180, 81, 108, -17, -178, 116, 216, -101, -119, 133, 126, -123, -137, 94, 59, -227, -30, 181, -23, -170, -52, 143, 15, -94, 12, 173, -52, -183, 32, 73, -129, -82, 146, 48, -162, -67, 78, 15, -143, -60, 216, 18, -99, 39, 107, -36, -156, 44, 120, -61, -91, 85, 46, -129, -83, 165, 85, -133, 30, 169, 19, -117, 76, 179, -83, -191, 64, 144, -104, -78, 115, 80, -206, -83, 131, 16, -109]
4500a09O9J76j35j50J02J63j90q2J59J05j80p8K63J7k75M5K48o6k24R7K06j21
4522D0k32J76J77k00m7P6J64k22o2K85j7j67o7J84mk56O9K40j69j08J49J42j71
4545b0j44J71P0j88K4J60Oj20m2J39O6k74Q5J55m0j84P4J87r0k37K21O5j45o9
4569a30K02J7j98kK69k9k76J45J73j48k10J82J52j22j76J45J27j64k8J00J22k23
4591g2jJ80Oj92j8K19j10j20P2K31j66j60J63J33j71j95K80Q6j88j22K10M9j68
4614e4n5K49k4k33O6J38k6j79J13J78k11q4J16J67k22q7J98J0j39%J69p3j09N3
4638c9J88m9j77P3J49j66j09J28J62k42l7J97N4k27nK27n7k58J25J45J8k66J60
4661fP6p7q6J06J95k81o2J51R4k29m7K47Rk22J24R3j8j85N4J41j28p5J43Q1j46
$$ y = [-109, -40, 136, 1, -149, -47, 116, -74, -156, 3, 108, -72, -150, 113, 130, -145, -100, 148, 82, -142, -45, 161, 40, -192, -16, 161, -39, -86, -10, 154, -68, -130, 155, 138, -29, -96, 88, 84, -172, -103, 137, -32, -140, 9, 151, -20, -164, 7, 77, -111, -87, 73, 79, -41, -83, 56, 122, -152, -67, 88, 48, -136, -62, 125, 35, -202, 19, 84, -61, -130, 72, 89, -109, -111, 158, 129, -147, -2, 171, 23, -187, -5, 147, 25, -151, -6, 121, -43, -71, 29, 151, -72, -73, 107, 113, -79, -97, 122, 12, -108, -36, 195, 29, -131, 32, 165, -6, -201, 79, 165, -23, -145, 65, 114, -54, -109, 140, 116, -117, -51, 87, 61, -118, -5, 173, -38, -122, -6, 161, -61, -148, 50, 60, -79, -79, 90, 17, -92, -39, 149, 100, -77, -4, 145, -21, -130, -2, 160, -82, -119, 78, 132, -95, -100, 127, 70, -188, -63, 82, 100, -166, -6, 70, -7, -93, 13, 208, -73, -135, 16, 110, -119, -166, 81, 90, -132, -8, 85, 67, -118, -64, 77, -51, -126, 17, 98, -48]
4686d8p6K16L6k07n5K14L7k62R5J45k6j66M0K19j07j70R8J72j36j96K05J34k14
4709e2n3K54o7j21j09K48n7j06kJ85k5k74J50J82j70p4J20J35j96j14J61K9r8
4732e4p1K36j6k37l7L14l3k87J59J51j54l5N1J64k12k1J29N9j13r4J35O2j72N6
4756b0J15lj46l2K38j50j32J27J25j37j23K32M0j64j25K11R0k37L6J72q7r6M6
4779b0R5p3j66J39J90k17l0J26J51k28n5R1J01j04m2J40j0j83qK60j03k50J92
4802dJ47j68j63J91J49k03n2J13J33k49QK21o2j75P4J99j02j92K00M8j30o8P7
4825hJ92k08j41J84O7j46r0K54J0k08P7J13o4k23J26K21j50j02Q9R7j18o9J29
4848C2R2j87o0J85J3j38K0J28l0j73R0J79j31j22O3J63j05j28J64Q4k18LJ21J24
$$ y = [-48, -124, 92, 128, -79, -134, 80, 117, -145, -50, 95, 69, -97, -57, 162, 55, -115, -17, 155, 19, -177, 28, 162, -52, -105, 149, 82, -39, -148, 100, 43, -63, -65, 120, 95, -179, -29, 153, -17, -91, 29, 164, -32, -146, 15, 44, -54, -125, 111, 95, -142, -179, 135, 102, -185, -26, 125, -29, -64, -13, 151, -61, -82, 47, 106, -7, -101, 34, 96, -76, -20, 95, 92, -54, -86, 152, 2, -130, -3, 122, -15, -138, 94, 134, -30, -155, 56, 146, -91, -55, 117, 30, -66, -20, 75, 2, -164, -25, 165, -52, -82, 44, 195, -33, -88, 3, 104, 0, -42, 98, 88, -95, -103, 157, 54, -196, -4, 143, -25, -188, 3, 152, -51, -103, 10, 143, -106, -98, 123, 61, -114, -40, 159, 57, -135, 65, 113, -17, -85, -8, 184, -24, -165, 19, 86, -60, -150, 104, 114, -94, -17, 96, 32, -191, -65, 156, 6, -96, -7, 90, -28, -97, 32, 124, -63, -123, 62, 75, -63, -43, 85, 55, -118, -28, 151, 20, -102, -39, 124, 19, -109, 55, 139, -79, -76, 45, 169]
4872A69k14n8K18p7j04mK14q5j41L3J45r8j39J66N0j24m6J39O7j76m9J52j1r1
4896f4N9R9M5k68R2J51r2j40J16P9r3j50J47J26j47q1J65Q7j76j7J85l3k34J53
4920IJ15j64p4O4J93j19r9J18N6j01o1R4J31k16j27K84J1k97J32K13j02j66R2
4943a4J49j80j01K04k0n2o4J08M1j48O6J9O7j50LJ62q2j13N2J06n0j77J52P5L6
4968H9j71J25N1j14n6R1O1j73M3K26m3k13R0J07k0j82J26Q7j28o5J15K2o8r5J28
4993C3M3j66J1J47j3j99J17K05j32j45L6J35j20q2J20Q8j05q1J32Nr6K0J69q9
5017C3j60L8J94o8j22O1J43j16j51J83M6q6l0N3J42k20l0J84%k43R7K10j04j22
5041f8pJ57q1j40J44R7j83m3J98N2j77nJ00M0j43OJ48n2j03mJ74m0k00R1J21j49
$$ y = [169, -45, -103, 115, 38, -66, -70, 144, 59, -82, -49, 96, -2, -141, 25, 75, -49, -95, 44, 111, -65, -114, 38, 27, -64, -5, 94, 139, -129, -37, 114, 22, -118, -2, 77, -16, -166, -19, 107, -40, -121, 44, 131, -45, -62, 123, 90, -144, 9, 124, -40, -114, -50, 143, 24, -75, 43, 99, -2, -63, 31, 162, -54, -181, 103, 114, -183, -51, 162, 60, -106, -14, 135, -45, -146, 58, 38, -14, -78, 30, 71, -77, -11, 8, 75, -75, -72, 90, 8, -105, -53, 53, 3, -174, -22, 53, 89, -82, 43, 94, -20, -76, 15, 76, -97, -54, 172, 129, -84, 6, 113, 93, -89, 37, 124, -4, -69, 46, 68, 0, -95, 33, 76, -90, -79, 68, 55, -144, -27, 178, 46, -99, -63, 72, -48, -130, -10, 78, -27, -108, 24, 29, -67, -47, 122, 33, -127, -89, 105, 37, -85, -24, 119, 3, -148, 35, 81, -5, -35, 18, 160, -60, -90, 94, 94, -149, -52, 158, 54, -68, -75, 82, 1, -139, 5, 102, -81, -124, 74, 126, -51, -56, 44, 84, -59, -53, 95, 43, -60, -64, 110, 70, -130, -39, 82, -67]
5067f7oJ04P4j85n7J80J8q9l8J91o6j54rK21o6j15OK09j22j59J45J13j59n8J65
5092G6Kj49m1K31o1j17j6J74p5j16R5J39j33j54J63J58k26j2J22J8r3q7J86Oj99
5117a09M9K21j21j05J8J04m1r6N9J21r8j10J14J30j89j9J30M0k17J14P9J1j50
5140f5J2J70j46j24J46K01k22o7J36Q6j11j29J10O7j32L4J34m8j04j0J21k4j22
5163h7P3J13r6j29J34M1n7r9J50M7j21l6J13N9j85L9L7R7j71N7J61j31r6J20J07
5188A40j27j26J79N1j62m6J45k5j16kJ95k1k28J24J17j49l0P9J03r9j11J45Q7
5211A23j84PJ33M8j30j3P9Rj44O1J07r2p3N4J09j10r8J54J9q4l7J34l2j12j0J59
5237G7J2j67M4N9Rj46P4J85j36r3P2J52j51m3O3M8j29K8R6O8k02jJ87l1j44J04
$$ y = [-67, -73, 31, 105, -80, -137, 43, 61, -28, -66, 125, 59, -95, -104, 117, 51, -64, -58, 151, 29, -130, 15, 128, -31, -89, 76, 78, -71, -112, 119, 58, -59, -75, 99, 24, -92, 3, 142, 9, -145, 18, 176, -50, -62, 60, 78, -15, -102, 84, 90, -109, -60, 161, 40, -65, -47, 57, 16, -80, -21, 100, 2, -108, 6, 136, -53, -72, 58, 98, -119, -5, 74, 85, -65, -53, 117, -29, -153, -7, 194, -28, -95, 41, 127, 16, -113, -3, 64, -68, -34, 100, 52, -52, -62, 59, 35, -87, -14, 99, 3, -126, 8, 49, -8, -107, 43, 90, -31, -67, 46, 105, -80, -41, -4, 93, -78, -21, 140, 9, -87, 33, 140, 13, -113, 66, 117, -45, -91, 54, 29, -87, -89, 106, 85, -143, -19, 98, -51, -81, -2, 101, 2, -109, 36, 123, -61, -54, 79, 127, -3, -16, 63, 72, -72, -11, 96, 4, -69, -15, 94, -16, -114, 40, 59, -25, -62, 72, 40, -72, -82, 77, 89, -78, -34, 25, 34, -112, -38, 147, 11, -82, -10, 142, -9, -52, 11, 59, -70, -42, 54, 122, -80, -81, 106, 75, -69, 35]
5263C5M7r1j01Q8J35j25p2J29Nj72R2%J35k38P8J31q2o2j5J83o7q8P3J20j55m0
5289e7J22J5j37l4J90j4j36l7J24lj13K0J03qj05N7J31j02j01Q8R1j36OP3J4r4
5315d3k0J56J9j54l6J65l1j44J40M8j42PK6J79j41q6L1P7j02l7J55L6k06N6O7
5340B0K7j35M7J04n4q0L2J34j48K8Q4mm5j05J52R3k07m1J90m4j36Q3Q9m3j86J07
5366c8R2o9r1J04L0m8J0Q9O6j74o8J45nj11O9R1p0j11Q3J06r4r4J42J00j58o6
5392g0J26M6j43n8K17o0j92J21J05j6j63O6J51k07n8J22J44k14k6J24J04j61l8
5415h0J42jj06J0J16o3p4QJ54k7j15P9P2j93l0J48L7r8o9O9L9j20M4J75p4j14
5441g1M1J37n6j42R0R4o6j17J34pj04j3O0J12k19L3J92n6p7r1K53j47r8J30L1
$$ y = [35, 82, -9, -110, -22, 113, -12, -84, 45, 50, -122, -30, -30, 105, -133, -55, 76, -6, -68, -83, 100, 33, -55, 18, 138, -17, -57, 65, 80, -57, -91, 99, 85, -51, -88, 36, 33, -80, -60, 43, 35, -70, -13, 118, 16, -85, 3, 94, -42, -36, 37, 51, -43, -63, 93, 112, -42, -78, 87, 56, -88, 52, 100, -42, -35, -9, 170, 29, -57, -26, 51, -51, -88, 67, 103, -103, -47, 20, 47, -88, -41, 63, 9, -71, -39, 95, -53, -25, 59, 55, 10, -95, 57, 150, -57, -98, 92, 48, -88, -5, 84, 41, -145, -38, 54, -15, -106, -2, 28, -20, -10, 79, 145, -29, -97, 48, 43, -68, 1, 92, 22, -89, -6, 100, 6, -88, 54, 154, -4, -70, 56, 102, -41, -99, 118, 58, -134, -13, 92, 76, -87, -21, 130, -77, -135, -13, 131, -83, -109, 15, 119, -42, -80, 62, 61, -45, -35, 81, 18, -56, -48, 106, 79, -36, 43, 115, -78, -108, 40, 77, -21, -90, -21, 18, -102, -58, 117, 43, -71, -30, 107, 51, -91, -1, 93, 27, -90, 44, 37, -67, -80, -20, 92, -127, -94, 98, 42, -35, -126, 127, -20, -118, 12, 43]
5466D3r2q0Q3J60j49k5L3J45j81k8J24L2j33k4J39P9k50J00J32p3j26Q6J16j63
5490e2k8O5P4l4j25J70M9j65%P0P1j52o0K17p3j63J29J33j43j06J19N4j18o4J41
5515IN4j09N6K3P0j68J1J35o9l9L3M7q5o5J83j1r9n0J00N9r2OJ26j10r7N5P3N5
5543A01k11J09O4l8j15J20P3j98M0J19J6j44J6J49Mj74KR5K8j06%J31j14n5j9
5568a07K19j68p7J20P2o3j10J66N3j50N9R6q5o7n8J54m3j05P1J29j41J9l9J13
5592E8j49J7J00N9j47j2J52k0j77R7J29j06l8mQ7l0j19J48J6j28l4J92O5j73m4
5617f1J04K3j49RR5N6j40pQ5M2k25J90jp3l5J30J3j37lR0O8j16k5J24n7q4N1Q1
5645D8m0n6O4O7j28n5J39L5j27p4J77O7j52l9J57Qj57l5J81n9j22J65l2o2j8K2
$$ y = [43, -49, -129, -46, 114, -35, -60, -27, 118, -63, -91, 33, 65, -68, -92, 47, 126, -124, -24, 108, 35, -91, -5, 111, -52, -80, -15, 59, 25, -100, 70, 119, -46, -46, 24, 95, -57, -117, 100, 27, -136, -7, 126, -17, -123, -4, 50, -68, -132, 9, 63, -46, 10, 33, 103, -65, -54, 81, 12, -27, 6, 53, -32, -97, 86, 75, -24, -74, 26, 85, -7, -1, 125, 15, -82, -27, 46, 101, -110, -1, 63, 25, -90, 30, 103, -95, -55, 64, 80, -64, -48, 101, 105, -69, -67, 28, 56, -50, -50, 81, -33, -88, -107, 112, -56, -133, -13, 59, -4, -114, 52, 105, -45, 14, 110, 25, -42, -100, 54, 11, -94, -23, 106, -35, -16, -55, 58, -91, -74, 26, 85, -62, -74, 78, 58, -119, -22, 107, 1, -37, -41, 46, 16, -103, 45, 61, -67, -101, 91, 156, -17, -61, 43, 66, -83, -74, 21, 77, -63, -70, 15, 57, -168, 22, 21, -52, -87, 43, 56, -81, -84, 6, 74, -42, -67, 57, 0, -84, -33, 48, 8, -48, 16, 83, -45, -100, 39, 74, -53, -127, 50, 117, -35, -74, 83, 91, -66, -101, 80, 21, -101, 64, 32, -30, -48, -26]
5671b6J44n1j22R2Lp2l4J31j6j33j2J36o8m3O9P1n3ol0R3j26j8P9O6j42j8J63
5698G7k9p7r7K07n9n5L7P4n6j52J08J12j16p1J24Pq5J6J34j7j22j1Q1L1j43Q0
5724bN5o8m9N0J42q3j55J53P0k04kJ14Ol1q2J64r0n2K7J13j5j30N3N3j4q3J8J36
5752I4j37j17J90P9j31p6J16L2r6j5J19j5j34M9J20j3j65O3R9l6j09K07j6k12
5776a04Q0J07K1j66Q1M0o7l7j7R3j4n4L2R0j12p5P8R0j23L4Q8%j30J0J21o3o5
5803f2L5L3N9j32J23N2j47n2O5J04j23m4J26M9j15J1J11m2j25N4K0K8k9K3P2j06
5829a2j8N8R6j73n6J26rl9m8J40Kr4K3O4m6j36J26M7k2j45J44M3r8n9K2J07n6
5856a3m9P1P6j10p8K00l1j15J3J34r4j11R8N9l9j16R3N3m2o4J34m8j0o5R4M9j70
$$ y = [-26, 118, 67, -55, 37, 40, -32, -66, 65, 49, -84, -96, 40, -28, -71, -2, 69, 16, 10, -20, 73, -53, -71, 8, 74, -68, -86, 77, 48, -29, -126, 81, 22, -33, 4, 78, 22, -130, -22, 90, -26, -97, 27, 34, -51, -35, 99, 82, -40, -51, 30, 61, -82, -2, 53, -15, -64, -14, 128, 45, -110, 43, 113, -91, -93, 21, 27, -4, -86, 78, -12, -64, -37, 76, 61, -69, -16, 37, 23, -60, -42, 94, -43, -160, 30, 109, -22, -98, 18, 50, -46, -61, 58, 43, -91, -42, 78, 65, -100, -37, 62, 26, -83, 124, 108, -104, -24, 83, 104, -62, 19, 59, -8, -45, -62, 31, 17, -37, -5, 85, -27, -102, -24, 66, -57, -23, 65, 65, -65, -55, 66, 3, -62, -27, 6, 65, -67, 56, 108, -39, -91, -26, 78, -45, -89, 37, 86, -29, -18, 93, 51, -74, -20, 0, 28, -1, 22, 94, -12, -30, 28, 124, -49, -105, 21, 12, -27, -75, 65, 67, -27, -4, 60, 14, -122, 4, 51, 29, -116, 28, 71, -27, -86, -64, 43, -13, -62, 9, 85, -25, -103, 97, 66, -49, -36, 98, 4, -107, -9, 50, 11, -105, -12, 41, -1, -65, 69, 21, 11, -54, 40, 89, -81]
5883h1P8jK6r5K2J75j35j33J19O7j33K3J18m4m7k5J79l1j43N4J06m0j44M4J31
5908I0j30o5J17N2J4j96J81Kq7l6P8M2j30N6N6L9j54O3O4j11N7k4P8n2m2K4P3
5935E9p5m5J12O5k02M7J29k0j84P9R0p1p9L1J31q3QRO2o3j3M9L7n6j05R3P0p8
5963cJ3L6j7j18O2M3j9j26J23P8q5p6J18j5j8m1O3j3p7M8L9M1l3o2J06pm4p1J18
5992F3k6r0O3P1q8q5K05l0j74R2J2k5LK0N2m2j18J29O7j22m1M4J64j82l8Q4M7
6019E5q4q2K05o6r3%J54q7p8Q3O9o5j21J9J38o2l5O9J00j29jP8p2m0J05K8r9K3
6047A2m0J20j18k1N8O4p4o2P9M1q3l5J18lo5j8J13rj67K9J19l3q8K3Q2r9l5J06
6075A4R9j31j3J13m1n7j00J26Kq8Q9N3m0j02Q2P2l1j67K05nj30N5K8K2j08nR0
$$ y = [-81, -3, -4, 22, -73, -51, 124, -11, -144, -25, 42, -91, -68, 50, 6, -41, -66, 113, 82, -61, -7, 99, 59, -85, -41, 90, -40, -105, 12, 64, 78, -118, 63, 65, -22, -58, 20, 62, -68, -12, 44, 83, -71, -8, 56, -55, 2, -22, 56, 4, -38, -14, 59, -16, -61, 51, 116, -86, -39, 90, 70, -114, -35, 55, -16, -95, -64, 67, -16, -8, 1, 63, 0, -13, 36, 73, 17, -88, 5, 75, -3, 10, 46, 29, -89, -27, 16, -3, -129, -6, 72, -13, -89, 29, 14, -4, -45, 18, 5, -72, -24, 15, 56, 23, -39, 67, 60, 16, -55, 63, 37, -53, 10, 81, -7, -92, 113, 83, -91, 1, 13, -12, -9, 11, 63, 21, -97, 32, 99, -23, -64, -20, 144, -38, -76, 8, 55, -29, -111, 94, 28, -65, -65, 89, 2, -76, 7, 76, 11, -110, -91, 47, -15, -50, 19, 119, -10, -11, 67, -5, -45, 60, 88, -11, 12, -28, 92, -26, -47, 11, 75, 1, -61, 18, 59, -24, -59, 59, 56, -9, -27, 86, 77, -90, -61, 58, 25, -63, -40, 42, -57, -92, 14, 113, -18, -31, 82, 41, -16, -116, 10, 12, -76, 13, 66, 26, -76, 6, 78, 47, -120, 85, 80, -50, 5, 33, 55, -53, -58, 32]
6102C2ql5n4J41k8j18R1M9o9o4R8O2j29p5J25M3r2p6J56j9r5K2K3N1p7L1J08n5
6130C8j65J67O7j08j4j7J17j61j1J73n9o3j1N8P6r4lN4k6p6k2J44m6l3P8J8q4
6157cq4J14K3j49P0K7N0q2rJ45p5m8O3rk7j02J21N3r8pn6J41q5j7R1l6j18N7J37
6186H7lj28j5J40o1q2Q4J3n3l2P2N3j39J7N7M9n5o0P0M9j33P9K2l8k2J07k0oj03
6215e1K2J34j06o9J66o8l6o8J32Mj06J0P4L0j52O1K8k5r4J19M2r1k1P9P5j50J4
6242d7Q8kn5k9Q7r5Q0L8k9j8n6l0J20l8r0J03J4r9j5Q4P3j06J7J02l4j05K8P3
6270E9j0m5l4L1l2k7K3J32r8mO6k2lj23J72n1j27J01L7k7j29J23N1lj35N6Q7j51
6298h3MJ59k1j16n9J40M3j55M9Q3qj23M0J17J2j21K1O8r3p8J60nn7K1P7J5j18
$$ y = [32, 24, -11, -65, 76, 48, -70, 21, 70, 1, -63, 35, 97, -32, -107, 18, 61, -31, -107, 49, 30, -65, -43, -20, 31, -46, -15, 93, 38, -127, 40, 107, -1, -15, -32, 85, -76, -87, 86, 27, -36, -47, 11, 87, -7, -10, 44, 18, -58, -80, 64, 18, -15, 63, 81, -3, -87, 27, 50, -99, -29, -2, 48, -34, -43, 102, 27, -21, 42, 33, 6, -96, 25, 78, -20, -27, -83, 58, -27, -44, 47, 11, -107, -50, 87, 84, -44, -59, 81, 20, -62, 22, 35, -18, -50, 22, 75, -64, -47, 10, 59, 4, -56, 14, 63, -70, 9, 31, -7, -29, 78, 58, 52, -51, -29, 105, -1, -70, 96, 28, -8, -76, 56, 60, -46, -36, 38, 68, -84, -23, 5, -20, -114, 5, 47, -44, -65, 14, 89, -61, -47, 41, 39, -16, -45, 42, -53, 27, 65, 36, 18, -38, -68, 52, 14, -76, 27, 41, -58, -73, 11, 84, -22, -5, 97, 63, -42, -14, 59, 49, 4, -30, 1, -31, -58, -35, 97, -1, -5, 61, 39, 36, -87, 85, 34, -93, 8, 45, 18, -111, 12, 63, 60, -75, -19, 68, -83, -79, 80, 59, -57, -116, 24, 67, -88, -39, 44, 36, -87, -47, 70, 82, -39, -18, 50, -43, -121, 39, 34, -23, -2, 75, 90, -28]
6325b8j0O9j4j7nL7j9p4M4L0J9l0M3Kp0j5J59j18p6J0J12l8J1r8J04Oq2jJ00o5
6355a4q9J44J9r9n8R7J5q7M8J26k5o3j01J21N7j05J03j9q8L1j0J17j41k4J06m2
6381A9J0j32J85m2r9N1N9k8j07J00O2j44j1M7R7j03mO4jl9k9J39o1q3K0M0m2m7
6409g9P5J08j29K0PO2k2q6M8Nk6JL5Lr1K4P8N8j79L2R9L2j12P3K5q2o6P4P9r9
6439c3j3O1P6j22J1M7m6J5N0k4Mo0J5J24r2n5l9J44j13m8J26J7r4j5J25l8m5k3
6467d5K3K8j02P5P3r3K3J5R9j25l9R1N9j14j9N9L1j23P0N1N0j02k0J18o1o0N3
6494A5M3n5lJ7M3r6j0L1Om1J8R9Nj13kQ0J8j12q3K63j48nK6O8o6oO4j7j8n7N3
6525A7K7j37P8K7K1q5L2J52j28p3L5J53r0o3Q8M1j07o0J54l7j03J08j9k6j1L0
$$ y = [-28, -38, 31, 17, 0, -5, 32, 13, -61, -17, 13, 32, 2, 45, 47, -23, -38, 121, 3, -73, -63, 49, 11, 22, -76, 28, 34, -48, -49, 51, -14, -103, 41, 60, -39, -97, 0, 15, -72, -24, 102, 77, 14, -87, 34, 91, -14, 89, 70, -18, 13, 3, 120, -21, -45, 61, 19, 29, -103, 82, 40, -59, -8, 51, 23, -84, 16, 78, -66, -77, -30, 67, -36, -40, 24, 23, -16, -45, 94, 33, -50, -30, 10, -32, -79, -4, 104, -25, -5, 2, 64, 42, -44, 4, 9, -17, -16, 19, 22, -69, -45, 33, 91, -88, -56, 43, 75, -37, 36, 61, -21, -87, -13, 66, -33, -46, 15, 91, -31, -20, 27, -19, -4, 46, 22, 26, -34, -19, 105, 13, -42, -81, 63, -50, -98, 28, 45, -49, -64, 61, 23, -22, -45, -22, 6, -96, -21, 52, -41, -18, -3, 96, -29, -68, 23, 82, -32, -51, 8, 39, -84, -14, 37, 87, -15, -35, 83, 22, -38, 15, 58, 3, 0, 17, 60, -36, -46, -15, -9, -50, -32, 67, 72, -41, -43, 37, 55, -57, -140, 123, -25, -30, -4, 64, -2, -8, 56, 39, 21, -36, 17, 44, -93, -15, 12, 33, -52, -20, 132, 4, -69, -34, 119, 29, -34, 54, 95, -12, -72, 82, 45, -58, 50, 31, 5, -6, 24]
6551B4Q4m8j00R6J1q5l3J53j8j89J03k3J37j29n7R7M6q6K5Q1j12oN9k6k3q8J05
6578bJ03j13o7Q1J46j54k4K6Q2j23J5R4n4N4j26O7j0l2j6J14n2q2Q7K0p9J7Q6
6605E8k8r2J7O3L9j09K1L7j6L2N7o5k6m2J26L3j97O7K8K6o9l6Q7k8l8R5k6N8j86
6634a14R5J24j35j9N2K4J5j41J95q1m5OP4Oq1pQ1J5q9O6M8l5j14O6J2m8m2Q5k3
6663a0p9PJ61kp4o5J36nj31Q5PJ6j08K7N5K4j33R5L3r3KQ1l6N7k2m7P9j10N2J12
6693A14q9q2P9Pm2j9O7J4r9JQ1L3r5k0Q5k2r8JJ54j17m4O7J32j07o4J20rj8j03
6722g3J56j4p3j5R1l5j17J3J42j6j17J7O9K5j22L9L2m2J6J6j1l5L0Q8j5j13QJ11
6750E5r8L0RN2Lj06MJ16q6j2P9j1q6J7J00m9J2p8J21p9j7j9J27l3q3PJ16p0o5
$$ y = [24, 108, 60, -40, 56, 67, -18, -51, 102, 84, -105, -2, -25, 112, -17, -74, 23, 69, -17, 8, 89, -23, -29, 30, 4, -19, -107, -2, 101, -12, -79, 2, 148, -6, -30, -4, 78, -45, -30, 64, 10, 64, -62, 5, -5, -37, -53, 61, 9, -73, 14, 34, -45, -28, 58, 30, -62, -45, 18, 57, -52, -31, 6, -10, 22, 79, 14, -12, -54, 72, 105, -92, -25, 3, 29, -40, -76, 11, -17, -55, 40, 14, 72, -114, -19, 105, -30, -49, 3, 27, 42, -99, 96, 15, -30, -24, 50, 56, -25, -32, 49, 64, -25, 41, 89, 54, -60, 6, 18, -30, -72, 13, -10, -89, -82, 79, 77, 3, -62, 74, 69, -62, 23, 30, 46, -62, -35, 20, 44, -89, 6, 39, -54, -52, 29, -7, 50, 28, -19, 60, -50, 2, 114, 25, -57, 22, 29, -13, -32, 35, 49, -50, -49, 32, 65, -30, -50, 35, 13, -85, -84, 70, -47, -91, -24, 108, 1, -63, 57, 48, 30, -73, 83, 69, -4, -19, 72, 37, -80, -67, 75, 59, -58, -41, 28, 53, -69, -30, 2, -40, -24, -8, -19, -54, -24, 64, 49, -64, -56, 55, -43, -13, -4, 48, 51, -55, -51, 65, -21, -33, 46, 35, -51, -34, 66, 17, 29, -49, 72, -7, -24, -43, 84, 51, -32, -25, 91, 21, -44]
6779d4K4N5k3m4Q6k2j09L3J39r5p1N5N4l7l5J5M9n5m3J6Q4n4j11J21O2J3j58J01
6807FK9r2O9O5Pj21L5Q8m7l4j6O8l3m6P4k1r1%O0J9o0Q3K5l9r9N9R9o7j15Q8P8
6838G1r3KM5rp4j1N5O2j00L0J26o6m5k2J19j10p0R1L9j8k9J2K2L5j29O2N9p8P
6867a7J6Mm8K6J29p7q5J9Q5m6j18J16P3J5j21K8PK8j7Q5n6j30J02KL5r0ON4r0
6896f5k8J27L3m9k9K9m0oj3R2k0o8j6R0J1k00J60O4o7p7O3O8k9p0M5O4j8n3M8
6925D6K6j42L9P1J4j37P9R1k8j05L5P8p9q8J16O0l6o6O7L3j35N7mQn7L0M4O2q1
6954bl2R5o9r1O5J16r5l8J05K4q0rQ7j5j23j4J57rn2m5N2r8PO7J2L9n9K3k3p0
6984g5P2j0N5m8L6L7j2o2j5O3ko0J5N9p6m7Q5M7m7l7L1P9o1p7M3Ql7l8R0K3o5
$$ y = [-44, -20, 35, 12, -32, 54, 32, -77, -44, 95, 0, -71, -16, 38, 1, -34, -19, 30, -25, -68, -52, 32, -22, -133, -12, 50, 63, -95, 6, 35, -57, 12, 77, 84, -37, -2, 86, 39, 5, -11, 57, 24, -22, 52, 31, -60, -60, 0, 19, -41, 42, 67, 28, -71, -12, 87, 20, -95, -7, 71, -22, -20, 25, 16, -58, -69, -14, 48, -52, -22, 104, 38, -7, -29, 90, -20, -90, 1, 40, 22, -7, 5, 27, 62, -67, -5, 54, -24, -17, -1, 3, -45, -19, 110, 33, -52, -33, 52, 6, -112, 4, 77, 92, -29, -1, 6, 34, 17, 102, 46, -84, 18, 20, 55, -35, -29, 25, -65, -93, 34, 67, 18, -11, 18, -22, -28, -41, 51, 31, -37, -53, 37, 48, -152, 8, 72, 5, -72, -9, 59, 30, -40, 5, 69, 51, -2, 46, 72, -70, -31, 40, 54, -83, -4, 87, 59, -46, -11, 67, -12, -100, 16, 76, 40, -26, 41, 74, -61, -4, -8, 0, -57, -27, 17, 79, -2, -34, 61, -8, -99, -34, 82, -13, -51, 54, 78, -2, -11, 76, 61, -62, -76, 81, 72, 20, -25, 27, -71, -64, 3, 15, 54, -5, 18, -5, -75, -3, -13, 42, -6, 30, 67, 55, -7, -22, 41, 39, -21, -6, 53, -23, -70, 15, 62, 15, -22, 9, 88, 27, -50, -7, 1, -36, -74, 16, 39, -26]
7015b6J4L5nj7p1J14j30P6K8K5l0r8J28J1j16L9P1p1J4rP8n0l5K9O9j2o8L5l1
7044cJ0q5J09K5n0j7Q6l8n3pJ02o4j01P2J08r1j8P6J6r0m4P4L2q8NP2nr1J5J10
7074F7r5j07J03jJ6p9J04O6j43K0O9K9p6kR0o7NpJ33j23L1m4J39j84%O8P5j08
7102b1J8P9J0r8m7J53q7n3P5M4j10j0N3J14j09p4J47rj04l4L2J07j73M0J15Pj47
7129h2P2N8n0m2P4j2m6k7L8L5n4rN4J4l5lM6K0n4j8O9k3l4oO9L7j06J3R8m6n8
7160hN4o0k1kJ21m2m5l8L5L1j03RJ52j05Oj0M7q5lQ4kl4m5Q1P6j12k2L6M0n9j
7191b5K4l6M7JN3n3k8P2j4k4j6J1L5j31N6P1L2q8j2R2ko0k8P5n2n5J00pn7j2L6
7222EP4r5p4R4J0Mo0R7pj41J05M0l1o2J4R3r3p0M6P6K1j60R9L6r7Q5MK9o4j9R2
$$ y = [-26, -12, 23, 18, 1, -70, 44, -86, -10, 18, 43, 13, -85, 43, 54, -62, -23, 48, -23, -9, -18, 60, 10, -25, 4, 73, 61, -7, 28, -3, 7, -78, 31, 56, 6, -11, 75, 37, -16, -23, 79, 15, -86, -14, 94, 3, -15, 61, 77, -13, -57, 17, 49, -39, -34, 38, 33, -58, -43, 67, -28, -135, -32, -33, -17, -96, 8, 74, -69, -49, 20, 49, -27, -29, 61, -6, -1, -8, 125, 2, 33, -11, 128, -56, -56, 12, 87, -21, -3, 76, 86, -12, -59, 94, 7, -46, 29, 73, -37, -47, 6, 120, 11, -63, 84, 75, -29, -63, -31, 76, -97, -57, 58, 65, -82, -10, 48, -2, -44, 30, 18, -28, -55, -17, 18, -36, -45, 9, 23, -12, -15, 31, 51, -3, -21, 48, 25, -9, -15, 54, 91, -15, -2, 96, 50, -8, 46, -14, -35, -37, 84, 42, -3, -41, -6, 25, -78, -69, 83, -22, -16, -26, 21, -64, -67, 17, 15, -19, -64, 17, 93, -19, -41, -5, 35, -24, -25, -1, -37, 10, 11, 64, 11, -17, 55, 41, 17, 1, 12, 47, -84, -28, 43, 75, -13, -25, 67, 65, 5, -23, 52, 0, -55, 45, 38, -19, -31, 5, 79, -16, -90, 4, 14, 18, -42, 55, 48, -93, 12, 52, 21, -41, -27, 66, -27, -97, -51, 25, 46, -114, -15, 21, -76, 9, 13, 42, -22, -41, 51]
7253E1Ol1n2N1Qq9P6JK2r1O5J1n6J3P9n3q3K4J84j09j27K8J13n8m9J00rn1QM8
7283C0K7o3lM8j9kk6O4K0j08j3J02l0o8MN3Qpk4%m1K1O5k4m9K2K4j1N5p7J06j30
7315d6Kj7J35p3q2J04M9k9j13Q5Jq7O0J69j04r0QJ9P5j07L4J03j31j2K2J03j21
7342d3J8O4j1n3m8J56l1n7q8J42l7q7O3J33j00n6L0P2q8l4Q4P2j18n6J01k1l1
7369b4k4R8lq4QQ1J9j43J27Mp4KK1J10j26j3M2j0ooP8o3j10J05K7J2q6jR8q2l5
7400e8M1J18p2j10Q3P0p6q7J62j37LJO0Ro6M8O8L5j37J13j1qr7L5Q6r8PK5N1j20
7430f2o5K20j1j94Q1M3L6j32J45Mr5N5q6Q6J1p7K7L4q9L2Q9l9j00J02lJq6R8k9
7459dm4J5k4J47j38n3J21K3p3K0P5q6N2l2M8k3r4M1J03l4r5M1O3p6n3P8J14j55
$$ y = [51, 57, 26, -26, 25, 33, -56, 20, 21, 43, -48, 17, 28, -28, -15, 64, 11, -72, -48, 136, 27, -100, -72, 41, -17, -66, 34, 25, -26, -18, 30, 57, -6, -9, 39, 20, 18, -8, 56, 76, -32, -45, 57, 27, -41, -37, 16, 24, 17, -7, -7, -48, -27, 38, 14, -35, -13, 11, 0, 55, -22, 84, -46, -44, -61, 74, 1, -81, 23, 72, 43, -70, 15, 16, -71, -11, 158, 54, -36, -28, -9, 66, -41, -7, 96, -35, -47, -25, 78, -43, -25, 39, 28, -25, -73, 83, 52, -5, -93, 49, 12, -75, -12, 121, 21, -35, -5, 67, -21, -55, 29, 101, -17, -73, 28, 7, -24, -48, 50, 47, -37, -29, 52, 71, -72, 55, 59, -15, -13, 8, 118, -8, -21, 21, 11, 5, -1, 77, 14, -96, 9, 36, 48, -38, -39, 59, -23, -58, -17, 101, 29, -81, 2, 72, -4, -91, 71, -66, -63, -62, -2, 7, -59, -11, 57, 92, -45, 68, 57, 49, -48, -13, 73, -25, -18, 7, 58, -62, -127, 93, 82, -112, -31, 12, 48, -84, 61, 65, -30, 25, -61, 25, 36, -41, -14, 20, -69, -37, 52, 13, -87, 15, 12, 13, -73, 25, -4, -48, -33, -57, 90, -48, -101, 20, 43, -30, -10, 65, -21, 31, -1, 47, 24, -70, -29, 74, 40, -55, -14, 49, -27, -80, -2, 112, -43]
7487d3L1M9m2m4RJ15l8m1O4j4l1l2J0O5o0nj6Q4p4l3N7K6l7o3J48o1o1k0J35j17
7517c9pO1L6n7n9R0N9j52QN3k8O1j35J33L9n7q6J40q3l3R6M6p3n2O3P0j05J5J0
7546A4Qp6j3J61o6o5K3N0J9j01J2P7k3om0Q3r3n3J54k4p7QQ2o6J6k7P8m5l7k7
7576e4J40j14n3J22mn2p0P8K6n1L0OM4o2J8K8j4m8P1J4m5p5Q1J03j02j43J54Q6
7604A14j63L5M6j6q0P0P3m0l7KP0j6j13P2J6q3RM0P0n0j33J64Mj06L3J10j27o7
7632a03P1P3M5j31k0J28Qr6k1J07r5qM4O5j00k0J05J9q1m8R8J0j53J04N9n7l2
7659b9mR9r9j7O1Q4j57M3M8O3j06L1j3N3o3l8J38j01n9J3J41j39l2K7Q0p8L6N4
7687C6j6r0m1J19L7j03M5K2lq9R5O8q9r3J00O3p8j8O9M7o5o7O5K7j06N9LPm2j5
$$ y = [-43, -12, 37, -5, -49, -40, 75, 37, -4, 60, 46, 15, -17, -7, 58, -2, -7, -23, 61, -13, -46, 11, 37, 0, -63, 85, 24, -37, -57, 78, -39, -46, 15, 51, -6, -65, 25, 84, -68, -60, -7, -35, 26, -109, 24, 63, 6, -80, 60, -23, -56, 40, 86, 13, -39, 24, 94, -11, 4, 14, 22, -54, -67, 94, 28, -37, -14, 36, 55, -46, -34, 43, 20, 14, -26, 57, -36, -89, 65, 41, -36, -28, 54, -12, 4, -23, 55, 10, -27, -54, 86, -28, -81, 41, 37, -15, -85, -7, 19, -32, -2, 4, 48, -14, 4, 32, 18, -30, 41, 55, 10, -65, 16, 119, 17, -126, 28, 114, -49, -14, 32, 16, -64, 6, 79, 39, 2, 4, 74, 58, -55, 17, 33, -50, -41, -1, 69, 19, -114, 50, 54, -52, -19, 91, -36, -103, -32, 41, 86, -45, -65, 63, 71, -25, -46, 61, -34, -42, 2, 67, -33, -53, 52, 71, -10, -58, 40, 50, -103, 1, 60, 3, -29, -33, 66, -33, -50, 11, 95, -62, -19, 29, 92, -14, 17, 4, 57, -6, -44, 94, -7, -66, -53, 88, -51, -83, -56, 24, -54, -18, 36, 20, -70, -111, 8, 45, -58, -13, 9, 6, -83, 12, 80, -9, -102, -2, 61, -17, -35, 34, 81, 16, -51, 14, 41, -65, -6, -3, 4, -38, -53]
7717e3O8m1o6Q5R9j26NQ5L6j28m7J19k3k4l1P0L0j12N3L3p4K4P6k5j9j10J31k0
7745A5j33P7j3J03j01j4J32j00m1P0P5j0o0MN7m7q1L7R0j01j0P1L5o2RR2n5jl0
7774HN8k6j49J02L8Jr3J0J10o3k7M9M6r1N3k7rn8K4J01q3j24J47R4j43m0J29L9
7802G6p6j03J13j1J2r5P5M7j06L6J23o6k8m4R2r0JJ9J36j60k7R8pn3M0N3rl6n7
7831d7J34k8p4m4J29r2OK9J0j9m9P1qJ9l7K1l7o6N9JJ6o5Q5j4L3j21L0J15Rj97
7861a31J50K7p3J00n3L6o0q3J19l7m8L7M9j1r2K8R8m6k0M2K7k0p8O3M4r7k9J45
7889H7n2n0j6P4J9p5k7R1p7l8O0Q4j05k7M4O3l9k2L9k5j03O2P0M6j45O1J14o2
7917E1j20J19L8l5m7%M5p0k0R7O1j40j2N9M1j14M0O5pj01O2M9k3p8M5N5m6n6L9
$$ y = [-53, 15, -26, -92, -7, 92, -34, -29, 56, 92, -36, -83, 36, 13, -11, -42, 28, 58, -54, -1, 32, -42, -18, 58, 33, 14, -96, 35, 15, -118, -41, -54, 49, -52, -66, 66, -34, -75, -5, 70, 60, 0, 4, 61, 14, -67, -30, 60, -41, -51, 20, 55, -7, 2, 94, 39, 38, 8, 66, 40, -109, -7, 31, 32, -61, -51, 59, -4, -31, 18, 64, -27, 26, -1, -10, -68, -44, 57, -26, -150, -3, 91, -52, -92, 37, 76, 0, -103, 10, -1, 11, -84, -9, 38, -68, -32, 91, 25, -3, -47, 45, -45, -44, -25, 111, -49, -76, 22, 15, -38, 2, 55, 46, 10, -47, 87, 59, -15, -59, 70, -22, -16, 13, 23, 4, -45, 26, 18, 37, 0, 21, -16, -82, -23, -22, -6, -71, 14, 0, 33, -88, -58, 57, 66, -131, 19, 46, -27, 73, 20, 56, -4, -87, 32, -5, -53, -16, 33, 22, -70, -42, 56, 10, -10, 32, 59, 39, -39, 24, 68, -29, -58, 87, 35, -15, -31, 43, 62, -13, -40, 51, -26, -64, -4, 80, -25, -52, -8, 55, 16, -6, 33, 8, -95, -33, 37, 83, -62, -1, 113, 51, -69, 50, 88, 53, 6, 6, 51, -19, -39, 58, 119, -21, -33, 26, 67, -47, -7, 58, 51, -50, 12, 61, 38, -40, 5, 60, 14, -42, -3]
7946cJ11j25K9J9m3n9j4J53p8J7j4N5m2l3j3J49p9n2M5P7j42ON8Q9j66K0Q5Mj18
7975f4l2J68lj83N5J61j01l4K6J02j24KL9N3j33k6J55l3j04J7J06q4L3N8J7k6
8001D5j37J19Qq5L1O2J9r1n3Q5K7m4l8Q4k4J4lk0o2pK0J01p8q5J16J7J1n8K3R0
8031H7j86M7J27o7n2mO6l4QoN3n5n6O3O7k8q4K9R7o7QPOj22P4P1jn8K9O1r2n0
8063f2O6Lk0p4K4J02m1n1J09o3m4K5J9O7j16N0L4J7r6J10n8l4KM0K5j05J6R5j5
8092B5l8LQN8p0K8L3j6j5n5P4m9m5P0O9m6j10J15j0Jj14J16j1l4M6J4lo6K9R4
8122A01j21LK3P3j14rQ4m7j13J41L4m4j10J10J16j56l5M8P0q6n4Q9K2J1m3K3L5
8149E1k4p0M5Qp9O7j7J2p1N5J55l4j27O4Op4l7P0O0n8k6M6O8j45JJ16n8p0L2Q2
$$ y = [-3, 108, -17, 12, 31, -12, -71, -85, 68, -10, 7, -7, 48, 6, -27, -40, 109, 30, -22, 23, 100, -42, -36, 22, 111, -55, -35, 50, 54, -64, -96, 72, 69, -114, -59, 102, 1, -33, -7, 95, -29, -27, 12, 65, -68, -94, 61, 28, -76, -59, 47, -37, -4, 54, 71, 45, -92, 27, 35, -50, -19, 43, 62, -29, -82, 3, 30, -14, -52, 32, 8, 22, 19, -1, -63, -70, -50, 51, -27, -112, 4, 21, 32, -26, -3, 87, -99, -52, 75, 8, -44, -48, 18, -16, -8, -14, 39, -16, -72, -9, 58, 30, -54, -25, 72, 5, 13, 20, 26, -96, -22, 49, 48, -10, 19, 80, -12, -62, 4, 7, -13, -87, -63, 39, -2, -53, 56, -7, -51, -26, -7, 60, -56, -6, 28, 45, -51, 59, 1, -33, -31, 9, 34, -71, -55, 40, 25, -13, -10, -2, 56, -14, 14, 47, 31, 16, -39, 35, -14, -59, 11, 80, 34, -76, 39, 29, 30, -84, 32, 21, -13, 33, 47, 44, -22, 7, 101, -20, -17, 6, 79, -35, -44, 40, -7, -120, 21, 55, 11, -99, 11, 127, -29, -64, -16, 54, -32, -86, 3, 25, 36, -7, 16, 51, 27, -43, 2, 10, -69, -2, -19, -7, -78, -23, 132, 98, -29, 35, 41, -33, -70, 0, 60, 2, -24, 22, 90, -55, -54, 62, 4, -66, -34, 48]
8179D8o3mP2k5n6m5O1R9j04o8J24K9
$$ y = [48, -15, -19, 53, 28, -28, -73, -12, 87, -17, -85, 39, 68]
8191F8
$$ Imaginary data points
##PAGE= N=2
##DATA TABLE= (X++(I..I)), XYDATA
0@%%%%%%%%%%%Qj6J6j6J6j6K4l2L2m0M8n0N8p1P9q8J04j17J29j45J64j84K04k28
35a21K52k78L10l43L80m21M65n14N70o32P03p83Q72r73J089j230J400j606J866
54A006k204K665l326M352o155J0169l1755j18O4743n0758Q753j1834L4604j1846
68H296l8380M6173j2759l953n519J191K1439k2016o51r59K8716k6547j8800M6125
82B2356k0143p168r643K7481M917n2804N0478o166j7454Q829j1651L2556l2028
95a0440J849J8314j1917J1856k8782K4986R165k7812P879Q658J2185l3153J1518
108e694K3447k2732n15l60K2847k1447q886K5888j6279J0090j8359J2611J6770
121A7381l3075J7554k686R373r830j7402L9567k1157j0549J1217N480J513k5401
$$ y = [0, 0, 0, 0, 0, 0, 0, 0, 0, 0, 0, 0, 8, -8, 8, -8, 8, -8, 16, -16, 16, -24, 24, -26, 32, -39, 40, -48, 56, -61, 68, -77, 87, -97, 107, -121, 131, -147, 163, -180, 200, -221, 244, -270, 300, -332, 371, -412, 460, -513, 576, -654, 746, -860, 1006, -1198, 1467, -1859, 2493, -3662, 6507, -25248, -25366, 39377, -11381, -2628, -14462, 20142, 8296, -30084, 16089, 3330, -623, -6142, -4951, 16488, -5528, -6179, -7138, 21578, -4969, -23769, 22356, 2213, -4955, -14598, 12883, 17800, -35004, 15474, 9308, -8146, 683, -10968, 21588, -10440, -8591, 9723, -2194, 9662, -19120, 5866, 15031, -12781, -4902, 3756, 15941, -17212, -5694, 17753, -4979, -5494, -5854, 16993, -4454, -13340, 12548, -3731, 6359, -12000, 611, 17381, -15694, 1860, -826, 8547, -1283, -18685, 20882, -275, -10824, 393, 5873, 7386, -18015]
134a8015K2853O347j5504l720Q091J5461k6497M788J2817m17q092j4558L3947
147A7501j4880j6412J7274j117P914k6382J5366J8145k8238P497K666J1303j2215
160a578j3261K6787p280j0913j483J5828M72k2216J3369P867l555j5601Q914J8726
174A6076k3312J565O462P782p973j7390K8501n823j3138L161O391J0632k6842
187a3908R623J6989j4033m377R35J7581j3939j0761J7368K15n957j0442J6318
200E612L241j7354N051O144O694j8076K061J9713j4731l705J449J2827n663j7530
214a4267K0863l94r240k997O279J0937j8638J821J1968k091q304l577J6589n969
228B980j0421N469Q591k686j5339J3593N533j0813j550L892J0923j5092k778J4981
$$ y = [-18015, 4838, 11185, -4319, -8039, 52, 15513, -10984, -6196, 6621, 6204, -1888, -16446, 17501, 2621, -13791, 3483, 2366, 10280, -16102, -736, 17409, -10829, -3332, -666, 10637, -1578, -14839, 11948, 4668, -6245, -7728, 8100, 8572, -13644, -275, 7592, 4037, -11564, -2650, 16076, -7236, -5671, 791, 8573, 600, -16790, 11711, 5888, -7250, -4089, 2302, 12934, -13908, -4285, 12704, -1329, -5706, -4771, 12810, -1129, -11890, 5478, 5693, -264, -10706, 5612, 8853, -8501, -3450, 2694, 9388, -8688, -6627, 13086, -1645, -5350, -3901, 8926, 3263, -14267, 6596, 6202, -3038, -6035, 244, 11181, -7457, -5636, 6332, 4241, -4063, -7640, 8949, 2980, -7441, -1972, 6619, 3933, -11406, 2187, 7720, -3093, -4643, -751, 10172, -4920, -7698, 7283]
242G283n036m539m009J1872Q26j5618P863P295l304r920N363J1454j1145n443
256g058P670P635j0719o255J4876j272q418k685J0511L144j6428O698R022m572
270B149p634J167J4093j0098q345J1307L532o974p659J2041L901j3420J057R750
284D867Q05j2179K304J1733n738q280M057J0759p780r141J0921L805p573n934
298g374R950N681j3977P06J0121j001q881k09J1859l746j0164N719P797n986p324
313f829P346N921p244n964R086M587j1602M4Q675K32p764j913J1920l293j0424
328g222O534N873l575p447M475Q999r005n674R597L079q023l118Q402L046j0391
343d450j051J1399k557q912L452P054k082r410M826R516r068m559P532L334n958
$$ y = [7283, 2247, -2292, -6301, 5571, 6397, -9221, -1358, 5937, 2633, -7287, -1924, 9530, -1615, -7058, 612, 8247, -2472, -8727, 6149, 4877, -3541, -6226, 4285, 7429, -8999, -2301, 6721, 2149, -5485, -4318, 9775, -323, -8668, 2639, 6171, -803, -8462, 3579, 7480, -5940, -4883, 4867, 5672, -6507, -4203, 7530, 1792, -6488, -2431, 8328, 548, -8593, 2328, 6133, -1440, -7374, 2576, 8257, -5720, -5014, 5107, 4106, -4775, -4984, 6875, 3129, -7035, -1316, 6481, 495, -6829, 517, 6438, -806, -6770, 2316, 6903, -4699, -4655, 4020, 4252, -3512, -5425, 6495, 3202, -7222, -688, 5185, 1610, -5837, -1362, 7637, -1368, -7042, 2555, 5634, -2389, -5507, 2895, 5941, -4450, -5501, 5898, 3341, -5571, -2119, 4935, 2853, -6557, -1731, 7785, -1283, -5842, 1690, 5024, -934]
358i34n839R651L446j1388J148Q571j266p813M00J0016l246r728O662O427o330
373b23n492N624O777q218n164J0270J604q912o90P685J652r623O80J0232m174
388B028p575M215O302l496p574O015O901q711l694P925K193o520l285Q677J885
403E286j0684K195Q328l283n996J562Q190l509r285P961M960p511k464M866N225
418E841p533m911J1088m79q510K000N668P90q433Q58J0229n956o400O429L469
433D150l633n805N428O371r627j755Q734q62n414j650P310J294j0337L788P601
448E593n206m373K565O272l826p561Q100L978q132j233N523K623o544l065R675
463D389o90q705L340N338j535o217J387R038o076n912P169K256m284m280N681
$$ y = [-934, -6773, 2878, 6324, -5064, -3916, 4655, 3389, -4424, -4024, 5992, 2746, -6982, -320, 6107, -223, -5715, -91, 6686, -1532, -6696, 3574, 5178, -3734, -4424, 3261, 4913, -4710, -4030, 6202, 2028, -5547, -1332, 4970, 1474, -6100, -85, 6816, -1895, -5589, 2336, 4529, -1991, -5276, 3401, 5286, -5398, -3203, 5125, 1842, -4154, -2592, 5598, 2089, -7196, 765, 5725, -1786, -4250, 616, 5841, -1692, -6603, 4485, 4006, -4504, -2504, 3164, 3954, -4479, -3621, 6608, 652, -5748, 681, 4150, 517, -5288, 140, 6511, -3116, -4871, 3863, 3001, -2413, -4063, 3247, 4541, -5796, -2008, 5593, 387, -3986, -1421, 4851, 1025, -6536, 1564, 5542, -2590, -3823, 1700, 4323, -2221, -5286, 4389, 3699, -5006, -1666, 3672, 2137, -4080, -2693, 6345, 269, -5643, 1526, 3782, -502, -4782, 899]
478H99N051r483n82Q134j347n873j84P458q34q552L776P069n546m794M928M378
494D498m272n845P023M250r172j11O287Q54n728k545R559j749q627M741M684k334
510A513n874L010P169o661m200O761K306n524k399N827K344p124j370Q447j724
525B501o630K552M904o65p905L853P576p803k199M745K789l875n351Q216J308
540D016p337J012M337J457o496l06P599k269o328K996O064m419m806M660M288
555D468n201m406P906P79o543O55L943K186p000Q4P760l644m162J354N554j738
571A995p661O086M600o352l056N945K900p100r87O631K16o689J017O273k657l840
587b679P24N499j342p454N524L715m387l316L570N822q087k035Q053j138n184
$$ y = [899, 5950, -3533, -4115, 4019, 2672, -3201, -3385, 4073, 3239, -5313, -1537, 5532, -14, -4808, 120, 4498, 226, -5619, 1404, 5654, -3518, -3629, 2658, 3512, -2216, -4761, 4798, 3049, -5578, -837, 3847, 1513, -4361, -1351, 5818, -843, -5043, 1718, 4024, -1500, -3899, 1928, 4272, -2852, -4222, 4225, 2501, -4129, -1577, 3327, 2662, -5243, -1390, 6186, -1617, -3816, 929, 3718, -157, -5508, 2708, 4016, -3321, -2309, 2028, 3485, -3011, -3317, 4282, 2013, -4315, -1319, 4745, 326, -4480, 180, 4468, -733, -5139, 2767, 3546, -2997, -2342, 1601, 3787, -3213, -3129, 4631, 987, -3175, -1821, 3733, 1995, -5666, 420, 5020, -1332, -4388, 1557, 4457, -2643, -3630, 3001, 3217, -3472, -2455, 3818, 1161, -2679, -1955, 3544, 2202, -5252, 272, 3987, -400, -3716, -146, 5676, -2411, -4446, 3607, 2469, -2715]
602b715l29O751j568o037K720M387j701n835M092M190m109l091K386O261o980
617a578l402Q471j070m006k075O416J042q942M506L881k299l512O80O326m395
632D3l751L769L585l654m688O662J452n366j525N578K228r063L386N008l040k923
648b299k18P380m702m432N553Q21j159n423N036M247p472J3M112K355o712n21
664c421P818l492l688R26N618k423o258O178J100k094l495K815N705q142K05M413
680A765R11l769l545R038k536n924L355L335m47o923M746M281n424j674K592M677
696D458o177j854O204n02l180l123P476m28p379M365K219J4n648J862O989o878
712a582j044L087K403k616m903O966O32n098m41M726R92o875K468L990j125m721
$$ y = [-2715, -3044, 3707, 2139, -3898, -1178, 3209, 1508, -4327, -235, 3955, -154, -3245, -859, 5402, -1578, -4980, 3491, 2421, -1585, -3660, 2756, 3798, -5144, -638, 3243, 944, -2568, -1888, 4438, 43, -3708, 61, 3646, -8, -4696, 1966, 3418, -1948, -3473, 2105, 4333, -4730, -1344, 3664, 624, -2299, -2517, 4863, 161, -4271, 1282, 2103, 944, -4479, 557, 4804, -2668, -2655, 1457, 3812, -2900, -3421, 4397, 905, -2783, -1857, 3761, 1338, -4920, 1258, 2358, 264, -3231, -416, 5289, -2853, -2648, 1765, 2676, -1093, -4638, 4400, 1864, -4060, -705, 2630, 2183, -4740, 6, 4287, -1137, -2811, -219, 4458, -1719, -3573, 2631, 2129, -1051, -4174, 3302, 2874, -4505, -140, 2079, 2093, -3555, -1693, 5296, -1582, -2626, 461, 2864, 248, -4655, 2311, 2943, -2155, -2596, 2130, 3122, -3753, -1285, 2705, 1580, -3141]
728c141J379O789o246j390L130J338m83o409O919J625o107J240J575L701o329
743b409j031P680l258l637R84N202k767m650M652J698j988m293M659K818o068
758b408J046J564L114m628k870Q435l359l263Q32L808O40q003N348L540m811j576
774b591K379M285n631j586M973N74l622k252O464j079m446J000L481R71p579M228
790d31M580n241q97Q98N331n056l679P816j903k595j169L776J924p019K438L889
806B662j351l950J107N330l842k867K488M147m002m044P022q41l048j190L205
821H26L245q034K871M116k921j205j535O339k795n066N384Q18j858l417L654L208
837C630n638l01L834J111n114N87M690j988k367n07N160j953m971M759N97p98
$$ y = [-3141, -1762, 5027, -1219, -2609, 521, 1859, 1376, -5033, 1886, 3511, -2596, -1356, 219, 3920, -2409, -3440, 4240, 982, -2655, -1671, 3531, 764, -3886, 766, 2464, 476, -3817, 842, 3660, -2408, -1362, 202, 3316, -1312, -4182, 4253, 894, -2369, -1537, 2271, 2911, -5092, 256, 3796, -1015, -2591, -212, 4073, -1558, -3144, 1829, 2403, -1219, -3471, 2993, 1914, -2532, -1532, 1949, 2920, -4659, -431, 4149, -1092, -1989, -1091, 4240, -816, -4495, 3321, 1418, -1177, -2346, 1430, 3354, -3665, -1227, 2662, 1311, -2639, -1532, 3798, -44, -2911, -423, 3724, -278, -4322, 2700, 1859, -1189, -2379, 826, 4071, -3963, -1092, 3024, 103, -1102, -2637, 3702, 907, -4159, 1225, 2043, 185, -3232, 422, 3630, -2008, -2309, 1525, 2636, -2478, -1891, 2799, 811, -1556, -2063, 3097, 1144, -3827, 932, 1529, 731]
853G31l385J805N418o688k11L867K22k428k686O034p49m868J906L114n99m502
869c019K647L067k520k706J946M276m952j348L974N20k159l433O214N8n997L011
885d21J874N63m591P28N993m784j758K515K313k033m013M792J633m231j147M154
901A587J133n328R64L797l17m561J018N682m367k162K754J827j140m815N233J797
917C102n349P99K177J845m250j112O063k162l776J780L346j600l779K768L000
932B852l028k950M103J604l981m13K488J984m242j106N602k006k832Q22K854J13
948A864n155L078L106l489j369J943K652l168k231M098P81l625n22L688N6l505
964a798J69L726n23m522K503K999k525j952J369L554l216k918M711L05k873q85
$$ y = [731, -2654, -849, 4569, -2119, -2330, 1537, 1759, -669, -3355, 2679, 1930, -2938, -1032, 2082, 1483, -3019, -372, 2695, 175, -2531, -585, 3691, -1261, -2609, 1365, 1885, -274, -3707, 2507, 2565, -3432, -421, 1453, 2016, -2575, -1847, 4146, -638, -2396, 119, 2432, 399, -3614, 1178, 2811, -1420, -2567, 1587, 2720, -2608, -1644, 2153, 1836, -2725, -1707, 3975, -392, -2554, 200, 2027, 887, -3928, 1305, 3102, -2247, -1448, 729, 2574, -1676, -2788, 3275, 1113, -2663, -883, 2463, 863, -2916, -148, 2852, -176, -3126, 977, 2581, -1400, -1813, 675, 2659, -1583, -2689, 2913, 907, -1925, -1103, 1751, 1864, -3291, -213, 2893, -596, -1965, -22, 2630, -538, -2769, 1329, 2110, -1515, -2037, 1651, 1707, -1798, -1629, 2097, 1574, -2948, -445, 2554, 29, -1923, -554, 3000, -216, -3134, 1577, 1882, -991, -1876]
980a876K766J735m674J48M421j500l088J145L079j167l731K328L496l600k112
995b630L603R90k611j796L573J569n050Q74L697j158k742J01M115j447m165L208
1011A31K479k922k050K666K288l425j827M195N55m005K86L360j70l496L29M315
1027B709j942l549K770K300k040k792K708K758m057j277L838M31l089q78L953
1042A843N7m345J350L406j623k879J507L182k120l177L111K184l247j359K919
1057H09J347l243j213M006O9l760Q28L005o68l194R68L532k160k835K755J905
1073B151k372j924K506K000l380j136L778m4k938l2K858J75l773R77L541k010
1089C77k428J747K242j494k994K837K188l487q41K775Q81k775j046L675l6l663
$$ y = [-1876, 890, 2625, -2049, -1901, 2520, 1020, -2068, -923, 2156, 989, -2742, -414, 3082, -518, -2630, 973, 1963, -648, -2444, 1129, 2698, -2352, -1478, 2219, 1061, -1681, -1580, 2535, 1088, -3077, 131, 2610, -312, -2362, 304, 2592, -833, -2660, 1535, 2090, -1915, -1629, 1731, 1561, -1935, -1606, 2709, 767, -2782, -12, 2288, 248, -2544, 164, 2922, -1135, -2412, 1426, 1857, -1232, -2110, 1843, 1900, -2445, -1095, 2311, 688, -2191, -684, 2498, 378, -2799, 312, 2496, -751, -2110, 809, 2156, -1087, -2300, 1706, 1775, -1985, -1157, 1848, 1180, -2014, -1046, 2486, 326, -2509, 246, 2151, -221, -2145, 361, 2361, -1019, -2155, 1623, 1579, -1359, -1391, 1467, 1642, -2131, -1154, 2387, 377, -2051, -304, 1938, 444, -2550, 287, 2475, -1012, -1853, 922, 1803, -972, -2018, 1657, 1621, -2042]
1105b042R82L054j199k691J161L042j918k984L027J885l050j287K718J532l351
1120a121j090M154m62l438Q53K918n59l634J640L269k473k371K544K050k617k024
1136b361L235J349l612m92L574j81l285M67L293p57l653J929K831k291k071J939
1152h6K436k687k110L493R46l196m63K864O13l511K48L374r44k939J223K817j689
1169C89k422J752K540k368k304L261R40k620q25K352J420l672J0L431j022k203
1185a341J63K883o34l299J984K270k030j951K039J966k580j475K764J247l317
1200a311l28L161m41k242l59L259m70l674K135K045j435k160J290L086l126j538
1216b108L063O85k400j191L326K21l218M51K799m00l320J526K514j653k085J207
$$ y = [-2042, -1060, 1994, 795, -1896, -735, 2307, 389, -2595, 432, 2317, -733, -2020, 698, 2230, -1121, -2211, 1943, 1481, -1957, -1104, 1814, 1255, -2379, -739, 2530, 57, -2314, 230, 2280, -337, -2361, 874, 2223, -1389, -1881, 1693, 1512, -1773, -1306, 1987, 1230, -2423, -494, 2337, 46, -2025, -86, 2350, -337, -2447, 1046, 1992, -1204, -1667, 1197, 1810, -1701, -1453, 1921, 977, -1962, -739, 2078, 389, -2033, -281, 2259, -109, -2413, 848, 1788, -832, -1657, 695, 2115, -1557, -1547, 1884, 862, -1341, -1178, 1705, 1071, -2228, -244, 2026, -4, -1955, 84, 2050, -530, -2005, 759, 2006, -1311, -1639, 1522, 1081, -1161, -1520, 1739, 1269, -2405, -270, 1775, 340, -1820, -530, 2556, -570, -2108, 955, 1640, -760, -1951, 1375, 1596, -1622, -1171, 1628, 1228, -2092, -566, 1948, 295, -1790, -583]
1232e83L086k913j837L184O12k042j694L420P72m054J191K264l28k770N02L545
1248B355k394j797J758J868j708k436L123J034k529j007K541J215l842P34K656
1263A571o18k279p5L931k373k183K315R05o11k818K526J976l459K5J650J247k539
1280h09j080L647p22k465K44L079j052l029K139J512r75k540K025K487l758J75
1296a122J554R64j652k135M346r93k531R58J457P49l757J586K721k300j232J029
1312c58K526k574j533K763N42j686j828L565J1l041R46J356J066l642P26L744
1328B583k992q03O12K399j351l202M009J55k214n39J781J640l835O90K417m16
1344I34k235RL526k200j529J189J831q26l450L708O76k600J16P27K405l665k11
$$ y = [-583, 2503, -410, -2247, 937, 1549, -493, -2187, 1233, 2005, -2049, -858, 1406, 1078, -1692, -1190, 2355, -39, -1836, -78, 1790, 82, -2354, 769, 1803, -726, -1733, 808, 2023, -1819, -1085, 1571, 953, -1326, -1401, 2530, 157, -2026, 289, 1194, 583, -2235, 291, 2267, -1192, -1167, 483, 1730, -809, -1889, 1758, 1036, -1429, -1185, 1894, 842, -2187, -48, 1464, 489, -2051, -26, 2461, -1297, -1122, 432, 1396, -256, -2391, 1955, 962, -1569, -611, 846, 1595, -2162, -576, 2145, -155, -1387, -358, 2168, -406, -1939, 824, 1366, -320, -2148, 1417, 1428, -1613, -667, 689, 1755, -1887, -1161, 2583, -409, -1212, -600, 1799, 448, -2754, 1255, 1410, -804, -1343, 438, 2078, -1757, -1067, 1350, 934, -1301, -1292, 2234, 34, -1495, -306, 1525, 699, -2751, 957, 1633, -967, -851, -124, 2281, -1384, -1595]
1361a595L684j786j028o37K829k68l479K361J304r77k404J940K326l285l34J620
1377B71J672k948j019M196j828j227j80K131N57m220K900J184j636p26j65L550
1393B512l040j460L007j0j191j794L113M05l168Q10J863J96l176J389K389j900
1409e5r68P2L126k259k168L403k61r42j720K349J653m352J512J740k74j884l69
1426a397L587k129j632J505J414j027k458K809P08j872q66J658J782l766P81K165
1442A262n98j287j061L796j666k388K278M33kk669J831K292l285q2J528J247k452
1459h23r12L284o85j975q4K737p22k856K227Q24m52k136J150K814l415n9J481
1476C98Q67j270k352M048n97k650J030J304O23l224J281K367j944j037P24K205
$$ y = [-1595, 2089, 303, -725, -1362, 1467, 1199, -2280, 81, 1385, 408, -1996, -56, 2270, -1015, -1349, 271, 1943, -1005, -2024, 2172, 344, -883, -1063, 1068, 1625, -2595, 305, 1489, -147, -873, -1038, 2512, -528, -1988, 1019, 1009, -182, -1976, 1137, 1542, -1626, -816, 1047, 1243, -1933, -544, 1845, -55, -1023, -951, 2175, -84, -2252, 1151, 890, -52, -1772, 577, 2230, -2122, -610, 1130, 856, -1028, -1397, 2190, 61, -1571, -66, 1348, 321, -2137, 672, 1380, -492, -1358, 300, 2082, -1684, -903, 1262, 664, -623, -1684, 2112, 446, -1942, 336, 769, 767, -1902, -71, 2221, -1064, -1146, 382, 1629, -823, -1735, 1549, 864, -1111, -1195, 1542, 820, -2036, 191, 1015, 563, -1573, -423, 2391, -1024, -1083, 398, 1265, -5, -2357, 1691, 1094, -1556, -526, 778, 1401, -1823, -542, 1825, -119, -1156, -432, 1773]
1492A773j970j419K129P05j239k042L101N68l113Q15J371P83l196P21L359k764
1508d18o92Q49J621q74k682L030L74j722o38J302J728l045r0K398o3k255o4L228
1526A987j693j913J513J424q62k514K718P78k300J39P93J637k478p58K935p89
1542F17j393l62K303Ql235J818J809j499j692J720J699k469m92J673P72j900p48
1559a371K582o28j264l05J787M81l092J480J764j372j179O17K398k189j398K517
1575H28L06j675p31K105L07k214K74J782m0k353Q41J864j027j400M85K401j724
1592B9j854K475M71j433j121J938J127k916M01J980k95j845Q8K403q81k061J177
1609c17J772j293j845J959J165j821j052J940J116k731K0K189k69j834j29K615
$$ y = [1773, -197, -1616, 513, 1218, -21, -2063, 1038, 1606, -1507, -692, 679, 1462, -1734, -1013, 2346, -418, -1110, -261, 1360, 486, -2196, 834, 1208, -514, -1152, 150, 1878, -1167, -1257, 1141, 1078, -1177, -1241, 1987, 294, -1619, -106, 1318, 456, -2058, 660, 1438, -862, -723, 70, 1707, -771, -1529, 1406, 617, -776, -1138, 1165, 1173, -2062, -244, 1565, 66, -1626, 94, 1793, -676, -1168, 505, 1277, -623, -1371, 1211, 583, -681, -986, 801, 1282, -1810, -330, 1434, 62, -1117, -500, 1898, -291, -1689, 828, 1134, -541, -1272, 833, 1140, -1074, -800, 982, 942, -1411, -570, 1294, 267, -1133, -648, 1753, 29, -1825, 650, 1121, -312, -1433, 505, 1632, -1284, -883, 1097, 802, -1043, -955, 1448, 567, -1494, -317, 1455, 162, -1683, 276, 1441, -380, -1432, 508, 1624, -1107, -1087, 1102, 833, -1001, -1130, 1485]
1625A485q95k203J441J452r75j860J516J718k133j009J963R07k153m29K145Q3
1641A053k073k2K432o88k141J184J440q13j797J297J878k254p71J789O49j581
1657d18r93K358J54k305M84J765l69j882O35J870r24j899J442J525j690r95J538
1674B96R33j616j034K249K91k129L23J465M7j864K36K201j105j624J252J243j052
1691A12j434J475J263j917p51J938L26j746k96J864J73k099L86K004r49j615Q97
1708c69J636q92j906J647J254j843p18J572R02j872p46K297Lk091M02J785m12
1725F49j813N84K001j120j813J619J182j490r46J347J180k022o49K311p4j837
1741h91R3J668Q7k275O87K162j385j375J157J228j062j546J723J205k220l17J794
$$ y = [1485, 590, -1613, -172, 1280, 305, -1555, -39, 1679, -454, -1463, 500, 1407, -746, -1175, 970, 1053, -1020, -1042, 1390, 702, -1439, -255, 1185, 372, -1425, -128, 1750, -504, -1275, 514, 1163, -418, -1411, 947, 1101, -1204, -720, 1045, 676, -1206, -571, 1299, 375, -1524, -82, 1443, -247, -1242, 296, 1229, -387, -1421, 828, 1119, -1010, -687, 778, 825, -1039, -803, 1398, 293, -1331, -79, 1164, 112, -1322, 153, 1416, -501, -1252, 686, 1012, -734, -1030, 834, 1007, -1092, -706, 1298, 349, -1266, -369, 1267, 375, -1531, 116, 1370, -473, -1191, 381, 1283, -589, -1335, 962, 965, -1126, -724, 1061, 649, -1164, -580, 1421, 301, -1512, 107, 1289, -201, -1147, 200, 1380, -642, -1291, 1020, 946, -891, -798, 870, 957, -1318, -631, 1531, 146, -1229, -72, 1156, 94, -1452, 271, 1476, -744, -1061, 733]
1758G33J87j635l73K188k73k207J061J458q32j369P12J800j399j546K038O37j739
1775e59m87J467Q32k089j80K230n89j672N77J412l27j804P83J838j618j069J506
1792B51P61j116j141J668R00k273O5J737j74j425n8J927n17j908J030J422j100
1809D9j086R85J288j387j163J810O22j738k81J519L70j782k30K192n89j662P83
1826c00J226m84j681R40J767j751q14J404O52j182r98J819N41k111J73J672j84
1843F89j585K05J753n35j905J256J370j434q12J057J108j346j244K201K14j979
1859i87L55J150M63j854k2K369j216j381J009J173q67j550J470J275j837p06J769
1876F13K04j464j54J497K72k054L66J988j038j121N75J334o12j891J691R63j662
$$ y = [733, 920, -715, -1088, 1100, 827, -1380, -319, 1139, 307, -1062, -350, 1450, 51, -1495, 543, 1180, -559, -1046, 421, 1253, -836, -1016, 1214, 625, -1047, -470, 942, 615, -1189, -406, 1432, -186, -1255, 251, 1012, -104, -1245, 423, 1323, -950, -885, 852, 678, -747, -805, 1122, 605, -1303, -273, 1149, 49, -1037, -52, 1236, -151, -1314, 496, 1118, -620, -901, 618, 988, -794, -1024, 1168, 579, -1083, -300, 926, 442, -1239, -299, 1468, -283, -1097, 307, 959, -223, -1221, 598, 1139, -972, -799, 873, 689, -896, -691, 1062, 527, -1378, -122, 1248, -186, -998, 59, 1167, -179, -1423, 778, 992, -987, -632, 518, 981, -873, -895, 1474, 258, -1123, -114, 1059, 192, -1358, 112, 1387, -450, -1156, 613, 817, -647, -801, 696, 968, -1086, -720, 1268, 230, -891, -316, 1018, 406, -1485, 206, 1169, -493]
1893d93k49R99Q47j661n49J974k16j433J67J464k66j575N72J452p38j547J358
1910A06R68j258p05R38J196j809n59K040l92j078k00J513J17k085R62J125o44
1927B35j030M64J547j188j215J453Q03j344p66J633K64j385m23J752J11k067P62
1944c94J345o93r77J20J967j296j372J742K49p07j096J378J049k212K05J423l9
1961F92j442m2J843o78j368N75J576j076j323J496N97r06j011J332J071k269L18
1978f15J295j01j039m91K135p04j599R42Q93k73j658J203J246j530n62J008R21
1995A071j620k87J610k47j064k94J700l54j593J080O31k00j502P65J638j751l34
2012g51R43P46j071j106K168k70j425K35J212Q9j850Q57J036n66r48K63J674j344
$$ y = [-493, -742, 257, 1104, -557, -1106, 868, 652, -781, -614, 850, 584, -991, -419, 1033, 295, -1252, 106, 1074, -184, -889, 49, 1245, -564, -1123, 917, 525, -553, -753, 760, 877, -1208, -246, 879, 235, -795, -331, 1216, 28, -1187, 266, 1069, -275, -1041, 592, 856, -529, -952, 800, 911, -1156, -394, 951, 258, -719, -599, 1368, 72, -1300, 442, 691, -16, -1112, 266, 1315, -897, -692, 731, 692, -750, -792, 1051, 373, -995, -420, 1156, 80, -1243, 253, 850, -56, -1067, 265, 1336, -933, -615, 680, 579, -460, -951, 1184, 480, -1119, -177, 716, 443, -1215, -12, 1234, -296, -858, 150, 1071, -549, -836, 774, 527, -537, -831, 869, 515, -1078, 2, 633, 433, -1069, -304, 1334, -417, -751, 192, 938, -133, -1239, 929, 659, -766, -531, 681, 770, -1080, -223, 813, 247, -701, -438, 1236, -108]
2030a08q01J084N41o50j404J972M25j917L68R75M56j910M26J680j214n31L03J249
2048I44p84j290J377L77n47j062J154J069k054J21J148M63j544m07K433j343r23
2065h68P10R14l04j767J650M63r81m22M64J363j742l25J435J9p98r55K178l82
2083F52j814J038Q79k01j832J327J160j743k2O22Q62j181q64J940m21p52l45J225
2101E30L72k090R62J018m61j300N88J790j822m13R97N74q48j080J986l32j049
2118e78K33N58P24j925N97J340q53n43j17J666j015j224J553K20o24j043J434
2135D03N43j721L15P90M18j495J23J651r59n14r5J334k70j777J605L12p09n74
2153f20N32J357j932p0J369k24p55m36J668m59j261N87Q45j60j567J148Q70j109
$$ y = [-108, -909, 175, 716, 66, -1338, 634, 1059, -858, -490, 485, 941, -969, -543, 1137, -77, -608, -305, 944, 160, -1130, 247, 624, 77, -985, 169, 1238, -816, -695, 453, 916, -628, -1035, 1398, 55, -868, -158, 756, 452, -1315, 335, 798, -183, -605, -141, 1222, -520, -845, 590, 609, -189, -1144, 1034, 652, -1162, -124, 755, 554, -1278, 49, 1209, -534, -556, 66, 928, -253, -1117, 823, 402, -350, -695, 530, 902, -1188, -226, 792, 331, -969, -381, 1409, -413, -826, 171, 745, -103, -1183, 803, 471, -578, -345, 213, 937, -988, -391, 949, 96, -447, -564, 1102, 87, -1137, 416, 636, 12, -1031, 403, 946, -775, -460, 330, 748, -747, -624, 1027, 68, -446, -541, 793, 523, -1254, 351, 663, -46, -620, -88, 1269, -663, -733, 636, 412, -343, -779, 889, 430, -831, -244, 601, 441, -1126, 22, 892, -217]
2171b17m52N56J283j628m14J598l31o81o60J663J24k042J133O53j32j352N24J595
2189A220j506m49Q09P14q66q91J551j0r78k60J125L61j742O37R34k88r96K9J864
2208A258j509o55J176J53l06j243J590M27j630M88N23M01j208j45J655o30r78
2225f33K60J217o20j188J038O43o37j049J316N76j729M14O58L68j041m08J828
2242A013q62q00N10O54j5j448Q25J061j172m52Q21P18j190m28J348J1j206q5J560
2261H63m91j094N66O83q6j395Q66J031j186k01K09J059q29j072J699j16j027J7
2279e04Q65L29j522M37J153n03r01M55R86p84p32O48Q92r70p32J325J32r66j13
2298e05P34O16j571K86J307p11p29J50J212m39j356J154N88r07n44Q19P03j213
$$ y = [-217, -669, -113, 1170, -458, -872, 726, 395, -286, -946, 717, 841, -1201, -68, 585, 453, -899, -375, 1220, -286, -735, 74, 788, -78, -969, 582, 572, -406, -666, 459, 820, -922, -285, 649, 361, -635, -606, 1258, -251, -906, 270, 423, 117, -1126, 464, 891, -739, -251, 272, 673, -535, -680, 975, 345, -633, -373, 844, 224, -964, 74, 717, 80, -969, 347, 923, -806, -392, 266, 634, -407, -815, 1013, 151, -649, -139, 515, 500, -948, -123, 938, -234, -686, 135, 853, -337, -765, 583, 594, -612, -697, 863, 372, -722, -156, 527, 441, -954, -88, 943, -243, -444, -235, 824, -5, -1077, 622, 506, -521, -504, 361, 690, -832, -395, 758, 255, -646, -191, 795, 11, -721, -73, 819, -151, -883, 442, 574, -392, -505, 229, 845, -726, -440, 867, 156, -573, -423, 789, 350, -1006, 148, 736, -171, -715, 104, 807, -406]
2316d06l09J243P4j284K27J134l53r12J52J300o92j145J153M58o75n91O46R46
2334I66j434k47J337j71q73j84J193n7j368O00R93n87q99O68P98p21p61Q94O99
2353H46j232k87J067J39q82l68J311q9j277N13Q05k56r30L27J183r03p81R21N79
2372F86q38o20J024N20j219k00J219j01j024O8J136k32j187M63J059o98p73P18
2390AP25p71p14J022M44j105j79R51K16j057n5J162k79j085M70R56o13p68O55
2409b4P29p63o72R84L94r93k31R02K60j058q7J260l79r22L48Q38k87j037O02Q76
2429G40q86m33O94N63q19n24R61K98j012o2J016j07r65J61R97l74r46M91R17o79
2449C1o91P85O29r44n17J072K07r60k05J106J3j180K61J045k55j076M32R76o27
$$ y = [-406, -715, 528, 602, -682, -455, 679, 326, -586, -434, 866, 174, -971, 182, 640, -35, -626, 20, 966, -468, -715, 622, 451, -422, -606, 587, 530, -838, -238, 755, 168, -731, -63, 735, 14, -747, 147, 846, -386, -673, 394, 533, -349, -717, 594, 505, -772, -259, 546, 290, -640, -313, 870, -33, -814, 107, 686, -152, -772, 252, 772, -447, -647, 572, 471, -553, -485, 651, 419, -768, -305, 754, 56, -717, 1, 726, -45, -759, 263, 707, -398, -577, 374, 590, -467, -522, 640, 361, -724, -254, 702, 89, -679, -24, 705, -58, -730, 254, 648, -345, -576, 326, 586, -472, -559, 701, 322, -600, -252, 586, 299, -738, -136, 740, -146, -579, 115, 678, -141, -665, 296, 594, -418, -480, 536, 429, -536, -375, 622, 248, -698, -207, 710, 31, -660, 125, 754, -190, -707, 365, 572, -388, -593, 513, 526, -654, -393, 652, 397, -679, -247, 729, 102]
2468A02q76P64P76r07o18R77M89j156j67R84K04j121J29J155m25r48L31J008n49
2487A52q95Q23N67p47o43R86L94r56j84Q06K82j052l1J125l17q65K42R16l71r49
2507g17P25O03o85n34P17N90r30l70R47K16r94m0R62m0r40J37R73l89r31O19P00
2528F19n81o14N40P98r52n04J049J49p35l33R15J80j107K32R36l05q37K87R58
2547F95o31p15P05O39q28m60Q54J69p51k22Q89J92j098L15P37l21o18P4J105n73
2567A57q52P84M32n35o69P83O24j050j91R24M8q57K3R07k27q09K26R26m50q98
2587g04P39M04l89p28O85Q47j267m5P73J36o74l98J245k73r89N02O30k62q40M78
2607a30Q06p13n74O94N68q81l10Q15K84q13l71J230j92r81L90N50k4j023M77J003
$$ y = [102, -774, -10, 766, -141, -759, 218, 707, -449, -616, 368, 572, -549, -420, 735, 310, -638, -307, 701, 152, -743, 80, 647, -100, -743, 243, 637, -319, -503, 303, 585, -467, -498, 627, 310, -555, -313, 603, 232, -717, 8, 611, -74, -608, 109, 699, -231, -601, 346, 562, -432, -472, 490, 450, -490, -353, 620, 231, -700, -81, 619, 38, -576, -36, 762, -190, -694, 355, 504, -231, -564, 351, 531, -576, -344, 592, 287, -550, -263, 695, 64, -651, 54, 693, -135, -595, 259, 428, -323, -545, 344, 536, -562, -247, 490, 169, -449, -375, 730, 157, -695, 89, 521, -14, -683, 100, 724, -326, -517, 407, 455, -402, -379, 528, 301, -508, -282, 644, 194, -704, 35, 439, 50, -678, 7, 854, -413, -458, 315, 451, -223, -621, 624, 351, -638, -136, 494, 232, -608, -130, 676, -37, -611, 83, 651, -230, -540, 275, 559, -254, -625, 605, 413, -568, -178, 372, 348, -675, -198, 805]
2627H05r63k81N48L72m90p26J022K29q52p6O66J99r07O6Q05j05r16L98R09p73
2647g0m43M48N52m21q49J135J33p83k4M14M88r49o7J085m33n83J10P48k48q67
2667f24O24N26m77o09P15M02p50k30N54M60r98r6J098m53m69n1Q43r8j242R95
2687A20L95o00k75K10Q30r31l03R65k0o05k85R30o7q63K48P25j48j009O21N78
2707E16o20k46K28Q35r27m75J125j53m13l61Q26K02j152M55O17k26o23O6R95o78
2727io29P17M09n70m97R08Q4o72k21P22K50r96K68O58k41n02k5J029o61o51P83
2748A54K21l04o97P20M85q94m5O40J28p25j22Q75k00o32J35P48l22p23M66N97
2768E05l78p19O43N82r95%N79J55o26k63J077k88p32L47L87kp92M46O07n69l94
$$ y = [805, -158, -439, 109, 481, -9, -735, 287, 516, -336, -412, 254, 453, -454, -388, 417, 312, -604, -206, 703, -70, -513, -65, 487, 66, -783, 352, 485, -298, -322, 92, 580, -369, -436, 649, 216, -367, -257, 491, 243, -624, 0, 526, 49, -560, 155, 557, -193, -423, 131, 591, -407, -503, 595, 142, -327, -378, 465, 367, -875, 120, 515, -85, -360, -150, 680, -251, -554, 411, 391, -214, -499, 431, 364, -499, -251, 474, 326, -683, -62, 516, -104, -350, -122, 713, -214, -689, 436, 283, -130, -491, 335, 537, -615, -160, 457, 231, -392, -326, 669, -9, -638, 79, 488, -82, -579, 329, 413, -259, -480, 242, 492, -504, -236, 422, 181, -321, -346, 683, 22, -629, 154, 375, 71, -626, 94, 579, -315, -360, 280, 408, -317, -439, 436, 236, -396, -261, 487, 165, -558, -92, 505, 127, -592, 51, 633, -362, -362, 217, 372, -254, -517, 560, 272, -460, -113, 274, 272, -520, -74, 533, -36, -430]
2789d30M61N19o91l78P26K46p25k39R23q9p74K34N27M2q99L82P70p05k52K85O23
2810E56n57n77R05Qo13j55O77K42r82K30O74j55p49K31Q71n84m49L90N05l90p18
2831f40Q98J66o46j32M84M08j010J34Q16m43l44N3P58l33p43O18L77l97n20N74
2851G8M99p96j50N94J84p35l0P85k25o09J31O25j30q10O14L55l41m46M04N70p64
2872a97k15O32J77n41k89P99q5o85J81N93j92p46N21N68n27l49L38N27o47l57
2892d94P49L6m47k71O96J92q49J64N80q1p38K89P49n12m94M31N24n72m65P39J88
2913D14o43j44N54K52p80J19O29k00n18M4P76l93o20M92N26m79n51O56L37o57
2933a86j55N63K16q21J26O33j83m87L3P21l10n87M63L28l75m12M23M88p67j14
$$ y = [-430, 31, 550, -141, -519, 207, 453, -272, -511, 412, 323, -451, -217, 310, 352, -547, -165, 605, -100, -352, -67, 556, -1, -578, 327, 335, -278, -433, 244, 486, -496, -266, 408, 253, -496, -265, 606, 22, -427, -37, 468, 78, -640, 258, 424, -222, -354, 130, 538, -472, -338, 478, 35, -309, -256, 502, 169, -574, 44, 421, 24, -496, 78, 577, -219, -369, 225, 409, -326, -356, 429, 204, -405, -274, 351, 221, -589, 25, 380, 39, -407, -3, 567, -197, -412, 220, 397, -144, -433, 366, 281, -404, -223, 370, 178, -568, -47, 521, -6, -355, -17, 510, -137, -494, 255, 291, -156, -427, 269, 461, -388, -224, 356, 275, -463, -174, 575, 63, -431, 0, 524, -48, -513, 226, 414, -229, -373, 181, 433, -347, -228, 401, 201, -317, -273, 503, 110, -510, -18, 508, 29, -522, 134, 471, -186, -341, 222, 438, -383, -257, 376, 193, -294, -261, 460, 150, -437, 26, 354, -21, -433, -10, 478, -289, -403]
2953d03O14J53o11j40P25k8o75J95N96k81o33M27M80l82m35M39M14o55j68N63
2973A95J34m93k36P22K2p47K76M89j85n70K36O07l46n68N10L92m78l84N50L10
2993D36o63j66P27m0o61J48M41J06o92J61P09m82l71L09M53m46m19O07K99o63
3013b07r7N94J03o47j01P21j06o19J93N86k97m58L29L95l93n00N73L60o36j87
3033c94N31L07o77j11P30j46o84K92N31k46n60L96M47m15m29M69L11m49l36N50
3053A17K72o57j26P19q5n63J25M91r5o48L85M37l65l48L28M78n34l50O24R9n34
3074b30q1N09J20o20M3O13j41n90K00N55l17m56L25M79m93l12N76J59m64k08N52
3095B19J09o84J62M82j59m19Q7N74k18o41M63L91l67l27M57K61n53k33N89J34
$$ y = [-403, 211, 364, -247, -387, 338, 310, -365, -170, 426, 145, -488, -61, 419, 37, -398, 41, 455, -200, -368, 195, 329, -164, -400, 322, 344, -403, -127, 362, 177, -393, -157, 450, 104, -464, 46, 438, -40, -424, 126, 436, -227, -393, 334, 294, -367, -219, 222, 328, -364, -203, 506, 24, -347, -38, 415, -31, -450, 157, 456, -207, -304, 290, 393, -254, -355, 366, 260, -359, -166, 420, 123, -335, -6, 389, -4, -504, 69, 429, -207, -394, 137, 444, -233, -344, 386, 240, -444, -152, 379, 133, -427, -31, 416, 1, -428, 41, 352, -97, -433, 117, 389, -268, -394, 325, 240, -323, -198, 293, 198, -450, -65, 372, 7, -341, -13, 465, -69, -419, 205, 304, -230, -311, 198, 318, -302, -259, 354, 213, -377, -177, 378, 61, -395, -70, 409, -84, -396, 180, 339, -125, -333, 219, 328, -356, -194, 288, 129, -290, -203, 371, 153, -488, -25, 366, -1, -328, 129, 390, -163, -396, 193, 327]
3115C27o11O2M81j8n61J48N81l40m88L54M40l17m50M61L48o26k06O53M1n46o1
3136c28O10L5p13K50N63k75n28L17M35l06m87M49L73n27k20N21J56n05k15P19
3156C24k6o46J96M30l2n71J66N52m05l61L98L21m22l15M66L53o52j18O54n3n16
3177b57k0N34j7o13K15N90m43l58L26M11m09l36M61K78n41j29M85J14n73k9O49
3198C38j61n14K28M66l25m16L26M68l67m24N07K10m34k25M39K56o53pN58j09m15
$$ y = [327, -284, -222, 259, 241, -320, -172, 409, 69, -419, -65, 375, 58, -392, 69, 417, -209, -415, 238, 279, -267, -328, 282, 317, -396, -146, 417, 142, -386, -69, 366, 60, -427, 22, 395, -132, -352, 169, 325, -180, -395, 324, 298, -348, -152, 278, 246, -325, -159, 393, -12, -373, 25, 346, -76, -391, 75, 428, -224, -342, 312, 259, -257, -277, 257, 240, -373, -158, 432, -11, -369, -43, 368, -41, -377, 84, 362, -179, -308, 177, 291, -282, -311, 338, 177, -337, -109, 357, 32, -384, -58, 410, 43, -381, 126, 336, -98, -323, 116, 372, -281, -288, 270, 161, -254]
$$ [...]
8191c2
##END NTUPLES=NMR FID
##END=
