##TITLE=1H_DE-68_k
 DMSO-d6
 8 sc, 
 8.10.2024
##JCAMPDX= 6.0         $$ Bruker NMR JCAMP-DX V2.0
##DATA TYPE= NMR FID
##DATA CLASS= NTUPLES
##ORIGIN= UXNMR, Bruker Analytische Messtechnik GmbH
##OWNER= root
$$ XWIN-NMR		Version 3.5
$$ Tue Oct  8 16:01:07 2024 Russian Standard Time (UT+4h)  she@DPX200
##.OBSERVE FREQUENCY= 200.1318
##.OBSERVE NUCLEUS= ^1H
##.DELAY= (6, 6)
##.ACQUISITION MODE= SIMULTANEOUS
##.ACQUISITION SCHEME= undefined
##.AVERAGES= 8
##.DIGITISER RES= 18
##SPECTROMETER/DATA SYSTEM= spect
##.PULSE SEQUENCE= zg30
##.SOLVENT NAME= CDCl3
##.SHIFT REFERENCE= (INTERNAL, CDCl3, 0, 15.7039)
##AUDIT TRAIL= $$ (NUMBER, WHEN, WHO, WHERE, WHAT)
$$ ##TITLE= Audit trail, XWIN-NMR		Version 3.5
$$ ##JCAMPDX= 5.01
$$ ##ORIGIN= Bruker BioSpin GmbH
$$ ##OWNER= she
$$ F:/spectra/data/she/nmr/H-F/1/audita.txt
$$ ##AUDIT TRAIL=  $$ (NUMBER, WHEN, WHO, WHERE, WHAT)
(   1,<2024-10-08 15:59:57.85 +0400>,<she>,<DPX200>,
      <created by zg, POWCHK disabled, PULCHK disabled
       configuration hash MD5:
       00 E9 B6 7A A2 85 ED C7 34 08 36 98 17 FE 4E 26
       data hash MD5: 16K
       18 60 A8 6D 7A 24 B3 80 50 AC 0B E5 EC BD B4 82>)
$$ ##END=
$$ 
$$ hash MD5
$$ 91 64 37 E0 14 C4 E8 A4 6E B7 8A 0D 93 74 17 31
##$RELAX= 
##$RELAX= 
##$RELAX= 
##$RELAX= 
##$RELAX= 
##$RELAX= 
$$ Bruker specific parameters
$$ --------------------------
##$DU= <F:/spectra>
##$EXPNO= 1
##$NAME= <H-F>
##$PROCNO= 1
##$TYPE= <nmr>
##$USER= <she>
##$AMP= (0..31)
100 100 100 100 100 100 100 100 100 100 100 100 100 100 100 100 100 100 
100 100 100 100 100 100 100 100 100 100 100 100 100 100 
##$AQSEQ= 0
##$AQ_mod= 1
##$AUNM= <au_zg>
##$AUTOPOS= <>
##$BF1= 200.13
##$BF2= 200.13
##$BF3= 200.13
##$BF4= 200.13
##$BF5= 200.13
##$BF6= 200.13
##$BF7= 200.13
##$BF8= 200.13
##$BYTORDA= 1
##$CFDGTYP= 0
##$CFRGTYP= 5
##$CHEMSTR= <none>
##$CNST= (0..31)
1 1 145 1 1 1 1 1 1 1 1 1 1 1 1 1 1 1 1 1 1 1 1 1 1 1 1 1 1 1 1 1 
##$CPDPRG= <>
##$CPDPRG1= <>
##$CPDPRG2= <>
##$CPDPRG3= <>
##$CPDPRG4= <mlev>
##$CPDPRG5= <mlev>
##$CPDPRG6= <mlev>
##$CPDPRG7= <mlev>
##$CPDPRG8= <mlev>
##$CPDPRGB= <>
##$CPDPRGT= <>
##$D= (0..31)
0 1.2 0 0 0 0 0 0 0 0.06 0 0.03 0 0 0 0 0.0002 0 0 0 0 0 0 0 0 0 0 0 0 
0 0 0 
##$DATE= 1728388797
##$DBL= (0..7)
120 120 120 120 120 120 120 120 
##$DBP= (0..7)
150 150 150 150 150 150 150 150 
##$DBP07= 0
##$DBPNAM0= <>
##$DBPNAM1= <>
##$DBPNAM2= <>
##$DBPNAM3= <>
##$DBPNAM4= <>
##$DBPNAM5= <>
##$DBPNAM6= <>
##$DBPNAM7= <>
##$DBPOAL= (0..7)
0.5 0.5 0.5 0.5 0.5 0.5 0.5 0.5 
##$DBPOFFS= (0..7)
0 0 0 0 0 0 0 0 
##$DE= 6
##$DECBNUC= <off>
##$DECIM= 24
##$DECNUC= <off>
##$DECSTAT= 4
##$DIGMOD= 1
##$DIGTYP= 9
##$DL= (0..7)
0 120 120 120 120 120 120 120 
##$DP= (0..7)
150 150 150 150 150 150 150 150 
##$DP07= 0
##$DPNAME0= <>
##$DPNAME1= <>
##$DPNAME2= <>
##$DPNAME3= <>
##$DPNAME4= <>
##$DPNAME5= <>
##$DPNAME6= <>
##$DPNAME7= <>
##$DPOAL= (0..7)
0.5 0.5 0.5 0.5 0.5 0.5 0.5 0.5 
##$DPOFFS= (0..7)
0 0 0 0 0 0 0 0 
##$DQDMODE= 0
##$DR= 18
##$DS= 0
##$DSLIST= <SSSSSSSSSSSSSSS>
$$ [...]
##$SUBNAM2= <"">
##$SUBNAM3= <"">
##$SUBNAM4= <"">
##$SUBNAM5= <"">
##$SUBNAM6= <"">
##$SUBNAM7= <"">
##$SUBNAM8= <"">
##$SUBNAM9= <"">
##$SW= 24.0689170037331
##$SWIBOX= (0..15)
0 0 2 0 0 0 0 0 0 0 0 0 0 0 0 0 
##$SW_h= 4816.95568400771
##$TD= 16384
##$TD0= 1
##$TE= 0
##$TE2= 300
##$TE3= 300
##$TEG= 300
##$TL= (0..7)
0 120 120 120 120 120 120 120 
##$TP= (0..7)
150 150 150 150 150 150 150 150 
##$TP07= 0
##$TPNAME0= <>
##$TPNAME1= <>
##$TPNAME2= <>
##$TPNAME3= <>
##$TPNAME4= <>
##$TPNAME5= <>
##$TPNAME6= <>
##$TPNAME7= <>
##$TPOAL= (0..7)
0.5 0.5 0.5 0.5 0.5 0.5 0.5 0.5 
##$TPOFFS= (0..7)
0 0 0 0 0 0 0 0 
##$TUNHIN= 0
##$TUNHOUT= 0
##$TUNXOUT= 0
##$USERA1= <user>
##$USERA2= <user>
##$USERA3= <user>
##$USERA4= <user>
##$USERA5= <user>
##$V9= 5
##$VALIST= <valist>
##$VCLIST= <CCCCCCCCCCCCCCC>
##$VD= 0
##$VDLIST= <DDDDDDDDDDDDDDD>
##$VPLIST= <PPPPPPPPPPPPPPP>
##$VTLIST= <TTTTTTTTTTTTTTT>
##$WBST= 1024
##$WBSW= 4
##$XGAIN= (0..3)
0 0 0 0 
##$XL= 0
##$YL= 0
##$YMAX_a= 82421
##$YMIN_a= -71917
##$ZGOPTNS= <>
##$ZL1= 120
##$ZL2= 120
##$ZL3= 120
##$ZL4= 120
##$ABSF1= 10
##$ABSF2= 0
##$ABSG= 5
##$ABSL= 3
##$ALPHA= 0
##$AQORDER= 0
##$ASSFAC= 0
##$ASSFACI= 0
##$ASSFACX= 0
##$ASSWID= 0
##$AUNMP= <proc_1d>
##$AZFE= 0.1
##$AZFW= 0.1
##$BCFW= 1
##$BC_mod= 2
##$BYTORDP= 1
##$COROFFS= 0
##$CY= 11.3945322036743
##$DATMOD= 1
##$DC= 2
##$DFILT= <>
##$DTYPP= 0
##$F1P= 15.6554695791079
##$F2P= 12.8336369535428
##$FCOR= 0.5
##$FTSIZE= 0
##$FT_mod= 4
##$GAMMA= 1
##$GB= 0.15
##$INTBC= 1
##$INTSCL= 1
##$ISEN= 128
##$LB= 0.24
##$LEV0= 0
##$LPBIN= 0
##$MAXI= 10000
##$MC2= 0
##$MEAN= 0
##$ME_mod= 0
##$MI= 1.114404
##$NCOEF= 0
##$NC_proc= 0
##$NLEV= 6
##$NOISF1= 3.799351
##$NOISF2= 2.8
##$NSP= 1
##$NTH_PI= 0
##$NZP= 0
##$OFFSET= 15.70392
##$PC= 1
##$PHC0= -26351.3
##$PHC1= 10.18747
##$PH_mod= 1
##$PKNL= yes
##$PPARMOD= 0
##$PSCAL= 0
##$PSIGN= 0
##$REVERSE= no
##$SF= 200.130013532006
##$SI= 16384
##$SIGF1= 3
##$SIGF2= 2
##$SINO= 400
##$SIOLD= 16384
##$SREGLST= <1H.CDCl3>
##$SSB= 0
##$STSI= 0
##$STSR= 0
##$SW_p= 3612.71676300578
##$SYMM= 0
##$S_DEV= 0
##$TDeff= 0
##$TDoff= 0
##$TI= <>
##$TILT= no
##$TM1= 0
##$TM2= 0
##$TOPLEV= 0
##$USERP1= <user>
##$USERP2= <user>
##$USERP3= <user>
##$USERP4= <user>
##$USERP5= <user>
##$WDW= 1
##$XDIM= 8192
##$YMAX_p= 0
##$YMIN_p= 0
$$ End of Bruker specific parameters
$$ ---------------------------------
##NTUPLES= NMR FID
##VAR_NAME=  TIME,          FID/REAL,        FID/IMAG
##SYMBOL=    X,             R,               I
##VAR_TYPE=  INDEPENDENT,   DEPENDENT,       DEPENDENT
##VAR_FORM=  AFFN,          ASDF,            ASDF
##VAR_DIM=   8192,          8192,            8192
##UNITS=     SECONDS,       ARBITRARY UNITS, ARBITRARY UNITS
##FACTOR=    0.0002076,     1,               1
##FIRST=     0,             0,               0
##LAST=      1.7004516,     0,               0
##MIN=       0,             -71917,          0
##MAX=       1.7004516,     82421,           0
$$ Real data points
##PAGE= N=1
##DATA TABLE= (X++(R..R)), XYDATA
$$ [...]
1916d2j66K08j26j05P2q5M46k09l5J27k21K71l72Q3O6J0N9k72L47l90J28L59j66
1939a3P8k93J93j73K36N4j99J79j21R0J6j60J66J10j0k8J6K4j73q3J33l06L5J37
1963i2J76l00L85j36r4l5J21j04K40j99q0K74o10N11r4J94l50J40k47L24k6K81
1985B79l38l4j28L39J11k22m06M10P6l60L68J00j90j86L03j12J85k10j33J71k68
2006b45N45j19m0j16j33J97O2j65q7J87k02j5j06M10k95j94M13r6K18l49lJ72
2028C9k10K16k10L2K99j31K94k49l57L35j19OR5j13K36p3J0mk39mM66l42Q0p8
2052b1m92M29L36j98K7j9j40J15J62n27K55M5k68L50o6k04N16k29k70J06J72k23
2074a44K62l17QJ76j54p3K71%R3j75L3R8K4l7J27k37L41j36pPo2j2k07K5O1r7
$$ plain form
1916 -42 -208 0 -126 -231 -159 -244 202 -7 -42 85 -136 135 -237 -154 -88 -78 -19 -291 56 -334 -206 153 -13
1939 -13 65 -228 -35 -208 28 82 -117 62 -59 31 47 -113 53 163 153 125 141 165 -8 -91 42 -264 -229 -92
1963 -92 84 -216 169 33 -61 -96 25 -79 161 -38 -118 156 -454 57 -37 157 -193 -53 -300 24 -2 279
1985 279 -59 -93 -221 118 229 7 -399 11 87 -273 95 195 5 -181 122 10 195 -15 -148 23 -245
2006 -245 300 181 141 25 -108 89 151 -14 -101 86 -116 -131 -237 173 -122 -316 97 1 219 -130 -133 39
2028 39 -171 45 -165 -133 166 35 329 80 -277 58 -61 -55 40 -73 163 90 100 96 -143 -147 319 -23 57 -21
2052 -21 -513 -84 252 54 81 62 -78 37 199 -328 -73 -28 -296 54 -12 -216 300 71 -199 -93 79 -144
2074 -144 118 -199 -191 -15 -169 -242 29 29 122 -53 -20 78 102 65 192 -45 296 160 153 160 98 86 -121 -96 -35 -132
2100a32R3L33n02K84j92l8L57m4j27j38N0Q9k7p4j26O83m85k91R0N25l22j97K88
2123I7j64K83l57o3K38J32k51M3p6L68j53l07j3J54K28k11mj80Q9n8K23M5J58
2146B21Q5m35P5n2l1j02L27k60J54R4l2K9j26o6R5k18J65k2j13L03p3J60j95j79
2170a96K91pn11J76J45M9J08k19R7J64l0k04j12J22K17J64n19K58Q5Q0L7m16J87
2193c4K90l11m8K07J0k4pl30N6K57n2R6m51L78j23j05o9L71l58K26l64L88l05
2216c02L26q4J90Q4j47Q3q9j41j51M46j22N7j56l5K02k95j20J01j15J95O3J17
2238A07J6o8k29J54QP8k91K93k20N4J56o9n0K48j22j15J44r9j98K10N5j79J74
2261E7l21N40j48j52o2M3l9L42l96j21K55K50k54J14K74m37J39J47o86N44p5r2
$$ plain form
2100 -132 -39 294 -208 76 -116 -154 203 159 32 -106 -56 33 6 -68 -194 489 4 -287 -197 328 6 -191 97
2123 97 -67 216 -141 -204 34 166 -85 -42 -118 250 97 -210 -223 -69 159 -52 -56 -236 -147 -205 18 63 221
2146 221 306 -129 -54 -106 -137 -239 88 -172 -18 76 44 73 -53 -119 -24 -242 -77 -99 -212 91 18 178 -17 -196
2170 -196 95 88 -423 -247 -102 -53 55 -164 -67 97 67 -137 -249 -127 90 254 -265 -7 78 158 195 -221 -34
2193 -34 256 -55 -103 104 114 90 83 -247 -191 66 14 110 -341 37 -86 -191 -260 111 -247 -21 -385 3 -302
2216 -302 24 -60 130 214 67 150 61 -80 -231 215 93 150 -6 -41 161 -134 -254 -153 -268 -73 -10 107
2238 107 123 55 -174 -20 -12 66 -225 68 -152 -98 58 -11 -61 187 65 -50 94 -5 -203 7 62 -117 57
2261 57 -264 276 128 -24 -86 -43 -82 260 -136 -257 -2 248 -6 108 382 -55 84 231 -455 89 14 -78
2283g8L5j03O8O6K22n47N23j38K1j8M5L6r0J27j52N0J50k63R7l4J15N8qk61mJ70
2309H7k57l0J21q2J90k15K10k0j83J22K36j20k19J51J6j08P7j62L50m0j06J24
2331A42p0j57j03J16J92L1l41K25K03l02K76k86J22J4j19J1K01k23n4QR3J27J73
2354B79m73J38J25j18p2j0P7K45k77Q7k15K80k48K20j30M6J13j7k10K26J5o0O8
2377H9K00p2P8l42k94M91J92k83r2K73q5J67n51R0J59J88l27r0J97p7j7J88ml1
2401D7K17j88m0j80L14l25M55k55j1n7K47k30P6K14m19j99L02J45r1J6J15m53
2423c00K05K41j07J01m80N21j00j87L13j69k4L5L8O2k5j84m9K88l04J69N8J2k1
2446I3j19k75K62K04l08J51P5l7J63N1m40M19J00o89K44j39R7j97K90K53j5l05
$$ plain form
2283 -78 -43 -146 -78 -12 210 -337 186 48 69 51 96 132 42 169 17 67 217 -46 51 17 132 190 182 -79 -83 87
2309 87 -170 -200 -79 -161 29 -186 24 4 -179 -57 179 59 -160 -9 7 -101 -24 -186 164 124 18 142
2331 142 72 -85 -188 -72 120 151 -190 35 238 -64 212 -74 48 62 -57 -46 155 -68 -122 -114 -21 106 279
2354 279 -194 -56 69 -49 -121 -131 -54 191 -86 1 -214 66 -182 38 -92 -46 67 50 -160 66 81 21 89
2377 89 289 217 295 -47 -341 150 342 59 -33 240 155 322 -229 -139 20 208 -119 -209 -12 -89 -106 82 78 47
2401 47 264 76 36 -144 170 -155 300 45 34 -23 224 -6 70 284 -135 -334 -32 113 22 38 153 -300
2423 -300 -95 146 39 140 -340 181 81 -106 207 38 14 49 87 149 124 -60 -109 179 -125 44 102 114 93
2446 93 -26 -301 -39 165 -143 8 83 46 209 260 -180 239 339 -350 -106 -245 -148 -345 -55 198 183 -122
2468a22L4k7N8O3J86q2j48n4K38L5n4Km21M51k56R5N6K54k54jj69mO0Q1M9j10
2494d0O7q4J89O9l56K0J54J06k68j86M95k59J42k08M60p3k80P1J35k7k75L65k03
2517A4k17M38k9l25m4K08k61Q9Q9l83K58O34n12J92J62l78K21k8ok49J37R8j2
2540I6K60q94N61j79mML71m04K89K2O2r6j32m3m5J20N3R3m43J64q0L53k73j66
2564c11M10j62J40O0r5J45mj13r8J10K01jl37O2j29o4J43k89L23k96K79o8j37
2587b31N88o83L33J35k53J2K7N8j2L28k29J94k77l2j7k83M34j21J62l2o3q2j3
2610e7J7J05O3J14k22j76j4K96l66J44j29K06J22q7J43j76qO0j00QK44k47j45
2633b05k2L47L05k17j1k34j82J63k60L68k32R9L43l48R2L22k56M4J48J75m44j97
$$ plain form
2468 -122 -88 -115 -57 6 192 110 -38 -92 146 181 127 129 -292 159 -97 -2 54 308 54 53 -116 -120 -60 21 70 -40
2494 -40 27 -57 132 201 -155 -135 19 125 -143 -329 166 -93 49 -159 301 228 -52 19 154 127 -148 217 14
2517 14 -203 235 206 -119 -163 45 -216 -127 -38 -421 -163 471 -41 151 313 -65 156 128 122 -127 10 108 96
2540 96 356 -538 23 -156 -160 -156 215 -189 100 122 184 88 -44 -87 -132 -12 41 134 -309 -145 -225 128 -145 -311
2564 -311 99 -63 77 137 42 187 183 70 -28 82 283 282 -55 7 -122 -186 -43 -332 -9 -305 -26 -94 -231
2587 -231 357 -326 7 142 -111 -99 -72 -14 -26 302 73 267 -10 -42 -59 -342 92 -29 133 101 38 -44 -57
2610 -57 -40 65 128 242 20 -156 -170 126 -240 -96 -225 -19 103 16 159 -17 -25 35 -65 -57 187 -60 -205
2633 -205 -227 120 425 208 197 -37 -219 -56 -316 52 -180 -81 262 -86 6 328 72 116 264 439 -5 -202
2655b02l0K03q3M07j39M0J89l12j52Q2Q2k94K53o2k12L57l85M02j69L01l90p0
2677a84j86L70J20k9j68L19k60j5J07k86J15Q4k6J28J90j27k86K32j70p8J19K33
2699B02j42K82p6k31P4N0k53O6m15M71M1O4p8l40K90j0o1NQ7J85j73J59jo4j89
2724e7K10j99J14N4l90L70J82K3j16l74jK75l82K27K64k77K58l39J77J18Jj13
2746B5j0J93M1p3l35K41j0j6k26O8K08j26R0p4k73J26M35k98q0J42j24j92K51
2769a7J3m7Q8J03m09M81L7j44j95O9j35j54N37J05r2m01K16k82L21L9J49k51p0
2792c9l51L70K29J4k66K60k15l00L70n7j80R4R0k25J10J84l35J92L61k61k43M11
2814B13n10N84k07M7P6j70J21J44n44J6j5M75k86R1o9j30J66P1P4k82J76p9o8
$$ plain form
2655 -202 -232 -29 -112 295 156 196 385 73 -79 3 85 -209 44 -18 -230 127 -258 144 -25 276 -114 -184
2677 -184 -370 0 120 91 -77 242 -18 -33 74 -212 -97 -13 -39 89 279 152 -134 98 -72 -150 -31 202
2699 202 60 342 266 35 109 159 -94 -28 -443 28 69 133 55 -285 5 -5 -66 -61 26 211 38 197 196 132 -57
2724 -57 153 -46 68 122 -268 102 284 307 191 -183 -184 91 -291 -64 200 -77 181 -158 19 137 138 25
2746 25 15 208 249 176 -159 82 72 56 -170 -102 106 -20 70 -4 -277 -151 284 -14 -94 48 -76 -268 -17
2769 -17 -4 -51 37 140 -269 212 249 105 -90 -21 -156 -310 227 332 240 -161 55 -227 94 133 282 31 -39
2792 -39 -390 -20 209 223 -43 217 2 -298 72 15 -165 -71 19 -206 -96 88 -247 -55 306 45 -198 213
2814 213 -297 287 80 127 203 33 154 298 -246 -230 -245 230 -56 35 -34 -164 2 73 147 -135 41 -38 -106
2837a06J71O5k56lK37k76N9J09J82q1m73L50j3P4m02K44j09J33j5M7K36m27L31
2860G7r2l9P6j13J44j19J05k20N1K49J26l5j55Q6k05K82k65k59K75J01J37j85
2882B2j62M17k96l0k5J61j96NK56O9k91L05k43J49k24K72l38K60j43P3L32k99
2904G4L3J5j42j84J44l6K87k80J28R6j6k29K2p7L33k06p5J42k9J70j22p0K96j06
2928A68rl66K28k46L39r6K3J7M8o1j34M15l13l65P45l99J75j20n2J52j22N5k93
2951b11k6M27j4j00p5J55k36K43L6k67Q6J97j48Ml84L66j04k84K78l6j17OK45
2974D1l4k53L8K20J12K11m16J32J64k84J78j43j18L46l66M14j65l61K66Q6Q2k24
2996g4l2o6K22k06J01K6J02N0j25J48J37M7m01J25j66J21j49J01K56j22j98Rj21
$$ plain form
2837 -106 65 130 -126 -129 108 -168 -109 0 182 101 -372 -22 -35 39 -363 -119 -228 -95 -110 -63 173 -254 77
2860 77 -15 -54 22 -91 53 -66 39 -181 -130 119 245 210 55 141 -64 218 -47 -306 -31 70 207 22
2882 22 -140 277 -19 -49 -74 87 -109 -104 152 221 -70 235 -8 141 -83 189 -149 111 -32 41 373 74
2904 74 107 122 -20 -204 -60 -96 191 -89 39 135 119 -110 -88 -165 168 -38 -113 29 0 170 48 -22 274 168
2928 168 159 -207 21 -225 114 18 41 58 106 45 -89 326 13 -352 393 -6 169 49 -3 149 27 82 -211
2951 -211 -237 190 176 76 1 156 -80 163 199 -68 18 215 67 71 -313 53 -51 -335 -57 -93 -210 -204 41
2974 41 7 -246 -208 12 124 335 -81 51 215 -69 109 -34 -152 194 -172 242 77 -284 -18 68 150 -74
2996 -74 -106 -172 50 -156 -55 -29 73 123 -2 146 283 330 -71 54 -112 9 -140 -39 217 95 -103 -94 -215
3019b15L19Q7k07j27M4J22l22R5J6K6N32j75k07q9K30P4m8K13l37J17k21L5J22
3042H4k2k05J94j47L2J47p5Q6j79R5J32l75L48L6k37j81J97p5L28l37K87k96Q6
3065g7o8J98O6N1l1O3l14J46Q0j38k2m7j34J42L81l99P0q5r7K97j49L94n01M5
3089a29K98k68J13p7K11%k74l8P25m74r4m9J35J43q5k43j0O1j17J47N5n2K22o1
3113A39j51k21o4M43j45n2Q3k72K22l3P2J19k94J03L7k81P4M40M2l69j43L39r2
3136dm0K3rQ5p5m6L6J41m0j17J96K7n58L02K60k47N6k05O9n5M29k33O9j25J08
3161D7j86Q8J11O0m71L81k39J19K25k42K34j62J05Q5j0Q3m38J63Q3j5l2m9l6k6
3185a22L36m92M85k81n4r7J89m2J33j15K60j16K29j64l08K07p9P8PJ03m61M48
$$ plain form
3019 -215 104 191 -16 -143 -99 23 -299 -204 -188 -162 370 195 -12 -101 129 203 155 368 31 148 -73 -38 84
3042 84 62 -143 51 -96 -64 83 8 94 -85 10 142 -233 115 151 -86 -267 -70 -145 183 -154 133 -163 -77
3065 -77 -145 53 119 170 139 202 -112 34 114 -24 -46 -93 -227 -85 296 -103 -33 -118 -215 82 -67 327 -174 -129
3089 -129 169 -99 14 -63 148 148 -126 -164 561 87 -7 -56 79 222 137 -106 -116 -55 -172 -25 30 -22 200 139
3113 139 -12 -233 -297 146 1 -51 32 -240 -18 -51 21 140 -154 -51 -14 -295 -221 219 261 -108 -251 88 -4
3136 -4 -44 -21 -30 55 -20 -66 -30 111 71 -46 150 177 -381 -79 181 -66 -10 -215 -146 -201 228 -5 64 -61 47
3161 47 -139 -51 60 120 -351 30 -209 -90 135 -107 127 -35 70 155 145 228 -210 -47 36 21 -11 -60 -96 -122
3185 -122 214 -278 207 -74 -128 -225 -36 -78 55 -60 200 84 313 149 -159 48 -31 47 54 157 -304 144
3207A44j80O9o1J39q3j25J80l0P0k40r0K86k71O8m4L61k30k3N0J23j60l2J53L5
3231A09N2k31k56L05K12l45k2J63L59n18pL52L3k00J0Pj6J10j95J15k47Q7K91
3254A68m53J81j7j7Q2J2j0j33n6K51J22k4n2J56m0k07J45J31k01j45J50J40k86
3277a03N2L19l31J14l32M70j07k81J62j97J06J86N5P7k78k3O1k65L00r5K28J1
3299A29m5P1j42n3j93J10R5p3j95L66k98K74R8l14L76Qm13K31k95J88J95j83N6
3322gq5O5L19l59J24J28j99mJ55j93mkj24N56m16k62L10o7L4J59j19K19q3rj79
3347d3J28R8r6l46L70j63J65%k59K26q0O2Q3K52l96N0j5N8P0k33p1Q1M37m64J80
3372I4k03k13M57l56L01k11k7j59O26j50k61J6r1J41k02M50j39n63L94P6j27K58
$$ plain form
3207 144 -36 33 -28 111 28 -97 83 53 123 -117 -207 79 -192 -124 -168 193 -37 -60 -10 113 -47 -79 74 109
3231 109 161 -70 -326 -21 191 -154 -176 -13 346 -172 -179 173 206 6 16 23 7 117 -78 37 -210 -123 168
3254 168 -285 -104 -121 -138 -56 -44 -54 -187 -243 8 130 106 54 210 170 -37 108 239 38 -107 43 183 -103
3277 -103 -51 268 -63 51 -281 189 82 -199 -37 -234 -128 58 113 190 -88 -111 -50 -315 -15 -110 118 129
3299 129 84 155 13 -40 -233 -123 -28 -101 -296 70 -228 46 144 -170 206 214 -199 32 -263 -75 120 -63 -7
3322 -7 -92 -27 292 -67 57 185 -14 -18 137 -56 -60 -62 -186 370 -46 -308 2 -65 -31 128 9 228 145 136 -43
3347 -43 85 183 87 -259 111 -52 113 113 -146 80 0 62 145 397 1 51 36 94 164 -69 -140 -59 378 -86 94
3372 94 -109 -322 135 -221 80 -131 -158 -317 309 159 -102 -86 -177 -36 -238 212 73 -490 -96 -20 -147 111
3394A11j50n8J05j60K34l06M25l93pJ41j00L64J24l84K08l4q5l01J32M62m14j60
3416b46K12n9K11j40j3K93m67J07J49O3j33K91k91Q7k64K44l1k78M00J2J25k13
3438E9j30p6K07m9K35k65Q8j72l08K47k5P2n9K14k4J37j18K26l68J40k58K03K9
3461Ek11M99k80q6K62j69N2k9j3j04J29J01j80j5j58j83N94k50J20n7Q9j32j65
3484a81K11k39P9J06K00k05K9j25j33K18rJ67l2l8Ln3o9l77P88j74j64M49m95
3507d4j34M57j01j03j92L09J49j74p4k93K85p1L2J2r9j43K05K48j43M7j09l85
3529c21N89l45R2J94l22K58l19M35j97K31k83l1K41l09J37L20m59n1L45j88m2
3550b5NJ19l56N0K82k25N6L1L9L1J34k60N9k62N28J16l63K09Pm94L46j9J91q1
$$ plain form
3394 111 -39 -97 8 -152 82 -224 201 -192 -199 -58 -158 206 330 -54 154 120 35 -266 -134 328 -86 -246
3416 -246 -34 -93 118 -22 -35 258 -209 -102 47 110 -23 268 -23 64 -200 44 13 -265 135 147 272 59
3438 59 -71 -147 60 11 246 -19 69 -103 -411 -164 -189 -117 -176 38 14 151 33 259 -109 31 -227 -24 5
3461 5 -206 293 13 -73 189 20 72 43 30 -74 55 156 -24 -39 -197 -380 214 -36 84 27 116 -16 -181
3484 -181 30 -209 -130 -24 176 -29 0 -125 -258 -40 -49 118 86 48 51 -2 -71 -448 340 166 2 451 -44
3507 -44 -178 279 178 75 -117 192 341 167 93 -200 85 14 46 58 -41 -184 21 269 126 173 64 -321
3529 -321 268 -77 15 209 -113 145 -174 261 64 295 12 -19 222 -87 50 370 -89 -140 205 17 -25
3550 -25 -20 99 -257 -207 75 -150 -94 -63 -24 7 141 -119 -60 -322 206 322 -41 168 175 -319 27 8 199 118
3574A18p7K51o9J39m00rK36J34m91KK67k20M2R8l1k2K22p3k1k4J89k57K78m16
3598a34J10P7Kk6k90R2K42k84L16r2R6K18m74K50J97j63q9O0k92J21j6m5J88j81
3622a17J53j99J70o2J5Q5K03j58k40J63j8R9J38k30L18k58k35N4q5L10r4J27j02
3645C7j66N67l56J9j83P2j10K06k26j93M64l6m19K1J81j17L43k4j72K84l62l3
3667b03P7J74l20J21o6K44l9LJ73m09K46M8o3l6M35n90Q6N7J09q1L0oK81k73M3
3692D1j10J10J04J0q4m3o3l21J89J63j35L88j95K4q7J11l6J28k3k57j07J69L7
3715A3N7j81j25J10L3L45l38rR2O8l25N7r5L16K91m77J60m6J85j15K25j46j73
3738g8K14q6k39Q6J71K2M1r9m7M2J64k94L85j85k07J9k3Q2O2J33j96M5JJ03k59
$$ plain form
3574 118 41 292 223 362 -38 -47 189 323 -168 -166 101 -119 -77 21 -10 -32 190 117 96 72 261 4 282 -134
3598 -134 -24 53 55 29 -261 -169 73 -211 105 13 109 327 -147 103 300 137 48 108 -184 -63 -79 -124 64 -117
3622 -117 36 -163 7 -55 -40 45 248 90 -150 13 -5 94 232 2 320 62 -173 -119 -204 106 12 139 37
3645 37 -129 438 82 101 -82 -10 -120 86 -140 -333 131 95 -324 -303 -122 -239 104 80 -92 192 -170 -203
3667 -203 -126 48 -272 -151 -217 27 -12 -9 164 -245 1 49 -14 -50 385 -205 -119 -62 47 -34 -4 -10 271 -2 41
3692 41 -69 41 145 155 71 28 -35 -356 -167 -4 -139 249 54 78 -9 102 66 194 171 -86 -193 -24 13
3715 13 70 -111 -236 -126 -93 252 -86 -95 -3 65 -260 -203 -298 18 309 -168 -8 -54 131 16 241 95 -78
3738 -78 136 50 -189 -103 68 90 131 32 -15 27 191 -103 282 97 -110 -91 -114 -32 30 163 -33 12 13 116 -143
3763a43n2j69K10QK06J16M23q19L49J27m48K04j38L38J07o7l28j44N58m00J18
3784E6O9J55q2J48l17J31Ml59J87k16J74K53l04P1k1K6P7J5N1n15N65Lk38l5n7
3809a59n3L30j95M69n85J09K00k84L27j86J11k43K53k99J42L14l48o1o7L81j16
3830D0l2j5K01j53N3m00M12nj56L4K36L9k80K16n16K79j1m0R1j96K70P2q6r2M03
3855C64l28j55R1L35j59k60J17L7J17m19L69j65J57N9l38J99J58p2j73Q8O7o4
3877B5j5j26O0MR9R7k10R3K08k97J25j83L04J20m06R3m3L30l64J85q0J5k7K49
3901B56m95j28O94k37q0k98J95O0m3K0J94r8J48m30J59k14K01J74m2J7K00n5k12
3924a4J09P8k37K5J26K42m32K71j48k28J18J55j02p7k6K3j00K62j0J4Ok95J05
$$ plain form
3763 -143 -195 -364 -154 -146 60 176 599 -220 129 256 -192 12 -126 212 319 252 -76 -220 338 -62 56
3784 56 125 280 198 346 29 160 164 -195 -8 -224 -50 203 -101 -30 -51 -25 52 67 118 -397 168 171 -67 -102 -159
3809 -159 -212 118 -77 392 -193 -84 116 -168 159 -27 84 -159 94 -205 -63 251 -97 -158 -225 156 40
3830 40 8 -7 194 41 94 -306 106 101 -55 -21 215 254 -26 190 -326 -47 -58 -98 -7 -203 67 139 53 -39 364
3855 364 36 -119 -28 307 148 -112 5 42 159 -260 109 -56 101 160 -178 21 179 107 -66 22 89 25
3877 25 10 -116 -56 -52 47 144 -66 27 235 -62 63 -120 184 304 -102 -9 -52 278 -86 99 19 34 7 256
3901 256 -239 -367 327 90 10 -288 -93 -33 -76 -56 138 40 188 -242 -83 -297 -96 78 36 53 253 198 -14
3924 -14 95 173 -64 -39 87 329 -103 168 20 -208 -90 65 -37 -114 -140 -117 -217 45 35 49 55 -240 -135
3947a35J47jM0l1j26JJ49K62l06oJ24l1R4l32K09K8p5J63j94mK30l26M3q1Q9J7
3973e2J82j80J04r4K08q4l36L38J32j22M1k31J45P4k27L7j84K52K5o9N1m1n9K29
3997A39m79j18M35k45L99O1j87p6J92K3l98K10Lp7k9O8j4l3Q3J5J57r6L7j36m0
4022a06k55M87j67p0L55m49M51r1r4k71L72K62l80J32l66K91j28j02L8PJ1J85
4044A12nj17L51k97M6m8Mj00L8J35n1O4J10J2k49j30k01K48m6J50j62R9L70N0
4068C83k44pR4n57O24k55P7K46k74Q7q4P0k34J12M8l7R6k13P0K53o82J19L08O1
4092F1j06K17j42J3lQ0m67J57L87m10M62O4J27k81k66o0L85k13l4K22r1J27l13
4115h4J44k64J28N3j66J55k82K7J39L14l36r1N17l77J03J11k28J66j21J89q0j62
$$ plain form
3947 -135 12 11 51 20 -106 -105 44 306 0 -6 118 87 181 -151 58 86 11 174 -20 -24 206 -120 -77 -158 -69 -52
3973 -52 130 -50 54 -40 168 84 -252 86 218 96 137 -94 51 125 -102 -65 -249 3 28 -41 10 -31 -90 139
3997 139 -340 -458 -23 -268 131 192 5 -71 121 144 -254 -44 -41 -118 -147 -79 -93 -126 -43 -28 129 33 70 -66 -106
4022 -106 -361 126 -41 -111 244 -205 246 155 61 -210 162 424 44 176 -190 101 -27 -129 -91 -84 -73 112
4044 112 107 -10 341 44 90 42 46 -54 -16 119 68 132 242 254 5 -125 -326 -78 -124 26 -136 -37 333 383
4068 383 139 132 226 -331 293 38 115 361 87 174 90 160 -74 38 86 49 145 -68 2 255 -427 -308 0 61
4092 61 -45 172 30 43 40 120 -347 -190 197 -213 249 313 440 159 -107 -167 218 5 -29 193 102 229 -84
4115 -84 60 -204 -76 -23 -189 -34 -316 -289 -150 164 -172 -263 254 -123 -20 91 -137 29 -92 97 17 -145
4137a45p7J92K91k52k50K54L2j88Oj04M19m7j57j30K00pj75K53m8k4K3k89K96
4160G3j62Q1j79L13k14J30N9k64%l8L65J8n47M67l08p9j84N58N8p3k3j12J41K25
4184C05k11k00L45m78O56j81p6l36R4po7k1K08k26M1J63K00k70q8J00l6l2N7K
4208e8K04r4k00L81l78K77o7K05k86J9J14m55K95L05m02K8M5M36o85M03J43k4
4230B06j18k1j77J49Ql11J54q6Q6P8K00o7k3J44N2j83p0r3l3O2J12j4j38M00l43
4255b6n0K92j55j00K18j35Q2O7j4p4k07Rr3K48J7j47Q7R9K03l35k12P4n4M82k78
4280bK26k12K0k4l2L81l71L5L3J85m42J41K0M2J14k89P6K28K8l16Q0K15j80L4
4304a0K13l01k2L08l5k7p8k79J31L42l43J13l8l34M76J27j10l98p1L06%j70L16
$$ plain form
4137 -145 -222 -30 261 9 -241 13 45 -143 -137 -241 178 131 -26 -156 44 37 -138 115 67 43 66 -223 73
4160 73 -89 -8 -187 126 -88 42 101 -163 -163 -201 164 182 -365 102 -206 -285 -469 89 147 74 51 -61 80 305
4184 305 94 -106 239 -239 417 236 160 -176 -82 -89 -156 -177 31 -195 -154 9 209 -61 -149 -49 -85 -117 -60 -58
4208 -58 146 52 -148 233 -145 132 65 270 -16 3 117 -338 -43 262 -140 -112 -67 369 -316 87 230 206
4230 206 88 67 -110 39 47 -264 -110 -196 -110 -32 168 101 78 222 274 91 21 -72 -105 -43 69 55 -83 317 -26
4255 -26 -76 216 61 -39 179 44 126 193 179 105 -102 -93 -186 62 79 -68 19 118 321 -14 -226 -152 -206 276 -2
4280 -2 224 12 32 8 -24 357 -14 21 54 239 -203 -62 -42 0 114 -175 -99 129 157 -159 -79 136 -44 -10
4304 -10 203 -98 -120 188 153 126 48 -231 -100 242 -101 12 -26 -360 116 243 133 -265 -336 -30 -30 -200 116
4327A16k77J23j16J10J1R6J33L5j28R0jl56L68K0r9k6Ml18Q7L01Ln03L93m6j54
4352a34QL07l24J10K20l4o8p1o5K89j43J3m10K66J9m2K93j09l92L07rj04K26Q4
4376B37q5j66K25l25L0j82N61o98N36k07J9l02M69J80m0j64k42J6P3K3MJ38r7
4399Cj08j08K22j79J24j08r9l7O91m48K55l89O2K69j1l03p5J01J31J13j79L39
4421B66k70J04L4kk73K78k85J55P0k22j28J83qJ46j08O0j87J90p5k48M90k84K60
4444A46m4K50m70j0J5j68M53k85O4K12l66L92k19ON1J06j10n0J58j78j08O2N84
4467D91l55j50o7l5Q7PJ88Q7l90M20j17m3j59j96NL51j11l42M19r1n6J88j65N6
4491B2J37p9j88K83K2l23L9L86k06j2mJ0k7o0J89j57k61L47j2k90K82J13q3k70
$$ plain form
4327 116 -161 -38 -154 -44 -33 63 196 231 103 193 192 -164 204 224 125 99 103 -215 -128 173 176 -327 66 20 -134
4352 -134 -126 181 -143 -33 187 153 85 14 -51 238 95 108 -302 -36 -17 -59 234 125 -267 40 31 -73 153 237
4376 237 152 -14 211 -114 -84 -266 295 -403 133 -74 -55 -357 112 292 252 88 -154 -138 -65 -42 -38 100 3
4399 3 -105 -213 9 -170 -46 -154 -253 -290 401 -47 208 -181 -119 150 139 -164 -239 -138 -7 106 -73 266
4421 266 -4 100 134 132 -141 137 -148 7 77 -145 -273 -90 -98 48 -60 0 -187 3 -72 -320 170 -114 146
4444 146 102 352 -118 -128 -113 -281 172 -113 -49 163 -203 189 -30 -24 27 133 23 -27 131 -47 -155 -93 491
4467 491 136 -14 -81 -116 -29 -22 166 253 -137 283 166 123 -36 -232 -227 124 13 -329 90 -1 -57 131 -34 22
4491 22 159 80 -108 175 197 -126 -87 299 93 81 77 87 60 0 189 32 -229 118 106 -184 98 211 128 -142
4515a42L48m07k70N17O5l19o0O4J56k0N3l3R1L7J58j14j98j21l9J94O8q2K2p9
4539a11K58l12K46l5j59M1L51m47L27J12l44O3K24m01P2M3n6O1M3L9o6j37K51
4562F3O9o1M9n9L06k51j94j26N9R1j99L88k46R2k65M8J68P3J53k48K94k11K44
4585B37Lm36K88n9J93J33l92K04k80J17k39J38k02M34l05K90k07J11K40l04Q2
4606D6k43J23j30O8r3M40l56J2M11l15l36J18J71N0K30j55K3k3l25M44k01j11
4628a52k1K06n3m3j95L73pl25J71K70r6l96L23om1K06l85J42J82l31l9K81R8k88
4652a26K42o7n7lK62m23l2L33J92m94j85K59L77j84L8o9k35J12Q7J37j0p9Q5q7
4676G3j47K12m19J42j18K33N9j29P7L20m33M38m45M11k38k46L76l3l84n8J03P6
$$ plain form
4515 -142 206 -201 -471 46 111 -208 -268 -204 -48 -68 -15 -48 43 80 238 124 -74 -195 -234 -40 28 -54 -32 -111
4539 -111 147 -165 81 46 -113 -72 279 -168 159 271 -73 -10 214 -187 -115 -72 -128 -67 -24 15 -51 -188 63
4562 63 132 71 120 61 367 116 -78 -204 -145 -54 -253 135 -111 -19 -284 -236 -68 5 158 -90 204 -7 237
4585 237 240 -196 92 33 226 359 -33 171 -109 8 -231 -93 -295 139 -166 124 -83 28 268 -36 46
4606 46 -197 -74 -204 -136 -229 211 -145 -133 278 -37 -373 -255 -84 -34 196 41 64 41 -284 160 -41 -152
4628 -152 -173 33 -20 -63 -258 115 108 -217 -46 224 128 -268 55 49 8 214 -171 -29 153 -178 -217 64 162 -126
4652 -126 116 49 -8 -11 251 -172 -204 129 321 -173 -358 -99 278 94 132 63 -172 -60 27 164 154 75 160 73
4676 73 -74 138 -281 -139 -257 -24 35 -94 -17 303 -130 308 -137 274 36 -210 166 133 -251 -309 -206 -130
4698a30K22o1m05L91K52o14J47J21P2q6n1K30k47K78k90K21L71k69j49O4Mj34
4720f3k1k18J58M6n4o9L0J1NK13l0l72K69M67m56K86k64K8N8j13K67l71K4J89
4744B0j55J51k37J32q1K19J25l68L22k36Q8j61J54j13J54k47J76j91M84j53L2
4765A15l6j31r3L11n6k2k38j06K61j12O7m3j18M01m58M14l25P9L64l57Pj41L1
4788a86K06N1k73J20R7l09J55m9Q7J17j42K64k85O4k4J21O7l05K0K58k00J70Q1
4811A05nq0J21j51q7oj40J95j68L56k44P1J79l99K81J75j91J57o8j34j32K38k35
4834a62J86j72J24K4j23K93l23j21K83Q3j70N8L01m06J38mm5o5q7K3J76l68M85
4857A28k63J14j47j58L68j9q4l09P29m40k30O0K33K2K46n40J7L38m0P7O0l24M88
$$ plain form
4698 -130 92 31 -374 17 269 -345 -198 -77 -5 -91 -142 88 -159 119 -171 50 421 152 3 67 71 -63
4720 -63 -84 -302 -144 -98 -152 -221 -191 -180 -175 38 8 -364 -95 372 -84 202 -62 -34 24 -89 178 -193 -169 20
4744 20 -135 16 -221 -89 -170 49 174 -194 128 -108 -20 -181 -27 -140 14 -233 -57 -248 236 83 115
4765 115 79 -52 -145 166 110 88 -150 -256 5 -107 -40 -83 -201 200 -258 156 -169 -90 274 -83 -76 -217 -186
4788 -186 20 71 -202 -82 15 -294 -139 -188 -101 16 -126 138 -147 -83 -107 14 81 -224 -204 54 -146 24 105
4811 105 100 20 141 -10 -97 -103 -243 -48 -216 140 -104 -33 146 -253 28 203 12 169 101 -33 -165 73 -162
4834 -162 24 -148 -24 0 -123 170 -153 -274 9 92 -78 -20 281 -125 13 9 -36 -101 -188 -165 11 -357 128
4857 128 -135 -21 -168 -326 42 23 -61 -370 359 -81 -311 -251 -18 4 250 -290 -273 65 25 102 162 -162 326
4880C26l05M84n66k17L67l09Q9K36M8j98l65K17J60k4q4J87j3K7Q5l36K6K9K18
4903H2l30K28J62K2p6P1O7k2n49R4L75j42J34j88j7P1JR7r5r4l0K49l5L2m7Q6
4929A46Pj09k24J41K18k75K88l54K26J98m42N55m23J02j18J15j40j6N6R8N9M5
4951A53Q9o7l69N1J8J47l85L74j28J12N4P8j58m9J75k73J74m9L00j96j34j03L1
4974a55J1L72k7j84j54J59J66k57J25j41l29L52K5J36k06J00n4J60n8J18k84L04
4996A79l50K00K9J62p0r2J12L7k94P5j08K29k1j26P1j67o8L09k70L01M7J82k48
5019A19l04R0l09M94L7n51N89m0m15K93%M80l53M8k14K56l79M0M01k63J03p5J12
5042A59L4m99K25J08J54j26J80k00j33K55k58L14m83L93J14o45O90L3m57K75N1
$$ plain form
4880 326 21 505 -61 -278 89 -220 -131 105 153 -45 -410 -193 -33 -57 -141 46 33 60 145 -191 -165 -136 82
4903 82 -248 -20 142 164 88 159 226 204 -345 -251 124 -18 116 -72 -89 -18 -17 80 -15 -109 -139 110 75 107 60 146
4929 146 153 44 -180 -39 179 -96 192 -162 64 262 -180 375 -48 54 -64 51 -89 -105 -49 49 108 153
4951 153 242 175 -194 -143 -125 22 -363 11 -117 -5 49 127 -31 -80 95 -178 -4 -53 247 51 -83 -186 -155
4974 -155 -144 228 201 17 -137 22 188 -69 56 -85 -414 -62 -37 99 -107 -7 -61 99 41 159 -125 179
4996 179 -171 29 58 220 150 58 170 207 -87 -12 -120 109 88 -38 33 -134 -202 107 -163 138 185 367 119
5019 119 -185 -95 -404 90 127 -424 165 125 -290 3 3 483 130 178 -36 220 -159 -119 282 19 122 47 159
5042 159 193 -306 -81 27 181 55 235 35 -98 157 -101 213 -270 123 237 -408 282 315 -142 133 184
5063A84Jj78o4N9J72K7Oj3n98K81J23k2p4J47j40Q8L5K78m86L38l7j48MJ24k37
5088a30n8Q5J86r7oJ43O4j68K60k33k11L79j67j1j23J98m13K73J05k19L20M5k65
5111d3j5r4K00J55j41j20p5k40K28O4N5KL29k3l01L9K04l75K60K6j00J15l55M73
5135B68l41R9k30J73J59k16J48J43j63j6k92K33J6O4l16O73k78j83O8l14L54m9
5157@j73Q9n3J47j1J85j67J30o4P3J45l06K62l02O9Q2j16K23k8j49K4r7K32m12
5181b17J85O6J1k58K68L4k60L60L6k62J72r7J16l98N22o09M93k40k8K47m74K75
5203e8O1L03l74J43j99m7L62o2r9J82J99l83O20q33M5K01l58R8ON01l40K20q4
5226A04m57pP68l96OJ44M1j72P2j41l5j10K00r5J45m6m4Jj17J08n08Q26k00j89
$$ plain form
5063 184 185 7 -57 2 174 201 207 194 -404 -123 0 -22 -96 51 -89 -1 34 312 -174 164 127 -21 -17 107 -130
5088 -130 -188 -103 83 -14 -20 123 187 19 279 46 -165 214 47 36 -87 111 -302 -29 76 -143 177 222 -43
5111 -43 -58 -152 48 203 62 -58 -133 -373 -145 -81 -26 -24 305 282 -19 20 224 -151 109 135 35 150 -205 268
5135 268 -73 26 -204 -31 128 -88 60 203 40 24 -268 -35 -19 45 -271 402 124 -59 9 -305 49 0
5157 0 -173 -84 -137 10 -1 184 17 147 83 156 301 -5 257 -45 24 106 -10 213 185 36 60 -37 195 -217
5181 -217 -32 34 45 -213 55 89 -171 189 225 -37 135 38 154 -244 278 -331 162 -78 -106 141 -333 -58
5203 -58 3 306 -68 75 -124 -171 191 129 30 212 411 28 648 -185 -140 61 -297 -199 -193 308 -32 188 104
5226 104 -353 -360 408 12 18 162 203 31 103 -38 -73 -183 17 -78 67 21 -23 -22 -139 -31 -539 287 87 -102
5250a02N9O1j05j13M26j38o0O0j75mR0P7q7m51O38j23j79K63j59j11J44lmJ8j40
5275a18K14j31k2k1K69p3j84nL48k62k3K31q9j60k31K42j95J05K78k24P6K20m35
5298a90L31k35k7M67l55n1o1j49L26J01m45K61J74k88M6J68M6J88q8l33Q8J94
5320A68k78j56K62o9O2J07j88J35p2K9o6J74j15L68k64Qj10k81K75q6mK16r9k
5344A4J71o1j16L8j38k4J68n8K73j24j71J06N2l42J17K98j18k96K61j65k9J36
5366hj91K04j94L30k32kJK87k97J99l8k14J28RN5J79m50K02K23q8o0L6lK06j87
5391I5J11l23M72q38P7L49m3J48K39m07K10j5K4M9j52J10k23K27J53m01N6L03
5413B21j08M9k69Q3j00J55j03K22j8k46L03m12P5j2K48n5j38J35k66K44k18j7
$$ plain form
5250 -102 -43 18 -87 -200 226 88 28 88 -87 -91 -1 76 -11 -462 176 53 -126 137 -22 -133 11 8 4 22 -118
5275 -118 96 -35 -57 -78 191 118 -66 -71 277 15 -8 223 134 -26 -257 -15 -210 -105 173 -51 25 245 -190
5298 -190 141 -94 -121 346 -9 -60 -121 -270 56 157 -288 -27 147 -141 -95 73 119 307 219 -114 -26 168
5320 168 -110 -266 -4 -73 -11 96 -92 43 -29 0 -66 108 -7 361 97 105 -5 -286 -11 -97 -101 115 16 14
5344 14 185 124 8 46 -92 -116 52 -6 267 143 -28 78 130 -212 -95 203 85 -211 50 -115 -144 -8
5366 -8 -199 5 -189 141 -91 -93 -92 195 -102 97 59 -155 -27 -18 37 216 -234 -32 191 103 43 79 76 282 95
5391 95 206 -117 355 -483 -406 -57 -100 48 287 -120 90 75 99 148 -4 106 -117 110 263 -138 -82 221
5413 221 113 162 -107 -24 -124 31 -72 150 132 -114 189 -223 -148 -160 88 33 -105 30 -236 8 -210 -227
5435b27K90J22m79K93k44L20L51n06O3J23K5j18J6j96j2M70j97k6j71K8N9N6J00
5458A40j71j07L94l48J25k53M3M14k62j20K16p6Np1P9J22j07k5L4j03k14J97L22
5481B34l06J15K42j98j22j42K77J07k48J8K21n2P4k49Q6O1J34j96n0L0J95m07
5503a76J43j26J45m5q7J38J27j88k33M45j74R3n5k81K76N7k50K64k43J11L06l90
5525a43J03j84L62k42J16L5k0J77k8m97L95k80J98K12M4j90R6J48j68j77j63L26
5547A20l8J1L4K9j61q1p2J54L9j84K95k46L80n18L30m7j47J49k67L86r5l35K9
5570b35k5K57l85M21j52K23j88N2J31j83K21l02L11k72k83K54J44Mp1J22Q8j86
5592e4Q3q9j48M36j00k44J47q7j41j12N30m3j67j99J81j69J75j78J60j09K35j69
$$ plain form
5435 -227 63 185 -294 -1 -245 75 426 -80 -17 106 131 13 29 -167 -179 291 94 68 -103 -75 -16 40 140
5458 140 -31 -138 256 -92 33 -220 -177 237 -25 -145 71 -5 0 -71 8 130 23 -2 32 -71 -285 -88 234
5481 234 -72 43 285 87 -35 -177 100 207 -41 -23 198 146 220 -29 57 118 252 56 6 36 231 -176
5503 -176 -33 -159 -14 -59 -146 -8 119 -69 -302 143 -31 62 7 -274 2 59 -191 73 -170 -59 247 -143
5525 -143 -40 -224 138 -104 12 47 27 204 176 -321 74 -206 -8 204 248 58 154 302 134 -43 -206 120
5547 120 82 93 127 156 -5 -86 -158 -4 35 -149 146 -100 280 -238 92 45 -102 47 -220 166 71 -264 -235
5570 -235 -260 -3 -388 33 -119 104 -84 -32 99 -84 137 -165 146 -126 -409 -155 -11 -7 -78 44 132 -54
5592 -54 29 -60 -208 228 128 -116 31 -56 -197 -309 221 178 11 -188 -7 -176 -1 -179 -19 -128 107 -62
5614f2J26q9J22q4N8N6j40L62K1k1l72m6J1J51j66k21j0k6L45K34l49n4M71j68
5638A49p3O5k79P8m1P8r7L32k97K59k31K95j39jj21j13L02m39N7J60K67j82J16
5661A45j83K16j03n2K51m01k5N9o8K8J06k48N60O4m04jj7J99L4k72J30j31L29
5684B16j86j17M8o8K37j67j02m2O8R2K2l5q3j52M18k37K05j92L17j75q8O8j8Q5
5708A14l86P9K05p1l1O6O2J53m38J75Q1J35j89J38j78k06P3J47J37k07J50K6N3
5731H8k40R9l9lJ26o7K85m82N5Q9J17jJ61r6q6J55n0p7Ok5J83l34J31k7lJ05j88
5758a18J53J2L6l61J2L73j94J71p0k12J93p7L92m35J98j42L57o0r0l07O7n8L97
5781B37K5k82K18k14N1k07K74J39r3j57r8M9K09n68L65K96m90N3L4j82M24ok30
$$ plain form
5614 -62 64 -25 97 13 71 127 -13 349 370 349 -23 -69 -58 93 -73 -294 -304 -330 15 249 -100 -154 317 149
5638 149 76 141 -138 -60 -101 -23 -120 212 -85 174 -57 238 99 98 -23 -136 166 -273 -216 -56 211 29 145
5661 145 -38 178 75 23 274 -127 -152 -93 -161 -133 -27 -275 285 349 -55 -56 -73 126 160 -112 18 -113 216
5684 216 30 -87 -39 -107 130 -37 -139 -181 -113 -21 1 -34 -117 -269 149 -88 117 -75 242 67 -21 47 29 114
5708 114 -272 -193 12 -59 -90 -24 38 191 -247 -72 9 144 -45 93 -85 -291 -218 -71 66 -141 9 35 88
5731 88 -152 -53 -92 -95 31 -36 249 -233 -178 -89 28 27 188 92 6 161 111 34 40 15 198 -136 -5 -32 -35 70 -118
5758 -118 35 47 83 -278 -266 107 -87 84 14 -198 -5 -82 310 -125 73 -69 288 228 138 -169 -102 -160 237
5781 237 262 -20 198 -16 35 -172 102 241 148 -9 -107 -58 151 -417 -52 244 -246 -193 -159 -341 83 77 -153
5804a53l6RL3M44l31m2j45J99R5j40K87r9j66J4J28m09P77n10P2J45r1k18J16
5827b1j73J93L88o37K80mk77L99o8O8k69K08P7j26k89K23j1m36N86k83N81l18
5849I1r4j68L02L2j00J84m44J6o2Q5L84m05K94l87L72M0j27K74j52k37J88k62
5871a76M31j15l95K34J11K38l04J07r7O9J9l59N61n51k1M75k98M50l59L62n51
5892a69K85k82J24j86K95j87L0K69k53L63m07J25J53j85K71j21k38J18k8j08M87
5913C56l61k2M01k84j27K3L0k35J64nL60j97k97k02K55Q7J1K72k75K43k68K04
5935A33j89N6K22l09K04j4k94L18k76J67K3k91R5O3k0j52L37j02M7N6N7j17J73
5958A87k22k06L2L54o8j53J85k30J71j4j32J96k87J36J80k78j12L75k27J77R5
$$ plain form
5804 -153 -189 -180 -147 297 -34 -76 -221 -22 73 -67 220 121 -45 -31 97 -312 465 -45 27 172 81 -137 -21
5827 -21 -194 -1 387 -250 30 26 -251 148 80 148 -121 87 164 38 -251 -28 -39 -475 111 -172 409 91
5849 91 -3 -171 131 163 63 247 -197 -181 -243 -158 226 -179 115 -272 100 140 13 287 135 -102 86 -176
5871 -176 255 140 -255 -21 90 328 24 131 34 103 122 -237 324 -227 -248 227 -71 379 20 382 -169
5892 -169 116 -166 -42 -228 67 -120 -90 179 -74 289 -118 7 160 -25 246 125 -113 5 -23 -131 356
5913 356 -5 -27 374 90 -37 -14 16 -219 -55 -60 300 103 -194 -396 -141 -54 -43 229 -46 197 -71 133
5935 133 -56 0 222 -87 117 103 -191 127 -149 18 41 -250 -155 -92 -112 -264 73 -29 18 74 131 14 187
5958 187 -35 -241 -209 145 77 -76 109 -121 50 36 -96 100 -187 -51 129 -149 -261 114 -113 64 159
5979A59Q9k15K6n2k22J76J50l13j3O3J03R9l5o1L9oJ72k50oK78k81R8O1K06m63
6004a98K33J64k2k78qK14k23K75Ql25n1N1j20J02J8M94j02k55j15k27P07O1l89
6027A4K07o2k27K73l37K97K1k70j6p2P7L90k71m1j52K63k03k89M60j77M9K41n77
6050d02J86K60J61J26q0k22o8pP0o9r7K02Pj39k3J33J2j90K49l96M74k01j74K90
6074A02o4k23J70j15K5K49K5l02J52K20j86k39K23L11l16L12l1n29J86j16J14
6095c2J57l74L57j40j08K92j83J4n3J29k84J09J60k2O4j04K44L6k68k6k43J09
6117a66L57j76R2j21J2l97L70m2rK11k04LJ2M3J21Q2l38J29K4L3j4m1J33j26j38
6142a50N5q0O4M98l66l7k6n8m9N27j64k89j22Q9l4o4J46R1k36P6J66k09M12n26
$$ plain form
5979 159 248 33 59 7 -215 -39 111 -202 -215 -152 -49 50 15 -46 -7 -13 159 -91 -97 181 -100 -2 59 265 -198
6004 -198 35 199 177 -101 -109 105 -118 157 165 -160 -211 -160 -280 -178 -160 334 232 -23 -138 -365 342 403 14
6027 14 221 159 -68 205 -132 165 186 -84 -100 -172 -95 295 24 -17 -169 94 -109 -398 62 -115 -66 175 -402
6050 -402 -216 44 205 331 251 29 -39 -46 24 -45 -142 60 67 -72 -95 38 50 -140 109 -287 187 -14 -188 102
6074 102 38 -185 -15 -130 -105 144 169 -133 19 239 53 -186 37 348 32 344 313 -216 -30 -146 -32
6095 -32 125 -249 108 -32 -140 152 -31 -17 -70 59 -225 -116 44 22 86 -18 226 262 -6 -32 -275 -166
6117 -166 191 15 107 -14 -2 -399 -29 -71 -80 131 -73 -70 -58 -15 106 188 -150 -21 3 36 22 -19 114 -12 -150
6142 -150 -95 -175 -111 387 21 -16 -42 -100 -149 378 214 -75 -197 -108 -142 -206 -60 31 -205 -129 37 -172 240 -286
6166b86n2K77Q1J66j06q3J01j88J08k1J75j94K0J07k85K77j2k03J59k62K87j20
6188e4J36n3j69L30l22j51L13J76m12q5J15L79l90J79J26j28L9l50J67j1K09j08
6210f4J43K5l31j03N12P2l04M1j27J96l6J08l41J41k1J66J6J35k78L37j59k42
6232a14P8j13NJ28k36N1M8J87j31K85j8L6j93K65j80j93P8m3r3J93j22P5J18k7
6256H4k40J25Q3J5K2J13p9k80M98l32n2OqM42n39L12j53lj38NP5j84J09ON7o5
6282a21K47j78R6P5j53j11KJ51K71p26M79j49L27l33p6K4J26J14r9j04J56L14
6304C32l77RO6Pj3J7p8K2K33k9j92K51j30j26r8K81m53N48l77R0p3NQ5J73k69
6329i6jK57j73L50l44o6j84L09p2J66Kk69m8L64j64j75k56L35j99K93k64L79n4
$$ plain form
6166 -286 -338 -61 20 186 80 -3 98 -90 18 -3 172 -22 -2 105 -180 97 85 -118 41 -221 66 -54
6188 -54 82 29 -140 190 -132 -283 30 206 -206 -291 -176 203 -187 -8 118 -10 29 -321 -154 -165 44 -64
6210 -64 79 104 -227 -330 182 254 -50 -9 -136 60 24 132 -209 -68 -89 77 93 228 -50 287 128 -114
6232 -114 -36 -149 -144 -16 -252 -201 -153 34 -97 188 170 206 13 278 98 -95 -17 -60 -153 40 -82 -7 111 84
6256 84 -156 -31 52 67 89 202 123 -157 341 9 -43 -37 -45 397 -142 170 17 14 -124 -119 -44 -228 -119 -113 -56 -121
6282 -121 126 -52 44 119 -34 -145 -143 8 279 -447 32 -117 210 -123 -199 -175 -49 65 -34 -138 18 332
6304 332 -45 -36 30 37 24 41 -37 -15 218 189 -3 248 118 -8 -106 175 -278 270 -107 -17 -90 -85 0 173 -96
6329 -96 -97 160 -13 337 -7 -73 -257 52 -20 146 148 -121 -169 195 31 -144 -400 -65 -264 29 -235 144 90
6352I0j18J35l0j12k0l28N55j70P4O7N1k2N7L97n76OK3O4l5j05k0J05J51n87M30
6377H2k68K56J10j65M8K07j24o6q8K04L7k05p1M5O6RQ9l90M48n85M83J26K4k34
6401C8ln5k11L02k97K19k18L86k7k74J56J04m14L28K09m25k7K92J15k00L1J5p2
6424b8J25l04p3M23n7j57L9P7pRQ7Nl29J07J8R6r2J22k32K14Q8l87N2J16K07k7
6450I2k56N14o47M11j61j30j19J26M7J82Q8Q2j98k82M95k65j51k5mJ12J47m89
6472d31K50K37K78l50j8P5j58K74j12k10J69J10r9j41M7J12j8J85k47l4k88J76
6494a93J7r9K92j40J14r7M26k92N4k01J63J06k74K30j74j0J46O0j90L2J43P1l40
6517a56n0J44J49j03RK12p2mj76l1P2j63J50P0k96k8K16J8J55R3j97L51m47k1
$$ plain form
6352 90 -28 107 77 -35 -55 -383 172 2 76 143 194 172 229 626 50 56 79 143 108 3 -17 88 239 -348 82
6377 82 -186 70 180 15 63 270 146 80 -8 196 233 28 -43 2 68 77 166 -224 224 -361 122 248 272 38
6401 38 35 -20 -231 71 -226 -7 -225 161 134 -140 16 120 -294 34 243 -182 -209 83 198 -2 29 44 -28
6424 -28 97 -207 -280 143 86 -71 -32 45 38 47 134 139 -190 -83 -65 31 -61 61 -171 43 131 -256 -204 -88 119 92
6450 92 -164 350 -297 114 -47 -177 -296 -170 -123 59 147 229 31 -251 244 -21 -172 -197 -201 -89 58 -431
6472 -431 -181 56 334 -16 -34 41 -117 157 45 -165 4 114 15 -126 -79 33 15 200 -47 -81 -369 -193
6494 -193 -176 -275 17 -123 -9 -106 320 28 82 -119 44 150 -124 106 -68 -78 68 128 -62 -30 113 184 -156
6517 -156 -206 -62 87 -16 -7 205 133 129 -47 -78 -6 -169 -19 51 -245 -273 -57 -39 116 209 12 363 -84 -105
6541a05J31j59q1o9M42n0nj27o0j12R1J84p4j02J21L6k20n1j9R1M44k23j96K60
6565A47j93J9Q5j81k08L23K15l80J19j99L15l2P4j63J03Q2j62J67j81K35j43k9
6587A3k10M12l15L43k10J8n3R8p0m63Q47o32j30N20J47j97l73K16J55j52RK4P2
6610F9j46K37k63J17M8J83l80J16J00j79M35k88nq8j53K27N2j83o5R9m3j77L07
6633B0K38k01j22K7J60j76k2j33J34L12j13M1Nj2j9J66k11K26m98K48Q4k39N4
6656c1J07k83kJ11J80j37J58k16J89j42j05j19P72n80q2J82m2j5J1r6j0O8J84
6679A02j54l65O53r0k26K98k94L6L89m59R6M58n50L64l06M43k51o1L9p4k69J15
6701a06K19j81J88j70K82l10J77j80K99k8o0j58M6P5Q6ok56L17q3J65k94l1j05
$$ plain form
6541 -105 26 -133 -214 -283 159 109 104 -23 -83 -195 -104 80 6 -96 25 61 -159 -210 -229 -138 306 83 -113 147
6565 147 -46 -27 58 -123 -331 -8 207 -173 -54 -253 62 30 104 -59 44 126 -36 131 -50 185 42 13
6587 13 -197 215 -100 243 33 51 -2 96 26 -437 410 -222 -352 168 315 118 -255 -39 116 -36 -27 -3 69
6610 69 -77 160 -103 14 62 245 -135 -19 81 -98 337 49 44 -44 -197 30 82 -101 -166 -67 -110 -287 20
6633 20 258 57 -65 -38 122 -54 -76 -209 -75 237 124 165 170 158 139 305 94 320 -178 70 154 -85 -31
6656 -31 76 -207 -209 -98 82 -55 103 -113 76 -66 -171 -290 482 -98 -180 2 -40 -55 -44 -140 -150 -82 102
6679 102 -52 -417 236 146 -80 218 -76 -40 349 -110 -14 444 -106 258 -48 395 144 83 122 48 -221 -106
6701 -106 113 -68 120 -50 232 -78 99 -81 218 190 130 -28 18 93 179 173 -83 234 151 316 22 -9 -114
6724a14J15j25J37R3j35R6j0Q6j55p9K00L5l3Pj35J13k99J55M3P9J99n79M98k83
6748i1J46n9J71j55J39j3k70J21L3p4J59l76M67O5m13J26J4r4m0K77m4l78Q3M66
6772B60k38K59l92K35P7l33l4J91K6q8k80M19j10N2j50J18k18K43k03j7M45k16
6794D6P7j64K71l24J54j18M76l64J07l65J88O9L00l05j64L42k23q2J03J09j25
6815Hj2j14J4m2J21MJ94k55r5L24o8j04l5j03J95K3R6J11l92K94j33l6N8k29M
6840a72L4K48l32L47k44Q5k86J81O5L87o43L11K62r0l74J99j55O5Q6k7Pn5J80
6863G9J07k03J85l20J61J76l02K49l40J74L7J15j14o0J0J7p0K81M6rJ2m82K95
6886D4r8j45J73J76N5r9p0j25K09k41M8K20j30r2L81m00K77n42K71J90rj47K1
$$ plain form
6724 -114 1 -124 13 106 -29 67 57 143 -12 -91 109 144 111 118 -17 96 -203 -48 -5 74 273 -306 192 -91
6748 -91 55 -4 167 12 151 138 -132 -11 22 -52 107 -269 198 263 -150 -24 -10 -104 -144 133 89 -289 -206 260
6772 260 22 281 -111 124 201 -132 -166 25 51 -37 -317 102 -8 44 -106 12 -206 37 -166 -183 262 46
6794 46 123 -41 230 -94 60 -58 418 54 161 -204 -16 53 353 48 -116 226 3 -79 24 133 8
6815 8 -4 -118 -104 -146 -25 -21 173 -82 -177 147 79 -25 -60 -163 32 55 151 262 -130 164 31 -5 53 -176 -172
6840 -172 -138 110 -222 125 -119 -34 -320 -139 -74 313 -330 -19 243 153 -221 -22 -177 -112 -26 -53 -46 -101 79
6863 79 186 -17 168 -152 9 185 -117 132 -208 -34 3 118 4 -56 -46 -29 -99 182 228 219 231 -251 44
6886 44 -54 -199 -26 150 205 106 36 -89 120 -121 -73 147 17 -75 306 -94 183 -359 -88 102 93 -54 -33
6909c3J65k89K43L0k7J8m8k04J58o4J20n0P9l83L31r6j03K50p1L6K50k66l6N2
6933F2m8k45K3L63o2r9r8J27J40j13j14M5O3j11k2J44o6O9N1k72L54m53L27k61
6957a96r9J03J46j04J2Q7K55l51J31k69K81K20l71M34k93j84J93q9K66m3q5nJ8
6980E7j86K2K92o3l40k8P6J24J82l14J71J44J3l01J75l71K54pp6J88j3J4P0n4
7004B9j21J34J19l5j70J1K97l55N7p3J33J19r0q3l05M04p2J61k62j41L36m8k45
7027b00M54q7K8J16j75m68L16m9J05m7j74R4J9K18j81m8O2P6r6k9J43L08m75J25
7051C5K9j02j00J47L9k19Q6K80n2N6k21l44M18k91j06O47j64j48M6qo8J6j08L55
7075B23j42k1Q4k9q9q0K25j89m3l10O73k97J01l49M0J39K76q3J63j52O8k25J6
$$ plain form
6909 -33 132 -157 86 116 89 107 59 -145 13 -51 69 19 98 -285 46 -50 -153 97 26 62 312 46 10 62
6933 62 14 -231 -208 155 93 -6 -104 23 163 50 -64 -19 44 -67 -89 55 -11 58 109 -163 191 -262 65 -196
6957 -196 -295 -192 -46 -150 -138 -51 204 -147 -16 -285 -4 216 -155 279 -14 -198 -5 -94 172 129 44 39 57
6980 57 -129 -107 185 122 -218 -246 -170 -46 136 -178 -7 137 150 -151 24 -347 -93 -100 -176 12 -1 13 83 29
7004 29 -92 42 161 126 -44 -33 264 -91 -34 -107 26 145 55 -28 -333 71 -1 160 -102 -243 93 45 -200
7027 -200 254 167 195 311 136 -332 -16 -65 40 -7 -181 -87 -68 150 -31 -79 -17 59 -37 -66 77 385 -90 35
7051 35 64 -38 -138 9 48 -171 -85 195 143 199 -22 -366 52 -239 -345 302 138 -10 36 28 -40 -24 -132 223
7075 223 81 60 144 115 26 -54 171 -18 -61 -371 302 5 106 -243 -203 -64 212 129 292 140 208 -17 -1
7098aJ7j38j8L77m19J07K0K20l50J17J72j51j29l4K43k81K8J06K58J72l69j49
7120b02J92k17J26K52l37K88l85J43K82l22J45q1L5N0nNJ94j64j13J0N3J80j57
7143b8J30L6j30m7J03R3k60j61K48O6k68J08k0k3K14k04K59Q0k81k70K50K08l16
7166b13K91k4m8k59M38j31j43J97k53r1P7M19k40J16j52j06j5m4J38K15j92J70
7188A50j78J07L47o90L32j17q4L2k18L79l1j73K05K13k32r5p9K04Qj85K93p4j70
7211e6J38n4m42M07J00L22m26J59J9k12P9K45Q0j1o82M19J01k04o4J05R4j32J55
7234A40k45K77j72l6k34L26J65L1j75k81K23R7n7j64J6k81M74n3J12k80NK26J02
7257B16l78P6j3m06L96k09N72l03J73J14M3j99r1j58L71j46o4o7j20J59k01P13
$$ plain form
7098 -1 16 -122 -140 237 -182 -75 -55 165 -185 -68 104 -47 -176 -210 33 -248 -220 -114 144 316 -53 -202
7120 -202 -10 -227 -101 151 -186 102 -283 -140 142 -180 -35 -116 -81 -31 -36 -31 163 -1 -114 -104 -51 129 -28
7143 -28 102 138 8 -39 64 157 -103 -264 -16 50 -218 -110 -130 -153 61 -143 116 196 -85 -355 -105 103 -213
7166 -213 78 54 6 -253 185 54 -89 108 -145 -236 -159 260 20 136 -16 -122 -137 -181 -43 172 -20 150
7188 150 -28 79 426 -264 68 -49 -133 -101 -319 60 29 -144 61 274 42 -53 -132 72 80 -105 188 114 -56
7211 -56 82 28 -414 -7 93 415 -11 148 167 -45 34 279 359 348 -334 85 186 -18 -82 23 117 -15 140
7234 140 -105 172 0 -36 -270 56 221 252 77 -204 19 116 59 -105 -89 -370 104 51 163 -117 -112 114 216
7257 216 -162 -86 -99 -505 -109 -318 254 -49 124 238 281 82 -9 -167 204 58 -6 -73 -193 -34 -235 478
7279D78q49N18j82j7J00O1J75J4n87L29K30o13J35J74k0K22j67M1K14n27J1K82
7301B2M8L70k81M2m47K52J12j44L57l00N8k25K34k60L5r3M66J20m64R1P2o7k25
7324b27J32J8K60j37J1o2J00J05k79J22q3q4j14M44Q8k58j58L04l2j99K04l91
7346b36K42J8J08j63j44P3j90K15Q1K08j85j03J2J79L17j70m42N24o55M71r1N0
7368A19j05k16K95l33L46N1p0k50J38K57j25J9m77J31K43O5j36J35l63L89j31
7389a8P3KR6k35K74l63K55l42J94K9J98J01j40J34O4k65Rl14N90j53k80L2m9Q9
7413a9n6K94l31J53k30K29j51M26k78l8k87K70kJ91j94J68q0n6K22l49r0K62J0
7436F4m7k09K89k96J19J62K67l49j71Q5L5k67K03J77j30K00m29L43j81M54n37
$$ plain form
7279 478 -371 147 -35 -52 48 109 284 298 -289 40 270 -343 -208 -34 -54 168 1 42 256 -271 -260 22
7301 22 70 440 159 201 -246 6 118 -26 331 31 89 -136 98 -162 -127 -220 246 366 -98 -7 65 -2 -227
7324 -227 -95 -77 183 46 57 -5 95 200 -79 43 -40 -124 -238 206 294 36 -122 182 150 -49 155 -236
7346 -236 6 24 132 -31 -175 -102 -292 -77 4 212 27 -76 -64 115 432 262 -180 344 -311 160 69 119
7368 119 14 -202 93 -240 106 157 87 -163 -25 232 107 126 -351 -220 23 88 -48 87 -276 113 -18
7389 -18 55 57 153 -82 192 -171 84 -258 -64 -35 163 264 124 258 322 57 66 -248 342 189 -91 -59 -108 -19
7413 -19 -75 219 -112 41 -189 40 -111 315 37 -1 -288 -18 -20 171 -23 145 65 9 231 -118 -208 54 64
7436 64 17 -192 97 -199 -80 82 349 0 -171 -86 -51 -318 -115 62 -68 132 -297 46 -135 319 -218
7457b18R9jp8M43j17j69l06L42k6k22K81n6m8K13k59m4J27m7q0L53k75L35k96
7480d9J01j25j7J24k1K79m79N9L53l42J86o2j61K64j60r9L2j68M39J30l04n9M8
7503c1N8l34M26k92J47j37M12j3m15K91o3K19n98O9M50k50J94k18J02j87K58j79
7525i1J91m12K76j89J08K74O0r2n9J76k06L4K40m29j5lK76l01K46j45q7J97J65
7548B14l68N6nj33K20J03l05K73J3l8j35J87O0Q6k91l54M91pJ11k71m0J10Jr1
7572a13O4J08L15m06J59k5k77J38J63Q5k36q6K83m29J4M10k00Q2k4l36K84J50
7594A23j66k00J63K67K4l34q9L25o9J16k26j69J25K83l04N2Rp3L4K31m27K57J93
7617A45m57M60k19L7k43K94q7K31j75M8J17L1O3k41j05nO8O5p2K7j26L67l90K29
$$ plain form
7457 -218 -119 -120 -198 245 128 -41 -347 -5 -31 -253 28 -28 -76 137 -122 -166 -39 -86 -166 187 -88 247 -49
7480 -49 52 -73 -90 34 13 292 -187 -128 225 -117 69 7 -154 110 -50 -149 -117 -285 154 284 -20 -79 -31
7503 -31 27 -307 119 -173 -26 -163 249 236 -179 112 49 268 -330 -261 189 -61 133 -85 17 -170 88 -91
7525 -91 100 -312 -36 -225 -117 157 217 125 66 242 36 70 310 -119 -134 -137 139 -162 84 -61 -148 49 214
7548 214 -154 -98 -103 -236 -16 87 -218 55 68 30 -105 82 142 228 -63 -417 74 67 178 -93 -133 -23 -22 -113
7572 -113 -49 59 374 -32 127 102 -175 -37 126 211 -25 -111 172 -257 -243 167 -33 49 25 -311 -27 123
7594 123 -43 -243 -80 187 211 -123 -212 113 44 160 -66 -235 -110 173 -131 -79 -70 -143 -109 122 -305 -48 145
7617 145 -312 148 -71 -34 -277 17 -70 161 -14 34 151 182 245 4 -101 -106 -38 27 -45 -18 -144 223 -167 62
7641F2j83j8K0J27L41m53O03m16q9j50L00l91J83j91K8J71j91J50J13J08j69J99
7663A54l80qJ8K30O3q0m8l89M90J93j77%K6j50J37M2n4J87l5k19J63l0k31KJ24
7688B8L9j22J35k20o4J93nR2J1O1k56J56J64p9k65K26Q2L1k88n1k4J42J81l17
7712a50j69L56L8r5J28k02k32N52l79K02L8O9k57L33j73l54K46N7J70o1k68Q3
7734f8L45n75M08l02K63OQ1j97l0k49O55j59K5j41K5L0j11k73L09j26K22j61l
7757b6J16k55J68J04P1j75j77K02Q1n90K06K16j26L08j05J66K2l12P3k52J01K32
7779D8j57M8J34j28K96j88Nj47Q9l62L96o4R1k19J60K54j22K5k54k5M2K02n2q7
7803a5l4r3M45l90N4p2J66Q3kJ2k7O3k27k9J56J89j83O7N3l36J58J9k42J46k0
$$ plain form
7641 62 -121 -139 -119 8 349 -104 499 83 -6 -156 144 -247 -64 -255 -227 -56 -247 -97 16 124 -45 154
7663 154 -226 -234 -216 14 77 -3 -51 -440 50 243 66 66 92 -58 79 121 67 254 219 0 163 133 -98 -96 28
7688 28 67 -55 80 -140 -204 -11 -16 76 87 148 -108 48 212 133 -132 94 176 207 -81 -132 -156 -14 167 -150
7712 -150 -319 37 75 -20 108 -94 -326 226 -153 49 87 156 -101 232 59 -295 -49 8 178 117 -151 -68
7734 -68 277 -298 110 -192 71 77 158 -39 -69 -318 337 178 203 62 87 117 6 -267 42 -84 138 -23 -26
7757 -26 90 -165 3 107 178 3 -174 28 109 -481 -275 -59 -185 123 18 184 206 -106 -33 -285 -184 48
7779 48 -109 -61 73 -55 241 53 58 -89 0 -362 34 -30 61 -158 2 256 134 159 -95 -120 -78 124 72 -15
7803 -15 -49 -142 303 -87 -33 -105 61 144 142 154 127 190 -37 -66 90 279 96 163 216 -120 38 57 -185 -39 -59
7828e9K38k09p7L10J6j50j34R5j69K76j31J89j1k88j30N1N0R2J64k87N92m93m23
7851d88P31k74k77M28n3rJj65J62k87M39j86J55L5j96j41j37K93p0K04j34J13
7873A44o7L6k4j55o4K8K18J19k77L1l52M37J0k32L50l69L28jo8k31J8L7p0J80
7897B6r8k7J16l09K21J39n8j84J81j26J26nj5J6J98k61J04j59NJ37O3m1k66J00
7921a17J11K42j90M1j4l6j8K5j53L8q8N71l31l12R2P6N7k36L14J32k00o8J47l14
7945b31L50j54J78m0l09L56l97j56L12l1n1L55k72L33j54L5L6k57J4L9J56J89
7967C01o6j1j47k03M04j79r8k9qJ65KO9l35j57K59r9M6J46J76l85L30m8j17J76
7991A92j95q6L01j38l60M86r6R0j63n7m2J56r1o9k5R7Jq3J38j68L73k14j89M04
$$ plain form
7828 -59 179 -30 -107 203 219 69 -65 30 -139 137 6 195 184 -104 -234 -183 -133 -41 123 -164 428 -65 -488
7851 -488 243 -31 -308 120 67 58 59 -106 56 -231 208 22 177 212 16 -125 -262 31 -39 165 31 144
7873 144 77 113 89 -66 -130 -102 116 235 -42 -11 -363 74 84 -148 202 -167 161 160 92 -139 -121 -84 -154 26
7897 26 -72 -99 17 -292 -71 68 10 -174 7 -119 7 2 -13 3 201 -60 44 -115 -110 27 90 49 -217 -117
7921 -117 -6 236 46 87 73 37 19 44 -109 -71 -159 412 81 -231 -139 -63 -6 -242 72 204 4 -64 83 -231
7945 -231 119 -35 143 103 -206 150 -247 -403 -91 -122 -173 182 -90 243 89 124 160 -97 -83 -44 112 301
7967 301 235 224 77 -126 278 99 1 -28 -36 129 131 200 -135 -292 -33 -132 -86 60 236 -149 181 133 16 192
7991 192 -3 -89 212 74 -286 200 104 194 31 -26 -68 88 -3 -72 -97 0 1 -82 56 -112 261 47 -142 262
8015B62l28R8j09r6J66O2J33k13j66K58j57K04q3l0K90k49J14l9J56l35O3n0k77
8038c26J56J9j7j47M20n04K68m3q9K56nM43m99L1k8K27j81J24l59L18m40L13j55
8061b18K6j03K42Q6k49J46RL73m80J20K83n1m15M51l64J7j64J67P7M0r9P5m9o6
8085a46J12J39P4j59L4J06l7k01k75L13j31J74j46j27K0K21r7K27j51j55R1Q6
8107b8J14O0j11j54K42j50K45p7j78J1J03k41J76M6k73P1J10o4J66l11M24q5k18
8130a22l07K86M5j21M67l01Q3m6q4k13K96L2r8K67k68K77k13N6P9j16k09K07k17
8153b20K81o3K3j35K16o9j79J3J04J25n65K98K08k6R8k00K04k80K32k6L0k01Q6
8176d6J76l17L37j70k20j50L28K68o7l69j7J41N3J9K62
$$ plain form
8015 262 -66 32 -77 -173 -7 55 188 -25 -191 67 -90 114 31 1 291 42 156 117 273 -62 1 -49 -326
8038 -326 -170 -151 -168 -315 105 -399 -131 -174 -263 -7 -12 431 -68 -37 -65 162 -19 105 -254 64 -376 -63 -218
8061 -218 -192 -295 -53 33 -216 -70 -61 312 -168 -48 235 184 -231 220 -144 -127 -291 -124 -47 -7 -106 -31 -80 -146
8085 -146 -34 105 179 20 54 160 123 -78 -353 -40 -171 3 -143 -270 -250 -29 -126 101 -50 -205 -114 -28
8107 -28 86 146 35 -119 123 -27 218 141 -37 -26 77 -164 12 58 -215 -144 -34 -98 68 -243 181 96 -122
8130 -122 -429 -143 -98 -219 248 -53 30 -16 -100 -313 -17 15 -83 184 -84 193 -20 36 115 -1 -210 -3 -220
8153 -220 61 -2 21 -114 102 33 -146 -133 -29 96 -469 -171 37 11 109 -91 113 -167 65 39 69 -132 -46
8176 -46 130 -187 150 -20 -240 -390 -62 206 139 -230 -247 -106 -53 -34 228
8191B28
$$ Imaginary data points
##PAGE= N=2
##DATA TABLE= (X++(I..I)), XYDATA
0@%%%%%%%qJ6j6J6k4L2l2M0n2O0p2Q8j04J20j40J64j90K18k50K87l25L68m17M70
31B49n29N93o63P41q27R21j023J134j257J394j543J706j889K093k321K578k868
48a511L199l584M035m568N220o033P074q468J0440j3459J8701l0309R6794j3795
62F3736j35653J17681o1951J790M5500m2524k329J9717k4235K3947M55j9253Q202
75d917J6190j5826P555N608j3155O643M660j0764P812n848J781L64q052R903o74
90A280n047P873p664J627P054o034K390j71n658P165Nm828J676p5k094L639L14
107A452m502L018Q34k357L967k079j924L052j602m23J932k181J57J536j668N04
123b84N70o41K20N3k59N87J88m46J08j16j17M84l77q4N8KJ00K75n08k9K84q0K71
$$ plain form
0 0 0 0 0 0 0 0 0 -8 8 -8 8 -16 16 -16 24 -28 32 -40 48 -56 64 -76 88 -102 116 -134 153 -172 196 -221 249
31 249 -280 313 -350 391 -436 485 -538 596 -661 733 -810 896 -993 1100 -1221 1357 -1511
48 -1511 1688 -1896 2139 -2429 2791 -3242 3832 -4636 5804 -7655 11046 -19263 77531 63736
62 63736 -71917 45764 -16187 -14397 31103 -11421 -13750 5967 -18268 5679 6134 -13119 -4917
75 -4917 11273 -4553 3002 8610 -4545 2098 6758 -4006 3806 -2042 -261 103 -7949 1954 1280
90 1280 -3767 4106 -3558 -1931 5123 -911 1479 1308 -4350 2815 2820 -2008 -332 -407 -2501 1138 1452
107 1452 -3050 -32 802 -1555 2412 333 -1591 1461 -141 -564 1368 -813 -656 880 -788 -284
123 -284 286 -355 -135 -82 -341 246 434 -12 96 -20 -137 347 -30 -114 -56 -54 46 321 -187 -216 68 -12 259
146B59k99j02J00l7J77N9l61M93j68m32L37q8O1M4K74n87L44JN0J29n94K64L85
169C09n39K50J96j24k35K93l65K51j16J73r6k6N51p19J71K85l55j53L21M1k62
190a49l8K40J04j58o9J85n8J22j05O2o8J58L4r5k35L24m2k12L2j25l0j21K25J62
214A43j29k49O4J16J19j39M4L21j97N7r2J30N9r1k21K80l90pL80o9l4k98J96p5
238h2K44K3k46m7l2p3J95K5l5j74m9K80j79n7L85J45k15K02k20J83r4j85J3j57
262a50J39J9k7O5J81l08K89n0j18J94K56q27J86j17M37l13m7N55j92l06L11j5
284A62l61Q8pJ04j70J38L38k03J97l40K59k09M1o2l00N68l35K34k17K09np9n0
307@KJ2Q3n6k09J35p7m9q4R8N7J56m15L28J1J26N9l34J66j21L81q05N27J63l88
$$ plain form
146 259 -40 -142 -42 -79 98 157 -204 289 121 -311 26 -62 -1 43 317 -270 74 75 125 254 -340 -76 309
169 309 -230 20 216 92 -143 150 -215 36 -80 93 -3 -29 522 -197 -26 259 -96 -249 72 113 -149
190 -149 -187 53 157 -1 -70 115 57 179 74 136 68 226 260 165 -70 254 212 0 32 -93 -123 -244 -19 143
214 143 14 -235 -171 -55 64 -75 -31 290 93 150 58 188 247 156 -65 215 -175 -182 198 129 95 -203 -7 -82
238 -82 162 185 -61 -108 -140 -213 -18 7 -28 -202 -251 29 -150 -207 178 323 108 310 90 273 179 -6 7 -150
262 -150 -11 8 -19 46 227 -81 208 158 40 234 490 -337 -151 -268 169 -144 -191 364 172 -134 177 162
284 162 -199 -111 -118 -14 -184 -46 292 89 286 -54 205 -4 37 -25 -325 243 -92 142 -75 134 129 50 0
307 0 2 14 97 41 -168 -33 -110 -159 -243 -145 -88 68 -347 -19 -8 118 177 -157 9 -112 269 -536 -9 154 -234
332b34J77J74k03j09J76J99k28o1L80m10k37K35K18j54J12j19J19j45R6m7j98
353b59L56K09j61m33M94j47K82k94p6K4j65K89j32l92M41L10k00j3k46K94j46
374C5j54L16j74k4L9p1J34j19L87o69K43J57l24L04j50k22K97k68L80j25J58k30
396h0k56L19j8p5O04o10J58L58m28q6n4K64j49j48M22k90j71L60J16k17K32k47
418Dm1J31j60K77m94L01Q3k46J76L6k45K3M18m79L4J89k82M7K86N3L8j37ll3j07
443a31L24j41k62Q1J91m8l26J25L13k84K03O1j66k78K79l41M03J07q2p9j26J17
465f0K19k98M4L31m16J55j12J17K8Q4J48l62K71j32o1O0J44m12O02k73k65J72
487a6k24J34n3j33K3J69k50M96k52K72j38J33k09K27k63n1J08Q7l01K65r3K28
$$ plain form
332 -234 -57 117 -86 -195 -19 180 -48 -109 271 -139 -376 -141 77 -77 35 -84 35 -110 -14 -61 -259
353 -259 97 306 145 -288 206 59 341 47 -29 -5 -170 119 -13 -405 36 346 146 133 -113 181 35
374 35 -119 197 23 -1 38 -33 101 -18 369 -300 -57 100 -224 80 -70 -292 5 -263 117 -8 150 -80
396 -80 -336 -17 -35 -110 494 -116 42 400 -28 -114 -168 96 -53 -201 221 -69 -240 120 236 19 251 4
418 4 -37 94 -66 211 -283 18 101 -145 31 67 -178 -155 263 -216 -182 7 -275 -228 58 111 149 12 9 -24 -131
443 -131 193 52 -210 -129 62 14 -312 -187 126 -158 45 106 -60 -338 -59 -400 3 110 28 -51 -177 -60
465 -60 159 -139 -95 236 -180 -25 -137 -20 8 92 240 -122 149 17 -44 16 160 -252 350 77 -188 -16
487 -16 -240 -106 -159 -292 -269 -100 -350 146 -106 166 28 161 -48 179 -84 -135 -27 60 -241 24 -69 159
509A59j55j60K07Mp3j0n0K47k36l9Q8j35Kl6k5J02P6k65L86R8p1L2l3l70L30k41
535a68K44j86j1J70j66K11K44p42L60J54q4J15Pj43nj14J51k02o3M3n3J15K39
558A16M5m64Q0L95J29o7p5l56L58k60K4K97n74M38o5j98ML79j50j44R5j61q6K60
582B0p3Q9j43K34j04j43L72j28o5r7K34o16O60l93r7M06j2l26K35K1l43N03j60
605G4j63J97k49n9K57Kk36J78n6r3QO3L20k09j44j76M0L16j38J74K0J68l16L4
629A2l54L55m23K88L76k67j26K50j97qk9o7K77l94J42j49K83R3k78K33J8j91P
652a49J26L34k20l68N76l34k39M76k92K79Ok78K04j82J72j12L5k6m58N00J13j2
674A51l35M50n23M19j82K0k43p0O3L54l95K66K01l18K6J31j93J14L98j02k96N
$$ plain form
509 159 4 -156 51 55 -18 -28 -78 169 -67 -106 -18 -153 -151 -187 -212 -110 -34 -299 87 185 114 146 113 -257 73 -168
535 -168 76 -110 -121 49 -117 94 338 -404 -44 110 26 141 148 5 0 -114 37 -165 -228 -185 -238 -123 116
558 116 161 -303 -223 172 301 234 159 -197 161 -99 -75 222 -352 86 21 -177 -173 206 56 -88 7 -154 -240 20
582 20 -53 36 -107 127 23 -120 252 124 59 -38 196 -420 240 -153 -250 156 144 -182 53 74 -269 234 74
605 74 -89 108 -141 -200 57 59 -177 1 -55 -148 -140 -77 243 34 -110 -286 -246 70 -68 106 126 294 -22 12
629 12 -342 13 -410 -122 254 -13 -139 111 -86 -94 -123 -190 87 -307 -165 -314 -31 62 -216 17 35 -156 -149
652 -149 -23 311 91 -277 299 -35 -274 202 -90 189 195 -83 121 -61 111 -1 34 8 -450 50 163 151
674 151 -184 266 -257 162 -20 0 -243 -313 -250 104 -291 -25 176 -142 -116 15 -178 -64 334 232 -64 -59
696e9j3n9P3j20n7K42p5N0r6Q2J46l19RK99Q9k64j25p9J84M43l76K44p7j12J33
721A63k18J32k3r0J30M8k73J62k4p1J70J79n25K45K99o1pj05J05k65L5M4j23K6
745d7K03p6j45L49j30k27J99m66K25n9L43j88K4N6nj5k4r3J55j09O5Q3K9l26L29
770A50m45L30k02K91M8l57K69k23P03p69L62J40m33K7J1Mj38o9O54j88l68K33
792C0j33J22j05K10o1P1k03K37l90K8mK85l52L81n86N48M4j76J79n30P08k38j55
815i0J98L3J42l00K9k00L48J6l39K68k2lj23q1M09m83M37j96l29Q4J25k63K33
838a07L14l51K87l6k15L30l90L95k69n8J18j55R9L29q4l12O4O6J82m46J94k99
860c44M26J50r2l68K93J91j85l9j4J98n31K80j33J85J58J15l61L56l05L2k2P2
$$ plain form
696 -59 -72 -131 -58 -178 -235 7 -68 -18 -114 -32 114 -205 -196 103 192 -72 -197 -276 -92 351 -25 219 142 30 163
721 163 -55 77 54 -36 94 142 -131 31 7 -64 106 285 -240 5 304 243 236 131 236 -29 6 50 -73 -47
745 -47 156 80 -65 284 154 -73 126 -340 -115 -174 169 -19 5 61 56 41 17 -76 79 -30 35 118 147 -179 150
770 150 -295 35 -167 124 172 -185 84 -139 564 -205 157 297 -136 -109 -98 -94 -232 -301 353 165 -203 30
792 30 -103 19 -86 124 63 134 -69 168 -222 -194 -198 87 -265 116 -470 78 122 -54 125 -405 303 65 -90
815 -90 108 141 283 -17 12 -188 160 176 -163 105 83 80 -43 -124 285 -198 239 43 -286 -202 -77 -340 -107
838 -107 207 -144 143 107 -108 222 -168 227 -42 -100 18 -137 -38 291 207 -105 -41 25 207 -239 -45 -344
860 -344 82 232 140 -228 65 256 71 32 18 216 -315 -35 -168 17 175 290 -71 285 -20 12 -10 62
882F2L05m64l1j61M54j01J03j62j19J32k33K70m4J24j17r0K01Q8k83P7k05K10
904A6L68j32j81j34K04j23R7J89o34J37K1r9K51k76O63l69J03l31QJ31K77o9j25
927hN9o5j84K34k57K89M1k57J9J9N7M3J62n6k55K6K29k47M06k64n5O8J44j76O7
952C9q9J26k23P8J54j68J28M6j35J14m6K5q9k32M32k11p9J26k6k8J6o4K37J9K7
977A77O5k44m9j88m3M21k91O6r4K46m01M87o4k05P6J90q9m12L3K59J28K05l48
1000g5O7m0J47l46O50n90K15K67k87J31k66K69k50J19l33K75K30J06k58j40K8
1021h1k5J73m34L44o9K58ok50q6R3K76l93L94k33j49L93J2m14j53M21L0l08r8
1044c05O19l49L4P3j98J51J06l71J86L2pKk33N82l48J21m98J48j37K69L52j13
$$ plain form
882 62 367 -97 -128 -289 165 64 167 5 -114 18 -215 55 11 135 18 -72 129 217 -66 11 -194 16
904 16 384 252 71 -63 141 18 115 304 -330 -193 -172 -271 -20 -296 367 -2 101 -230 -222 -91 186 117 -8
927 -8 51 -14 -198 36 -221 68 109 -148 -129 -110 -53 -10 152 96 -159 -133 96 -151 255 -9 -64 4 148 -28 39
952 39 -50 76 -147 -69 85 -83 45 91 -44 70 24 49 -40 -272 160 -51 -130 -4 -30 -58 -42 -106 131 150 177
977 177 242 -2 -51 -239 -282 139 -152 -86 -180 66 -335 152 88 -117 -41 149 60 -352 -319 -60 68 273 -75
1000 -75 -8 -48 99 -247 403 -187 28 295 8 139 -127 142 -108 11 -322 -47 183 289 31 -109 -81
1021 -81 -106 67 -367 -23 -92 166 160 -90 -176 -83 193 -200 194 -39 -188 205 217 -197 -350 71 101 -207 -305
1044 -305 314 -35 -1 72 -126 25 131 -240 -54 -22 -29 -27 -260 322 -26 95 -403 -255 -392 -123 229 116
1066A16Pq0J42j72jm0K31j64k93L49K51l35k4q4l1K17k26l4L35p8j19J03K59l24
1090En0p2R5J1n9J64j22O3R7K29k81m7P7J7k00K32p5j63K39k15j46K44mk79J63
1115g7O3J15l0k30MK30j23j56L24r9K81l18K3J57j81R0K2r3jJ68k35m4L39K43
1139D72n20K93l56K1R8J06l20K52K09O3o60R3K93j25N9P9n35O19l11K41j98n9
1161a86J10N3O4l3m2j4K08k84M8l3M6P6k80J30q7K75j1l27M10l10K89J6j34N6
1185D0j60J3L54j88L3k95m9J93K15k18m03M29R1J36j83q9j84M05rRP3j65k15K73
1209A06l18l1L53q1j60K98m1O0l25j44l3K55N8k41J68J15J72j92k11J44l0N5J11
1232H8j98j89m2L11R4k48K22M4k38K40K6j89M8N0J68j74J85Q5k36J30m45L80q9
$$ plain form
1066 116 123 43 185 13 12 -28 203 39 -254 95 346 11 -13 -97 -128 89 -137 -171 164 86 -33 70 329 5
1090 5 -45 -117 -22 -11 -70 94 -28 35 132 361 80 33 110 127 -73 159 84 -79 160 -55 -201 43 39 -240 -77
1115 -77 -14 101 71 -159 -155 75 -48 -204 120 21 302 -16 7 164 -17 73 95 2 1 169 -66 -110 229 472
1139 472 -48 245 -111 -90 8 114 -206 46 255 318 -342 -249 44 -81 -22 57 -478 141 -170 71 -127 -186
1161 -186 -76 -23 41 8 -34 -48 160 -124 -76 -109 -63 13 -267 -137 -224 51 40 -287 123 -187 102 118 -16 40
1185 40 -120 -107 247 59 92 -203 -252 -59 156 -62 -465 -36 55 191 8 -81 -265 140 131 140 213 48 -167 106
1209 106 -212 -243 110 29 -131 167 126 186 -139 -283 -316 -61 -3 -244 -76 39 211 19 -192 -48 -78 -23 88
1232 88 -110 -299 -341 -30 64 -184 38 82 -156 84 110 -79 -31 19 187 13 198 283 47 177 -268 112 23
1255B3j38j5M61l91Pj71O15k83k07L29q7l15L01J7nJ8j56L8J19k27K45M1j61K13
1279B71k36O0k27J16L16l71j69M94k47m9N1j46K07j01k31N67l24l62M38q3Q6K12
1301B72m63J16O8J55j58L98m02k28J72n3J41O3q8K09m26K70j75L61k2mj03l0k6
1324D7k09J68q6J37j64M4j9J24j11J27J14R3m97J35QJ28L5j61j72M89k32j56K36
1347G8j11q1K67M2k79j3J38n9j48K14N3J8j03L1m1RK40K58l46j61m6L77l88R8
1371D7r2m7K26k42L67k92Q7M37o96M43k13M7K77l09j98Q9P1prk7q5L0r5j9O5n8
1397b03M60j57J04k09j81J00K84m81M21l12J44K22l77L38q7K76k18j9j10J3K2
1418C0q6l07M74j06J2k15o3K04Q7j40p5J20k01J59J79o2k5n6P9L11m55j4K08O
$$ plain form
1255 23 -115 -130 331 -60 -53 -224 391 108 -99 230 143 -172 129 146 141 159 3 41 160 -67 178 219 58 271
1279 271 35 95 -132 -16 300 -71 -240 254 7 -42 9 -137 70 -31 -262 305 -19 -381 57 -26 60 272
1301 272 -191 -75 -7 148 -10 388 -14 -242 -70 -123 18 81 -7 202 -224 46 -129 232 210 206 103 73 47
1324 47 -162 6 -80 57 -107 -63 -82 42 -69 58 172 265 -232 -97 -89 39 74 -87 -259 230 -2 -158 78
1347 78 -33 -114 153 195 -84 -97 41 -18 -166 48 101 119 16 47 6 15 255 513 167 6 -40 337 -51 47
1371 47 -45 -92 134 -108 259 -33 54 491 -205 238 25 72 349 40 -158 -69 2 -5 -14 -41 -126 -96 -191 -210 -145 -203
1397 -203 257 100 204 -5 -186 -86 198 -283 138 -174 -30 192 -185 153 66 342 124 105 -5 8 30
1418 30 -56 -363 111 5 17 -198 -261 -57 30 -110 -185 -65 -266 -107 72 10 -15 -71 8 319 -136 -150 58 64
1442F4j19J27P1l97L11Jl54L73j17K63m42J78J78Pk39K55r0J2O4k20J36J6Nj56
1466g3m4K44l2M9l15L38k65K29Q6m87O8M39k49N6R0l16l6J92n8j51M23J25m66
1489a53J0K33j48j58J40r9J99k42J99K00Nm85K05J69k57L67n44J92J65j52J23
1510c1m0L83l07m8k4r5p8J79L14j82N1Pj63p3J08K42m04L38k39j77M10k31p7N29
1534C92j24k44j24j28L97m6l37K60q6n8O7k18L34k25r7M91n2j60k59J53K43l5
1556A44k02n0L83j53j16J94m60N6P6K93j46O9Q7k16L32j20k23j17J26J80l11q4
1578b58K75J24m93O19l73J30M3M1l43N69q2l01M5l7Q2j13J40k01j51L53q5J60
1600A44n9k70N41n16K11p7J17O4pk8j92J09J39k71o2J90K19LMk79L3l0j15N1K04
$$ plain form
1442 64 -55 72 143 -254 57 58 -296 77 -40 223 -219 -41 137 144 -95 160 70 82 146 -74 62 78 83 -73
1466 -73 -117 127 95 144 -171 167 -98 131 217 -270 -202 237 -12 44 134 -182 -218 -26 -84 -235 188 313 -153
1489 -153 -143 90 -58 -216 -76 -175 24 -218 -19 181 186 -299 -94 75 -182 185 -359 -167 -2 -154 -31
1510 -31 -71 312 5 -43 -67 -162 -240 -61 253 71 122 129 -34 -107 1 243 -161 177 -62 -239 171 -60 -137 392
1534 392 268 24 -100 -228 169 123 -214 46 -40 -98 -31 -249 85 -140 -237 254 202 42 -217 -64 179 144
1556 144 -58 -108 275 122 6 200 -260 -204 -128 165 19 88 175 -41 291 171 -52 -169 -43 137 -174 -258
1578 -258 17 141 -352 267 -106 24 67 108 -235 334 252 -49 -4 -41 41 -72 68 -133 -284 69 -16 144
1600 144 85 -185 356 -160 51 -26 91 155 148 120 -72 37 176 -95 -157 33 252 255 259 -20 13 -17 -132 -81 123
1625A23M9j72P8L3n8j61J39J27l60J44q3K73j67M2R8j34O8K65o46N11j66j05j
1648a03j60M94l15L68k18N9j93K02k44q4J37N9J31k94j89K72L10o17M32q1Q0N4
1670A00k74q0L17k50NJ60k01J48O9J15J54m08M8J25m4O5k62J78K42l23k45K34
1692a27J04J69q0m3j98K86l86L43J21l06j49J25M8J22k59L6K71J33k87Q1J90l69
1714a75J26J23j52J30K43m68L32O8Q6k76k7L6K9P9jMj73n0j2J29nJ63l76K40k86
1739b13J98jq3J96l47M35k30k4L52l82K26k63L99j71l1m1J44l78k18M07k32J53
1761a04J1J44O9q7r6J83j03p3K51r7j36K17m29K21Q9j42J17j73K56k80L2M9P8
1784cJ08o1M4k58J74j19n9K78J41k1n04m9K41rJM1R5O8k24J31Kj5K1%o4r3J42
$$ plain form
1625 123 172 0 78 111 53 -108 31 158 -202 -58 -141 132 -35 7 105 -29 39 304 -342 169 3 -102 -103
1648 -103 -263 231 -84 284 66 125 -68 134 -110 -194 -57 2 133 -161 -350 -78 232 -385 47 -34 46 100
1670 100 -174 -254 63 -187 -182 -22 -223 -75 -6 109 263 -145 -97 28 -16 49 -213 -35 207 -116 -361 -127
1692 -127 -23 146 66 23 -175 111 -275 68 189 -117 -266 -141 -93 29 -230 -194 77 210 -77 4 194 -175
1714 -175 -49 74 -78 52 295 -173 159 227 313 37 10 46 75 154 153 157 -16 -66 -78 51 46 209 -167 73 -213
1739 -213 -15 -16 -99 97 -250 185 -45 -69 283 -99 127 -136 263 92 61 20 164 -214 -432 -25 -257 -104
1761 -104 -93 51 120 33 -63 120 17 -56 195 98 -38 179 -250 -29 60 -82 35 -138 118 -162 -130 -81 -3
1784 -3 105 44 88 -170 4 -115 -174 104 245 224 -280 -329 -88 -97 -96 -55 40 108 -116 15 17 2 23 23 -41 -134 8
1811HK9l99J95L9J37N6RK50n76N86k48j84m1QJ74M7o5k9J4J98j08l28K58j30m4
1836a44L27k19O2k26K18p2K69k26K19k39J69k20J35J1j08k9N0K92L0k95J33j64
1858b7J26J75k34j94J56QP1Q9k87n3k4J18o3K62l30J53J06r5l7p1L45l13R5J57
1882A33k21K19M0m9l93L74k7j38J09j18l21M09k12J95J9O5l75O7R3K15l2k23L17
1905A46k03P4q5M0R7j20j2J86K5j76j30L68k2P6l24p7R3J57j8M7k33J76r6k67
1929b78K49lj71J86j3j01j24N96m68k3K48j53J09k58K56q8m16N17P4l77M90j66
1951H6oJ95k00J02k32M77n70L77l9k07K7J78J01o52L23L32k04k57J04q9R9O3k1
1974a3r1J37o0J9P3l32K13j3K65k30J21J82m92K42j50o6K46m76M70K35k64L6R0
$$ plain form
1811 8 37 -362 -167 -128 9 65 74 324 -252 334 86 -98 -139 -131 43 90 25 -4 10 208 100 -228 30 -100 -144
1836 -144 183 -36 26 -200 18 -54 215 -11 208 -31 138 -82 53 64 -44 -73 -23 269 299 4 137 -27
1858 -27 99 274 40 -154 2 10 81 170 -117 -170 -194 -76 -139 123 -207 -54 52 -43 -80 -151 194 -119 -24 133
1882 133 -88 131 171 122 -271 103 76 -62 47 -71 -392 17 -195 0 19 84 -291 -224 -131 84 52 -171 146
1905 146 -57 17 -68 -28 69 -51 -63 123 148 -28 -158 210 188 264 -60 -137 -44 113 95 142 -91 85 -11 -278
1929 -278 -29 -32 -203 -17 -30 -131 -255 341 -127 -150 98 -55 54 -204 52 -36 -452 65 139 -238 252 86
1951 86 80 275 75 177 -55 422 -148 229 190 -17 10 188 289 -363 -40 292 88 -169 -65 -154 -55 8 -13
1974 -13 -104 33 -27 -8 65 -267 -54 -67 198 -32 89 271 -221 21 -129 -195 51 -425 45 280 16 52 142
1997A42k28q7J47J51j42j26R0k30Q1M3M5P6J12J38j50J8m5K00p0k22j8QP3K49
2021B55n10L20O5J57m80L89j90j46O9pM02m23L03r2J19l57k09L59J79j86J5J39
2043A71q5j4p9M4P9j46L0R9j57n9kj4R2j87N43l84j6L08l66Q2N1l10M83l95JO0
2069a71K79q1k37K38k87J01J43P7K26m51K7P3k05L79j72K41j83J42kJ09p5k71
2091a00J62J25k85J27j1oP9J0N9p2j05j1j15J14L22k60O5j03K00k17K95o1j26
2114H6j69J28k60J09J97J2L7k42J88q9M07l26l7k10L52n27J26M64k33J50n7m41
2136c35N58m12R9K3j05K26n9Kj65J85l1K65k70j85l0K02n1l0j03N73j89k87J49
2159C0r3Q4m0K5M1j8l6J4K20Q1r0k31%j8J64J21q4k30K0pp6m7K98r9M8o9p2jJ24
$$ plain form
1997 142 -86 -173 -26 125 -17 -143 -53 -283 -202 -159 -114 -38 74 212 62 80 35 235 165 -57 -75 -67 6 255
2021 255 -255 65 130 287 -193 196 6 -140 -71 -78 324 -99 204 112 231 -126 -335 24 203 17 32 171
2043 171 86 72 -7 37 116 -30 0 99 -58 -117 -119 -133 -41 -228 315 -69 -85 223 -143 -61 -10 -320 163 -232 -231 -171
2069 -171 108 27 -210 28 -259 -158 -15 62 288 -163 -136 -63 -268 111 -61 180 -3 139 137 246 171 -100
2091 -100 62 187 -98 29 18 12 91 101 160 88 -17 -28 -143 -29 293 33 98 -5 195 -22 273 212 86
2114 86 -83 45 -215 -106 91 103 140 -102 86 -3 404 78 41 -169 183 -344 -218 246 13 163 106 -335
2136 -335 223 -189 -90 -67 -172 54 -5 -3 -168 17 -14 251 -19 -204 -234 -32 -83 -113 -216 357 168 -119 30
2159 30 -63 21 -19 6 47 29 -7 7 227 308 218 -13 -13 -31 133 254 170 -60 -40 -47 -123 -170 128 29 77 8 -64 -65 59
2188E9L6N2j64m1L24j24K0k85n3R2K10k10P4P7j23q8K67n8o2J4J12k9l58M08K9
2213A79J57j00j58J9k8L72l02j28l6J70l0k82K07K0j66m2L06j36j38L09m42L38
2235H9J76k11l06L29J7l17L8J57m3J07p2J00k94L47j74J16k14R8L2J72j90p2j42
2258b57K22j49K15R4j21l7R3kQ6j35j55N22k32P1k10Q3o3j67L4J47K03k78j0K9
2282a7l04L51J12j51k66m2L29P8k24r3M30l71K15m36L09K13l16Q0J7PJ23R6l79
2305b39K43K17j84J96j94k46Q0R0J16l39PK04J76j87r5K22l45L25k04N6r9n4N6
2328a98L35l02L5MJ25J15r6r0j1m6K53l85L63n8j29p3Q1p5K07J13j11j66K57N2
2352B00l83L64r2m58K02L40j2l47L32k7O8mJ80n32Q7R4p5J02J18j78l9rP5K57
$$ plain form
2188 59 95 147 -17 -58 266 142 162 -123 -176 -84 126 -84 -10 67 -56 -144 123 65 3 17 129 100 -258 150 179
2213 179 336 236 78 97 69 441 139 11 -25 145 115 -167 40 60 -106 -148 158 22 -116 193 -249 89
2235 89 265 54 -252 77 94 -223 -185 -28 -71 36 -36 64 -230 117 -57 59 -155 -57 -25 147 -43 -115 -257
2258 -257 -35 -184 31 125 4 -33 60 58 144 9 -146 376 144 215 5 88 25 -142 -108 39 242 -36 -46 -17
2282 -17 -321 30 142 -9 -275 -317 12 90 -134 -227 203 -168 47 -389 -80 133 -183 -103 -86 -79 44 140 -239
2305 -239 4 221 37 233 39 -207 -127 -37 79 -260 -253 -49 127 -60 -155 67 -278 47 -157 -101 -200 -254 -198
2328 -198 137 -165 -130 -126 -1 114 18 -72 -83 -129 124 -261 102 44 -85 -158 -77 -152 55 168 57 -109 148 200
2352 200 -183 181 89 -369 -167 173 161 -186 146 119 187 183 363 -169 -82 12 -63 39 157 -21 -60 -69 6 263
2376B63j55j83n8j26J16J09k15J09K66m05L82o7r4J28j45K51o12N08j60J47j47
2397h8R8l02M19j73J76j40k6k9l13J67J11k2R0L6J62j89j43l8K87m28J08J36K23
2420A22n4l37L65K1k6j54q8K68j4m4j34J95J83l67M3o1R2R1j7k39K37l0k04j44
2444b96o0P3K15k5J7K08j74M9K56m96J03L40l18L18l23L05j51J88l23L88k08k60
2466a74Q7J24j61L05l72L98O6j90J9J12rk20J17q6k70K22j32K83J8j44j47L15
2488A61j12Q8j15r7K43j38R4J96j88j99K66j38M7pJ45j74K44l85j46L49k18L3
2510e1K3L7K35l21J50q4l43k5N18%p8q4J98l93J80J37O6j82k41M75on35L90o8
2534bon4rK63j57r4j5k4k19K93j51L90j02r3M4K9l08J2K99J4J6j48K64n24L80
$$ plain form
2376 263 108 -75 -133 -259 -143 -34 -249 -140 126 -279 103 36 -58 70 -75 176 -436 72 -88 59 -88
2397 -88 10 -292 127 -46 130 -10 -36 -65 -378 -211 -100 -122 -32 4 166 -23 -166 -204 83 -345 -237 -101 122
2420 122 68 -269 96 117 91 -63 -151 117 103 59 -75 120 303 -64 -21 -82 10 101 84 -155 82 52 -152 -296
2444 -296 -356 -283 -68 -93 -76 132 -42 7 263 -233 -130 210 -108 210 -113 192 41 229 -94 294 86 -174
2466 -174 -87 37 -124 181 -191 207 273 83 102 214 205 -15 102 16 -254 -32 -164 119 137 -7 -154 161
2488 161 49 137 22 -75 168 30 124 320 132 -67 199 61 108 101 246 72 316 -69 -215 134 -84 -51
2510 -51 -28 9 244 -77 73 -11 -354 -379 139 139 61 -23 175 -218 -38 99 165 -17 -258 217 211 -324 66 -2
2534 -2 -8 -62 -71 192 35 -59 -74 -98 -317 -24 -175 215 113 20 64 93 -215 -203 96 110 126 -22 242 -282 98
2559I8mk5l2j03P0j44%M5J48J92l06l5K27p1n3N4J9k62o2K92j33J74k26J6R8j63
2585a86o3O6L65j75m1K87m54M62k29k14p1K79p3M4OQ8j8J9J20n46L83l14N81k73
2609D3l6n7k22L31j66M68o19K53r8N8K13j49l6k04O6J08Q2J65o03K64J23l6M5
2632gp5j16J75J5o4J51J90k57P3N4mj13M1k30M29j20l8j9j07o1j02L52l34K5r7
2657b39P8M60k36j40j93K22k1K94n94R9M72k00l10J14J96K26m2r7r2L40n04J61
2679fq9K26l21L63k61R6o6N4J33m11M30p1j72m2K06n7Pj01j27L53o0n4LL8k33
2704a62L30k59L9o3O3K0o8N3K91n1j61j60j78R5L56O0J41l83J02L2j25K28m20
2727b20J90J30J08n28K72K18m24M95j42k22P3J06j56k53M32r0K35k93J2M9k05
$$ plain form
2559 98 94 69 37 -66 4 -140 -140 -95 53 245 -61 -96 131 60 7 61 80 -182 -244 48 -85 89 -137 -121 -23 -186
2585 -186 -249 -183 182 7 -34 253 -201 261 32 -182 -253 26 -47 -3 3 91 73 92 212 -334 49 -265 316 43
2609 43 7 -50 -272 59 -107 361 -258 -5 -103 -45 168 19 -17 -221 -155 -47 35 200 -403 -139 -16 -52 -7
2632 -7 -82 -198 -23 -8 -72 79 269 12 85 139 135 22 63 -167 262 142 104 85 -22 -83 -185 167 -167 -142 -239
2657 -239 -161 299 63 -77 -270 -48 -69 225 -369 -270 202 2 -308 -194 2 228 186 89 -3 337 -167 -6
2679 -6 -95 131 -190 173 -88 8 -58 -4 129 -282 148 77 -95 -137 69 12 19 -82 -209 144 84 30 33 71 -162
2704 -162 168 -91 -52 -115 -52 -32 -100 -47 244 193 32 -128 -306 -211 145 205 346 -37 65 97 -28 200 -220
2727 -220 -30 100 208 -320 -48 170 -254 241 99 -123 -50 56 -100 -353 79 -11 224 -69 -57 -8 -213
2748b13K65j99J67l72K02J67j54K61m29L62l16L58j57j10N68n93j4J6M32l9O1
2769B63m02N5or2J72J35k29J27j01O0q0J64k4R5k84L84o4m48K83N5M7j06j28J68
2793D4q6N2P9k50L92m26J67K17k84J1N37j35m84J55O2Q0k04k2j36K45l1O4M12
2816D59l57m74K77Q2j50J40j3J06q0j20J09k56J81L33n43Q6J35k6J28j05p4K58
2838I6k03J08J64j77r2K9K76j34j44J01L4J53l37K13j11j26k58M08p2m1K33mk66
2861a50K43Q7j95k16J84P7j31K74l23L18P4l13J84p5l9J65j3rj75j59Q7r5K89
2884H9k6k00L9J90q9k05J88j40L93j39q0k77J46P4K24j83l3J42j56Q6J84l0j02
2907I5j91L2J14k50l9K06L1r2j13nR2J38L2l23M34k84J99Q4k25L2J76k47K64j97
$$ plain form
2748 -213 52 -147 20 -352 -150 17 -137 124 -305 57 -259 99 -58 -168 400 -193 -207 -191 241 202 263
2769 263 -139 -84 -90 -182 -10 125 -104 23 -78 -18 -98 66 42 137 -147 237 173 -275 8 63 110 4 -124 44
2793 44 -42 10 89 -161 231 -195 -28 189 -95 -84 453 318 -166 -11 51 131 -73 -95 -231 14 -17 47 459
2816 459 102 -372 -95 -13 -163 -23 -36 70 -10 -130 -21 -277 -96 237 -306 -220 -85 -111 17 -88 -162 96
2838 96 -107 1 165 -12 -104 -75 201 67 -77 24 58 211 -126 87 -24 -150 -408 0 -72 -113 120 116 -150
2861 -150 93 180 -15 -231 -47 30 -101 173 -150 168 242 -71 113 38 -1 164 151 142 -33 -192 -105 -200 89
2884 89 63 -137 -98 92 3 -202 -14 -154 239 100 20 -257 -111 -37 187 4 -29 113 -43 43 227 197 95
2907 95 -96 -64 50 -200 -239 -33 -2 -94 -207 -212 -120 18 50 -273 161 -123 76 160 -65 -33 143 -104 160 -37
2931c7mL1M60m50rk00K67M3q4j73K0K90m9j49L81k40j87j20L73J09m04L7N08j23
2955B90j38j04oJ31o20N77k58K1N2R0K06l74K43n3K2j48l7K73k64K44k03m0L47
2978B51l79M63l02l47M42N9N0j47q1j5k52K82o1J04m5j18k8j52K10J00m7j10J22
3001aM7r0l75M16J51q2j1Q5l64J26N97q39M16J8K44k78m93K98j6OP2J7R1J4J70
3026B19k74j91N2J96L44k40l1j68J84j57J36QK19j62k88K62l3M5k80j9J3M2J22
3049ap7oj70J53M11l12m4j45K50j11j1l03K02J04J10J38l33J12J9Oo4Q9j40N6
3073f7J3mj43K02L27k17k14o9O1J97k44M5J95k4j91J54r9J56k18J13j1j79K75
3096E8J2j26o0J3LL40k36l00OJ86Q4q4j10J65Q4K8p9j47M47j67o0Q8j63L32q83
$$ plain form
2931 -37 -41 -10 450 0 -9 -209 58 101 17 -156 -136 154 105 -44 337 97 -90 -210 163 272 -132 -95 413 290
2955 290 152 48 42 173 -447 130 -128 -107 -55 35 241 -133 110 57 79 -69 -106 167 -97 147 -56 -96 251
2978 251 -128 335 33 -314 128 187 237 90 9 -6 -258 24 -37 67 22 -96 -124 -276 -66 34 -13 -123 -1
3001 -1 46 -44 -419 -3 148 66 55 140 -224 -98 499 -340 76 94 338 60 -433 -135 -151 -145 -73 -56 35 49 219
3026 219 -55 -246 -194 2 346 106 75 -93 91 -66 70 78 297 135 -153 109 76 121 -159 -178 -165 -123 -1
3049 -1 -78 -84 -254 -101 310 -2 -46 -191 59 -52 -63 -366 -164 -60 50 188 -145 -33 -14 -8 -72 17 -123 -67
3073 -67 -54 -58 -201 1 328 111 -103 -172 -111 86 -158 -113 82 58 -133 21 -78 78 -140 -27 -38 -217 58
3096 58 70 -56 -116 -103 -100 240 4 -296 -290 -104 -20 -104 -214 -49 35 63 -16 -163 284 117 57 145 -18 314 -569
3121e69P05k99K28j66K12j68J39k51K15K85m96J23J20m4k21R4J53L6j59J68p8
3142B7J06l43Q0q3K09j12J90j94J26j10R4Q1j6k78L85j29q2j03N5J29j28J30P
3165D1j94m04N07l3j6L21m33L23O8j97j5m7J41q2r3k0J95j78J17j31M4O7K19k37
3189c7J0J24J67m57O9J43p9p1P0J18j4k50K86J9j18p6ko4j34N61l89QL0L12k76
3214e0n6J28N7M7k12M10j62l39j41p6J50J34l02L34J8J28o2k98M59K3j18q1j30
3237a39M1K49k20L4k2o3Q5j29J92q5L33j17l8Mk24P8J73l10J03OK59j85j29j16
3261b20K34l0J65l4j65o9P2j8J72r5m62M80J63j49R2k3j98J65o0L3q4K49k15j41
3285a38K74n7J9l9n0j79L00k24Q9J60k25J24O4K48k98K6J36n24J75lk7K08J97
$$ plain form
3121 -569 136 -163 65 -101 111 -57 82 -169 46 331 -165 -42 78 34 -187 -93 60 96 -63 105 27
3142 27 133 -210 -130 -213 -4 -116 74 -120 6 -104 -10 71 55 -223 162 33 -49 -152 -97 32 -96 34 41
3165 41 -153 -557 -50 -83 -99 222 -211 112 180 -17 -32 -79 62 -20 -113 -133 62 -116 1 -130 -86 -19 200 -37
3189 -37 -27 97 264 -193 -124 19 -60 -131 -61 57 43 -207 79 98 -20 -96 -98 -162 -296 265 -124 -116 -86 226 -50
3214 -50 -106 22 79 126 -86 324 162 -177 -318 -394 -244 -110 -412 -78 -60 68 6 -292 167 190 72 -9 -139
3237 -139 -98 151 -69 -35 -57 -120 -35 -164 28 -57 276 159 121 125 -99 -21 152 -158 -55 -49 210 25 -104 -220
3261 -220 14 -16 149 115 -50 -119 -47 -65 107 12 -450 30 193 44 136 113 -85 80 20 53 -31 218 3 -138
3285 -138 136 79 98 59 9 -170 130 -94 -5 155 -70 54 118 366 68 94 230 -294 -119 -122 -149 59 256
3308B56m88N49m80mk4J62k0K17k65M00j15N1n9n4j99n9NK83j13j26N1Q0K28j27
3332A49R7m49J58r4Pm2N75l12jj88K8r3j57L86j34P6K75o7k97j65L43Rk05k6m2
3357a69O27k89Rk24J19l83M16m87K56j9K54J27m65O58n05j85m4M35k40p8O8q2
3379b01K18j25j91M53j80K8P6j51J97q4k89J97K61l98K34j88L51m00M79o24N0
3400b87M25l9j68l4j5K37l26N23l71o8J99o1m4J56n5j86K03m32L67j00q8R0J46
3423G2K21m82J25L19l28J93k66L31j31j05J69k21J33j97K66j94J68K66j66j97
3443b4J48P7j28r9L02k77J26P6j73m38K56N6J16m54L83J35K94n89J25M8K87n3
3465A94P6m53J1J81J98j5k46RJ0j10K3K95j3k7k4j91%P3j2j9J36p0o6M10o40N59
$$ plain form
3308 256 -232 317 -163 -167 -191 -29 -49 168 -97 303 188 239 180 126 -73 -132 -127 156 43 -83 -32 48 276 149
3332 149 246 -203 -45 -139 -132 -174 401 89 88 -100 -72 -165 -322 64 -70 6 281 214 -83 -248 95 104 -101 -127 -169
3357 -169 458 169 178 -46 73 -310 106 -381 -125 -144 110 237 -228 430 -75 -260 -304 131 -109 -187 -119 -201
3379 -201 17 -108 -299 154 -26 2 78 -73 124 40 -249 -52 209 -189 45 -143 208 -192 287 -337 -287
3400 -287 138 99 -69 -103 -118 119 -207 316 -55 -123 76 15 -29 127 72 -114 89 -343 24 -76 -164 -74 72
3423 72 293 -189 -64 255 -73 120 -146 185 54 -51 118 -103 30 -167 99 -95 73 339 173 -24
3443 -24 124 201 73 -26 276 -1 125 201 28 -410 -154 -98 18 -436 -53 82 376 -213 -88 -40 247 194
3465 194 270 -183 -172 9 207 192 -54 -45 -35 -145 -122 173 160 133 109 -82 -82 -9 -21 -40 96 26 -40 370 -270 289
3491B89m62J57M4N7j22j1K85n41L79m4j7m2K8J3k98K36nL1J53l06p8L28k33L51
3515A92k35P5r3J64J49l52M8l7O3P1P0O4lk93K52j09J20K7j48k31J70l3J88q0
3539C9n9K15k76J89j30m7l26N28o5k64M4%L35l35r1P8N18k86L23m38m8R5J18j24
3563gK19k26l96O66k24J51j13O9J27N3j51k85k6Q8K29l60J13Q1L32o60L62n8q2
3586i8K21l20n2K21K57n38L24K72m10J33L48m91Q4K34m70K47Pk0RO7M3j94K39
3609A13j82N8R6p7J32%l36J44m9J01J89O9l04J15p8J5k14K15N0M4j04p3L03Pl49
3634a15J94K99o18J86kQ3l9J73l94K20o7J81j32Q6l07J68m6M54m26P5p4L09l05
3657i7R2Q1l16K65r5J39M9N3k99J92P4l98L57j54k4j86L6K42k38R4n1L0J5j31
$$ plain form
3491 289 -173 -16 28 85 -37 -48 237 -304 75 31 14 -28 0 13 -285 -49 -54 -23 130 -176 -254 74 -159 192
3515 192 -43 32 -61 103 252 -100 -52 -89 -26 45 115 179 176 -117 135 26 146 173 25 -206 -36 -69 119 39
3539 39 -20 195 -81 108 -22 -69 -395 133 68 -196 -152 -152 183 -152 -243 -165 353 67 390 -48 -96 -1 117 -7
3563 -7 212 -14 -410 256 32 183 70 139 266 319 168 -117 -143 -55 174 -186 -73 8 340 -320 42 -16 -98
3586 -98 123 -197 -249 -28 229 -309 15 287 -123 10 358 -133 -49 185 -285 -38 -31 -51 -42 25 68 -126 113
3609 113 -69 -11 85 8 140 140 -196 -52 -101 0 189 258 -46 69 -9 6 -208 7 57 101 -3 -76 227 234 -115
3634 -115 79 378 -240 -54 -56 27 -12 161 -233 -13 -80 101 -31 55 -252 -84 -130 324 -102 -27 -101 208 -97
3657 -97 -5 76 -240 25 -70 69 118 171 -128 64 138 -260 97 -57 -81 -267 -231 11 -227 -133 -184 -154 -139 -270
3681b70J55j3J39k36L12K86m83oQ3J75q2Q8q4N8K65k34pj82k57J68rL24J58n84
3705b36J14J30r9O0L0j25J12n8j20L90p8j12l51N68k56p6N54n41N6M4jK18j87
3728C6j54m1R3l5L2K3J87k70R6k33J22k44N01L0mJ5Q8k69r2P2K27j49k00J94K75
3753C00j75m23L30J89k28J01l9n5J81k16K60j97l16J91P4K12m31K87J4j19j4R7
3775B3R0k30K1k56M36o2J39k43j37K93o5m3K26o6l20L73j26j27qL3j02j03L80
3798A26j62o9L97j87l02N23l18j41r8K75K09j95k31M13p2j17J32j6j45K3j6j95
3820a66K89p7J5k26M12l94L61j77J25j1k88L54l55L14o33N41j68j04J57ML40n80
3842b67J46J14o0Q5J13j18P2k9L7j16j07L8k90K80K5k10M07nl33K12m1J42j83
$$ plain form
3681 -270 -115 -128 11 -225 87 373 -110 -116 -33 142 60 148 64 122 387 153 146 -36 -293 -125 -134 190 348 -236
3705 -236 -122 8 -91 -31 -1 -126 -14 -72 -192 198 120 8 -343 225 -31 -107 447 -94 -38 6 5 223 36
3728 36 -118 -159 -66 -101 -69 -46 141 -129 -33 -266 -144 -388 113 143 139 154 242 -27 -119 -47 180 31 -169 25 300
3753 300 125 -298 32 221 -7 94 55 0 181 -35 225 28 -288 -97 -23 189 -242 45 59 -60 -74 23
3775 23 113 -117 -96 -352 84 22 161 -82 -219 74 9 -34 192 126 -194 179 53 -74 -82 -49 -151 -254 126
3798 126 -36 -105 292 105 -197 326 8 -133 -231 44 253 58 -173 240 168 51 183 167 22 45 29 -166
3820 -166 123 46 61 -165 247 -147 214 37 162 151 -137 217 -138 176 -457 84 -84 -188 -31 -27 313 -267
3842 -267 -121 -7 -67 18 131 13 85 56 93 -23 -130 -92 -382 -102 -77 -287 120 115 -218 -6 -47 95 -88
3865h8m1j30l6M56j83j65l1K54k09J25L5lJ16p4j69J52o2j10L15j28k9K47k12
3888C0l28Q2M3J53M5j93K96k36l0J30l06M97j62k69K21o6K56k50PJ70K33l72j03
3911a52J49l8L14m66J24J13J6j12J24k97M89j12p8j83K7J7J12j49J93K1M2k96
3933a42L95k36K20j36k91K12j0l7j31K34j58j7O9Q9j88n9m8N77l21JK00k04j39
3956a20j2L2j45K15Q9j53j54J65K64k19M8N0R9j73P7k35J41P4J63L2r2K4k23l02
3980c55K13n2J52n5J67R1J61q2k42K84j10k3k61J23Nk2J14j68k06J81R3k4M9k52
4004b19M03j9J49k07j79J32j12N4P4j97J49l4j39P7J30j49k9N7p4L12j03j04M0
4027A2O8j12L1l18M68k71J59j37J08k21L36k36J36K84o44J65L6J23N9q4M7o4n33
$$ plain form
3865 -88 -129 -259 -295 161 -22 -187 -218 36 -173 -48 -13 -16 100 26 -143 9 -53 -163 152 24 -5 242 30
3888 30 -298 -216 -173 -20 25 -168 128 -108 -138 -8 -314 183 21 -248 -27 -93 163 -87 -80 90 323 -49 -152
3911 -152 -3 -41 273 -193 -69 44 60 -52 72 -225 264 152 74 -109 -82 -65 47 -102 91 112 154 -142
3933 -142 253 17 237 101 -190 22 12 -25 -156 78 -80 -97 -28 61 -127 -186 -234 343 22 23 223 19 -120
3956 -120 -132 -100 -245 -30 59 -94 -248 -83 181 -38 10 60 159 -14 63 -172 -31 43 206 238 146 170 -53 -355
3980 -355 -142 -194 -42 -97 70 161 322 240 -2 282 172 149 -112 11 16 -6 108 -60 -266 -85 8 -16 33 -219
4004 -219 184 165 314 107 -72 60 -52 2 76 -121 28 -6 -145 -68 62 -87 -116 -59 -133 179 76 -28 12
4027 12 80 -32 -1 -319 149 -122 37 -100 8 -213 123 -113 23 307 -337 -172 -136 -13 46 -38 9 -55 -588
4050e88Q09m07J92l0K24k73J59l28L81k41K2L59k78r2J64j17Q8q4l6j70K20j41
4072a67P8o6K78l25j17K57k7%K33j05K07m50K03j31L36J30j33q9m8o7rp3K12K55
4096C82n10Qj95K0K57q3K2Q0J5J36k94JK80J35l35J75j2m5k09L61j14Ko8kM33
4121D40l29k21J08R3j04j00j22J95P9J98k96J91j29k25j56K10J03J16j20KL58
4142B91m71K56k00q8J85p9j08L55j33J64k07j1R2O0p1J26n53N35k83J69j8N0N1
4165A12j9j16j5O9L36n02J30Q9j13J85j64j1K9l3j14K80k04M46n19K04j93J40
4187A7m9k29P5J19nQ4jj33J52Q7j89J5j37J64p3K03l9l15J06K93j21J89j52j86
4211a25J64J17l20M9J68K27k80k9k0J91l6l98L22J5k20K35O3j17O2J15m0k67K4
$$ plain form
4050 -588 221 -186 6 -24 200 -73 86 -242 139 -102 -80 279 1 -91 73 -44 44 -40 -76 -246 -26 -167
4072 -167 -89 -155 123 -202 -319 -62 -89 -89 144 39 246 -204 -1 -132 204 334 201 112 64 -3 -12 -85 127 382
4096 382 -128 -120 -315 -295 -38 -121 -99 -19 -4 132 -162 -161 119 254 -81 94 82 37 -172 189 75 77 9 7 440
4121 440 111 -110 -2 91 -13 -113 -235 -40 39 237 -59 132 3 -222 -378 -168 -65 51 -69 -67 291
4142 291 -180 76 -124 -212 -27 -106 -214 141 8 172 -35 -46 46 106 35 161 -392 143 -140 29 11 61 112
4165 112 93 -23 -38 31 367 -135 -5 84 -29 156 -8 -19 10 -23 -137 143 -61 385 -134 70 -123 17
4187 17 -32 -261 -186 -67 -72 12 11 -122 30 117 -72 -57 -194 -30 -103 100 61 -254 -148 145 24 213 61 -125
4211 -125 39 156 -164 -115 53 280 0 -29 -49 142 106 -292 30 45 -175 60 123 6 68 183 143 -124 -100
4234a00K1j01P1K17l75K49j39l35M44L33j77k50l2J25q3K13j26j21jn9K32k58
4256b52K03J38l8k63K11R7m3j53K33m35L91P6j16K72m91J38Q2o4l55R7L58k68
4278a82K10J81q0m33L48j89N45m84K02m42Q0J82K57j38j29J18k60M05o0n5O0j84
4300d8L4Q4j58J09J76p9l83M68k2j96J03m5k30J46O1Q0J57j84l26K71J8j50j60
4323b74K27K25j29J43L8j79l2K24j59p4P0k44m3K98j52Q9j11P2M2k6p7K24J15
4346B67o14L88j11M52m39l0q1J86j67J19K54Lm35N63l5l31J35j71K21r9j08j23
4368a56J92m6mJ75l31K03J02o5J47j60k1k25K78l55M77j36J41k02R3j33m8L57
4390B83l73P1Pk75L49J11m30K62j3N0M6j54k60O41j99p7k02o7L56M1j20j40J38
$$ plain form
4234 -100 -79 -180 -109 108 -267 -18 -157 -492 -48 285 108 -142 -174 -49 -132 81 -45 -166 -167 -226 6 -252
4256 -252 -49 89 51 -212 -1 96 53 -100 133 -302 89 165 49 321 -170 -32 50 -14 -369 -272 86 -182
4278 -182 28 209 129 -304 44 -145 400 -84 118 -324 -244 -62 195 57 -72 46 -214 191 131 76 136 -48
4300 -48 -14 70 -88 21 197 118 -265 203 181 -15 88 43 -187 -41 20 100 257 73 -253 18 36 -114 -274
4323 -274 -47 178 49 192 230 51 19 243 84 10 80 -164 -207 91 -61 28 -83 -11 31 5 -72 152 267
4346 267 -347 41 -70 382 -57 -87 -168 18 -149 -30 224 227 -208 355 320 -11 124 -47 174 75 -33 -156
4368 -156 36 -10 -14 161 -170 33 135 70 217 57 36 -189 89 -266 211 75 216 14 107 -26 -74 283
4390 283 -90 -19 -12 -287 62 173 -257 5 -8 42 88 -66 -326 315 116 39 -163 -230 126 167 47 -93 45
4413D5j35J39o3j8J47J87o45M01k35j81R5J02R0N3L31l88L52k4j77j05K08j65
4435A4l00M46j80l04M64j38J9l31M52P3rm0l92P4M61l40L1N4k92K49K70j46l83
4458b48K31J28L3p0p7O4J70j58m55L33k15j5M67k47j17L16k9q0j01J6L1j78K44
4481D3p3L41k33j74k1K15j24J61l64R4M44l43K60l08J55J09n01M29Ro2O2m34L33
4504A8P1J53r9j28j42M6J12O3j68N14l48J25N1m45J48Q2O9o5M4j17K74j12l4j65
4528e3Q5j90J52j86o1M26m02K89j43L01k20l55O28j81j52K08j85K19o8q6j04m6
4550a24K70j34q5n7K04j16N5k33J78K36N8m65J73N4jp1J42j34Q3Q3l19J19K10
4573A26O4m44N17n4j18m70M97On5j42J63k1j66J24r1k27L71P7l93M4J53J37k54
$$ plain form
4413 45 -90 49 -14 -32 115 302 -343 58 -177 -358 -263 -161 -71 -18 313 -75 277 253 76 -29 179 14
4435 14 -286 160 -20 -324 140 2 21 -310 142 215 206 166 -226 -152 309 -31 0 54 -238 11 281 135 -248
4458 -248 -17 111 144 74 -3 61 231 73 -382 -49 -264 -279 188 -59 -176 140 111 31 -70 -54 -23 -201 43
4481 43 -30 311 78 -96 -117 98 -26 135 -229 -135 309 -34 226 -82 73 182 -319 110 119 57 119 -315 18
4504 18 89 242 143 15 -127 -81 31 94 -74 440 92 217 268 -177 -29 53 122 57 101 -16 258 146 112 -53
4528 -53 32 -158 -6 -192 -253 173 -229 60 -83 218 -2 -357 271 90 -62 146 -39 180 112 26 -78 -124
4550 -124 146 12 -73 -130 74 -42 13 -220 -42 194 252 -213 -40 14 13 -58 84 -50 33 116 -203 -84 126
4573 126 190 -254 263 209 91 -379 118 124 69 -73 90 69 -97 27 -64 -291 80 157 -236 -192 -39 98 -156
4596a56j48M33j18j97K05J2J2qm38L01O1j3o4K8J27J76j89j70L89k65N2o8N6j52
4620a34o4k6J99k5l8K32n1M8k04j9p5O7L10k25J07l45M45jj90J19n6j43j0L99
4644C20l36k41L50J69j70l06R9K07k14K82N9j66P0o7M2N8k54K11j65K85j90O9
4666A12p0j87K50l22M30k21K49j89J02j9k20L09m14L66k14k9N1N1j11l1K02j25
4688c0k6q8L49j32j8J23j3l65O2J34j71J89O9k27K82k05L05Lj12k47nJ30j54N0
4712i7q9K94k59J55R1j20J80l90L43R9j83k11L45j04n40L43L51k04o2p9K98k37
4734g6J32N7R4o08K53K11K23m13J28K3M36m64j77K3k35N40k41j07L67j86k59K75
4756dr7k00L04K1J55o2m81L59P4L6j75O7P6k23l7L81l70K81l73L59j55j95N71
$$ plain form
4596 -156 -304 129 11 -186 19 31 43 35 -403 -102 -41 -54 -118 -90 37 213 24 -146 243 -22 30 -38 18 -134
4620 -134 -198 -224 -25 -50 -88 144 93 141 -63 -82 -157 -90 220 -5 102 -243 202 201 11 130 74 -69 -79 320
4644 320 -16 -257 93 262 92 -214 -115 92 -122 160 219 53 123 56 98 156 -98 113 -52 233 43 112
4666 112 42 -145 105 -217 213 -8 241 52 154 135 -85 224 -190 176 -38 -67 -16 35 -76 -107 95 -30
4688 -30 -56 -144 205 73 55 178 165 -200 -138 -4 -175 14 83 -144 138 -67 238 241 129 -118 -123 7 -147 -97
4712 -97 -186 108 -151 4 95 -25 155 -235 108 207 24 -187 158 54 -486 -143 208 4 -58 -137 161 -76
4734 -76 56 113 207 -401 -148 63 286 -127 1 24 460 -4 -181 -158 -393 147 -94 -201 166 -20 -279 -4
4756 -4 -101 -301 3 24 179 117 -364 -5 69 105 -70 -3 73 -150 -187 194 -176 105 -268 91 -64 -259 312
4779C12k86K53J3l76J19R8r3l67K65M5O2K6j31j8j13L56o0j37R2kr1M1j96J29
4803e9J3j77L02P1K08m03K59n68J52K03J8j31J86l1j18j77K57N7j08P3m8k71l4
4826c26K31k16M79j84j88K14n9K1l4k11k1R8m3K44n0oj47R6J7j73Q3L44k49K0
4850f0L8r1N79n42k3M01o6k21J95k16O2K42n95M34jj58R3l14L75j36j30K36k74
4873a72n8nL58j33P5P1O6j31l01L04J50j0n1k61K65j54M1J60j04j56m5p3L5r7
4897b26N33K4k08l28j4L25p4k94K84j28m9M98k27k34k4RK05j00L94j94j71N6k17
4920a60M40l76N8r8J66k51n6o1L44K17P2k11l25J40L7N8k0J46J32m9j81P0l18
4943b26J12K22N2m52l5J22J41j09P3J03J67l56p9M92m91M29k18j54K16J19k8o0
$$ plain form
4779 312 26 279 292 -84 35 133 40 -327 -62 -17 45 71 -60 -78 -191 165 105 -32 60 58 -33 8 -188 -59
4803 -59 -46 -223 79 150 358 -45 214 -354 -202 1 19 -112 74 43 -75 -252 5 62 -46 27 -21 -292 -326
4826 -326 -95 -311 168 -16 -204 10 -49 -28 -62 -273 -294 -196 -239 5 -45 -51 -198 -102 -85 -258 -175 169 -80 -60
4850 -60 -22 -113 466 -76 -99 302 236 15 210 -6 56 298 -297 137 136 -22 71 -243 132 -4 -134 102 -172
4873 -172 -230 -235 123 -10 65 136 202 71 -230 74 224 214 163 -98 167 13 54 214 110 -46 -91 -164 -129 -226
4897 -226 307 331 123 -205 -219 106 32 -262 22 -106 -155 343 116 -118 -142 -133 72 -28 366 172 1 57 -160
4920 -160 280 -96 -38 -136 30 -221 -277 -338 6 223 295 84 -241 -101 -64 -6 -26 120 252 203 22 92 -226
4943 -226 -114 108 160 -292 -327 -205 -64 -173 -100 3 170 -186 -265 227 -264 165 -53 -207 9 128 100 40
4965D0o4J55R5l98K62k28J59O3k27K50q9K65j87l66K80k3l04K59K79j69j31M06
4987C27j19k83m2K24p4m1k94K92N8Qq9J08k14j31J08K64k49OJ90k30Q4J96J40
5010B39l31J40J70k87L4N3J42k89L25o1m13R1K15N2j65Q7Jk4j92P2N56n51J91
5033E5j12l7K64k84n1J54N5oj24R2N4r1m9J95J43l02L29l91lJ00J6j41M00m36
5057a70J37J52l01J73j70J97R4O1l94L38j28J24m25J66R9R3p7J63o1K8kJ99k88
5080Hp7q9j59J00L00J8J28p4j25j54K92O5m32K79m15M00om4L78m13q5q9M4r8J58
5105i0J82j68q4J06O5r6L46n16J51P4L47l34k24L44k91K49l32J62P6J76k89J96
5127E0k16J96R5l84K52J41m4l97L71k47L43j34j79o1N75l64m0n9k31L74j25R6
$$ plain form
4965 40 -24 131 226 -172 90 -138 21 84 -143 107 18 283 96 -270 10 -13 -317 -58 221 52 -79 327
4987 327 208 -75 -117 107 33 -8 -302 -10 48 56 -33 75 -139 -270 -162 102 -147 -141 49 -181 -97 99 239
5010 239 -92 48 218 -69 -35 18 160 -129 196 135 -278 -187 28 80 -85 2 3 -21 -213 -141 415 -136 55
5033 55 -57 -94 170 -114 -165 -11 44 38 -86 6 60 -31 -80 115 258 -44 285 -106 -109 -9 7 -134 266 -170
5057 -170 -33 119 -182 -9 -179 18 112 173 -221 117 -11 113 -312 -146 -47 46 -31 132 71 99 97 296 8
5080 8 -69 -158 -317 -217 83 101 229 155 30 -124 168 233 -199 80 -335 65 59 15 393 -20 -105 -194 -150 -248 -90
5105 -90 92 -76 -160 -54 11 -85 261 -255 -104 -30 317 -17 -241 103 -188 61 -271 -109 -33 143 -146 50
5127 50 -166 30 125 -259 -7 134 90 -307 64 -183 160 26 -153 -214 361 -3 -43 -102 -333 41 -84 12
5149A2J28m5P8o5k26m4O1o4J9K40k00K3j3J27j49L92j42j84m4P6r4J07M91n31
5173d7K54j24j18j84O2Q5J54j52K93j94k1Q8l1l04j42L36k09J00K42k01J24l9
5195b8o0J9J23q6q6J06K14j59n8K02P3m88J90N6J14l17L98J75o1j67m00L40j87
5218h7M29j67p2k05M21l01J99l64L74j22j72J74J96j36j87J20m6k4K7N6l50J43
5240i4J33k16M15P1n11J64m4l62O60j46R8n34L71j01K77J03k86o9k4K81j09j48
5262g1n7L98m38J47J88m46J01L94m23OL27J26m66l2L31k12O4L89j09k16j63j41
5284c03J91L06q2o0K1J39k56J44r7k99K24J01j24O7M13m12j84n1J42J95p5j48
5306a48J80k93J96O0K28l03J67q5N7j35J06N7k79O59o66J08M27k91J61P3k51j06
$$ plain form
5149 12 140 95 173 108 -118 -162 -101 -165 -146 94 -106 -83 -96 31 -118 274 132 -52 -96 -20 -114 -7 484 -47
5173 -47 207 83 -35 -219 -157 -72 82 -70 223 29 8 96 65 -239 -381 -45 -254 -154 88 -113 11 -28
5195 -28 -88 -69 54 -32 -118 -12 202 43 -15 187 260 -228 -38 18 132 -185 213 388 327 160 -240 100 -87
5218 -87 342 175 103 -102 319 18 217 -147 227 105 -67 107 303 167 -20 100 54 30 57 113 -237 -94
5240 -94 39 -177 238 309 -202 -38 -82 -444 216 70 168 -366 5 -96 181 284 -2 -71 -95 186 77 -71
5262 -71 -128 270 -168 -21 167 -279 -178 216 -207 -201 126 252 -214 -246 85 -127 -63 326 217 1 -162 -303
5284 -303 -112 194 112 52 73 212 -44 100 3 -296 -72 29 -95 -28 385 -27 -211 -262 -120 75 0 -148
5306 -148 32 -261 -65 -5 223 -80 87 2 59 -76 30 87 -192 467 -199 -91 336 45 206 279 28 -78
5328g8R1K38l65J97P7j51K56l09pJ41j16O8l0K91m69r4L96J70nm91K74j45j91
5351b52K43J0k01P4K59l03K25Mj29M1L21l07p4M9k4K12k45J11L21m73N8L09r1
5374A38p5M3K1m3k2P6J4j46m13L44o3J42j40j7L24J2N4k59k49N41l32K5J52k0
5398A07p7j18R3J42N4o7m05J0K10j46J54K4P2K9r3k8l2j3m1J89j34L12j67k66
5422a91L71j32j96K70k43j65K89K43l52l5M9J63P5J13j90k58N15j69j76k3J6Q7
5444F1k06J02L6q5j41J81j82K2M75k20j29L9K15p6l39J78J02k29L2j09K90P5j43
5467e1RJ44l9p7k6j65N03j51k03N4j03N6R9J51l45n2J31O8m9J48k02J57K45m35
5491a33J08k09J21K09O7j91J76Mk70J44L85l80k65N7r3J03L57k92J90j34O6L3
$$ plain form
5328 -78 13 251 -114 83 160 9 265 -44 -51 90 -26 42 12 303 -166 -260 136 306 301 -190 84 -61 -252
5351 -252 -9 1 -200 -126 133 -170 55 59 -70 -29 292 -15 -89 -40 -64 148 -97 14 335 -138 -80 229 138
5374 138 63 106 127 84 62 138 152 6 -407 -63 -126 16 -124 -141 183 195 249 -10 -259 282 -50 -25 127 107
5398 107 30 -88 5 147 201 134 -271 -261 -51 -197 -43 -19 53 82 -11 -39 -71 -84 -125 64 -70 242 75 -191
5422 -191 180 48 -148 122 -121 -286 3 246 -106 -141 -92 71 146 259 69 -189 326 157 -19 -42 -26 61
5444 61 -145 -43 -7 -92 -233 -52 -234 -212 263 43 -86 -47 168 92 -247 -69 33 -196 -164 -273 17 92 -51
5467 -51 -42 102 63 -14 -40 -205 298 147 -56 -2 -105 -49 50 201 -144 -196 -65 3 -46 102 -100 57 302 -133
5491 -133 -25 -234 -113 96 163 -28 148 152 -118 26 411 31 -234 -177 -270 -167 190 -102 88 -46 20 53
5513E3K10n4o04L17l0K91J01J02j05l70j15J09J57n2K49l59M39k89j52J6J96R4
5535B04k36L25o69M45Q0k23K17K6k68J78k23q8k16K10K64J5LJ05k55qK71k75Q6
5558c2K63l49J08k94L62k44K68J33k7l18jL14k56o0L03r5k69J66j39J91j63jm3
5581a83L53l63J03J60J16k4K04l94M60n18K72J15l74K11j1l98K99R3k99Q1K27
5602A30l53PM35k21j55K22J31r3l1m4L67n85K54l70K70k06J66J53r1o3P1k63N21
5625B52m09J09K78l85M15K3l52L8N3J73l17m9J18O2m7kR5N5j9j59k21K97KQ4j56
5650f2J06k58K93P4j5j00j2j33K85k01L18n35P7K93k92M01j72l37Q6L25jj68L2
5673DK8j24J69m5J54m41j94K08J80J22J16l13K76l91M49k76K2K57l06K54j95j08
$$ plain form
5513 53 263 209 -395 -78 -108 183 284 386 281 -89 -204 -95 62 10 259 -100 339 50 -102 -86 110 204
5535 204 -32 293 -376 69 149 -74 143 169 -99 79 -144 -232 -448 -238 26 41 44 149 -106 -114 157 -118 -32
5558 -32 231 -118 -10 -304 58 -186 82 215 188 -130 -131 183 -73 -133 170 75 -194 -28 -167 24 -139 -140 -183
5581 -183 170 -193 -90 70 186 162 366 -28 432 -86 186 301 -73 138 127 -271 28 121 -178 -97 130
5602 130 -223 -216 219 -2 -157 65 196 103 72 28 395 -190 64 -306 -36 -242 -76 77 -14 -77 -6 -269 252
5625 252 -157 -48 230 -155 260 283 -69 -31 22 195 -122 -171 -53 9 -38 -40 55 110 91 -68 -289 8 10 94 -62
5650 -62 44 -214 79 153 138 38 26 -107 178 -23 295 -240 -163 130 -162 239 67 -270 -184 141 140 -28 4
5673 4 32 -92 77 32 186 -255 -449 -241 -61 61 177 -136 140 -251 198 -78 -56 201 -105 149 -46 -154
5695a54J64J73j31j28m17P95l8k87P7P3Lk50N1R8O4j43K07j78k3Q3p4K08m21N30
5719B82k42O7k1p6jm27M52k17L40j55j0R5L14l93R4j21J00k77j20K30Nk8L25j69
5743D7j70J23p6O3j33J20N0j18k2J3P9J47n8j32j80L12K0j52R1j09r4J9n7k4K85
5768D4j8q6J98k32K05j13K16k38J1K75m65k24P31j69l05L36m32M89j13k73O4j85
5790b84M83n09M47j64O2K06n69M82N2m46L32K10k86R7j99p9J60J30o9r7m2L8j22
5813a67K25j7j27Q5jn5L2J66r0oj29r4P4K49n3k60K2K67j53o9L12J83n87q6L94
5838A15J05j34J54j23m0m06L10L95l22L2J80l79j29L68m0J62k01qj8J84LJ2l23
5861a03J26J61k78K47j92K03J85k25o5j8Q3j95k5K48j26M2k53K96N3q7k84L0P0
$$ plain form
5695 -154 10 183 52 -76 -493 302 264 -23 54 127 130 -120 -69 29 93 -50 157 -21 -44 39 -35 173 -248 282
5719 282 40 107 86 10 9 -418 34 -183 157 2 -8 87 401 8 102 -19 81 -196 -316 -86 -81 -109 216 47
5743 47 -123 0 -76 -13 -146 -26 24 -94 -116 -103 -24 123 65 -67 -247 65 85 -67 24 -85 -179 -160 -217 -241 44
5768 44 26 -60 138 -94 111 -2 214 -24 -13 262 -203 -427 304 135 -170 166 -266 223 110 -163 -99 -284
5790 -284 199 -310 137 -27 35 241 -328 154 206 -240 92 302 16 113 -86 -165 -5 125 56 -41 -83 -45 -167
5813 -167 58 41 -86 -1 -2 -57 -25 141 51 45 -84 -178 -104 145 92 -168 -146 121 -32 -101 211 394 -193 -279 115
5838 115 220 86 240 117 77 -329 -19 376 54 86 266 -113 -242 126 86 248 47 39 21 205 208 220 -103
5861 -103 23 184 -94 153 -39 164 349 124 59 41 124 -71 -96 152 26 68 -185 111 164 77 -207 -177 -107
5884a07r1K73j49j86M38m31N99m33Q4L85m16j33J65k0J15k3l34o6L27k64J06n0
5906b11K30J99l84K41m9Q9k20k5P7J36R5j34k30O7K90l49k32K12J22p5K10K65
5928C24k80j14p3J45Kr4j56L38R2K9k8k59J32k01j86M34j97k16J86L43j15k14
5950a08J78q5k02K83l07J77M14l6l51k8K23rl30M30k93P3o2Q3K1l7N9L49n81j17
5974b56N2J93n2L99n85K88K69j72K38k33jk10P3j5LJ47j9j83n7M64j67j58j7k1
5998b0R9j59k0k01K68n4N8L86l87K46j53J66k31J72k31L14j71j93k8M7q5J59j12
6021a30k83L24l6k4N4j1K17j1M9j10k53K44K01p4q9J74l38o8J50J86m45K06K3
6044d4K3J77j93J9J65r7n4Q9k92L38k16J23J14l04L52Lj84K27j32q6J5j2j98K75
$$ plain form
5884 -107 -198 75 -74 -260 178 -253 346 -87 -3 382 -34 -167 -2 -22 93 70 -264 -330 -3 -267 -161 -211
5906 -211 19 218 -166 75 26 115 -105 -130 -53 83 178 44 -186 -119 171 -178 -410 -198 -76 -151 59 324
5928 324 44 -70 -143 2 4 -90 -246 92 184 213 185 -74 58 -143 -329 105 -92 -308 -122 221 106 -108
5950 -108 70 -15 -217 66 -241 -64 350 314 -37 -65 158 149 -181 249 -44 29 -33 50 71 34 93 442 -139 -256
5974 -256 -204 -11 -63 336 -249 39 308 136 374 141 140 -70 3 -12 -9 138 119 -64 -121 343 176 18 1 -20
5998 -20 79 -80 -100 -301 -33 -87 -29 357 -30 216 63 229 -2 170 -61 253 82 -111 -139 -92 -177 -18 -130
6021 -130 -413 -89 -125 -149 -95 -106 111 100 149 39 -214 30 231 157 68 242 -96 -164 -14 172 -273 -67 -44
6044 -44 -21 156 -37 -18 147 50 -4 85 -207 131 -85 38 152 -152 200 203 19 246 114 28 43 31 -167 108
6068A08k50K31j58J46j17j07r5J18J44j10K20j42J08l79K18MJ28j26j74K55l10
6089b88LL82q5p6K31k50j06M01l74K45j04OK05m5k78K56n4k26L48k14KoK5j34
6113a36L33j03k19pK16J68j6k41J75k38j7K41L8l60j41J57N6K52j11q0j72K99
6135I4k15K43m1o9l51M14j38P7k26k42M09K3j14N3j25K82L66p38L57q8mK12k32
6158e3Q0k76L62q2j03k2j70J76Q3N8j35k54K24NR6j28Q1%l9J33k64N37k47l8J09
6183A33k94N9J35k39J28j81K30j31J41J70l77K09k2M34m99k56L23R3k6j77J18
6204b9k5L38O7p70L22K41k61j35L34j11j34M02j79l4j4J4j78L6LN17l6m79L74
6227B63k56J9j55K36l36l7K66q2K02k10L50l12m6M6K91j49k9k0J95k26k6J7k67
$$ plain form
6068 108 -142 89 -69 77 -40 -147 -242 -124 20 -90 130 -12 96 -283 -65 -61 67 -59 -233 22 -288
6089 -288 -285 97 12 -64 167 -83 -189 212 -162 83 -21 -15 190 145 -133 123 69 -157 191 -23 -21 -27 -2 -136
6113 -136 197 94 -125 -132 84 252 236 -5 170 -68 -85 156 194 -166 -307 -150 -94 158 47 -33 -205 94
6135 94 -121 122 81 12 -339 75 -63 14 -212 -454 -45 -22 -136 -83 -208 74 440 -298 59 -29 -33 179 -53
6158 -53 27 -249 113 31 -72 -94 -264 -88 -5 53 -82 -336 -112 -107 -11 -139 -58 -58 -97 36 -228 309 62 24 133
6183 133 -161 -102 33 -206 -78 -259 -29 -160 -19 151 -226 -17 -39 395 -104 -360 -37 56 30 -147 -29
6204 -29 -54 284 351 -419 -97 144 -117 -252 82 -29 -163 239 60 26 12 26 -152 -116 -113 404 368 -111 263
6227 263 7 26 -129 107 -229 -266 0 -82 120 -90 260 -52 -98 -52 239 90 61 41 236 10 -16 1 -266
6250b66K55r8Q1K45J48k24j93L9k73L79J6r6j11j38M24Km4k04J31j56M62m24n8
6273a03L06l40K60j39K04r9n05J15j4M01q4O3k3l05M59k14M7J56j11l70N27m98
6295b67J58Jp8K64m7L62l59n0J78j97Q2J53q3j30M2j19m1J91o2J1J67k38j84N42
6319B96m19O9K23m1j4r7L01l65j65K71L8J56k20j67j01M32lr9l06J78K58k28J4
6342A1m6o2r3q6J94J97k53K17k13J39n7K80m6Q0k50j27L7j63M0K71l96L25J70
6365A69Pj25q3K60m50M92k75J01l10M69Q5j03l32n9L8M33l54R2k78M17r9Q0m9
6388A26j80J39k06J78K5m60L95O7m9j42Q8R7n8K48p04N57k45K01l44L27m01N22
6410A81lk15l1J50J3K44j88n18K18K01J69l00J10q8L77l12J65m28M08J54l18k64
$$ plain form
6250 -266 -11 -109 -28 217 365 141 -52 -13 -286 93 109 13 -98 -236 188 190 146 -58 73 -83 379 -45 -103
6273 -103 203 -137 123 -16 188 89 -416 -301 -315 86 2 65 42 -263 196 -18 29 185 74 -296 231 -267
6295 -267 -109 -108 -186 78 31 393 34 -16 162 -35 47 200 117 -13 29 -90 -131 60 -2 9 176 -62 -246 296
6319 296 -123 -54 169 128 114 17 318 -47 -212 59 97 253 33 -134 -235 197 194 95 -211 -33 225 -3 11
6342 11 -35 -97 -190 -276 -82 115 -138 79 -134 5 -52 228 182 262 12 -115 -78 -241 -201 70 -326 -1 169
6365 169 176 51 -32 228 -222 270 -5 96 -214 255 340 237 -95 -154 -116 317 -37 55 -223 194 95 175 126
6388 126 -54 85 -121 57 82 -378 17 84 35 -107 -19 78 20 268 -436 121 -124 77 -267 60 -341 181
6410 181 178 -37 -68 82 95 339 151 -367 -149 52 221 -79 31 -57 320 8 173 -255 153 307 -11 -275
6432b75M93k72P5k0J06r7M8j61k69N72j46m5J9L15l35j36j46M05j80K20P4j39
6454A06j49j33K58K2m17J87K91l48M12l40J22M0R2J14J2m75K61K7m5J28q2j52
6476f9J55o9r3J06R8R2j35k01L97k26j54J45P2k17J06j03L6p6J6K94l74J41p1
6499a30j87M46pP2k73K81k82M0j14J60j2r7K53l49J01l1P8K84m80l1N20l91J23
$$ plain form
6432 -275 218 -54 21 1 107 10 58 -103 -372 200 54 9 28 343 8 -128 -274 131 -49 171 245 106
6454 106 -43 -176 82 104 -313 -126 165 -183 229 -111 11 51 143 257 269 -206 55 82 37 165 83 -69
6476 -69 86 17 -76 30 128 220 85 -116 281 55 -99 46 118 -99 7 -96 -60 -136 -120 174 -200 -59 -130
6499 -130 -317 129 122 194 -79 202 -80 -40 -154 6 -6 -103 150 -199 -98 -129 -51 233 -247 -278 242 -149 -26
$$ [...]
8191A5
##END NTUPLES=NMR FID
##END=
