##TITLE=1H_DE-67_rmoil3
 CDCl3
 8 sc, 
 4.10.2024
##JCAMPDX= 6.0         $$ Bruker NMR JCAMP-DX V2.0
##DATA TYPE= NMR FID
##DATA CLASS= NTUPLES
##ORIGIN= UXNMR, Bruker Analytische Messtechnik GmbH
##OWNER= root
$$ XWIN-NMR		Version 3.5
$$ Fri Oct  4 16:26:43 2024 Russian Standard Time (UT+4h)  she@DPX200
##.OBSERVE FREQUENCY= 200.1318
##.OBSERVE NUCLEUS= ^1H
##.DELAY= (6, 6)
##.ACQUISITION MODE= SIMULTANEOUS
##.ACQUISITION SCHEME= undefined
##.AVERAGES= 8
##.DIGITISER RES= 18
##SPECTROMETER/DATA SYSTEM= spect
##.PULSE SEQUENCE= zg30
##.SOLVENT NAME= CDCl3
##.SHIFT REFERENCE= (INTERNAL, CDCl3, 0, 15.7039)
##AUDIT TRAIL= $$ (NUMBER, WHEN, WHO, WHERE, WHAT)
$$ ##TITLE= Audit trail, XWIN-NMR		Version 3.5
$$ ##JCAMPDX= 5.01
$$ ##ORIGIN= Bruker BioSpin GmbH
$$ ##OWNER= she
$$ F:/spectra/data/she/nmr/H-F/1/audita.txt
$$ ##AUDIT TRAIL=  $$ (NUMBER, WHEN, WHO, WHERE, WHAT)
(   1,<2024-10-04 16:25:38.98 +0400>,<she>,<DPX200>,
      <created by zg, POWCHK disabled, PULCHK disabled
       configuration hash MD5:
       00 E9 B6 7A A2 85 ED C7 34 08 36 98 17 FE 4E 26
       data hash MD5: 16K
       21 8B E6 F1 88 7C 73 B5 D4 8E 6A 7E 80 18 B3 77>)
$$ ##END=
$$ 
$$ hash MD5
$$ 42 72 F0 18 A5 EB DE C7 AB 23 3B AE 86 AD E3 C5
##$RELAX= 
##$RELAX= 
##$RELAX= 
##$RELAX= 
##$RELAX= 
##$RELAX= 
$$ Bruker specific parameters
$$ --------------------------
##$DU= <F:/spectra>
##$EXPNO= 1
##$NAME= <H-F>
##$PROCNO= 1
##$TYPE= <nmr>
##$USER= <she>
##$AMP= (0..31)
100 100 100 100 100 100 100 100 100 100 100 100 100 100 100 100 100 100 
100 100 100 100 100 100 100 100 100 100 100 100 100 100 
##$AQSEQ= 0
##$AQ_mod= 1
##$AUNM= <au_zg>
##$AUTOPOS= <>
##$BF1= 200.13
##$BF2= 200.13
##$BF3= 200.13
##$BF4= 200.13
##$BF5= 200.13
##$BF6= 200.13
##$BF7= 200.13
##$BF8= 200.13
##$BYTORDA= 1
##$CFDGTYP= 0
##$CFRGTYP= 5
##$CHEMSTR= <none>
##$CNST= (0..31)
1 1 145 1 1 1 1 1 1 1 1 1 1 1 1 1 1 1 1 1 1 1 1 1 1 1 1 1 1 1 1 1 
##$CPDPRG= <>
##$CPDPRG1= <>
##$CPDPRG2= <>
##$CPDPRG3= <>
##$CPDPRG4= <mlev>
##$CPDPRG5= <mlev>
##$CPDPRG6= <mlev>
##$CPDPRG7= <mlev>
##$CPDPRG8= <mlev>
##$CPDPRGB= <>
##$CPDPRGT= <>
##$D= (0..31)
0 1.2 0 0 0 0 0 0 0 0.06 0 0.03 0 0 0 0 0.0002 0 0 0 0 0 0 0 0 0 0 0 0 
0 0 0 
##$DATE= 1728044738
##$DBL= (0..7)
120 120 120 120 120 120 120 120 
##$DBP= (0..7)
150 150 150 150 150 150 150 150 
##$DBP07= 0
##$DBPNAM0= <>
##$DBPNAM1= <>
##$DBPNAM2= <>
##$DBPNAM3= <>
##$DBPNAM4= <>
##$DBPNAM5= <>
##$DBPNAM6= <>
##$DBPNAM7= <>
##$DBPOAL= (0..7)
0.5 0.5 0.5 0.5 0.5 0.5 0.5 0.5 
##$DBPOFFS= (0..7)
0 0 0 0 0 0 0 0 
##$DE= 6
##$DECBNUC= <off>
##$DECIM= 24
##$DECNUC= <off>
##$DECSTAT= 4
##$DIGMOD= 1
##$DIGTYP= 9
##$DL= (0..7)
0 120 120 120 120 120 120 120 
##$DP= (0..7)
150 150 150 150 150 150 150 150 
##$DP07= 0
##$DPNAME0= <>
##$DPNAME1= <>
##$DPNAME2= <>
##$DPNAME3= <>
##$DPNAME4= <>
##$DPNAME5= <>
##$DPNAME6= <>
##$DPNAME7= <>
##$DPOAL= (0..7)
0.5 0.5 0.5 0.5 0.5 0.5 0.5 0.5 
##$DPOFFS= (0..7)
0 0 0 0 0 0 0 0 
##$DQDMODE= 0
##$DR= 18
##$DS= 0
##$DSLIST= <SSSSSSSSSSSSSSS>
$$ [...]
##$SUBNAM2= <"">
##$SUBNAM3= <"">
##$SUBNAM4= <"">
##$SUBNAM5= <"">
##$SUBNAM6= <"">
##$SUBNAM7= <"">
##$SUBNAM8= <"">
##$SUBNAM9= <"">
##$SW= 24.0689170037331
##$SWIBOX= (0..15)
0 0 2 0 0 0 0 0 0 0 0 0 0 0 0 0 
##$SW_h= 4816.95568400771
##$TD= 16384
##$TD0= 1
##$TE= 0
##$TE2= 300
##$TE3= 300
##$TEG= 300
##$TL= (0..7)
0 120 120 120 120 120 120 120 
##$TP= (0..7)
150 150 150 150 150 150 150 150 
##$TP07= 0
##$TPNAME0= <>
##$TPNAME1= <>
##$TPNAME2= <>
##$TPNAME3= <>
##$TPNAME4= <>
##$TPNAME5= <>
##$TPNAME6= <>
##$TPNAME7= <>
##$TPOAL= (0..7)
0.5 0.5 0.5 0.5 0.5 0.5 0.5 0.5 
##$TPOFFS= (0..7)
0 0 0 0 0 0 0 0 
##$TUNHIN= 0
##$TUNHOUT= 0
##$TUNXOUT= 0
##$USERA1= <user>
##$USERA2= <user>
##$USERA3= <user>
##$USERA4= <user>
##$USERA5= <user>
##$V9= 5
##$VALIST= <valist>
##$VCLIST= <CCCCCCCCCCCCCCC>
##$VD= 0
##$VDLIST= <DDDDDDDDDDDDDDD>
##$VPLIST= <PPPPPPPPPPPPPPP>
##$VTLIST= <TTTTTTTTTTTTTTT>
##$WBST= 1024
##$WBSW= 4
##$XGAIN= (0..3)
0 0 0 0 
##$XL= 0
##$YL= 0
##$YMAX_a= 639958
##$YMIN_a= -663983
##$ZGOPTNS= <>
##$ZL1= 120
##$ZL2= 120
##$ZL3= 120
##$ZL4= 120
##$ABSF1= 10
##$ABSF2= 0
##$ABSG= 5
##$ABSL= 3
##$ALPHA= 0
##$AQORDER= 0
##$ASSFAC= 0
##$ASSFACI= 0
##$ASSFACX= 0
##$ASSWID= 0
##$AUNMP= <proc_1d>
##$AZFE= 0.1
##$AZFW= 0.1
##$BCFW= 1
##$BC_mod= 2
##$BYTORDP= 1
##$COROFFS= 0
##$CY= 11.3945322036743
##$DATMOD= 1
##$DC= 2
##$DFILT= <>
##$DTYPP= 0
##$F1P= 15.6554695791079
##$F2P= 12.8336369535428
##$FCOR= 0.5
##$FTSIZE= 0
##$FT_mod= 4
##$GAMMA= 1
##$GB= 0.15
##$INTBC= 1
##$INTSCL= 1
##$ISEN= 128
##$LB= 0.24
##$LEV0= 0
##$LPBIN= 0
##$MAXI= 10000
##$MC2= 0
##$MEAN= 0
##$ME_mod= 0
##$MI= 1.114404
##$NCOEF= 0
##$NC_proc= 0
##$NLEV= 6
##$NOISF1= 3.799351
##$NOISF2= 2.8
##$NSP= 1
##$NTH_PI= 0
##$NZP= 0
##$OFFSET= 15.70392
##$PC= 1
##$PHC0= -26348.66
##$PHC1= 17.58747
##$PH_mod= 1
##$PKNL= yes
##$PPARMOD= 0
##$PSCAL= 0
##$PSIGN= 0
##$REVERSE= no
##$SF= 200.130013532006
##$SI= 16384
##$SIGF1= 3
##$SIGF2= 2
##$SINO= 400
##$SIOLD= 16384
##$SREGLST= <1H.CDCl3>
##$SSB= 0
##$STSI= 0
##$STSR= 0
##$SW_p= 3612.71676300578
##$SYMM= 0
##$S_DEV= 0
##$TDeff= 0
##$TDoff= 0
##$TI= <>
##$TILT= no
##$TM1= 0
##$TM2= 0
##$TOPLEV= 0
##$USERP1= <user>
##$USERP2= <user>
##$USERP3= <user>
##$USERP4= <user>
##$USERP5= <user>
##$WDW= 1
##$XDIM= 8192
##$YMAX_p= 0
##$YMIN_p= 0
$$ End of Bruker specific parameters
$$ ---------------------------------
##NTUPLES= NMR FID
##VAR_NAME=  TIME,          FID/REAL,        FID/IMAG
##SYMBOL=    X,             R,               I
##VAR_TYPE=  INDEPENDENT,   DEPENDENT,       DEPENDENT
##VAR_FORM=  AFFN,          ASDF,            ASDF
##VAR_DIM=   8192,          8192,            8192
##UNITS=     SECONDS,       ARBITRARY UNITS, ARBITRARY UNITS
##FACTOR=    0.0002076,     1,               1
##FIRST=     0,             0,               0
##LAST=      1.7004516,     0,               0
##MIN=       0,             -663983,         0
##MAX=       1.7004516,     639958,          0
$$ Real data points
##PAGE= N=1
##DATA TABLE= (X++(R..R)), XYDATA
0@%%%%qJ6j6K4l2M0n6P2q8J05j30J65k03K43k89L41l99M72n57O47p43Q51r75J116
$$ 0 0 0 0 0 -8 8 -8 16 -16 24 -32 40 -48 57 -73 92 -111 132 -157 184 -215 257 -300 347 -396 455 -520 596
28E96j275J445j628J833k065K321k598K899l227L591l994M433m912N438o020O665
$$ 596 -679 766 -862 971 -1094 1227 -1371 1528 -1699 1892 -2102 2331 -2581 2857 -3163 3502
44C502p383Q180r066J0063j1195J2494j4000J5767j7866K0416k3607K7714l3215
$$ 3502 -3881 4299 -4767 5296 -5899 6595 -7405 8362 -9504 10912 -12695 15019 -18196
57a8196M1019n3047P4514j64627P60295l51326p78468O70926j94798j34740N81027
$$ -18196 22823 -30224 44290 -120337 639958 288632 -489836 181090 -13708 -148448 432579
68D32579l30094o15269N56776K31039m34263J19115R3216l78569M87727K52444
$$ 432579 102485 -512784 43992 275031 -159232 -40117 53099 -325470 162257 414701
78D14701q06293K59946O38376o72158J6645M67886n73700Q6989N34246n53761
$$ 414701 -391592 -131646 506730 -165428 -148783 319103 -254597 -167608 366638 -187123
88a87123q7614N45786l07492j83625N19801j93435m25447M76522Q6242n14571
$$ -187123 -274737 271049 -36443 -220068 299733 106298 -319149 157373 243615 -270956
98b70956L35209J28245n74711L63295L33934n35518J53690K14291l48454L52034
$$ -270956 64253 192498 -382213 -18918 315016 -220502 -66812 147479 -200975 151059
108A51059J79286o21164J46243M71873l65176j39815L22493k64296j21247N25526
$$ 151059 330345 -290819 -144576 327297 -37879 -177694 144799 -119497 -240744 284782
118B84782j94125m47042M75884R3832l74620L04304n4234l68740M28889M8599
$$ 284782 90657 -356385 119499 213331 -161289 143015 88781 -279959 148930 197529
128A97529m85757K42174J94402l00338J45811J68751l02712P3264L12470k48307
$$ 197529 -288228 -46054 148348 -151990 -6179 162572 -140140 -66876 245594 -2713
138b713j19939K68692j93868q1352L35808k76846k06209M40335r7756k36982L05308
$$ -2713 -122652 146040 -47828 -129180 206628 -70218 -276427 163908 66152 -170830 134478
149A34478r1850k13106L19055K2380l10187Q8928J25492j33933O3357N3992k32642
$$ 134478 42628 -170478 148577 170957 -139230 -50302 75190 -58743 4614 58606 -174036
160a74036J09424K56876k35663l8664K26005j88323Q622K24102k58587o4775K64586
$$ -174036 -64612 192264 -43399 -82063 143942 -44381 -35759 188343 -70244 -135019 129567
171A29567j47987j13619J80109n5290o6815J59599m7208j43662J71358P5065k19542
$$ 129567 -18420 -132039 48070 -7220 -74035 85564 38356 -105306 66052 141117 -78425
182g8425N0174J11408j72953O7196J10330k03767N8940J47164j47693O1029J09032
$$ -78425 -28251 83157 -89796 -22600 87730 -116037 -57097 90067 -57626 3403 112435
193A12435j59202K8375J14739j14511j5192R3245j02396p0344J51759R747j29429
$$ 112435 -46767 -18392 96347 -18164 -33356 59889 -42507 -112851 38908 48655 -80774
204h0774Q1200L6936q1022J21776r8j64411J07821M5066j34264P0775J0695j07361
$$ -80774 426 37362 -43660 78116 78018 -86393 21428 66494 -67770 3005 13700 -93661
216i3661R8181M4675j07505M4216Q4455n6546k2221N0072m3418j6978P5561q1897
$$ -93661 4520 49195 -58310 -14094 70361 13815 -8406 41666 -1752 -18730 56831 -25066
228b5066p1503J26727k0855o9735R8367m0634m7325J30782l2392q8377O8276q605
$$ -25066 -96569 30158 9303 -60432 37935 -2699 -50024 80758 48366 -40011 28265 19660
240A9660n1939M2195j0705n8220L8317M4549n2620J6610O9445o5510m109Q4216
$$ 19660 -32279 9916 -789 -59009 -20692 23857 -28763 -12153 57292 -8218 -12327 71889
252G1889p4109k1628P1668q2952j2601P8617o2043q342O3584l4808J448N2945
$$ 71889 -2220 -23848 47820 -35132 -47733 30884 -31159 -39501 24083 -10725 -9277 43668
264D3668k1168l0569L1725N182n7170J9833K9850p4292K5729N3558o9527M2185
$$ 43668 22500 -8069 23656 28838 -28332 -8499 21351 -52941 -27212 26346 -43181 -996
276i96N2300p9268L8700M4566o6060K3500R447n7225J8432K1895k3579j2549K3288
$$ -996 51304 -27964 10736 55302 -10758 12742 22189 -35036 -16604 5291 -18288 -30837 -7549
289g549J4623k0508L9677J5343o3556M4577J7326p5186M7292o02p1585N9839K597
$$ -7549 7074 -13434 26243 41586 -21970 22607 39933 -35253 12039 11437 -60148 -309 2288
302B288m1135N4390n813j9878L2244m24m204r550k527k899l3322K9195K674m8841
$$ 2288 -38847 15543 9730 -10148 22096 21672 17468 7918 5391 2492 -30830 -1635 1039 -47802
316d7802N1340J158l5646P0356j7360l7432N4553l1073j7499L1073l8666m628
$$ -47802 3538 4696 -30950 39406 22046 -15386 39167 8094 -9405 21668 -16998 -21626
328b1626J0842j1804J9461o357R341J3880j8564L5509n842l4657L8152l2282k4252
$$ -21626 -10784 -22588 -3127 -9484 -143 13737 -4827 30682 24840 -9817 28335 -3947 -28199
341b8199M5576m1844p100L9223l0205K0490K3199k0903K0778q243n399J3634l0127
$$ -28199 17377 -24467 -31567 7656 -22549 -2059 21140 237 21015 12772 7373 21007 -9120
354i120P529l039k7424L0834j1516q242L5838k4499J5089K9876l6883J8895L230
$$ -9120 -1591 -4630 -32054 -1220 -12736 -20978 14860 -9639 5450 35326 -1557 17338 20568
367B0568l6496K2005j2027j5790J5245j8913J8553J2588j6687L2466p759j2762
$$ 20568 -15928 6077 -5950 -21740 -6495 -25408 -6855 5733 -10954 21512 13753 991
379I91K8610k4693l387P735l3535J8176k111k0515L2272j2351j920L2693j7373
$$ 991 29601 4908 1521 9256 -24279 -6103 -8214 -28729 3543 -8808 -10728 21965 4592
392D592J1879P458k6986J6690j4217j5228J9093k6779M980J9251k1046K6998O922
$$ 4592 16471 23929 -3057 13633 -584 -15812 3281 -23498 -18518 733 -20313 6685 13607
405A3607j6990K7738j2916o288J5753l0648M860L287k7170K3370j823j0553K6079
$$ 13607 -3383 24355 11439 5151 20904 -9744 -4884 -1597 -28767 -5397 -7220 -17773 8306
418H306j0558R902J6321k1728J8090p361k6577K1826j7800j2537K0767k0285J0790
$$ 8306 -2252 7650 23971 2243 20333 12972 -13605 8221 -9579 -22116 -1349 -21634 -10844
431a0844J7525j3920K3768J89j4845J7296j2946l365K898k3047J0349o326j0798
$$ -10844 6681 -7239 16529 16718 1873 19169 6223 2858 5756 -17291 -6942 -13268 -24066
444b4066L0491j2958k887L0620j8978P102J8305k7069M678k414j9528J2794n569
$$ -24066 6425 -6533 -9420 21200 2222 9324 27629 560 5238 2824 -16704 -3910 -9479
457i479n817O529l378J7031L122j097J6569k1836J600J9410l1403K922R398l3704
$$ -9479 -15296 -8767 -12145 4886 8008 6911 23480 1644 3244 22654 -8749 -5827 3571 -30133
471c0133J6848J5549j8718J8667P552r811J1775O723l465j3764k991L831j9314
$$ -30133 -13285 2264 -16454 2213 9765 -46 11729 18452 14987 1223 -1768 2063 -17251
484a7251R610Q159k7495K0239J4005j9525L1382K674k9912K6854j966k9551J6661
$$ -17251 -7641 518 -26977 -6738 7267 -12258 19124 21798 -8114 18740 16774 -12777 3884
497C884N01k6283K034J7521k081p217K0856l66j6665L2744k813l1833K3643j4254
$$ 3884 4385 -21898 -19864 -2343 -4424 -11641 9215 8849 -7816 24928 22115 -9718 13925 -329
511c29k5393L6964j8449k8977M0668j890j7875K9186L388j6841J1259Q815k3222
$$ -329 -25722 11242 -7207 -36184 4484 2594 -15281 13905 17293 452 11711 20526 -2696
524b696n905K0418k5849j3661L7992k4221j1128N2495k8407j6556N4522k4192
$$ -2696 -8601 11817 -14032 -27693 10299 -13922 -25050 27445 -962 -17518 37004 12812
536A2812k2969L2824k3445j6360K3146j5228j5379K0190N816j5086J9747K0234
$$ 12812 -10157 22667 -778 -17138 6008 -9220 -24599 -4409 1407 -13679 6068 26302
548B6302l7916J1722M3785n0553q218M1320n2427M98M9684m5926l284M1085k3502
$$ 26302 -11614 108 43893 -6660 -14878 26442 -25985 -25487 24197 -21729 -25013 16072 -7430
561g430J0758K8455l2115q270L1680r693l3803J9154R908m3358K4185K8864m8388
$$ -7430 3328 31783 -332 -8602 23078 13385 -20418 -1264 8644 -34714 -10529 18335 -30053
574c0053L1604L4286n7199K9432L0810n5982K5443J5345n9741K1262L4414l6651
$$ -30053 1551 35837 -21362 8070 38880 -17102 8341 23686 -36055 -14793 19621 -17030
586a7030n146K9879j0698j0639M0823k313m2198L2723j575m0138N2592j5506p0043
$$ -17030 -22176 7703 -2995 -13634 27189 24876 -17322 15401 13826 -26312 26280 10774 -59269
599e9269O0059J4412m6076M9771l309m8209M9318K5157m3330n334J4905j7033
$$ -59269 790 15202 -30874 18897 15588 -32621 16697 41854 -1476 -6810 8095 -8938
611h938M58K2499l7916j0997O4675l2197l1722P0813k6445k7441O3763m7929l6838
$$ -8938 -8480 14019 -23897 -34894 29781 -2416 -34138 36675 10230 -17211 46552 -1377 -38215
624c8215P1036k2514m4913K9402n117r080L8235j074m5730K4054M7229m2971l894
$$ -38215 32821 10307 -34606 -5204 -10321 -19401 18834 17760 -27970 -3916 43313 342 -3552
637c552L5897o3376Q814O3093o8120k496N5081n5795J9920N9601n9662m986N0030
$$ -3552 32345 -31031 -22217 40876 -27244 -29740 25341 -30454 -10534 49067 -10595 -15581 34449
650C4449k9270j6367L4008k2955m5041M9502K2101o8322L0358M0992n4675M3374
$$ 34449 5179 -11188 22820 -135 -45176 4326 26427 -41895 -11537 29455 -25220 18154
662A8154K1224q0991N5110L7859q5109K5123K5354n4116L9066K4897o5697J1284
$$ 18154 39378 -41613 13497 51356 -33753 -8630 16724 -37392 1674 26571 -39126 -27842
674b7842P0460k4441m0917M4450j1577l5410P1097l0563q7425Q3908J3704p1522
$$ -27842 42618 18177 -22740 21710 10133 -25277 45820 15257 -72168 11740 25444 -46078
686d6078O4031p889o1757Q1383J3894o8195L2531J4724m4998K6118K8182o3139
$$ -46078 17953 10064 -51693 29690 43584 -24611 7920 22644 -22354 3764 31946 -31193
698c1193p228O6455l9787j7556P5797n8465l0811J09460m9049o3505Q3445l2213
$$ -31193 -38421 28034 -11753 -29309 46488 -11977 -42788 66672 17623 -45882 37563 5350
710E350m6400P1808l2448n6395P2644J6416o2059K5184L4092m1614L1362L2324
$$ 5350 -41050 30758 -1690 -58085 14559 30975 -31084 -5900 28192 -13422 17940 50264
722E0264r6246J5861R2242p7898k0265O2324p1624K0446R8972q4529m1547Q9567
$$ 50264 -45982 -30121 62121 -15777 -36042 26282 -45342 -24896 74076 -10453 -52000 37567
734C7567j8364l1795N1037l7671n8627P5144K0012q5259L6702L6599p0438N6463
$$ 37567 19203 -12592 38445 774 -57853 17291 37303 -47956 -11254 25345 -45093 11370
746A1370M7043j01353L7326O5171q6393J8630N0901q2039J2836O9516o5440k2094
$$ 11370 58413 -42940 -5614 59557 -26836 -8206 42695 -39344 -26508 43008 -22432 -44526
758d4526P6532k3024l8106O6997k1825o3382Q6256O094j00072N4564K1936p0796
$$ -44526 32006 8982 -29124 37873 16048 -47334 38922 45016 -55056 -492 21444 -49352
770d9352O7639J3156r6354N8764N8259o5596J5188L0836o1122J8880O5664o7345
$$ -49352 18287 31443 -64911 -6147 52112 -13484 1704 32540 -28582 -9702 55962 -11383
782a1383m2582P5717k0877l9997P5303l3504n8226R8328n800p6416O5184k955
$$ -11383 -53965 21752 875 -39122 36181 2677 -55549 42779 36979 -39437 25747 22792
794B2792o3718O0993K400p2997M3475L5882n7495J6152M6057m9787P048O2620
$$ 22792 -40926 20067 22467 -50530 -7055 28827 -28668 -12516 33541 -16246 -9198 53422
806E3422o2692k5262P9570m5427l9553O9763m4498l4844Q7703k4954n6271O1590
$$ 53422 -9270 -34532 45038 -389 -39942 29821 -14677 -49521 38182 13228 -43043 18547
818A8547J825l7752M5552m072o1933L4946L6432n7217M707L6673n0202J8990O1827
$$ 18547 20372 -17380 28172 24100 -37833 -2887 33545 -23672 -18965 17708 -32494 -13504 48323
831D8323o3759r579O7850m3320j3065N1469m9701k2545N9599k5465l7213M5247
$$ 48323 -15436 -25015 42835 -485 -13550 37919 -11782 -34327 25272 -193 -37406 7841
843G841J573l3595L6385J1796m4538K9882K7356n6180J0934L0809m7027J6696
$$ 7841 9414 -24181 12204 24000 -20538 9344 36700 -19480 -8546 22263 -24764 -8068
855h068L0194n5692J4505M9964l5802k321L1948k9264m781L9151k0791l6955K7211
$$ -8068 22126 -33566 -19061 30903 -4899 -7220 24728 -4536 -9317 29834 9043 -27912 -701
868g01O057k7566K7959K487m1031L8359K3831m1653K1221J1542l8914K5023J4317
$$ -701 5356 -22210 5749 8236 -32795 5564 29395 -12258 8963 20505 -18409 6614 20931
881B0931m1141P058J7995j7464M603J6613j2961k515K7537j0211k2643K9006n512
$$ 20931 -20210 -13152 4843 -12621 -8018 8595 -4366 -6881 20656 10445 -12198 16808 11296
894A1296l1751K9399p014l1738L5549J409k8210K3824N141r352J7666o718j5553
$$ 11296 -20455 8944 1930 -29808 5741 7150 -21060 2764 7905 -1447 16219 9501 -6052
907f052Q270O912j1827q061R362r158n092K9995j1721j8948L0604o203j0307K2757
$$ -6052 2218 9130 -2697 -10758 -1396 -10554 -15646 14349 2628 -16320 14284 8081 -2226 20531
921B0531j9939j1969J9154j4423k891J1124j1971L68J1301O258l889l929J2766
$$ 20531 592 -11377 7777 -6646 -9537 1587 -10384 -10016 1285 7543 3654 -275 12491
934A2491o987q907J5384j5002q177J5273j8484M293J8913j8649R213J3274j6630
$$ 12491 5504 -3403 11981 -3021 -11198 4075 -14409 -10116 8797 -9852 -639 12635 -3995
947c995J0435P637j0595k543o412L744J024p519N188o434K603J5394r734P787
$$ -3995 6440 14077 3482 939 -5473 -1729 -705 -8224 -3036 -9470 -6867 8527 -1207 6580
961F580O211k0004J5005O021k2602P432j154r704R802l291K491O447o712R035
$$ 6580 12791 -7213 7792 13813 -8789 -1357 -2511 -12215 -2413 -5704 -3213 3234 -3478 5557
975E557K957k835K378r856M043m04j4781J3219j830j4416J7245l01l427J3497
$$ 5557 8514 5679 8057 -1799 2244 1840 -12941 278 -1552 -15968 1277 976 -2451 11046
989A1046q628J438O952j1730L349o12q985L026m682N901L234r872J3941K362p434
$$ 11046 2418 3856 10808 -922 2427 1815 -7170 -4144 -8826 -2925 309 -9563 4378 6740 -694
1004f94J2293p204m036P448j4212M026M655j7043R606O109o955Q336j342M827
$$ -694 11599 4395 359 7807 -6405 -2379 2276 -14767 -5161 948 -6007 2329 987 5814
1018E814L294r406R627l534j3666Q923n621l535P519j0230R002P078j0550J3947
$$ 5814 9108 -298 9329 5795 -7871 1052 -4569 -8104 -585 -10815 -1813 5265 -5285 8662
1032H662J315j0872Q297n155k251K690j2826N316J820o801J1890k733q68R333
$$ 8662 9977 -895 7402 2247 -4 2686 -10140 -4824 -3004 -9805 2085 -648 -1516 7817
1046G817q091P918M762j6262N573q65q857O756n040K97N865q237J1325P199r846
$$ 7817 -274 7644 12406 -3856 1717 852 -8005 -1249 -6289 -5992 -127 -8364 2961 10160 314
1061C14N869p04l704L331r105K562j94j2544J0741M622o511P817n71J223N772
$$ 314 6183 5479 1775 5106 -3999 -1437 -1631 -14175 -3434 1188 -5323 2494 1923 3146 8918
1076H918o708M074j219j1819M754k52m362L954m902M788O060m396P885J159o548
$$ 8918 2210 6284 5065 -6754 -2000 -2252 -6614 -2660 -7562 -2774 3286 -1110 6775 7934 1386
1091A386L860m197o56J967j0896K521M105o058O250L863j003L384l230N852J983
$$ 1386 5246 1049 393 2360 -8536 -6015 -1910 -7968 -1718 2145 1142 4526 1296 7148 9131
1106I131j0374L040k022o852L570k285J499L545n835Q771O240o915M581L49n685
$$ 9131 -1243 1797 -225 -7077 -3507 -5792 -4293 -748 -6583 2188 8428 1513 6094 6443 758
1121G58N05l394P92j313p020N930J458p52P596l297K065N528q984N276K521j3478
$$ 758 1263 -2131 -1339 -2652 -9672 -3742 -2284 -3036 4560 1263 3328 8856 -128 5148 7669 -5809
1137e809K168Q68m725N017j304R62L952j778O636J905l866O78o508K197K845j2612
$$ -5809 -3641 -2773 -7498 -2481 -3785 -2823 1129 -649 5987 7892 4026 4704 -1804 393 3238 -9374
1153i374N631L729j2049J0944O447p387P819n88m275O772n089l172n1m414k36
$$ -9374 -3743 -14 -12063 -1119 5328 -2059 5760 5172 897 7669 2580 -592 -643 -5057 -5293
1168e293j666N295L356r605R873O611j0453J0688P20j5366R272k728q503R777
$$ -5293 -6959 -1664 1692 -7913 1960 8571 -1882 8806 9526 -5840 3432 704 -7799 1978
1182A978q400m852J2978o76k441M321K461J12m867O802l045j3595J1103k520j3168
$$ 1978 -6422 -11274 1704 1028 -1413 2908 5369 5481 614 7416 4371 -9224 1879 -641 -13809
1197a3809J5709m130p486J9058p241o036J7304q093p056O356m215m164j9Q95l186
$$ -13809 1900 -2230 -9716 9342 2101 -3935 13369 5276 -1780 4576 361 -3803 -3822 -2927 -6113
1212f113j738J1375l426m264J5856j0088l205J8548j9095p254J8468j5197m624
$$ -6113 -7851 3524 98 -4166 11690 1602 -1603 16945 -2150 -9404 9064 -6133 -10757
1225a0757J4245r051k131J0069J746j387Q98L508o828M91R522j6368k710J3650
$$ -10757 3488 -5563 -7694 2375 4121 2734 3632 7140 312 803 10325 -6043 -8753 4897
1239D897j7077O363J6261k1151O453J7900j4251M437O497j2563J243M840o610
$$ 4897 -12180 -5817 10444 -10707 -4254 13646 -605 3832 10329 -2234 -991 3849 -2761
1252b761o715O603N369j3318P230J3575j5162J1256Q990k4680J1822J1820k1342
$$ -2761 -9476 -2873 2496 -10822 -3592 9983 -5179 6077 15067 -9613 2209 14029 -7313
1265g313O881j336j3949J6168M397j1025K639N857L083k282N801k717j6358J4192
$$ -7313 -432 -1768 -15717 451 4848 -6177 -3538 2319 5402 3120 8921 6204 -10154 4038
1279D038L279k1671J4959K25j8411K2746R46j4545J8202l558r271J1457l873o042
$$ 4038 7317 -14354 605 830 -17581 5165 6111 -8434 9768 6210 -3061 8396 4523 -1519
1293a519n30J16k328n229J0512k60r748J7037m530j0205K3084j0027j4965J6793
$$ -1519 -2049 -1933 -4261 -9490 1022 762 -8986 8051 3521 -6684 16400 6373 -8592 8201
1307H201j1825m512J5199j3405n599J1256R51K837J94m99j970Q23J0997j1584
$$ 8201 -3624 -8136 7063 -6342 -11941 -685 266 3103 3297 2798 828 1651 12648 1064
1321A064j0460J3062j0050j077J4296j6685K302J7541j2475M427R035j1777L520
$$ 1064 -9396 3666 -6384 -7461 6835 -9850 -7548 9993 -2482 1945 10980 -797 2723
1334B723K951q289q26J552Q84o778J475Q760n469O879N372j5728J1374Q432j7910
$$ 2723 5674 -2615 -3441 -1889 -1005 -7783 -6308 2452 -3017 3862 9234 -6494 4880 13312 -4598
1349d598O856q15j4765J3679K489j1793N245K472K159N734o02m146l405P854k061
$$ -4598 2258 1443 -13322 357 2846 -8947 -3702 -1230 929 6663 6061 1915 -1490 6364 4303
1364D303j0121P859p103q541K0112o592j1110J8429m897m866J5458j0157o666
$$ 4303 -5818 2041 -5062 -13603 6509 -83 -11193 7236 2339 -2527 12931 2774 -3892
1377c892J0168m949p560J932K398l071K292O655j0276K924J9776j3108o264J1050
$$ -3892 6276 1327 -6233 -4301 -1903 -4974 -2682 3973 -6303 -3379 16397 3289 -2975 8075
1391H075j4496O749J4668k7735l143K0820p984J694Q141j2979L79J9313O39j9074
$$ 8075 -6421 328 14996 -12739 -15882 4938 -3046 -1352 6789 -6190 -5811 13502 14141 -4933
1405d933P64Q610r584P130L152k4230J3611J7214j9961J0142R058k1128J6741
$$ -4933 -4169 4441 -5143 1987 5139 -19091 -5480 11734 -8227 1915 10973 -10155 6586
1418F586J1207k5965L849J2132j3404j382R731r346m493K1395l037k0006J9339
$$ 6586 17793 -8172 -4323 7809 -5595 -6977 2754 -6592 -11085 10310 7273 -12733 6606
1431F606N761j9566J7982l018k8756K3657R088k5863J0575L662j2737K0601P380
$$ 6606 12367 -7199 10783 7765 -20991 2666 11754 -14109 -3534 128 -12609 7992 15372
1444A5372k2502K717J6298r625m047J1754j8632j0072L1209q067k3316K4848l642
$$ 15372 -7130 -4413 11885 2260 -1787 9967 -8665 -18737 12472 4405 -18911 5937 2295
1457B295j5173L0569o054k6058K1135K738j7801J1868j320j8473J2664J4473j8859
$$ 2295 -12878 17691 11637 -14421 6714 9452 -8349 3519 2199 -16274 -3610 10863 -7996
1470g996p87K0458j1290k601J9344k2114o320L2434k0616k0892K5152p824o894
$$ -7996 -8783 11675 385 -2216 17128 -4986 -11306 21128 512 -20380 4772 -3052 -9946
1483i946K3842j6032j7564K9947R784k2624L72O029j0817J1511R544l1722Q57
$$ -9946 13896 -2136 -19700 10247 20031 -2593 -2221 3808 -7009 4502 14046 -17676 -16819
1496a6819K9863j6111l884J8849k1121N171K7599k5175r467K3713j2551j1043
$$ -16819 13044 -3067 -6951 11898 -9223 -4052 23547 -1628 -11095 12618 67 -10976
1508a0976J4475n005j1008J5932L313j9476J3555J6634k2675M386J5615k4716
$$ -10976 3499 -1506 -12514 3418 6731 -12745 810 17444 -5231 -845 14770 -9946
1520i946P220J6105k6706M959J7915k0529M636J8278j2888k446J2040n916n718
$$ -9946 -2726 13379 -13327 -8368 9547 -10982 -6346 11932 -956 -3402 8638 2722 -2996
1533b996J3113m768k2424J4624J2611k1830Q421P877j9132K1030J2121k8472Q024
$$ -2996 10117 5349 -17075 -2451 10160 -11670 -3249 4628 -14504 6526 18647 -9825 -1801
1546a801J3188j3137M482N18j4749N373J1794p256r296J2627L786r888J2829j218
$$ -1801 11387 -1750 2732 3250 -11499 -6126 5668 -1588 -10884 1743 5529 -4359 8470 7252
1560G252j7810J9936L08k4133J4785L141j5268J3303L55j1725J2546O179p883
$$ 7252 -10558 9378 9686 -14447 338 3479 -11789 1514 1869 -9856 2690 8869 986
1573I86q94M699k066l875O338p217j0993J5751k002j0597J5528n736q481K0254
$$ 986 92 4791 2725 -1150 5188 -2029 -13022 2729 727 -9870 5658 -78 -8559 11695
1587A1695m603j0940R924m811n864O214j042o724q32P790j714k968J1122m984
$$ 11695 7092 -3848 6076 1265 -4599 1615 573 -6151 -6983 807 -907 -3875 7247 2263
1601B263o300J3222o534n168R870j1294m032J0244o902P39O333n333J375N454
$$ 2263 -4037 9185 2651 -2517 7353 -3941 -7973 2271 -4631 -3892 2441 -2892 -1517 3937
1615C937K277l386k704M838o602k706Q709q762l166R135p835M640R537q904J896
$$ 3937 6214 2828 124 4962 -1640 -4346 4363 -4399 -7565 1570 -6265 -1625 7912 -992 904
1630I04L750m046M833k386o149m48q03M029j829k504N696l769L985P052r263L737
$$ 904 4654 608 5441 3055 -3094 -3542 -4345 -316 -2145 -4649 1047 -2722 1263 8315 -948 2789
1646B789L622j0422M474Q18p015M824l103j400O322j351L495M41l534N276k469
$$ 2789 6411 -4011 463 1281 -5734 -910 -4013 -5413 909 -442 3053 3494 -40 5236 2767
1661B767j031M69q060L760K509p442O061L07l663Q198j052j448M513n258R76O30
$$ 2767 1736 2205 -5855 -2095 414 -7028 -967 -660 -4323 3875 2823 1375 5888 630 1606 2236
1677B236n628L025k741k452M825k445K922L133l841N625k40l538L982n637j727
$$ 2236 -3392 -367 -3108 -5560 -735 -3180 -258 2875 -966 4659 4419 881 4863 -774 -2501
1692b501M010o001P19K395l161M796N73k94M592m423J989K368o326J734j176m322
$$ -2501 1509 -4492 -3773 -1378 -4539 257 830 536 5128 705 2694 5062 -1264 470 -706 -5028
1708e028L382k354J805L371m133M714L349m455M043j532m410K348k711l04L6m011
$$ -5028 -1646 -4000 -2195 1176 -2957 1757 5106 651 4694 3162 -1248 1100 -1611 -1915 -1879 -5890
1724e890M105J087j262O357k355j462M217l180P50l61n403K170k384j061N579
$$ -5890 -1785 -698 -1960 4397 2042 580 4797 1617 2367 2006 -3397 -1227 -3611 -4672 907
1739I07l681M42M598j651K839J207k847R84l927j30K650o268J421K577l774M449
$$ 907 -2774 -2332 2266 615 3454 4661 1814 2798 -1129 -1259 1391 -4877 -3456 -879 -4653 -204
1755b04K722j838L173k162R88J851n321J223o85o234M601M65k113L953j474K103
$$ -204 2518 680 3853 1691 2679 4530 -791 432 -253 -6487 -1886 -1421 -3534 419 -1055 1048
1771A048K897k603L705k295n257M636l195l244L809l201K78L025j125M476k89
$$ 1048 3945 1342 5047 2752 -2505 2131 -1064 -4308 -499 -3700 -3422 -397 -1522 2954 2665
1786B665j958M392l684j456L094n402l05P87k593L635j322M10N348m123K350M821
$$ 2665 707 5099 1415 -41 3053 -2349 -2654 -1867 -4460 -825 -2147 -1737 3611 -512 1838 6659
1802F659o435J283J164o040J834k24j969K357k746L593L392l209M180j05l646
$$ 6659 224 1507 2671 -3369 -1535 -1759 -3728 -1371 -4117 -524 2868 -341 3839 3734 88
1817H8L187k934o25R56o241L244J678m661O602L22l177N472m34j916K086l052
$$ 88 3275 341 -284 672 -5569 -2325 -647 -5308 1294 1616 -1561 3911 3477 1561 3647 595
1833E95m74k009j592L404m432J695M365m794M609L930m939L873j716l712M246
$$ 595 121 -1888 -3480 -76 -4508 -2813 1552 -3242 1367 5297 358 4231 2515 -1197 3049
1848C049m452k199L041l943J477L832q78M33l59L577J040m937M025k176o877P041
$$ 3049 -1403 -3602 -561 -4504 -3027 805 -73 360 1 3578 4618 -319 3706 1530 -5347 1694
1864A694k765n341O619k382m16O150k961O67K966k607O92j837j022j11l528L208
$$ 1694 -1071 -6412 207 -2175 -2591 3559 598 1265 4231 1624 2316 479 -543 -654 -4182 -974
1880i74j501j992P891m401o70Q904p054L37O525r143j100N399m747q75J226N79
$$ -974 -2475 -4467 3424 -977 -1647 7257 203 540 7065 -2078 -3178 2221 -2526 -3401 -2175 -1596
1896a596L71N44M592k010k409O478n455n09M776r753J318N926q571M786N070q733
$$ -1596 -1225 -681 3911 1901 -508 5970 515 6 4782 -4971 -3653 2273 -6298 -1512 3558 -5175
1912e175N599M790m187J252P00j633k568J054J294p354L180N675q875N592O721
$$ -5175 424 5214 1027 2279 2979 1346 -1222 -168 1126 -6228 -3048 2627 -6248 -656 6065
1927F065r414O448L228j0043P615M86q503K760l62k695L677J520k806j372P872
$$ 6065 -3349 3099 6327 -3716 3899 4385 -4118 -1358 -1720 -4415 -738 782 -2024 -3396 4476
1942D476J477q188O505p35r437J0302j944j2086R999j66o922Q648O1l907N157
$$ 4476 5953 -2235 4270 3535 -5902 4400 2456 -9630 369 203 -6719 1929 1990 -1917 3240
1957C240N24l222O53K794m519m416O313k804m824R779n871l911J4144n595n636
$$ 3240 3764 542 1195 3989 -530 -4946 1367 -1437 -6261 3518 -2353 -6264 7880 2285 -3351
1972c351J1149o299m789P649m554m514L484%l101K506N756m620r29P794n966K7
$$ -3351 7798 1499 -3290 4359 -195 -4709 -1225 -1225 -4326 -1820 3936 -684 -1613 6181 215 242
1988B42Q254j2181j764J0603r264m21O812p345K448P453l970j084M506o51n149
$$ 242 8496 -3685 -5449 5154 -4110 -4531 2281 -5064 -2616 4837 867 -217 4289 3638 -1511
2003a511K324L324q869J411N692r589N075Q346j0484L022P443p275N207J511j0327
$$ -1511 813 4137 -4732 -3321 2371 -7218 -2143 6203 -4281 -1259 6184 -1091 4116 5627 -4700
2018d700L630L426n409n94K843j079k634O494L080o966M252K390q612P340J857
$$ -4700 -1070 2356 -3053 -3647 -804 -1883 -4517 1977 5057 -1909 2343 4733 -3879 3461 5318
2033E318j2020M834J666n801P693q27o546O993M298l730j557J513P68k625K39
$$ 5318 -6702 -1868 -202 -6003 1690 863 -5683 1310 5608 1878 321 1834 2602 -23 216
2048B16l007k624P816j876q312Q432K004k789P324o596n959J0118J250q027j731
$$ 216 -2791 -5415 2401 525 -7787 645 2649 -140 7184 588 -5371 4747 5997 -2030 -3761
2063c761q36L025L200k197l217J950N663p53k275L053m238j170N979o272l251
$$ -3761 -4597 -1572 1628 -569 -3786 -1836 3827 3074 799 3852 -386 -1556 4423 -1849 -5100
2078e100O235m475m25N829k656J320K554l312K449K302m512l308J465L243m289
$$ -5100 1135 -3340 -3765 2064 -592 728 3282 -30 2419 4721 209 -3099 -1634 1609 -2680
2093b680j791L471j113L600J948o019M067M433m612Oj918m301P056M41r377J691
$$ -2680 -4471 -1000 -2113 1487 3435 -2584 1483 5916 1304 1310 -608 -4909 2147 2588 -6789 -5098
2109e098N794J969j027k278K25J690M589k716p319K728J440l146N068l992n539
$$ -5098 696 2665 1638 -640 -415 1275 5864 3148 -4171 -1443 -3 -3149 1919 -2073 -7612
2124g612R973N95m059N290k152l411M599j202k612p3j973j204K745L151m692r81
$$ -7612 2361 2956 -1103 4187 2035 -1376 3223 2021 -591 -664 -2637 -3841 -1096 2055 -2637 -3618
2140c618Q554k812l454P182n783k306P699p967m171Q279k835j517L069l755K969
$$ -3618 4936 2124 -1330 5852 69 -2237 5462 -2505 -6676 1603 -1232 -2749 320 -3435 -466
2155d66O966j609p332Q48O536l185k850J307p732M082R538r342k64P734o551M283
$$ -466 6500 4891 -2441 -1593 4943 1758 -1092 215 -7517 -3435 6103 -3239 -3503 4231 -2320 1963
2171A963N832r464p0N818n258k730M118j64m853K599M624m534L869M036q595M497
$$ 1963 7795 -1669 -1739 4079 -1179 -3909 209 45 -4808 -2209 2415 -2119 1750 5786 -2809 1688
2187A688M927j0960M110L799j0278M804L877p153M919M457n395q99O319K46n143
$$ 1688 6615 -4345 -235 3564 -6714 -1910 1967 -5186 -267 4190 -1205 -2104 4215 4461 -682
2202f82K245j940n818Q911O12j3078P834N317o838P495k24q032P242K542o603
$$ -682 1563 -377 -6195 2716 3328 -9750 -1916 3401 -3437 4058 3834 -4198 3044 5586 -1017
2217a017J35O37k378M47L008l034k795R072k073n680R746k607p295R148l420q186
$$ -1017 -882 -245 -2623 -2176 832 -2202 -4997 4075 2002 -3678 6068 3461 -3834 5314 1894 -6292
2233f292Q432k098n372M836P26k625L076L081k749k062N825l299l852O257o495
$$ -6292 2140 42 -5330 -494 232 -2393 683 3764 1015 -1047 4778 1479 -2373 3884 -2611
2248b611l683R839n399k975P979m752K64P957m847l737L930k03k222n62J154m708
$$ -2611 -6294 3545 -1854 -4829 3150 -1602 -1338 6619 1772 -1965 1965 1762 -460 -1022 132 -4576
2264d576P46P344m858j732Q332n683l55P643p611p04M800o358L70L489l401M16
$$ -4576 -3830 3514 -1344 -3076 5256 -427 -782 6861 -750 -1454 3346 -3012 -2642 847 -2554 -2138
2280b138J661N35j86J957K517m508n8M408n952O51L942q561K142N625m927L071
$$ -2138 -477 58 -128 1829 4346 -162 -220 4188 -1764 -1113 2829 -5732 -3590 2035 -2892 179
2296A79K305l957K708K184j488o21k212r9p32M28J893m192J434M106l619L575
$$ 179 2484 -1473 1235 3419 1931 1310 -902 -1001 -1733 -1305 588 -3604 -2170 1936 -1683 1892
2312A892K495n742L296J026m594K361q20l062J727j05M32P33M72J426j741J969
$$ 1892 4387 -1355 1941 2967 -1627 734 -86 -3148 -1421 -1526 -1094 -361 111 1537 -204 1765
2328A765K511m499J136J45m824L738j81l531L359l34l09L205r92L03k7p01R60
$$ 1765 4276 -223 913 1058 -3766 -28 -209 -3740 -381 -715 -1024 2181 1189 1492 1465 764 1724
2345A724j766q98L47k905K156J390k338L358j79j117L560j485r69J261k782j17
$$ 1724 -42 -940 -593 -3498 -1342 48 -2290 1068 889 -228 3332 1847 878 2139 -643 -760
2361g60M30j904N94m23M47K378j047J855Q45k311K213o18k901J795k168j033K224
$$ -760 -330 -2234 -1640 -2063 -1616 762 -285 1570 2415 104 2317 1699 -1202 593 -1575 -2608 -384
2378c84j932J301J332j665L115L19j387J942k106m74Q09k671P08m74j670L524
$$ -384 -2316 -1015 317 -1348 1767 2086 699 2641 535 61 870 -1801 -1093 -1567 -3237 287
2394B87n21n60L082j944P18J780k407O68p43k668J876j044q18K458k383J782K418
$$ 287 -234 -794 2288 344 1062 2842 435 1103 360 -2308 -432 -1476 -2294 164 -2219 -437 1981
2411A981k147K808n17j958J595k049o92R74l252J602J184j592K796J91j005K721
$$ 1981 -166 2642 2125 167 1762 -287 -979 -5 -3257 -1655 -471 -2063 733 924 -81 2640
2427B640j499L72N66l078Q66k79k327K543q44j014K621q18J670R24k049J859j063
$$ 2640 1141 1513 2079 -999 -133 -412 -2739 -196 -1040 -2054 567 -251 1419 2343 294 2153 1090
2444A090j925K117k776o57J642j703J551J174j417K562j29n94K172k585k87M40
$$ 1090 -835 1282 -1494 -2151 -509 -2212 -661 513 -904 1658 1529 935 3107 522 235 675
2460F75k844J316m62j085K155p02P15K464k581K289N11k769J824q57k260R93j583
$$ 675 -2169 -853 -1315 -2400 -245 -947 -232 2232 -349 1940 2451 -318 1506 649 -1611 -618 -2201
2477b201P01Q99j503K737K58r04K750j126m17M98k621Q53n83k257K513p02r53
$$ -2201 -1500 -601 -2104 633 891 -13 2737 1611 1194 1692 -929 -76 -659 -2916 -403 -1105 -2058
2494b058L005r47R06J569k220J497n54j395J246k665j26J356k517K580Q25k545
$$ -2058 947 0 906 2475 255 1752 1198 -197 1049 -1616 -1742 -386 -2903 -323 502 -2043
2510b043M330l60j426K359k878K32J075l707J526j03j353K313j016Q44J706j679
$$ -2043 2287 1927 501 2860 -18 214 1289 -2418 -892 -995 -2348 -35 -1051 -207 1499 -180
2526a80L030o86l470L737k381k322L307l712K2K929k110K354J074j709K593p31
$$ -180 2850 2164 -1306 2431 50 -2272 1035 -2677 -2655 274 -1836 518 1592 -117 2476 1745
2542A745m32J40k442J368j510j841L551k442j80L744l233K275K857m043J778R54
$$ 1745 1313 1453 -989 379 -1131 -2972 579 -1863 -2043 1701 -1532 743 3600 -443 1335 2289
2558B289l923J733j45j261l54o01K008j27j20K848k496O79L110l974J316M89n541
$$ 2289 -1634 99 -46 -1307 -1661 -2262 -254 -381 -501 2347 -149 530 3640 -334 982 1471 -4070
2575d070L502J468m236K811M78j363K769J160n79j843P16J195l315Q70L37l713
$$ -4070 -568 900 -3336 -525 -47 -1410 1359 2519 1940 97 813 2008 -1307 -437 -100 -3813
2591c813L476O39m007N288O11l572M064r14k118K671j651k611O76J54P66j452
$$ -3813 -337 302 -3705 1583 2194 -1378 2686 1772 -346 2325 674 -1937 -1261 -1107 -341 -1793
2607a793J570l19q77N596j972m474N421j762l901M855l487k815M440j365q18K563
$$ -1793 -223 -542 -1419 4177 2205 -2269 3152 1390 -2511 2344 -1143 -3958 482 -883 -1701 862
2623H62j040Q75O64N85j076j137K474k764k744N031l918j464O203m013l18N334
$$ 862 -178 697 1361 1946 870 -267 2207 -557 -3301 1730 -2188 -3652 2551 -1462 -1780 3554
2639C554l641L97L256l339q12J552j975j116M14J352j822Q39L694k980l03N346
$$ 3554 -87 310 3566 227 -585 967 -1008 -2124 -1710 -358 -2180 -1341 2353 -627 -930 4416
2655D416l977m33L293o163J853L121m668K05K422k152K123K423j556j627J803
$$ 4416 439 6 3299 -2864 -1011 2110 -2558 -2353 69 -2083 40 2463 907 -720 1083
2670A083K242k812j344J582l763J574K978m725J679L661l533K912J317l854K143
$$ 1083 3325 513 -831 751 -3012 -1438 1540 -3185 -1506 2155 -1378 1534 2851 -1003 1140
2685A140J298l434m66J512m68j229M76M33p22L012J354m688K721K239l396K250
$$ 1140 2438 -996 -1462 50 -418 -1647 -1171 -738 -1460 1552 2906 -1782 939 3178 -218 2032
2701B032q48n265L023K206l417J481P02n44J720R27r23r72J399m32k773K011m43
$$ 2032 1184 -4081 -1058 1148 -2269 -788 -86 -630 1090 2017 1094 122 1521 1089 -1684 327 -116
2718a16l304L209k33k229M484Qk721K589j32j017J207j674j431N1l8O80j027J440
$$ -116 -3420 -211 -444 -2673 1811 1819 -902 1687 1555 538 1745 71 -1360 -1309 -1347 -667 -1694 -254
2736b54J69r20L550o40k175K835k595j591L387k616j585J456r84J204K219j720
$$ -254 -85 -1005 2545 1905 -270 2565 -30 -1621 1766 -850 -2435 -979 -1963 -759 1460 -260
2752b60J56N48J559L01k771K89O0j127J824k293j078L574j041O3J775j855J855
$$ -260 -104 444 2003 2304 -467 -178 -118 -1245 579 -1714 -2792 782 -259 -196 1579 -276 1579
2769A579J241l072L32j54k88P96k629j58J924K92J623j334j107L482r07m49r09
$$ 1579 2820 -252 80 -74 -362 434 -2195 -2353 -429 -137 1486 152 -955 2527 1620 1171 262
2786B62k262K067O50k736J102j466Q78L698j946j56J264j224J783o25k437O89
$$ 262 -2000 67 717 -2019 -917 -2383 -1505 2193 247 91 1355 131 1914 1289 -1148 -459
2802d59r10j96J310j070P37M45l30K176j159K97J595l227O44J160l424J794O06
$$ -459 -1369 -1565 -255 -1325 -588 -143 -473 1703 544 841 2436 -791 -147 1013 -2411 -617 -11
2819a1k489K284J90m85K316n27l56q06P71J047k706q11O61j957L343Q79m294K694
$$ -11 -2500 -216 -26 -511 1805 1278 922 116 887 1934 -772 -1583 -922 -2879 464 1343 -2951 -257
2837b57J158p51L395k510l032K876J03j282j047l42O20m55K205r7k209L439M94
$$ -257 901 150 3545 1035 -1997 879 982 -300 -1347 -1689 -1069 -1524 681 584 -1625 1814 2308
2854B308l285L597j780k397L395l240j980M163j013r69J511n56Q46J071J018j895
$$ 2308 -977 2620 840 -1557 1838 -1402 -3382 781 -232 -1201 310 -246 600 1671 2689 794
2870G94k508L201j151k423L285l768j245O031k322j122M122l466M82L347k811
$$ 794 -1714 1487 336 -2087 1198 -2570 -3815 2216 -106 -1228 2894 -572 -90 3257 446
2885D46o59n67j37M58o11N91j123q5M163k286n18L683m134L51L892n651M89K763
$$ 446 -213 -780 -917 -459 -1070 -479 -1602 -1687 2476 190 -328 3355 -779 -428 3464 -2187 -1698 1065
2903A065l270M53J688o92P68M02O77p66J51K495l194o57J921l727J685K722m762
$$ 1065 -2205 -1752 -64 -756 12 414 1091 325 476 2971 -223 -880 1041 -2686 -1001 1721 -3041
2920c041J526L070k533K705O92k751J395J54r68o23r21N56j367J619J648k896
$$ -3041 -1515 1555 -978 1727 2419 -332 1063 1217 249 -374 -1295 -739 -2106 -487 1161 -1735
2936a735J716K692l370K464J020l976J330O99k817J753q30j235J807N46N02k16
$$ -1735 -19 2673 -697 1767 2787 -1189 141 840 -1977 -224 -1054 -2289 -482 64 566 350
2952C50P34P45k135J423N73l243J992l57l232L088M33k136K669n64o31K603o96
$$ 350 1084 1829 -306 1117 1690 -1553 439 82 -3150 -62 371 -1765 904 340 -291 2312 1616
2969A616q90o62o04Q98j480K43J80j447K322P27j353K156p22j362K738j631j494
$$ 1616 726 64 -540 358 -1122 -879 -699 -2146 176 903 -450 1706 984 -378 2360 729 -765
2986g65J192j911m55J518m51P35j86K94J168p73J349j37k383J397n77j462J595
$$ -765 427 -1484 -1939 -421 -872 -137 -323 -29 1139 366 1715 1578 -805 592 15 -1447 148
3003A48j760p00K543p12O12J109r27R28j0p79K32j405j7L85j151Q80J5n11J530
$$ 148 -1612 -2312 231 -481 131 1240 313 1241 1231 452 684 -721 -738 -353 -1504 -624 -609 -1120 410
3022D10j15J13J852j875j45P82j933O89q7j614R92O1N35J078o30O45M46q90J282
$$ 410 295 408 2260 385 240 1022 -911 -222 -309 -1923 -931 -870 -335 743 113 758 1204 314 1596
3041A596j230j111P88j017N6R40j610J209P29n39J859o08l03Q88j948K66L41j578
$$ 1596 366 -745 43 -974 -918 22 -1588 -379 350 -189 1670 1062 759 1647 -301 -35 306 -1272
3059a272M70m92k2J946p87J50J099j076J034M81j042n2r02p73J216j487M40J108
$$ -1272 -802 -1294 -1316 630 -157 -7 1092 16 1050 1531 489 437 -465 -1238 -22 -1509 -1069 39
3077C9j187J869K58p18J268j049k72P97j633K45m97j214J620k13J52J166o91Q50
$$ 39 -1148 721 979 261 1529 480 208 1005 -628 -383 -880 -2094 -474 -687 -535 631 -60 790
3095G90N52j296R56p00j093J078j336l42J250j470J370P31p13J854o23m19J100
$$ 790 1342 46 1002 302 -791 287 -1049 -1391 -141 -1611 -241 490 -223 1631 1008 589 1689
3112A689j961M69k20j770J394l69o58J755r89J023J471k069J607J1j731J028r73
$$ 1689 -272 197 -23 -1793 -399 -768 -1426 329 -660 363 1834 -235 1372 1383 -348 680 -293
3129b93q88J189j791J107J297j666J788K50j189K126j340k60Q88k471R48l91q43
$$ -293 -1181 8 -1783 -676 621 -1045 743 993 -196 1930 590 330 1218 -1253 -305 -696 -1539
3146a539J508o80j97K313j596J005R84j839J063m12j648J705j985k0J385j879
$$ -1539 -31 -711 -908 1405 -191 814 1798 -41 1022 610 -1038 667 -1318 -1338 47 -1832
3162a832J667Q28j349J909n62l66J506k286M52l8j860J489J63j286J834l38q0
$$ -1832 -165 663 -686 1223 661 295 1801 -485 -33 -71 -1931 -442 -279 -1565 269 -69 -149
3179a49K035j754R58m7j559J345j019j126J289j503R65O42p77J944o88l93J832
$$ -149 1886 132 1090 1043 -516 829 -190 -1316 -27 -1530 -565 77 -700 1244 556 163 1995
3196A995j523k19J133k671M53M79j244J454l08m08J890j191R43J104j526M16o29
$$ 1995 472 253 1386 -1285 -832 -353 -1597 -143 -451 -859 1031 -160 783 1887 361 777 148
3213A48j116J432j910M28O96j520K128O57j536K212k30j222J200j542J61J93j643
$$ 148 -968 464 -1446 -1018 -322 -1842 286 943 -593 1619 1389 167 1367 -175 -14 179 -1464
3230a464Q18n67j16K162j249O21J169j695K018o23k186J706j326m60J952k208
$$ -1464 -646 -1213 -1329 833 -416 205 1374 -321 1697 1074 -1112 594 -732 -1192 760 -1448
3246a448j07J871q36J224L06m82N62p47J49K08j992J089l07j656K246n23m28K245
$$ -1448 -1555 316 -520 704 1010 528 1090 343 492 700 -1292 -203 -510 -2166 80 -443 -871 1374
3264A374j312M39J436j632J94K18j741M80k78N0M51q73P65O11j81K210j542j011
$$ 1374 62 501 1937 305 499 717 -1024 -544 -822 -772 -321 -1194 -429 182 1 2211 669 -342
3282c42J973j545k00M04k410O73J767j480Q46L46j9J198p2k17m01p63J001j454
$$ -342 1631 86 -114 290 -2120 -1447 320 -1160 -314 32 13 1211 1139 922 521 -242 759 -695
3300f95o52J257j417O33J557k120J293K207j651L23J41j384J120q14o34k55R9
$$ -695 -1347 -90 -1507 -874 683 -1437 -144 2063 412 735 876 -508 612 -202 -836 -1091 -992
3317i92L79J32M38N88o64J264P65k008N51J94j722J213j21j610O83O05j2P85l0
$$ -992 -613 -481 -43 545 -119 1145 1910 -98 453 647 -1075 138 17 -1593 -910 -305 -317 468 438
3336D38l15O00P11k19j852j47L35p33J182n94j311J971L53n87J514n96p76J607
$$ 438 123 723 1434 1215 -637 -784 -449 -1182 0 -594 -1905 66 419 -168 1346 750 -26 1581
3354A581r80j190l1K91o41m06Q65N43m01J463qj341J453l27j175J504k121o83
$$ 1581 601 -589 -620 -329 -970 -1376 -511 32 -369 1094 1086 -255 1198 871 -304 1200 -921 -1604
3372a604J809q91l82R08n72J103P88l8p00o62R48k1j081J13q39q59K372p42n04
$$ -1604 205 -686 -1068 -160 -732 371 1159 1121 421 -241 707 686 -395 -282 -1121 -1980 392 -350 -854
3391h54J823j018L81J760j828J20J14j054M87o17O7J93j014J397K49j16J393q80
$$ -854 969 -49 332 2092 264 384 498 -556 -69 -686 -619 -426 -1440 -43 206 90 1483 603
3409F03m70J331j921O65L48j777L17O31l45O37k49K52P69l37O73r0j484J016j114
$$ 603 133 1464 -457 208 556 -1221 -904 -273 -618 19 -230 22 791 454 1127 1037 -447 569 -545
3428e45n22J152j270K91R50n55J218k04n74J712j414J03K37j371J71l03o57J379
$$ -545 -1067 85 -1185 -894 56 -499 719 515 -59 1653 239 342 579 -792 -621 -924 -1581 -202
3446b02k77P1J477j037N43J030j201J78p02o73Q95j034j88N67r38J933N93j516
$$ -202 -479 -408 1069 32 575 1605 404 582 -120 -793 102 -932 -1120 -553 -1491 442 1035 -481
3464d81J310n20l7J651k015p74Q77j046L50o6m24J349p86J187O57r01J098r54
$$ -481 829 309 272 1923 -92 -866 11 -1035 -685 -751 -1175 174 -612 575 1232 331 1429 475
3482D75j175J577j431m90J493k052M10K383j633P88N62r10J225m85k38n17j046
$$ 475 -700 877 -554 -1044 449 -1603 -1193 1190 -443 345 907 -3 1222 737 499 -18 -1064
3499a064J135n82q02K104j587m3K582j847P85J599l117N18J251j290L62q89o77
$$ -1064 71 -511 -1313 791 -796 -839 1743 -104 681 2280 -837 -319 932 -358 4 -885 -1562
3516a562O10R57N20j065M06J873j560J68J515k921P18J581l214R98J212j417J051
$$ -1562 -952 5 525 -540 -134 1739 179 347 1862 -1059 -341 1240 -1974 -976 236 -1181 -130
3533a30M93q56J815o3l98o22J01K32j756M80L82j700K002J350k681J751R78k112
$$ -130 363 -493 1322 1259 861 239 340 572 -1184 -704 -322 -2022 -20 1330 -1351 400 1378 -734
3551g34K372o06j918P49K78r41K35K58n33m55J506J238j760J598k6k033K249n18
$$ -734 1638 1032 -886 -137 141 -800 -565 -307 -840 -1295 211 1449 -311 1287 1261 -772 1477 959
3569I59k579J528k10j438J852k40r24J828K88j097N59P76o70j152P74l22j514
$$ 959 -1620 -92 -302 -1740 112 -128 -1052 776 1064 -33 526 1302 632 -520 254 -68 -1582
3586a582K105j088j392K698l2j276K083o65r98J545q81j394O40M6m20k54J193
$$ -1582 523 -565 -1957 741 709 -567 1516 851 -147 1398 517 -877 -237 -191 -611 -865 328
3603C28m03p09J773l89o47K139j681j321K038j407p72R51j270N0J989m65j57J70
$$ 328 -75 -784 989 600 -47 2092 411 -910 1128 -279 -1051 -100 -1370 -1320 669 204 47 217
3621B17R69n59k55N39j102o07J179j749K81J693j399K07J607j154N60J130j514
$$ 217 1186 627 372 911 -191 -798 381 -1368 -1087 606 -793 -586 1021 -133 427 1557 43
3638D3j65N51p95J95o78K46n5L5R84l78M28J085j106J0J190j998j46P85j282M98
$$ 43 -122 429 -366 -171 -849 -603 -658 -623 361 -17 411 1496 390 400 1590 -408 -554 231 -1051 -553
3658e53N51r57O62N62rR51m76L0m09j99M60j709L47O93j112Q46Q18r45P87N22
$$ -553 -2 -959 -297 265 256 1207 731 761 352 153 613 -1096 -749 -56 -1168 -322 496 -449 338 860
3678H60r97J052p5p22R8j002K42K23m88K52j79P72Q76o11K10O93j372P41j43j397
$$ 860 -137 915 840 118 216 -786 -544 -321 -809 -557 -736 36 912 301 511 1204 -168 573 430 -967
3698i67Q50q26k57J037l6L47L10q3M52j86K6O7j098j17K30q37O67Mo35J100k69
$$ -967 -117 -943 -1200 -163 -199 148 458 375 827 641 667 734 -364 -481 -251 -1088 -421 -417 -1052 48 -221
3719b21L16J021j077O76J04j034L59m63n87R11j011N44Q80q71Q54M94p37J136
$$ -221 95 1116 39 715 819 -215 144 -319 -906 5 -1006 -462 418 -453 401 895 158 1294
3737A294q71p61P28j157N04O8j088J146k96J82Q79l02L57L59j133Q05o19q12O95
$$ 1294 423 -338 390 -767 -263 -195 -1283 -137 -433 -251 628 326 683 1042 -91 714 95 -717 -22
3756b2q88r5R25n23N87M14o01J220k98o57Q39r41l21N02j059L99J27q28J745m80
$$ -22 -910 -1005 -80 -603 -16 398 -203 1017 719 62 901 -40 -361 141 -918 -519 -392 -1220 525 45
3776D5J59R37r93P54J79j623P41o73o40R84j088N09Q91o17Q99M30p62R31q29k05
$$ 45 204 1141 148 902 1081 -542 199 -474 -1114 -130 -1218 -709 182 -435 464 894 132 1063 234 29
3796B9N28j095j35M08j049J323l24n20J558n61L13O62j216M50p0j010P29q36P1
$$ 29 557 -538 -673 -265 -1314 9 -315 -835 723 162 475 1137 -79 371 301 -709 20 -816 -745
3815g45N43p93Q36Q55l16R75p14p80J051r50k7j08j297R78M11j093J355j51j28
$$ -745 -202 -995 -159 696 380 1355 641 -139 912 -38 -65 -173 -1470 -492 -81 -1174 181 30 -98
3834i8J082n63K58P3j019N9L3j023J283j001L20N95p23J126N61j048R42n39m21
$$ -98 984 421 679 752 -267 -208 -175 -1198 85 -916 -596 -1 -724 402 963 -85 857 318 -103
3853a03P02j414L57r8m60R40o7q8R68j91J98K83q96O03m27j403R50o06j73Q37
$$ -103 599 -815 -458 -556 -1016 -76 -143 -231 737 546 744 1027 131 734 307 -1096 -146 -752 -925 -88
3873h8p65R66O18o26L76L73p77O08p41j97O33j331M95R2m09R51k54j78J047o63
$$ -88 -853 113 731 105 481 854 77 685 -56 -253 380 -951 -456 -364 -773 178 -76 -254 793 130
3893A30M24J8j122L68J02q30O01n97L92N97J7L75%l98R53q94j72J31m65J5J60
$$ 130 554 572 -550 -182 -80 -910 -309 -906 -514 83 100 475 475 77 1030 136 -36 95 -370 -355 -195
3914a95j077P65N64l76J030o83M88M55n75k50Q2j040N47m23l4L53n79J042O70
$$ -195 -1272 -507 57 -319 711 28 516 971 396 146 228 -812 -265 -688 -722 -369 -948 94 764
3933G64p04M25O04r98L17j75n15K1l0k22K2j17O01K69k84J044j190O44M43r08
$$ 764 60 485 1089 91 408 233 -282 -261 -291 -513 -491 -608 -7 262 -22 1022 -168 476 919 11
3953A1k11j24p52Q99p4n77O76j4P00J86O1l11k25r8R3j065j25R40q97P56M35n86
$$ 11 -200 -324 -1076 -177 -251 -828 -152 -166 534 720 781 470 245 147 240 -825 -950 -10 -907 -151 284 -302
3975c02N58M47m25L32p37L8L44m15K5n28L17J01J01L0O77o83J072m4j371R39l49
$$ -302 256 703 278 610 -127 -89 255 -160 -135 -663 -346 -245 -144 -114 563 -120 952 908 -463 476 127
3996A27r76Q19o69o00R07L34j32L96l49R69j55r0Rj219L73L54n43jJ58p22J648
$$ 127 -849 -30 -699 -1299 -392 -58 -190 206 -143 826 671 581 590 -629 -256 98 -445 -446 -288 -1010 638
4017F38j42o01Q73n49M44j04q58j45K57j85J66q41N95P61l81R19l27r21J785j002
$$ 638 496 -105 768 219 663 559 -299 -444 -187 -372 -206 -1047 -452 309 -72 847 520 -401 1384 382
4037C82q02O93r62O95L31r86K45L13n8O57l99L55O2p01P16m87p07O47p97L3J168
$$ 382 -420 273 -689 6 337 -649 -404 -91 -149 508 109 464 526 -175 541 54 -653 -6 -803 -770 398
4058C98r24J54N32J13P64m76n70K50j88j99Q6j062N05N43l29P07l91J93J164j179
$$ 398 -526 -372 160 273 1037 561 -9 241 53 -146 -60 -1122 -617 -74 -403 304 -87 106 1270 91
4078I1k29P37p60O04p21q05J021l34K96K45r21J198M34o38P63j014m62J264j363
$$ 91 -138 599 -161 443 -278 -1083 -62 -396 -100 145 -776 422 856 218 981 -33 -495 769 -594
4097e94J57k00k87Q20K71m76P27p20Q74M34j256Q18l99j143J131p89l37J581j185
$$ -594 -437 -637 -924 -104 167 -309 418 -302 572 1006 -250 568 169 -974 157 -632 -969 612 -573
4116e73L92R49m85O97k25p20M37p08L33m8j214R43k47j34J622j398L23J138q78
$$ -573 -181 768 283 980 755 35 472 -236 97 49 -1165 -222 -469 -603 1019 -379 -56 1082 204
4135B04j50P11j299K48K63p20P45o31K64K72n77J425l42k92Q97j075k11J056j351
$$ 204 54 765 -534 -286 -23 -743 2 -629 -365 -93 -670 755 413 121 1018 -57 -268 788 -563
4154e63l98R40p50Q10K54p24P19K18m3k1n25K58m3q05P96j266P30R17j223O90
$$ -563 -961 -21 -771 39 293 -431 288 506 463 442 -83 175 132 -673 123 -1143 -413 504 -719 -29
4174b9J119j027P30M3j205J072r9r23l79j30O67J94k90M0j57R19P80j763O26M10
$$ -29 1090 63 793 836 -369 703 604 -319 -698 -828 -161 33 -257 -217 -374 545 1325 -438 188 598
4194E98j310R65k89j396R57K44m76J128m3J69J23m0m34k51K94pj438P76M94r70
$$ 598 -712 253 -36 -1432 -475 -231 -707 421 378 547 670 630 196 -55 239 232 -1206 -430 64 -906
4214i06R00q1p87J771j05q86N90j30n26P3M6n89m5K03N6o03J648j1r75J250n34
$$ -906 -6 -87 -874 897 792 -94 496 366 -160 -87 -41 -630 -675 -472 -416 -1019 629 618 -357 893 359
4235C59o80J331j118q65J032n09M6J97k77J76Q59j79L30o41J010n02r93R04p87
$$ 359 -321 1010 -108 -973 59 -450 -404 -207 -484 -308 551 372 702 61 1071 569 -424 480 -307
4254c07p53J113q14O0J331p61N6P86m82j05P60p80n56R4K90j09l42N62q51N28
$$ -307 -1060 53 -761 -701 630 -131 -75 711 229 124 884 104 -452 -358 -68 -177 -519 43 -808 -280
4274b80J481j218K24P09r22j27J002j323j72O77p81L38Q29l56L7K60L7j15O4J82
$$ -280 1201 -17 207 916 -6 -133 869 -454 -626 51 -730 -392 437 81 118 378 415 300 364 546
4294E46r85q6L95n71q6R73q64O96R38j078M57J91m58R1K59o87J4j17Pj36J81P33
$$ 546 -439 -525 -130 -701 -787 186 -678 18 956 -122 335 526 68 159 418 -269 -255 -372 -365 -501 -320 413
4316D13p13L23M35q26J076K86j524O41O8r18J99K95k62O60m59N09o3N3M94m92
$$ 413 -300 23 458 -368 708 994 -530 111 179 -739 -540 -245 -507 153 -306 203 140 193 687 195
4336A95J39J08j090M92n1p62Q37K00o84J156m16n3N67n45J31l32O7J08m69j56
$$ 195 334 442 -648 -156 -207 -969 -132 68 -616 540 124 71 638 93 224 -108 -41 67 -402 -558
4356e58L88m34J201m5p52J171l70o97Q00n47o94L00k77K56J18j48M71M4qN97p57
$$ -558 -170 -604 597 552 -200 971 601 -96 704 157 -537 -237 -514 -258 -140 -288 183 227 219 816 59
4377E9K10J79j082R37k49r33J102o28l3Q63n94N10N14j039Q17j67n68K27j065
$$ 59 269 448 -634 303 54 -879 223 -405 -438 425 -169 341 855 -184 633 466 -102 125 -940
4396i40L59M10l20N16l79j82J247m15k09Q32q50J13l3m30K24m25l73P36L8J10
$$ -940 -581 -171 -491 25 -354 -536 711 296 87 919 69 182 149 -281 -57 -482 -855 -119 -81 29
4416B9N74r64R29j09n43P64q02k24N06q22N91J81r86J159Q2m30R40p97M66k07
$$ 29 603 -361 568 459 -84 680 -122 -346 160 -662 -71 110 -876 283 365 -65 875 78 544 337
4436C37m35Q6J39j150R24o12K71O75j50M40K26q76Q11m29m79L49p74M42j67l06
$$ 337 -98 -12 127 -1023 -99 -711 -440 235 85 525 751 -125 686 257 -222 127 -647 -205 -372 -678
4456f78O94j89k10J050l18n9N05r75O05l03o72J24q1N3M22k51N15K16l10L96L7
$$ -678 16 -173 -383 667 349 290 795 -180 425 122 -550 -426 -507 -454 -32 -283 232 448 138 534 571
4477E71p93P99q42k99Q32q84R22p45L2O98j24O5L90k43R8q0q64M43p5l86M73m40
$$ 571 -222 577 -265 -564 268 -616 306 -439 -407 291 167 232 622 379 477 397 -467 -24 -99 -485 -12 -452
4499d52L39L56m25Q43K35q78J99K9n16K12k79rN5l05O00K68j06L99m05m3O87o35
$$ -452 -113 243 -182 661 896 18 217 246 -270 -58 -337 -346 -291 -596 4 272 166 565 160 117 804 169
4521A69P0o2p54K51J66p80J014m93L40M69k20L57ql67L27n33j74k08j82J21N26
$$ 169 239 177 -577 -326 -160 -940 74 -419 -79 390 170 527 519 152 479 -54 -228 -436 -618 -497 29
4542B9o17Q53K10l63M11j74J51J27o00j22p7m65M06k18J77R31l73j59M04n24K55
$$ 29 -588 265 475 112 523 349 500 627 27 -95 -172 -637 -231 -449 -272 659 286 127 531 7 262
4563B62Ql51J76o28j35N08l69K97N83n52M43J87j43K21p13L17J81p16o5M85o47
$$ 262 270 -81 95 -533 -668 -160 -529 -232 351 -201 242 429 286 507 -206 111 292 -424 -489 -4 -651
4584f51P09k36J93K02n5K34L42p84L07l65m99M36k66K07J0l38P73J66n23O79j3
$$ -651 58 -178 15 217 162 396 738 -46 261 -104 -603 -167 -433 -226 -216 -554 219 385 -138 541 528
4605E28j34qm47l34M69p21M41P2j39M21q4J5N43o73L07J60p69J03l01K94K71o60
$$ 528 394 386 -61 -395 74 -647 -206 -134 -273 148 64 79 622 -51 256 416 -353 -250 -551 -257 14 -646
4627f46L76N40m17L97O68r74O83m82q3m2r02Q34J9k92R6J85k07P69l03OJ71n25
$$ -646 -270 270 -147 250 918 -56 627 145 62 20 -882 -48 -29 -321 -225 -40 -247 522 219 225 396 -129
4649a29N06J3r81N31n12R4M47m29L2P35m91L40M38n35N95r51L8K36p54L72N05
$$ -129 377 390 -591 -60 -572 -478 -31 -460 -428 307 -184 156 594 59 654 -297 -259 -23 -777 -405 100
4670A00m76N00n8L57K44o93P4O8m19K51N9p56P11n35K19J096r36K26P24m69K70
$$ 100 -376 124 66 423 667 -26 48 116 -303 -52 7 -749 -38 -573 -354 742 -194 32 756 287 557
4691E57k55o08M93n35j11j08l44R94O9j81O74n49j88Q92o94k00o4j39L93k40o57
$$ 557 302 -306 187 -348 -459 -567 -911 83 152 -29 645 96 -92 800 106 -94 -158 -297 96 -144 -801
4712h01R52l14K07M00n79O34j85J47m0j155p1P62n38J77P37p57M46L26j22J83
$$ -801 151 -163 44 444 -135 499 314 461 421 -734 -805 -43 -581 -404 333 -424 22 348 226 409
4732D09p21N11O0m04K93m00l27M97j52j78O89m89N21N39r50R34l01o53L75l95
$$ 409 -312 199 259 -145 148 -252 -579 -82 -234 -412 277 -212 309 848 -102 832 531 -122 253 -142
4752a42k53L5J40j87N93l67P43k98J36J13r96N29J33p77M68j20l56O46j24k93
$$ -142 -395 -360 -220 -407 186 -181 562 264 400 513 -483 46 179 -598 -130 -250 -606 40 -84 -377
4772c77J117n81K13K55m88J29m02R5K89r21L98N59q35J122n17K77L27n69n6K33
$$ -377 740 159 372 627 139 268 -134 -39 250 -671 -273 286 -549 573 56 333 660 91 35 268
4792B68k37r2L21m38K20n1k84L95l50O24NOJ33Q0j215O18k99LL43r12Q27J47R2
$$ 268 31 -61 260 -178 42 -9 -293 102 -248 376 381 387 520 600 -615 3 -296 -293 50 -862 -35 112 204
4815B04L26l92j58K12j07J8P1p46Q62q55O8N72n80K40O14j00L92m1r81K96L4k23
$$ 204 530 138 -20 192 85 103 174 -572 290 -565 -497 75 -505 -265 349 249 641 600 -381 -85 -51 -274
4837b74K12n29J66M51p8M17j45KJ51j64l09N35n01j07K74o11N52l11J39M07l91
$$ -274 -62 -591 -425 26 -52 365 220 222 373 209 -100 435 -66 -173 101 -510 42 -269 -130 277 -114
4858a14K58O78q14L58m99k7L86n84RR2k56L52K80J0J31j15j03M16p30J33N50j030
$$ -114 144 822 8 366 -133 -160 226 -358 -349 -257 -513 -161 119 129 260 145 42 458 -272 -139 411 -619
4880f19m8O44o60L46K42r3N76k4o6k93l4M17m42kj87m13K10M59l55K97L24l32
$$ -619 -667 -23 -683 -337 -95 -188 388 364 298 5 -29 388 -54 -56 -243 -656 -446 13 -342 -45 279 -53
4902e3P36m03m19N09l29m44M02O2n35M13l05O29l15J39L24q0r7j57l39N73l13
$$ -53 683 280 -139 370 41 -403 -1 61 -474 -61 -366 263 -52 87 411 331 234 77 -262 311 -2
4923bn25L77j83J23O44n61M0N26m67M07K0l77k65j64K78R3n66N78J02j94N00m46
$$ -2 -527 -150 -333 -210 434 -127 -87 439 -28 379 399 22 -243 -407 -129 -36 -602 -24 78 -116 384 -62
4945f2k67R22p15J78M1k44k8k45O6K42j81M37j16J21M79o7n17L09o22j17M55l45
$$ -62 -329 593 -122 56 97 -147 -175 -420 -354 -112 -293 144 28 149 628 561 44 353 -269 -386 69 -276
4967b76N1L10n88O78p7j06N61m15O0N3n56L15k59k65K97k42M69K35m19K35M86
$$ -276 -225 85 -503 175 98 -8 553 138 198 251 -305 10 -249 -514 -217 -459 10 245 -174 61 547
4988E47o07L97J9k85n0L3m40J26k49M68j16J46J33K22J70Pn43J65j24l75J54O1
$$ 547 -60 337 356 71 21 54 -386 -260 -509 -41 -157 -11 122 344 514 521 -22 143 19 -356 -202 -141
5010a41n54Q63k90L03J13j88Q6K36k64O1l91o6M2l52K26L50m47Q84j61o35R99
$$ -141 -695 168 -122 181 294 106 192 428 164 225 -166 -232 -190 -542 -316 34 -413 471 310 -325 674
5031F74l79k70J80q3k95J36k63j53K48k30M89q2K12K51l88J61k15l24N69l49k98
$$ 674 295 25 205 122 -173 -37 -300 -453 -205 -435 54 -28 184 435 47 208 -7 -331 238 -111 -409
5052d09N18m58L23M71r11P88m25M87N9l10k10p0j62M77l48M0L26l06L15mj19J41
$$ -409 109 -349 -26 445 -466 322 -103 384 443 133 -77 -147 -309 168 -180 -140 186 -120 195 191 72 213
5074B13L21n58K55l86j37K79k85K50j57j88P73l20j22N32k09o2K77j049K51M86
$$ 213 534 -24 231 -155 -292 -13 -298 -48 -205 -393 380 60 -62 470 261 199 476 -573 -322 164
5094A64p72N66r8k08N88k34J36P8l87O60O9p02J74m56P8J31m1K33o8j65M06o9
$$ 164 -608 -42 -140 -348 240 6 142 220 -167 493 562 -140 34 -422 -344 -213 -254 -21 -89 -254 152 83
5116H3j09O44n16j02J32n64J91j51K03J72j58L35J45r0k40M54l57K20o1o42K91
$$ 83 -26 618 102 0 132 -432 -241 -392 -189 -17 -175 160 305 215 -25 429 72 292 231 -411 -120
5137a20k49L09J30K7L3o8K31KMk18K84m28j62J40j38J55k07M3N45m57Q5N38l88
$$ -120 -369 -60 70 97 130 62 293 295 299 81 365 -63 -225 -85 -223 -68 -275 -232 313 -144 -59 479 91
5160I1N4j39Nq7j22J91p1k26J2M29pK7M70n03P5K38l03j34m32J11L8j51K46J37
$$ 91 145 6 11 -76 -198 -7 -78 -304 -292 137 130 157 627 124 199 437 134 0 -432 -321 -283 -434 -188 -51
5184e1p8K64p1R4K70n96J48n5j75K06Rk08L87n15J99K47k94K72K63m28M16m44
$$ -51 -129 135 64 158 428 -168 -20 -75 -250 -44 -35 -243 144 -371 -172 75 -219 53 316 -112 304 -140
5206a40J30l1l08K99Q1l67M61K3j81K38k25K14L8q8m46R2Q7J10m69N38Q0M0L6
$$ -140 -10 -41 -349 -50 31 -336 125 148 -33 205 -20 194 232 144 -302 -210 -123 -13 -482 56 136 176 212
5229B12J48r6k05L6l88N24o25K5K73k06K14L48j22J13l48J32J75q3J7l8l79K79
$$ 212 360 264 59 95 -293 231 -394 -369 -96 -302 -88 260 138 251 -97 35 210 127 144 106 -273 6
5251Fq3k30L50r9k49N40m70M99K69o67L91J39o49NJ0j01J59j48P00k04o5N25n51
$$ 6 -77 -307 43 -56 -305 235 -235 264 533 -134 257 396 -253 -248 -238 -339 -180 -328 372 168 103 628 77
5274G7O5K60l09m29L12j78%j2L1K22J1J56j10j93O20o76K52J5p25Q4N18k18j21
$$ 77 142 402 93 -336 -24 -202 -202 -214 -183 39 50 206 96 -97 523 -153 99 114 -611 -527 -9 -227 -348
5297c48K84k48L02K60N8J82k73l89J84l86N33k03l53N03k85L5M61k0j30L30k22
$$ -348 -64 -312 -10 250 308 490 217 -172 12 -374 159 -44 -397 106 -179 -144 317 297 167 497 275
5318B75R1l81m45L12J08j24L14m25M73j33j86M31j5k02P7l56j93J13m58O85k25
$$ 275 366 -15 -460 -148 -40 -164 150 -275 198 65 -121 310 295 93 170 -186 -379 -266 -724 -39 -264
5339b64J02K29l6J2J62n25Q95l18n15N91p41P5J31m31O67q2k79P18k36o3J16P8
$$ -264 -162 67 31 43 205 -320 575 257 -258 333 -408 -333 -202 -633 34 -48 -327 391 155 92 208 286
5361B86m19m6P8J94o48K64L49k63K11N98q68N01P81j266K57r1j77K26l61L35J09
$$ 286 -133 -179 -101 93 -555 -291 58 -205 6 604 -264 237 1018 -248 9 -82 -259 -33 -394 -59 50
5382E0n6L53l06r7M24l16R7k73m23N28K20l46R2J0q3P56n94K19n03J73L60k17
$$ 50 -6 347 41 -56 368 52 149 -124 -547 -19 201 -145 -53 -43 -126 630 36 255 -248 -75 285 68
5404F8k52K38m50J28L44n98L23K74j32K48M05q31O34j35j14j16j71O3j17P2J96
$$ 68 -184 54 -396 -268 76 -522 -199 75 -57 191 596 -235 399 264 150 34 -137 -74 -191 -119 77
5425G7m48K69K39l3M75k52l74M16l23n45Q2J53J47Q9N1o56P62L33k03j12J19j81
$$ 77 -371 -102 137 104 579 327 -47 369 46 -499 -417 -264 -117 -28 23 -633 129 462 259 147 266 85
5447H5r9J1n62M8O69k60k07O96m87p6R67l58q4K6n97J7j17k1j8J09R0J27q6N78
$$ 85 -14 -3 -565 -517 152 -108 -315 381 -106 -182 785 427 343 369 -228 -211 -328 -349 -367 -258 -168 -41 -127 451
5471D51l08k00M48n6n19M48k96l03K09N7L33n03o3J12n0N70l40L21j70m37J75
$$ 451 143 -57 391 335 -184 264 -32 -335 -126 -69 264 -239 -302 -190 -240 330 -10 311 141 -296 -121
5492a21M01o34j27M93k83M7M99m74N80J07n55L37n15K6M2q4q2K33k87M07j25M38
$$ -121 280 -354 -481 12 -271 -224 275 -199 381 488 -67 270 -245 -219 -177 -261 -343 -110 -397 10 -115 323
5514C23k95o7M54Q3n98P2N2k51K03o2k25MK7K50L07k25J5n8L5J46o07N11j03o96
$$ 323 28 -39 415 498 -100 -28 24 -227 -24 -86 -311 -307 -280 -30 277 52 67 9 44 190 -417 94 -9 -705
5538g05M54M40m8J25K1k22J43k40j38J87k79NJ9k45J43M63l85L93k05K21p8j81
$$ -705 -251 189 141 266 287 65 208 -32 -170 17 -262 -257 -238 -483 -340 123 -262 131 -74 147 69 -112
5560a12L96j82l03L17l38j00J70j59L16J74m4K29l32K40j33j30j13K40n47M97
$$ -112 284 102 -201 116 -222 -322 -152 -311 5 179 135 364 32 272 139 9 -104 136 -411 86
5580H6k12l80J094p84J33M10o17K34L49n64J23J55l35K43j03j3n3J31P00o00K04
$$ 86 -126 -506 588 -196 -63 347 -270 -36 313 -251 -128 27 -308 -65 -168 -181 -234 -103 597 -3 201
5601B01K25n08J61O6l83M0L00k31o8J74K46L5k75L12R7m30K23m92K21J43l52J79
$$ 201 426 -82 79 145 -238 -198 102 -129 -197 -23 223 258 -17 295 392 -38 185 -307 -86 57 -295 -116
5623a16oJ27K37m2m07N36j90j39j6k28J37K92o11M30R9l43K09J8K76M2k1J50k22
$$ -116 -122 5 242 200 -207 329 139 0 -16 -244 -107 185 -426 4 103 -240 -31 -13 263 305 284 434 212
5646B12r7j11l80R1M74k95R3L81n41M41J23n24p4M17L8k37j30k38o7P7O51m69
$$ 212 115 4 -376 -285 189 -106 -13 368 -173 268 391 -133 -207 210 248 11 -119 -357 -424 -347 304 -165
5668a65L38J46m18K40K89n47L80j05q30P89k64j46K24j18P4J15J65K10k95O2r2
$$ -165 173 319 -99 141 430 -117 263 158 -672 117 -147 -293 -69 -187 -113 2 167 377 82 144 52
5689E2J8L02m95l93L29L50l48M24j50n17R01o62L53j7m95K49l3l06N13n20K93
$$ 52 70 372 -123 -516 -187 163 -185 239 89 -428 473 -189 164 147 -348 -99 -132 -438 75 -445 -152
5710a52K49k89M67p6L6L62k27n41L46k94l19M61m48K76K50k31L48j25J08J01m47
$$ -152 97 -192 275 199 235 597 370 -171 175 -119 -438 23 -425 -149 101 -130 218 93 201 302 -145
5731a45K80k37j22K58l95M49K9n65N99j41j62N47l07k56N34l34p8J44m42L46K1
$$ -145 135 -102 -224 34 -361 88 117 -448 151 10 -152 395 88 -168 366 32 -46 98 -344 2 23
5752B3J2P1k6O0N88r14J98J7l48L30m1j53J8L35l84J16J65L42j25j80K48l87J79
$$ 23 35 106 80 140 728 -186 12 29 -319 11 -30 -183 -165 170 -214 -98 67 409 284 104 352 -35 144
5775A44p7k70J92J66n13K81J79j50L92k13L52j59k30m14N76m70J28m9k20M08p8
$$ 144 67 -203 -11 155 -358 -77 102 -48 344 131 483 324 94 -320 256 -214 -86 -135 -355 53 -25
5796b5J19j9R1L0J31j31m5j68k03K19l38L91j11J66j17P2j18O06m73q4n3j35M62
$$ -25 94 75 166 196 327 196 151 -17 -220 -1 -339 52 -59 107 -10 62 -56 550 77 -7 -60 -195 267
5819B67l39O9R3k09J07K77l79J93k5J98j78K90m06L43p44L52K2m65N94r9JJ75
$$ 267 -72 -3 90 -119 -12 265 -114 79 54 252 74 364 -42 301 -443 -91 -69 -534 60 -39 -38 137
5841A37R3l3J74m18O0J88o51K79P3j61L08j60J86K55k81K18k47P0j51L19m80M18
$$ 137 230 197 371 -47 13 201 -450 -171 -98 -259 49 -111 75 330 49 267 20 90 -61 258 -222 196
5863A96l00J3o5j32M86J2j72Q8k27J62K83k90k66k73LL53l2k55L22k54L58M12
$$ 196 -104 -91 -156 -288 198 210 38 126 -101 61 344 54 -212 -485 -482 -129 -161 -416 -94 -348 10 422
5885D22n71K02K0j35o4L1n3j38L18k42J66k50J92L20l0Q8l09K53k0l53L05m8n49
$$ 422 -149 53 73 -62 -126 -95 -148 -286 32 -210 -44 -294 -102 218 188 276 -33 220 200 -153 152 104 -445
5908d45N80j95M1K80l12K23R1j30R4k61l10J86N3k80N98k67j91L28n3Q6J02j27
$$ -445 135 -60 -19 261 -51 172 263 133 227 -34 -344 -158 -105 -385 213 -54 -245 83 30 116 218 91
5930I1j10j82J25J64k78K84j63j74j3J57k19O25m74K46lJ41J01m74j23q0J47O3
$$ 91 -19 -201 -76 88 -190 94 -69 -243 -256 -99 -318 307 -167 79 76 217 318 -156 -279 -359 -212 -149
5952a49J40J30P8j45l87N87k96M1L76n59j31K31l2j46M40l78P46l25r6N7l14J9
$$ -149 -9 121 199 54 -333 254 -42 -1 375 -184 -315 -84 -116 -262 178 -200 546 221 125 182 -132 -113
5974a13L24n09N50l48J76l2m11P22m81J76K11O1k91j50J23j50J12k8l1j13j08
$$ -113 211 -298 252 -96 80 48 -363 359 -122 54 265 326 35 -115 8 -142 -30 -58 -89 -202 -310
5995c10M91K04m81N11n80L80j92l85K84n2k67M32q1j25L95j04p7L5n7K14k35J7
$$ -310 181 385 -96 415 -165 215 23 -362 -78 -130 -397 35 -46 -171 224 120 43 78 21 235 0 17
6017A7Ln43K06L83m23M9M66k00M10l5k31J84k57k02N52o45L98P6m21L53k78l9
$$ 17 20 -523 -317 66 -357 -308 158 -42 368 333 102 286 29 -173 379 -266 132 208 -213 140 -138 -177
6039a77K58m2L33k73l9J62j09j82K88l23O3j43J68L83m15KJ96l06L16L36l39l6
$$ -177 81 39 372 99 60 222 113 -69 219 -104 -41 -184 -16 367 -48 -46 150 -156 160 496 157 121
6061A21K1m30J3o3K81K68l30K53J83L0m39M87j03j10j57j01J42j42J22r5R7K42
$$ 121 142 -288 -275 -338 -57 211 -119 134 317 347 -92 395 292 182 25 -76 66 -76 46 -49 48 290
6083B90n16L19J78l68P6Q1J0Q9k83j56N34l64J93O9n6j63M31m15l0O8j88M42k93
$$ 290 -226 93 271 -97 -21 60 70 159 -124 -280 254 -110 83 152 96 -67 364 -51 -81 -13 -201 241 -52
6106e2O7k58j53L68J22K4K56j61Mo8L5j26k86r0O12k60k41K47N0p0Q8J11M7o0
$$ -52 15 -243 -396 -28 94 118 374 213 217 149 184 58 -228 -318 294 34 -207 40 90 20 108 219 266 206
6130B06l54J15K8r6K24l21M39j30n20P48n01K50kqj04K15k72M5j23l1j03K07J11
$$ 206 -148 -33 -5 -101 123 -198 241 111 -409 339 -162 88 86 78 -26 189 -83 -38 -161 -192 -295 -88 23
6153B3KO3R0J09k94M3p7p6k9J33k29K06j77Q4Q4K19k51p8M79Q9k94Rm7k32J83
$$ 23 25 88 178 287 -7 36 -41 -117 -146 -13 -242 -36 -213 -129 -45 174 -77 -155 324 413 119 128 81 -151 32
6178C2j37m9J78q2m7K3j35M51J22n12L08m07n7K87J08k61K9N6K01K2L3j8J15j30
$$ 32 -105 -154 24 -58 -105 -82 -217 234 356 -156 152 -255 -312 -25 83 -178 -149 -93 108 130 163 145 260 130
6202A30k41k48N46k81P5l58K66j56J28K88j12J00n52N03N2p8l22K89k84L25k71
$$ 130 -111 -359 187 -94 -19 -377 -111 -267 -139 149 37 137 -415 88 140 62 -260 29 -255 70 -201
6223b01J86J91m56O45n07J97J03K09n89J68j76J47K61n02J71J28r6M34q0j31N
$$ -201 -15 176 -280 365 -142 55 158 367 -222 -54 -230 -83 178 -324 -153 -25 -121 313 233 102 107
6244A07m8k1k49K50k73j51N53J10J42m72K00k8K62l65p3J23l27J93K13j81J85
$$ 107 59 38 -211 39 -234 -385 168 278 420 -52 148 120 382 17 -56 67 -260 -67 146 -35 150
6265A50k02J9J07J41j55O5j17J33om10J04K9k31O88l91j05L31k08K77k23K04J3
$$ 150 -52 -33 74 215 60 125 8 141 135 -275 -171 -142 -373 315 -76 -181 150 -58 219 -4 200 213
6287B13j09m60K77j71K22k03l8M86l3J98k26K48l46L64n63J32J28l38O1j38N2
$$ 213 104 -356 -79 -250 -28 -231 -269 217 184 382 156 404 58 422 -141 -9 119 -219 -158 -296 -244
6308b44L03J15l10K12k56J58k52L42K86o55r5L92k45L52j46J43K12k97J29j73
$$ -244 59 174 -136 76 -180 -22 -274 68 354 -301 -396 -4 -249 103 -43 100 312 15 144 -29
6328b9J75l45M95q10O83j12n3j24j17J06K1j05K14K35j49K34l36L1Q3j47m85Q04
$$ -29 146 -199 296 -514 169 57 4 -120 -237 -131 -110 -215 -1 234 85 319 -17 14 97 -50 -535 269
6350B69o44K33n5K21K01k66J96k8J24l67J73n9J56k22k38L78k32J75M04m95N24
$$ 269 -375 -142 -197 24 225 -41 155 127 251 -116 57 -2 154 -68 -306 72 -160 15 419 -76 448
6371D48k95l92J89k54j42M46p0L8K51M2k42l7o6K42j70j83K19k10j15J77r0R4
$$ 448 153 -239 -50 -304 -446 0 -70 -32 219 261 19 -18 -84 158 -12 -195 24 -186 -301 -124 -214 -120
6393a20J52k18m3K02J92l5j27J57k16J3J2k19J9K38l01L87R8m65K76j01L77k39
$$ -120 32 -186 -229 -27 165 130 3 160 -56 -43 -31 -250 -231 7 -294 93 191 -274 2 -99 278 39
6415C9r5K40k16q5J29k04k24Q48k57j69K11k87K40m2k31n0L4J87M4m20K03J11
$$ 39 -56 184 -32 -117 12 -192 -416 432 175 6 217 -70 170 128 -103 -153 -119 68 112 -308 -105 6
6437Fp5P8K14j60K96l56p6Pl68J07M52m94k50M56k8K61k2K45k0j38r0R8j30q0
$$ 6 -69 9 223 63 359 3 -73 -66 -434 -327 125 -369 -619 -163 -191 70 48 293 273 135 45 143 13 -67
6461f7N6R0m62qL85L93n19J84K58k33K47l21mK06n58M93l50j13L96m9M18j01m
$$ -67 -11 79 -383 -391 -6 387 -132 52 310 77 324 3 -1 205 -353 140 -210 -323 73 24 442 341 337
6484C37j5n8k00L5p7m00L25j99K57p4J89q7j24J91J58j82j00K67n06Q5n2NJ67
$$ 337 322 264 64 99 22 -378 -53 -252 5 -69 120 33 -91 100 258 76 -24 243 -263 -178 -230 -225 -58
6507e8K0l2j55L06J00J09j35l37K07n0K6n5k56l1M61q9L4l70O55k75l0Q3q9j25
$$ -58 -38 -70 -225 81 181 290 155 -182 25 -25 1 -54 -310 -341 120 31 65 -305 350 75 45 128 39 -86
6531h6J37j34j3j1J98j59k9O5K11J7P7k34j05qJ51j56p0J7r7K00j01J53K18j01
$$ -86 51 -83 -96 -107 91 -68 -97 -32 179 196 273 39 -66 -74 77 -79 -149 -132 -229 -29 -130 23 241 140
6555A40j1q9O3m3M3n38K84k88K34L05l27M93j30J74j7l99J90j69J91j12q3J63
$$ 140 129 40 103 60 103 -435 -151 -439 -205 100 -227 266 136 310 293 -106 84 -85 106 -6 -89 74
6577G4J78m30K67k40L09J63l74M5L65k50l7j90q0M6Q2J10K71k68r2j35J85r3J63
$$ 74 252 -178 89 -151 158 321 -53 -8 357 107 70 -120 -200 -154 -72 38 309 41 -51 -186 -1 -94 69
6600F9o4j31K01j45R0k15k8N48n56J94L70n73K09K45q5l23K61j32J44M6j88Q9
$$ 69 5 -126 75 -70 20 -195 -223 325 -231 -37 333 -240 -31 214 129 -194 67 -65 79 125 -63 26
6622B6l65K55N1N1L34j79m12N34m40Q7j99j47J66K52j72L85k67J47J7n2K93o33
$$ 26 -339 -84 -33 18 352 173 -239 295 -145 -58 -257 -404 -238 14 -158 227 -40 107 124 72 365 -268
6644b68K65K19k36P9Pl92K87k26J23L67j54j67J88r2j35J05j38P4pk02K33j38
$$ -268 -3 216 -20 59 66 -326 -39 -265 -142 225 71 -96 92 0 -135 -30 -168 -94 -101 -303 -70 -208
6666b08L43J06o4J18m22M4K83l27o2K06l16j0P96o94K65l0K1K36m33K98o2k83
$$ -208 135 241 177 295 -127 -83 200 -127 -189 17 -299 -309 487 -207 58 28 49 285 -148 150 88 -195
6688a95KL01k68J92j20n9J57J6M39n55L05o4j07k87p8K37J44p7nJ94k13%NQ4p
$$ -195 -193 108 -160 32 -88 -147 10 26 465 -90 215 151 44 -243 -321 -84 60 -17 -22 172 -41 -41 -36 48 41
6713D1J26k80Q7L56j37k72J77o7k55J87J09R9J3J99r0m79M4J3j40O42o19j67N59
$$ 41 167 -113 -26 330 193 -79 98 31 -224 -37 72 171 184 383 293 -186 -142 -129 -269 373 -246 -413 146
6736A46k23m3J96J62k60J94j71l33M07k47K8l15L96oq4K86N0l66M82k71J87N2
$$ 146 -77 -120 76 238 -22 172 1 -332 75 -172 -144 -459 -63 -69 -153 133 183 -183 299 28 215 267
6758B67k40K6j59L0J11m68L37k76K97J72j89J99L81m18N9J74n67L34j71K04l50
$$ 267 27 53 -106 -76 35 -433 -96 -372 -75 97 -92 107 488 70 129 303 -264 70 -101 103 -247
6779b47K80O9J43j14m67K39J77J2l7k86n9L41m77L49j95N03O1l27K70k37N5r1
$$ -247 33 102 245 131 -336 -97 80 92 55 -231 -290 51 -426 -77 -272 231 292 -35 235 -2 53 -38
6801c8k42M5K46j39m5p8r2M35J31J02l98J59N9jj00j96R4Kk29M92m00L55m6P3
$$ -38 -280 -235 11 -128 -173 -251 -343 92 223 325 -73 86 145 144 44 -152 -58 -56 -285 207 -193 162 116 189
6825A89o2%j11k86L08k22J75k47K76m4m6K62l42L78r0J35L5l55p5L27m27J22k77
$$ 189 127 127 16 -270 38 -184 -9 -256 20 -24 -70 192 -150 228 138 273 308 -47 -122 205 -222 -100 -377
6848c77J40L26l20K05p5J6J22J4R1j31k34k69M58Ok1N5k16M86k28j34L81j67K6
$$ -377 -237 89 -231 -26 -101 -85 37 51 142 11 -223 -492 -34 -28 -49 6 -210 276 48 -86 295 128 154
6871A54j5l50K11L4l34m1l7K54K26j18k65N95l19p7k4JJ98k22N1R0k62J76o9J19
$$ 154 139 -211 0 34 -300 -341 -378 -124 102 -16 -281 314 -5 -82 -106 -105 93 -129 -78 12 -250 -74 -143 -24
6895b4J31j75J52J01mj28l2j0n0k03K88J96k07J07Q8k5j99J77k94K25q3k91J71
$$ -24 107 -68 84 185 181 53 21 11 -39 -242 46 242 35 142 230 205 6 183 -111 114 31 -260 -89
6918h9j9j24K04o7L48k63N3k2j99K83J69m43K05r6k38L19O6k29L61l83L86J84
$$ -89 -108 -232 -28 -95 253 -10 43 21 -178 105 274 -169 36 -60 -298 21 87 -142 219 -164 222 406
6940D06m20n8J30j25L29o27J02m1K64l24O27l58J11K88k4k27j35K21j18k7j32
$$ 406 -14 -72 58 -67 262 -365 -263 -304 -40 -364 263 -95 16 304 280 53 -82 139 21 -6 -138
6961a38L89l57J82q3n3K60K81p34N59o10K90J35m06L49k98j79N43J08j18K71k99
$$ -138 251 -106 76 -7 -60 200 481 -253 306 -304 -14 121 -285 64 -234 -413 130 238 120 391 92
6982I2J96j76n4K82m84P9l1l22J63K67l44K84k11L13K28m33O4K20l6k99k5L20
$$ 92 288 112 58 340 -144 -65 -96 -418 -255 12 -332 -48 -259 54 282 -151 -87 133 97 -202 -227 93
7004I3k15o2N89J13o12K76j30p4K22J27j63rl00l5K1Q5J66LP2j13K7K78k51j4
$$ 93 -122 -184 405 518 -94 182 52 -22 200 327 164 155 -145 -180 -159 -74 92 95 167 54 81 359 108 94
7028I4K5l73M1p0J73o5R6j87J24L54m56K72q5K50l06K1K71n0k19j68m8J09L88
$$ 94 119 -254 -213 -283 -110 -175 -79 -266 -142 212 -244 28 -57 193 -113 -92 179 129 -90 -258 -306 -197 191
7051A91j17Q0k79K15j50L64l02nl47K11p3p8P9L59N5j00j14J95J82l57k99O62
$$ 191 74 154 -125 90 -60 304 2 -3 -350 -139 -212 -290 -211 148 203 103 -11 184 366 9 -290 372
7073C72l75l1p8K17pn7l66N09m9l79K10j47P2j17J10K85p7L0K0l35N3K65L0L43
$$ 372 -3 -34 -112 105 98 41 -325 184 135 -244 -34 -181 -109 -226 -116 169 92 122 142 -193 -140 125 155 498
7097D98j69l24o5r6L95m76N6j7L7j32K34j45J91J79J04m37Q1J07MKk76K46p7J35
$$ 498 329 5 -60 -156 239 -237 -181 -198 -161 -293 -59 -204 -13 166 270 -167 -86 21 25 27 -249 -3 -80 55
7121E5p1L27l10j1J17Q2o4j99j43K18k0K67m32K92k16K77k63K37k09L69p5m10
$$ 55 -16 311 1 -10 107 189 125 -74 -217 1 -19 248 -184 108 -108 169 -94 143 -66 303 228 -182
7143a82M9O7J86J5j97R3k49L06J77k58K27j90q1p2J75r9J1l04M2L74k18Q7K33
$$ -182 -133 -66 120 135 -62 31 -218 88 265 7 234 44 -37 -109 66 -33 -22 -326 -284 90 -128 -41 192
7166A92m04N99k31j46L44m15L42k95j16Q2m4J64j44J77l1J86k02J32l13j26N38
$$ 192 -212 387 156 10 354 -61 281 -14 -130 -48 -92 72 -72 105 74 260 58 190 -123 -249 289
7187B89n16m65L99q7K77J91k32M74j54l51k0K56j9L5k84K43n5k09L79k62J18K23
$$ 289 -227 -692 -293 -380 -103 88 -144 330 176 -175 -195 61 42 77 -207 36 -19 -228 151 -111 7 230
7209B30k93O2J02J30j11J5l49K79k21K66l8j71K67J21k52R9r2j38K89j40j05P5
$$ 230 -63 -1 101 231 120 135 -214 65 -156 110 72 -99 168 289 37 136 44 -94 195 55 -50 25
7231B5kj93K14l12K39j18L53j29J20j08M1m64J17RN0k0J41OK10m05M85k16k67
$$ 25 23 -170 44 -268 -29 -147 206 77 197 89 130 -334 -217 -208 -158 -178 -37 -31 179 -226 259 43 -224
7254b24J61k25K43m9L4J73K59l55l7k63M20M5J30j63J47k48m0L71l28j31k27l3
$$ -224 -63 -288 -45 -94 -60 113 372 17 -20 -283 137 182 312 149 296 48 8 379 51 -80 -307 -340
7276c40N91l72J38R3n8K83j45k21M2q8K13k13r8L0O7P7O9j4k16M96o7l67K01K0
$$ -340 251 -121 17 110 52 335 190 -31 11 -77 136 -77 -175 -145 -78 -1 68 54 -162 334 267 -100 101 121
7300A21k75Q6k45j29L18M82r6k03m7L36k78J28j1m4m03L23j30J23j73k74L19J32
$$ 121 -154 -68 -313 -442 -124 358 262 59 12 348 70 198 187 143 -260 63 -67 56 -117 -391 -72 60
7322F0O1j63K47jl28N5j80M4j07M3K9k9J75o7L02k35P9J23Q6j18n4q9J60k86j29
$$ 60 121 -42 205 204 -124 -69 -249 -205 -312 -269 -240 -269 -94 -161 141 -94 -15 108 194 76 22 -67 93 -193 -322
7347c22J17j23K38P0J6M30k81J73P4o42K01l8J78j32j18l7K41J63k38J44j16J86
$$ -322 -205 -328 -90 -20 -4 426 145 318 392 -250 -49 -87 91 -41 -159 -196 45 208 -30 114 -2 184
7369A84k15j9k81K72j63L34j24j51L92l21J1QJ76p3j17j75K00R8N4M1k46K25j54
$$ 184 -31 -50 -331 -59 -222 112 -12 -163 229 -92 -81 -73 103 30 -87 -262 -62 36 90 131 -115 110 -44
7392d4K93l07L1J77r1j4K23j66l37J39q1K12J46m28L15J43k20J45j87J60M6j38
$$ -44 249 -58 -27 150 59 45 268 102 -235 -96 -177 35 181 -247 68 211 -9 136 -51 109 155 17
7414A7k0N6j80O6k4j18J92J7J76J56k60j30M08k36j39L17n50l8K25o2j31L48K04
$$ 17 -3 53 -127 -61 -85 -203 -11 6 182 338 78 -52 356 120 -19 298 -252 -290 -65 -127 -258 90 294
7437B94l02L33k5n57L36K60l90k98K38q4J42mp7L44Mk00J99j08j33j71R5m0k03
$$ 294 -8 325 300 -257 79 339 -51 -349 -111 -195 -53 -57 -134 210 214 14 213 105 -28 -199 -104 -144 -347
7460c47N55p8n10R1P18m75M57l95k16M36l71k53N16j67m4k23m5K61L81l79O3J47
$$ -347 208 130 -380 -289 429 -46 411 16 -200 236 -135 -388 128 -39 -83 -306 -351 -90 291 -88 -25 122
7482A22R3K57n90K74k50k45M03L70j047O51P6O7J94q3m13L80l00q4M1k44L46M0
$$ 122 215 472 -118 156 -94 -339 64 434 -613 38 114 181 375 292 -121 259 -41 -125 -84 -328 18 58
7504E8j11R1l21M43K2m12M81J24k35q9k67lK49r3K05k85L86m22r4K33j8p5L23
$$ 58 -53 38 -283 160 182 -230 251 375 140 51 -216 -219 30 -63 142 -143 243 -179 -273 -40 -58 -133 190
7527A90k19k51O84k69k23P5k64R8J81r0L62k44J01k60k15N06J60n51K37j11m8
$$ 190 -29 -280 404 135 -88 -13 -277 -179 2 -88 274 30 131 -129 -344 162 322 -229 8 -103 -151
7548a51L94k68o6L57n67M25L04n23N7J01K2k14J5J69j48K18j85J96k93M28J3k02
$$ -151 243 -25 -91 266 -301 124 428 -95 -38 63 85 -129 -114 55 -93 125 -60 136 -157 271 284 82
7570H2l4k21J72j01k03N34l08J91j76jL15M7k19Q3l93L65j17l12L20M8k25M67
$$ 82 48 -173 -1 -102 -305 229 -79 112 -64 -65 250 297 78 161 -232 133 16 -296 24 72 -153 314
7592C14J7k22m1J81l07J38m7j02J29l73K87J62k53K16l66J43L59k50L17m34K16
$$ 314 331 109 68 249 -58 80 33 -69 60 -313 -26 136 -117 99 -267 -124 235 -15 302 -132 84
7613H4M2l31l2M27n36J73J16Ok0N94o96M63l08j46M09l87o5O4o2K66q9l5J15n9
$$ 84 126 -205 -237 190 -346 -173 -57 -51 -71 523 -173 290 -18 -164 245 -142 -207 -143 -205 61 -28 -63 52 -7
7637gL38j42l67K83n3j75L53l13K76o4p1K69l86j53K12J60P8j53k91N2J47k68
$$ -7 331 189 -178 105 52 -123 230 -83 193 129 58 327 -59 -212 0 160 238 85 -206 -154 -7 -275
7659b75R3M5j77L46J90j57J09k86L5R5K65m35K89j19k39o0L16N7m30N36Q4k68
$$ -275 -182 -137 -314 32 222 65 174 -112 -77 18 283 -152 137 18 -221 -281 35 92 -338 198 282 14
7681A4l0o2L71k55j68J53N7l8L4rj36M60k69L17k42k12J97k7m99M29k7j97K15
$$ 14 -16 -78 293 38 -130 23 80 42 76 67 -69 391 122 439 197 -15 182 155 -344 85 58 -139 76
7704G6k63J61R2J22Pj77K29j54k7k11J36P7j69M28l32L07k27j05J26j09j3J09
$$ 76 -187 -26 66 188 195 18 247 93 66 -145 -9 68 -101 327 -5 302 75 -30 96 -13 -26 83
7726H3j14J70k66R2m86L98n9LM36j78J24n11K05J05m56L18P2L35l82n9q6J34Q8
$$ 83 -31 139 -127 -35 -521 -123 -182 -179 257 79 203 -308 -103 2 -454 -136 -64 271 -111 -170 -256 -122 -34
7749c4M7K97j03j30O3j9j84J99k65k12J42J34k15M30o0j36O2J15j48j7j5J37o8
$$ -34 13 310 207 77 140 121 -63 136 -129 -341 -199 -65 -280 150 90 -46 16 131 -17 -34 -49 88 20
7772B0j60j66N35m86K84K18o5L81n53K89k46k57K75j70l63P58l64j63K28J0R2
$$ 20 -140 -306 229 -257 27 245 180 561 8 297 51 -206 69 -101 -464 294 -70 -233 -5 5 97
7793I7J94k27J83J51n53K28l61K67k3l84M85o5k38N9qK22L40n16j1J87m40Q28
$$ 97 291 64 247 398 -155 73 -288 -21 -44 -428 57 -8 -246 -187 -195 27 367 -149 -160 27 -413 415
7815D15Pn55j18K18R0j2L29m02r1K03J50j89j39K5Q5o7J91l24J04j25J67L30l89
$$ 415 422 -133 -251 -33 57 45 374 -28 -119 84 234 45 -94 -69 16 -51 140 -184 -80 -205 -38 292 -97
7838i7J51J1M4Nk15l4k18P8j36Q44o33N4M51k41J60j73k11K07k44J90j79j61K78
$$ -97 54 65 109 114 -101 -135 -353 -275 -411 433 -200 -146 305 64 224 51 -160 47 -197 -7 -186 -347 -69
7861f9j32L72r9j50M3J73l39J52K17kl79P8K64p0K7k67L78j67J5P4N9j91J67k70
$$ -69 -201 171 72 -78 -35 138 -201 -49 168 166 -213 -135 129 59 86 -181 197 30 45 119 178 -13 154 -116
7885a16k05M57K4m36J69J95ol9O9k70K36j55K89j82k38L16m8j21M1K61k67J48
$$ -116 -321 136 160 -276 -107 88 82 43 112 -158 78 -77 212 30 -208 108 60 -61 -20 241 -26 122
7907A22K61n86J59K6K46m7j73j61J87m08L68N4j45K34m32K22K98J01l29J61k28
$$ 122 383 -203 -44 -18 228 181 8 -153 34 -374 -6 48 -97 137 -295 -73 225 326 -3 158 -70
7928g0K2j23J16J82l12L66L81o67p4K27k8J74n4k92K34p6q1J58k60O7L19PK21
$$ -70 -48 -171 -55 127 -185 181 562 -105 -179 48 20 194 140 -152 82 6 -75 83 -177 -110 209 216 437
7951D37m96n8K68q5m84M67l79J20p1J41K76l8j92K36Q8J34m61J57j65Ml92M15
$$ 437 -59 -117 151 66 -418 49 -330 -210 -281 -140 136 98 -94 142 230 364 -97 60 -105 -101 -493 -78
7973g8N8L28j22j23N5O7Q6l25M9N9J35k77r2k50N42Ml04K95m04K69J44J42m4j31
$$ -78 -20 308 186 63 118 185 271 -54 -5 54 189 -88 -180 -430 112 116 -188 107 -297 -28 116 258 214 83
7997H3k1k73L0M3k79K93n3J78k74K00on8m2J6K5K09J0k14L37n50L37q8m2K2K71
$$ 83 62 -211 -181 -138 -417 -124 -177 1 -273 -73 -79 -137 -179 -163 -138 71 81 -133 204 -346 -9 -97 -139 -117 154
8022A54k10L54nj61j9j77r1oj9M9J99p2k07M42m77L73p3lJ46m31K93l40P9j2N86
$$ 154 -56 298 293 132 113 -64 -155 -161 -180 -131 68 -4 -211 231 -246 127 54 51 197 -234 59 -281 -202 -214 372
8047C72l62P1J84n45L33J44K4k36L6j15J19%k12R6l2L88l41L19K15j13l40k18
$$ 372 10 81 265 -280 53 197 221 -15 21 -94 25 25 -187 -91 -123 265 -76 243 458 345 5 -213
8069b13J95j89J30r8J44k60Q4J98N2L23n79L44l1P2l70J36j58M56p6j17k53J70
$$ -213 -18 -207 -77 -175 -31 -291 -207 -9 43 366 -213 131 100 172 -198 -62 -220 236 160 43 -210 -40
8091d0k50L36j42N4K70l04L3p5L10j66O7J58l19j93N33k28JR2q8K16j46l66MQ8
$$ -40 -290 46 -96 -42 228 -76 -43 -118 192 26 93 251 -68 -261 272 44 45 137 49 265 119 -247 -243 -155
8115a55j26K09p3K56K76j91RO9l95O24l31k91L19l72J25J27J8l15M91o17N13l6
$$ -155 -281 -72 -145 111 387 196 205 274 -121 503 172 -119 200 -172 -47 80 98 -217 274 -343 170 134
8137A34k28jL4J2P8j28J83Nk87K20j43o3L98m34L21p6j73J58k01k8J65k51J51
$$ 134 -94 -95 -61 -49 29 -99 84 89 -198 22 -121 -184 214 -220 101 25 -148 10 -191 -219 -54 -305 -154
8160a54O23m80k1k30J72K00O0N6j05n05N97m63J73n0K86o4p9J87l38N62n04P6
$$ -154 469 -11 -32 -262 -90 110 170 226 121 -384 213 -250 -77 -127 159 95 16 203 -135 427 -77 -1
8182aK82l07j38L78o57Q29n75QJ5
$$ -1 281 -26 -164 214 -443 386 -189 -181 -166
8191a66
$$ Imaginary data points
##PAGE= N=2
##DATA TABLE= (X++(I..I)), XYDATA
0@%%%qK4l0L0m0N6p2Q9j12J35j63K03k48K99l56M18m91N80o78P82q99J034j186
$$ 0 0 0 0 -8 16 -14 16 -24 32 -40 49 -63 72 -91 112 -136 163 -193 225 -266 314 -364 418 -481 553 -633
26f33J357j545J746j966K215k494K801l133L493l890M329m812N340n918O551p252
$$ -633 724 -821 925 -1041 1174 -1320 1481 -1652 1841 -2049 2280 -2532 2808 -3110 3441 -3811
42c811Q030q892R851j0923J2131j3506J5086j6917J9071k1647K4793k8744L3865
$$ -3811 4219 -4673 5178 -5745 6386 -7120 7966 -8951 10120 -11527 13266 -15478 18387
55A8387m0789N0717o6203R3775j56905N27979J10362j201306O95255J94514m02840
$$ 18387 -22402 28315 -37888 55887 -101018 426961 537323 -663983 31272 225786 -177054
66a77054M07108r3265o83320N11917M25245n05233o2122L18086k88482K08517
$$ -177054 230054 136789 -546531 -34614 390631 -114602 -176724 141362 -147120 61397
76F1397L64335o90647l6119Q01041n34080l40136O36599l46153k11920O39327
$$ 61397 425732 -264915 -301034 500007 -34073 -374209 262390 -83763 -295683 343644
86C43644l65809l22648O11616j25254l86775M47253j7547n11549L47277K77728
$$ 343644 -22165 -344813 266803 141549 -245226 202027 184480 -327069 20208 297936
96B97936n47157J26984L64534n00709J34735N18064n07732q1186M32790l04507
$$ 297936 -249221 -122237 242297 -258412 -123677 394387 -113345 -194531 238259 -66248
106f6248P2688K98073n47807k0657N82996k85648l19405L73070o1485k35253M31346
$$ -66248 6440 304513 -243294 -263951 319045 33397 -286008 87062 25577 -209676 221670
117B21670k3392n29251L63483K94264m83830J22626J77338l97275K68984K34481
$$ 221670 198278 -330973 32510 326774 -157056 -34430 142908 -254367 14617 249098
127B49098n06339J23106L71772k98594o695K55734k46592n1309L26118j78271
$$ 249098 -257241 -134135 237637 -60957 -67652 188082 -58510 -109819 216299 38028
137C8028k45017K79340m0712k06412K99364r4117l01951M06162O3514l73122K34281
$$ 38028 -206989 72351 31639 -174773 124591 30474 -271477 134685 198199 -174923 59358
148E9358P0963k91789K29031J10844l47249M3121K26115j22430k7567J11656j53065
$$ 59358 130321 -161468 67563 178407 -168842 -125721 100394 -22036 -49603 62053 -91012
159i1012K6433K76461j82593j68878K56748r1624j32977K32890j54767j64201
$$ -91012 -64579 211882 29289 -139589 117159 25535 -107442 125448 -29319 -193520
169a93520K93081n1494j96920J93207K7299j28951J21827R203j63257J09041J12689
$$ -193520 99561 48067 -148853 44354 71653 -57298 64529 73732 -89525 19516 132205
180A32205k14204k1850J81405j25452k3832J68159j50250k4068K05873j18558
$$ 132205 -81999 -103849 77556 -47896 -71728 96431 -53819 -77887 127986 9428
190I428m5139J44736j34113m5303J46840q7395p0228J09959m6607q0166J38126
$$ 9428 -35711 109025 -25088 -70391 76449 -10946 -81174 28785 -17822 -97988 40138
201D0138M9985j46354M1113R5011r5571M3334M6562j68711N4885J15044j40469
$$ 40138 90123 -56231 -15118 79893 -15678 27656 74218 -94493 -39608 75436 -65033
212f5033K1100Q4519j00133N6960Q7706j10492N841R9346n8437n8862N1415j4750
$$ -65033 -43933 40586 -59547 -2587 85119 -25373 -19532 79814 21377 -37485 13930 -820
224h20m3346O2607k9703q1816J18230L5353j07794P3783J8483q6004R6893K966
$$ -820 -44166 18441 -11262 -93078 25152 60505 -47289 26494 44977 -41027 55866 58832
236E8832j27107N5438L5428o8858L2479K1772n0376L1436N8832m1696j5924O6513
$$ 58832 -68275 -12837 22591 -46267 -13788 7984 -42392 -10956 47876 6180 -9744 56769
248E6769m3380m8196Q0852m2879o6017Q2705l6501m7031R7203k7306m2636P6656
$$ 56769 13389 -34807 46045 3166 -62851 19854 -16647 -63678 33525 6219 -36417 40239
260D0239j7382l0672M7719j8553m6066K2083J4556m7439L229N0611m7569k135
$$ 40239 22857 -7815 39904 21351 -24715 -2632 11924 -35515 -32286 18325 -29244 -31379
272c1379P9415n0492o025P3209p2634q648O8183o8354j2087M0456n0731J0529
$$ -31379 48036 -2456 -8481 64728 -7906 -16554 51629 -16725 -28812 11644 -39087 -28558
284b8558M3635k0945r607K5043J9770k0718Q477K2085o1779Q284M6287p3286J5476
$$ -28558 15077 -5868 -15475 9568 29338 8620 17097 39182 -22597 -14313 31974 -41312 -25836
297b5836M5836p0106M1025M6052n7150L7028J9257m3793K5105K449k2819n421
$$ -25836 20000 -50106 -9081 36971 -20179 16849 36106 -7687 17418 19867 -2952 -8373
309h373q455O566j7443J4965K8581m2943L0338L5873n2445M1815J0551o8031M1761
$$ -8373 -16828 -10262 -27705 -12740 15841 -27102 3236 39109 -13336 28479 39030 -29001 12760
322A2760k717m6250L8878j7325j7788L4330o859J2657P295q527J7640j9414Q237
$$ 12760 10043 -36207 2671 -14654 -32442 1888 -4971 7686 14981 6454 24094 4680 12917
335A2917Q360m8182K3440R33m0556M8676q919k8368N4227j3978p422L5105l0295
$$ 12917 21277 -26905 -3465 -2532 -43088 5588 -3331 -31699 22528 8550 1128 36233 5938
348E938O15M504k3435J4551j8794n951K0370k2502K3447J4939k3778L4010q358
$$ 5938 6553 11057 -12378 2173 -16621 -22572 -2202 -24704 -1257 13682 -10096 23914 15556
361A5556j5837L4131l5137r925K2269l8456J2328J3979k3867K3889j218L428K5025
$$ 15556 -281 33850 -1287 -11212 11057 -27399 -15071 -1092 -24959 -1070 -2288 1140 26165
374B6165k2156J2880N389l2806K1321j1334k3487K1838k1569P222K4227k3483
$$ 26165 4009 16889 22278 -10528 10793 -541 -24028 -2190 -23759 -16537 7690 -15793
386a5793K5592Q227k0972K9975j1908j5432J4709k9434M052P517k3214K3178m685
$$ -15793 9799 18026 -2946 27029 15121 -311 14398 -15036 -10984 -3467 -26681 -3503 -8188
399h188p521L3477j4917O598J9531k9938J2550p82k5485J7827j8501q429K3953
$$ -8188 -15709 17768 2851 9449 28980 -958 11592 10810 -14675 3152 -15349 -23778 175
412A75j9604J5002J8845j9618K1532k91j1263J7821k4099k050P825l1610J7463
$$ 175 -19429 -4427 14418 -5200 16332 16041 4778 22599 -1500 -3550 4275 -27335 -9872
425i872N918k0506K8172l711l427K7385j6209N181P563k7439J0068l240j6373
$$ -9872 -3954 -24460 3712 1 -3426 23959 7750 12931 20494 -6945 3123 -117 -16490
438a6490J1523j3985N177J4113j2024K5762K201j9914K8088j2229j6306K0947
$$ -16490 -4967 -18952 -13775 338 -11686 14076 16277 -3637 24451 12222 -4084 16863
450A6863k5234r142J3995j7210J1577R397r353J3105K210O733O801j3790P115
$$ 16863 -8371 -17513 -3518 -20728 -9151 246 -9107 3998 6208 12941 19742 5952 13067
463A3067j3327j4326K3193k1329j1492K6312k1061P315L2104j9574N577J5430
$$ 13067 -260 -14586 8607 -12722 -24214 2098 -18963 -11648 20456 882 6459 21889
475B1889j7949L199N055j1894j1757m871J0205p804K470J9603j8459Q205K8093
$$ 21889 3940 7139 12194 300 -11457 -16328 -6123 -13927 -11457 8146 -10313 -2108 25985
488B5985k3381R811J3116l8988J1604J3202l4648J0667J5070k2407M832K4644
$$ 25985 2604 12415 25531 -13457 -1853 11349 -23299 -12632 2438 -19969 -15137 9507
500I507J430j0557J2203N951k2683J5643O928m0506J3078R346l0141L0742O999
$$ 9507 10937 380 12583 18534 -4149 11494 18422 -22084 -9006 340 -29801 941 7940
513G940l5977L7334J6016l1196K0134Q749k6786K953R480j9744j0525K2708q333
$$ 7940 -28037 9297 25313 -5883 14251 23000 -3786 -833 8647 -11097 -21622 1086 -7247
526g247j9529L7959o81k7544M5236p809m0749M6388p837m6354L2071m807k7659
$$ -7247 -26776 11183 10502 -17042 28194 20385 -20364 26024 18187 -28167 3904 -903 -28562
539b8562K7911n09j7321K1981J2953j5172O590J8933l0251r875M3471l5833l2677
$$ -28562 -651 -1160 -18481 3500 16453 1281 7871 26804 -3447 -13322 30149 -5684 -38361
552c8361N1621k4902k3093O1197k5115k6459N2289j2871j6025K9064k7568k0691
$$ -38361 13260 -11642 -34735 26462 1347 -25112 27177 14306 -1719 27345 -223 -20914
564b0914L1298l799l4176J2826K5099l0757P651M5084l8393P43M9264n2006n434
$$ -20914 10384 6585 -27591 -14765 10334 -20423 -12772 32312 -6081 -5338 43926 -8080 -13514
577a3514M9621n2807m423L9650n0051N581N3208l1279j6133L6703j826j9406K5561
$$ -13514 36107 -16700 -21123 18527 -31524 -25943 27265 -4014 -20147 16556 14730 -4676 20885
590B0885M238m7888J5549K3138m4299K8101J7508o9254M4982N0070n9051K3949
$$ 20885 25123 -22765 -7216 15922 -28377 -276 17232 -52022 -7040 43030 -16021 7928
602G928K3744n6177L0541L5746n3143j5867K7154o761p660K1951j5758j8932N7435
$$ 7928 31672 -24505 6036 41782 -11361 -27228 -74 -6835 -14495 7456 -8302 -27234 30201
615C0201o962n3865N8276K856o0339N0467j3261n9153O7075M806o2635L3818K0841
$$ 30201 23239 -30626 27650 30506 -29833 20634 7373 -51780 15295 20101 -42534 -8716 12125
628A2125j8124K6302L671m2241J0036M8828l6146l3065M3075l3096j8808P3885
$$ 12125 -5999 20303 23974 -18267 -8231 40597 4451 -28614 14461 -18635 -37443 36442
640C6442m1704l6667P4749l0448j8691O7056m7626l5214N8908j8306l5481L1706
$$ 36442 -5262 -41929 32820 2372 -16319 50737 3111 -32103 26805 8499 -26982 4724
652D724m663l9881L7404L9722o0500M332O4579m9211l18M5973p4040J5522O6382
$$ 4724 61 -39820 -2416 37306 -23194 -18862 45717 -3494 -3812 42161 -31879 -16357 50025
665E0025q2476m909O2676m6955J1961M5040n5169m169P2149j8803n9990L4056
$$ 50025 -32451 -37360 25316 -21639 -9678 35362 -19807 -23976 48173 29370 -30620 3436
677C436J5812m7788M1771O489q9523O3399N8946q6537L2771L7657p1904N2171
$$ 3436 19248 -28540 13231 19720 -69803 -6404 52542 -33995 -1224 36433 -35471 16700
689A6700L9756q5374J1406M0915m4089O356L7829m5747j9076P1801j2646m6865
$$ 16700 56456 -28918 -17512 23403 -20686 -14330 23499 -22248 -41324 30477 17831 -29034
701b9034O5250j9237o3112R2078j1125r9529P4020J4293p3757O1580O920o7971
$$ -29034 36216 16979 -46133 45945 34820 -64709 9311 23604 -50153 11427 18347 -49624
713d9624O0891L8410o9940N843N0886l6699o187M0237o9092j4054J04240n1344
$$ -49624 11267 49677 -20263 -14420 36466 -233 -6420 33817 -35275 -49329 54911 3567
725C567o2503Q2837k8283k3457R8272n8526p6809R6008P536o6683L7368o263n9457
$$ 3567 -58936 23901 -4382 -27839 70433 11907 -64902 31106 38642 -28041 9327 3064 -56393
738e6393N9755M4766q4624R269P0735n8473J0225O7857q9234p840R1748p2848
$$ -56393 3362 48128 -36496 -27227 43508 -14965 -4740 63117 -26117 -33957 57791 -15057
750a5057k6053P6750n8654j8715Q5075m2259m6137P8284k69o1632M7469R362p3950
$$ -15057 -41110 35640 -23014 -41729 43346 1087 -45050 33234 32965 -28667 18802 28164 -45786
763d5786N5623L8655j04871K6911O9680p1480K8210N0302r0828K7629Q4853p0709
$$ -45786 9837 48492 -56379 -29468 40212 -31268 -3058 47244 -43584 -15955 68898 -1811
775a811k1877N0410m4090q186O6480m5728n8396P7765J4786o2805N5139O973p5711
$$ -1811 -23688 26722 -17368 -25554 40926 -4802 -63198 14567 29353 -33452 21687 28660 -47051
788d7051P3493K7888r9762L9929L7940p4474L7120L5790p3367K5715N9722n2913
$$ -47051 26442 54330 -45432 -5503 32437 -42037 -4917 30873 -42494 -16779 42943 -9970
800i970q822N6896l5375k3395O0204l8156n2338P7256j0730o7592O5768j004n7734
$$ -9970 -18792 38104 2729 -20666 39538 1382 -50956 26300 15570 -52022 13746 12742 -44992
813d4992P6687N750p8699M9810K9635n6452K3581J6049o0232K0391N3011m8537
$$ -44992 31695 37445 -41254 8556 38191 -18261 5320 21369 -38863 -18472 34539 -13998
825a3998j7401N4031k8124r738O3636m4792m0585P2021k1389m6748N2968k2621
$$ -13998 -31399 22632 -5492 -15230 48406 3614 -36971 35050 13661 -33087 19881 -2740
837b740m1654O1799k017n0162M0798K1268m0880J9048K4516m4784P150L8359m8373
$$ -2740 -44394 17405 15388 -34774 6024 27292 -13588 5460 29976 -14808 -7658 30701 -17672
850a7672j1664M9565l3117p692M6064l9151p000O0040k8626k7536L7030j7997
$$ -17672 -29336 20229 -12888 -20580 25484 -13667 -20667 39373 10747 -16789 20241 2244
862B244k0331L4963j0739m0709K5769K4007k8276J2491J9597l7192J9612L7231
$$ 2244 -18087 16876 6137 -34572 -8803 15204 -13072 -581 19016 -18176 1436 38667
874C8667m6040k080K8791l7050P166K9398l8564j690L3306j2957l917J9520q656
$$ 38667 -7373 -9453 19338 -17712 -10546 18852 -19712 -21402 11904 -1053 -4970 14550 5894
887E894j0331K0118l479k9256J8719R372l5609J8969J5586l4195K5978J9922l5198
$$ 5894 -4437 15681 12202 -17054 1665 11037 -24572 -5603 9983 -24212 1766 21688 -13510
900a3510J5610J7756k0007P726q25j9604P518R522r997p849J0686L053p715K2536
$$ -13510 2100 19856 -151 7575 6750 -12854 -5336 4186 -5811 -13660 -2974 79 -7636 14900
914A4900r63k7731K3724O794k5754J6623q013k1549K3894l036j1373J6846n787
$$ 14900 13937 -13794 9930 16724 -9030 7593 -420 -21969 1925 -1111 -12484 4362 -1425
927a425l013J4109K308n973p324O822j366j5028J1828k987j5784J9499n321n194
$$ -1425 -4438 9671 11979 6006 -1318 5504 4138 -10890 938 -2049 -17833 1666 -3655 -8849
941h849K4156j2961m488J9219j6691j323J1807j4867m410M16J804P003o806L854
$$ -8849 15307 2346 -2142 17077 386 -937 10870 -3997 -8407 -7991 -6187 816 -5990 -2136
955b136L261j677J4136o574o349J0308j8116L293J4243k3932K321J1915j0042
$$ -2136 1125 -552 13584 7010 661 10969 -7147 -3854 10389 -13543 -11222 693 -9349
968i349R975L865l851Q440o797K105N155r529J38n680j486P018j1474P489R846
$$ -9349 626 4491 640 9080 2283 4388 9543 14 152 -5528 -7014 4 -11470 -3981 5865
983E865j5573J3416Q908j2587R870n288q364R237r975k712O010q430M594L110
$$ 5865 -9708 3708 12616 29 9899 4611 -3753 5484 -4491 -7203 -1193 -9623 -5029 -1919
997a919J715P721r135O389Q176j3987N950j403j2057Q824p201k700J3160j2647
$$ -1919 -204 7517 -1618 4771 12947 -1040 4910 3507 -8550 274 -6927 -9627 3533 -9114
1011i114M703J4549r320L925K517l578L529j0430J933L373j5108P735M905p623
$$ -9114 -4411 10138 818 4743 7260 3682 7211 -3219 -1286 2087 -13021 -5286 -381 -8004
1025h004J0443l174J421J1900j2179M081O943j6856M120J480p854N729o745J885
$$ -8004 2439 -735 686 12586 407 4488 11431 -5425 -1305 175 -7679 -1950 -8695 -6810
1039f810J0547o997P695L726p836Q406n851k767P727j5833o06Q848r331O181L040
$$ -6810 3737 -3260 4435 8161 325 8731 2880 113 7840 -7993 -8599 249 -9082 -2901 139
1054A39m094R940m813K793R812j3417r14L922q117L013m405j353P168q490P379
$$ 139 -3955 5985 1172 3965 13777 360 -554 3368 -4749 -1736 -6141 -7494 -326 -8816 -1437
1069a437J2072j0236L135L703n549M609o444k858K904j0092L374P088n311M953
$$ -1437 10635 399 3534 7237 1688 6297 -147 -3005 -101 -10193 -6819 269 -5042 -89
1083h9O04P50Q058n391O33K209r945J562j3m388M408n767N41R858l653L048N734
$$ -89 515 1265 9323 3932 4565 6774 -3171 -1609 -1622 -6010 -1602 -7369 -6828 3030 -623 2425 8159
1100H159m576J043k417l28K519j0749J75M571o629M722L771j095N383l308L185
$$ 8159 3583 4626 2209 1881 4400 -6349 -6174 -1603 -8232 -3510 261 -834 4549 1241 4426
1115D426O701r711j282K915q164L66P68r50L232m181N215N928l478N412j676m818
$$ 4426 11127 1416 134 3049 -5115 -4749 -3981 -4931 -1699 -5880 -665 5263 1785 7197 5521 703
1131G03N238p490j808O252j2138J68Q631l583M462K599j950M924k275J018K132
$$ 703 5941 -1549 -3357 2895 -9243 -9075 -444 -4027 435 3034 1084 6008 3733 4751 6883
1146F883q202r17k599r15O097p961J324J1336r658N815J1571j1424J555L376q898
$$ 6883 -1319 -2236 -4835 -5750 347 -7614 -6290 5046 -4612 1203 12774 1350 2905 6281 -2617
1161b617L367j609o409L126j273J228K562K690N662p521K851J0148j2641J273
$$ -2617 750 -859 -7268 -4142 -5415 -4187 -1625 1065 6727 -794 2057 12205 -436 837
1175H37N663j6752N360O367j1624R266O88p434J3575K735p796L486L92j853m865
$$ 837 6500 -10252 -4892 1475 -10149 -883 -195 -7629 5946 8681 885 4371 4763 2910 -1955
1190a955J185J415j2506P314P763j3708J1772P115j3917J4978J3j5345J4185l418
$$ -1955 -770 645 -11861 -4547 3216 -10492 1280 8395 -5522 9456 9469 -5876 8309 4891
1204D891j4136P784n45n073L096K061P58j145R045R38j0243J1536l888j2733J6048
$$ 4891 -9245 -1461 -2006 -7079 -3983 -1922 -1164 -2309 6736 7674 -2569 8967 5079 -7654 8394
1219H394j0084j5497K1500n217j2221J8779l229p074J1995Q08n205j242R86m093
$$ 8394 -1690 -17187 4313 -904 -13125 5654 2425 -4649 7346 8154 2949 1707 2693 -1400
1233a400m151Q535q146q729J8572o971m360K1080j5000n468K2763j3617p521J1249
$$ -1400 -5551 2984 -5162 -13891 4681 -2290 -6650 14430 -570 -6038 16725 3108 -4413 6836
1247F836j1869k751Q421m990l933O348P864q550L42J6667j2354k975J4157k2092
$$ 6836 -5033 -7784 637 -4353 -8286 -1938 5926 -2624 -2282 14385 2031 -944 13213 -8879
1261h879P56K0609k1206j432J2131j2598J1948J0793j4794J072Q235L10m135j201
$$ -8879 -8123 12486 -8720 -10152 1979 -10619 1329 12122 -2672 -1600 6635 6945 2810 1609
1275A609k69j3260P363J2645k0902O894J4675j9421J4589J1843k1958J1405M736
$$ 1609 1340 -11920 -4557 8088 -12814 -5920 8755 -10666 3923 15766 -6192 5213 9949
1288I949j7413R214P41j0230K451J847M33j493O836N437j1720R994M235j7329
$$ 9949 -7464 1750 2491 -7739 -5288 -3441 -3008 -4501 2335 7772 -3948 6046 10281 -7048
1302g048J4983j52k3483J5112J023j2726J7202n549j0398J6156K714l241ol031
$$ -7048 7935 7783 -15700 -588 435 -12291 4911 -638 -11036 5120 7834 4593 4587 1556
1316A556j085j452O112o211j3942J3982J068q205J5745p490p235K1167r309p586
$$ 1556 471 -981 5131 -1080 -15022 -1040 28 -8177 7568 78 -7157 14010 4701 -2885
1330b885J2329j1403k907P351q312j111N428O87k334M58R785k742k551P936j3688
$$ -2885 9444 -1959 -4866 2485 -5827 -6938 -1510 -823 -3157 -2699 7086 4344 1793 9729 -3959
1345c959J252J4205j8422j476J0124j2942R463J0060j3643L379Q096k003K869
$$ -3959 -2707 11498 -6924 -8400 1724 -11218 -1755 8305 -5338 -1959 6137 4134 7003
1358G003k460o138k495M538J352j0390M609L416r577J6305L065j7867J4932L495
$$ 7003 4543 -1595 -4090 448 1800 -8590 -3981 -565 -10142 6163 9228 -8639 6293 9788
1372I788j4463J1866m388j3102J1485j062r260M762M893m69J40O023n071l284
$$ 9788 -4675 7191 2803 -10299 1186 124 -9136 -4374 519 50 190 6213 1142 -2142
1386b142J6318r279j6000J4136o383m319J7724j9354q938K8423l473q981J0303
$$ -2142 14176 4897 -11103 3033 -3350 -7669 10055 -9299 -18237 10186 6713 -2268 8035
1399H035r259l213J6487j352k0621j566J4695o062j269R311j7007N365K5267j8494
$$ 8035 -1224 -4437 12050 10698 -9923 -11489 3206 -2856 -4125 5186 -11821 -6456 18811 317
1413C17l927J7270j9273L564J7578k4892m190K0234r597o314J2505k784o384J5979
$$ 317 -3610 13660 -5613 -2049 15529 -9363 -13553 6681 -2916 -9230 3275 491 -5893 10086
1427A0086K405k2810J1165J4486k3386N702R877k7444J5114K1813k7877K604J7865
$$ 10086 12491 -10319 846 15332 -8054 -2352 7525 -19919 -4805 17008 -10869 -8265 9600
1440I600j3240R815J1042k4119k118J9551p235j2119J0471p075j2090K7731K549
$$ 9600 -3640 6175 17217 -6902 -9020 10531 3296 -8823 1648 -5427 -17517 10214 12763
1453A2763k9933J9364J1858k2794J9448M183l2864J5358J4354k2374N791R022
$$ 12763 -17170 2194 14052 -8742 10706 14889 -17975 -2617 11737 -10637 -4846 4176
1465D176j6313Q888J8137j5636q229K1483n110j4590J6662j0328j6547K9486p554
$$ 4176 -12137 -3249 14888 -748 -8977 12506 7396 -7194 9468 -860 -17407 12079 4525
1478D525k9785K6917P277j7314J8975m607k1884K5154J3109k8723n165J4031o297
$$ 4525 -25260 1657 8934 -8380 10595 5988 -15896 9258 22367 -6356 -11521 2510 -3787
1491c787J426J1593k1835n136L4702q551j8233K0841j0511q417K7249j8030k0983
$$ -3787 -2361 9232 -12603 -17739 16963 8412 -9821 11020 509 -7908 19341 1311 -19672
1504a9672K6427l376j8203J5175L612j2607J1964Q292j7993M756K0126k0590q222
$$ -19672 6755 3379 -14824 351 3963 -8644 3320 11612 -6381 -1625 18501 -2089 -10311
1517a0311K1156j7088n695K3556j9613n556K6622j4636n551K2078j0518j0627
$$ -10311 10845 -6243 -11938 11618 -7995 -13551 13071 -1565 -7116 14962 4444 -6183
1529f183J2798l051r968Q618P71j8821R288K0772j9644k364J8206j5202P253J7778
$$ -6183 6615 3564 -6404 2214 2985 -15836 -6548 14224 -5420 -7784 10422 -4780 2473 20251
1543B0251k8170k137K1906j4064l849P681j1602M042J4381n958r875J0231Q121
$$ 20251 -7919 -10056 11850 -2214 -6063 1618 -9984 -5942 8439 2481 -7394 2837 10958
1556A0958j2532M322M879j8141J0223J0622k5820Q298J6301j7691P489R643j3630
$$ 10958 -1574 2748 7627 -10514 -291 10331 -15489 -7191 9110 -8581 -1092 8551 -5079
1569e079P672Q890j1119l881N116p79n238L508o34j0196J2933P011j5076J1012
$$ -5079 2593 11483 364 -3517 1599 820 -4418 -910 -1544 -11740 1193 8204 -6872 4140
1583D140L689j4381J4790J253j8203P946K117r096O510J932n784R49P719J507
$$ 4140 7829 -6552 8238 9491 -8712 -766 1351 -7745 -1235 697 -5087 -4138 3581 5088
1597E088n439O272o49j0663R586q19j1371R428m041q070J3487j991m264Q829l675
$$ 5088 -351 5921 5272 -5391 4195 3376 -7995 1433 -2608 -10678 2809 818 -3446 5383 1708
1612A708j716N691q87m247l938L166j772n206Q555k248p086J1802k087k477J1143
$$ 1708 -8 5683 4796 549 -3389 -223 -1995 -7201 1354 -894 -7980 3822 1735 -742 10401
1627A0401q703m384P235n748J022K35p147K193K611K704J361l643N020J62j993
$$ 10401 1698 -2686 4549 -1199 -177 58 -7089 -4896 -2285 419 1780 -1863 3157 3319 1326
$$ [...]
8191H5
##END NTUPLES=NMR FID
##END=
