##TITLE=1H_DE-66
 CDCl3
 8 sc, 
 1.10.2024
##JCAMPDX= 6.0         $$ Bruker NMR JCAMP-DX V2.0
##DATA TYPE= NMR FID
##DATA CLASS= NTUPLES
##ORIGIN= UXNMR, Bruker Analytische Messtechnik GmbH
##OWNER= root
$$ XWIN-NMR		Version 3.5
$$ Tue Oct  1 16:41:42 2024 Russian Standard Time (UT+4h)  she@DPX200
##.OBSERVE FREQUENCY= 200.1318
##.OBSERVE NUCLEUS= ^1H
##.DELAY= (6, 6)
##.ACQUISITION MODE= SIMULTANEOUS
##.ACQUISITION SCHEME= undefined
##.AVERAGES= 8
##.DIGITISER RES= 18
##SPECTROMETER/DATA SYSTEM= spect
##.PULSE SEQUENCE= zg30
##.SOLVENT NAME= DMSO
##.SHIFT REFERENCE= (INTERNAL, DMSO, 0, 15.7039)
##AUDIT TRAIL= $$ (NUMBER, WHEN, WHO, WHERE, WHAT)
$$ ##TITLE= Audit trail, XWIN-NMR		Version 3.5
$$ ##JCAMPDX= 5.01
$$ ##ORIGIN= Bruker BioSpin GmbH
$$ ##OWNER= she
$$ F:/spectra/data/she/nmr/H-F/1/audita.txt
$$ ##AUDIT TRAIL=  $$ (NUMBER, WHEN, WHO, WHERE, WHAT)
(   1,<2024-10-01 16:40:39.42 +0400>,<she>,<DPX200>,
      <created by zg, POWCHK disabled, PULCHK disabled
       configuration hash MD5:
       00 E9 B6 7A A2 85 ED C7 34 08 36 98 17 FE 4E 26
       data hash MD5: 16K
       1F 01 91 7D 10 DF 4E BE 00 5A EA A8 28 49 21 97>)
$$ ##END=
$$ 
$$ hash MD5
$$ BB 49 EF 66 8F 6D 90 92 99 62 93 47 84 6B 5D DE
##$RELAX= 
##$RELAX= 
##$RELAX= 
##$RELAX= 
##$RELAX= 
##$RELAX= 
$$ Bruker specific parameters
$$ --------------------------
##$DU= <F:/spectra>
##$EXPNO= 1
##$NAME= <H-F>
##$PROCNO= 1
##$TYPE= <nmr>
##$USER= <she>
##$AMP= (0..31)
100 100 100 100 100 100 100 100 100 100 100 100 100 100 100 100 100 100 
100 100 100 100 100 100 100 100 100 100 100 100 100 100 
##$AQSEQ= 0
##$AQ_mod= 1
##$AUNM= <au_zg>
##$AUTOPOS= <>
##$BF1= 200.13
##$BF2= 200.13
##$BF3= 200.13
##$BF4= 200.13
##$BF5= 200.13
##$BF6= 200.13
##$BF7= 200.13
##$BF8= 200.13
##$BYTORDA= 1
##$CFDGTYP= 0
##$CFRGTYP= 5
##$CHEMSTR= <none>
##$CNST= (0..31)
1 1 145 1 1 1 1 1 1 1 1 1 1 1 1 1 1 1 1 1 1 1 1 1 1 1 1 1 1 1 1 1 
##$CPDPRG= <>
##$CPDPRG1= <>
##$CPDPRG2= <>
##$CPDPRG3= <>
##$CPDPRG4= <mlev>
##$CPDPRG5= <mlev>
##$CPDPRG6= <mlev>
##$CPDPRG7= <mlev>
##$CPDPRG8= <mlev>
##$CPDPRGB= <>
##$CPDPRGT= <>
##$D= (0..31)
0 1.2 0 0 0 0 0 0 0 0.06 0 0.03 0 0 0 0 0.0002 0 0 0 0 0 0 0 0 0 0 0 0 
0 0 0 
##$DATE= 1727786438
##$DBL= (0..7)
120 120 120 120 120 120 120 120 
##$DBP= (0..7)
150 150 150 150 150 150 150 150 
##$DBP07= 0
##$DBPNAM0= <>
##$DBPNAM1= <>
##$DBPNAM2= <>
##$DBPNAM3= <>
##$DBPNAM4= <>
##$DBPNAM5= <>
##$DBPNAM6= <>
##$DBPNAM7= <>
##$DBPOAL= (0..7)
0.5 0.5 0.5 0.5 0.5 0.5 0.5 0.5 
##$DBPOFFS= (0..7)
0 0 0 0 0 0 0 0 
##$DE= 6
##$DECBNUC= <off>
##$DECIM= 24
##$DECNUC= <off>
##$DECSTAT= 4
##$DIGMOD= 1
##$DIGTYP= 9
##$DL= (0..7)
0 120 120 120 120 120 120 120 
##$DP= (0..7)
150 150 150 150 150 150 150 150 
##$DP07= 0
##$DPNAME0= <>
##$DPNAME1= <>
##$DPNAME2= <>
##$DPNAME3= <>
##$DPNAME4= <>
##$DPNAME5= <>
##$DPNAME6= <>
##$DPNAME7= <>
##$DPOAL= (0..7)
0.5 0.5 0.5 0.5 0.5 0.5 0.5 0.5 
##$DPOFFS= (0..7)
0 0 0 0 0 0 0 0 
##$DQDMODE= 0
##$DR= 18
##$DS= 0
##$DSLIST= <SSSSSSSSSSSSSSS>
##$DSPFIRM= 0
$$ [...]
##$SUBNAM2= <"">
##$SUBNAM3= <"">
##$SUBNAM4= <"">
##$SUBNAM5= <"">
##$SUBNAM6= <"">
##$SUBNAM7= <"">
##$SUBNAM8= <"">
##$SUBNAM9= <"">
##$SW= 24.0689170037331
##$SWIBOX= (0..15)
0 0 2 0 0 0 0 0 0 0 0 0 0 0 0 0 
##$SW_h= 4816.95568400771
##$TD= 16384
##$TD0= 1
##$TE= 0
##$TE2= 300
##$TE3= 300
##$TEG= 300
##$TL= (0..7)
0 120 120 120 120 120 120 120 
##$TP= (0..7)
150 150 150 150 150 150 150 150 
##$TP07= 0
##$TPNAME0= <>
##$TPNAME1= <>
##$TPNAME2= <>
##$TPNAME3= <>
##$TPNAME4= <>
##$TPNAME5= <>
##$TPNAME6= <>
##$TPNAME7= <>
##$TPOAL= (0..7)
0.5 0.5 0.5 0.5 0.5 0.5 0.5 0.5 
##$TPOFFS= (0..7)
0 0 0 0 0 0 0 0 
##$TUNHIN= 0
##$TUNHOUT= 0
##$TUNXOUT= 0
##$USERA1= <user>
##$USERA2= <user>
##$USERA3= <user>
##$USERA4= <user>
##$USERA5= <user>
##$V9= 5
##$VALIST= <valist>
##$VCLIST= <CCCCCCCCCCCCCCC>
##$VD= 0
##$VDLIST= <DDDDDDDDDDDDDDD>
##$VPLIST= <PPPPPPPPPPPPPPP>
##$VTLIST= <TTTTTTTTTTTTTTT>
##$WBST= 1024
##$WBSW= 4
##$XGAIN= (0..3)
0 0 0 0 
##$XL= 0
##$YL= 0
##$YMAX_a= 515447
##$YMIN_a= -452393
##$ZGOPTNS= <>
##$ZL1= 120
##$ZL2= 120
##$ZL3= 120
##$ZL4= 120
##$ABSF1= 10
##$ABSF2= 0
##$ABSG= 5
##$ABSL= 3
##$ALPHA= 0
##$AQORDER= 0
##$ASSFAC= 0
##$ASSFACI= 0
##$ASSFACX= 0
##$ASSWID= 0
##$AUNMP= <proc_1d>
##$AZFE= 0.1
##$AZFW= 0.1
##$BCFW= 1
##$BC_mod= 2
##$BYTORDP= 1
##$COROFFS= 0
##$CY= 11.3945322036743
##$DATMOD= 1
##$DC= 2
##$DFILT= <>
##$DTYPP= 0
##$F1P= 15.6554695791079
##$F2P= 12.8336369535428
##$FCOR= 0.5
##$FTSIZE= 0
##$FT_mod= 4
##$GAMMA= 1
##$GB= 0.15
##$INTBC= 1
##$INTSCL= 1
##$ISEN= 128
##$LB= 0.24
##$LEV0= 0
##$LPBIN= 0
##$MAXI= 10000
##$MC2= 0
##$MEAN= 0
##$ME_mod= 0
##$MI= 1.114404
##$NCOEF= 0
##$NC_proc= 0
##$NLEV= 6
##$NOISF1= 3.799351
##$NOISF2= 2.8
##$NSP= 1
##$NTH_PI= 0
##$NZP= 0
##$OFFSET= 15.70392
##$PC= 1
##$PHC0= -26162.95
##$PHC1= 18.58747
##$PH_mod= 1
##$PKNL= yes
##$PPARMOD= 0
##$PSCAL= 0
##$PSIGN= 0
##$REVERSE= no
##$SF= 200.130013532006
##$SI= 16384
##$SIGF1= 3
##$SIGF2= 2
##$SINO= 400
##$SIOLD= 16384
##$SREGLST= <1H.CDCl3>
##$SSB= 0
##$STSI= 0
##$STSR= 0
##$SW_p= 3612.71676300578
##$SYMM= 0
##$S_DEV= 0
##$TDeff= 0
##$TDoff= 0
##$TI= <>
##$TILT= no
##$TM1= 0
##$TM2= 0
##$TOPLEV= 0
##$USERP1= <user>
##$USERP2= <user>
##$USERP3= <user>
##$USERP4= <user>
##$USERP5= <user>
##$WDW= 1
##$XDIM= 8192
##$YMAX_p= 0
##$YMIN_p= 0
$$ End of Bruker specific parameters
$$ ---------------------------------
##NTUPLES= NMR FID
##VAR_NAME=  TIME,          FID/REAL,        FID/IMAG
##SYMBOL=    X,             R,               I
##VAR_TYPE=  INDEPENDENT,   DEPENDENT,       DEPENDENT
##VAR_FORM=  AFFN,          ASDF,            ASDF
##VAR_DIM=   8192,          8192,            8192
##UNITS=     SECONDS,       ARBITRARY UNITS, ARBITRARY UNITS
##FACTOR=    0.0002076,     1,               1
##FIRST=     0,             0,               0
##LAST=      1.7004516,     0,               0
##MIN=       0,             -452393,         0
##MAX=       1.7004516,     515447,          0
$$ Real data points
##PAGE= N=1
##DATA TABLE= (X++(R..R)), XYDATA
0@%%%%Qj6J6j6K4l2M0n7P3q8J06j31J62j98K38k80L27l82M50n25O03o90P89r03
$$ 0 0 0 0 0 8 -8 8 -8 16 -16 24 -33 40 -48 58 -73 89 -109 129 -151 176 -206 244 -281 322 -368 421 -482
28d82J028j166J318j481J663j868K093k335K597k888L210l563L954m381M845n360
$$ -482 546 -620 698 -783 880 -988 1105 -1230 1367 -1521 1689 -1874 2080 -2301 2544 -2816
44b816N936o579P296q103R020j0071J1295j2739J4465j6573J9218k2659K7337
$$ -2816 3120 -3459 3837 -4266 4754 -5317 5978 -6761 7704 -8869 10349 -12310 15027
57A5027l4110M4907o5506J62463n08864J12552N81764m00348J72957J4478n38789
$$ 15027 -19083 25824 -39682 122781 -386083 -273531 308233 -92115 80842 95320 -443469
68d43469M45841M76513p52786K7371N48189l55654k0889L10276m84657J09516
$$ -443469 2372 478885 -273901 -246530 301659 -53995 -74884 235392 -249265 -139749
78a39749N14304n14909j55885N84762k80806k09544M09870k43793j05990M90827
$$ -139749 374555 -140354 -296239 288523 7717 -201827 208043 -35750 -141740 349087
88C49087l35217l19264N17660j06682l50168L72620p2597k89616L50566q7180
$$ 349087 13870 -305394 212266 105584 -244584 128036 55439 -234177 116389 29209
98B9209k89161M56097l966m82706K79585J92728k80216J55020k2901l03219L65541
$$ 29209 -259952 196145 192179 -290527 -10942 181786 -98430 56590 33689 -269530 96011
109I6011J60135m82354R6050K95681j76400R0618N2025l39893J82408K92996l19074
$$ 96011 256146 -226208 -130158 165523 -10877 79741 131766 -208127 -25719 267277 -51797
120e1797n7210J95697j83110M6207J85675k47893P779K64544j80564p7526J93197
$$ -51797 -109007 86690 -96420 -50213 135462 -112431 -104652 159892 -20672 -98198 94999
131I4999j25525k7065J85058j68325q4500K06015q6920q0876J65234p8838o2305
$$ 94999 -30526 -57591 127467 -40858 -125358 80657 -6263 -87139 78095 -743 -63048
142f3048J76757p7475j12839J42740k1864o5717R7268j07752j00822J77507J1609
$$ -63048 113709 36234 -76605 66135 44271 -21446 75822 -31930 -132752 44755 56364
153E6364j14977N5213k2655k5321J31063n1324j08634J10883N198q7236O5386
$$ 56364 -58613 -3400 -26055 -51376 79687 28363 -80271 30612 35810 -51426 13960
164A3960k2556o3065J02799n110p0587Q5801k1005p5725J17178K0090r9549L7660
$$ 13960 -8596 -71661 31138 26028 -44559 41242 20237 -55488 61690 81780 -17769 19891
176A9891k2950n9082J13030j0713j26814P4898L6702p5598P0759O178q4759J00216
$$ 19891 -3059 -62141 50889 40176 -86638 -11740 24962 -50636 20123 26301 -58458 41758
188D1758J6163j39311O6862O5581r7866L8992K5856q9902R4316N1092j49207N9587
$$ 41758 57921 -81390 -14528 51053 -46813 -7821 18035 -71867 22449 73541 -75666 -16079
200a6079J25583r7362j2385L2212r6894P5768R5707j60771k2646J18921p3908
$$ -16079 109504 12142 -243 31969 -64925 10843 106550 -54221 -76867 42054 -31854
211c1854J628R6603r8979q452J16029r4848l4269J21518p8887n5822J14326n8522
$$ -31854 -30226 66377 -32602 -41054 74975 -19873 -54142 67376 -11511 -67333 46993 -11529
223a1529n4822J14249n0729n5973J36798l0453j01166R1267r193o6438J00425
$$ -11529 -66351 47898 -2831 -58804 77994 47541 -53625 37642 28449 -37989 62436
234F2436l2471j17903R4225K2773r4698P9898K7523r7481O1866L1211q7653P0011
$$ 62436 29965 -87938 6287 29060 -65638 14260 41783 -55698 6168 37379 -50274 19737
246A9737L8589j18903L5884O7139q5502K0885N5231p4054L8517P3082r1489j954
$$ 19737 58326 -60577 -24693 42446 -43056 -22171 33060 -40994 -2477 70605 -20884 -22838
258b2838Q1680n5000l174N7653q3388k4209Q2230m1535k4328O5260m6858l0277
$$ -22838 58842 3842 668 58321 -25067 -49276 32954 -8581 -32909 32351 -14507 -44784
270d4784P5850k4641l1891O4784l2737n3063N9996q680m6537M9771l220l8698
$$ -44784 31066 6425 -25466 39318 6581 -46482 13514 4834 -41703 8068 4848 -33850
282c3850N2324j92m6334N2149J9410m7756K3740L573n0424K6424K0912m0012J5774
$$ -33850 18474 18282 -28052 24097 43507 -4249 19491 23064 -27360 -936 19976 -20036 -4262
295d262J1634m1491K3674L5664k9657N620J8239l4684K945K4470k5856j377K0745
$$ -4262 7372 -34119 -10445 25219 -4438 1182 19421 -15263 -12318 12152 -13704 -15081 5664
308E664k2519K9K5514j4396L605L2098j1561j4469J0857j1982m323J7610j3385
$$ 5664 -16855 -16826 8688 -5708 -2103 29995 18434 3965 14822 2840 -1483 16127 2742
321B742j6168Q532q979m290K4414L635j1406M794l678n348J1155k733j1052L938
$$ 2742 -13426 -4894 -13873 -18163 6251 9886 -1520 3274 -404 -5752 5403 2670 -8382 -4444
335d444m993r822J0051Q577L59R421L723n389K317J090j860N017m212j4699m810
$$ -4444 -9437 -19259 -9208 -631 -272 9149 12872 7483 9800 10890 9030 14047 9835 -4864 -9674
350i674K25q95O602N838k083j553j401M00P397K854o912n745m478n275J819P132
$$ -9674 -9449 -10344 -3742 2096 13 -1540 -2941 -2541 4856 7710 798 -4947 -9425 -14700 -12881 -5749
366e749N147K575q10k50O216O655J511k53l393q472p191j879J450J782m70j505
$$ -5749 -602 1973 1163 913 7129 13784 15295 15042 11649 3177 -4014 -5893 -4443 -2661 -3131 -4636
382d636K22R33J513N144N251j321p909q075k659K176L373K146l91k691J35P156
$$ -4636 -4414 -3481 -1968 3176 8427 7106 -803 -8878 -11537 -9361 -5988 -3842 -4233 -6924 -6789 367
398C67J0607O099k327n888l374j039j854k022j594k619k714n52K061K817L376
$$ 367 10974 17073 14746 8858 5484 4445 2591 569 -1025 -3644 -6358 -6910 -4849 -2032 1344
413A344L982K271l073p626n695J950N093j56n800m648j68O347J2012P991j642
$$ 1344 5326 7597 4524 -3102 -8797 -6847 -1754 -1910 -7710 -12358 -12526 -6179 5833 13824 12182
428A2182n153l056J514N479j112r174m943j268k843K745M367o22K991M222k874
$$ 12182 7029 3973 5487 10966 9854 680 -4263 -5531 -8374 -5629 -1262 -1884 1107 5329 2455
443B455j686k82m824K915N220r991r223L524K706P395J1597l690n468N925J46
$$ 2455 769 487 -4337 -1422 3798 -6193 -15416 -11892 -9186 -1791 9806 6116 648 6573 6719
458F719J656R351q540j4576K843j343m740Q734o60o949R917J808q837Q006K491
$$ 6719 8375 17726 9186 -5390 -2547 -3890 -8630 104 -556 -7505 2412 4220 -4617 3389 5880
473E880r289P041j098j9680K620J0387l363Q989M220j5134P465J6606o643L747
$$ 5880 -3409 3632 2534 -17146 -14526 -4139 -7502 1487 5707 -9427 -1962 14644 8001 11748
487A1748O313j9317l802J2044j0336k114R893j2490l87J6536j0452m471J8262
$$ 11748 18061 -1256 -5058 6986 -3350 -5464 4429 -8061 -8448 8088 -2364 -6835 11427
500A1427n546q478Q621j3935j0330J8683j795j0290J1477n958p553K3133M788
$$ 11427 5881 -2597 6024 -7911 -18241 442 -1353 -11643 -166 -6124 -13677 9456 14244
513A4244j1208J1136m209j6389J2505L097j4376O474k427j4229J5303P989j5545
$$ 14244 3036 14172 9963 -6426 6079 9176 -5200 1274 -1153 -15382 -79 7910 -7635
526g635P676J0234q948M023l022j8719J0647J4608j3746n501J11o468J8044J6855
$$ -7635 41 10275 1327 5350 2328 -16391 -5744 8864 -4882 -10383 -10272 -16740 1304 18159
540A8159j4327m370P301m207O688M777j5948j286N899j1198K302R757p999J799
$$ 18159 3832 -538 6763 2556 9244 14021 -1927 -3213 2686 -8512 -6210 3547 -4452 -2653
554b653Q525n643M485K742j6357L750J4062j0813p000k61r121J3823J7143j3429
$$ -2653 5872 229 4714 7456 -8901 -5151 8911 -1902 -8902 -9163 -18284 -4461 12682 -747
568g47r56J0470j1098O250J6646j4096n172L585k0611P362K6560j9706j4531J6516
$$ -747 -1703 8767 -2331 3919 20565 6469 1297 4882 -15729 -8367 18193 -1513 -16044 472
582D72k948Q404J4751l3476p207M2137r371k8944P089r364P184L5879k7134k8537
$$ 472 -2476 5928 20679 -12797 -20004 22133 12762 -16182 -9093 -18457 -11273 24606 -2528 -31065
596c1065M0856N033k2140K4406n298k0876K8219j4462l4435M2320R225m5308J7905
$$ -31065 9791 14824 -7316 17090 11792 -9084 19135 4673 -29762 12558 21783 -23525 -5620
609e620J2897k3155L2437L645m9009L1354K8609m8704O690K1793l6937K1182K8712
$$ -5620 7277 -15878 16559 20204 -28805 2549 31158 -17546 -10856 10937 -26000 -4818 23894
622B3894n0264R641M1803l9685Q368M8478m4670j6160M0795k9429Q0M4396n3708
$$ 23894 -26370 -16729 25074 -14611 -6243 42235 -2435 -18595 22200 -7229 -7149 37247 -16461
635a6461k5180O8709j5948l4558M0418j9148j6788N8446l2428n3397O2209N763
$$ -16461 -41641 27068 11120 -23438 16980 -2168 -18956 39490 7062 -46335 15874 21637
647B1637n0799L4423n397l9535N8572N210o2630M7609K7984n8721K5679K1159
$$ 21637 -29162 5261 -136 -39671 18901 24111 -38519 9090 37074 -21647 4032 25191
659B5191n0639L6864K4551p5062J9329N2822m8716Q158L6329n4906J4823N6990
$$ 25191 -25448 11416 35967 -39095 -19766 33056 -15660 -7502 28827 -26079 -11256 45734
671D5734n7529j3738N3885l8712r559M9347n0304k0478P1157k1052l1967M5527
$$ 45734 -11795 -25533 28352 -10360 -19919 29428 -20876 -41354 29803 8751 -23216 22311
683B2311k6268k1828O7316k0843n3981M7213j557l9208M3745o959m6483M9856
$$ 22311 -3957 -25785 41531 20688 -33293 13920 12363 -26845 16900 9941 -36542 13314
695A3314J0475n2457L4857J7215m5854L0486J6783n3209K1569K5679m6205J8619
$$ 13314 23789 -28668 6189 23404 -22450 8036 24819 -28390 -6821 18858 -27347 -8728
707h728L1194m4154J1227L5823l8063N831L8289l4380m196K9516l6827k992M5904
$$ -8728 22466 -21688 -10461 25362 -12701 -6870 31419 -2961 -7157 22359 -14468 -17460 28444
720B8444k7253k4004K8942j1395L17L4422l2031k5259M5622J020l0201Q722r941
$$ 28444 1191 -22813 6129 -5266 -4949 29473 -2558 -27817 17805 18825 -11376 -2654 -12595
733a2595l278L7513j6272l9166K7658K0291j2096R215q247j6228K5646K999k7312
$$ -12595 -15873 21640 5368 -33798 -6140 14151 2055 11270 3023 -13205 12441 15440 -11872
746a1872J0971R565j6470M584K832q444J6244L937j9001P140J0071r910J076r45
$$ -11872 -901 8664 -7806 -3222 -390 -8834 7410 11347 -7654 -514 9557 -353 723 -222
760b22q857Q655Q17j2208O912N204n152R389L384p251L884m274l994J7265k776
$$ -222 -9079 -424 393 -11815 -4903 301 -4851 4538 7922 671 4555 281 -3713 13552 10776
775A0776k2653K123P248L142J1756j3267j7465K4131J1604j9144J045j75o956
$$ 10776 -11877 -9754 -2506 636 12392 -875 -18340 5791 17395 -1749 -704 -879 -7835
788g835J8450n836k9661J6847J7631j7075P645N451j8106J8746J2684k8219J0342
$$ -7835 10615 4779 -24882 -8035 9596 -7479 166 5617 -12489 6257 18941 -9278 1064
801A064J8337k8133J095J7489k1355Q773K0371l0986J590L1799k1957n186K6460
$$ 1064 19401 -8732 -7637 9852 -11503 -2730 17641 -13345 -11755 20044 -1913 -7099 19361
814A9361k3975q301K9237k3205j2927L2858j8330j5982L6590j2408k2871L3914
$$ 19361 -4614 -12915 16322 -6883 -19810 13048 -5282 -21264 15326 2918 -19953 13961
826A3961m573k0069L1150j3120l3689L6017O829l3911K0743K308k8095L2576J0157
$$ 13961 9388 -10681 20469 7349 -26340 9677 16506 -17405 3338 5646 -22449 10127 20284
839B0284l9869K1725K0012l4863J2045J5120l4395J5659K2678l8607O575L0984
$$ 20284 -19585 2140 22152 -12711 -666 14454 -19941 -4282 18396 -20211 -13636 17348
851A7348k9319K596L1052k6557j348K8778k9829o439L6632k3227j7671K9959j6276
$$ 17348 -11971 -9375 21677 -4880 -6228 22550 -7279 -13718 22914 -313 -17984 11975 -4301
864d301j2343L4555j4579j9912L3264q852k4562K9195m057k6605K4569j945k6790
$$ -4301 -16644 17911 3332 -16580 16684 7832 -16730 12465 8408 -18197 6372 4427 -22363
877b2363K5700M637k8037K3734J2812k7562J3981J0520k4657J6518J3487l2452
$$ -22363 3337 7974 -20063 3671 16483 -11079 2902 13422 -11235 5283 18770 -13682
889a3682N512J9495k1478N536J8336k1899K926K0950j9915j402K1983j8043q732
$$ -13682 -8170 11325 -10153 -4617 13719 -8180 -5254 15696 -4219 -5621 16362 -1681 -10413
902a0413J8456j3481p268J9181j1087p828K1834o903j2526J8119j337j0456J3606
$$ -10413 8043 -5438 -12706 6475 -4612 -12440 9394 2491 -10035 8084 6747 -3709 9897
915I897o004j4866J4341R82j3849J0849L154j1626R252L997j0306R426M664j4734
$$ 9897 3893 -10973 3368 4350 -9499 1350 4504 -7122 2130 6127 -4179 5247 9911 -4823
929d823K492N658r780K796M976r128L308P568p374K356R185m761j115M172o520
$$ -4823 -2331 3327 -6453 -3657 1319 -7809 -4501 3067 -4307 -1951 7234 2473 1358 5530 -990
944i90j188N831m662k387M466l723j236O811k36j250L301k628k473K635k588l033
$$ -990 -2178 3653 -1009 -3396 1070 -2653 -3889 2922 2686 1436 4737 2109 -364 2271 -317 -3350
960c350K212j286k446J373O0J574M649K12j725P72k11q8Q28k351j715L77j524
$$ -3350 -1138 -2424 -4870 -3497 -3437 -1863 2786 2998 1273 2045 1834 1746 2574 223 -1492 -1115 -2639
977b639k08K385R90J203J398j772J3J555j665j131L17k961j800J015q70J228L551
$$ -2639 -2847 -462 528 1731 3129 1357 1370 2925 1260 129 446 -2515 -4315 -3300 -4170 -2942 609
994F09l70k55K375o46k84K727j403k951r6k002j114L359L47j502K212L43q12K733
$$ 609 239 -16 2359 1713 1429 4156 2753 -198 -294 -2296 -3410 -51 296 -1206 1006 1349 537 3270
1012C270K69k486N06j522l653M54P12j342J585J304j438K216K481q64J174J178
$$ 3270 3539 1053 1559 37 -3616 -3162 -2450 -3792 -2207 -903 -2341 -125 2356 1492 2666 3844
1028C844k418j106k63k253L31J880r39k49J380k48J211K802k48j615j033k220
$$ 3844 1426 320 57 -2196 -1865 15 -924 -1173 207 -41 1170 3972 3724 2109 1076 -1144
1044a144j027J240o55j585o2M5Q59K776J545k15L02J3o70j22q66j579k69L33k96
$$ -1144 -2171 -931 -1586 -3171 -3233 -3188 -2329 447 1992 1777 2079 2092 1422 1300 434 -1145 -1414 -1081 -1377
1063a377J6M74Q51J822J827j84j610j417o97M43Q2j672k267p52J220K215J918
$$ -1377 -1361 -887 -36 1786 3613 3429 1819 402 -295 148 230 -1442 -3709 -4461 -3241 -1026 892
1080H92L85o02K11J010P40m45j620j627m14K51j14l56K69J310J963R98n99j030
$$ 892 1277 675 886 1896 2636 2191 571 -1056 -1470 -1219 -1333 -1689 -1420 -110 1853 2851 2252 1222
1098A222m80L65N35j245k893j829L92J826K072L44j210L29J785J510Q51j094k734
$$ 1222 742 1107 1642 397 -2496 -4325 -3933 -2107 -35 309 -901 -572 1213 2723 3574 2480 -254
1115b54q74N41k80k60k67n23J481K265j7k94M48m82L90M59k708k632l5K37J021
$$ -254 -1128 -587 -867 -1127 -1394 -1917 -436 1829 1812 1518 1966 1484 1874 2333 -375 -3007 -3042 -2805 -1784
1134a784J511j308r28K407J858R09Q38k008k329Q10J20r41J25j069p95K427J330
$$ -1784 -273 -1581 -2509 -102 1756 2665 3503 1495 -834 -24 96 -845 -720 -1789 -2584 -157 1173
1151A173m07R43P04m99O85r50k809m54L79p93K60k11j185J668K350N88P59j11
$$ 1173 766 1709 2413 1914 2599 1649 -1160 -1614 -1235 -2028 -1768 -1979 -3164 -1496 854 1442 2201 2090
1169B090j318Q9J27j058l15p35j225N98Q90M50J526N58k35R81k82j411K82j075
$$ 2090 772 861 988 -70 -385 -1120 -2345 -1747 -857 -407 1119 1677 1442 2423 2141 730 1012 -63
1187f3j623P21r82j824J776J260L28K603o01k413K816J112k896N43j021l118K771
$$ -63 -1686 -965 -1947 -3771 -1995 -735 -407 2196 1595 -818 1998 3110 214 757 -264 -3382 -611
1204f11Q31l881K917L049k563K314J395m748K750L217o044n08K313n262J890N155
$$ -611 220 -3661 -744 2305 -258 2056 3451 -1297 1453 4670 -1374 -1882 431 -4831 -2941 2214
1220B214n363N80O087m494J83O813n430k334O312n695l547P574m476l762Q576
$$ 2214 -3149 -2569 3518 -976 -793 6020 590 -1744 4568 -1127 -4674 2900 -1576 -5338 3238
1235C238l062m298R705k387o928Q754j178q021P159k416r619J0035K604j0488
$$ 3238 176 -4122 5583 3196 -3732 5022 3844 -4177 2982 566 -9053 982 3586 -6902
1249f902O425L158q493R748M595j3701M737O814j1031M049O007j3418M061J0999
$$ -6902 -477 2681 -5812 3936 8531 -5170 -433 6381 -4650 -601 5406 -8012 -3951 7048
1263G048j1503J180J1120j0284Q01J2020j2055l350J2903j0168n098J3247q411
$$ 7048 -4455 -3275 7845 -2439 -1638 10382 -1673 -5023 7880 -2288 -7386 5861 -2550
1276b550n995J4382o424p101J6063m201j0895J2630k916j0469J3390k509j4723
$$ -2550 -8545 5837 -587 -7688 8375 4174 -6721 5909 2993 -7476 5914 3405 -11318
1289a1318J2365L171j2198J0777K892j3402J1060O367j5372N932O797j3977N691
$$ -11318 1047 4218 -7980 2797 5689 -7713 3347 9714 -5658 274 7071 -6906 -1215
1302a215Q001j5247L304J1690j1331K232J1291j2336J46J3202j0622l552J1425
$$ -1215 6786 -8461 -5157 6533 -4798 -2566 8725 -3611 -3465 9737 -885 -4437 6988
1315F988r649m150J2475p924n272J3718n106o958J2128l280p299J0768l927r822
$$ 6988 -2661 -6811 5664 -2260 -7532 6186 1080 -5878 6250 2970 -4329 6439 2512 -7310
1329g310J0489o42j0443Q074J312p798R033J672j0057P375M874q939L545K408
$$ -7310 3179 2537 -7906 168 1480 -6318 2715 4387 -5670 1705 6579 -2360 1185 3593
1343C593q891M462M471q658K513N705n841K284N173n855J345M991n837p87L657
$$ 3593 -5298 -836 3635 -5023 -2510 3195 -2646 -362 4811 -1044 301 5292 -545 -1332 2325
1358B325m801k99M058l652m52M022k003N16L529k504m40J973k361n69J033k562
$$ 2325 -2476 -2775 1283 -2369 -2821 1201 -802 -286 3243 739 299 2272 -89 -658 375 -2187
1374b187O73J486k247J407K257j357J836O71l276K643R90m875J045J214l534K913
$$ -2187 -1514 -28 -2275 -868 1389 32 1868 2539 -737 1906 2896 -1979 -934 280 -3254 -341
1390c41J072n261M083M751n290J634L057n790K942L795q765J190O340p067L77
$$ -341 731 -4530 -447 4304 -986 648 3705 -2085 857 4652 -4113 -2923 3417 -3650 -3273
1405c273O938o507J113Q489q046j410R988p439m107R285o795m486J0692o080n800
$$ -3273 3665 -2842 -1729 6760 -1286 -2696 7292 -147 -4254 5031 -1764 -6250 4442 -1638 -7438
1420g438J2907l697p968J2178k413r357J1287j857j1543J1028O1j2769J1092L561
$$ -7438 5469 1772 -6196 5982 3569 -5788 5499 3642 -7901 3127 3188 -9581 1511 5072
1434E072j3258R563N503j3088Q566O278j5406O480R009j5731L127J0670j3384
$$ 5072 -8186 1377 6880 -6208 2358 8636 -6770 -290 8719 -7012 -3885 6785 -6599
1447f599K527J2054j3468J160J4833j2497l032J4596j0609n235J3864r955o271
$$ -6599 -4072 7982 -5486 -4326 10507 -1990 -5022 9574 -1035 -6270 7594 -2361 -8632
1460h632J5934p885r061J6389l833j0376J4415k802j1350J3549k217j4055J3181
$$ -8632 7302 -583 -9644 6745 2912 -7464 6951 4149 -7201 6348 4131 -9924 3257
1473C257J689j5041J0730M597j3135R791N244j4177Q987P540j6189M925R914j3686
$$ 3257 4946 -10095 635 5232 -7903 1888 7132 -7045 1942 9482 -6707 -1782 8132 -5554
1487e554J996Q876j1951L780J1479j3595l92J4749q854m303R969q131k116J1631
$$ -5554 -3558 5318 -6633 -2853 8626 -4969 -5361 9388 534 -3769 6200 -1931 -4047 7584
1501G584j0225o624J4532l486q509R667j582m683J0342m957r421J1930J101j1791
$$ 7584 -2641 -9265 5267 1781 -6728 2939 1357 -3326 7016 2059 -7362 4568 5669 -6122
1515f122N056K228o025P028Q2r297Q287N760r712K073N287o211J731K517p491
$$ -6122 -1066 1162 -4863 2165 2247 -7050 1237 6997 -2715 -642 4645 -1566 165 2682 -4809
1530d809L194N657p930l47P864l046j645L712l323J047M773o270l245O521j217
$$ -4809 -1615 4042 -3888 -4235 3629 583 -1062 2650 -673 374 5147 -1123 -4368 2153 936
1545I36m295K198kM28L634l047k535N848R72n040l64J227K64Q79k960k570M128
$$ 936 -3359 -1161 -1163 -735 2899 -148 -2683 3165 4137 -903 -1267 -40 224 1103 -1857 -4427 -299
1562b99K906k746j219J627J726N41j831j863J121R35j540j574M03J701K79j147
$$ -299 2607 -139 -1358 269 1995 2536 705 -1158 -37 898 -642 -2216 -1813 -112 167 -980
1578i80Q55J694j73l23l98q14J062k46k714N20J667j531K31J858o91O63J094j983
$$ -980 -125 1569 1396 1073 675 -139 923 677 -2037 -1517 150 -1381 -1150 708 17 680 1774 -209
1596b09R86K368l297k133K446o99p75J328k061J47M364j343k407L019n2k041J736
$$ -209 777 3145 -152 -2285 161 -538 -1313 15 -2046 -1899 2465 1122 -1285 1734 1682 -359 1377
1613A377j349k442K890o31k962L091J191k626K272J182k336K217N69l895J273
$$ 1377 28 -2414 476 -155 -3117 -26 1165 -1461 811 1993 -343 1874 2443 -1452 -179
1628a79J583l589P93K203k783N57K665k021J267K515l200o58L183k230j646J770
$$ -179 1404 -2185 -1392 811 -1972 -1415 1250 -771 496 3011 -189 -847 2336 106 -1540 230
1644B30j831m83L069j666j378L696j86j762K174n46j873J860j068k590K274L16
$$ 230 -1601 -2084 985 -681 -2059 1637 1451 -311 1863 1317 -556 1304 236 -2354 -80 236
1660B36k626J536J321j092J815N66k310J166J313k280K9P86k201J83J490j081
$$ 236 -2390 -854 467 -625 1190 1756 -554 612 1925 -355 -326 460 -1741 -1558 -68 -1149
1676a149O05J592j040J55K028j035r99P81j167n44Q44j115j035J605L76k50J170
$$ -1149 -544 1048 8 163 2191 1156 157 938 -229 -773 71 -1044 -2079 -474 -98 -348 822
1693H22q6o15R34Q0r12K73p12j481M91R25l81M08J94k83J120R50o74l54l9o30
$$ 822 736 121 1055 1135 223 496 -216 -1697 -1206 -281 -662 -254 -60 -343 777 1727 1053 699 660 30
1713C0j78N5r49l32N19J83M73O01j40K3O60J42l01n15q13n97L94K24j22q5M3N55
$$ 30 -148 -93 -1042 -1374 -855 -672 -199 402 262 285 945 1087 786 271 -542 -1139 -745 -521 -643 -728 -685 -130
1735a30J017N27k10l99k14k94q8l04o13m84K26L12K98L10J69M17M17L2l68n47
$$ -130 887 1414 1204 805 591 297 209 -95 -708 -1192 -966 -654 -356 -46 123 540 957 989 621 74
1755G4l56j98k8j69l30pL54P04O30L09r1j98M6q1k29m70n83k62n3J96K22L11L32
$$ 74 -282 -480 -508 -677 -1007 -1014 -660 44 674 983 892 694 740 659 430 -40 -623 -885 -938 -742 -520 -209 123
1778A23L96L15m2k80j17k10l51k91n13j25J93N07M18M12J54P3K26J84k98k71n33
$$ 123 519 834 792 512 395 185 -166 -457 -970 -1095 -902 -395 23 435 589 662 888 1072 774 503 -30
1799c0m86k14j89j0K20N33K47J41K09J14R8K35k97q72l82k49j1L64K60k30L64
$$ -30 -516 -730 -919 -929 -709 -176 71 212 421 535 633 868 571 -301 -683 -932 -943 -579 -319 -549 -185
1820a85O08L08L68K00o43k60N5o87m47M8l85K10P68p5j61O31K35J18N54p69j280
$$ -185 423 731 1099 1299 656 396 451 -236 -683 -635 -1020 -810 -42 -117 -278 353 588 706 1260 491 -789
1841g89K00Q7k32M75l98p28J035J023jN32l2j054N10M70j304l49K17q47M69R33
$$ -789 -589 -502 -734 -259 -657 -1385 -350 673 672 1204 1172 118 628 1098 -206 -555 -338 -1185 -716 217
1861B17j003K52J324k81J21P08j372o69J183p27p60P85r22o07K021L45o07J252
$$ 217 -786 -534 790 509 630 1338 -34 -703 480 -247 -1007 -222 -1144 -1751 270 615 8 1260
1879A260l71j168J548P8j840M43r7j470J300N64j716J063J460j021O14P06k048
$$ 1260 889 -279 1269 1347 -493 -50 -147 -1617 -317 247 -1469 -406 1054 33 647 1353 -695
1896f95N20J630j801q47R20j442M24K429j079p35J715n64l29K013j208j829J377
$$ -695 -175 1455 -346 -1193 -273 -1715 -1291 1138 59 -676 1039 475 146 2159 951 -878 499
1913D99m53j405J306k95j396K080N31j616J281O77j494R06N06k279L63P91j676
$$ 499 46 -1359 -53 -348 -1744 336 867 -749 532 1209 -285 621 1127 -1152 -789 2 -1674
1930a674P19J810j447k05J675o53O97J505k164j188J788m83j283O64p24l50J939
$$ -1674 -955 855 -592 -797 878 225 922 2427 263 -925 863 380 -903 -239 -963 -1313 626
1947F26k88j442J659P73j199O10j48j598N05M48j229P21Q05j571K18K227R5m06
$$ 626 338 -1104 555 1328 129 739 591 -1007 -502 -54 -1283 -562 243 -1328 -1110 1117 1212 806
1965H06K26j092O9J614j158j937J045M51r21N06K28m92J497N61j833N38J322j778
$$ 806 1032 -60 9 1623 465 -1472 -427 24 -897 -391 -163 -655 842 1403 -430 108 1430 -348
1983c48o95J103o88k07O88j568M66L359p02k271J367M05m10J259j433k368K318
$$ -348 -1043 60 -628 -835 -147 -1715 -1249 2110 1408 -863 504 909 499 1758 325 -2043 275
2000B75N47k784J278J458j604J325Q30k339J548J725l434Q8K560k376p37J799
$$ 275 822 -1962 -684 774 -830 495 1325 -1014 534 2259 -1175 -1087 1473 -903 -1640 159
2016A59j774Q27L540l030j796M114m16j730J947k100j829L845j198l751L333R33
$$ 159 -1615 -788 2752 -278 -2074 2040 1624 -106 1841 -259 -2088 1757 559 -3192 141 1074
2032A074k803K420L76k960L469J016m743J711K526m011N86K256l148J716L036
$$ 1074 -1729 691 1067 -1893 1576 2592 -2151 -440 2086 -1925 -1339 917 -2231 -515 2521
2047B521m527L35N131k542j512K744k794o23L974l394k526M972j120l381L635
$$ 2521 -2006 -1671 3460 918 -594 2150 -644 -1267 2707 -687 -3213 1759 639 -2742 893
2062H93n4k122L802j394m159M514Q26n398K045K306l094J883O18m148M078M073
$$ 893 839 -1283 2519 1125 -3034 1480 2306 -3092 -1047 1259 -1835 48 666 -3482 596 4669
2078D669n756o47M062k143K56J527m781R75N345m236k903M911l57j405K768k981
$$ 4669 -1087 -1734 2328 185 441 1968 -2813 -1838 3507 -729 -3632 1279 922 -483 2285 -696
2094f96j532N532k015m962L914J008l490K019j50k151M748O60n748K624L430l407
$$ -696 -2228 3304 1289 -3673 241 1249 -2241 -222 -372 -2523 2225 2885 -2863 -239 3191 -216
2110b16M90J178l622J783K564m556N11M401k928j082L500j981p42L082k954j559
$$ -216 274 1452 -2170 -387 2177 -2379 -1868 2533 -395 -1477 2023 42 -700 2382 -572 -2131
2126b131M227k043l591L531O00j797K406r91k519M228J020m196J476J468k944
$$ -2131 2096 53 -3538 -7 593 -1204 1202 211 -2308 1920 2940 -1256 220 1688 -1256
2141a256J069J173l132J804K366l568L16L288j926m34K098k493n21K948k435j938
$$ -1256 -187 986 -2146 -342 2024 -1544 -1228 2060 134 -300 1798 -695 -1216 1732 -703 -2641
2157b641L083l95j529K223q23j696L726M57l180J160N05j996J850M15l376J501
$$ -2641 442 47 -1482 741 -82 -1778 1948 2405 -775 385 890 -1106 744 1159 -2217 -716
2173g16K164k486K31K292j614M44J504k833j53L074k089j932K133m32q53J970
$$ -716 1448 -1038 -807 1485 -129 315 1819 -1014 -1167 1907 -182 -2114 19 -413 -1266 704
2189G04j070j078L429j45l035J618R18j831J092k4k410J642J216k811J209K682
$$ 704 -366 -1444 1985 1840 -1195 423 1341 -490 602 578 -1832 -190 1026 -1785 -576 2106
2205B106k093n19J465j419N63J801k989j118L099j137j729K127j25o20K158j294
$$ 2106 13 -506 959 -460 103 1904 -1085 -2203 896 -241 -1970 157 32 -588 1570 276
2221B76j629L136J02l064J033R77j795R64jk009K611J689l458J47K527j157J59
$$ 276 -1353 1783 1885 -1179 -146 831 -964 0 -1 -2010 601 2290 -1168 -1021 1506 349 508
2238E08O22k780M35K477k373q74K754q38r04J891r13l08K606j516k088K238r2
$$ 508 1130 -1650 -1215 1262 -1111 -1985 769 -69 -973 918 5 -303 2303 787 -1301 937 845
2255H45k157J251J43j295K006q4k317J940J545k076M34O45j987N82J159k113O23
$$ 845 -1312 -61 82 -1213 793 709 -1608 332 1877 -199 235 880 -1107 -525 634 -1479 -856
2272h56J609k023q3K457p59j83J258j476k48J908j441j455J719k92j069J148l96
$$ -856 753 -1270 -1353 1104 345 162 1420 -56 -304 1604 163 -1292 427 135 -934 214 -182
2289a82p01K078M4j693Q48K16j343P96K70j467N03M90j297R52J431r55J18Q64
$$ -182 -883 1195 1239 -454 394 610 -733 63 333 -1134 -631 -141 -1438 -486 945 -10 108 972
2307I72q79P0R61j152l75R11q95o09J005j12j46J128l43q90Q19J0n86N26l21j247
$$ 972 93 163 1124 -28 -403 508 -387 -996 9 -103 -249 879 536 -354 465 475 -111 415 94 -1153
2327a153K84M83m37O95L35p18N55Q31n23RL72o49o7K94q23k79P70Q5p3L74l52
$$ -1153 -869 -386 -823 -128 207 -511 44 875 352 361 733 84 17 311 -512 -791 -21 64 -9 365 13
2348A3k26Q91Q7m19j61o29n89N07L50m04J11Q3o2O76N34k98m8J32k73j31J3n35
$$ 13 -213 678 765 346 185 -444 -1033 -526 -176 -580 -469 -386 -448 228 762 464 416 548 275 144 157 -378
2370c78j80N26L9j35O4j11L54O75O0p35m38k67L4M74q8p84m2M02L35O80L1l69
$$ -378 -558 -32 7 -128 -64 -175 179 854 914 179 -259 -526 -492 -18 -106 -890 -932 -530 -195 485 516 147
2392A47Q2L09p3j77j94l74n8L39j22k22J12K73N55L17l69n75j70J90K22n8o59
$$ 147 229 538 465 288 94 -280 -338 1 -121 -343 -231 42 597 914 545 -30 -200 -10 212 154 -505
2413e05o54K92M16N08K50j87k33L58L91m0k58m02r4N6n0k34o2K69M32L50j05m15
$$ -505 -1159 -867 -451 57 307 120 -113 245 636 596 338 -64 -158 -102 -152 -386 -448 -179 253 603 498 83
2435H3j39L32J99j51o19p08J7M24M27O4j93j12M43M25K24j90l15j94K1l9k04k26
$$ 83 -56 276 475 324 -295 -1003 -986 -562 -135 -71 -264 -376 67 492 716 526 211 17 38 -1 -205 -431
2457d31J34L28K57k7k19kL88L70k10o01o35j76L75L35j48l41j40L79O88M21j99
$$ -431 -297 31 288 261 42 40 428 798 588 -13 -648 -824 -449 -114 -262 -603 -743 -364 324 745 546
2478E46l35r3J12k2j62l22k28K93K91j5j22L7L78M74k6n58n88j00K11K82l05n39
$$ 546 211 118 230 208 46 -276 -504 -211 80 65 -57 -20 358 832 806 248 -340 -440 -229 53 -252 -791
2500g91k28L43O72M46%l09q4K81J61j93k21m65O8K74Q7k45LL96L83K35l56m91
$$ -791 -1019 -676 -4 442 442 133 49 330 491 298 77 -388 -320 -46 41 -204 -201 195 578 813 457 -34
2522c4k29M67P8l85m56m80J22Q05L05j41Rr0L3O02M8n05j88j68j48L44j2n14K36
$$ -34 -263 204 282 -103 -559 -1039 -917 -112 193 52 61 -29 4 606 654 149 -39 -207 -355 -11 -23 -537 -301
2545c01P51m6k3j19k80K97M85o97p29L1j46J97P37l60l25N26K4J46P76l00r39
$$ -301 450 404 381 262 -18 279 764 67 -662 -631 -777 -580 157 -203 -528 -2 22 168 944 644 -295
2566b95K96P3k71L16l14n26R40M07q11K94M42k85M46L8j413P2N93n47J23M54q17
$$ -295 1 74 -197 119 -195 -721 219 626 -185 109 551 266 712 750 -663 -591 2 -545 -422 32 -785
2587g85JJ047k39J94Q58j012n17J053l18n97N28o01l79J320l14r56J132K90n03
$$ -785 -784 263 24 218 1076 64 -453 600 282 -315 213 -388 -767 553 239 -717 415 705 202
2606B02O66n41j231Q87M14j033K99P4j062R38J037q40M28M63j151M51J127j231
$$ 202 868 327 -904 -17 397 -636 -337 -263 -1325 -387 650 -190 238 701 -450 1 1128 -103
2624a03k97P07q89J10J100r92k80J500k74m80P10p68o81J511m54j347M84j44m84
$$ -103 -400 307 -582 -472 628 -364 -644 856 582 102 812 44 -637 874 420 -927 -443 -587 -1071
2643a071J295J08r97Q58K02q22R33M79j165J2J32o54P35N01j257K24J271l58k46
$$ -1071 224 332 -665 193 395 -427 506 985 -180 -168 -36 -690 45 546 -711 -487 784 426 180
2662A80J90n71M96Q03j186j085P05J73o8L22l68j63Q54r4l81Q28J73q51m47K80
$$ 180 370 -201 295 1098 -88 -1173 -468 -295 -363 -41 -409 -572 282 188 -193 635 808 -43 -490 -210
2682b10K00L51m62p35O07J055k86p85L56N49K12m48r18l04R41J55r16k38P27L3
$$ -210 -10 341 -121 -856 -249 806 520 -265 91 640 852 404 -514 -818 123 278 -638 -876 -149 -116
2702a16r0K83J18L96J92j217m05J481P4j200o0K52J08R17n17r12J426P11j550
$$ -116 -206 77 195 591 783 -434 -839 642 716 -484 -544 -292 -184 733 216 -696 730 1441 -109
2721a09j86O02o40N42m2j672Q05J337j390K8J635q37k09Q25j225K83J838j749
$$ -109 -295 307 -333 209 167 -1505 -700 637 -753 -725 910 73 -136 689 -536 -253 1585 -164
2739a64j379K020l78q86J440o88o07K213r22j971K124L32j920J014k83j641K004
$$ -164 -1543 477 99 -787 653 -35 -642 1571 649 -1322 802 1134 -786 228 -55 -1696 308
2756C08L35k412J778J369k273P44J220j822J214J060l001O60K241k139j12J976
$$ 308 643 -1769 9 1378 -895 -151 1069 -753 461 1521 -1480 -820 1421 -718 -830 1146
2772A146j748K05K213k308m22K994j690j467J975j454r65K704j384j739K821m83
$$ 1146 -602 -397 1816 -492 -914 2080 390 -1077 898 -556 -1521 1183 -201 -1940 881 398
2788C98j941K588j45j999K207l39k581K173P26k599J540R48k331J642J213k572
$$ 398 -1543 1045 900 -1099 1108 769 -1812 361 1087 -1512 28 976 -1355 287 1500 -1072
2804a072J369J759k726K59J661k377M96J883k363j67K315j788j81K471j485p99
$$ -1072 297 2056 -670 -411 1250 -1127 -631 1252 -1111 -1278 1037 -751 -932 1539 54 -745
2820g45J928j354q75K280j194j522K117m88j308J923k85j229J906k52j913J443
$$ -745 1183 -171 -1046 1234 40 -1482 635 147 -1161 762 477 -752 1154 902 -1011 432
2836D32M68j717Q90J61j575J107P35j552Q92J200j305J87P32j145N78R16j533
$$ 432 900 -817 73 234 -1341 -234 501 -1051 -159 1041 -264 -77 655 -490 88 1004 -529
2853e29k57J141p69O1J004o45j42R66o01l84Q58l46n54K97m36l54O47p6l33M49
$$ -529 -786 355 -414 -353 651 6 -136 830 229 -155 703 357 -197 100 -336 -690 -43 -119 -452 -3
2873cJ23l14M08P6k13J45n8l32n9l6K2K10J61O5k20l8N24K11k57j21l65k76L96
$$ -3 120 -194 214 290 77 222 164 -168 -227 -263 -241 -31 130 195 -25 -63 461 672 415 294 -71 -347 49
2896D9o4n43J91L35m37M35K14m25N27K79p36K29J42o90K19O16o78J11P03q46L13
$$ 49 -15 -558 -367 -32 -469 -34 180 -245 282 561 -175 54 196 -494 -275 341 -337 -226 477 -369 -56
2917e6J130p47k90N98q34j89J040p41p18R23n26m30J319k46p23R61j71p04Q65
$$ -56 1074 327 37 635 -199 -388 652 -89 -807 116 -410 -840 479 233 -490 471 300 -404 461
2936D61k26j078J036J34j126P71J50p22J115N63j399L94N90r58O02L96j492J43
$$ 461 235 -843 193 327 -799 -28 122 -600 515 1078 -321 73 663 -295 307 703 -789 -646
2954f46R16r99K93J027j012O0J107r02j08J130j021l90J091p58o15J017k61k89
$$ -646 270 -729 -436 591 -421 -361 746 -156 -264 866 -155 -545 546 -212 -827 190 -71 -360
2972c60J211m59r93J144O3p02P91m65j152P71K23p42O94Q9q74P55N58p52L47L65
$$ -360 851 392 -601 543 606 -96 695 230 -922 -151 72 -670 24 113 -761 -6 552 -200 147 512
2992E12q56L79L96j066J06P17l91Q5N28o94J53R27l44k33K91o94l07P76l64m32
$$ 512 -344 35 431 -635 -529 188 -203 -118 410 -284 -131 796 452 219 510 -184 -491 285 -79 -511
3012e11M61k94j69P68m1l25L73l0m45L92j57m47L12K13k79J76o1k59N78M84l92
$$ -511 -50 -344 -513 255 214 -111 262 232 -213 179 22 -425 -113 100 -179 -3 -64 -323 255 739 347
3033C47j23l8m38K92K47m89k67J72j03K70K83j75n0K24m7J3O0l20j08K02q0l2
$$ 347 224 186 -252 40 287 -202 -469 -297 -400 -130 153 -22 -72 152 105 118 178 -142 -250 -48 -128 -160
3055a60q2J0K30M65l9k52j66J18J49Q9k89l57j15K3J88K60j18j20J19J13J58L0
$$ -160 -242 -232 -2 463 424 172 6 124 273 362 73 -284 -399 -376 -188 72 -46 -166 -47 66 224 254
3077B54j90k30J36n2p1p3q6J39M12K7j10p3N9K13J11k26m00j38j4J49J59k00j13
$$ 254 64 -166 -30 -82 -153 -226 -312 -173 239 266 156 83 142 355 466 240 -160 -298 -312 -163 -4 -204 -317
3100c17J29J64J26Q3j10n7l2K6j59q0k5K3K65M8j32L8J29K35J08j08l19k39L5
$$ -317 -188 -24 102 185 75 18 -14 12 -147 -227 -252 -229 36 84 -48 -10 119 354 462 354 35 -204 -169
3123a69J65j2j36k61R5K45K08k1K6n5l7J40j05j77j46LJ34R2j76k0K24K22K26
$$ -169 -4 -16 -152 -413 -318 -73 135 114 140 85 48 188 83 -94 -240 -237 -103 -11 -187 -207 17 239 465
3146D65o7k57k07R5J54n1k26k57j08K87K73k1k2k05J35K30j4k52j07k4o4J81q7
$$ 465 398 141 -66 29 183 132 -94 -351 -459 -172 101 80 58 -147 -12 218 204 -48 -155 -179 -243 -62 -149
3169a49k21K06L71L3J21j19l27J73K87j28k18k84k33K29L53q1p3Mp0J88L77l32
$$ -149 -370 -164 207 240 361 242 -85 88 375 247 29 -255 -488 -259 94 13 -60 -56 -126 62 439 107
3191A07k67R9k0n7J55l57m4L92J24o0J77j39j13L73J43m11j41j35j84L87P5l65
$$ 107 -160 -61 -81 -138 17 -340 -384 8 132 72 249 110 -3 370 513 102 -39 -174 -358 29 104 -261
3213b61n4J91l6M89Q3m05m4J18j81M4J1l07J07L33k20L5J99n6J84L66l25k21l1
$$ -261 -315 -124 -160 329 412 7 -37 81 -100 -56 -45 -352 -245 88 -132 -97 102 46 230 596 271 50 19
3236A9j15qL28l28l75K44J19J23K65j73k09K24k3k01J53j15j77J64J3j43K95Q7
$$ 19 -96 -104 224 -104 -479 -235 -116 7 272 99 -110 114 91 -110 43 -72 -249 -85 -72 -215 80 167
3258A67j46K48R0k24j11J16j39J64r7l97m4L56J25Ol2j48J46J55j91j15m1J5m7
$$ 167 21 269 359 135 24 140 1 165 68 -329 -373 -17 108 114 82 -66 80 235 44 -71 -112 -97 -144
3281a44p5K9J45K1R8J81r9j8L7N2m8J15l76k96K51k1P1J74j25j09L22K8k85K70
$$ -144 -219 -190 -45 -24 74 255 156 138 175 227 179 294 -82 -378 -127 -148 -77 97 -28 -137 185 213 -72 198
3305A98l6l27J29j0l17L71l0k97L69K15l46J59L03l50K69J23q61J08N57l98J1
$$ 198 162 -165 -36 -46 -363 8 -22 -319 50 265 -81 78 381 31 300 423 -438 -330 227 -171 -160
3326a60L09o19K04P76m97j32N63o04q5N86n50l45P75l57k98P67k81m31Q35k6o48
$$ -160 149 -470 -266 510 13 -119 444 -160 -245 341 -209 -554 221 -136 -434 333 52 -379 456 430 -218
3347b18N95j14p27Q14p5r05O58J86q88P67M38q79N25L72j101M90O95j010K10M63
$$ -218 377 263 -464 350 275 -630 28 214 -674 93 531 -348 177 549 -552 -62 633 -377 -167 296
3367B96r28K70R46r59P7J093p32j34Q69r33k71J155o85o90Q79m53l70J143l74
$$ 296 -632 -362 584 -375 -298 795 63 -71 798 -135 -406 749 64 -626 253 -200 -570 573 199
3386A99q53R97l2q30R81j82r58R26k7j082Q41M18r85P92L81j174P64O84j115K44
$$ 199 -654 343 311 -519 462 280 -678 248 221 -861 -20 398 -587 205 586 -588 176 860 -255 -11
3406a1N79j069L25O97j124J69J098p89j80P80o79%J079r22n22Q90m00m22Q12m70
$$ -11 568 -501 -176 521 -603 -434 664 -125 -305 475 -204 -204 875 -47 -569 321 -79 -501 311 -159
3426a59m01R89k70o78R85Q2p87O15j35q14P65J06q07M57K72p07N36M03p14K50
$$ -159 -560 429 159 -519 466 548 -239 376 241 -573 192 298 -509 -52 220 -487 49 452 -262 -12
3446a2M66o80J25L59p63K21O39o02j61N43j87J21M83n20k03N97k37l24K87k51
$$ -12 454 -226 -101 258 -505 -284 355 -247 -408 135 -52 69 552 32 -171 426 189 -135 152 -99
3466i9r0L31l31j69M58J29k28Q7nj66K34j23k37O6K8j43K06j6N3J47J08j16k4
$$ -99 -189 142 -189 -358 100 229 1 88 83 -83 151 28 -209 -143 -115 -258 -52 -68 -15 132 240 124 100
3489A00r6J21J64k16k02k8J4Q3J49l14J18L26j16o8L8j89J28K16m64l02N06r3
$$ 100 4 125 289 73 -129 -157 -143 -60 89 -225 -107 219 103 35 73 -116 12 228 -236 -538 -32 -125
3511a25p9K83k25j0O64l65k93M97k10l52L32k20k04N28k36m08O09Kn60O28J22
$$ -125 -204 79 -146 -156 508 143 -150 347 137 -215 117 -103 -307 221 -15 -423 186 188 -372 256 378
3532C78n34L54o9o71N29J95p44M68M35o99K47M45n36M48L96j021O0Q44o20j23
$$ 378 -156 198 129 -542 -13 182 -562 -94 341 -358 -111 334 -202 246 642 -379 -319 525 -95 -218
3552b18M78p11J05R24p67k02R62m13m51O79n31m48R10l48o08Q04j26o87R35N9
$$ -218 260 -451 -346 578 -189 -391 571 158 -293 386 -145 -593 317 -31 -639 165 39 -648 287 346
3572C46o65O55Kp66O84K15r12L99L21p96N07M55q48L68O12q15J57O05q40Q1O59
$$ 346 -319 336 338 -428 256 471 -441 -42 279 -517 -10 445 -403 -35 577 -238 -81 524 -316 -235 424
3593D24p61r3O75n72r4R04m74k58O71m06k27P54m06n85O25j84m52O54j06o01P30
$$ 424 -337 -430 245 -327 -421 483 9 -249 422 16 -211 543 137 -448 177 -7 -459 195 89 -512 218
3614B18J04n82M95N9n32L47J13p60L27L01n05L67L22m56J60L86m46K27L59n99
$$ 218 322 -260 235 294 -238 109 222 -538 -211 90 -415 -48 274 -182 -22 364 -82 145 504 -95
3634i5j04L83l21r4M26m47K4M34j99j59M30j67k13L58k83l15L46j13j93K72J1
$$ -95 -199 184 -137 -231 195 -252 -228 206 7 -152 278 111 -102 256 -27 -342 4 -109 -302 -30 -19
3655a9j47K87L7p2J97j34l13K25Q9j99nl5j24J61J20j20P1L7j3K1J2j73o7J24
$$ -19 -166 121 158 86 283 149 -164 61 150 -49 -54 -89 -213 -52 68 -52 19 56 43 64 76 -97 -164 -40
3679d0j07J01n8j00J15J65M6N0p1j11M2J12p1p6j16o6J01Q9p4J31l0rJ09K4j03
$$ -40 -147 -46 -104 -204 -89 76 122 172 101 -10 32 144 73 -3 -119 -185 -84 5 -69 62 32 23 132 156 53
3704E3n3n7j1J3qj81P8Q8P9Q8j7j58J02J85j02k8r0j45oK08q6m5J41j12Q4K11
$$ 53 0 -57 -68 -55 -63 -244 -166 -78 1 89 72 -86 16 201 99 71 -19 -164 -170 38 -48 -93 48 -64 20 231
3730B31j35p4P4n1j06L5j85mJ47l2L9O3j2k4K41j0j18j17k5kM6L2j59O5P7l3J52
$$ 231 96 22 96 45 -61 -26 -211 -215 -68 -100 -61 2 -10 -34 207 197 79 -38 -63 -65 -19 13 -146 -81 -4 -37 115
3757A15K1j15O7jk9r4l8j33O1M6o7R5M5Q7LJ27m9j50M8p5l5P6j06q8J20l0Q0O5
$$ 115 136 21 88 87 58 -36 -74 -207 -146 -100 -167 -72 -27 60 63 190 141 -9 39 -36 -71 5 -101 -189 -69 -99 -19 46
3785D6rq5R3O3o4p2m5Ll4M9j24Q8M4Q2J20n6j3n7RL5j9j21m6o1J77m3P7l3N4q
$$ 46 37 -48 45 108 44 -28 -73 -70 -104 -55 -179 -91 -47 35 155 99 86 29 38 73 54 -67 -113 -174 3 -40 37 4 58 50
3815E0P8p5J6lj34Lm5l9l1M4M4L7J58j02rJ64J9q4j06m9p2M7P9n2l2J02l1Q4N8
$$ 50 128 53 69 66 -68 -65 -110 -149 -180 -136 -92 -55 103 1 -8 156 175 91 -15 -64 -136 -89 -10 -62 -94 8 -23 61 119
3844A19p3j4l9%L8j51r4N9O4K8L2JMJ17R2k1j10k3j23PN1om1j8J6P2J42j21%P6
$$ 119 46 32 -7 -7 31 -120 -214 -155 -91 -63 -31 -30 -26 91 183 162 52 29 -94 -87 -36 -42 -83 -101 -85 -13 129 8 8 84
3874H4p5J1J5j53k6P1n3L8O9p2R6J27K6p6l2j05l8J14o9n1j10R7J12R0m5j5K6
$$ 84 9 20 35 -118 -144 -73 -126 -88 -19 -91 5 132 158 82 50 -55 -93 21 -48 -99 -209 -112 0 90 45 30 56
3901E6P7p2j6m5m3j9p1m0l4P7Q7O4N9l9J56j41l2R6j28o9lom3J57J9j06J06N9
$$ 56 133 61 45 0 -43 -62 -133 -173 -207 -130 -43 21 80 41 197 56 24 120 -8 -77 -80 -86 -129 28 47 -59 47 106
3929A06j11K14n2k51J51p9j52R2K4k68K74J27j26L7J54j32J09J42m03RJ30j54
$$ 106 -5 209 157 -94 57 -22 -174 -82 -58 -326 -52 75 -51 -14 140 8 117 259 -144 -135 -5 -159
3951a59J12R6k26J01K60j88MK71k14j41K74k47j81L43k40j16L34j68j01L90n3
$$ -159 -47 49 -177 -76 184 -4 0 271 57 -84 190 -57 -238 105 -135 -251 83 -85 -186 204 151
3972A51k30L59j75l42L34j16k89L67L3l46L55J09l82L79J66o13K59K71n76K17
$$ 151 -79 280 105 -237 97 -19 -308 59 92 -254 101 210 -172 207 373 -240 19 290 -286 -69
3992f9J62m86K69M05n92O5O65m92PM50n64K1N41m50k95N49k85j59N20l93j55P81
$$ -69 93 -393 -124 281 -311 -246 419 -73 -66 384 -180 -159 382 -68 -363 186 -99 -258 262 -131 -286 495
4014D95l16l59M29j42l59M71j55n16N46m7m03M90J06n14N30O8n63L54J07n89L79
$$ 495 179 -180 249 107 -252 219 64 -452 94 47 -356 134 240 -274 256 324 -239 115 222 -367 12
4035A2K15o27K53M40n16J81L27m55K11M48o26o4M30l32j39L98m64P8N76m30j68
$$ 12 227 -400 -147 293 -223 -42 285 -170 41 489 -137 -201 229 -103 -242 156 -308 -230 346 -84 -252
4056b52N14j67j71L37k63k48M88k28m00M71j63j30L57p7k14L72q6k81K52p3l37
$$ -252 262 95 -76 261 -2 -250 238 10 -390 81 -82 -212 145 68 -146 226 140 -141 111 38 -299
4077b99L14lk31J67L8j61L56Ok56J36J48k21Kn2j64K27O3k73J29J64n6J24j20
$$ -299 15 12 -219 -52 -14 -175 181 187 -69 67 215 -6 -4 -56 -220 7 70 -203 -74 90 34 158 38
4100C8j62L31J9k96O0j7j13J59p5k61L45J22l58K59J42l31J81J16l56J81J19m67
$$ 38 -124 207 226 -70 -10 -27 -140 19 -56 -317 28 150 -208 51 193 -138 43 159 -197 -16 103 -364
4122c64L08K63m73J92L52l54J41J79n48K91M39o16j03M68l81J8M00m93J04P30
$$ -364 -56 207 -266 -74 278 -76 65 244 -304 -13 426 -190 -293 175 -206 -188 212 -281 -177 553
4142E53n31l61P11l26k40M97m75k45Q17l38o42Q21l4m69O58j96n03O63l2r58P21
$$ 553 22 -339 372 46 -194 303 -172 -417 400 62 -580 241 207 -262 396 200 -303 360 328 -630 91
4163I1K59q38M62K58p25N69L23q52N44M58r54K35N52p17K36L68q42L16Q54q57
$$ 91 350 -488 -26 232 -493 76 399 -453 91 549 -405 -170 382 -335 -99 269 -573 -257 597 -260
4183b60j04Q69n30j33P21p67k12R15n75n89R39k09m90O69k05m62J011k84q63Q17
$$ -260 -364 505 -25 -158 563 -204 -416 499 -76 -665 274 65 -425 244 39 -423 588 304 -559 258
4203B58J16q14N95l5o76P49J77r44O52L74p60L77K99p21L93L57q08K22N73p67
$$ 258 374 -440 155 120 -556 193 370 -574 78 452 -308 69 368 -353 40 397 -411 -189 384 -383
4223c83P5O17m87Q2N46o03j3P06n59l46N77l48k55O19m15j83P16k72l66O49j58
$$ -383 -308 309 -178 -96 450 -153 -166 540 -19 -365 212 -136 -391 228 -187 -370 346 74 -292 357 199
4244A99m54M60j36m63N09q0m59M27J38l56K93J56l65L20P6m50K37J47m44J16J89
$$ 199 -255 205 69 -394 115 35 -424 3 141 -215 78 234 -131 189 265 -185 52 199 -245 -129 60
4265F0l00J94K83l97J79K28k20n8K64l30p9L55l41p1K55n2m7K04j72O8J38j66
$$ 60 -240 -46 237 -160 19 247 27 -31 233 -97 -176 179 -162 -233 22 -30 -77 127 -45 23 161 -5
4287eJ4R5j56j19J91j57m1J62r1P9R4l4rK04j91j14J32j50K7Q5k37Q3K50j43q
$$ -5 9 104 -52 -171 20 -137 -178 -16 -107 -28 66 32 23 227 36 -78 54 -96 -69 16 -221 -138 112 -31 -39
4312c9J94j07L4Q0j31q7J45j32j15J94j66j7K43n0j12K27o3j43K55j82j64K37
$$ -39 155 48 82 162 31 -56 89 -43 -158 36 -130 -147 96 46 -66 161 98 -45 210 28 -136 101
4334A01j16j85K54p3r3J97O8k15K26Kj71J58j06l03J95O4k51J81J50k64K60J88
$$ 101 -15 -200 54 -19 -112 85 153 -62 164 166 -5 153 47 -256 -61 3 -248 -67 83 -181 79 267
4356B67l68J44K00l17R1L6k43J9K74k29K0K75k44Q7K65j61j25J89k44q6K02j40
$$ 267 -101 43 243 -74 17 53 -190 -171 103 -126 -106 169 -75 12 277 116 -9 180 -64 -150 52 -88
4378h8j26K76o9j61L15n6j08K16l1k80J73nk96J93K4j59J97O1k04J96J32j69J6
$$ -88 -214 62 -7 -168 147 91 -17 199 168 -112 61 56 -240 -47 -23 -182 15 76 -128 68 200 31 47
4401D7L9j66L0J41k09l3J64r0l1K12j21j1J87o4qN8j08j47J59j25m6J65j10N7
$$ 47 86 -80 -50 91 -118 -151 13 -77 -108 104 -17 -28 159 95 87 145 37 -110 49 -76 -122 43 -67 -10
4425a0J40J2j18J33l9j07O7j44m8N2j8NQ6M7r7J48K6o9Rnj13K1J0n5k9K2j2O1
$$ -10 130 142 24 157 118 11 78 -66 -114 -62 -80 -75 11 58 -39 109 135 66 75 70 -43 -22 -12 -67 -96 -74 -86 -25
4453b5J02m4j5J27o1k7K2p6l2nj57J2J55N7k3J8Q3p5Nn7P7q6l8m4K9J7m4O2O9
$$ -25 77 33 18 145 84 57 79 3 -29 -34 -191 -179 -24 33 10 28 111 36 41 -16 61 -25 -63 -107 -78 -61 -105 -43 26
4482B6RJ00m0Qm6j6n6K8j25l6kO2L8k3P5M2K3P3m4q6r0L3p0M6p3N6P0O0M3pm7
$$ 26 35 135 95 103 57 41 -15 13 -112 -148 -150 -88 -50 -73 2 44 67 140 96 10 -80 -47 -117 -71 -144 -88 -18 42 85 78 31
4513C1L3J0k3l2r2r4N9K0JQ2j3N6NQ2m3J%j04M1r1o4P8Ko3Q5M6nQ4Mnj2ql9j33
$$ 31 64 74 51 19 -73 -167 -108 -88 -87 -5 -18 38 43 125 82 83 83 -21 20 -71 -135 -57 -55 -118 -33 13 8 92 96 91 79 71 32 -101
4547a01L3j6j4P8L4m0J9k2J20K4n7p7M4p0j3J2j4j07J07P0k0J22r8K1R9r2j45
$$ -101 -68 -84 -98 -20 14 -26 -7 -29 91 115 58 -19 25 -45 -58 -46 -60 -167 -60 10 -10 112 14 35 134 42 -103
4574a03L0O4j39P3L3j66J89O1q4J44N9j54L8L9j46OJ41k38K0J64n3N1J10j21j8
$$ -103 -73 -9 -148 -75 -42 -208 -19 42 -42 102 161 7 45 84 -62 -56 85 -153 -133 31 -22 29 139 18 0
4599@J55n1j83K07j71r1J92j72j04L01m6j22J84Jj59J79m1k06J11K3k48K04O6
$$ 0 155 104 -79 128 -43 -134 58 -114 -218 83 37 -85 99 100 -59 120 79 -127 -16 7 -241 -37 29
4622B9k29K05J01k14K16J12k52J12Nk17K1J51k70Q3K08j44lK60j26j7J47j65q5
$$ 29 -200 5 106 -108 108 220 -32 80 85 -132 -111 40 -230 -147 61 -83 -86 174 48 31 178 13 -72
4645g2J79k40n5K37r7j09K86j64o4K65K0k62K57j52j35J71j48j09J32J02j75J49
$$ -72 107 -133 -188 49 -48 -157 129 -35 -99 166 186 -76 181 29 -106 65 -83 -192 -60 42 -133 16
4667A6N7j06J95ok74J33P6k21M8K0j52R7J79k23J81J33q2j8j0o5JJ26k64K3J29
$$ 16 73 -33 162 156 -118 15 91 -130 -82 -62 -214 -117 62 -161 20 153 71 53 43 -22 -21 105 -159 -136 -7
4692go8l1J06k9O6P1j00k0J74k60L0J5l4J5J7j24J64J21o4k5M8MJ00l7k66k4K42
$$ -7 -75 -106 0 -29 37 108 8 -12 162 -98 -68 -53 -87 -72 -55 -179 -15 106 42 17 65 69 169 132 -134 -158 84
4719H4j38o8J27j14J55J67l02j5M14k53j22J15j71J5J73k99k0M64j33k74L54j17
$$ 84 -54 -122 5 -109 46 213 -89 -104 310 57 -65 50 -121 -106 67 -232 -252 212 79 -195 159 42
4741D2j2K72l65j94M05j33l42L33K4j75L08j24k83N93l2n83L47R2l64K80k3m58
$$ 42 30 302 -63 -257 148 15 -327 6 30 -145 163 39 -244 349 317 -266 81 173 -191 89 66 -392
4763c92M86K42o71L27L95n13K00K04n72K92M30o56l9N38m41k5L64m08J02O25m95
$$ -392 94 336 -335 -8 387 -126 74 278 -294 -2 428 -228 -267 271 -170 -195 169 -239 -137 488 -7
4784gk31O46m41l17O45l27l53O08l26m00Q25j38n01N89j3o02O40q0p09O25R4p27
$$ -7 -238 408 -33 -350 295 -32 -385 223 -103 -503 322 184 -317 272 259 -343 297 217 -492 133 227 -500
4806e00M71K66o73N60K91o55K75L89o15J03M50o62J01M75o45J54O54n64l4N59
$$ -500 -29 237 -436 124 415 -240 35 424 -191 -88 362 -300 -199 276 -369 -215 439 -125 -159 400
4826D00m29o9N40m46l50O27k92l41O13l09k91O95j18n37N63j32l27M71j89n17
$$ 400 -29 -98 442 -4 -354 273 -19 -360 253 -56 -347 348 230 -307 256 124 -203 268 79 -438
4846d38M41O5m26M10N1m36M03K70m97L49J23n19J60K64m46Q2K54l31J09L51l98
$$ -438 3 68 -358 52 103 -333 70 340 -157 192 315 -204 -44 220 -226 -144 110 -221 -112 239 -159
4867a59J40L44l49p2L17k81p5K52l39NL83j63k24K39J1P2J83k53j49M01j05l28
$$ -159 -19 325 -24 -96 221 -60 -135 117 -222 -217 166 3 -221 18 29 101 284 31 -118 283 178 -150
4889a50Q9q0M5K29j78j41K97J4j34J50j25j12K57j94j34J10j14j1K23n2o2K30
$$ -150 -61 -141 -96 133 -45 -186 111 125 -9 141 16 -96 161 -33 -167 -57 -171 -182 41 -11 -73 157
4911A57m6j03J80j04j71K47k17j33K78j49l0K15j43j56L64k1k98K74q4k20K23
$$ 157 111 8 188 84 -87 160 -57 -190 88 -61 -91 124 -19 -175 189 168 -130 144 60 -160 63
4932F3j19l09L16J29j85J60P3k50L79O9m79J52J42k85J30R8m00K31L38l92J04
$$ 63 -56 -365 -49 80 -105 55 128 -122 257 326 -153 -1 141 -144 -14 84 -316 -85 253 -139 -35
4953c5L37m33J47K60m15r5M06l41q4M13k67j18M85l13q5M44k06k89L82j92k50
$$ -35 302 -131 16 276 -139 -234 172 -169 -253 160 -107 -225 260 -53 -138 306 100 -189 193 1 -249
4974b49L89j39l77M37J6k81L58j3l48L20J60m01J66km08L73K07n20J36L55l05
$$ -249 140 1 -376 61 77 -204 154 141 -207 113 273 -128 38 36 -372 1 208 -312 -176 179 -126
4995a26K64K01m56J12L45l19j54L04l51pL66l83L5M22k60j04L55j78k46L96l20
$$ -126 138 339 -117 -5 340 21 -133 171 -180 -187 179 -204 -169 253 -7 -111 244 66 -180 216 -104
5016a04j75L77j27k94K78N4r9K74o1l29L28J4k64J87j7k06J29J02k55J88P4k71
$$ -104 -279 98 -29 -323 -45 9 -90 184 123 -206 122 136 -128 59 42 -164 -35 67 -188 0 74 -197
5038a97K28J77j90n3Q9j16M5K3k93O6K44k1r5J99o4q7K27r0q1J73k63p9J69q9
$$ -197 31 208 18 -35 54 -62 -17 6 -287 -221 23 2 -93 106 42 -45 182 92 11 184 -79 -158 11 -78
5062g8m0J46q6K5J28K2q2l1N3p3L5j17j28J83m8O1J3K9j29J71J60j59L5K0j67
$$ -78 -118 28 -58 -33 95 117 35 4 57 -16 19 -98 -226 -43 -91 -30 -17 12 -117 54 214 55 90 110 -57
5087e7j2J25j04%rj1J15N4n0k0J04o6Kr6k8k7R3j26mQ4m7J48O2Qq4J1k2j4K8n2
$$ -57 -69 56 -48 -48 -57 -68 47 101 51 31 135 69 71 -25 -53 -80 13 -113 -117 -33 -80 68 130 138 54 65 43 29 57 5
5117Ej08L7q3J04O5j0J4J19j8n4Lj44P7q0o4j7O6J4j3J68o0j5J12j42R3R2j36
$$ 5 -103 -66 -149 -45 20 10 24 143 125 71 74 -70 7 -73 -137 -154 -88 -74 -87 81 21 6 118 -24 69 161 25
5144B5j30P2o3LQ0qn5J45O0j36J40k2q6N2j03j04QR9n6Q2P9r3KR4J7j1l2m5n9
$$ 25 -105 -33 -96 -93 -13 -21 -76 69 129 -7 133 111 25 77 -26 -130 -122 -23 -79 3 82 -11 -9 85 102 91 59 14 -45
5173d5Q3r4J6j6j2P5K6k9M7K2k0k5m8l7r8Q0l5m2J06l7N8Q4M5k2M4j23n0O8m0
$$ -45 38 -56 -40 -56 -68 7 33 4 51 73 53 28 -20 -57 -155 -75 -110 -152 -46 -83 -25 59 104 82 126 3 -47 21 -19
5202a9k7L5j27L5J14M8o6J10K2m6Kk8j46J3ol3K9Po0P6J75m3K8J4j5r3J09r0O
$$ -19 -46 -11 -138 -103 11 59 -7 103 125 79 81 53 -93 -80 -86 -119 -90 -83 -143 -67 108 65 93 107 92 -1 108 18 24
5231B4p8n3L5M1m8J19N7o3o2J97j05r3K3j16nl3M1l5J81l1j1Q6k3m5J33k2j53
$$ 24 -54 -107 -72 -31 -79 40 97 34 -28 169 64 -29 -6 -122 -127 -160 -119 -154 27 -4 -15 71 48 3 136 114 -39
5258c9M5o3o7Q9K4RK2Q0j26O9N7o7O0j09p9pK9j1N1J6M4jqL8KL9j2j01k6M1m8
$$ -39 6 -57 -124 -35 -11 -2 20 100 -26 43 100 33 93 -16 -95 -102 -73 -84 -33 -17 27 26 18 56 58 97 85 -16 -42 -1 -49
5289d9J0o8N7M8mJ6O5Q1m7r3n1o4O0j8q5P0p7P8P2K8N2O5l4j7j1k09R6l3n8L9
$$ -49 -39 -107 -50 -2 -6 10 75 156 109 16 -35 -99 -39 -57 -142 -72 -149 -71 1 29 81 146 112 95 84 -125 -29 -62 -120 -81
5319h1J17n1LJ23NR1j24j90J20N3j32q2R7l9L3P6o3pJ88n0o2J26k5j75N6qj13
$$ -81 36 -15 -12 111 116 207 83 -107 13 66 -66 -148 -51 -90 -57 19 -44 -51 137 87 25 151 126 -49 7 -1 -114
5346a14J56q4j58K79K5j59J78n9k06K69L0l38R5K6k32K90J12l46L32O8k00J23
$$ -114 42 -42 -200 79 104 -55 123 64 -142 127 157 -181 -86 -60 -292 -2 110 -236 96 164 -36 87
5368H7J48l18Q9J80l01j8K75k91PL84j71q1K19k11K1K64k62l07M09k41j58L80
$$ 87 235 -83 6 186 -115 -133 142 -149 -142 242 71 -10 209 -2 19 283 21 -286 123 -118 -276 104
5390A04j30j87K96k4j82L05J0l05K26j7k77K13L1l89L52J44l29J63J74l30K61
$$ 104 -26 -213 83 59 -123 182 192 -113 113 96 -181 32 63 -326 26 170 -159 4 178 -152 109
5411A09J34l89O5K49l52N1K60l96Q4M05k51o1M00l16l0K66k03j73L40k21k08L69
$$ 109 243 -146 -81 168 -184 -133 127 -269 -185 220 -31 -92 308 -8 -38 228 25 -148 192 -29 -237 132
5433A32j08k22L98o9j76K52Qm65L26Mk74J95J09m71L36K31l40K18J06k86J43K17
$$ 132 24 -198 200 131 -45 207 215 -250 76 80 -194 1 110 -361 -25 206 -134 84 190 -96 47 264
5455B64l74K8J76j83J1K04l19M8L81j77j30K17k00NL02k51k18J60Rj00K00j11
$$ 264 -110 -82 94 -89 -78 126 -193 -145 236 59 -71 146 -54 -49 253 2 -216 -56 -47 -147 53 -58
5477e8p8K66k8q3M5N7n4j8n0j71J87Kl6jpQ3M7n1%lJ27j04j74j8M0K8O1j00n2
$$ -58 -136 130 102 19 64 121 67 49 -1 -172 15 17 -19 -20 -27 56 103 52 52 49 176 72 -102 -120 -80 -52 9 -91 -143
5506a43N9J25J73j44j19J19m5l5O3k04k3J36%MJ6L8M6K14k43j36K34j19j6k4j56
$$ -143 -84 41 214 70 -49 70 25 -10 53 -151 -174 -38 -38 -34 -18 20 66 280 37 -99 135 16 0 -24 -180
5531a80n9L36j51j43K75R1j44P4j37p4K89m4m50K15J75k03K16j06j71L44J82l97
$$ -180 -239 97 -54 -197 78 169 25 99 -38 -112 177 133 -317 -102 73 -130 86 -20 -191 153 335 -62
5553f2O9J58k18Q4J50m05l4K75j45O7K56k64n7L73j65j41K45k59k26N10j77l65
$$ -62 7 165 -53 31 181 -224 -258 17 -128 -61 195 -69 -126 247 82 -59 186 -73 -299 211 34 -331
5575c31L87K2j11J80j22j16M05r4m08K05J02l36R9N4k57M51J49n72K05L55k15
$$ -331 56 78 -33 147 25 -91 314 220 -188 17 119 -217 -118 -64 -321 130 279 -293 -88 267 52
5596E2L4Rl17J79K72l71o5K85q8j0K70k76l2L38j25k71K74j71k15K52j7k10K33
$$ 52 86 95 -222 -43 229 -142 -207 78 -10 -20 250 -26 -58 280 155 -116 158 -13 -228 24 7 -203 30
5619C0Mj92L58K1l32J76O9l15K72m1k30J71J55k77O3K35j89M2J29q3k9P8k21j07
$$ 30 34 -158 200 221 -111 65 134 -181 91 50 -180 -9 146 -131 -68 167 -22 20 149 66 37 115 -106 -213
5643b13K78l0j56J38j46j1L89k09j45J59M5p5J19j83j76J89N9j20Q3J02j38J14
$$ -213 65 35 -121 17 -129 -140 249 40 -105 54 99 24 143 -40 -216 -27 32 -88 -5 97 -41 73
5665G3R3j69K5J09j35j9Kj36QR4kN8J05p2j7O9n7KL9j10r1J13Q3j32L3mP6P9m
$$ 73 166 -3 22 131 -4 -23 -21 -157 -149 -55 -57 1 106 34 17 86 29 31 70 -40 -131 -18 65 -67 -34 -38 38 117 113
5694A13r0P8J5r6K2p6o3k4O1Q7n3O4m6P6J3J2m4l8l7Q5l5m3p2RJ21r9Q5J29j4
$$ 113 23 101 116 20 42 -34 -97 -121 -60 27 -26 38 -8 68 81 93 49 11 -26 59 24 -19 -91 -82 39 -60 25 154 140
5723A40J8Rj38n9K9j02J5K9Ml6kJ9R8Q6K6j13Ql2P4j20q9J4MJ42p0Q0L6o7P7O1
$$ 140 158 167 29 -30 -1 -103 -88 -59 -55 -91 -93 -74 24 110 136 23 31 -1 73 -47 -136 -122 -118 24 -46 34 70 3 80 141
5753A41r3j28J11q5n4J3M8l0N0N3l1M9L6o9N8k2p7K5p5rL1j7KJ24O0m0J0L7p3
$$ 141 48 -80 31 -54 -108 -95 -47 -77 -27 26 -5 44 80 11 69 47 -30 -5 -80 -89 -58 -75 -73 51 111 71 81 118 45
5782D5j9opj22N2m5j6M1R7m4N2Pl1J11n1q2k4j3l9K8J7j06J53j1M6L6K9m5Kj0
$$ 45 26 20 13 -109 -57 -102 -118 -77 20 -24 28 35 4 115 64 -18 -42 -55 -94 -66 -49 -155 -2 -13 33 69 98 53 55 45
5812D5j5m8o0j6J1K2o5J16k5N1J15Kj44K1Rn0K0J7jm4K0L3O5J0K9r8K8p8j5jN4
$$ 45 30 -18 -78 -94 -83 -61 -126 -10 -35 16 131 133 -11 10 19 -31 -11 6 5 -39 -19 14 79 89 118 20 48 -30 -45 -46 8
5843Hj20R2J7n4k8R1M9K0J5j17K3%l9rnqj5J6O0N2J3K9n8J2Ol2l8o3o1O3J9k1
$$ 8 -112 -20 -3 -57 -85 6 55 75 90 -27 -4 -4 -43 -52 -57 -65 -80 -64 -4 48 61 90 32 44 50 18 -20 -83 -144 -81 -62 -83
5875h3%J18%K5P9j11k5%o4jJ2l2K5L2M0m3R8q0P3k1j8Rj6p9r3lR8k8Q4O7q4L7
$$ -83 -83 35 35 60 139 28 3 3 -61 -62 -50 -82 -57 -25 15 -28 70 -10 63 42 24 33 17 -62 -155 -158 -60 -88 -4 63 -21 16
5907A6PN9n3m8J8o8JMm7J0R5J0P8n8N6k7J7m2J6lq3o9K2N4Jl7J36m8N1PLk5j16
$$ 16 23 82 29 -19 -1 -69 -68 -64 -111 -101 -6 4 82 24 80 53 70 28 44 41 -42 -111 -89 -35 -34 -71 65 17 68 75 78 53 -63
5940f3J2L8m9J0O7l3J5M3L8k3N0J9q1k9k6p4M4Lp0P6j6J2J01M5j06O9j6j32J06
$$ -63 -51 -13 -62 -52 15 -18 -3 40 78 55 105 124 43 14 -12 -86 -42 -39 -109 -33 -49 -37 64 109 3 72 56 -76 30
5969C0q9JNk2k2m4J49J2M1R3j43jJ51j42k4no8K9rM1k7M8PoO0nr6L5O8j67N3L3
$$ 30 -59 -58 -53 -75 -97 -141 8 20 61 154 11 10 161 19 -5 -10 -78 -49 -58 -17 -44 4 11 5 65 60 -36 -1 67 -100 -47 -14
6001a4r0P2J01q2mJ19j04J32m6l5j17J11j25r3R9L2j8R8%q6K27r3j41J21o8j05
$$ -14 -104 -32 69 -13 -17 102 -2 130 84 49 -68 43 -82 -175 -76 -44 -62 36 36 -50 177 84 -57 64 -4 -109
6027a09R5m6j51K05M0j47J20J30j24R0M3k15J2J16j34J7J00j61N3J74r6o2J82
$$ -109 -14 -60 -211 -6 34 -113 7 137 13 103 146 -69 -57 59 -75 -58 42 -119 -66 108 12 -50 132
6050A32j21k4J48j09q4J05j14k7J23m8m3J70p9m2J66nk14R4K9j47J32j17j18J44
$$ 132 11 -13 135 26 -58 47 -67 -94 29 -19 -62 108 29 -13 153 148 -66 28 57 -90 42 -75 -193 -49
6074d9J24j30R2L8j26M6J70k12j3R1o4j12J30q9K8J53l3J2L9r9j00J50mj00K1
$$ -49 75 -55 37 75 -51 -5 165 -47 -60 31 -33 -145 -15 -104 -76 77 44 56 95 -4 -104 46 42 -58 -37
6099c7n6MK2N8m3J60j3j18P6J9mn1m1j07J11J5o2q7J78M1K3m0j4oJ42j18j10p2
$$ -37 -93 -89 -67 -9 -52 108 95 -23 53 72 68 17 -24 -131 -20 -5 -67 -154 24 65 88 48 34 28 170 52 -58 -130
6127a30Q0Q6l9p4l4J29O0o8k3L7kq1J9p4o0Q5N2n7R4ro3J43N9j32K5M5j45rR2
$$ -130 -50 36 -3 -77 -111 18 78 10 -13 24 22 -59 -40 -114 -174 -89 -37 -94 0 -9 -72 71 130 -2 23 68 -77 -86 6
6156Fj37M1J28q2m6J44mK2N5j44p3J07N5j50k3P5k3N2Oj75K71R3j90R4j55n2J77
$$ 6 -131 -90 38 -44 -90 54 50 72 127 -17 -90 17 72 -78 -101 -26 -49 3 9 -166 105 198 8 102 -53 -105 72
6183G2pk63J38J13j46M0J80k49J09K28k99M9J06j41o7J92k24m7K85j19qJ93r7
$$ 72 65 -198 -60 53 -93 -53 127 -122 -13 215 -84 -35 71 -70 -137 55 -169 -216 69 -50 -58 135 38
6206C8j10L05j49k51K79j2k42J06N7j48K17N2l09J38J57r3L4kk65J38J94k59M2
$$ 38 -72 233 84 -167 112 100 -142 -36 21 -127 90 142 -167 -29 128 35 69 67 -198 -60 134 -125 -83
6229h3J87k50J26J51j93K3K63k20m0K51k88o8K56j54r2J32q9L7K21q2j60J98p6
$$ -83 104 -146 -20 131 -62 -39 224 4 -36 215 -73 -141 115 -39 -131 1 -88 -51 170 88 -72 126 50
6252E0j88J59k0j01J18K6k55J52J53j56N2J03j39J86l2k14J3J77j33l2Q7q1J43
$$ 50 -138 21 1 -100 18 44 -211 -59 94 -62 -10 93 -46 140 108 -106 -93 84 -49 -81 6 -75 68
6275F8J10j28j11J30q6lM4o9q4J44j33N2J56p1n5J40O1j33k1nr0R6Nj09J1P9p8
$$ 68 178 50 -61 69 -17 -20 24 -45 -129 15 -118 -66 90 19 -36 104 165 32 11 6 -84 12 17 -92 -81 -2 -80
6302h0PQ9n7N3J1j9k9R3q9r9P0rL0n0M4rJ40Mq6J0pJ8l2l9l7L3J7K6o3N9N5l7
$$ -80 -73 16 -41 12 23 4 -25 68 -21 -120 -50 -59 -29 -79 -35 -44 96 100 14 24 17 35 3 -36 -73 -40 -23 3 -60 -1 54 17
6334A7%M3Rm9L5j41J21l5o3NL6L3K2J8NQ8k5p5n8l0p1O3N8n8qJ02o9L1R8Rj95
$$ 17 17 60 69 20 55 -86 35 0 -63 -58 -22 11 33 51 56 144 119 44 -14 -44 -115 -52 6 -52 -60 42 -27 4 102 111 -84
6365h4R5Rp4M3L2j07L8L9o5J28j8l9L0M8j31LK7o7J3J00n1r0J60pn5J27j5j10
$$ -84 11 20 -54 -11 21 -86 -48 -9 -74 54 36 -3 27 75 -56 -53 -26 -93 -80 20 -31 -121 39 32 -23 104 89 -21
6393b1J21p1k1l4qj00R1N2o7Q1O6n5N4j1l5m8PL4n0pn0k1J45k4m1M6m8L1M3k1
$$ -21 100 29 8 -26 -34 -134 -43 9 -58 23 89 34 88 77 42 -6 1 35 -15 -22 -72 -93 52 28 -13 33 -15 16 59 38
6423C8j30P8k7q5J03q0K1P8K7j3Q8j7j2lJ3j01k4j4m2R1Lp3J70p7K4O9k0J3j68
$$ 38 -92 -14 -41 -126 -23 -103 -82 -4 23 10 98 81 69 66 79 -22 -46 -60 -102 -11 -8 -81 89 12 36 105 85 98 -70
6452g0R5o8NJ4o1N6L8J9j0P4J3l9l5n5J4L4o2pK8k9j5J28n3lO7p2Oo9j0j6K0l
$$ -70 25 -43 -38 -24 -85 -29 9 28 18 92 105 66 31 -24 -10 24 -38 -45 -17 -46 -61 67 14 11 78 6 12 -57 -67 -83 -63 -66
6484f6M0k8M6rN7N4n2j1PNm5J4n1k0L1pL4N2k4K3L1q8L8K8m1n7O2r4K4L2n5P2
$$ -66 -26 -54 -8 -17 40 94 42 31 38 43 -2 12 -39 -59 -28 -35 -1 51 27 50 81 -7 31 59 18 -39 23 -71 -47 -15 -70 2
6516BK4L9o1K2M4m8J0n0J7j34J35n6M5kl6P3K8kq7M1N8j02p1O8J8p5J07o1M0P
$$ 2 26 65 4 26 70 22 32 -18 -1 -135 0 -56 -11 -13 -49 24 52 50 -37 4 62 -40 -111 -43 -25 -100 7 -54 -14 -7
6546gK7j6O2l9k6Q1j68R8p5K3L0j6N6j9J07oj34Q9p9Mm2MlRO2j12M6Q7P%l2M3
$$ -7 20 4 66 27 1 82 -86 12 -63 -40 -10 -26 30 11 118 112 -22 67 -12 -8 -50 -46 -49 -40 22 -90 -44 43 50 50 18 61
6578F1l2j09M6m7K5K8kK2k3L9j3N2o4O5o0m9P5r0J0M7l5k6N0M1L7MK1j07P5Jl1
$$ 61 29 -80 -34 -81 -56 -28 -30 -8 -31 8 -5 47 -17 48 -12 -61 14 -76 -66 -19 -54 -80 -30 11 48 52 73 -34 41 42 11
6609A1N1o1m2l1J7M0k0O6J2k9O8j8o4j3j6L0l6M1p4Q9j2K3M6o8L5qJ5jm4m4M5
$$ 11 62 1 -41 -72 -55 -15 -35 31 43 14 82 64 0 -13 -29 1 -35 6 -68 21 9 32 78 10 45 37 52 51 7 -37 8
6640Hq9J11%q9L3P0j9P6p3qM7j8p4o8J0P7MOJ8L5l0R2r8M1j16O8m2n9J03j9o3
$$ 8 -81 30 30 -59 -26 44 25 101 28 20 67 49 -25 -93 -83 -6 -2 4 22 57 27 119 21 62 -54 14 -28 -87 16 -3 -66
6671f6J1R0o5K3O9o7L3L1j00K4Qk0k8K4N4k3j5MJ09m4N4j21J3l5k7J8n7N8j2J16
$$ -66 -55 35 -30 -7 62 -5 28 59 -41 -17 -9 -29 -57 -33 21 -2 -17 -13 96 52 106 -15 -2 -37 -64 -46 -103 -45 -57 59
6701E9q4L9Rk3K6O1q9k8kn0J2L7N8j12J69j1r9R3l5l8M2j1j59R8N9j29J00J05
$$ 59 -25 14 23 0 26 87 -2 -30 -32 -82 -70 -33 25 -87 82 71 -28 65 30 -8 34 23 -136 -38 21 -108 -8 97
6729I7q6L0L7k7j9j4k6OK6q4O4Pr6K7P1K3%K7j18K4J11r1p9J29r9l4M1J6o1J17
$$ 97 11 41 78 51 32 18 -8 -2 24 -60 4 11 -85 -58 13 36 36 63 -55 -31 80 -11 -90 39 -60 -94 -53 -37 -98 19
6759A9j1n9N7j4m6O4l7j05N8Jo1J30N8p4P5j2p2K2J23j26p8Q3n6k7J04k0j7Q4
$$ 19 8 -51 6 -8 -54 10 -27 -132 -74 -73 -134 -4 54 -20 55 43 -29 -7 116 -10 -88 -5 -61 -88 16 -4 -21 63
6787F3n3J0P9j5r6L1jm8P5j17k4J60l7q6M1L3R0m8n9m9J4P8j02j6O6n4N4O3q2
$$ 63 10 20 99 84 -12 19 18 -30 45 -72 -96 64 27 -59 -18 15 105 57 -2 -51 -37 41 -61 -77 -11 -65 -11 52 -30
6816c0L2J04n4o6mL0j1j1ol9Q5n7jQ6k8m4M8P6j52O5K4m5m4L0k0qN2n0N1P1l6
$$ -30 2 106 52 -14 -18 12 1 -10 -16 -55 30 -27 -28 58 30 -14 34 110 -42 23 47 2 -42 -12 -32 -40 12 -38 13 84 48
6847D8r4P2k8o0O3j0n2N3j0M1kK0n6KK7n7j3J06q0j2J9J2p5J36p6N8M4j37J8Q5
$$ 48 -46 26 -2 -62 1 -9 -61 -8 -18 23 21 41 -15 -13 14 -43 -56 50 -30 -42 -23 -11 -86 50 -26 32 76 -61 -43 42
6877D2l4m2knn3O3J3l5J16p0o6R1M8n2K5p0J2M8L5r0O3Lj2j9M1k2k4L8n7%K4m
$$ 42 8 -34 -36 -41 -94 -31 -18 -53 63 -7 -73 18 66 14 39 -31 -19 29 64 -26 37 40 28 9 50 28 4 42 -15 -15 9 5
6909Ep6M7j2MN0K6r3J14qp9N8pj40J01j2l6K9K2j8J7K0l1PM9m2mJ40j69JM0o0
$$ 5 -71 -24 -36 -32 18 44 -49 65 57 -22 36 29 -111 -10 -22 -58 -29 -7 -25 -8 12 -19 -12 37 -5 -9 131 -38 -37 3 -57
6940e7L4J2rN8L1l2p6O0L6r8M3nm4M1n1N7N8K7j21PJ01r4Q5j06j1K0M8n4KN4q4
$$ -57 -23 -11 -20 38 69 37 -39 21 57 -41 2 -3 -47 -6 -57 0 58 85 -36 -29 72 -22 63 -43 -54 -34 14 -40 -38 16 -68
6971f8J09Qm5l9N7K0p0Pn4jL6K2o0Q1K5p5P5K4m7K4ll3M6r7lK3P3j9q1Q0K4n9
$$ -68 41 49 4 -35 22 42 -28 -21 -75 -76 -40 -18 -78 3 28 -47 28 52 5 29 26 -7 39 -58 -61 -38 35 16 -65 15 39 -20
7003b0P6Jjn9J1r5Q1l2M7N8j05Q6o2J05j03NN3m8Nm9K3n9P4l5O1M4o4L1rK5o4
$$ -20 56 57 56 -3 8 -87 -6 -38 9 67 -38 48 -14 91 -12 -7 46 -2 3 -46 -23 -82 -8 -43 18 62 -2 29 20 45 -19
7034a9L8l8l2nQ6p4Q9o2RK2K3n0O1K7j19J24p8r9P1J8m3N8M5l1K0M2n0J4j27R5
$$ -19 19 -19 -51 -56 30 -44 45 -17 -8 14 37 -13 48 75 -44 80 2 -97 -26 -8 -51 7 52 21 41 83 33 47 -80 15
7064A5J6qM4n0mJ5K9k5K2j00R5l9k8O2o0k9J2L5K6r1J2K4K8R7n9K5k8j5p1R0p4
$$ 15 31 23 67 17 13 28 57 32 54 -46 49 10 -18 44 -16 -45 -33 2 28 -63 -51 -27 1 98 39 64 36 21 -50 40 -34
7095c4q9Q0J3J2K9JMJ3LMjp7j0O9p8J7pQ6j9oO1j3L1k2j00N8o0O6q7Q0l7j3L9
$$ -34 -123 -43 -30 -18 11 12 16 29 32 36 35 -42 -52 17 -61 -44 -51 35 16 10 71 58 89 67 -33 25 -35 31 -56 24 -13 -26 13
7128A3Nn2P0rok9j1j8M0Qn9R1q1M8pK9K3m0K4l9NpQr1N4j5N2N8n9M8r8PJ08j25
$$ 13 18 -34 36 27 21 -8 -19 -37 3 11 -48 43 -38 10 3 32 55 15 39 0 5 -2 6 -85 -31 -46 6 64 5 53 -45 -38 70 -55
7162e5J30q9J5J4l3lO1q2N4RL8k1k9R2j69L1J01o0m3M4o4J02p3Q6k4ml5L0k6k0
$$ -55 75 -14 1 15 -18 -21 40 -42 12 21 59 38 9 101 -68 -37 64 4 -39 5 -59 43 -30 56 32 28 -7 23 -3 -23
7192b3%jK1k3O5m0K8l2J0N4nm0n7L9o9O3M0o4M4j6j2N3k8n1O0O7p9J8pMok5j5
$$ -23 -23 -24 -3 -26 39 -1 27 -5 5 59 54 14 -43 -4 -73 -10 30 -34 10 -6 -18 35 7 -44 16 83 4 22 15 19 13 -12 -27
7225b7R6j3nk0m2J3L5k2o6O6m0J6k0K4N6j2j3KK9m4%l9K7Lr2J18l3o0m5R4K7j5
$$ -27 69 56 51 31 -11 2 37 15 -51 15 -25 -9 -29 -5 51 39 26 28 57 13 13 -26 1 4 -88 30 -3 -63 -108 -14 13 -2
7257bK3J0J9m0L8l2Qo2Rj7Q6q6M8ql5J17j1k8l7M%k5O8l6j4K0K0n8K4M9o6R0m5
$$ -2 21 31 50 10 48 16 24 -38 -29 -46 40 -46 2 -6 -41 76 65 37 0 4 4 -21 47 11 -3 17 37 -21 3 52 -14 76 31
7290C1m4Jj7Qk8Q0m4K2Qm7P1L0n2NJ4j06L8L2l1%rj9O3L7q5J4pK1o4R0l1K5m3
$$ 31 -13 -12 -29 -21 -49 31 -13 9 17 -30 41 71 19 24 38 -68 -30 2 -29 -29 -38 -57 6 43 -42 -28 -35 -14 -78 12 -19 6 -37
7323c7O8%p0P5n9l2L9oQ3o1n6M3J4k8N4o5J1N9R3o3j31J09j5k6n1M7K7n6nJL8
$$ -37 31 31 -39 36 -23 -55 -16 -22 61 0 -56 -13 1 -27 27 -38 -27 32 125 62 -69 40 25 -1 -52 -5 22 -34 -39 -38 0
7354@L1k2Pln4M7J3p0O0%m8P7j40K3N6lM5Kl4lk5M2p3M3j8J8k8M3L7n3K9O3J2
$$ 0 31 9 16 13 -41 6 19 -51 9 9 -39 38 -102 -79 -23 -26 19 21 -13 -16 -41 1 -72 -29 -47 -29 -57 -14 23 -30 -1 62 74
7387G4k8Qp3N0j5L5l6J8K8n0l6pJ34j25KLM7km5N4Pk6J7o8L7m2jQ6k7J1j2k4M
$$ 74 46 54 -19 31 16 51 15 33 61 11 -25 -32 102 -23 -21 -18 29 27 -18 36 43 17 34 -34 3 -39 -40 46 19 30 18 -6 -2
7420bK0l3k7P4r6M0P3l4rp3L7RK4l3K6J8m9Q0m9Pk7N5j3kJ1%l7n4P3M2m5l9M0
$$ -2 18 -15 -42 32 -64 -24 49 15 6 -67 -30 -21 3 -30 -4 14 -35 45 -4 3 -24 31 18 16 27 27 -10 -64 9 51 6 -33 7
7453Go4L2J7K3mP2m8j33J16J0n2N3j2p2Q9k8O0n8M5k4J7q9K2M7J2j06N3k9l5M2
$$ 7 -57 -25 -8 15 11 83 35 -98 18 28 -24 29 17 -55 34 6 66 8 53 29 46 -43 -21 26 38 -68 -15 -44 -79 -37
7483c7j3P3m3P4n9r3J21l1NL2p8J08p6Q2pn9L3n5L1J3p0L2J2K8j8N7l9N1n8qK9
$$ -37 -50 23 -20 54 -5 -98 23 -8 -3 29 -49 59 -17 65 58 -1 32 -23 8 21 -49 -17 -5 23 5 62 23 74 16 8 37
7514C7L7p9ON0n5PJk8l5M5J4K2j9n4M3L9j2p9R9m1r7J07l7n2J23p1J6M1j3j01
$$ 37 74 -5 1 51 -4 3 4 -24 -59 -14 0 22 3 -51 -8 31 19 -60 39 -2 -99 8 -29 -81 42 -29 -13 28 15 -86
7544h6R2j4j9kk0q%N4j5K7lq5J00ol4M5nj6k7P5q5nL0l3K3N0m0k0P0l9J9j9n0
$$ -86 6 -8 -27 -29 -49 -57 -57 -3 -18 9 6 -79 21 15 -19 26 21 5 -22 53 -32 -37 -7 -40 -17 33 -7 -27 43 4 23 4 -46
7577d6K9J4m3%O3J8l5L8J1j05O8j7m1pL0J5L9m1m9L4L1j1rj7l2O6k0k3j2N4L2
$$ -46 -17 -3 -46 -46 17 35 0 38 49 -56 12 -5 -46 -53 -23 -8 31 -10 -59 -25 6 -5 -14 -31 -63 3 -17 -40 -52 2 34
7608C4J8o6M0m5O4n0k1k7P2o8N7Kk0K1k6NPQ3k3m5L3lo4M1l1Qqk0NjM1L4m2K7
$$ 34 52 -14 26 -19 45 -5 -26 -53 19 -49 8 10 -10 11 -15 -10 -3 80 57 12 45 42 -22 19 -12 -4 -12 -32 -27 -28 13 47 5 32
7642C2n8jJ00j23O0kj8k8j7O9mL2Pn8O7l0Nm8N1m3J2k7jK8l0M1J8nK2k3M1r5k7
$$ 32 -26 -27 73 -50 10 8 -10 -38 -55 14 10 42 49 -9 58 28 33 -15 36 -7 5 -22 -23 5 -25 16 34 29 51 28 69 -26 -53
7675e3pK8O2L1r0k5JJ14m8l2Q5j13Q4j26L5M5m0K7J5Q2j25J8R7j1p0k7O7r3P3
$$ -53 -60 -32 30 61 -29 -54 -53 61 13 -19 66 -47 37 -89 -54 -9 -49 -22 -7 75 -50 -32 65 54 -16 -43 24 -69 4
7704Dl6j0O9o4K1L1Rm1L6k4j3Q1j16K8Q8j18M9l2M5m8Q2j6k2j4kJJjM2l4L0n9
$$ 4 -32 -42 27 -37 -16 15 24 -17 19 -5 -18 63 -53 -25 63 -55 -6 -38 7 -41 41 25 3 -11 -13 -12 -11 -12 30 -4 26 -33
7736c3K2O5l4j1k6N9n5L3pJ9o8K2J5o9N1N6Oj8p7M0N6n7N8q0J3j6N6j34R9J2J5
$$ -33 -11 54 20 9 -17 42 -13 20 13 32 -36 -14 1 -68 -17 39 45 27 -50 -10 46 -11 47 -33 -20 -36 20 -114 -15 -3 12
7767A2l4M2r4pR5o7J8J2m1N1K5k0l4R2m1K0m6pJ0P0m2J5j02L3M1M1K4m2M7n6j2
$$ 12 -22 20 -74 -81 14 -53 -35 -23 -64 -13 12 -8 -42 50 9 29 -17 -24 -14 56 14 29 -73 -40 1 42 66 24 71 15 3
7798Ck1N2l2J6j0l0p1R9ll9K9L2o7K8J7K9k2l9rNM3j9j03N3K2k1N7M4pj05M4o5
$$ 3 -18 34 2 18 8 -22 -93 6 3 -36 -7 25 -42 -14 3 32 10 -29 -38 -33 10 -9 -112 -59 -37 -58 -1 43 36 -69 -25 -90
7830i0N0J3k2K7jj4N4J1L6k4l8Olk0j6j1K4J2JJ1L4pRo2rM8m5K2j1K1n4k7J24
$$ -90 -40 -27 -49 -22 -23 -37 17 28 64 40 2 8 5 -15 -31 -42 -18 -6 -5 6 40 33 42 -20 -29 19 -26 -4 -15 6 -48 -75 49
7863D9j12M2J6k3K3j1%K5mn0O9m1MNj02J06L5k7kK0m2o0J19r2N9o0O4k4kQ2n5
$$ 49 -63 -21 -5 -28 -5 -16 -16 9 5 -45 24 -17 -13 -8 -110 -4 31 4 2 22 -20 -80 39 -53 6 -54 10 -14 -16 66 11
7894A1J9k5LJ4n4M8Ml2M2j2K5p6P1k7Kk0j4L1K6l2J5n7L0J00j37M5k0L0l0Q3l4
$$ 11 30 5 8 22 -32 16 20 -12 30 18 43 -33 38 11 13 -7 -21 10 36 4 19 -38 -8 92 -45 0 -20 10 -20 63 29
7925B9k3J8j1j0J8n2OJ1L4p0O7j3L5m2K7r3KO0J1q8N6K4J9l0QN1k4j4J6N%jn7
$$ 29 6 24 13 3 21 -31 -25 -14 20 -50 17 4 39 -3 24 -69 -67 -7 4 -84 -28 -4 15 -15 -7 44 20 6 22 27 27 26 -31
7958c1O2m0qM7l3KLKR4r0mj2J0M0k7m2Q0q4L7R0q9ol3M3Lo1K3M4l6j5N2q2P8m
$$ -31 31 -9 -17 30 -3 -1 2 4 98 8 4 -8 2 42 15 -27 53 -31 6 96 7 1 -32 11 14 -47 -24 20 -16 -31 21 -61 17 13
7992A3QrN9n7JpN4m3Ro6Q1k7n5K7qN4M2p5Q4o5J1no5Q4j03L3kON3O4n6o8O2J1
$$ 13 21 12 71 14 15 8 62 19 28 -38 43 16 -39 -12 -20 34 76 1 85 20 31 26 -39 45 -58 -25 -27 -21 32 96 40 -28 34 45
8026D5n6j1J19r5m9RO4j0j0j8J0nl4jQ5p0Q6j26N4m6J3P9q7M3J7J1m1J01o5j6
$$ 45 -11 -22 97 2 -47 -38 26 16 6 -12 -2 -7 -41 -42 43 -27 59 -67 -13 -59 -46 33 -54 -11 6 17 -24 77 12 -4
8056dm2l7Q9l1j6J4O2Mk8m0JN5rk7n1N3l8lJ1J8K6j0j8O0l6M4o4L7k1j0k4QM0
$$ -4 -46 -83 6 -25 -41 -27 35 39 11 -29 -28 27 18 -9 -60 -7 -45 -48 -37 -19 7 -3 -21 39 3 47 -17 20 -1 -11 -35 -27 13
8089A3p6N3Ql1O1ml5j8J4m0R0o9P0p0nj1N0N0k9J4L2q6J4K4n8J8P4m6m4O5r1Q3
$$ 13 -63 -10 -2 -33 28 24 -11 -29 -15 -55 35 -34 36 -34 -39 -50 0 50 21 35 67 -19 -5 19 -39 -21 53 7 -37 28 -63 20
8121B0rK7pL0k5l0L1m3jN7n6j8L5J5j9l3O2q1P8m8k4J8M3p3L9O4q7K7J3m2J7N9
$$ 20 11 38 31 61 36 6 37 -6 -7 50 -6 -24 11 26 7 -26 36 -45 33 -15 -39 -21 22 -51 -12 52 -35 -8 5 -37 -20 39
8153C9p9kM4m2J0n6O2O8j9l2L4J0l0mK8po7M4l0LM9p5%L8K0J2k1P4p8J3P0r2N1
$$ 39 -40 -42 2 -40 -30 -86 -24 44 25 -7 27 37 7 3 31 24 -43 1 -29 -26 23 -52 -52 -14 6 18 -3 71 -7 6 76 -16 35
8186C5k8r8M2L9j8
$$ 35 7 -91 -49 -10 -28
8191b8
$$ Imaginary data points
##PAGE= N=2
##DATA TABLE= (X++(I..I)), XYDATA
0@%%%Qj6J6j6K4l2M0n6P2q8J04j28J60j92K26k67L13l66M29m99N72o52P48q56
$$ 0 0 0 0 8 -8 8 -8 16 -16 24 -32 40 -48 56 -72 88 -104 122 -145 168 -198 231 -268 304 -348 400 -456
27d56R75j106J247j401J575j771J981k208K458k732L035l368L735m135M575n065
$$ -456 519 -587 660 -741 834 -937 1044 -1164 1294 -1438 1597 -1771 1964 -2171 2404 -2661
43b661N609o217O896p659Q527r527J0689j2059J3701j5707J8230k1514K5977l2411
$$ -2661 2948 -3269 3627 -4032 4495 -5032 5657 -6402 7299 -8408 9822 -11692 14285 -18126
57a8126M2516o0686J02913l56407j62603Q56960l76407j54224K26874l82251K00667
$$ -18126 24390 -36296 66617 -289790 -452393 404567 28160 -126064 100810 -281441 -80774
68h0774N96221o63000k26962O99263k23171l18538L96726k77950j19257N58801
$$ -80774 515447 -147553 -374515 324748 101577 -216961 179765 -98185 -217442 341359
78C41359l30322l71972O15250q2662m30809L97033k5949l07125M11565j31904
$$ 341359 11037 -360935 254315 171653 -259156 137877 111928 -195197 216368 84464
88H4464m57727M66681J12240m80862K80313J47592l74695K51145J26629l60241
$$ 84464 -373263 93418 205658 -275204 5109 152701 -221994 29151 155780 -204461
98b04461L00490J57918n18778J62185L64094l24366p055J54644k64683K10229
$$ -204461 96029 253947 -264831 -102646 261448 -62918 -69973 84671 -180012 30217
108C0217K64340m60730k4625M26523j66517j09438J34377k52198N9978L48560
$$ 30217 294557 -166173 -190798 235725 69208 -40230 94147 -158051 -98073 250487
118B50487k80376j90370K85468p9760p7755K20611j60755r8987K86891j07595
$$ 250487 -29889 -220259 65209 -14551 -92306 128305 -32450 -131437 155454 47859
128D7859j87061K11945l4927j26542J77585q0528j50918K13203j021j55495J49004
$$ 47859 -139202 72743 37816 -88726 88859 8331 -142587 70616 69595 -85900 63104
139F3104n69j30744J43150j3340j65418J22748M1905j25657O7679k2444j10830
$$ 63104 62535 -68209 74941 61601 -103817 18931 60836 -64821 2858 -19586 -130416
150a30416J62555O3754j58940L3698N1297m9990Q9672j0966j36576Q7778N9398
$$ -130416 32139 95893 -63047 -29349 21948 -28042 61630 50664 -85912 1866 61264
161F1264j12112L9113L8367p2705P5666L6658r8529N1819K9209r2877P4521M8041
$$ 61264 -50848 -11735 26632 -46073 29593 66251 -32278 19541 48750 -44127 30394 78435
173G8435j28609Q139M1357n9486P6037L1822j31830N0049R3071q3358K4362M9874
$$ 78435 -50174 -42035 -678 -60164 15873 47695 -84135 -34086 58985 -24373 -11 49863
185D9863r1193M8453N6858j34035K7890J13833r2806r957P5181p3275L7048Q3974
$$ 49863 -41330 7123 63981 -70054 -42164 71669 -21137 -31094 44087 -29188 7860 91834
197I1834j32274L165J47765r4742p8525P2874n3262J8371J09294j29206o5247
$$ 91834 -40440 -37275 110490 15748 -62777 10097 -43165 -24794 84500 -44706 -109953
208a09953J57036k7486o0770J00806n7246o2054J20280m8576q5518J20571k5842
$$ -109953 47083 19597 -41173 59633 2387 -59667 60613 12037 -73481 47090 21248
219B1248r8568J10586n24r2986J01204N338r5260J03827J1274j35926O6751M7284
$$ 21248 -77320 33266 32742 -60244 40960 46298 -48962 54865 66139 -69787 -3036 44248
231D4248r3325N9813J8577j23370P1404Q0763j02074L6297O9266j00554K0621
$$ 44248 -49077 10736 29313 -94057 -22653 58110 -43964 -7667 61599 -38955 -18334
242a8334P3179q5666K0081O9942j06235j089J04052o7050k1120Q2956n2884r300
$$ -18334 54845 -30821 -10740 59202 -47033 -48122 55930 -11120 -32240 50716 -2168 -11468
254a1468Q2723p3646m3187R4236l4459n0678O0893m7747m6592R4063q381n7076
$$ -11468 71255 -2391 -45578 48658 14199 -36479 24414 -23333 -69925 24138 15757 -41319
266d1319O2499j2224n2506P0740L283o1145M9090k447o7008N2415K5118n7556
$$ -41319 21180 8956 -43550 27190 30473 -30672 18418 15971 -51037 1378 26496 -31060
278c1060L6428K5846m8707L3122K2640n5298K8408L3642n9604l35K5242m4140
$$ -31060 5368 31214 -17493 15629 38269 -17029 11379 45021 -14583 -14918 10324 -33816
290c3816J2971M0191l6990j285L0820l0530Q952M4414k9957j6990K5213k4821
$$ -33816 -20845 19346 -17644 -18929 11891 -18639 -9687 34727 4770 -12220 12993 -11828
302a1828q838L3479j5914j2977K7944j0668r303K9462o636j1635K4834j1380k8598
$$ -11828 -20666 12813 -3101 -16078 11866 1198 -8105 21357 14721 3086 27920 16540 -12058
315a2058J0023j676j0552J5873o039j9101J3500N788m584K0740N017j9917L71
$$ -12058 -2035 -3711 -14263 1610 -4429 -23530 -10030 -4242 -8826 11914 16931 -2986 -2615
328b615K904o947Q062J189j2740M004M497n569J1252J2534l926J181R20j0356
$$ -2615 289 -6658 1404 2593 -10147 -6143 -1646 -7215 4037 16571 12645 13826 14746 4390
342D390k509J447m954k94l364j2304l51R424M034N942N173m264l790N16P10M213
$$ 4390 1881 3328 -1626 -1920 -5284 -17588 -17939 -8515 -4481 1461 6634 2370 -1420 -904 -194 4019
358D019N45q956n440J437J442N950R363L661j029k653j698L165K475m664o615
$$ 4019 4564 -4392 -9832 -8395 -6953 -1003 8360 12021 10992 8339 6641 9806 12281 7617 1002
373A002n810o976l222L646N491L373M40p06J260K386J498K284R91n044q503m351
$$ 1002 -4808 -11784 -15006 -11360 -5869 -2496 -2056 -2762 -1502 884 2382 4666 5657 613 -7890 -12241
389a2241L270P003N214J709n24j072J793O346N664j825r166r304l388O25k44r20
$$ -12241 -8971 -1968 3246 4955 4431 3359 5152 11498 17162 15337 6171 -3133 -6521 -5896 -6140 -7060
405g060K00Q0K20K505M056L186J441L76j825n457o282j571N259O543l7m848q57
$$ -7060 -6860 -6780 -6560 -4055 1 3187 4628 5004 3179 -2278 -8560 -10131 -4872 1671 1634 -3214 -4071
422d071N211Q118P916J015q692r085k876J380K908k643r064k991M417K393L840
$$ -4071 1140 9258 17174 18189 9497 412 -2464 -1084 1824 -819 -9883 -12874 -8457 -6064 -2224
437b224N674o59n75K441m030m290J140k101J074N289o518o680R387Q704L925O221
$$ -2224 3450 2791 2216 4657 627 -3663 -2523 -4624 -3550 1739 -4779 -11459 -2072 6632 10557 16778
453A6778o031j0352M241J798m167L054p428j5022N447P709l257P103L699q029
$$ 16778 10747 395 4636 6434 2267 5321 -2107 -17129 -11682 -3973 -7230 -127 3572 -4457
467d457O169N224j0676L092N835j0747J364M293j4181L488J8594j689P20N652
$$ -4457 1712 6936 -3740 -648 5187 -5560 -4196 97 -14084 -10596 7998 6309 7029 12681
481A2681j2954J771J7358q958r151N063j4945p338J6964l634p388J2419n037n278
$$ 12681 -273 1498 18856 9898 747 5810 -9135 -16473 491 -3143 -10531 1888 -3149 -8427
495h427J7025m727j1641J5658j759j6286P372l266j0228J9364O027j4821R093
$$ -8427 8598 3871 -7770 7888 6129 -10157 -2785 -6051 -16279 3085 9112 -5709 3384
508C384L855r610J6927O958k0440J775J772j7196Q183J0102j5635K064P489j1047
$$ 3384 7239 -2371 14556 21514 1074 2849 4621 -12575 -4392 5710 -9925 -7861 -372 -11419
522a1419J0840J3523j6435K53J3703j0912m421L155j2839P578J8779j3071r597
$$ -11419 -579 12944 -3491 -3238 10465 -447 -4868 -1713 -14552 -6974 11805 -1266 -10863
535a0863R787Q04J1122J4004j8185j2481J0618k017j634M258j3891m683J2150
$$ -10863 -1076 -272 10850 24854 6669 -5812 4806 2789 1155 5413 -8478 -13161 -1011
548a011n220q51J3006n090l746R747n019l413M651j2024k83J6572q453j0929P817
$$ -1011 -6231 -7082 5924 834 -2912 6835 1816 -1597 3054 -8970 -9253 7319 -1134 -12063 -4246
563d246J01R064J6563j4313j0470J2992o527l487J4414j3309j4296R611q545J823
$$ -4246 -4145 4919 21482 7169 -3301 9691 3164 -323 14091 782 -13514 -3903 -12448 -10625
577a0625K7019j4069k1772K1254O044n767J0507k2468j3634M0197k026l9002J1001
$$ -10625 16394 2325 -19447 1807 7851 2084 12591 -9877 -23511 16686 14660 -24342 -13341
590a3341J1628k93K7033j6038l5225L7265J8545l5070J0972P748k8807J7218M326
$$ -13341 -1713 -2006 25027 8989 -26236 11029 29574 -5496 5476 13224 -15583 1635 5961
603E961l5231L0697K4573m7898O273L3180k3738J1096J6269m5946J3254M2128
$$ 5961 -29270 1427 26000 -21898 -15625 17555 -6183 4913 21182 -24764 -11510 30618
615C0618m5013j1681M0117k4463L79L9030l8574j0265N2613k6626j9129M8051
$$ 30618 -14395 -26076 14041 -10422 -10043 28987 -9587 -19852 32761 6135 -12994 35057
627C5057l1372l7297M7492q690k4626M1495k8600l8753O8211N521n6237L3117
$$ 35057 3685 -33612 13880 5190 -19436 22059 -6541 -45294 22917 28438 -27799 5318
639E318P948l4503M2497p729o2778N1602L2260o2564J8191K6774m1535L6781K7466
$$ 5318 13266 -21237 21260 13531 -49247 2355 34615 -27949 -9758 17016 -24519 12262 39728
652C9728o6781K2919M9094o0625j315M4175m4878P130M2354o2017k564P1816l7667
$$ 39728 -27053 -4134 44960 -15665 -16980 27195 -17683 -10553 31801 -30216 -32780 39036 1369
665A369k3665M8677l5935j3317O2186m0611l9838O1896j5156l5755N0735k1265
$$ 1369 -22296 26381 -9554 -22871 39315 -1296 -41134 20762 5606 -30149 20586 -679
677f79l7761O8956R8n6992L8324K835l9323N1357j80o8702L7066K7837m8632K6747
$$ -679 -38440 30516 30614 -26378 11946 14781 -24542 26815 26635 -42067 -5001 22836 -25796 951
691I51J9078n0513L2101L2245n6942J4068L8161m6268O978L4542m7633K883M4839
$$ 951 20029 -30484 1617 33862 -23080 -9012 29149 -17119 -10141 24401 -23232 -20349 24490
704B4490l7109k485M4613l4608j0306M5396k7794j6769M2105k4516k5203L5385
$$ 24490 -12619 -15104 29509 -5099 -15405 29991 2197 -14572 27533 3017 -22186 13199
716A3199j8663j8381M6061j3703l7864L2849O687j6678K6237j7638l3783M1790
$$ 13199 -5464 -23845 22216 8513 -29351 3498 10185 -6493 19744 2106 -31677 10113
728A0113J2525m2093O254J1161p744K7406n326m0843K5381L2384k2125m740J448
$$ 10113 22638 -19455 -13201 -2040 -9784 17622 12296 -28547 -3166 29218 7093 2353 3801
741C801j6610J7610J0458k9592M300J9560j5769j019J1876p503P750P341j9969
$$ 3801 -12809 4801 15259 -14333 -10033 9527 -6242 -7261 4615 -2888 4862 12203 -7766
754g766J265J5165j0682m628M976o298N688O541j0692M586J0712o141K986M552
$$ -7766 -6501 8664 -2018 -6646 -1670 -7968 -2280 4261 -6431 -1845 8867 2726 5712 10264
768A0264j0603j12J692n812J0521L24k2251L383J7108L7L330p278j6455J9640
$$ 10264 -339 -451 1241 -4571 5950 6274 -15977 -12594 4514 4551 7881 603 -15852 3788
782C788J5755k4368n705J0090o260R831K107k5784J2927K7199j7938m233J3407
$$ 3788 19543 -4825 -10530 -440 -6700 3131 5238 -20546 -7619 19580 1642 -2591 10816
795A0816j5006O534J7401k6581k775K4770k2185r798K6190j2532m961K4327k1370
$$ 10816 -4190 2344 19745 -6836 -9611 15159 -7026 -16824 9366 -3166 -8127 16200 -5170
808e170j0719L4899j3155k1169K6610j1375k0468K9733p817k3478L2228j765k6588
$$ -5170 -15889 19010 5855 -15314 11296 -79 -20547 9186 1369 -22109 10119 8354 -18234
821a8234L1467K577l2767K6335R632l1547J9038L563l6896K6886K2415l8828Q617
$$ -18234 13233 15810 -16957 9378 19010 -12537 6501 10064 -26832 54 22469 -16359 -7742
834g742K0763k7408J7150K2196m0421N774L2342l2637m593K8144k6614K69L2772
$$ -7742 13021 -14387 2763 24959 -15462 -9688 22654 -9983 -14576 13568 -13046 -12777 19995
847A9995k9415q139L9703j9330j5152L4157j7036j9105L0628j6556k0535L6645
$$ 19995 -9420 -17559 22144 2814 -12338 21819 4783 -14322 16306 -250 -20785 15860
859A5860r773l0146L0320R17k3179K9193q72l0749K6350N432l2867K0935J0792
$$ 15860 6087 -24059 6261 7178 -16001 13192 12320 -18429 7921 13353 -19514 1421 12213
872A2213l1574J6289J4090k8183J6433J8579k9039J1261K2731k9147P52K0762
$$ 12213 -19361 -3072 11018 -17165 -732 17847 -11192 69 22800 -6347 -5595 15167
884A5167k2725K598K0816k7805m251K9161j4914o911K3018j5485q712K3989j3201
$$ 15167 -7558 -4960 15856 -11949 -16200 12961 -1953 -8864 14154 -1331 -10043 13946 745
897G45j2921K2752j0149j7507K0591k723j3749J9343j331j4297J8896O66j8888
$$ 745 -12176 10576 427 -17080 3511 788 -12961 6382 5051 -9246 9650 10316 -8572
910h572J4074N441j6834P797J854j6489J1316Q926j5308O252R607j2470L907Q869
$$ -8572 5502 10943 -5891 1906 3760 -12729 -1413 7513 -7795 -1543 8064 -4406 -499 8370
924H370j1430K543P502j4193j434J1000o831q82R007o100k60J0159n398k506R153
$$ 8370 -3060 -517 6985 -7208 -8642 2358 -4473 -5355 3652 -2448 -2708 7451 2053 -453 8700
939H700m708o288M402l789l460O871j960m375N500m48k651O305M86m596J515j595
$$ 8700 3992 -2296 2106 -1683 -5143 1728 -232 -4607 893 445 -2206 4099 4585 -11 1504 -91
955i1l869K516l35l111K738J338j988K410K266P38K824q07l884j11K41j233K42
$$ -91 -3960 -1444 -1779 -4890 -2152 -814 -2802 -392 1874 2612 5436 4629 745 634 875 -358 -116
972a16j544j630J647L62K08K854J026o43J44k007j469J383j403j910R29j153q66
$$ -116 -1660 -3290 -1643 -1281 -1073 1781 2807 2164 2308 301 -1168 215 -1188 -3098 -2169 -3322 -4188
989d188K952J317Q33L067l90k113J425n82j970J347j251l743N61O01k60L474J303
$$ -4188 -1236 81 914 3981 3591 1478 2903 2321 351 1698 447 -3296 -2735 -2134 -2394 1080 2383
1006B383k364J137J035j878R49J47l588l90J55k310J345K989m07J336K111j344
$$ 2383 19 1156 2191 313 1262 1409 -2179 -2569 -2414 -4724 -3379 -390 -797 539 2650 1306
1022A306R17K122j795j212N53k650j854R58n05M89K695m03q80J620J96j66J423
$$ 1306 2223 4345 2550 1338 1891 -759 -2613 -1655 -2160 -1671 1024 621 -259 1361 1557 1391 2814
1039B814j383l172j028p08n8K085N05j205R58J666J165J944M15j751j082m05j071
$$ 2814 1431 -1741 -2769 -3477 -3535 -1450 -945 -2150 -1192 474 1639 3583 3998 2247 1165 760 -311
1056c11m94n35q27M41J271L25K72R08P34Q20K18j686k466j238J88P33K64r26r67
$$ -311 -805 -1340 -2167 -1726 -455 -130 142 1050 1784 2604 2822 1136 -1330 -2568 -2380 -1647 -1383 -2309 -3276
1075c276J108K635K391P63q52j441l31M54j88j265j736r12O59J223M70K49O26
$$ -3276 -2168 467 2858 3621 2769 1328 997 1451 1263 -2 -1738 -2650 -1991 -768 -298 -49 577
1092E77J174R68k85j727j692k32K04Q4j035j835o5K413K733J581l61j578J1J536
$$ 577 1751 2719 2434 707 -985 -1217 -1013 -929 -1964 -3799 -3864 -1451 1282 2863 2502 924 935 2471
1110B471K89r46j981k370k76J663N23k5N46M4J282J797r70j547j64n65o49N3j965
$$ 2471 2760 1814 -167 -2537 -2813 -1150 -627 -652 -106 -62 1220 3017 2047 500 336 -229 -878 -825 -2790
1129b790j647J673J953J186J316q15r76K264J529j039r59k143k316J248J307q50
$$ -2790 -4437 -2764 -811 375 1691 876 -100 2164 3693 2654 1695 -448 -2764 -1516 -209 -1059
1145a059J25L37j62K240J517j480l03K58j378n03p55k235K23J776M8L97Q71k77
$$ -1059 -934 -597 -759 1481 2998 1518 1215 1473 95 -408 -1163 -3398 -3175 -1399 -1351 -954 -83 -360
1163c60J572K165n06j082o36j750k57N71r77k50L70l05J109J672K29N56R8j317
$$ -360 1212 3377 2871 1789 1153 -597 -854 -283 -1260 -1510 -1140 -1445 -336 1336 1565 2121 2219 902
1181I02k87m45j766J1m4j195J184P73j032K117K248n01P78n13l115J526J539l506
$$ 902 615 170 -1596 -1585 -1629 -2824 -1640 -867 -1899 218 2466 1965 2743 2230 -885 641 2180 -1326
1199a326o53R49k054K257K783l420J482M111k975n52K050m396J48M097n113k353
$$ -1326 -1979 -1030 -3084 -827 1956 -1464 18 4129 1154 602 2652 -1744 -1596 2501 -2612 -4965
1215d965M827k375J2O430l404k466O624k629l507O006l494n688O319k036n536
$$ -4965 -138 -2513 -2501 3929 525 -1941 4683 2054 -1453 4553 1059 -4629 1690 -346 -5882
1230e882P615k38o121P727Q03p213P136Q93r661N790K844r869M314L359r198P245
$$ -5882 1733 1495 -4626 3101 3904 -3309 3827 4720 -4941 849 3693 -6176 -1862 1497 -7701 -456
1246d56P271j1000K454Q062q280L568P190j3531l76J1173r051j652R755r601q63
$$ -456 6815 -4185 -1731 6331 -1949 1619 8809 -4722 -5098 6075 -2976 -4628 5127 -4474 -5337
1261e337J4017q323n356J2830o478o284J2161p501r101J3676l889r908J3270j493
$$ -5337 8680 357 -4999 7831 1353 -4931 7230 -271 -9372 4304 415 -9493 3777 2284
1275B284j0426J3213J47j1810J2534J369j5384R118M088j3298R108M490j5575
$$ 2284 -8142 5071 5218 -6592 5942 7311 -8073 1045 5133 -8165 943 5433 -10142
1288a0142Q588J0363j3460M538Q810j3731M331J0857j5391n20J2151j1423o71
$$ -10142 -1554 8809 -4651 -113 8697 -5034 -703 10154 -5237 -5757 6394 -5029 -5700
1301e700J2573j1511k138J5486p968n028J2881q365o555J4078o504r632J2274
$$ -5700 6873 -4638 -6776 8710 742 -4286 8595 230 -6325 7753 1249 -8383 3891
1314C891l634q701J2770j757r677J2394L03j1639R614J850j1351P616J636j1984
$$ 3891 257 -8444 4326 2569 -7108 5286 5589 -6050 3564 5414 -5937 1679 3315 -8669
1328h669Q013N233j1503N322P011q715M712N548j0789L140P916r559q43O102p261
$$ -8669 -656 4577 -6926 -1604 5407 -3308 1404 6952 -3837 -697 7219 -2340 -3183 2919 -4342
1343d342J116P791p130p02Q327m589j689O184m842k374N733m515l390N170k393
$$ -4342 -3226 4565 -2565 -3267 5060 471 -1218 4966 124 -2250 3483 -1032 -4422 748 -1645
1358a645k038N256j603j974M671q95j827L111k041k493K275j536j629K043j142
$$ -1645 -3683 1573 -30 -2004 2667 1772 -55 3056 1015 -1478 797 -739 -2368 -325 -1467
1373a467O7K642j388L10K779j684l84J129l309M99K270m359j88L661k473J040
$$ -1467 -1400 1242 -146 164 2943 1259 875 2004 -1305 -806 1464 -2895 -3083 578 -1895 -855
1389h55L350m374J816N764n389j872M495m557m79N283o546j613Q654m317l040
$$ -855 2495 -1879 -63 5701 312 -1560 2935 -1622 -2101 3182 -3364 -4977 3677 -640 -3680
1404c680Q362l729l353Q502n172n988R669l526q199R257j492p650J0073m41q959
$$ -3680 4682 953 -2400 6102 930 -5058 4611 1085 -7114 2143 651 -6999 3074 2633 -6326
1419f326J0846J351j1661Q785K881j2433P310M136j3099P175O720j3120O372R579
$$ -6326 4520 5871 -5790 2995 5876 -6557 753 4889 -8210 -1035 5685 -7435 -1063 8516
1433H516j3432L519J0559j2832J388J0622j3590l38J3439j2423l220J5010q977
$$ 8516 -4916 -1397 9162 -3670 -2282 8340 -5250 -5588 7851 -4572 -7792 7218 -1759
1446a759m248J4614q727o136J5839p873j0197J4987m607j1401J3676k509j1241
$$ -1759 -6007 8607 -120 -6256 9583 1710 -8487 6500 1893 -9508 4168 1659 -9582
1459i582J4739m79j3660J3721K951j5035J0187L971j4863Q891N022j5663Q518
$$ -9582 5157 4678 -8982 4739 7690 -7345 2842 6813 -8050 841 5863 -9800 -1282
1472a282Q964j5471N376J1235j3208L074J0499j3636J805J1757j4212j559J4346
$$ -1282 7682 -7789 -2413 8822 -4386 -1312 9187 -4449 -2644 9113 -5099 -6658 7688
1485G688j0561m237J3022p640k738J3401r299o677J5725n231j0739J0504k652
$$ 7688 -2873 -7110 5912 -1728 -4466 8935 -364 -7041 8684 3453 -7286 3218 566
1498E66p056J1130m338r975J4011J720j2353P827L672q436O712j83j1253Q913
$$ 566 -6490 4640 302 -9673 4338 6058 -6295 1532 5204 -3232 3480 3297 -7956 957
1512I57N466j3090K486P898o301L149L899q928M474Q260j0101j989P929n245j939
$$ 957 6423 -6667 -4181 3717 -2584 565 4464 -4464 10 8270 -1831 -3820 4109 -1136 -3075
1527c075M984n239L85P502n772k888Q883j694m994L815j418j905M308m057m531
$$ -3075 1909 -3330 -2945 4557 -1215 -4103 4780 3086 -1908 1907 489 -1416 2892 -1165 -5696
1542e696O889R47n538K440K407r65K309j781l511M615J508o032q38L141J69M2
$$ -5696 1193 2140 -3398 -958 1449 484 2793 1012 -2499 2116 3624 -2408 -3246 -105 64 106
1558A06j416j743M039L105l442j988K255J082o46k083j612J257J444j258j094
$$ 106 -1310 -3053 986 4091 649 -1339 916 1998 1352 -731 -2343 -1086 358 -900 -1994
1573a994J249J822L35j328M39J508q04j257l53n74N56K56k019N03K663r10m95
$$ -1994 -745 1077 1412 84 523 2031 1227 -30 -383 -957 -401 -145 -2164 -1661 1002 92 -403
1590d03K146m93p79J083j693n89K177k418k649L209P53j525J508m06n62L635p09
$$ -403 1743 1250 471 1554 -139 -728 1449 -969 -3618 -409 344 -1181 327 -79 -641 2994 2285
1607B285l686K120R42l046R66J56k364K400J285l007K248K590l126O21K144k759
$$ 2285 -1401 719 1661 -1385 -419 -263 -2627 -227 1058 -1949 299 2889 -237 384 2528 -231
1623b31K32J466l713K07K957k599k99L439j793o81L323j349r46K399k552k080
$$ -231 1 1467 -2246 -2039 918 -1681 -1980 1459 -334 -1015 2308 959 13 2412 -140 -2220
1639b220L257r91k756K421l4j226L106m11k250L033O38l177J112L61k590J182
$$ -2220 1037 46 -2710 -289 -323 -1549 1557 1146 -1104 1929 2567 -610 502 863 -1727 -545
1655e45M67k445J881J726k476J018K385j422K86R12k509J37J805k290p13J737
$$ -545 -78 -2523 -642 1084 -1392 -374 2011 589 875 1787 -722 -585 1220 -1070 -1783 -46
1671d6j191j23K252n00k56J691r56q75J492q90j829P54k93p80J148j41q37J767
$$ -46 -1237 -1360 892 392 136 1827 871 -4 1488 598 -1231 -477 -770 -1550 -402 -543 -1380 387
1689C87R44q13M87N8j139M16J92j256p0J59j014R37J351k07m5M21k59L90O11j203
$$ 387 1331 518 1005 1063 -76 340 532 -724 -794 -635 -1649 -712 639 432 387 808 549 939 1550 347
1709C47r60J12m25j68M36k93lR59N80P3L17l03l92L53j42p43o08l40K0P55O49
$$ 347 -613 -501 -926 -1094 -658 -951 -954 5 585 658 975 672 280 633 491 -252 -860 -1200 -1180 -425 224
1730B24j34M8L20M42M17M8q39p64k85j40p6n5k72J17O05O16K74K09m5pj1k90p45
$$ 224 90 138 458 900 1317 1365 526 -238 -523 -663 -739 -794 -1066 -949 -344 272 546 755 710 703 692 402 -343
1753c43n05m7P2L80O3j2L72N83O04J57k99m93m56j95j23l67k78k14K31M70M38
$$ -343 -848 -895 -823 -443 -380 -392 -20 563 1167 1324 1025 532 76 -119 -242 -609 -887 -1101 -870 -400 38
1774C8L28K51K10j4j34m27m28k28j73n8r2m4K95O07N47K95oj21k30j65j55n33
$$ 38 366 617 827 813 679 252 -176 -404 -577 -635 -727 -771 -476 131 678 973 967 846 616 451 296 -237
1796b37m39l06j51K23L67K95L99M06K07j29r6p8k81j07m09o17p2L92K81N75K67
$$ -237 -676 -982 -1133 -910 -543 -248 151 557 764 635 539 461 180 73 -336 -953 -1025 -633 -352 223 490
1817D90r9J85N10j12k11k77p52m56R7k18k88M70K69K13P38M8m70N10R4m57J8o79
$$ 490 391 576 1086 974 763 486 -266 -722 -625 -843 -1131 -661 -392 -179 559 607 137 647 741 284 302 -377
1839c77j015M40P58j80L92J52m95R08J108n44n10o4j122K4P38j163m57R11j99
$$ -377 -1392 -952 -194 -374 18 170 -325 583 1691 1147 637 573 -549 -525 213 -950 -1407 -496 -695
1858f95K77J182n79k54J289l47q78M62r50r42J441j6j109R53N4o09J890P23j505
$$ -695 -418 764 185 -69 1220 873 -5 457 -493 -1435 6 -10 -1119 -166 -112 -721 1169 1892 387
1877C87M48j9j529Q52N44k070J38R36r57R46J322j528L56J859j109o09Q16j561
$$ 387 835 816 -713 139 683 -1387 -1249 -313 -1270 -324 998 -530 -174 1685 576 -33 783 -778
1895g78k31J881j349j289J633k25j08K313o59j726J566o0j206J202o17k348J228
$$ -778 -1009 872 -477 -1766 -133 -358 -466 1847 1188 -538 1028 968 -238 964 347 -2001 -773
1912g73P45j536J264P90j405J416J206k081M50J171j719J4R84j939jJ823j100
$$ -773 -28 -1564 -300 490 -915 501 1707 -374 76 1247 -472 -458 526 -1413 -1414 409 -691
1929f91K28K117j107r63J786l36n97R38j812j695K100L28j694Q14L18n09J745
$$ -691 -463 1654 547 -416 1370 1034 437 1375 -437 -2132 -32 296 -1398 -584 -266 -775 970
1946I70J53j760J008J055j668k18M91j314L26J263q45J88J301j066j53K191j85
$$ 970 1123 -637 371 1426 -242 -460 31 -1283 -957 306 -539 -351 950 -116 -269 1922 1737
1963A737j530o6n82l32J282o14j978J249J379r06J20Q58m65O63N09j920j26J511
$$ 1737 207 141 -441 -773 509 -105 -2083 -834 545 -361 -241 617 152 815 1324 -596 -722 789
1981G89j354j178J709O3q04J031m76O6K672o06l077J070J252j306M04m96k234
$$ 789 -565 -1743 -34 29 -775 256 -220 -154 2518 1912 -1165 -95 1157 -149 255 -241 -2475
1998b475J972J713k615O61K372j585n8J445k109K43K121k806j045L315j439j730
$$ -2475 -503 1210 -1405 -744 1628 43 -15 1430 -679 -436 1685 -1121 -2166 1149 -290 -2020
2014b020K667m41m14K981j982k919L809O23l432J152k71k386L263N28m029K523
$$ -2020 647 206 -208 2773 791 -2128 1681 2304 -1128 24 -247 -2633 630 1158 -2871 -348
2030c48K692l289Q75J859l051J481K200m647K35L929l109r45L737k045j45L499
$$ -348 2344 -945 -70 1789 -1262 219 2419 -2228 -1993 1936 -1173 -2118 1619 -426 -571 2928
2046B928l220j533N283j709l877K889q89k153L783j407l640M716Q90m534K831
$$ 2928 -292 -1825 3458 1749 -2128 761 -128 -2281 1502 95 -3545 1171 2061 -2473 358
2061C58J962l433K025M54m529L010K677n416Q64M278k849L3K329l242J917M452
$$ 358 2320 -1113 912 1366 -3163 -153 2524 -2892 -2028 2250 -599 -566 1763 -1479 438 4890
2077D890n508k587N205j117k279K148k724m90N649k643m322N104J236l451J796
$$ 4890 -618 -3205 2000 883 -1396 752 -1972 -2462 3187 544 -3778 1326 2562 -889 907
2092I07r21k618M540l05n639L291L128m005R52K097k403K707J671n751R96M752
$$ 907 -14 -2632 1908 1603 -4036 -745 2383 -1622 -670 1427 -976 1731 3402 -2349 -1353 3399
2108C399l472j689K556k600L65L683l347j078M958j898k918L619p19k403K706
$$ 3399 -73 -1762 794 -1806 -1441 2242 -1105 -2183 2775 877 -2041 1578 859 -1544 1162
2123A162j297k632L878k90m062L297K294k760J148O22k823K650J784m636J57K908
$$ 1162 -135 -2767 1111 821 -3241 56 2350 -410 738 1360 -1463 1187 2971 -1665 -1508 1400
2139A400k624j32K388k261L21L186k801j073L784j327k117K086j262j570K995
$$ 1400 -1224 -1356 1032 -1229 -908 2278 -523 -1596 2188 861 -1256 830 -432 -2002 993
2154I93r34k656L148J009k465J755L16k098K403J094l907K66J872j947P32J416
$$ 993 59 -2597 551 1560 -905 850 1166 -932 1471 2565 -1342 -1076 796 -1151 -419 997
2170I97k756O01L035k095q51K703j158j094J601j852j109L143r51k697K400R62
$$ 997 -1759 -1158 1877 -218 -1069 1634 476 -618 983 -869 -1978 1165 214 -2483 -83 879
2186H79j600J658M2j720K383N41l642O83K077k047Q7J052j988R55K178k333K7
$$ 879 -721 937 979 -741 1642 2183 -1459 -776 1301 -746 -659 393 -1595 -640 1538 -795 -768
2203g68L079j787j850J809n87o94J777j839j658L315J17k426J987R61j531J363
$$ -768 2311 524 -1326 483 -104 -798 979 -860 -2518 797 914 -1512 475 1436 -95 1268
2219A268m31k228K321Q82l590M76K156j666J54J169j613J423K177l250q45L081
$$ 1268 837 -1391 930 1812 -1778 -1302 854 -812 -658 511 -1102 321 2498 -752 -1597 1484
2235A484q53j375R44j677j46K912j360j713K972J41j981J640l5j382J848p33k722
$$ 1484 631 -744 200 -1477 -1623 1289 -71 -1784 1188 1329 -652 988 953 -429 1419 686 -2036
2252b036J912J060k466R19J359j492J045Q48k284J086K035k352p43J570j599k2
$$ -2036 -124 936 -1530 -611 748 -744 301 1149 -1135 -49 1986 -366 -1109 461 -1138 -1160
2268a160J880j458j44K156j359p43K507m20j487J089p76j128J804o57j914J808
$$ -1160 720 -738 -882 1274 -85 -828 1679 1259 -228 861 85 -1043 761 104 -1810 -2
2284bO11j527J031M16j034J304M30k168L61J006j389L27R79j313K36J273q84M11
$$ -2 609 -918 113 529 -505 799 1229 -939 -578 428 -961 -634 345 -968 -732 541 -343 68
2302F8J580j070o36R31p21n42R04p60p39J039k00p98J171L67o02P01j56j199N96
$$ 68 1648 578 -58 873 152 -390 514 -246 -985 54 -146 -944 227 594 -8 693 537 -662 -66
2321f6M46j019L15J56j016M70J027k19K92M96o76N7Q25o72m87K84m95k68L85l41
$$ -66 380 -639 -324 -168 -1184 -714 313 94 386 882 206 263 1088 416 -71 213 -282 -550 -165 -506
2341e06k61J022K86n13K76j57m64O82J32r18k23p4k68P43O53l99l5L70kL48M01
$$ -506 -767 255 541 28 304 147 -317 365 497 -421 -644 -718 -986 -243 410 11 -24 346 344 692 1093
2362A093o45n04K56l54j77N8k24pO87O0l29J70L9J54L46k43r64k77J53K34M90
$$ 1093 448 -56 200 -154 -331 -273 -497 -504 183 243 -86 84 123 277 623 380 -584 -861 -708 -474 16
2383A6k0n39J38P35L86J73j03n58j65K78k51l20j11j24Q1M89l1k59K15K82K52
$$ 16 -4 -543 -405 330 716 889 786 228 63 341 90 -230 -341 -465 -384 105 74 -185 30 312 564
2404E64Jn82o91K6M01J12k7m63k15O15P71L62j29l34k30J28K14k30n31j85M1J33
$$ 564 565 -17 -708 -682 -281 -169 -196 -659 -874 -259 512 874 745 411 181 309 523 293 -238 -423 -382 -249
2426b49K10k00K0M61K90P5l99m98q9L31J00l53m85k45M73O69M38j57j19j53M16
$$ -249 -39 -239 -219 242 532 607 208 -290 -379 -48 52 -301 -786 -1031 -558 111 549 392 273 120 536
2447E36K43j66n00m06o7J12J11q6n6K46L81O9j82k54l4K92P9m48n82l68L32N88
$$ 536 779 613 113 -293 -360 -248 -137 -223 -279 -33 348 417 235 -19 -53 239 318 -130 -712 -1080 -748 -160
2469a60L82j25k69J30M87M46ln27n16l1J39M0k56j57P6M21K17j23q1QJ86J86l19
$$ -160 222 97 -172 -42 445 891 888 361 -155 -186 -47 -7 -263 -420 -344 77 294 171 90 98 284 470 151
2492A51o61m16K82M57J18p6m00P3P02N44J48l42m39j79K54P2l26l11o7J31L52
$$ 151 -510 -926 -644 -187 -69 -145 -545 -472 230 774 922 580 141 -38 216 288 -38 -349 -416 -285 67
2513F7R0j55RL60K14k18m75n02q2N48J29m39k90N6M76Q34J89m04j97L1pJ99p0
$$ 67 157 2 11 371 585 367 -108 -610 -692 -144 -15 -454 -744 -688 -212 622 811 407 210 241 234 433 363
2536C63o91k02J67L9L07K35l99K22O71k32n34m7k19K13K79n92o89M58L69K92N54
$$ 363 -328 -530 -363 -324 -17 218 -181 41 712 480 -54 -101 -320 -107 172 -420 -1109 -651 -282 10 564
2557E64k48m74M28L21k07L57l92r93L05L88k69K07Q1n00P15N43q60j73O31l46
$$ 564 316 -158 270 591 384 741 349 -644 -339 49 -220 -13 68 -432 283 826 -34 -207 424 78
2577G8o0N2j152kJ234l17k73P96m76k06J135p7m69O42q54r31J109J08q73M09K3
$$ 78 18 70 -1082 -1084 150 -167 -440 356 -120 -326 809 732 263 905 51 -880 229 337 -536 -127 -104
2598a04m59J176Nj224Q55N97r00J5k9j249Q96Q64j106m5Q10o22N70J263r48l97
$$ -104 -563 613 618 -606 249 846 -54 -39 -68 -1317 -421 443 -663 -708 102 -520 50 1313 365 -32
2618c2P24r32o0J101q54q28R89k71k68J181n49o75J308m1j178M58k69o85J124
$$ -32 692 -240 -300 801 -53 -881 108 -163 -431 750 201 -474 834 793 -385 73 -196 -881 243
2637B43l5j465O46N97m30J013L88j202L85O34r25L10O06j275j34P36m79L26Q27
$$ 243 208 -1257 -611 -14 -444 569 957 -245 140 774 -151 159 765 -510 -644 92 -387 -61 766
2656G66r69j98J338l66q50L46l69QQ50j081j024J097P26l03K58j45l10P65N6n38
$$ 766 -203 -401 937 571 -279 67 -302 -294 556 -525 -1549 -452 274 -29 229 84 -226 539 595 57
2676E7K97K92j055l44O77K62J8k27n68N95J000m54j010L53O05k44n86o74R6R33
$$ 57 354 646 -409 -753 -76 186 204 -23 -591 4 1004 550 -460 -107 498 254 -332 -1006 -910 23
2696B3L83r62q1R84J63l81K38R4n5q8q39m15J407L07j470K2P87J53M71l54j059
$$ 23 406 -556 -637 347 510 129 367 461 406 318 -521 -936 471 778 -692 -670 117 270 741 387 -672
2717f72J049P63j710m92J156m26L7M02j181M27J811j167n93J742m58j050Q13o16
$$ -672 377 1140 -570 -1062 94 -332 -295 107 -1074 -647 1164 -3 -596 1146 688 -362 451 -165
2735a65m19J783j179j746K025N33j515J219O6j221J583j83k425J578J233k260
$$ -165 -584 1199 20 -1726 299 832 -683 536 602 -619 964 781 -1644 -66 1167 -1093
2751a093L84R00j525J408J163k236P21K102k171l14J982j604n1J583k357l59K959
$$ -1093 -709 191 -1334 74 1237 -999 -278 1824 -347 -661 1321 -283 -334 1249 -1108 -1467 1492
2768A492j439j264K446r64j041K254j439j535K870p79k550K009M1j673K304k9
$$ 1492 53 -1211 1235 271 -770 1484 45 -1490 1380 601 -1949 60 101 -1572 732 703
2784G03k445K406P75k676J795R87k613J197R13k803J424J964k701N12K043k113
$$ 703 -1742 664 1439 -1237 558 1545 -1068 129 1042 -1761 -337 1627 -1074 -562 1481 -632
2800f32L65K028k346p3K361k365q04K289j504o46K463j516j085K650q93j240K317
$$ -632 -267 1761 -585 -658 1703 -662 -1466 823 -681 -1327 1136 -380 -1465 1185 292 -948 1369
2817A369o71j852J830l15j604J969j17k101J795O66j848J392O69j890J140M97
$$ 1369 698 -1154 676 361 -1243 726 609 -1492 303 969 -879 513 1182 -708 432 929
2833I29k187Q03J331j848L17J073j417O07J461j413J15J542j298n00J120q77j04
$$ 929 -1258 -455 876 -972 -655 418 -999 -392 1069 -344 -229 1313 15 -485 635 -242 -346
$$ [...]
8191A6
##END NTUPLES=NMR FID
##END=
