##TITLE=1H_DE-64_oil
 CDCl3
 8 sc, 
 12.9.2024
##JCAMPDX= 6.0         $$ Bruker NMR JCAMP-DX V2.0
##DATA TYPE= NMR FID
##DATA CLASS= NTUPLES
##ORIGIN= UXNMR, Bruker Analytische Messtechnik GmbH
##OWNER= root
$$ XWIN-NMR		Version 3.5
$$ Thu Sep 12 13:59:19 2024 Russian Standard Time (UT+4h)  she@DPX200
##.OBSERVE FREQUENCY= 200.1318
##.OBSERVE NUCLEUS= ^1H
##.DELAY= (6, 6)
##.ACQUISITION MODE= SIMULTANEOUS
##.ACQUISITION SCHEME= undefined
##.AVERAGES= 8
##.DIGITISER RES= 18
##SPECTROMETER/DATA SYSTEM= spect
##.PULSE SEQUENCE= zg30
##.SOLVENT NAME= CDCl3
##.SHIFT REFERENCE= (INTERNAL, CDCl3, 0, 15.7039)
##AUDIT TRAIL= $$ (NUMBER, WHEN, WHO, WHERE, WHAT)
$$ ##TITLE= Audit trail, XWIN-NMR		Version 3.5
$$ ##JCAMPDX= 5.01
$$ ##ORIGIN= Bruker BioSpin GmbH
$$ ##OWNER= she
$$ F:/spectra/data/she/nmr/H-F/1/audita.txt
$$ ##AUDIT TRAIL=  $$ (NUMBER, WHEN, WHO, WHERE, WHAT)
(   1,<2024-09-12 13:58:16.25 +0400>,<she>,<DPX200>,
      <created by zg, POWCHK disabled, PULCHK disabled
       configuration hash MD5:
       00 E9 B6 7A A2 85 ED C7 34 08 36 98 17 FE 4E 26
       data hash MD5: 16K
       82 A1 F3 C5 8C 1A 5B BF D6 AD 32 C9 9F DE A4 B6>)
$$ ##END=
$$ 
$$ hash MD5
$$ 0F EC 47 8C 02 0B BC 5D BD 9A 44 87 B2 F1 CB 56
##$RELAX= 
##$RELAX= 
##$RELAX= 
##$RELAX= 
##$RELAX= 
##$RELAX= 
$$ Bruker specific parameters
$$ --------------------------
##$DU= <F:/spectra>
##$EXPNO= 1
##$NAME= <H-F>
##$PROCNO= 1
##$TYPE= <nmr>
##$USER= <she>
##$AMP= (0..31)
100 100 100 100 100 100 100 100 100 100 100 100 100 100 100 100 100 100 
100 100 100 100 100 100 100 100 100 100 100 100 100 100 
##$AQSEQ= 0
##$AQ_mod= 1
##$AUNM= <au_zg>
##$AUTOPOS= <>
##$BF1= 200.13
##$BF2= 200.13
##$BF3= 200.13
##$BF4= 200.13
##$BF5= 200.13
##$BF6= 200.13
##$BF7= 200.13
##$BF8= 200.13
##$BYTORDA= 1
##$CFDGTYP= 0
##$CFRGTYP= 5
##$CHEMSTR= <none>
##$CNST= (0..31)
1 1 145 1 1 1 1 1 1 1 1 1 1 1 1 1 1 1 1 1 1 1 1 1 1 1 1 1 1 1 1 1 
##$CPDPRG= <>
##$CPDPRG1= <>
##$CPDPRG2= <>
##$CPDPRG3= <>
##$CPDPRG4= <mlev>
##$CPDPRG5= <mlev>
##$CPDPRG6= <mlev>
##$CPDPRG7= <mlev>
##$CPDPRG8= <mlev>
##$CPDPRGB= <>
##$CPDPRGT= <>
##$D= (0..31)
0 1.2 0 0 0 0 0 0 0 0.06 0 0.03 0 0 0 0 0.0002 0 0 0 0 0 0 0 0 0 0 0 0 
0 0 0 
##$DATE= 1726135095
##$DBL= (0..7)
120 120 120 120 120 120 120 120 
##$DBP= (0..7)
150 150 150 150 150 150 150 150 
##$DBP07= 0
##$DBPNAM0= <>
##$DBPNAM1= <>
##$DBPNAM2= <>
##$DBPNAM3= <>
##$DBPNAM4= <>
##$DBPNAM5= <>
##$DBPNAM6= <>
##$DBPNAM7= <>
##$DBPOAL= (0..7)
0.5 0.5 0.5 0.5 0.5 0.5 0.5 0.5 
##$DBPOFFS= (0..7)
0 0 0 0 0 0 0 0 
##$DE= 6
##$DECBNUC= <off>
##$DECIM= 24
##$DECNUC= <off>
##$DECSTAT= 4
##$DIGMOD= 1
##$DIGTYP= 9
##$DL= (0..7)
0 120 120 120 120 120 120 120 
##$DP= (0..7)
150 150 150 150 150 150 150 150 
##$DP07= 0
##$DPNAME0= <>
##$DPNAME1= <>
##$DPNAME2= <>
##$DPNAME3= <>
##$DPNAME4= <>
##$DPNAME5= <>
##$DPNAME6= <>
##$DPNAME7= <>
##$DPOAL= (0..7)
0.5 0.5 0.5 0.5 0.5 0.5 0.5 0.5 
##$DPOFFS= (0..7)
0 0 0 0 0 0 0 0 
##$DQDMODE= 0
##$DR= 18
##$DS= 0
##$DSLIST= <SSSSSSSSSSSSSSS>
$$ [...]
##$SUBNAM2= <"">
##$SUBNAM3= <"">
##$SUBNAM4= <"">
##$SUBNAM5= <"">
##$SUBNAM6= <"">
##$SUBNAM7= <"">
##$SUBNAM8= <"">
##$SUBNAM9= <"">
##$SW= 24.0689170037331
##$SWIBOX= (0..15)
0 0 2 0 0 0 0 0 0 0 0 0 0 0 0 0 
##$SW_h= 4816.95568400771
##$TD= 16384
##$TD0= 1
##$TE= 0
##$TE2= 300
##$TE3= 300
##$TEG= 300
##$TL= (0..7)
0 120 120 120 120 120 120 120 
##$TP= (0..7)
150 150 150 150 150 150 150 150 
##$TP07= 0
##$TPNAME0= <>
##$TPNAME1= <>
##$TPNAME2= <>
##$TPNAME3= <>
##$TPNAME4= <>
##$TPNAME5= <>
##$TPNAME6= <>
##$TPNAME7= <>
##$TPOAL= (0..7)
0.5 0.5 0.5 0.5 0.5 0.5 0.5 0.5 
##$TPOFFS= (0..7)
0 0 0 0 0 0 0 0 
##$TUNHIN= 0
##$TUNHOUT= 0
##$TUNXOUT= 0
##$USERA1= <user>
##$USERA2= <user>
##$USERA3= <user>
##$USERA4= <user>
##$USERA5= <user>
##$V9= 5
##$VALIST= <valist>
##$VCLIST= <CCCCCCCCCCCCCCC>
##$VD= 0
##$VDLIST= <DDDDDDDDDDDDDDD>
##$VPLIST= <PPPPPPPPPPPPPPP>
##$VTLIST= <TTTTTTTTTTTTTTT>
##$WBST= 1024
##$WBSW= 4
##$XGAIN= (0..3)
0 0 0 0 
##$XL= 0
##$YL= 0
##$YMAX_a= 362631
##$YMIN_a= -309292
##$ZGOPTNS= <>
##$ZL1= 120
##$ZL2= 120
##$ZL3= 120
##$ZL4= 120
##$ABSF1= 10
##$ABSF2= 0
##$ABSG= 5
##$ABSL= 3
##$ALPHA= 0
##$AQORDER= 0
##$ASSFAC= 0
##$ASSFACI= 0
##$ASSFACX= 0
##$ASSWID= 0
##$AUNMP= <proc_1d>
##$AZFE= 0.1
##$AZFW= 0.1
##$BCFW= 1
##$BC_mod= 2
##$BYTORDP= 1
##$COROFFS= 0
##$CY= 11.3945322036743
##$DATMOD= 1
##$DC= 2
##$DFILT= <>
##$DTYPP= 0
##$F1P= 15.6554695791079
##$F2P= 12.8336369535428
##$FCOR= 0.5
##$FTSIZE= 0
##$FT_mod= 4
##$GAMMA= 1
##$GB= 0.15
##$INTBC= 1
##$INTSCL= 1
##$ISEN= 128
##$LB= 0.24
##$LEV0= 0
##$LPBIN= 0
##$MAXI= 10000
##$MC2= 0
##$MEAN= 0
##$ME_mod= 0
##$MI= 1.114404
##$NCOEF= 0
##$NC_proc= 0
##$NLEV= 6
##$NOISF1= 3.799351
##$NOISF2= 2.8
##$NSP= 1
##$NTH_PI= 0
##$NZP= 0
##$OFFSET= 15.70392
##$PC= 1
##$PHC0= -26170.95
##$PHC1= 25.18748
##$PH_mod= 1
##$PKNL= yes
##$PPARMOD= 0
##$PSCAL= 0
##$PSIGN= 0
##$REVERSE= no
##$SF= 200.130013532006
##$SI= 16384
##$SIGF1= 3
##$SIGF2= 2
##$SINO= 400
##$SIOLD= 16384
##$SREGLST= <1H.CDCl3>
##$SSB= 0
##$STSI= 0
##$STSR= 0
##$SW_p= 3612.71676300578
##$SYMM= 0
##$S_DEV= 0
##$TDeff= 0
##$TDoff= 0
##$TI= <>
##$TILT= no
##$TM1= 0
##$TM2= 0
##$TOPLEV= 0
##$USERP1= <user>
##$USERP2= <user>
##$USERP3= <user>
##$USERP4= <user>
##$USERP5= <user>
##$WDW= 1
##$XDIM= 8192
##$YMAX_p= 0
##$YMIN_p= 0
$$ End of Bruker specific parameters
$$ ---------------------------------
##NTUPLES= NMR FID
##VAR_NAME=  TIME,          FID/REAL,        FID/IMAG
##SYMBOL=    X,             R,               I
##VAR_TYPE=  INDEPENDENT,   DEPENDENT,       DEPENDENT
##VAR_FORM=  AFFN,          ASDF,            ASDF
##VAR_DIM=   8192,          8192,            8192
##UNITS=     SECONDS,       ARBITRARY UNITS, ARBITRARY UNITS
##FACTOR=    0.0002076,     1,               1
##FIRST=     0,             0,               0
##LAST=      1.7004516,     0,               0
##MIN=       0,             -309292,         0
##MAX=       1.7004516,     362631,          0
$$ Real data points
##PAGE= N=1
##DATA TABLE= (X++(R..R)), XYDATA
$$ [...]
1252B14q96J224L1r71P81r9j125J005K87j191O75P32j230M57R08j182K87R37j265
1271d21j37J182q39m80J194p75m07J489m77j026J119j0r46J056o7j449J006M82
1289D94j108O53M61j159N93J013j126m4Q48q75p3R55r31m53J148m16o01J016k60
1308A35o74J092r5r67P47J25r66O17L24r47N08N32q43K92P28p18l4P37p34j65
1328c06Q09n52m86P47k65l72O84o0o78P11K23o56L57J31o16K57M67p68JO09m89
1349b52J50N06m05k11P09l20m57N40k31m11M88m7n04M72O9k83L41J62m72K48J87
1370B79m45k0L09l52L0K31k59J8M78j44j52K72j55r6J90j74k21J92O5j68L3j2
1392a01M9L31m7k65P9L4m6k4j52J3P9p8J7R4N0m4J25m4k0K12k17k17K54j40k01
$$ y = [214, -682, 542, 573, -398, 383, 284, -841, 164, 451, -740, -65, 667, -563, -106, 802, -380, -93, 844, -421, -558, 624, -215, -695, 499, -276, -683, 806, 329, -697, 422, 412, -534, 522, 455, -994, 12, 494, -614, 39, 500, -659, -66, 947, -179, -223, 625, -250, -323, 632, -299, -752, 396, -20, -621, 395, 135, -539, 553, 458, -509, 238, 363, -603, 14, 338, -609, -101, 431, -412, -120, 608, -110, -144, 593, -141, -306, 503, -49, -535, 212, -53, -425, 259, 199, -479, 232, 455, -201, 156, 287, -329, -72, 395, -373, -372, 237, -252, -102, 404, -1, -212, 497, 177, -280, 260, 29, -382, 106, 59, -445, 27, 96, -187, 154, 316, -156, 92, 279, -166, -186, 123, -229, -199, 32, -227, -209, 269, 125, -27, 245, 90, -6, 184, 10, -211, -19, 46, -122, -89, -101, -52, 279, 232, -33, 46, 80, 34, 10, -142, -129, -50, -128, -111, -17, 33, -11, 114, 70, 50, 262, 45, -172, 82, -58, -259]
1417b59K71j17j50M95j08l74M88Q2n11L09R1n05L39P5o38L82N21o37J12N28n20
1438a26R6N92p19j30P54o06l69P48l31k74P58k98o17J013j08q01P88L1r40O63
1458A24K49j068O31M67r77N60O62r99K27Q21j004l0Q92r29k18J206q55n81J401
1477E79m25o67J117l60q17J236k21j248J016K90j186O57L89j155R48O14j344M24
1495a53J030j060n7Q64j019PJ156j087l96J285n26n85J107m68n90J142m39q77
1513f66J032%j137Q27L49r56O53K89r29P08O17j249K26Q42p70m0M11p06J77R41
1533F19p99m31J081j55m40M31l53k97R11m06r57P39M13n86J84K8l49P24J62r22
1553d03K96N77m73q1O2l49K64M20n28q9N27l1k98K71o2q0K15l12j71L68p9k60
$$ y = [-259, 12, -105, -255, 240, 132, -242, 246, 328, -183, 126, 217, -288, 51, 126, -512, -130, 391, -246, -134, 394, -126, -30, 562, -157, -287, 467, -139, -508, 240, -91, -365, 393, 95, -522, 491, 383, -418, 370, 401, -539, 124, 373, -695, -64, 403, -574, -14, 648, -351, -124, 697, -307, -337, 555, -374, -592, 614, -241, -822, 579, 154, -513, 604, 244, -573, 663, 442, -806, 210, 500, -686, -29, 360, -795, 153, 767, -577, -153, 877, -183, -240, 624, -395, -388, 768, -319, -715, 570, 44, -541, 566, 98, -492, 650, 211, -666, 366, 366, -771, 56, 405, -551, 102, 391, -538, 170, 787, -462, -236, 606, -164, -204, 207, -499, -322, 619, -180, -611, 470, 315, -125, 306, -47, -344, 567, 161, -796, -57, 356, -230, -46, -18, -367, 357, 519, -403, -107, 470, -3, -84, -22, -371, -107, 313, -215, -304, 223, 192, -106, 165, 103, 23, 238, -74, -245, 123, 44, -216]
1575b16Q6J54N8k4M5q2K24q8k40r3K38K8j24j68k5L20Qj12o3J55K04r8k81q6K85
1600A05q3j53j2j7J38K70k77j24L85q6k30J78j52p2J46rk70K31J00k53K59J04
1622A78k35K07J41m23J35J85l47KL25l65n4L59j52mL79l65j70M68j54l25K35q1
1644f1k96L73m5k31L93J20m48K85J81l23J07R0l75R4L28l97K8L69j40p2K24j24
1666H0q6K04j08k89M11k77l26L25P7k53M19n5l19K82J12k41J15J34l33M5J31k17
1688a69Q6K76k57p0L32q9n4J11j76j13J40k9k36K30p6n1J19J29j61J92L7j80J27
1711A18kk18k4K03j29J8J35j68P4J12Qn1Q9l4j28m8l6m3M1kl4Q2Ql3M6J26o1N
1739E4l5r1l8P0R8p9n7K6rJ44P9l1On8r4Q6k2j04ml9L7qP1rJ4K5L3K1m6p5r9P0
$$ y = [-216, -130, 24, 82, 58, 103, 21, 245, 157, -83, -176, 62, 90, -34, -202, -227, 93, 101, -11, -74, 81, 285, 187, -94, -180, 105, 22, -131, -143, -160, -22, 248, -29, -153, 232, 146, -84, 94, -58, -130, 16, 7, -263, -32, 68, -185, 74, 178, -57, 150, 291, -132, 3, 188, -159, -157, 168, -197, -251, 108, -44, -48, 331, -34, -204, 264, 110, -215, 20, -61, -357, 16, -29, -260, 133, 253, -195, 90, 271, -52, 55, 145, -230, -136, 192, -205, -177, 192, 52, -20, 204, 80, -6, 198, 90, -199, 212, -65, -391, -66, 11, -242, 177, 122, -197, 85, 197, -44, 71, 205, -128, -83, 48, -169, -83, 193, -64, -134, 198, 109, 55, 166, -10, -123, 17, -12, -248, -18, -94, -145, -26, 103, -58, 134, 171, -9, 118, 116, -102, -126, 77, -52, -34, 101, -67, 7, 119, 127, 76, 165, 131, 3, -45, -81, -124, -83, -85, -119, -37, -29, -62, -16, 110, 49, 54, 19, -72, -110, -40, 58, -21, -78, -52, -61, 83, 162, 131, 137, 79, -15, 71, 49, -55, -59, -98, -61, -69, 2, -7, 7, 32, 65, 86, 40, -35, -134, -64]
1771f4O9o1J4j20N5J66Q6m3Km7pO0j08L8Lj03l9N9k8K7R9j2n4l7N6j09O9K8p6
1800g7j12mR9J7J30L5Lk9M9K8k8o3n3q9J10k8PL0OJL4l2p7L2P2q3P9j24k35P5
1830b27K00OLJ28k16L8K53o8r0J64k55n2K15m4j47J85K8k00K25J3k23RL33k89
1854a1k4O8l98J48L40k65k1K44l14O6N45j98l19L20k65j78M63j35m38N08J2l82
1876b34M97qn36M96K30n60P9K32o07L16M92o59j0M57m96J54O57n15k42M76l25
1897a06k55P04l21n53P91j63n13O78N4o56O71K34q70L33L66q02L32N75q23Q8N21
1918B85o56J64Q37o87m31P34l66k46Q41m97o73R43j3p55P92J34p66P03J03q92
1938d46N08N02r85L90N65q94j7P41n94J49P89r09m40R50j25m76L73k35m33P87
$$ y = [-64, 5, -56, -42, -162, -107, 59, 145, 102, 104, 57, 50, 110, 2, 40, 43, -60, -99, -40, -68, -41, 58, 46, -8, -45, 11, -98, -29, -1, -77, -189, -193, -94, -77, 53, 88, 91, 62, 111, 139, 111, 48, -5, -94, 16, -12, -5, 25, 31, 32, 66, 34, -43, -11, 61, -22, 57, -67, -302, -227, -27, -21, -18, 110, -106, -68, 185, 117, 27, 191, -64, -116, 99, 55, -92, 93, 121, -79, 146, 159, -64, -55, 278, -11, -35, 33, -365, -217, 123, -142, -163, 81, -233, -167, 378, 180, -139, 181, -84, -262, 201, 66, -372, 136, 148, -234, 263, 255, -281, 215, 445, -115, -36, 196, -411, -95, 397, -262, -272, 185, -311, -157, 500, -15, -257, 219, -106, -361, 343, 22, -531, 260, 97, -416, 262, 316, -340, 331, 565, -305, 28, 394, -408, -76, 499, -324, -236, 285, -371, -207, 630, -57, -488, 246, -120, -366, 475, -22, -695, 248, 235, -520, 272, 406, -360, 343, 446, -446, 62, 564, -421, -31, 534, -360, -377, 364, -230, -81, 708, -201, -641, 309, 184, -292, 81, -154, -587, 200]
1958B00j18o89O38M03p20J86L98m73L02K22o70J73Q01o86n26O12K39r9J89n49
1978a67m28R52K92j001LN18l92O4J05l42L11O65q10m06R66J14n80K38j43j49P07
1999E17m02j003R47Q92r19l35L87k97N51N24j341j51J331p51o14R00k38m36Q66
2018D28n98p66J618nj580Q81O09r87L98K98j242J127J144k004n3J571q04r8J027
2037I64j437j51J778j176j266J998j41j487J185m33r85K126r7k412J303J323j677
2054e85M17O12j573J292J425k636j38K446r60n18J275j669k24K540j447j801K226
2071F82o0j506J404m49j386K309J39k738J342J406k003P30Q72j961J100J581k647
2088a185M2K581j275p13J510j426l53K371j377j658K384j95k047J652K69j404
$$ y = [200, 82, -607, 31, 434, -286, -100, 298, -175, 127, 349, -321, -148, 653, -33, -559, 53, 292, 193, 382, -167, -595, 357, 649, -352, -349, 169, -223, -159, -54, -396, -85, 580, -230, -636, 330, 444, -136, 102, -41, -190, 517, 115, -888, 59, 951, 32, -303, 84, -213, 338, 862, -479, -630, 701, -50, -664, 236, -2, -438, 428, -170, -936, 682, 677, -903, -22, 587, -400, -2, 296, -946, 181, 1325, -679, -732, 839, 35, -63, 964, -473, -624, 1154, -22, -1288, 710, 569, -918, 267, -166, -1151, 975, 878, -1534, -231, 1092, -585, -168, 444, -1129, 163, 1588, -1048, -1186, 1260, 300, -218, 1057, -612, -836, 1704, 257, -1544, 682, 622, -884, 520, 71, -1315, 994, 1133, -1605, -263, 1143, -860, -130, 742, -1219, -119, 1462, -1185, -1143, 1438, 163, -550, 960, -466, -819, 1552, 175, -1483, 901, 706, -1341, 311, 580, -824]
2104h24J685k04k308J917J313k560K23J673j460M21Q09k098N93K717j731j624
2120a458J954k76n06J387j379j099K680l65k452J341J090j145O62j36j740J844
2136D02J336k578j94J894r02l44P07j343K55K351j456j630J772K30r18J110n51
2153A41j240J694K34j961J122J135j492K98P65j382O87J338j871k20J673j019
2169i8p34J355o84o39J484o54j360J776K06j473J017L46j415R25N57j465P80J227
2187A151j572k77J447q77L4J331j386p06J751n84j198J302q6r91J173l40j479
2204a307J620P87j835M22P44j140P22P63j701L50J674j305o80J376m12j96J295
2221A177j289q91J811j45j414R47K75j178R44J14j364J312Q22j879K45J043r57
$$ y = [-824, 861, 657, -1651, 266, 1579, -981, -758, 915, -545, -124, 685, -1413, -820, 1897, 166, -1458, 496, 220, -286, 1101, -278, -1377, 1303, 938, -1514, -173, 917, -228, 434, 298, -1442, 402, 1738, -840, -1034, 860, -42, -386, 321, -1022, -767, 1584, 128, -1502, 270, 500, -418, 692, 141, -1099, 595, 829, -1132, -10, 1125, -367, -69, 696, -686, 1, 1339, -532, -752, 921, -98, -832, 523, -161, -800, 684, 30, -1330, 446, 652, -821, 196, 542, -873, 52, 609, -856, -76, 1151, -421, -698, 749, -128, -94, 1237, -149, -855, 896, 312, -886, 416, 330, -661, 512, 172, -1307, 313, 1100, -735, -313, 431, -709, 13, 776, -925, -575, 1099, -206, -886, 490, 78, -118, 1177, -112, -1003, 808, 663, -751, 196, 471, -707, 237, 351, -1013, 299, 1121, -758, -513, 530, -427]
2238d27K49P49j330K04J436j211o68J577k76n86R33o58o91J479j64j368J058L80
2256F86j359N62N61p96P48L34j696M93J336r45l49O77p26N8R29r35m07J366l14
2275B23p97P98q6o25R48k9r01Q05K00j122L96Q37n94J26K18r50L62R94q04l92
2295c93O69m33k73N75k61l44P24j62o93N55J91n50N58J83n65J90J95o79N37O46
2315F70o78j80L17k82J88O30n82m40N28j37l21M19q0l94M17ql79K86J85m13L14
2336F0K00n17j7L15j76K83L00m55l22M04J00M8L25l62l92K71J18k02P0nl55K37
2358g2J82l96J73J54j32N8J66m40q8L38J67m5N6k81k18M76K15r9M4j46l05L45
2380A52J76k11J7n6k07J08K27k62j1J77r9O0m6k84j25M08J38j84j35k94M2M31
$$ y = [-427, -178, 571, -759, -555, 881, -330, -998, 579, 303, -283, 650, -8, -699, 780, 616, -752, 306, 686, -673, -111, 450, -346, 402, 736, -960, -467, 869, -76, -425, 252, -474, -416, 513, -422, -829, 537, 223, -574, 224, 138, -487, 461, 432, -469, 336, 536, -586, -190, 647, 53, 179, 397, -553, -191, 803, -1, -393, 276, -157, -430, 145, -116, -460, 264, 102, -591, -36, 155, -395, 163, 346, -219, -29, 166, -513, 24, 670, -8, -188, 129, -153, 35, 665, 83, -357, 171, 34, -287, 132, 52, -342, 75, 67, -312, -26, 159, -254, 60, 260, -257, -274, 41, -135, 148, 448, -7, -329, 75, 175, 223, 548, 186, -206, 65, 183, -19, 51, 46, -309, -72, 110, -286, -113, 41, -91, -33, 133, -307, -395, -57, 110, 65, 121, -160, -378, 98, 313, 214, 258, 112, -193, 152, 328, 117, 134, 78, -129, -21, 206, -56, -67, 110, 11, 71, 25, -259, -384, 24, 162, -22, -157, -451, -409, 22]
2402B2L33j49k64n4m1L50K57k73j37m8j03K58Q9k13p3J60nj1j01j87Q0K20k4j89
2426a03k16l3J37L34J06j98l25Q3J73L23P2k74k42P5J55J78p0j13l9J18M7n9j02
2449B7o6Q1J02m6k65k17N2K07L48j44l15j05J68K62K99k19l34j06K53J33R3l2
2471A76j95m9J91K9L2j52m5J42J10k10k74J2J44J57P8k49l02M2K73L22l0k95k61
2494c54M4L19J47m2j36j02K8L26O0j20q0L7J06Kj55k26O5K12J13j19k92j71J73
2517a65L51J19k34l36j89J87L63N6k52j61k5K21K50J8k20J6K14q4j21J15k13N8
2539c2K63n8k35J9j79O2N24k7n17j54N0J05M98n8p33l3M30nP3K74m07L5M43m14
2563g6nM79l52j98N10k27l85L97j87j78Q55k45q91K40L96j90M26k50r94M70O93
$$ y = [22, 355, 206, -58, -112, -153, 197, 454, 181, 44, -4, -107, 151, 240, 27, -46, 114, 109, 98, -3, -190, -110, 110, 86, -103, -319, -352, -215, 119, 225, 27, -298, -215, -42, 281, 353, 79, -163, -88, 67, 245, 175, 62, 23, 141, 188, 129, 27, -39, 42, 144, 98, -167, -384, -332, -125, 223, 79, -236, -341, -173, 89, 388, 169, -165, -271, -18, 115, 208, 176, -19, -68, 123, 152, 184, 32, -13, 129, 239, 29, -245, -233, -89, 68, 146, -103, -405, -363, -90, 232, 202, -93, -354, -310, 9, 156, 114, -22, -124, -96, 230, 290, 170, 90, 127, 233, 235, 80, -146, -81, 131, 244, 125, -167, -338, -165, 186, 305, 71, -265, -454, -267, 96, 152, -100, -261, -286, -65, 185, 203, -17, -1, 213, 129, 8, 123, -90, -32, 231, 173, -62, -43, -222, -160, 364, 337, -180, -334, -284, -179, 319, 261, -472, -505, -75, -80, -7, 267, -140, -105, 338, -76, -81, 398, 46, -152, 358, 131, -254, 143, -44, -222, 633, 388, -503, -263, 133, -57, 369, 119, -875, -405, 288]
2584B88n53O1N12o70K12O02p11J40P37p20k85R50m71n11P82l08j41R48o47j039
2604h24J061L82p92M55k06j001R69M57j078N20N63j253L60R33r13K81P30j202
2622e58J60J182r06m87J060l29k75R86r20q08J563P3j030N48k88p38J183K32j299
2641f51O03M14j149O36O91j114M36P29j095J42R14q74q9R41o89j20R00p29m25
2660e29J155j38n97N60o62m35J311j2j101K93N4j61O60j05q45M48M52p54J36M26
2680A56l67J44J23m90L81L97n22p7N35J95k04l74k41N15M95m15n46P6L30J69j69
2701A11l66L09J48m33q2J89J69K81m99o18P66M86p93l5M14O2M44m49j114R47J252
2722A189r89n75M14k56M92N40j379J75J534j012r19J000l4k24O72j187o73K034
$$ y = [288, -265, -204, 308, -362, -150, 452, -259, -119, 618, -102, -387, 563, 92, -419, 363, 55, -86, 862, 215, -824, 237, 619, -173, 282, 76, -925, 44, 501, -577, -57, 506, -747, -387, 546, -367, -86, 644, -558, -398, 784, -122, -609, 451, 122, -153, 833, -87, -895, 668, 741, -289, 259, -29, -767, 416, 648, -651, -48, 366, -783, -147, 544, -570, -134, 595, -500, -358, 556, -318, -407, 534, -155, -275, 625, -104, -529, 626, 488, -109, 451, -211, -646, 665, 653, -448, -155, -101, -262, 398, 293, -552, -104, 348, -406, -270, 156, -211, -67, 56, -434, -53, 344, -178, -255, 280, 475, 271, -103, -344, 171, 666, 251, -295, -219, 111, 280, 111, -255, 54, 202, -231, -313, -124, 45, 326, -173, -791, -25, 461, -332, -367, 47, 109, 553, 104, -1010, -63, 1189, 200, -375, 39, -217, 275, 815, -564, -389, 1145, 133, -786, 214, 180, -44, 628, -559, -1232, 802]
2740H02j92j734J021N00p78R02l40j459J704R64k186L02J167j157O25Q10j835
2757h84O37J708j981m15K028j027o14J420j412n31K243j027j552K157l75j569
2773a194J722k63j498K062P4k452J649R66k097J095J004k004J001J221k331O10
2789d35K145k032m49J828j549j56K002j816q25K590j140j591K017l82j201J942
2805I48o71k066K190N89k129J342N28j857J419P67k263J157J588k053J73J256
2821I18j638M15J738j837n46J941j173p10J788r10q50J658o73j446J781j28j263
2838i35J392j32j464J287N17j348R68N02j454O90Q53j310L42R46j121L1Q76j067
2856d27M1J261q26n79Q52n83j60R78n54o71Q52j33n52O19r3l25P43j77o79L98
$$ y = [802, 610, -1124, -103, 397, -381, 521, 181, -1278, 426, 1390, -796, -494, 673, -484, 141, 951, -884, -247, 1461, -520, -935, 1093, 66, -548, 872, -540, -1071, 1172, 145, -1407, 750, 375, -1194, 528, 265, -1233, 829, 903, -1549, 100, 1066, -1031, 64, 1068, -936, 65, 1286, -1045, -435, 1710, -322, -771, 1057, -492, -648, 1354, -462, -1287, 1303, 163, -1428, 589, 207, -994, 948, 277, -1789, 401, 990, -1139, 203, 731, -1126, 293, 1060, -1203, -46, 1542, -511, -338, 918, -720, -305, 1433, -404, -950, 991, -182, -892, 896, -14, -864, 794, 121, -1325, 456, 328, -935, 457, 325, -1139, 148, 665, -683, 285, 787, -667, 23, 876, -434, -92, 854, -267, -236, 640, -427, -386, 875, 49, -530, 322, -261, -421, 557, 3, -668, 184, 51, -501, 118, 25, -300, 443, 266, -413, -15]
2876a5K79k29K39n1m97K62J76j13J28J27l85J16n6j85L26K2k79J9m3n4J93n5j50
2899b25K91j19j05L01r1l42M94J6l81K87j53k99O53K25p22K23O5m12O13K50r22
2920c53J97M02n76K79M47q62Q5P79p32pO92n83j49R24n99m87R44m24m40R68j60
2941C45q36P40n7o54J042Q4j244N83L59p87N95L84j157L30P62r41J83Q54j022
2960d37M1J009p91l23R00o25k24J189o30p92R24j26m68J075l80j027Q74K58p25
2979b78N97Q1j003N05O05r24L73N49q94J53P30q00rO30o48L7Q73p17m80Q46k11
3000A5j50O68m23o61P87Q9m38M52k29o04N89L38o29K55J58n72L18L77o19K7L73
3021A21l05R7K89n25j00N56p4o3K66m30j35N59O3l53K43k98k01N11J06l32J03
$$ y = [-15, 264, 35, 274, 223, -274, -12, 164, 51, 179, 306, -79, 37, -19, -204, 122, 144, -135, -116, -159, -213, -20, -75, -225, 66, -53, -158, 143, 52, -290, 204, 220, -161, 126, -27, -326, 327, 552, -170, 53, 118, -294, 319, 569, -353, -156, 246, -330, -51, 396, -466, -381, 398, -334, -341, 351, -232, -381, 543, -56, -543, 401, -23, -463, 505, 345, -491, 249, 192, -462, 580, 664, -580, 3, 362, -425, 170, 554, -603, -273, 489, -452, -269, 585, -437, -396, 613, -178, -501, 399, -226, -450, 739, 109, -683, 241, 115, -353, 722, 342, -685, 189, 447, -278, 319, 400, -603, -98, 507, -417, -44, 505, -389, -236, 494, -306, -315, 315, -333, -296, 577, -140, -620, 226, 15, -135, 533, 110, -551, 236, 325, -113, 339, 110, -494, 95, 433, -196, 59, 217, -355, -37, 340, -279, -252, 121, -184, -87, 202, -323, -423, 133, 59, -4, 262, -168, -303, 256, 319, -34, 209, -89, -290, 221, 327, -5, 98]
3042I8o4j46K25J65l99jJ55q5P9J8m27J22L52m3lp2k99J67L21Q6j88j36n0M7K86
3067B08J13k72l3j00J58J95r4k17QN2J8J6k05o7J40J74J9j91j87Q1J64K16o9k59
3091a32j23P2K11J85r1j28j01N0K44R8j88j05KL9J76j31j78N0L6J30k8j96j13
3114b21J21J77N4q5k51l4J63K94n7j77j10p7K20J68l2n7j01L6Q2O5j43p3jR3J8
3139G2m5n0j03J30J02l8j95j19m1L37J47k48j45rM9K10K04j63j43P6j2J83Rk50
3163d2MJ29L1o3L4j84O3K12lk04m5j25O5L25j4l59o7J7J30K51Q3l43k8J14J0Q9
3189H0Q2k50KK77j38j3J01k85J26L21j77j78L5n7k0L65j98m19K26K0NL13j14m37
3213c33K18K11j71J88k0l65K21K59k47N2J85l12Q7L75l45j29K60j76L2L32l37
$$ y = [98, 34, -112, 113, 278, -121, -122, 33, -52, 27, 45, -382, -260, 92, 49, 46, -26, -325, -158, 163, 249, 61, -75, -125, -78, 208, 321, 49, 16, -84, 74, 269, 175, -42, -34, 18, 36, 52, -153, -220, -80, 94, 113, -78, -265, -184, -20, 196, 127, -132, -255, -183, 28, 213, 122, -6, -107, -57, 187, 285, 97, -8, -6, 33, 209, 78, -100, -50, -14, 116, 88, -108, -221, -100, 77, 131, 46, -205, -239, -76, 218, 161, -16, -126, -203, 17, 185, 153, 96, -5, 31, 113, 178, 35, -38, -39, 54, 72, 27, -23, -126, 4, 106, 68, -127, -246, -287, 50, 197, -51, -196, -205, -156, 54, 258, 95, -48, 28, 16, 199, 208, -42, -38, 91, 122, 59, 93, -91, -28, 184, 181, -23, -68, -193, -128, 197, 183, -176, -243, -226, -96, 155, 238, -105, -133, -19, -9, 80, 162, -88, -86, 191, 53, 40, 141, -144, -18, 303, 126, -52, -17, -74, -94, 271, 73, -346, -120, -100, -95, 218, 104, -333, -115, 96, -75, 113, 93, -272, -51, 208, -39, 13, 198, -114, -27, 348, 3, -126, 134, -42, -10, 322, -15]
3234a5k97K81qm4K60k25m10L79K63k88K56j50l51L38J99l25J48J12k56J10K64
3255B41l56J02K52k48L8K76k81l20M52j57l4K53l05k86M78P4l01J69n6j92K17
3276A6L4k15J72J04l10K18P5j58O7R5j05J24Q6l35k2K54Q0j50q0j80R7K78oj76
3300c7pq7N2Q6p8Q8l8q7R5JO0J7j23m5L27j03k84J36J80j40J72j65l10L32K05
3325B47l03J27J23m16J76K16l92J01L95n56PM30k20j15M59m00j77O79k73m99N59
3346A68o1l26N68k17p25Q20J85p42N61P5q53O11N01p96K11L81q48L53P29r52j4
3367c71Q44o24j23P14o72k41J121o17o93J018j89o97J004k54q88J129j2j132Q32
3386A49M19r88O38K10j247P22Q69j235K11P75r76J89J010j084k09J265q01m17
$$ y = [-15, -312, -31, -39, -83, 177, -48, -458, -79, 184, -104, 152, 2, -349, -11, 188, -137, 11, 123, -133, -23, 241, -115, -13, 239, -9, 29, 305, 24, -296, 156, -1, -35, 218, -87, -373, 105, 179, -122, 47, -9, -201, 16, 50, -165, 7, 111, -199, 19, 94, -64, 3, 98, -7, 117, 203, -132, -154, 100, 180, 30, -50, -230, -133, 145, 139, -37, -44, -131, -79, 7, -71, 17, -21, -108, -13, -12, 48, 65, -58, -103, 224, 121, -163, -27, 153, 13, 185, 20, -290, 42, 247, -56, 71, 194, -222, -46, 170, -222, -121, 274, -282, -275, 155, -65, -180, 279, -121, -298, 381, 108, -391, 168, 107, -219, 349, 132, -593, 227, 412, -330, 231, 306, -547, 64, 565, -231, -20, 361, -487, -134, 595, -357, -371, 473, -151, -274, 440, -232, -473, 648, 31, -662, 356, 167, -530, 474, 220, -668, 461, 449, -683, 149, 568, -420, 218, 428, -819, -97, 772, -463, -252, 523, -453, -264, 746, -338, -547, 718, -83, -500]
3404e00J107p57m33J225m59r50J226k65q12J180j06j192R94K92j205P76L61j136
3422f54O99O24j269L40Q66r41J53P59j056N6J264r36n06J055m74l41Q92n22o14
3441f05J208j94r43P75m8o82R54j40j009Q03L28q92M67M10q16L61N14r46K30P04
3461D79p15KO90p33j25Q59n27j74O59n05j96O86k83m99N92o9l19L69j83m01N98
3482B05J12n19J44Q5j55K74j5m67K50K72l37JJ86j83J48J38k68K6K85j51k4Q3
3504I0k29J69J01k28Q2J55j41J19k6k06J76L8j57R0Q3m16K50K35k26K4J3k94L29
3527C1K64m38o9M35k76L5J85l84L5M68l71k39N19k51j07M57k40l42N91l28m11
3548d36O45k1n52M35jl65M12J69o79M13K76o28K65L97o34K17M08n48R1N65o19
$$ y = [-500, 607, -150, -583, 642, 183, -767, 459, 194, -618, 562, 456, -736, 258, 550, -655, 121, 482, -654, 45, 669, -600, -260, 606, -335, -182, 577, -479, -423, 841, -95, -601, 454, -20, -361, 531, 9, -605, 603, 409, -534, 241, 193, -489, 465, 325, -684, 119, 447, -445, 22, 432, -384, -23, 491, -455, -225, 479, -236, -234, 456, -277, -402, 457, -70, -244, 415, -90, -286, 400, 117, -382, 210, 141, -178, 191, 8, -393, 205, 317, -202, -58, 27, -128, 146, 131, -336, -86, 186, -151, -150, 36, -147, 1, 139, -129, -103, 182, 31, 7, 90, -139, 30, 131, -97, -15, 140, -1, 118, 92, -114, 62, 100, -57, 33, 116, -300, -50, 185, -41, -17, -4, -298, 31, 295, -143, -212, 223, -53, -18, 167, -217, -182, 286, -85, -324, 195, -56, -163, 294, 54, -288, 303, -25, -436, 209, 188, -364, 71, 70, -295, 117, 286, -393, 20, 296, -332, -67, 330, -304, -87, 321, -227, -136, 429, -190]
3569a90j23P52l29l17N33m62k17Q62m05n86O55m5m65N72j39n32O24P7p47M85K79
3590B82o63L77K69o16L04L55o58K19O10o71kM64m07j0N82n47k57O47k70l04O05
3611C09j73n45O53j16m77N73k1o48N10K11n68K87J26l51K91L08o37J72L79m19
3631a36J24L15m88LM22k99p8L97k96k23M56k49r8L06k17k69M49K1l68K04J01k00
3653a23K14K6k88K23O1j84J71j1k60P9J88j31m4K05k45O6K20n7j23P4k07R7J60
3676A11j13j19R8J1q5J78p0j25R0L2jJ46j69q0L8R9l1K8p3p6K02Q8j43PJ1j04
3702e0R2m9j4r7R1J6R2m7q6N8j4j7O1n5p4R8K9jJ1M0j42L8J34q2L9j4q0l5J40
3731H2l3o5j5n2M8N8o1n7J01N6q2J36j60k7M3J25q7k5K1q3R3M1kl3k4l2J3J61
$$ y = [-190, -313, 439, 110, -207, 326, -136, -353, 509, 104, -482, 173, 128, -337, 235, 96, -436, 188, 265, -482, 3, 282, -381, -4, 265, -351, -47, 308, -350, -131, 479, -192, -194, 270, -137, -147, 435, -112, -369, 278, 8, -296, 309, 136, -409, 244, 128, -349, 224, 203, -445, 65, 276, -292, -5, 121, -230, 61, 369, -268, -96, 283, -136, -12, 303, -185, -182, 240, -59, -137, 260, -36, -259, 197, -52, -150, 156, -61, -330, 119, 140, -228, -24, 77, -123, 91, 117, -171, 52, 113, -71, 100, 89, -171, -92, 96, -35, -79, 126, -119, -53, 167, 110, -13, 61, -146, -49, 111, -2, -121, -23, -12, -97, 81, 11, -114, -24, 8, 7, 153, -16, -96, -58, 41, 10, 38, -35, -111, 91, 179, 36, 43, 54, -50, 42, -7, -21, -118, -27, -11, 81, 34, -52, 6, -8, -25, 36, -19, -93, 5, 34, 33, 44, 84, -58, -20, 114, 32, 71, 57, -23, -58, 82, 49, -16, -31, -83, -35, 23, -38, -95, 6, 62, -20, 116, -44, -71, -28, 97, 10, -15, 6, -77, 16, 57, 55, 22, -2, -34, -21, 140]
3759A40j14l5Pp1J46M2j04m9J3m3O7L7q5j4M9k8M0l8l3mQ7P0o4j7Jn5J21M3j04
3788El3L6o0R4N0j19m1P3l3Q1o2J6J1j6O2p6K6J7n5J01Pj59O7k9N9nO5q3k7k7
3818e5N2m0K0M0LLj9j9M2r3Q0K0r1mQkP1j1O5j28Q3k5l0J9Pl3k7J18j3n1N3j05
3850f2L7O1M1m1k4k6K2L0l8j1n1J2K0Q5K2j39J6L4qP8p7n0M4L3l0L6qm1P6k0K3
3881D4j2l5RmP0m7k2j1q9P1R3j29O0qQ8o8Mk4K6n0R2j6q2J7N1m8P4m4k7NP3l2
3913B9n1m5O7j1LJ6l7j8J6R5k1L8r2pM5J8p6P2j29Q9j7qON3n3J7J08j74P3M1m2
3944El3N8k9j01R3j2o2J35o0j3L1M2q3J25Nk27J34P7j61P6pq2R2J16j95n1K61
3971A34j68M8J06j90l5J92m3j51J95r5l6J55o4j91J73R3l05K58l0j71J47P1k34
$$ y = [140, 26, -9, -2, -73, 73, 115, 11, -38, -25, -68, -1, 36, -49, -63, -14, -42, -2, -40, -73, -77, 10, 80, 16, -1, 0, -55, 66, 109, 5, -28, 8, -52, 42, 92, -27, -68, 5, -28, 53, -9, 7, 18, 2, 64, -12, 14, 31, -24, 77, 84, -75, -8, -37, 22, 17, 82, -1, -28, -55, -3, -43, -23, 17, 20, 23, 4, -15, 27, -66, 14, 34, -57, -61, -53, -55, 16, 5, 70, -58, 25, 0, -30, -11, -4, -37, -64, 54, 41, -10, 43, -62, -25, 36, 77, 36, 12, -14, 8, 38, 0, -11, -62, -50, -30, 55, 77, -62, -46, -12, -20, 58, -19, -69, -25, 8, -22, 14, 6, -35, 41, 21, 44, 32, -3, 6, 2, 72, 25, 3, -8, -97, -26, 67, -62, -2, -10, 78, 10, 14, -10, 16, -34, 58, 42, -40, -23, 28, -20, 54, 10, -17, -12, 61, 29, -22, -67, 0, -11, -8, 8, -29, -47, -31, 64, 43, 81, -11, -18, 27, 45, -31, 41, -88, 1, -16, -24, -18, 35, -18, -1, 107, -67, 6, 47, 5, -28, 30, 1, -100, -7, -19, -81, 54, -6, -19, 12, 54, -29, 96, 101, -126, 8, 85, -76, 0, -7, -89, 3, 119, -76, -127, 134, -34, 14, 120, -70, -105, 87, 44, -107, 88, -7, -43, 112, 48, -143, 30, 123, -182, 76, 46, -125, 22, 93, -141]
3994a41J69J37k69J44J35k52K0K58k77pK48k95M9K03j47j17K69j07j14K48j30
4015B4j95L02m4k20K00Jj88J62O6k70K70O9l04O4J10j66R0J78k53N8J42k03L8
4038f9K59k25m4K26k28J7J68j14j32K12o8j54K38o3j05J80qk83K43P1k28Q6O5
4061D4j06J1J91k64L7K79k09m9J59j39N1K01k73o6K67j02j66J58p1NJ01p1r7J47
4085C8N4j43L7L4oPkp6J21j9r2O0K6o0M7o2%R0o0Nl0Q1n7j5KM1N9p9o6Q8K8no8
4118b2jl3J32m4o2L7M1m4N6n1p8J02L2j54O3L9n4J05K1j47O7N3n3m5J46j53o9
4145a16K23j89L7J12j51OK29j07k07K11L4k33K18q1j42J62R6k38J18J65k07OJ60
4168A06j42L3J66k67J0K13j69qJ57j21m7J63r9j10K78p5k12J91k6j40J64K0k31
$$ y = [-141, 28, 165, -104, 40, 175, -77, -57, 201, -76, -83, 165, -130, -81, 122, -25, -142, 127, 20, -94, 154, 24, -171, 131, 87, -133, 67, 68, -120, 42, 108, -162, 108, 177, -127, -63, 47, -119, -29, 149, -104, -46, 96, -107, -69, 190, -35, -79, 147, -81, -64, 104, -10, -142, 70, 2, -152, 86, 23, -82, 98, 90, -193, 50, 121, -107, -21, 44, -62, -51, 140, -124, -87, 192, -17, -66, 93, -46, 5, 206, -67, -133, 134, 32, -134, 24, -47, -42, 59, -12, -109, 38, 92, -51, -14, 20, 14, 21, 19, -57, 64, 45, -47, 13, 39, -21, 26, -36, -36, 54, -6, -1, -31, 50, -7, -22, -20, 21, 80, 1, -65, 23, 51, 46, -22, -23, -56, 76, 32, -30, 7, 48, 4, 60, 9, -69, 33, 65, -89, -26, 13, -41, 64, 85, -62, 5, 58, 5, -40, 106, -47, -116, 107, -82, -45, 67, -84, -78, 151, 44, -163, 48, 82, -151, 67, -14, -156, 6, 102, -136, -18, 147, -60, -54, 106, -36, -3, 163, -104, -94, 119, -50, -58, 99, -22, -69, 94, -5, -115, 163, 88, -124, 67, 41, -99, 65, 85, -146]
4191a46K75J8k73L8J99j23j9J01j57J45J01k13jK15k19j5J50j01J0J48j37j91
4213a95K98j9j80J12rj39K62n1k11J71J05k22O8J05k21J52Q4k76J26J83j84o9
4235a10K34k02L1J29j15r0K43j29p4J32p5l1R7p8j34J97mj05J16l5r3J31N1j59
4259g3J67j0j25K5K0Mo2R2n8J0M3j13lJ00o2K7J9o2PJ25k5q8M0K0k8J9m2K0P3
4288F0n1o6P6j08P8JNKJJ7nLp3N5L8n4J1K5oM1k4l0N0l3j4o2J11ol2qJ1n5k0Q3
4322B1k2J01q9j6M2L1p1L3m5nK1L6n4k9J14j26L7O5o7L0L2j15QQ9m6K0P7n2j27
4351a07J16j0lM0o6j6N5j7k9qR3r4L4N1n6M9O6j71P0J0o3N0J4l4j2Q2o9J1M6n
4381B7o8J06r9L0L9J3q0O4k6MjL9o4L1K6j34J01kl0O9j3J1J2j03O5n6N8k1n4N8
$$ y = [-146, 129, 147, -126, -88, 111, -12, -31, 70, -87, 58, 159, -54, -55, 160, -59, -74, 76, -25, -15, 133, -4, -195, 103, 84, -96, 16, 7, -132, 130, 79, -132, 39, 144, -78, -10, 95, -126, 26, 110, -166, -40, 143, -41, -110, 124, -78, -47, 82, -33, -123, 120, -9, -83, 49, -26, -57, 40, -38, -172, 25, 21, -84, 32, -3, -96, 35, 86, -73, 94, 84, -41, -16, 4, 8, -54, 38, -20, -10, 33, -80, -83, 17, -45, -18, 1, -61, -54, 71, 46, -42, -2, 18, -10, 9, -33, -13, 60, 9, -57, 19, -89, -11, -10, -5, -3, -2, 15, 10, 13, -60, -5, 33, -21, -10, 15, 9, 50, 26, -4, 46, 13, -1, -63, 48, 42, 10, 2, 13, -42, -62, 21, -1, 100, 11, -5, 37, 68, -3, 30, -15, -20, 1, 37, -17, -46, 68, -58, -21, 44, -23, 7, 39, -76, -68, 21, -25, -5, 72, 20, -107, 9, -1, -4, 36, -30, -46, 9, -8, -37, -45, 48, -46, -12, 39, -17, 32, 98, -73, -3, 7, -56, -6, 8, -26, -38, 44, -25, -14, 32, 27, -41, 65, -34, -4, 35, 48, -32, 32, 6, 10, 9, 48, -16, 15, 41, -93, 8, 6, -24, 45, 32, 43, 55, -48, 17, -39, 19, -2, -56, 2]
4411BN3p5m7M7k3O7j1J5Qn2j2N1M2l8q0K3L6k5k5L3j1m1R4l2k7P9n4Pm4O1j8L1
4443C4n3L0m4j6O9k8K4m3M1l2P5q0k1O3j24J4J14k9j3l6RMR3m0j4M0m8l2K7j0
4473b6M0K1q7mJ83j67J8Q5j3m2m0K8j0K4j7m7J6J9K5J8m0L4Nl7L5k1m4L1K8qp
4504@l1O5n4rlL8l7NM2M2m6oJ8o1P1n2JO1m6l1J3O6op6R3q2L9QJ5l2j8LP7m7K8
4539D8r5P1qo2J7nl4m2Q9K6j7N6J8o6K2k5Ll7M5L3Nk0J8r2%LM3k0L9j9J4J5q6
4572f3J17l2r7R2L1K1m0l5O6J0rr4N1m8J5m6P1j0RM7o5N8K1p0L4J4n3p6N7L0j0
4603dO5m2o3J16j7j11QN4l9j8R9o2O4p3k0L3J8n4NQ8o5l7R5n2m5M3k3l0Q2m2J
4634b6M5j1jO2Kj33J02l8m9L8N8j31R2K7r3K1P1p0O6N3j22JQ7j36J19k3n4LP4
$$ y = [2, 55, -20, -67, -20, -43, 24, 13, 28, 36, -16, -28, 23, 65, 27, -53, -30, 6, -19, -44, -11, -22, -63, 31, -1, -28, 51, -3, 4, -40, 21, 3, 34, -19, 11, -33, -49, 20, -8, 16, -27, 14, -18, 57, -23, -44, 19, -105, -91, 23, -6, -19, -55, -46, -42, 51, 11, -3, 37, -11, -43, -16, -26, 14, 35, -52, -56, 127, -40, -22, 63, 50, 8, -32, -4, -14, 10, -7, -54, -38, -19, 6, 24, -16, 18, 23, -14, 21, 0, -44, -13, 15, 7, 0, -31, 34, -20, -29, -32, 6, -31, -26, 16, 58, 12, 6, 24, -37, 34, -18, -17, 44, -2, -33, -20, 46, 40, -36, 57, -25, 14, 22, 37, 5, -13, -10, 67, 20, 48, -47, 24, 16, -46, -29, -34, -68, -110, -21, 5, -12, 44, 62, -4, 18, -7, -4, -41, 4, 37, 42, 22, 40, -52, -52, -49, -6, -26, 13, -6, 8, 23, -63, 54, 22, -75, 17, 48, 69, 29, -6, 60, 70, 61, -33, 18, -30, -15, -61, 10, 0, 9, 56, -9, 49, 70, 0, 34, 48, -5, -81, -24, 6, -4, 61, 19, -44, 72, 55, -56, -48, 6, -33, -51, 48, -14, 50, -23, -43, -10, 8, -46, -41, 47, -18, -55, 40, -12, -57, -14, -37, -67, 15, -27, -26, 19, 8, 7, 69, 71, -62, 40, 2, -47, -9, 49, -82, 10, 37, -56, -35, 36, -34, 32, 85, -37, -36, 51, -85, 34, 11, -43, -40, 34]
4663C4j1m3lmN9j5j2j9Q2m0j02J58J3j56R4N5j16K1k2j5M3K1m1l8Q0o9L1N3q4
4692d6P6Kj3k0L2m9j4N1p8K5N1K0m1K7j4k7M6m6p1J33m8J8KNp7M3J8o8J12l0j04
4723h5pJ63j06R4l5q3M1K2o2J07k6o3R1o6k4P2Mp0N6M9j08N8mo7O7K9k6l4Q4q0
4753iNL6j07N8J24j47k1O1j8L2J00j05n7J52j28k8P4j9k5Q5q3m2J01Nj94J68K9
4780D7j18J53q0p0Q9Q6k67J59R5j01lP9r9rJ51j70l6K56j63q9J48n9o8J91j80
4805e8o7K26o4j69J81k4j04J59J1k50K21l6j31J09N3j72J03J75k49L6K00k33L4
4828d9K04k49L6K05k04qK41j98oQ1m4j20K11j18m8R4m5j19K48l1k48J54R3j89
4852a09J85K9k37J79M4k09J26P9j77P7J48k27K0K33j30r4J47j48m3K08j44k1J36
$$ y = [34, 23, -20, -23, -27, 32, 17, 5, -14, 68, 28, -74, 84, 97, -59, 35, 90, -26, -5, -27, -42, 1, 22, -19, -57, 23, -46, -15, 38, -46, 30, 32, 19, -1, 31, -18, -32, 19, -59, -34, 17, 37, -4, 23, 9, -18, 28, -18, -89, 44, -4, 14, 16, 21, -56, -13, 5, -63, 49, 19, -85, -92, 71, -35, 59, 24, -59, -18, 4, -58, 49, 23, -40, 51, -15, -39, 33, 37, -33, 23, 72, -36, 22, 18, -49, 18, 47, 21, -13, 71, -9, -4, 32, -75, -17, 107, -40, -61, 0, -18, 14, 114, 9, -48, 104, -24, -52, 22, 3, -22, 63, -20, -62, 39, 44, -150, 18, 47, -71, 82, 2, -68, 21, 107, -160, -1, 94, -7, -10, 69, -30, -39, 112, -58, -94, 162, -1, -90, 58, -1, -69, 122, -58, -125, 101, 37, -132, 49, 25, -79, 80, 91, -159, 62, 26, -105, 4, 57, -115, -12, 163, -86, -50, 150, -83, -49, 155, -94, -58, 147, -57, -65, 176, -22, -28, 53, 9, -111, 100, -18, -66, 28, -17, -136, 112, 81, -167, -13, 80, -109, 76, 105, -132, 47, 91, -118, 8, 87, -90, -13, 135, -92, -72, 161, 31, -63, 84, -64, -107, 101, -43, -64, 72]
4875G2m7r1J74j47n7K08j11o2M4J9m5P3L3k25K29m6p6M5P1q2Q7L7k23N2J12m0
4901DjP6j00K7O7q2NN1km8M6r2P1M8m0m6M1r0nR9No4Q0q3%J04l0q2O4k9q1Q3K
4934bm6O2J3r9P5J4n5L7km7R5m1q5M7O5l1O9L2k04P0P9n4L6Jj0j1K1r3N9R6j19
4965b8l1O4k2JJ00j14q0J39jj72K01m9m9J76j40q1J15N4j32J23ok11J68Lj32J26
4991B2O6j88J20Q9k00J9J95j83n1K18k12K4J42r0m3J63p5l8J50j15j42K44k5j88
5015i8J52K0j50J34L0j38R1kj18J09pr7M5J12j77N7J48j73O6N1o7k0J05j16pR5
5041D5j7j38J12k2m5J13rj70J95n7n9Q9l7p6R3Jo4N6J08j91P8K1o2K9O4j02k8
5068g3Q6m3NP4o9l2P2l6k8J36Qj08P4l2n1K6l9l0J16q8rK8k0Pj5K7m3N2J1m5Q0
$$ y = [72, 25, -66, 108, -39, -96, 112, 1, -61, -17, 2, -43, 30, 63, -162, 67, 21, -55, -10, 61, -21, 66, 103, -120, -68, 44, 4, 3, 79, -21, 6, 73, -9, -4, 47, 45, -3, 43, -49, 22, 70, 30, -16, 25, -65, -70, 29, 34, -30, 50, -33, -33, 71, 41, -41, 23, -6, -87, -4, -2, -48, 14, 27, -72, 3, 17, -38, -1, -3, -50, 45, 4, -81, -34, 31, 0, 69, 101, -103, -33, 46, -8, 28, 29, 19, 8, 29, -64, -5, 91, -28, -59, 5, -17, -16, 84, -30, -110, 29, 28, -144, 57, 8, -41, 135, -5, -86, 29, 83, -49, 74, 68, -143, 25, 28, -104, 22, 88, -100, 20, 109, -91, -72, 123, -60, -111, 107, -105, -81, 61, -29, -72, 91, 16, -22, 128, 13, -129, 115, 90, -98, 54, 74, -76, 58, 88, -50, 41, 39, -79, 30, 23, -74, -29, 83, -94, -37, 111, -62, 4, 55, -12, -32, 73, -43, -50, 45, 28, -110, 2, -20, -65, 48, 39, -131, 64, 7, -52, 37, 0, -76, 17, 18, -46, 10, 118, -73, 5, 26, -36, -7, 57, -45, -73, 13, -30, -25, 49, -20, -52, 20, -16, -44, 92, 100, -8, 66, 34, -17, 9, -30, -60, 56, -32, -41, -13, -33, -26, -41, -14, -57, -5, 6, -39, 41]
5099D1nq4RN6oj6L5j8l0j9Q5o0J5L2l9Kk5K8j5K2M5p7M0k9j9M1jLk0ko1O8k5J6
5133a3J4J6qOk2LL5K4l1m1PrN5r7P3%p1L3n1K8Q1l8%j5K8j6N4kr4Q4l4nj0%N0
5168C4o8N7k4o1P3m0LL9j6L5l1j6O7j4r7Q8M3o7Ml8j4J4J9PPO1n0nj33J12j1r
5200c1O7pj3L7m1mN4l4n7P0o8r1J36L0n8K0o8NL9k5k2Q6O8j99L5Q8n8jR0p2K7
5231CM2r2J9O2Om4J3kqQ1n8m2J4KJ4L1o6l0J32q5m8M6M1q2Q3k0l9n7R5o7M7O9
5263F0q8M3k0K3kJ11j43j1O2m5k7J11p1JK2rr2R0J3j02R0q7K2M8k5PJ17q2m7l5
5293f6R1K4M2m9k5p8J30j01K6O5l3m6J9J5m1J16q3Mm3l6Q3k3k5Lj1L6k4j9O5J7
5323C3k9p2M3P1q1N4Pn7L2kL7n2Q5n2N9m8m6Qm3M1L0Rk7MJ0p4N5L4K6j38J07j4
$$ y = [41, 36, -48, -39, 17, 11, -5, 30, 12, -18, -37, 48, -12, 3, 35, -4, -2, -27, 1, -14, 8, 53, -24, 16, -13, -32, 9, 8, 11, -9, -11, -72, -4, -29, -13, 1, 17, 9, 15, -7, -4, 31, 55, 24, -17, -10, -19, 36, -61, 12, 12, -59, -26, -77, -49, 32, -6, -6, -21, 7, -9, 45, 43, -51, 33, -1, -6, -16, -16, 34, -34, 23, -1, -62, 11, -29, -26, 13, -3, 32, 1, -15, 52, 38, -59, 29, 72, 5, 9, -29, -43, -29, -10, -3, 4, 65, 15, 10, -123, -11, -22, -31, 36, 29, 16, 53, 12, 8, 62, 28, -29, 41, -27, -118, 18, 48, -10, 10, -58, -53, -14, -39, -61, 25, 93, -106, -71, 17, -41, -42, 48, -24, 3, 45, -47, -28, 34, 40, -4, 9, 7, -1, 80, 22, -20, -6, -4, 10, 41, -25, -55, 77, -8, -56, -10, 31, -51, 32, 12, -27, -84, 11, -56, -9, 60, -28, 15, -5, 18, 16, 127, -16, -27, 35, -10, -37, 74, 3, 4, 26, 17, -75, 15, 28, -74, 16, -71, -49, -1, -26, -19, 98, 16, -31, -66, 25, 49, 91, 42, 17, -61, 69, -32, -6, 59, 26, -20, -1, 14, -27, 89, 6, 10, -33, -69, 14, -9, -34, -31, -42, -6, -30, -49, 16, 33, 4, -68, -25, 46, -35, 19, 26, -31, 1, -1, 36, -16, 69, 17, 76, 28, -18, -10, -53, -12, 18, 27, 0, 4, 14, -60, -5, 29, 55, -83, 24, 10]
5355A0l0R4q8j01K39j01r4J37Pj59J12M0j57J00J32j85Q0Q1k82J57P4j22RK13
5379A66k42NJ59j35n3J67j28p6K78j54j60J94K4j66K05n5j85K40K9k63J90P1k70
5402a59K04P9k13J32J70l72j6L43k14n0K37k25p9M09k71j92L65m9k82L96k27j76
5424a90K67L0k30J56P0l19K96J67m25J63J44k79P3K96l86lL72l07p2L21k10j28
5446a94M46k97j52L66r0k52L29r2k57K87J3l12K38J30k58J40Q3k98J64K44m18
5467a80J3K96k22O7K14k26j06L67j95j53K20k01MK46j61k04K60K5j91K28p9j67
5489a45K49M4k82J51R5k04O3Q4j46K3K27j83q3P8L2n5K22j61j73K06rq3L4q4J9
5514h1J44O0k81O2J23K4Jp7j22R5J28q0o5M3j1M9k6J0m1J20q9Nn9N7k4qN9k1m
$$ y = [10, -20, 74, -14, -115, 124, 23, -71, 66, 73, -86, 26, 66, -91, 9, 141, -44, 36, 117, -165, -8, 66, -56, -47, 166, -76, -71, 88, -47, -100, 67, -61, -137, 141, -13, -173, 21, 45, -121, 84, 29, -156, 84, 113, -150, 40, 111, -159, 45, 124, -89, 43, 213, -159, -175, 168, -46, -96, 141, -84, -163, 246, -25, -217, 148, 99, -183, 213, -14, -190, 77, 107, -123, 33, 103, -216, 80, 247, -178, -15, 129, -150, -77, 219, -167, -170, 202, -105, -177, 144, -66, -194, 252, -45, -197, 169, 79, -173, 156, 64, -193, 94, 107, -205, 33, 163, -95, 45, 128, -170, -6, 238, -180, -167, 129, -93, -26, 188, -38, -144, 223, 28, -125, 95, -106, -102, 144, -17, -221, 39, 64, -127, 101, 22, -145, 104, 148, -134, 17, 112, -92, -29, 55, -91, -68, 159, -24, -107, -29, 3, -52, 170, 9, -164, 42, 33, -50, -16, -100, -81, 63, 123, -158, -96, 27, 51, 52, -25, -147, -52, 76, -4, -69, -26, -37, 12, -14, -4, -45, 75, -14, -9, -68, -11, -35, -43, 16, -5, -9]
5543iJ0J5j06O7J06p8%K1j12M9J30l0j08Q3o0JJ98j18j68J30Kj08J52m6j46J91
5569F6Nj22L2M6j86J95P0k32oK21j64P5N8j61J9K54j99q6J64k6j18J67j28o4K52
5594A32o7k31J62R8k72K68p2j79K79M8l11L0K58k25P4J29k78k5M01l14rL51k28
5617A9j72L01k03p0J93j12j26K67qk75J80J02j72J10M7l16K61J40k32q5K46j62
5639f7k0J94k11R3K54k94j08K38kp3O5j01j09K78k8k81J37O3j11J37n1k07K45
5662D1Q2j72O7P1j55J8J69j48NJ26j65j1K09p6r4J62k5j70J37l1j03J28l8j35
5686a08R1O8j07N9On4N3Q9j81L1J10Oj01L1j8L3P6q4m3R5nq0P4%j28J60m7n2M8
5715B2n7N4J7L6j22J1mkj4O0q9K8L6M0K0mK0o9oK3k4J2K2j9N7l0j0qM0q2K4Nl6
$$ y = [-9, 1, 16, -90, -23, 83, 5, 5, 26, -86, -37, 93, 63, -45, 38, -22, -21, 177, 59, -109, 21, 23, -85, 67, 21, -125, 66, 71, -51, -19, 27, -159, 36, 106, -126, -132, 89, -75, 0, 58, -103, -84, 170, -29, -115, 49, 23, -95, 72, -56, -120, 132, 65, -166, -4, 94, -178, 90, 18, -161, 118, 166, -145, -115, 143, -82, -8, 121, -157, -182, 219, -95, -104, 247, 19, -153, 148, -55, -125, 68, -44, -170, 97, 89, -186, -6, 96, -76, 34, 81, -235, 26, 166, -66, -151, 95, -67, -87, 107, -104, -11, 243, -51, -159, 79, 77, 4, 69, -32, -141, 137, 109, -172, -35, 28, -83, 54, 3, -204, 41, 123, -49, 18, 89, -66, -48, 121, -27, -22, 104, -61, -72, 137, 61, -33, 129, 104, -66, 71, 40, -63, 65, 27, -108, -17, 51, -56, 3, 9, -45, 8, 97, -84, -53, 57, 63, -38, -7, -25, 8, 84, 0, -43, 52, 47, -33, 41, 41, -87, 73, 26, -26, 22, -35, 19, 36, 72, -50, -39, -43, -45, -59, 1, -88, -60, -24, 16, 36, 32, 52, -17, -23, 0, -24, -12, 10, -9, 48, 18, 8, 0, 40, -42, -18, -13, -49]
5748d9J3J4N6Ol5l3K6r7Q9jJ6K2m7m1J05k1oK1k9m8N3K8j08N9O7k6p8L7k3M3l3
5779b0J6m1O4m2K3ln3L4rl3PJ28ln1j9J3j02J03M6j46J28J4k7k8J4oM1qn9%P4
5810E5j6jJk3o1M0Jk9L0N1j22J23p3ML8o6O4K4k1nL7o1M4L0n2M2k1Ro2l3J04r5
5842d4J2J1O9j0m0K0j3K6%q5Q6nj00P4JJ5lN2q5k1J9R8q1R1m4o0L9rJ8j1J0k4
5874FK4j20N1J21p4o3NL0%NK9k0N2j2p5N3L2p2J13j17L1J0qO1q9N0l8N8n5K2n4
5905d4J08r9J6PP4o0%l5N4k9M9o9jK9M1Loq8L9M8k0j0j2O7q2P2o2O8m6l1j1K7
5937cQ1j51K2R4n0%K4m9o7J05O8m5Jk9%K7Qp1oO5n8J1N3l4knl1n4J13l3qK6Rp9
5971f8J03j2j00N3Q3r4LL1k5O7J7j97P7N9n2J6J25j48J1J17j9j36M7N0k9J02p5
$$ y = [-49, -36, -22, 34, 40, 5, -28, -2, -99, -10, -11, 5, 27, -20, -61, 44, 23, 17, 38, 9, -39, 14, 42, -66, -7, 60, 34, -44, -7, -30, 13, -20, -4, -45, 19, -23, 0, -3, -56, -22, -31, -64, -57, 71, 68, 17, -2, 11, -91, 12, 58, -88, 40, 54, 27, -1, 13, 7, 48, 40, -19, -19, 55, 39, 38, 39, 16, -45, -5, -4, -33, -3, 48, -74, 49, -24, -20, 18, -48, 16, 40, 19, 14, 51, -10, 34, 64, 12, 54, 33, 42, -20, -53, 51, -44, -32, -21, 48, 38, -2, 18, 5, 31, 31, -54, 32, 27, -73, 1, 2, 17, 14, 66, -19, -40, -21, 77, -4, 87, 43, -17, 22, 13, 31, 20, 30, 6, 30, -90, -39, 82, 8, -55, -50, -20, -20, -15, 14, -6, 46, 34, -41, 12, 44, -28, 85, -32, -1, 9, 1, 62, -27, 23, -15, 43, -12, 10, -44, 64, -35, -19, -12, 62, 2, 2, -33, 21, -8, 41, -28, -29, 0, 41, 44, 38, -50, -11, 37, 17, 7, -5, 62, -20, 52, -10, 58, 12, -19, -30, -3, 78, -73, -51, 43, -7, -7, 17, -32, -99, 6, 74, 29, 30, 1, 1, 28, 36, -35, -41, 24, -34, -23, 30, -4, -6, -11, -42, -96, 17, -16, -24, 2, 11, -68, 35, 23, -77, -24, 59, -35, -32, -1, -26, 41, 58, -139, -62, -3, -55, -39, 86, -62, -51, 66, 47, -89, -42, 8, -21, 81, 6]
5998Fj73J88l2k8O7J4q8L6K6l9m1J29r8oR1q7rJ34m1j49J06mj38K16m1j04N4Q2
6026G1j40O7R8j59J77q9j27N3O0m3J0Q9j15N3P6r7ML1m7KJ49j42p9K01j06l0J36
6053A03j67L0N2J0p3P7L0j77Q4Q3j43J05L2j54N0J78j30k9P3r5k7J87n9j28J11
6078B3k7k6N7L3j58J55K7j65R2K1j60J61J26k14j6J59j10j1R2j30j6J38n1o5J45
6103H0k1j24R0Pj87J77J1j35O8J15r9n7J19o8L9M6m7r4Q5j1J4Qn5j17J75N0j46
6130g7J01j1j10P0J14j05L9k4j10P4J25j27J1N2l8J9Q4q4k6Q9Kj20J35n2m0l4
6156d3N1l6K2N8j79O9J51o9k1k3m4N2J14r3j33J76n1L2M5q6j78K46N2j66L3J1
6182a0oj7R8j03k1J34j29K6R3j59l1J96p6l1L5L4j56J97n7j27J63m0l9L0Q6j91
$$ y = [6, -167, 21, -11, -39, 28, 42, -46, -10, 16, -23, -64, 65, -33, -39, 52, -35, -44, 90, 49, -100, 6, 2, -136, 80, 39, -65, -11, 71, -69, -2, 96, -63, 114, 25, -102, -49, 11, -32, -22, 67, -48, 5, 81, -16, -12, 19, -28, -26, 123, -19, -98, 103, -3, -33, 103, -64, -34, 18, 28, -45, 32, 62, -115, -31, 52, -91, 14, 46, -108, -58, 120, -10, -39, 34, -61, -88, 99, 40, -88, 23, -4, -30, 27, 60, -98, 57, 84, -81, 11, 32, -128, 33, 159, -55, -71, 88, -22, -33, 59, -71, -87, 51, 0, -65, 80, 59, -65, 25, 32, -155, 22, 33, -102, -34, 81, -18, -75, 44, -24, 15, 61, 14, -80, 5, -6, 8, 16, -39, -156, 19, 69, -77, 24, 13, -97, -27, 87, -18, 21, -3, -113, -39, 86, -41, -30, 22, -16, 3, 87, 3, -23, 66, 68, -52, 83, 31, -9, -43, 8, -28, -6, 52, -127, -58, 93, 24, 3, -20, -64, -12, 102, 9, -124, 52, 1, 33, 78, -8, -186, 60, 112, -54, -21, -10, -16, -33, 65, -38, -59, 75, -54, -28, 65, -94, -125, 71, -5, -36, -1, 33, -123, 74, 17, -110, 53, 13, -26, 4, 90, -101]
6208a01J49j0j12J9J72k05J5J26j05M3J64k18j06K87q2q7J36r7k3J31m0j41M1
6231d4J31k04J82K3j80M9R9j06L4R4j88P6J31j09lJ07j68J6J22K2j47J63n1j35
6255h6J25%p2M7J8j79J43J05r5m3O8n3K5J00j71PJ53j04qO2o1j22J98N0k14Q6
6281b1R1j67J01j7p6J00R2j38j8Q1j17J0J56j06j5J49j98L8J17n2k2lL0p1J28
6306G2K2j69Q0Mn2J05Mr9l8J17n9pJ49j40M5%K6j16Q7o0n1J13J8m9k0R0j47J42
6334F7J8j41K7N6r7L6R9q5j5QJ08p3M3oj56J63K6j05K7j1m4J24r2j3M7L5rl0N2
6363E9q9mJ27j01jJM2l4L5mp7Q9l6j03J14O7j59M6R6j09L8m1j1nJ42j04l6R8p3
6392c3M8M2jj34P6ok0N8k0qJ1k4L1k3k0p6M8J04q9O4j7n4RL8j1qj9L2k7kk0L7
$$ y = [-101, 48, 38, -74, -55, 117, -88, -73, 53, -52, -9, 155, -63, -169, 118, 36, -51, 85, -12, -35, 96, 56, -85, -44, 87, -117, 65, 88, -92, -43, 56, -50, -16, 78, -110, -34, 97, -12, -15, 92, -76, -60, 62, 84, -63, 100, 49, -86, 39, 39, -33, 14, 32, -147, -4, 101, 6, -37, 31, -22, 3, 103, -68, -61, 92, -12, -20, 42, -19, -141, 57, 107, -107, -21, 70, -97, 4, -13, -89, 11, 103, -35, -53, 28, -89, -79, 77, -29, -44, 105, -93, -55, 62, 10, -12, -15, 15, -56, 72, 94, -75, 5, 9, -43, 62, 66, -33, -71, 46, -13, -20, 129, -11, 34, 34, 60, -56, 31, -29, -80, 33, 51, 2, -18, 72, -75, 67, 85, -56, -29, 27, -70, -34, 65, -20, -35, -27, 81, 8, 51, 45, -111, 52, 78, -27, 0, -11, -55, 69, -23, -36, 11, 46, 37, 7, 59, -30, -34, 93, -8, -9, -8, 34, 0, 35, 31, -46, 43, 7, -96, 18, 85, -74, -28, 68, -41, -3, -44, -55, -60, 82, -22, -58, 40, -33, 15, 57, 56, -78, -2, -8, -28, 30, 10, 2, 13, -11, 20, -3, -23, -99, -51, 53, -36, 28, 11, -43, -34, 4, -7, -15, -34, -2, -29, -31, -51, -14]
6424a4qN7r4O4K9l1J3O9j48N3L3J3r5Q1k0J6k1L8n3Q1p1JKJ8p7NQ2m4NM4o9K9
6456a2P8j09P3m2l0M9K4l8j4N7q3M7K3j10O8k9P7j5n0M3j5k9M8m5L4Km7L1Q5q5
6486a4j5O2k0QJ2%k6L8q5NL1LkK8l0mL0l0K1K8nn2L8J6M3l7p6K0J9JJ7pj4J5j3
6521EJ1m1J9n3O8J4l6PkJ2N3m0nrpL5j0m0K2j0M1k7K4p3L4J0k7Pj7PPmM0rm8M6
6557DL0k5L2k5o1Q9k7j9k7K7j6oJ8Qm2N0pO6n8k8K6j5J2J3j4q2P2K0j3J2k6qj2
6590c2N4l2K0N4m1nm7M0mK4L1o9k3L8lk2p6O1M0k1l2K5J4k8M1J7l4N4l3K4l2n0
6622d7M9m6M4Nn4R6q7J8L1kLN4k2j07K9j2j2R1lo3K3J5oP6p5k4pO4l6n3lK6J1
6655b4j3O7j2n8M3n4M6lm1PON9k3jK5k3QnK8n1j8n4J46l3n9JlL4q1R2o1M8K0J5
$$ y = [-14, -22, 35, -59, 5, 34, 3, 16, 85, -63, -10, 23, 36, -59, 22, 2, 18, -3, 35, -18, 63, -8, -7, -5, 13, -64, -59, 23, -21, -16, 28, -41, -12, 66, -43, 30, -12, -42, 7, 31, -7, -21, 36, -47, 0, 23, -87, -19, -48, 29, 14, -36, 7, -8, -37, 11, -34, 0, 2, -45, -14, 71, -14, -29, 33, 13, 21, 33, 33, 7, 45, -40, -35, -4, -1, -3, 25, -5, -9, 21, -9, 12, 40, 35, -17, 21, 37, 80, 43, -33, -13, 6, 7, 24, 17, 3, 18, 5, 16, -25, -6, -59, 9, 23, -13, -6, -8, 4, 57, 17, 12, 3, -4, 31, 21, -19, 3, -7, 34, 7, 31, -42, -8, 2, -25, -18, -35, -28, -21, -25, 15, 6, -42, 4, 34, 9, 41, 16, -45, 44, 17, -2, -29, -2, -18, -24, -6, 2, -40, 10, 3, 69, 11, -17, 9, -6, 6, 19, 5, -77, -5, 15, 2, 14, -12, -20, -32, 22, -10, 10, 64, 23, 18, -29, 11, 7, 31, 62, -7, -30, 8, 5, -17, -93, -32, 8, -13, -45, -20, -6, -34, 7, 24, -10, 44, 11, 35, 3, -47, 2, -44, 0, 5, -49, 47, -40, -22, 9, 7, 10, 64, 42, -65, -36, -48, -60, 31, 28, -35, -12, 3, -3, 73, -2, -26, -33, 31, -5, -58, -61, -35, -24, -37, 30, 18, -40, 3, -51, -5, -8, -49, -42, -36, 23, 0, -1, 24, 1, 9, 4, 32, -19, -37, -91, 55, 22, -37, -36, -39, -5, -86, 6, -55, -7, 13, 28]
6689B8o1l1P8o3P8l5K1m7j8M4k6Q5q9J2M7k2l1R1l9l7l2O0j7L1m4L9P8j46L6j5
6719b5N7j09O1P1j10O2K0m0N6l8l2J8k0k6M5N1l4nLk5J6M4r7N3O3q0LM2n3k7R8
6750D2o7k7JO1o6J6L5K4k0qOmJ2n6O6l0L8j09Q2J2J1l4J9o7J14j0l8M2p6k5J45
6781H9r9n7P6pm8Q5J2j08M8Pj9K8K2J5p4N9Jj1L6j10N9j1L9o8P8l9j7Lrk8J37
6812H9q4K6p6JL8k2lN9k9nM2p5J9L8jK0o6M1L9q9j4M6J0J7j8L2o6L1l7Oj6O2k2
6845gl1O5p5N8O4n8qjOo2O1k0n5M0L8n3M1L0L4j08K3qO3pq7J6n2J29k9o1%M6N9
6878E1Nr9O5M1n4m8J3j4R2m0rm1N0j2k2P9o0j5Q5q7jL5j6n6K7J2Lk1J35r9L2K0
6910E1k9o5O3j1MKL0q1K4O1o8nM9L4n0K1q8L1L5Mn6J00q0k8Q2L5j30J27j13M6
$$ y = [28, -33, -64, 14, -49, 29, -6, 15, -32, -50, -6, -32, 53, -36, -24, 23, 1, -30, 61, 22, -15, -47, 13, -4, 27, -17, 22, 100, -46, -10, -25, 32, -77, -16, 55, -55, 7, 27, -13, 43, 5, -27, -9, -29, -55, -10, 41, 7, 2, 5, -20, -4, 40, -57, -4, 59, -21, -18, 24, -29, -56, 42, -25, -52, -51, 10, -56, -40, -5, 19, -1, -9, -3, -7, 5, -51, 15, -15, 23, -86, -4, 8, 19, -15, 4, -63, 51, 41, 3, 45, -31, -56, 89, -10, -67, 9, 2, -46, 39, 51, -57, -9, -2, -21, 7, 29, 44, -30, 29, 30, 19, 55, -55, 4, -7, 32, -36, 42, 3, -14, -11, -20, -48, 89, 5, 31, -45, -44, -6, -28, -31, 28, -1, -6, 36, -39, -20, 18, 17, 37, -29, 12, 51, -38, -52, -6, 4, 21, 3, 35, -31, 0, -37, -31, -47, 15, -7, -38, 27, -48, 10, 74, 16, 8, 7, 13, -49, 12, -8, -63, -23, 15, -38, 3, 33, 67, -41, -18, -26, 37, 30, -57, -41, -93, 36, 7, -54, -54, -8, 51, 56, -43, 22, 63, 9, -39, -26, -40, 52, 12, 3, -38, 12, 0, -22, 57, -3, -18, 67, -20, -21, 14, -2, -58, -31, -19, -16, -37, 98, -1, 31, 51, 22, -43, 20, 9, 13, 15, 45, -36, -12, 49, -19, -24, 25, 59, 9, 30, -58, -27, 8, 12, -44, 56, -24, -52, 30, 65, -65, 62, -51, -5]
6940eL3l3l8L6N1j17J44q6m5N0O3r6N2Q8r1l2K2j4J6M1o1L6l4J7lN8j37N6M1Q
6970B0j1k1k3k2K4K4K1j8n1mJ13l0o7L7oK0l0J13j23j5J47o3m1N3j0n6L4Rm4Q8
7000F8r2J6k9J6k9O5k0L1m1K1J1k5l1l6R7p3Q3m5N7o7J0L4Lp0O5j9k1M2J3p8Q7
7031D3l0l3K3M6j1l4k3j0j6J5PQM4m2qP6n8K4M4r8M3m9L5k2j5jo6J77o3k4pj6
7063d1O9j9k6k1k3P5J3m1kM3rl6O6n7Qk7K5M6p4M2K0oLl7L8L1J2o4m0P7j2p0L5
7096bL0l8M4Rm5M5o6O6k6pr%n3J24o9L3n4J21r4j4pJ7o9M3R0o0L0q5j0R2n0R5
7128H1p6Rn7K0J0k7KJ07n5kRpK0k8k7L3L0l6orN2n0J6p5R8o5L0M5K6n5n5j2Q3
7161B9l3n5L5M7n0N2l2J5j6kJ3M3qk7rj0L3n1M0l2N5n4J5J8l2RK1Kl5J9KJ4l4
$$ y = [-5, 28, -5, -43, -7, 44, -73, 71, -15, -60, -10, 53, -43, 9, 97, 6, -26, -4, -18, -2, 39, -22, 14, -20, -3, -6, 52, -85, -29, 12, 20, 9, -12, -35, -57, -33, -9, 12, -6, -57, -61, 52, 22, -45, -8, -14, 6, -24, 89, -34, -49, 98, 35, -6, 47, 37, -19, 15, 24, -20, 68, -24, -8, -37, -21, -50, 15, -5, 26, -15, 6, 17, -8, -39, -75, 22, -51, 32, -13, 44, -23, -13, 21, 24, -46, 19, 0, -21, 21, 34, -44, 43, 13, -20, 3, 49, 38, 4, -19, -29, -45, -30, -23, -15, 29, -13, -21, 55, -3, 21, 65, -33, 10, -39, -4, -26, -41, -42, -108, 69, 6, -18, -25, -41, 28, 9, -17, -38, -61, 14, 27, -14, -16, 27, 18, -18, 48, -9, -1, -28, -3, 43, -31, 11, 31, 25, 28, -9, 29, 60, 72, 8, -32, 45, 33, -37, -2, 28, -10, 34, 43, -2, 43, -23, 43, 17, 10, 1, 1, -52, 72, 3, 36, -18, 103, 9, -5, -12, 5, -64, -21, 69, 9, 39, -46, -56, 36, -14, 81, 5, 14, -43, -23, -13, -40, -38, 69, 14, 12, 21, 14, 34, 6, -21, 12, 42, 6, 0, -9, 43, -7, 9, -66, 32, -33, -3, 42, 68, 13, -42, -54, 29, -4, -59, -24, 23, -27, 25, -7, 8, -8, -10, 3, 46, 38, 11, 2, -8, 25, -26, 14, -18, 37, -17, -2, 16, -16, -7, 14, 16, -19, 0, 2, 16, -18]
7194a8O4k8KJ8o4Rj1oM8J9k8L1k2l2rM9j8l9M3Ll5P6o1M1n4j5l1N9J3m2mO9j9
7227Hl0N9l5j4mj6P1m2n2R5l3k1n1J17m1k5L4k5km9N4M4q1j8L0P6p2%N7k5m3M0
7259FNl7oN2NL1o5P1o3J5K2k5l7N0k1pjj6M5k1K2Ok5N9l0m8J0k5N4j6mm1K5Ll5
7294d2O1j2kM6q4K5M7l0j5m5M7J8j0K5m7k5Q5j4kn2N1l0J%K4OMl4J4l5M3j6LN9
7328F4j06O3l3OM1p9O3o3KK1Kk6R8p0m0P8l9K4l1L5j1l3J8M9%j0oq0%R7l4m1J08
7361F7n2j2LNkNl6L6N0q8P0Oj6l7O4j21P5K1N7r9J1%m1M3M1j22N9J6KJ3j5j4j4
7394b5O2l0n2J20j3m6Q7j28qL0j6J9J1o3%L2N9q3K7L4j9k6J08p3K7o7l2J7O8J2
7424C2j4K5qLk7J6m8M4Nk0O0k5j09M0MN0oj1l0NJ9m3M3M1n8KK9j0mm8O5J3J5m9
$$ y = [-18, 46, 18, 20, 38, -26, -17, -28, -34, 14, 33, 5, 36, 14, -18, -27, 22, 4, -35, 8, 11, -24, 52, -9, 32, -22, -37, -68, -9, 4, -38, -42, 27, 8, -22, 37, 2, -12, -16, -32, 39, -3, -55, 40, 7, -14, -65, 52, 11, -14, 20, -5, -7, -56, -2, 42, -39, -57, -27, 49, -23, -23, 34, 9, -34, 6, 11, -26, -32, 20, 25, 56, -9, 62, -1, 14, 36, 11, -26, 24, 3, -4, -5, -21, 24, 3, 25, 31, 6, 65, 35, -13, -3, -28, 26, 10, 6, -35, -10, -7, -42, 19, 7, 5, 51, -33, -8, 39, 9, -6, -51, -4, 14, 4, 29, -18, -43, 42, 28, 26, -26, 25, -5, -4, -4, 20, 26, 30, -4, 10, -25, 18, 2, 5, 64, -42, 21, -12, -6, 35, -44, 19, -44, -42, -21, -19, -45, 53, -17, -57, 21, -18, 6, -25, 10, -1, -34, -16, 33, 33, 23, 17, -63, -63, 34, 0, -41, 67, 15, 3, 6, 11, 9, 14, -22, 14, 64, -24, 46, 52, 36, -1, 63, -58, 17, 38, 95, -4, 7, 7, -34, 9, 50, -72, -13, 3, 5, 18, 3, -11, -25, 37, 7, -45, 75, 62, 16, 103, -25, -33, -3, -19, 0, 11, -52, -52, -20, 39, -44, -17, 17, -2, -28, 80, 7, 34, -33, -65, -48, 20, 32, 18, 43, 35, 38, 11, 27, -21, 23, 28, 8, 68, 43, -66, -26, -22, 28, 22, 11, -19, -14, 5, -38, 5, 46, -12, -10, 19, 9, 5, -43, 22, 35, 50, 1]
7458Aj8L4Nm8K5M7r0NO4m0M4l9JL4l1nj1k2P7K0l2o7k1P0L3n0P5p6R3o8QM7p7
7491a2kQ5m6RK9k5rN5j63P1J04j33N5M2p4n0P7ko1N8O0j48J21r7j1J10j1q4O1
7520IJ7qqMNK2j5j51J05N0q2O7K0j03K6R3p9qJ53j26j9J03j06nN1qn2Q5k9j28
7550a17J43q7J3K7P7q5M5N6j17L7J8n6%J29j09pP7j10N5L9m5n4R0rl5J0K1o3N7
7579@J8n5O1k2n8N1Oj5j2N4r1Q3J9qp4J42j40M4J0Qk6N1l6q5J15r6J0Q6j8j26
7609a04Q3J9n9J3J07p8j4K2RLL3j02O2N5k4L1K1r1jM8M5r1O5rj31J9J5Q0l0MK0
7640B0NL2p2N8l9k2J08p5J4k8O8l1k8J3K2j05ORN2K4j4j2j9N1k1j5J6l4M2j5K5
7671C5p0N9k5j4j9Nj3J5K0J1J4lo9L2J01m3k9N3j3o7M5jj0QM1j29O1Jm2Q4L7m8
$$ y = [1, -17, 17, 22, -26, -1, 46, -44, -39, 25, -15, 29, -10, -9, 25, -6, -11, -22, -44, 33, 53, 21, -46, -67, 3, 36, -14, 61, -15, 78, 10, 18, 65, -12, -14, 71, 25, 34, 63, 38, 29, 84, -79, -8, 96, -37, 18, 60, -14, -64, 13, 11, -50, 8, 68, -80, 41, -56, -67, 43, 32, -52, 9, 26, 18, 10, 14, 19, 41, 26, -125, -20, 30, -52, 15, 35, -68, -42, 51, -28, -36, 117, -9, -28, 75, -31, -36, 15, 7, -45, 40, 11, -117, 26, -61, -48, -21, 56, -29, 16, 72, -45, -8, 10, -46, -46, 83, -26, -33, 44, -66, -11, 28, -17, -71, 19, 10, -25, -15, 6, -57, 0, 18, -37, 24, 2, -56, -5, 1, -14, -26, 28, -63, 20, 39, 31, -43, 99, -41, 3, 13, 21, -5, 46, 10, -75, 40, -56, -46, 40, 22, -104, -21, -2, -61, -48, 59, -19, -33, -11, -2, 1, 34, -68, -6, 49, 25, 56, 77, -14, -15, 33, 78, -13, 52, 43, -88, -69, -54, 26, -4, 0, 20, 25, 57, -15, 43, 4, -18, 90, 15, 29, 1, 69, 38, 10, 23, 45, -60, -54, -45, 7, 31, 17, 5, -14, 37, 16, 1, 17, -17, 25, 10, 35, -35, 24, -1, -15, -34, -29, -42, -27, -7, 4, 18, 15, -54, -22, 79, 36, 7, 60, 47, -20, 25, 24, 14, 22, 63, -66, -5, -4, -46, 38, 75, 27]
7703B7o5N2Jo7Q7n2k8J15p3j8O1rr4O4O7r5P4pl9j7L9m0O0M6n2k1L4j35L3K2m
7734c4N5Po8M6k4k2nM1j0K2M7p5oJ6N5r5R3o3%k8P5r0Q6j2o6RJ24m5p8J33o5o7
7766d4P0ml1N8j6q5R4n8l9R4j6l9oJ3L3J4o7k6N8N0n2J2L3k9M9p1J0n7L6l0M5
7797aM4l9l4P1l2j6OM7q6M3j5n7J06o1M9nm9R3n8K7K4o1Jl6N0jk4O5o0J6n8O9
7829A8om5K2J2l8J6m5L5k4lJ09nOo0N5Ll6l9K6l9OKK6M7j21J00jL5m5m0Q5q2P8
7862E2m8J4n9J15r6J3L8Kq0J45j19pO4k1l5R4Jj57J47q5L4l6L5j8km5P2l2j4M5
7892A7l3k4RN4n0j4M6j1K5P1m7n6kOOK4k0L9K0m5m3mPn1O7J3M7m9k3O8k8J0n5
7925b6Q6m2p6M7L1R0j22Rk6L9K4mk9J4n1L1J5O0n6No6QM1m7m0M3R3j7m7L1n8Q
$$ y = [27, -38, 14, 15, -52, 35, -17, -45, 70, -3, -21, 40, 31, -63, 1, 68, -27, 47, 40, 1, -16, 23, -17, 43, 89, 37, 16, 50, -85, -52, -30, -34, 21, 28, -40, 6, -18, -40, -45, -4, -14, 8, 55, -20, -26, -10, 45, -50, 43, -20, -20, -48, 27, -63, 23, 11, -55, -46, 78, 33, -45, 88, 23, -44, 26, 22, -9, 49, 33, -52, 42, -16, -55, 39, 23, -16, -22, -9, 24, 38, -29, -55, 3, 53, 1, 13, 46, 17, 66, -5, 5, -52, -16, -46, -1, 43, 4, -30, 41, 9, -7, -1, 46, -40, 3, -12, -69, 37, -24, 25, 20, -29, 64, 6, 33, 57, -4, -3, -39, 11, 10, -14, 51, -9, 7, -51, 18, 12, -33, -11, 1, -37, -21, -66, -31, -55, -58, 51, 46, 52, -8, 47, 50, 14, -25, 1, -38, -32, -30, -4, 43, -78, 22, 21, 56, 11, -29, 56, -26, 52, 4, 18, -41, 74, -22, -9, 29, 31, -49, 96, -23, -30, 34, 13, -22, 72, 73, -84, 63, -22, 12, -24, 11, -7, -9, -54, 18, -14, -28, 17, -16, -40, -31, 23, -27, -41, 5, -6, 19, 90, 43, -13, -15, -9, -3, 21, 1, 40, 60, 15, -28, -32, -25, -76, -9, 4, 51, 2, -21, 47, 19, 29, -26, 60, 18, -58, -11, 20, 110, -12, -3, -29, 10, 34, 30, 1, 15, -36, -5, 10, 70, 14, 19, -47, -39, 2, -45, -85, -42, 51, 34, -13, 18, -40, -32]
7957c2J0J9K6j8J6j0J5p9O5J9k8k5J3L9l7l1M6n3J2%K4M4n1JO7l1l7kK7KoJ2j
7990A6L9l2q3R4op8P9n6N9m5j0l1N9K6n0N8n3J8j11J55on3P4L7j33M3O0l4k6L5
8020D5kp4K2n1M0L0k0n3R9o6LP2o8O3l8l2Kl8J30j03pJ09j01j2O4j2l2O1m4oL7
8051A8j2l0j1K0M0l8O2r0kJ0M7O5k8r1kO6Lkk6O0m8j8J1K1n7mM2j2n3L3Rk4N3
8084A2l4P3J3l3kJ2m4L6J8n0J1k0m5L0J09l1L1p1q3N4M7K2m6K2m8N1qpm7M0K3
8115C5j5L2l3p9Q3l7rN7j7ml9j4%O4jm8J9M3j3l2L6r8M0O0n1jL5M9j97J73m5l0
8147c7Q8J1m8L9nm8J2J2%m6M1J1J0M8r8m5J56p3q5J18p6n6R0j1n0J36j1r6P3j7
8177D3r3rJ05j32J27K2j11Q1Nj57J44L6k9o3
$$ y = [-32, -22, -3, 23, 5, 21, 11, 26, -53, 12, 31, 3, -22, -9, 30, -7, -38, 8, -45, -33, -33, -9, 35, -16, -15, 52, 21, -16, -18, 9, 11, 5, 17, 16, 55, 23, -60, 34, 28, -50, 29, -27, 32, -13, -23, -54, 5, 31, -19, 39, -14, 4, -107, 48, 42, -11, 63, 100, -33, 10, 70, 36, 10, 45, 43, -31, -9, -60, -20, 10, -10, -63, 36, -30, -27, 45, -23, 40, 2, -30, -28, -66, 64, -39, -46, 63, -38, -50, 14, 2, -30, 31, -13, -19, 18, 6, -24, -35, -15, 25, -13, 49, -41, -43, -33, 14, 79, 51, -40, -42, 24, 27, 25, -1, 59, 11, -7, 4, 25, -32, -36, 6, -6, -59, -26, -17, -41, 12, -22, 51, 64, 31, 29, 41, -3, 33, 51, 1, 12, -8, -53, -23, 86, 55, 86, 15, -68, -14, 33, 55, 9, 31, -17, 34, 26, 19, -28, 12, 35, 20, 52, 19, -60, 23, -14, -23, 34, 17, 13, -26, -40, -40, 24, 23, -25, -6, 37, 24, -8, 28, -70, -30, 30, -21, -22, 13, 62, -135, 38, -7, -37, 51, 62, 14, 53, 48, 0, 12, 24, 24, -22, 19, 30, 40, 88, -10, -55, 101, 28, -57, 61, -15, -71, 19, 8, -42, 94, 83, -13, 60, 43, -50, -59, 46, -86, 41, 63, -48, 33, 38, -119, 25, 61, 32, -31]
8191c1
$$ Imaginary data points
##PAGE= N=2
##DATA TABLE= (X++(I..I)), XYDATA
0@%%%%qJ6j6J6k4L2m0N6o4P2r3J17j38J62j92K25k66L14l63M15m75N44o23P12
28C79q06R08j021J148j290J443j610J792j994K217k460K726l017L338l696M096
44B153m539N032n587O220o950P798q793R982j1440J3274j5656J8883k3525L0803
58A7655m3846P4041k55277r9095N96340k73011r9523J60882k78199J17176M45488
69C62631m41290k13974M89087j00834k53370K72626j58571j32748M08984j56007
79G6534l44466L99580M5959l54783K21443P0340k60981K48532K8822l79172K34497
90a3695K16558l46911Q6650K13705k71565N5030J98768k56399P4148K53035l16840
101a07516p5313L35240j21161j19142J70678j52069j7188L05903j89949k42491
$$ y = [0, 0, 0, 0, 0, -8, 8, -8, 8, -16, 16, -24, 32, -32, 40, -53, 64, -74, 88, -104, 121, -145, 169, -194, 221, -254, 290, -333, 379, -427, 481, -540, 608, -682, 761, -849, 943, -1051, 1166, -1294, 1432, -1585, 1753, -1943, 2153, -2386, 2646, -2941, 3279, -3671, 4127, -4666, 5316, -6124, 7150, -8506, 10377, -13148, 17655, -26191, 47850, -207427, -306522, 289818, 16807, -82716, 78166, -200033, -82857, 362631, -78659, -292633, 196454, 95620, -157750, 114876, -43695, -176443, 232541, 76534, -267932, 131648, 177607, -177176, 44267, 114607, -146374, 102158, 130980, -248192, -13695, 202863, -144048, -57398, 156307, -115258, -60228, 138540, -117859, -43711, 209324, -107516, -182829, 152411, 31250, -87892, 82786, -69283, -86471, 219432, 29483, -213008]
111b13008K78086N1374j53648J07637j03775j34893K84984J9616k72177J11437
121b4367Q6579j39928J12438L0602j84841J24681J00434j97810M3055J22595j25674
132e2236L8266R4001j45292K5052J33149j14369j5806J11399q9332j1185J08293
143H1940r8884m7134J19211l4961l7092O4875q3360l7748J32599j8992q0975M3953
155C432k7458k1005R1910l8303p4176P6267M122n0928N4385j5180m7359P4113
167B9820J157n8481N1909r782o1012P2697K5586o5791K5353p009m9312P9745K0375
180E5255r4838L1325L7208o0499L3138K2119o8787M9316L8145r9227K2045P7318
192D2518o0140M29M2518o4053L0813P2314r7216j9869J06248l3265l4453M4955
$$ y = [-213008, 65078, 116452, -37196, 70441, -33334, -168227, 116757, 136373, -135804, -24367, 62212, -77716, 34722, 65324, -119517, 5164, 105598, -92212, -49157, 73438, -52236, -13970, 80031, -65261, -40209, 92940, -21429, -37235, 74164, -15168, -26353, 81940, -16944, -64078, 55133, 20172, -16920, 47955, -35405, -73153, 59446, 40454, -40521, 3432, -24026, -45031, 46879, 8576, -65600, 10667, 14789, -36139, 18246, 3066, -44293, 29820, 30977, -27504, 24405, 14623, -46389, 26308, 51894, -13897, 11456, 4447, -44865, 34880, 55255, -39583, -8258, 28950, -31549, 1589, 23708, -45079, 4237, 42382, -56845, -34800, 42518, -17622, -17193, 25325, -38728, -7915, 64399, -32817, -52686, 53562, 20297, -14156, 30799]
204C0799o3793l775J14297n2526p6389P7210j5652m8774P8726k1820o8192P7580
216B7691r165q2995P7487K4017q6491M8918K9758p4219M9358L2116q8747M5613
228f659O7834q5279O91N7230n9801J8778O8147p6488j5066P6441n3058k3729P8001
241D7042l8740l9450O0405l7003l6366Q0821j9765o5394N7407L711m9725N0725
253A3668n24n8292N6624K3513o9251K4800L0364m6204L2914L2832o3050R487M3382
266C0263m2915R468M6251m7103j4055M1570l1006p306M7280l2196k7985M2105
278A4371j5155k4312L9230j0815k8771L5959m847l4651K9891P891k7576K5167
290F382P332l3898J6991J6766k2814J6941J6036l1452J964J9467j6548O213J7062
$$ y = [30799, -32994, -36769, 77528, 25002, -51387, 25823, 10171, -38603, 40123, 18303, -49889, 27691, 18526, -64469, 13018, 37035, -49456, -538, 29220, -44999, 4359, 36475, -52272, -6659, 61175, -24104, -23413, 33817, -25984, -7206, 60941, -15547, -30613, 45828, -7230, -30959, 47042, 8302, -31148, 29257, -7746, -44112, 36709, 16944, -48450, 8957, 12668, -37057, 13668, 13144, -45148, 11476, 34989, -34262, -9462, 20902, -25302, 7612, 40444, -22606, -13119, 30263, -12652, -3184, 43067, -4036, -18091, 23479, -7527, -14833, 32447, 251, -27734, 14371, -784, -25096, 14134, 3319, -25452, 10507, 5660, -28991, 900, 8791, -18785, 6382, 13714, -20184, -3193, 13573, -9241, 7700, 23736, -7716, -5752, 13715, -2833, 3380, 20442]
303B0442k4523n412J9382j2827l926J7576j1494p921J4230j0380r594J6721j460
316H14q658J0522n499j1421J2755N208n147Q748k143j2811O727P500l304M954
330H245p25j1482J998N953l192K902K527p733j245K692l862J607M199m154j877
345d147J165m048L60N428Q16O87J240m006j515M595K774J635J164m004l573J648
361B19K009K627K381k804m305j109m6J906K776j354m021k620j797N93L249J365
377i31j124j223j498k47K358K712J517N53j548k081J04J798K808K412m24k467
393B719k188j16K450K969J45l142l759k190O94K507Q52j711k226j422k41J451
409c208J511M95L15j45j238r01L85J443K960K213j289l181r56J960L916L626j802
$$ y = [20442, -4081, -9493, 9889, -2938, -6864, 10712, -782, -8703, 5527, -4853, -14447, 2274, 814, -7844, 2678, -2821, -14242, -1487, 3721, -1426, 7322, 5179, -7632, -905, 6595, 3291, 8245, 7520, -3962, -1964, 3989, 797, 3699, 6226, -1507, -2752, -60, -3922, -2315, 1884, -2270, -4147, -2982, -7030, -6670, -1242, -426, 261, 1501, -2505, -4020, 575, 3349, 4984, 6148, 2144, -1429, 219, 2228, 4855, 7236, 4432, 127, -982, -1028, 878, 3654, 2300, -1721, -4341, -6138, -5545, -2296, -931, -2055, -3278, -4776, -5023, -2665, 47, 1564, 2117, 569, -1512, -1408, 390, 3198, 5610, 5186, 2719, 531, 415, 2865, 5834, 5979, 2837, -922, -3112, -2418, 89, 941, -770, -2996, -4418, -4659, -3208, -1697, -1202, -887, -1032, -2270, -3171, -2786, -1343, 1617, 3830, 2541, -640, -1596, 364, 4280, 7906, 6104]
426F104n461k604P59K600L325j065n558k526J219J151K527Q68l909j127K355j234
442b576o04K202r65O89L697k759l471L506J951J210M532l178o871K422K859m48
458B196M274k055r091J462M332k227L269J017q342R36N467n020L7M872n040L69
474c544O206o930l144R426j81j280O241o862o576J0415K462m323N504n073r926
489g585R276N075o942M157p81j0519P185O119j0639J865N744q760K804O019j1434
504h416J285J1916o360j442P781r241k496J3223l043l836P961q478p736J3945
518E063K210o962N474n544q097J3318K739j1951L859J771p100P261N16j2651O377
533c717R049p634Q69J604r268O778J0877q135k382L607p590L551J0927o177l361
$$ y = [6104, 643, -1961, -1202, 1398, 4723, 3658, -1900, -4426, -3207, -2056, 471, 1339, -2570, -3697, -1342, -2576, -3180, -978, -1943, -1254, 2443, -316, -3787, -281, 1670, 2880, 7412, 4234, -2637, -215, 2644, 2196, 6470, 4415, -4676, -3214, 1118, -1109, 2160, 3177, -5165, -4229, 1238, -3782, -3745, 1127, -3913, -3544, 2662, -4268, -7412, 2014, 1833, 553, 6794, -68, -6644, 3771, 6233, 1910, 7414, 2341, -7585, 1691, 6766, -176, 3981, 3200, -7319, -134, 5985, -4654, -2789, 2955, -5805, -3001, 3018, -8416, -7131, 4785, -1575, -3017, 4764, -4477, -6973, 6250, 3207, -629, 7332, -1146, -8882, 5063, 7273, 311, 5785, 241, -7856, 5462, 8201, -3750, 109, 1880, -5220, 2041, 2557, -10094, -3717, 5332, -2302, -1433, 171, -9097, -2319, 8558, 423, -1959, 1648, -5942, -2391, 8536, 2359, -1002]
548a002M439o217J281R895n743m857N636m117j477O604o604l886Q838k782m209
563d201N896m827l707R344j496l502P166o881q420J1879M804l867K776r649o656
578a1341J9554N507j5034l0L73j983J4088m215k0311J1062J2598j1998M46N67
592g17j0950J4491R523k1857J863J4990j3319L82J2495j2823K995J4375k0339
605h891l544K6133q473j1059J4021j1305n651K4587j0562j8393K1494k579j7742
618a1964K0182q03k2058J8554N286k0874J7212L631l0264J7385K2460k4551k30
631f034R372k0601J7757K4871l5135q297L1128j1609n762J8012k2516l204L5565
644B3547k0233k4968L0650p47j7592K1140j0763k0867L3736M4l5711K1548J4055
$$ y = [-1002, 3437, -2780, -1499, 8396, 2653, -2204, 3432, -685, -2162, 4442, -2162, -6048, 2790, 8, -4201, 1695, -3132, -6839, 2505, 1009, -2493, 4673, -2208, -10628, 1251, 6055, 2188, 4964, -4685, -11341, 8213, 13720, -1314, -1344, -971, -2954, 11134, 6919, -13392, -2330, 10268, -1730, -1284, -717, -11667, 2824, 12347, -9510, -7647, 7343, -5976, -5594, 6901, -5922, -2927, 11448, -8891, -12435, 13698, 5225, -5834, 8187, -3118, -8769, 15818, 5256, -13137, 8357, 5778, -11964, 8218, 7415, -14643, 3911, 9197, -11677, 5535, 9166, -21098, -3713, 18747, -5804, -6034, 3338, -17263, 494, 25365, -9770, -18067, 13061, 1452, -4310, 13702, -8814, -12018, 23547, 3314, -21654, 8996, 8249, -9343, 11797, 1034, -19833, 13903, 13947, -21764, -216, 13839]
657A3839k5511J3981N069l0104K3348K3050l5691J383K2699k2185P950K4257l1599
670i514n166L1819j8126q622K6081k0616j1909L4922j1457k3818K3817m555j5652
683a2796K8451p358l1744K4480J0985k3745J4853M662k5766J8629J4714k8919
695a3554Q554J9971k2620K488J7154k1315L299K3415k0918p452K3087j1962p395
708g248K0297j3472j1564K3930n624j7363J4749l115j0889K1017k692k4404J2359
721d019J0799r962Q735k241j9466J4888J5127j7951k211R038p015O984O620j7749
735h423J860J7586p943o296O728o050O72R565r225m014J1511m694p376O909l61
750D49j228N678o622n397R161K96n133M053j898l286N355j033k407N662l044m641
$$ y = [13839, -11672, 2309, 7378, -22726, 622, 23672, -12019, -10636, 12063, -10122, -2172, 22085, -9514, -14680, 17139, -987, -9609, 16472, -4144, -16053, 18869, 7412, -16406, 7411, 2856, -12796, 15655, 8297, -23447, 1033, 12018, -11727, 3126, 7788, -17978, 651, 15365, -13554, -5000, 14971, -7649, -5161, 11993, -9322, -6023, 17392, -3526, -10978, 12109, 147, -7248, 13049, -423, -11987, 11943, 6319, -11044, 3705, 590, -10299, 10718, 8026, -16378, -4019, 6780, -3182, 5553, 3312, -16154, -1266, 13861, -4090, -6301, 2737, -4278, 2706, 9326, -8423, -6563, 11023, 3080, -3216, 3512, -2538, -1866, 7699, -1526, -5540, 5971, 1277, -6099, 810, 449, -779, 4899, -1723, -7120, 2041, 2337, -2796, 1257, -641, -3927, 1428, 395, -2012, 3650, 606, -4035]
766d035P186R94n275J407k295N44R316n008j1240N947N744j303K672p072o877
781i295J2430L471j1118K705K851n442O558L09j0445Q395P173j2025K249P567
795E383q481L124O746j1563K759J1475j2448l120J2880p112k810J1260j0231n831
809g969J5358n824q877J3502m888j1707J3761L6j1537J2084m19j4236J3468N894
823H646j6898P045Q192j2807P258P110j7974N204J5930j3650k073J1592j2100
836d525qJ5762j2393o468J5993q336r061J5279m754r742J4112m013j2399J5158
850D605J314j4871J0660M124j3349R180M604j5192Q228R974j4620K759J0133j2382
864d833K047J2125j1856j830J2194j0451m130J4200o839p257J1394n042o766J2868
$$ y = [-4035, 3151, 4145, -1130, 277, -2018, -1474, 7842, 2834, -8406, -2459, 3285, 1982, 4654, -2418, -9295, 3135, 6606, -4512, -1807, 1044, -4398, 2160, 2469, -7976, 419, 7592, -4433, -2184, 5383, -3098, 26, 6772, -4791, -2032, 9443, -3005, -6125, 6755, -357, -3167, 8093, -2138, -7969, 7389, 1565, -7312, 6190, 1302, -10405, 3356, 3392, -8145, 3939, 3520, -10716, 2752, 8646, -8252, -1207, 6985, -5822, 1436, 8546, -9428, -4224, 11706, -1944, -4017, 7575, -4525, -4533, 11229, -1164, -7632, 8361, 25, -9036, 6243, 1489, -8253, 5859, 1846, -10553, 4605, 5919, -8952, 1708, 5832, -7517, 1663, 6267, -8925, -697, 9277, -5343, -2584, 7549, -4833, -2786, 9339, -2517, -4347, 7847, -2604, -6734, 7466, 627, -6630, 4764, -278, -7044, 5824]
878E824l326j0600J1353J175j0786P910J541r770Q695L906j2001M993O677r490
892c899L349P183r184P67P186q401J85R349p242l936P858l859k789P608m363m706
908d894Q263j573o473N695M07m936N091L6o110M656K808n677K849L271m908J288
924b07K765m264J594L829m550j171L749k195m74L180k428j340L280j682k086K989
940I89m45k054J884o10j933K101M68j454J636L71k130Q90J279q42M35l9j550P59
958b45J061q89n0O58k16J6J00p41L74O04l54n75k39j70L07J23j49L70P1m63K07
979b00J87O6O87l26q63J98K38l01N46K73n66J63L20n52N23M48p94%K26q74m5P26
1001H0m30K1M78p53q6J071j11k73M21n44m09P47j64n70P27J55o33M02J93l76O56
$$ y = [5824, 2498, -8102, 3251, 4426, -6360, 1550, 3091, -6679, 2016, 5922, -6079, -1086, 5591, -3899, -550, 6633, -2551, -1784, 5402, -2999, -2814, 6535, -707, -4643, 3215, -644, -3433, 4175, -188, -4894, 3369, 1796, -4677, 1018, 1425, -3511, 1580, 1616, -4494, 162, 2970, -2707, 142, 3413, -1495, -207, 2558, -1706, -112, 3717, -833, -2004, 1745, -450, -924, 2256, -172, -1512, 1768, 86, -2000, 989, 544, -1510, 374, -236, -2169, -68, 400, -1054, 582, 953, -1177, -287, 992, 150, 585, 546, -1004, -245, 816, -73, -123, 535, 319, 335, 435, -306, 68, 672, 318, -257, -496, -666, -359, -236, -385, -15, 56, -407, -200, -13, 53, 740, 414, -449, -251, -13, -314, 232, 505, -61, 102, 422, -130, 393, 841, 47, 47, 273, -601, -646, 80, -350, -329, 149, -604, -690, 381, 270, -3, 418, -126, -535, 212, 48, -522, 205, 360, -273, 129, 322, -54, 602]
1022F02K78o28OJ01q06K50N66n66p1J49m06J44O66k20j55K19k37k98L03q0k34
1043d17M17r0l30L15K19jM36J45m84j60Qm3L02L5m66k67J59J92J73J69j88j93
1065f9J49Q4j63j13j59n7J13J55k06q8J99K19L29J02l88k36R4L12J16j57m21k72
1087d57K00L43K45r4k90j19K28J40Rk44k01n6J43m1j06l2J19K42L86r7l45K1J63
1110A57J13Q1l14m28nL79J55J01jl88J76M26j36j54q9l14RL10k69k12J48K8J75
1133e2L72k60l11K34J46N6R0l34m48K61L00N0J33k51k00K79M73j69j81k3l39J48
1155b6J98k64j64R0M4Q7J76j62j33K60L8m6jk87k20J79J53%M5q9K0J23L27p9m8
1180B21j89k7J1L9n4k03n1K09J62j26J7k9K1M08m4n73q8K33j1J14M5n84J71N79
$$ y = [602, 880, 252, 258, 359, -447, -197, 369, -197, -268, -119, -525, -381, 285, 65, -90, 129, -108, -406, -103, -183, -417, 0, -90, -420, -105, 114, 113, 549, 694, 210, 50, 58, 15, 317, 352, -114, -381, -222, -30, 143, 312, 124, -69, 80, 164, 1, -112, -271, -328, -215, -60, -266, -354, -155, 64, 393, 495, 107, -129, -35, 277, 393, 236, -185, -457, -257, 86, 331, 237, -53, -172, 56, 196, 205, -39, -240, -296, -153, -194, -300, -332, -213, 29, 415, 318, -27, -6, 157, 270, 351, 37, -391, -396, -17, 138, 239, 238, -150, 26, 452, 316, 162, 73, -241, -232, 78, -191, -403, -255, -227, -52, 320, 60, -251, -17, 129, 185, 275, -59, -507, -246, 54, 104, 237, -14, -214, 65, 538, 369, 188, 165, -174, -26, 172, -92, -256, -166, -122, -35, 141, -21, -154, 106, 144, 98, 97, -190, -410, -231, -78, -78, -33, -122, -102, 21, 348, 269, 221, 32, 5, 16, 55, 1, -202, -253, -44, 118, -8, 9, -20, 1, 409, 365, -208, -296, -63, -74, 40, 85, -499, -328, 251]
1204B51j58l7L10m03o4N25m52l50N09k57l17N63p6m49O38O4n69N78J61q61L48
1225d6K96p68M28M78r61J91P59n32J70O54r20p5J058o07m77P03o50l37J152l73
1245A43r17J029J99p58Q62j80j091R43M80j269L28N96j169N73R30j197K16J099
1263H17j019j12J099q58m65J121q08o17J316m20p96J124j18q67J173O8j310Q77
1281B05M57j139O23K97j356O07J052j046K1R97j011O8J107r61n59J120m50o17
1299e85R90n51o64J204Q0r47P38K49r42P03K36j079M86N39r90K17P67p96O4Q77
1319E96o94k09Q75m56n40Q12m10n41Q22j79p60P66K58o59N37K32p98M35O08q81
1339a86nM36o18J19O37o11r8O74k00l55N93j77n06N99k00m31L62J13n42L63J80
$$ y = [251, 93, 56, 366, -37, -101, 424, -28, -378, 131, -126, -443, 120, 44, -405, 233, 297, -272, 306, 467, -394, -46, 250, -518, -90, 388, -573, -382, 377, -155, 15, 669, -251, -326, 732, 125, -352, 351, -299, -636, 516, 143, -774, 255, 454, -304, 558, 378, -713, 230, 710, -559, -231, 365, -804, -231, 699, -498, -282, 817, -202, -314, 785, -73, -538, 583, -225, -842, 474, 54, -742, 382, 264, -603, 570, 638, -672, 205, 662, -477, 146, 443, -913, -306, 746, -300, -279, 718, -293, -225, 882, -79, -638, 482, 32, -585, 405, -146, -810, 394, 474, -473, 265, 514, -428, 275, 511, -568, -82, 457, -533, -316, 451, -345, -281, 596, -98, -307, 568, 112, -428, 384, -26, -567, 255, 76, -684, 82, 340, -319, 218, 450, -348, 87, 695, -186, -191, 245, -373, -254, 383, -228, -326, 348, 148, -207, 386, 209, -297, 302, 102, -329, 33, 146, -396, -33, 147]
1360A47m01K83L12m47K24L54n84j24M26l29j92M06j12j38L76j46j10L73k7l87
1380i6J48L0j92J19j37k30K59K04j32k1J30M9J17r8k71J00L5o9pj13P8N8L3jJ15
1405A08J7J6J3j00j28J84j65k07K29N7l25L78Q7k10K66L2m53L11J90n81K9M33
1427A81m76J00M25n64K46O38n36k01N77l18l64P45n66l70P81k79o45Q18N7o11
1447c62P41k0q12O58L06r96M64M41j022M10O17r33J80R58q79q3J108q06m00J070
1467F40o73o91J154n34n93J195l65q53J140J23j143R09J18j010Q37L13j440O82
1485a91Q75j244K56R25r89K80R46j174k29J360q21o51J132o28m74J194n67p92
1503g92J343q0r92R09m1q71P84J39j251Q78M73j076L12R24r82K27P71r30J60Q23
$$ y = [147, -254, 29, 341, -106, 118, 472, -112, -236, 190, -139, -331, 75, -37, -175, 201, 55, -55, 318, 291, -96, 52, 82, -110, 9, -128, -358, -99, 105, -27, -48, 82, 131, 248, 150, -121, -21, 14, -55, -62, -175, -97, -39, -6, -7, 108, 125, 141, 154, 54, -74, 110, -55, -262, -33, 24, -301, 77, 164, -46, 220, 252, -201, 110, 300, -281, -252, 181, -295, -195, 230, -334, -88, 550, 14, -187, 390, 72, -292, 453, -113, -483, 298, 19, -626, 192, 249, -362, 379, 359, -453, 205, 511, -485, -21, 420, -602, -192, 425, -508, -328, 630, -249, -332, 776, -30, -430, 640, -33, -724, 430, -104, -697, 498, 133, -720, 420, 543, -600, 309, 427, -583, 254, 567, -873, -191, 684, -560, -304, 621, -368, -88, 858, -316, -545, 815, -6, -657, 475, -153, -627, 567, 0, -792, 551, 471, -521, 388, 347, -524, 260, 399, -852, 26, 499, -577, -265, 659, -323, -96, 675, -255, -95, 728]
1523G28j071k09J120n38n83P67l23k72R98n37p49J025J55q47L83Jm20N70n2r48
1543h02O53P86q19k7L24k53M03K13q96J7Q15l47l93K19o3J41L81l47k50N63Om78
1565a54K20K9k05J97j49k71L58K16m19J11K65q6p9K4q5J55r1k62o8L13Q1j94m6
1588a40J48J80j5j99m4K23j6o3l03QK59l1k40J24Q1Q5K01k05j20K68n7l37J22
1611g1M1j62K37J9l22L40J64k38N0K50l12o1J64k77j5L27l90L4M02k36j86M39
1633A97n6k19K72j74l62M58j1m19K04J60k55K79J33l49K63K21m73N0L85l93o3
1654a52K95l78K1L87l02o1M37j36k28L73j58k30K74j57k60L42k2l69K77K23k13
1675c7J48J72m48K18J95l02m1J72k36k6K41j56N8K68k26r1K59ok45J87j33k10
$$ y = [728, -343, -552, 568, 30, -553, 214, -109, -381, 617, 80, -669, 356, 511, -336, 47, 48, -372, 198, 146, -802, -149, 637, -182, -209, 115, -138, 265, 478, -418, -401, 414, 67, -326, -107, -170, -29, 352, 5, -245, 318, 324, -154, 66, 95, -110, 87, -62, -333, 25, 241, -178, -67, 198, 112, 33, 57, -28, 127, 36, -226, -294, 19, 100, -94, -140, 8, 188, 173, -26, -70, 153, 137, 74, -229, -221, 38, 7, -233, -109, -28, 57, 258, 53, -67, 201, 144, -193, -71, -30, -192, 45, 64, -258, 82, 246, 8, 58, 308, -4, -65, 99, -178, -193, 134, -256, -222, 180, -56, -242, 197, 141, -78, 194, 20, -342, 116, 105, -314, -110, 50, -205, 74, 207, -142, 121, 342, -131, -81, 304, -89, -152, 143, -235, -214, 173, -129, -190, 247, 111, -117, 256, 98, -132, 142, -15, -275, 67, 45, -324, -47, 176, -37, 111, 283, -165, 53, 248, -54, -95, 77, -159, -185, 56, -100, -42, 226, 0, -91, 168, 162, -83, 104, -29, -239]
1697b39K57q9j78K01J01m0P1J27k02R2O7j32m3O1j48n6J88m0l4J52r4q3K12k3
1721A28j20K2q4j55J17j1ojR9n1N5Q8m9Q1k3n1l8j7j21O7Q4M0k0j0j4L5J53l2
1749A66n5j11q9m0N6N9q9o3J10K8M8M4o0JQ3n0j07m6j3N6N3L2m5Kn3K11Q5o1q5
1778F7q2p7O0N9j17lm2J7P9P1L1j9J8l7p4J3L2l6J6N3n0p8N0Q9J28k5J9j51K4
1807C5o5J27r7lj21J6N3PQ9oj2ON2p6l3k5Kp7N0j7n0PL55k5j24O6j15q5L24k4
1837B34k64R1n4j52J95N4j81J01J20j66J3R0k15Q0K50l90q4J22j26R4M55k28k32
1860a93L57j32o1M23j61m13K79p6k50M19J10n40K92K29l66J47K38n54J78M86o82
1881b70r4M78m59J23P19n89k90N39k00r4O47l96n86N60j6m54O51Pp37N36L48p39
$$ y = [-239, 18, -71, -249, -48, 53, 13, 84, 211, 9, 101, 168, 36, -7, 54, -94, -150, 38, -2, -36, 116, 22, -61, 151, 128, 8, 30, -54, -209, -92, -103, -109, -110, -11, -62, -7, 81, 32, 113, 90, 39, 1, -16, -137, -70, 14, 54, 34, 24, 10, 45, 198, 166, 111, 0, -89, -129, -73, -14, -103, -166, -56, -28, 20, 64, 4, 5, 88, 38, -69, -115, -128, -72, -19, 13, -32, -30, -83, 128, 213, 152, 67, -15, -92, -32, 27, -90, -93, -135, -118, -39, 32, 63, 44, 62, 25, -49, -36, -4, -40, -24, 29, -21, -99, -49, 40, 168, 143, 162, 11, 35, -30, 97, 0, -3, -124, -108, -55, -48, 41, 35, 23, 29, 81, 5, -28, -53, -51, -128, -78, -95, -145, -138, 217, 192, 68, 134, 19, -66, 258, 234, -30, 61, 7, -145, 50, 104, -77, 24, 144, -22, -9, 81, -134, -54, 196, -194, -278, -156, -282, -188, 267, 39, -193, 164, 32, -29, 394, 233, -180, 99, 23, -227, 192, 302, -238, 54, 283, -83, 64, 302, -252, -74, 412, -270, -364, 114, -345, -222, 497, -92, -382, 157, -43, -137, 510, 114, -472, 88, 72, -382, 269, 276, -461, 75, 423, -316]
1903c16M98L00p81K50N12q86J33O42p35L4Q16p39j89P97l65k14Q68n91o36P70
1923A68Mn20O09o2q50Q74L12q79M90M69q05K88M03q71J03P38p67l7P52p19k39
1944e39Q53k31k89O52n50o86J006J60p78L56O5m31N86J67p33N31N48p75j44O51
1964D19l33j11L74n84k9P53m73o15O66M25m16Ql17l76Q84L27j050j69P31j35j27
1985a48J84j50J02O39n89o11R51K80q40P0K52k69L33k7q77O24J082r92p03P36
2005D7J2P7L79j000l86J318k22j022Q85K57q20O93m5q81J207M51j809N57J178
2024H76j090o6P28r23M34J373j725p40K001m19j027J052o82p59J689n53j619J816
2042C66N37j830O95O37j176J377M86k404P52J970j665m54J359j144L42J680k098
$$ y = [-316, 182, 482, -299, -49, 463, -423, -290, 352, -383, -349, 467, -272, -461, 336, -29, -243, 625, 34, -602, 168, 172, -348, 261, 199, -651, 223, 535, -344, 146, 615, -190, 98, 501, -370, -267, 471, -296, -333, 419, -300, -539, 314, 83, -206, 446, -104, -790, 216, 376, -402, -46, 19, -412, 174, 341, -392, 139, 687, -88, -232, 419, 86, -25, 349, -235, -264, 489, 16, -599, 67, 492, 76, 84, -233, -609, 275, 602, -448, -617, 114, -21, -148, 36, -114, -12, 627, 38, -573, 378, 658, -182, -112, 140, -129, 204, 177, -700, -76, 1006, 14, -689, 47, 59, 136, 515, -485, -871, 447, 225, -797, 88, 345, -475, 218, 173, -708, 499, 950, -859, -302, 876, -214, -280, 448, -475, -41, 1332, -393, -1133, 868, 449, -578, 474, -208, -967, 722, 169, -1450, 366, 903, -927, -232, 405, -771, 606, 1092, -1312, -560, 1410, -255, -709, 650, -494, -152, 1528, -570]
2059e70q66K843n32j661J280o99r29K423p34k373K002R14k100Q33P08j571J464
2076D32Q81k734O02K234j737l87J498j402J23K021k053q17K840p36j812J672m29
2093A96j182K057m36k281K137O17k462J203J189j743P62P48k200J045K007k385
2109g28n56K265r45o39J341j352j48K607j271k234J938O86j373R49m46j476K164
2126G82M89k764Q71J943j410k52O40j388J079J666k367q63K371m55j076J024n93
2143c03l32K028q34k152J764J021j490M62J84j400J289Q23j914M40J663j481l73
2160f05J211r71l7J423j323r89J922m84j253J360P6j185J313K4j561J284Q41j690
2178f44M63R82j406L54J131j291J10J510j360p36J643m05p86J097p62j063J694
$$ y = [-570, -1436, 1407, 875, -786, 494, -205, -1134, 1289, 555, -1818, 184, 1098, -1002, -169, 539, -1032, 432, 1313, -1421, -819, 1415, -322, -709, 789, -613, -490, 1531, -522, -1339, 1501, 765, -1047, 625, 196, -986, 1071, 635, -1646, 491, 1108, -1354, -151, 1038, -705, 57, 805, -1395, -350, 1657, -728, -1284, 981, 36, -603, 738, -614, -762, 1845, 574, -1660, 278, 964, -409, 540, 94, -1382, 782, 1271, -1493, -622, 1321, -89, -341, 299, -1089, -10, 1656, -711, -1574, 797, 342, -734, 290, -303, -635, 1393, 559, -1593, 171, 1192, -298, 164, 348, -1052, 237, 1060, -854, -414, 1249, -232, -605, 606, -365, -402, 1021, -302, -1291, 631, 147, -1106, 254, 330, -855, 458, 482, -1079, 205, 1046, -644, -181, 801, -605, -251, 880, -411, -301, 1209, -151, -887, 756, 351, -435, 662, -100, -1163, 531]
2195E31k1j601J111N72j243O72M36j443J005J271j825k43J377q38NJ118j358k15
2213f89J862q94j315J577P4r47R99n79j238J607M89j856O13Q70j197N05N99j270
2231g90P08J221j721l93J627n98m61R82q98l53J651p82j177J614J46j199O40O
2249B23r99J234L12j557O85Q42j390J86J068p76J09O67j373M8J556p76q14Q63
2267A08j52m22R49m64p27J285J10j151N54L88p27N15K65r88M23N97j050J60J037
2286G10o65k94M60o40N4J012o17p90Q36j65m36O61J5n59O94J06q85N58M14o32
2306a63J99M20o80M6M57m65R5P82n95m24M95j30q4M25l63n99N03J20l94K76J32
2327E3m51L64K11m23J49L94l30P1L01m16k33M49o2j4L31l55m03M89K28k56P9j72
$$ y = [531, 510, -1091, 20, 592, -651, 21, 457, -986, 19, 1290, -535, -778, 599, -239, -234, 884, -474, -689, 1173, 279, -1036, 541, 615, -332, 667, 88, -1150, 457, 946, -910, -297, 573, -624, -119, 480, -790, -82, 1139, -582, -975, 652, 54, -407, 575, -323, -676, 975, 193, -984, 630, 776, -423, 217, 223, -776, 458, 770, -787, -102, 740, -650, -464, 604, -172, -63, 604, -769, -721, 835, 59, -755, 108, -44, -466, 483, 19, -708, 577, 687, -464, 90, 478, -249, 266, 531, -457, -34, 563, -487, -327, 710, 45, -249, 211, -429, -375, 637, 20, -770, 66, -99, -535, 126, 141, -418, 276, 382, -503, 55, 469, -163, 36, 456, -224, -178, 279, -186, -91, 691, 96, -328, 167, 37, -47, 378, 15, -584, -81, 39, -355, -79, 53, -398, -34, 177, -246, -97, 297, -33, 38, 339, -77, -310, 139, 77, 63, 394, 39, -364, 125, 353, 97, 176, 4]
2349Dm30L46K01l07R7J25l55J20L12j78o1K57j35n3J50k32j76M74R3j63O3k13
2371f1j48N01K72l48j91j01j53K57K40k85j65N5q1Q0J92j54j71L13n9j70R4j77
2393b60jL47J13k55m6m7J27L97J94l81k67p0J03L60L9l67k17J19O9J10P7k00j32
2416a88J72J18j86p3q3O1K47l0k02j72K06J31L09l2l26j38J40K59J36n8l84j17
2438b10J02K28N0n1k03o6J92K8q7j92J03M1Q4j29k10j9J95K74J70j71l68L8K45
2461D4L27K3k21l86j0L54K21j17j52j89K9J84L6j64j00M6J3J16k08k58Q6K47K05
2484A26k1k96j86K47L29J17j31k89j82J90L16K00k67j66o1J78K30j45j53m5N3
2505D4j4J3k25j12J45J84j7j44j89J6K19L35n7l35k41M5L04L40l2l92j17J87K56
$$ y = [4, -426, -80, 121, -186, -89, 36, -319, -199, 113, -65, -126, 131, -4, -57, 93, -139, -315, 159, 252, 89, 152, -61, -209, 292, 564, 216, 25, -76, -229, 28, 268, -17, -182, -127, -208, -128, 64, -90, -261, 52, -7, -177, -83, -260, -261, 86, 199, -56, -102, -149, -22, 375, 569, 188, -79, -149, -46, 314, 353, -14, -231, -112, -43, 67, 144, -56, -188, -16, 102, -84, -157, -240, -179, 68, 38, -164, -336, -130, 1, 310, 278, -48, -186, -46, 213, 349, 291, -93, -210, -108, 120, 170, 119, -84, -150, 42, 70, -17, -209, -106, -65, 19, -110, -320, -339, -144, 130, 300, 129, -239, -201, 44, 371, 394, 173, -213, -223, 131, 352, 235, 83, -106, -77, 107, 143, -21, -121, -75, -62, 54, -154, -412, -326, -79, 126, 105, -191, -377, -130, 199, 316, 185, -104, -286, -96, 220, 420, 153, -13, -74, 104, 334, 189, 36, -9, 44, 30, 43, -182, -294, -149, 35, 18, -126, -315, -299, -80, 255, 198, -137, -378, -333, -29, 311, 279, -113, -230, -43, 213]
2528B13J16J6l08j3J55lk33K6p9l5K40p3k48N6K8M9L60j5n70j26L71O3K89r0o41
2553d52P9P00j23j09K27k81r8M40k27l34M61j93m08M61M8n15K46J48l61N72l7
2574B44r21K21P60k17lj3q18M19R87n40l45O27m46k01Q06m74l22Q14m72o16R72
2595D62j22q23O96J53o66P28k32j168Q81P92j015O2K58q83O89Q99j057LR27r10
2615c26j33J170o57l72R46q34l56J334m67j010J124Q8q52Q30l86r65J281M19j391
2634e57K72L14p65Q62N79j354K29Q47q57J35J033r71j78R88p68l12J101n36m97
2653d35J014l95n58R34m06p52J094J02r69K60Mm67R36L17j358J65O51l03L21J85
2673C40r20L40O88p07q6O61k45j65K94l28J44M85m50k68N51J73n34j51j00L19
$$ y = [213, 329, 345, 37, 24, 179, 176, -57, -31, -110, -145, 95, 22, -226, -170, -142, -93, 267, 252, -318, -444, -73, -10, 279, 189, -452, -373, 327, 204, 95, 322, 41, -57, 383, 156, -178, 283, 90, -318, 143, 191, -324, -78, 70, -291, 281, 244, -677, -456, 304, 87, 84, 71, -747, -328, 659, 119, -226, 401, -45, -246, 560, 86, -236, 578, 106, -510, 462, 340, -483, 213, 366, -300, 428, 196, -972, -91, 701, -314, -252, 6, -877, -188, 711, -346, -343, 584, -326, -459, 711, 54, -318, 628, -206, -562, 772, 305, -705, 419, 507, -345, 485, 99, -866, 415, 834, -557, -285, 29, -736, 126, 705, -649, -420, 427, -430, -295, 738, -233, -411, 577, -191, -503, 598, 62, -435, 579, 184, -374, 560, 154, -598, 496, 598, -371, -111, -107, -574, 362, 679, -679, -514, 137, -166, 155, 340, -580, -240, 448, -259, -345, 316, 71, -94, 200, -128, 16, 501, 51, -217, 334, 507, -27, -178, -278, 41]
2693D1N15m67o64J82N37Q1k60l13L28K14m53j27L39K12ml59l64P20N51q05k64
2714c60O55O5m2k29q40O70J272j007r74O68K26n6N65j020k79J442n15j386J117
2733b8N08p02L95m65q28J763L56k004O86J169r46K07K70j222J094J336k251l01
2751i63J820q13l26J140j335j58J873j442j165K270m92j444J387m50j082K079
2767H99k68k060J765O54k085J140Q01j728J244Q10k401Q17J938k146P1J828j725
2784d46j44J834j777m09K447j535j458K217p50j016J980q57j617K384r4k294J754
2801B19O93j788J328K51k281J756J418k437M67J521j791M65J540k077J64K024
2817A472j644r33J858r09n98J829j221j205K083l29j534J661r8j471J486N9j718
$$ y = [41, 556, 89, -575, -393, 144, 225, -35, -348, -20, 194, -259, -386, -47, 165, 161, -198, -562, 158, 709, -96, -360, 295, 360, 318, 89, -751, -81, 1191, 184, -790, -122, 104, 48, 613, -407, -686, 756, 241, -1145, -28, 480, -222, 173, -292, -1120, 643, 999, -1005, -319, 850, -96, 111, 381, -841, 253, 1589, -662, -963, 857, 44, -282, 858, -477, -635, 1238, -204, -1369, 901, 409, -1035, 352, -98, -1180, 899, 631, -1429, 336, 990, -1095, 45, 846, -882, 362, 1172, -1229, -412, 1526, -620, -549, 1279, -446, -590, 1244, -533, -942, 1505, -30, -1488, 729, -21, -1037, 943, 86, -1531, 853, 759, -1535, 219, 912, -876, 452, 703, -1578, 178, 1596, -841, -374, 1147, -644, -179, 1361, -716, -552, 1472, -172, -1105, 753, -156, -754, 1075, -146, -1351, 732, 403, -1131, 530, 432, -1039, 447, 506, -1212]
2834a212J379P03j620P90P66j579P76J080j503J89J069j311J3J309j088j99J149
2851G11r38m59J151n64o06J381n43r58R17q7n03Q54j54r26Q55K99p58L33L94n23
2871a24L43J81p51L00M97m07K1J10m49J81M09l34k6J34k34q4J93j27J57P4k69
2892b05%J07p8L42L1l11K05Q4k88K44P0l37K81J75m24M2J23k52L54L53p68J9L88
2915A55l15K93L38q89q8P12l93o4O62o11k98R09m22l90Q60k69n38P55j95p56Q35
2936B91N9p08P79Q2j084N71M01p06N03M06j270K17R24q63K18O86r70m5J043o60
2956a26k52R17p12l64J073m37p54R90j48o88J108k63j029Q46M18p92O15n7j161
2975h16O58Q15r68K01M77r64K59R28q53o1P92p77j00Q80n76l70Q08k95l98P86
$$ y = [-1212, 167, 870, -750, 40, 806, -773, 3, 1083, -420, -231, 838, -473, -460, 849, -239, -438, 711, -227, -686, 465, -99, -705, 676, 133, -825, 92, 5, -498, 356, 202, -724, 131, 430, -328, 5, 399, -124, 219, 400, -351, -51, 446, 39, 60, 170, -279, -98, 311, -23, -49, 85, -149, -233, -40, -167, -10, 64, -205, -205, -98, -176, 166, 197, -114, 91, 175, -113, 131, 201, -136, 145, 320, -104, -62, 61, -191, 163, 516, -252, -233, 155, -160, 133, 471, -418, -506, 206, -187, -251, 411, -200, -498, 411, -11, -401, 459, 190, -348, 407, 212, -544, 291, 350, -358, 421, 503, -581, -10, 391, -315, 188, 594, -676, -459, 465, -398, -180, 506, -464, -509, 534, -126, -378, 539, -173, -537, 536, 99, -655, 335, 187, -501, 607, 344, -685, 161, 579, -213, 402, 345, -816, -158, 657, -311, -110, 367, -597, -338, 590, -263, -324, 468, -309, -409, 471, -105, -475, 333, 38, -360, 426]
2995D26l06o88Q85J41n80L92j66p22P96L51p50J62J42n99M46N57o73M6L18m24
3015b46L8N19n67j18N75k38j02L51l74k31O98R3m12J83k07k72O90L7n07N5k9j30
3037a94L77K14n30q1K31j90J87J66m03k8L19j14m9O8j93J13M17j44j91k2n6M5
3059e8M30r4l19q1P7K0K84j03k49r2J43P4J63j23k88O4N5Q5k0j28o2J90J56K3
3083A47j97j31J04K20R3j08k45m4J13L34N5k78k16N3J48J89n6j66j97Q0Q5j0J0
3106a7j70KK01K3n1j06l7J29K06n2j26j51k9K38K56j76j28j16R7K47L1j15k99
3129a43O1N3Q2P4j63j30J17J12m2l6j33K5J33J23j61j32qK7K77Q2k70j47J12J81
3153I4J15M3k23q8J07M1nL1k06k1J47Q3j05q4l5j7L33j35k23m8M7J31J44o6l09
$$ y = [426, 120, -568, 317, 458, -122, 270, 104, -618, 178, 529, -221, -59, 83, -516, -70, 487, -186, -140, 178, -246, -208, 311, -256, -374, 201, -37, -139, 212, -162, -393, 305, 398, -14, 169, -38, -310, 380, 417, -90, -35, -64, -194, 183, 397, -133, -214, 17, -173, 14, 180, -223, -251, 68, -46, -95, -27, -220, -107, 310, 166, -25, -47, -103, -58, 372, 278, -41, -122, -45, -25, 259, 156, -93, -185, -42, 32, 195, 72, -216, -152, -97, -12, -32, -160, -222, -32, 124, 147, -50, -181, -77, 143, 236, 128, -117, -161, -48, 286, 341, 63, -153, -100, 48, 237, 181, 15, -182, -102, -17, -27, -17, -187, -185, 16, 39, -12, -118, -155, -26, 180, 128, 2, -149, -178, 60, 316, 140, 12, -104, -7, 240, 271, 156, -143, -82, -29, 53, 127, -36, -166, -49, 63, 21, -15, -148, -123, 10, 133, -28, -160, -168, -141, 136, 218, -52, -199, -87, 94, 209, 252, 29, -59, 48, 89, 84, 115, -91, -112, 35, 118, 13, -71, -106, -123, 210, 75, -148, -196, -149, -18, 126, 60, -249]
3178b49nK84K4J54k8l56KL39m7K4n1k59K7L03n9j54J7n8r9L24r1k72J01P2j3J82
3204A12j26l93L02J78k1J37o7l96J78L27j58J6N2l46N2M09j86k25K99k60j8M16
3226B82k57k86L25q0j48L19l06l16M21J79k18J84j27m23M33L93l35k2J8k52K36
3247B0L70m89j3K73j64j7K87k55j72L09j27j13K68k21l01M12jj81J63j70k21M22
3269G9J74l79qR8j18K03J00k45P7J49k19R4K39j89n6M4k2K5Q0k70o0K53Q3j99
3293f7m3j07J87K00p3j47q5R9P8l9L6n7ll8L1J14m4N3k8r2J84n0k84R2K61j87
3319iN2n3l43L14M18n08l0L02k93l5L48j89j03M14m11k16N60p0l50M09j06l81
3341b80O49j09o60N04J68n42L40J86p69M92M72p46K23M51p86K47O95p59j23P21
$$ y = [-249, -254, 30, 54, 208, 180, -176, -174, 165, 118, 142, 91, -168, -141, 162, 103, -51, -34, -92, -191, 133, 42, -230, -129, -57, -70, 112, -14, -407, -105, 73, 52, 189, 122, -274, -96, 231, 73, 89, 141, -205, -153, 256, 70, -155, 144, -116, -134, 282, 25, -261, 64, -16, -164, 155, -151, -467, -46, 133, -85, 99, -28, -451, -18, 375, 40, 18, 36, -216, 20, 390, -99, -112, 161, -3, -20, 267, 12, -160, 149, 22, -91, 177, -44, -345, 67, 66, -115, 48, -122, -343, 79, 253, -126, -134, -36, -154, 49, 149, -96, -19, 130, -89, 5, 244, 55, -1, 43, 21, 46, 126, -144, -204, 49, 132, -67, -110, -217, -30, 170, 97, -50, -135, -36, 42, 3, 39, -18, -21, -59, -28, 86, 42, 95, 67, -25, 159, 109, -175, -83, 178, -9, 43, -10, -353, -39, 379, -129, -159, 143, -150, -185, 163, -26, -129, 285, -126, -342, 218, 148, -202, 207, 101, -280, 369, 260, -400, 104, 272, -270, 70, 256, -513, -21, 451, -295, -72, 379, -407, -160, 535, -224, -347, 374]
3361C74o01j69J008o67m66R48l00o41Q89l31n85J065k25j042R59J93q51O61K06
3380D25j010P56N24j251M32P80j025J70O90j072J70J186r39m58J174o81k47J088
3398G12p29p63J435m33r47J108k04q52J170k7j182R15L31j121P57M14j274N64
3416a26P38j103K13Q92j077J67R60j032j48J208o98m43R40o97l83J323n33r03
3434g02J097r2q44R71k21r21J109J73j262O58M24p85M66L20j013M64P34r21M3
3453c02P62p09NP08p53j26R53o26l31Q10l80m00P34j58o02O85j39m63O12n6p38
3474e14N82J98m99K65P6m24M12K90o49J7L98j62j3J72m56J93L90l28p5K44q8j
3496B8N9k30M4L31k12j65J40o2R9K9j45K1K12k52MK02j52M0N8j41pR1k58J10M30
$$ y = [374, -227, -396, 612, -55, -521, 427, 127, -514, 375, 44, -541, 524, 299, -743, 216, 409, -442, 219, 425, -585, 171, 695, -556, -124, 656, -369, -199, 491, -581, -411, 775, -164, -622, 552, -129, -376, 712, -17, -780, 655, 222, -725, 383, 179, -673, 497, 470, -712, 203, 534, -587, 170, 584, -690, -126, 612, -491, -278, 614, -463, -296, 664, -368, -516, 692, -6, -449, 491, -206, -589, 734, 201, -702, 395, 303, -541, 430, 209, -712, 397, 570, -692, -34, 390, -395, 71, 391, -622, -158, 576, -345, -302, 460, -249, -244, 464, -289, -415, 538, -88, -419, 391, 11, -389, 345, 187, -415, 270, 131, -332, 280, 224, -514, 68, 266, -233, 32, 108, -316, 96, 386, -263, -246, 152, -10, -23, 149, -307, -114, 276, -52, -127, 117, 29, 28, 87, -143, -99, 232, 20, -145, -5, -67, 32, 61, -84, -63, 149, -103, -99, 103, -49, -9, 49, -92, -99, -8, -266, -156, 274]
3521B74k58j75J73j63J75K90m49j19M32j19j46K38k31p5M47j79l98M65r1l32L21
3542H0Rl61L08J37n12N31J11o50L00L03n06K64L56o13J16N76o20LN86m58k28O28
3564C60m02k20O26m25l34P54j98o13N91n5m51O48j18p38O16L05o48L62J65n71
3584c46L37M68q03K31N19o29P6N80o00n1N93n34o3O60l44n09O66k22k59N05k46
3605B9m60O19Nn06N12M3o45M60K19n41L39K17o57L35L97m94M3L34m36J27M02m78
3627a36j81N33k62j04L98l62j69M42j05k75M25j86k73L60J6l23K74K5m05M08J16
3648B16l97J43J31j58R6J18k68R0K19k00p0K20k92N1K81j58l3O9j19l2J67o2j26
3671a14J76q3l6J38o8j46J27J2m6J00p3j6N0O4p2Qj2j69J95J26j44j8j6o2J18
$$ y = [274, 16, -159, 14, -149, 26, 316, -133, -252, 180, 61, -85, 153, -78, -153, 294, 115, -283, 182, 91, -241, 80, 89, -272, 36, 173, -339, 192, 303, -347, -47, 256, -250, 14, 370, -243, -127, 449, -171, -168, 418, -40, -268, 360, -42, -262, 364, -61, -395, 359, 161, -452, 139, 84, -367, 281, 163, -575, 41, 346, -302, 60, 225, -346, -9, 459, -344, -113, 406, -223, -147, 433, -167, -218, 375, -159, -222, 438, 94, -415, 251, 29, -230, 275, 29, -431, 188, 193, -313, 199, 242, -403, 57, 276, -265, 74, 291, -366, -31, 366, -128, -85, 249, -187, -60, 342, -136, -317, 216, -46, -150, 248, -114, -283, 159, 54, -221, 204, 18, -255, 105, 121, -202, 72, 97, -308, 100, 216, -181, -38, 93, -65, 31, 149, -119, -29, 190, -10, -80, 140, -152, -101, 180, 22, -11, 58, -61, -93, 74, 12, -114, 62, -21, -57, 81, 13, -133, -6, 6, -40, 60, -13, -29, 21, 85, 13, 21, 9, -160, 35, 161, 17, -1, -17, -79, 39]
3696C9K6m3r5N3p9O7N4n1n6J09m8N2K6n5J6N3k6nj45L3O4J8L4m3M8r2N0J28nr5
3726C2o2Qq3K15m2j47M9m2K0N1K2j15P8P6j34J14j8j00R8K3J3j11M6j3KJ02o7
3753A5l6Pj02J21L0o8k9OPJ31j9q7mP0n1RJ3n1q3J92k2j6m5n6O3N0M3q0Rk1J4
3784A0K0rq7QR9m9P9J7j40k1J18K2l3q0KjJ13p1o7K1J4P5Qj0p5J8K3K8L8n5n4
3815c9m6J00j6NN7p4Q2p6J5M7j0o7M6L3q3m2M9mJ17j7j08M2K6J4k2J0l2p2lP2
3845DrqO2r7L3M4m8j9Q0o7M8op1p9J56jK0k5j01Q1P2l0J5n0J3p1N8M4k1Km3k8
3877d2J59j00N1p7O7m0K0o0q3R1m8J12j21R6p2RR1k4K0r5j1N4M1o3L2No0O3N8
3906G3n5Ql5n8O4J8Lo0RrJ02m5p4K4K4N5k3q9OK0K2O3l9J8o4MJ02j12J1Q6m7m1
$$ y = [39, 65, 22, -73, -20, -99, -32, 22, -29, -85, 24, -24, 28, 54, -1, 15, 68, 42, 37, -108, -75, -11, 7, 41, -2, 46, -46, 4, 132, 127, 32, -30, -22, -105, 110, 68, -79, -30, -72, -52, -1, 21, -94, -16, 60, -74, 40, 22, -78, 20, 43, 56, -55, -9, -22, -20, 82, 15, -21, -14, -116, 5, 35, -33, -62, -56, -49, 82, 63, -24, -28, 42, -9, 0, 13, -38, -121, 71, 49, 33, -12, -68, -5, 45, 88, 8, 17, -4, 10, 30, 21, -66, -58, 41, -8, 71, 88, -52, -73, 45, 67, 34, -46, -44, -45, 68, -3, -70, -49, -35, 40, 48, 38, -37, -19, 4, 32, 70, 15, -39, -85, 15, -1, 4, 61, -13, 69, -7, 8, 55, 45, -22, 24, 57, -26, -68, -19, -23, 94, 77, -31, 11, 37, 51, 29, 39, 7, -65, -68, 4, -5, -13, 49, -48, -15, 29, -19, -38, 42, -25, 23, 17, -54, -133, 23, 22, 42, 17, -84, -3, 69, 39, 54, 4, 17, -54, 4, 48, 27, 29, -14, -42, 117, 17, 68, -9, 58, 18, 38, -22, -105, -14, -62, 50, -71, 25, -47, -38, 53, 29, 49, -46, -57, -3, 38, -25, 7, 12, -48, 15, 73, 18, 26, -9, -67, -3, 15, 18, -42, -33, -42, 60, 15, -59, -35, -11, 44, 21, -68, -62, -42, -20, 43, 4, 22, -42, -38, 64, -48, -37, 49, 2, -39]
3938c9J01j6p8Q0Kj45J33L1j78J87j0j64J44oj19P2R0j38M4O4j37K6J19n6q5J12
3964C4p3m3J92j28j20J77j4j24J86p2j29K40q9j26J12j8j21J73J4j77R4J10k85
3987a87J99J12k57Q5K20j98K2K02k70L9J70j81q0L06j91j42K40q6j27K17k0j88
4009a15K51q5k05J39K1j71K50P0l24J03K93l08Q2L5j22M1K91l54j0K18j17n6K26
4032A53j98p6L26k22j04J90kk02K58j16j37K18l3j47J65K5k41J56J29j72N7Pj59
4055a25O8J19l7p3J76j48K6J24k10M0K64j67k35K27ln6J07j61j53K58N7k16R8
4078b0L3J0K9m7j20J07P9q4M5M7j29J23l0j22P6J31q1j00J06q1J6rJ6K3M7j36
4104g1R9L1o5N8n4k4N3k5q0P2j8kN2k4k0QO9j12L0J17j03J5Mj4k7J12j29k9J41
$$ y = [-39, 62, 46, -32, 48, 50, -95, 38, 69, -109, 78, 68, -96, 48, 42, -77, -5, 85, -53, -9, 55, -82, -56, 63, 7, -78, 34, -39, -82, 110, -18, -138, 39, 25, -99, 87, 15, -114, 126, 37, -89, 23, 5, -116, 57, 71, -106, -12, 98, -187, 12, 124, -133, -48, 172, -26, -4, 198, -72, -33, 137, -44, -124, 182, -9, -151, 89, 3, -124, 93, 73, -115, 136, 51, -154, -15, 6, -165, 85, 155, -169, -66, 227, -81, 1, 36, -86, -45, 246, -108, -118, 100, -17, -73, 153, -45, -121, 205, -17, -121, 69, 67, -135, 123, 7, -130, 88, 55, -92, 73, 98, -143, 13, 142, -30, 27, 34, -125, -57, 62, 25, -48, 128, -20, 6, 130, -80, -40, 224, 57, -178, 49, 46, -10, 97, -64, -217, 41, 98, -118, -20, 13, 23, 52, 5, -115, -8, 71, -13, 32, 79, -50, 73, 43, -79, -3, 128, 47, -53, 53, -28, -12, -21, -5, 18, 65, -71, 28, 59, -6, 52, -2, -26, 27, 2, -78, -6, -24, -26, 26, 2, -18, -10, 59, -53, -23, 94, -9, 6, 10, -4, -31, 81, -48, -77, 64]
4133F4j12j3J95j38j11J66l5j06J92j12j07K14nj73J13J7j87K68q4j46J38J22
4155A60k38Q1M4j64J60J16k60L4K24j78j06J70r0j9J64j71j19K98p0j28J60k5
4177D3j08J05J6j49J83j58j40J56J36k85J86J03j27J1K14k42o6K28k16L5J44j35
4199f6K5J71k07o0L05o4j81J30qj08K05n8k30K13J07l14J79L8j81J69L3k05R4
4222a3J97k87L0J98k09N1J46j86k3K45j63q0J78n4o2R5q7j11K67j01j14P7Q7j24
4246d3J26o9o0J49j2j30MJ00j24M7P7r1L8J36j75M3J29j41o2J05p0K3L8q6n7J89
4272H4k1j58J21M6o4L9o1j1P4nk8o7K9M2m8pO1JK1j9n9L3J6J0L4j02K4M0o8Q6
4302D3n4j5L1K1o4Rl4P2J7j9Lm4K6l2O0l2k8O7M5q3rJ9oP7j5j37P9L4k5l3L4K0
$$ y = [64, -48, -61, 134, -4, -115, 51, 16, -90, 102, -10, -117, 97, 92, -81, 32, 49, -138, 130, 46, -100, 38, 160, -78, 3, 47, -117, 43, 159, -101, -67, 157, -21, -127, 43, -47, -66, 98, -73, -192, 106, 36, -92, 68, 43, -65, 40, 56, -93, 90, -68, -208, -52, 84, -201, -15, 88, -39, -28, 186, -56, -122, 106, -110, -75, 69, -66, -41, 130, -77, -137, 168, 104, -77, 53, 45, -63, 142, 84, -146, 67, 174, -140, 39, 77, -104, 65, 98, -107, -13, 184, -103, -73, 125, -84, -33, 113, -73, -96, 149, -14, -94, 84, 30, -32, 63, -24, -135, 132, 31, -83, -6, 81, -43, 83, 14, -46, 103, 91, -39, -35, 65, -59, -12, 65, -26, 12, 148, -27, 16, 145, 4, -58, 47, -23, 0, 38, -48, -105, 84, 63, -95, 26, 72, 8, 47, -14, -25, 49, 44, 16, -51, -22, 20, -28, -35, 26, 27, 48, 29, -30, 3, 19, 29, 63, -39, -15, 25, -43, 43, -11, -26, 5, 26, -38, -29, -63, 9, 26, 7, 10, -34, -8, -40, 20, -12, -40, 27, 72, -11, -20, -1, -7, 70, 55, -82, -3, 31, 6, -27, 7, 27]
4334B7j3N4q0K6n9Pj8O4Mj6K2J8o9M5O8q8KL2n0K6Pq1J6R9r7N1Q0o6j2L1rNk7
4367al8K4j1Nl0P9No6O5kn2N6m3LQ6r4k0J6P5k1p3P3k9J1R4j18lL8o2NM5k5l8
4400d6P3j4j4qk0M6Nn8J6O1m7k1jN3n7K5j3N4l2j6M8k2K2j01J8L0K5k9N2k8J0
4431A1K7r3M4O2k0m6J7rj4N3k2J1Jl1K0J3o2O1j4j5j1k3O9j8L3m9lkk5L4l7N4
4463A6kk7N1K9p9L7q8RL0Mn1K0NQ8o8P4o4pn1K6N8o0J3K0rO7mn2J8M5j4l8qL7
4497B5k1K6o6K7L8o5K9m1Q6j01J00n4Q7j53J06l1k2O8mKj8N4j16P5j00J06n0L6
4525B3j0Mj6l9%j3L7R4j10O3MLk1m0J5M3m4PN4M0q9pl1Q6q0k2L0J2L0jj2j0Oj0
4559dRl2K0L1l9l3N1k5j8J05p9l6M0M4k2m5L6o7O0M5op9J07o4K4n9J2RO0n6JO4
$$ y = [27, 14, 68, -12, 14, -45, -38, -56, 8, 12, -4, 18, 36, -33, 12, 80, -8, -6, 26, -24, 2, 9, -72, -56, 43, -54, -3, 77, 11, -1, 30, 21, 26, -1, -39, -15, -26, -21, -51, 28, 33, -33, 32, 30, -22, 34, -9, -6, 80, -14, -34, -18, 57, 36, -37, 36, 7, 18, 112, -6, -9, 29, -33, -28, 17, -8, -46, 27, 13, -1, -9, -29, 17, 22, -36, -20, 41, -6, -27, -28, 25, -32, -7, -20, 34, 2, -14, 34, 12, 34, -67, -49, -19, 6, -23, 29, 1, 11, 38, -55, -11, 51, 31, -15, 2, -7, -21, 32, 10, 21, 22, -9, 11, 24, -38, 23, 9, -6, -17, -40, 29, 11, 44, -5, -8, -10, -35, -1, -38, 16, 14, -13, 38, 67, -12, 25, -63, -54, -24, -20, -71, -51, -46, 42, -26, 48, -16, -23, -74, -48, 10, -50, -37, -17, -26, 41, 37, -15, 3, 48, 34, -4, -12, 25, 4, 30, -36, -9, 29, -36, -7, -48, 38, -63, 37, -17, 70, -83, 23, -8, -30, 38, 34, 36, 18, 72, -44, 31, -69, 37, -13, 23, 13, 17, 1, -38, -38, -51, -14, 80, -30, 33, 37, 40, 19, -21, -6, 37, -7, 0, 54, 94, 5, -2, -33, 53, -27, -49, -19, -7, 23, 22, 10, 0, 6, -4, 5, -27, -7, 24, -15, -48, 3, -22, -40, 65, -14, -50, -10, 34, 12, -33, 3, -64, -4, 41, 35, -44, 63, -1, 23, -36, -24, -15, 45, -11, -10, 54]
4591E4j4n0J4N8j32R0Kl7J2j2J0M6Nq6R0J6m7k7Nj7O2n8l3O1j9k5oP9n5Oll8r
4624e8J5L5o3J9J01p9L9M3n6M1N6j10L5l0qOM2n4J8Pk1K8O8j56Q4J00j29J8k2
4653c1K1q2J36q4K0N9k2m6L0K8o4O6J3j08K5R0n3K2m8j1N7L1q1O0J2o6LQ5q6m
4683b8L5j26J09mo2O2PN6q5K6m5O3mL7o1K0J2j27J65r5l6J34n6j5K8m6K4K4L6
4712D8j72O5MM0O5K5l4J1l4j16J08K0j8l4J1q8J24P9j68P1J5l9qQ7j02K6N7j03
4740f0LQ5o9O2j5l7J0R2j37K1J65j53J5J01j83P5J03q4p4J51rj15M4O0j55J70
4766F6%j25K3J25j16LP6j16J80j05r2O9J43j27m4L9q5P4J35j66J0J23j02l0J42
4791A00j01m0J92k19p1K36n1j83J65nj61K06k9j72K06J4j96J66Kj46K05k8j85
$$ y = [54, 40, -10, 4, 62, -70, 20, 22, -15, -3, -15, -5, 41, 46, -40, 50, 66, 19, -8, -3, -20, 42, -16, -49, 12, -7, -32, -38, 41, -14, -8, -11, -49, -58, -43, -8, -71, -52, 49, -30, 9, 52, -4, 37, 93, -17, 18, -12, -20, -14, 28, -26, -8, -1, -22, 6, 74, -82, 2, 102, -27, -9, -31, -10, -92, 44, -40, -20, 39, 17, -29, 1, 29, -35, 31, 44, -64, -39, 51, -2, 20, -28, -39, 18, 49, -32, 28, 40, -26, -23, 62, -24, -28, 7, -119, -10, -14, -76, -14, -7, 49, -36, -10, -55, 8, 4, 41, -20, 0, 12, -115, 50, -45, -81, 53, -3, -18, 10, -36, -12, 12, 48, -124, -59, -55, -15, 50, 75, 41, 52, 18, -98, 10, 30, 12, -22, -11, -99, 25, 104, -64, 7, 22, -17, -25, 62, -40, -14, 43, -60, -57, 28, -41, 21, 6, -31, -21, 71, -66, -45, 120, -33, -18, 83, -100, -25, 78, -6, -80, 71, 62, -53, -9, 51, -104, 66, 66, -59, -36, 89, -27, -24, 52, -64, 116, 11, -81, -12, 131, 4, -40, -1, -86, -12, 123, -43, -33, 90, -12, -42, 100, -1, -41, 151, -68, -139, 97, 46, -137, 28, 23, -138, 68, 39, -133, 73, 87, -109, 57, 59, -87, 118, 90, -95]
4814i5Q5J12j55p0K54k58O4K25j92k8J89j54j00K74k12KK19j97o8K03k2j52J77
4837A01j05j75K34L8k22J25O1j87J59N2k05J08J54k70P3J64j27L4J30k42M5J72
4859A17j46l5J39j66k8K26r7j04J70j81j6K19j02j33J86m6m9P0O9j71J45M2j93
4882h4M0R6k7m4J08j51P2R0j37m5J73j46M3Q7k17O1J53l2r4J05j41J17M2o1r7
4907h9J53n0j35Q0k3l5J16J4m7L6k3n4R6K6q2LO1r4P0m2o8J43L4k10J12O8j27
4934f7J08J26j91L5P9j00j7O1p8R8M3j41PJ12j08J8M8j03J8J74j34m6J33r8l9
4959f2Q3n9j1J47n4j56J29n3k1Q8o0j9R3Mj05J34Jr7O6k1p4P2Q9k22Q8R0j88J21
4987CR7j88J04Q9j46p4J62j14k1J35q8m5J27m7o3J85q8j43J57j8j40J76J1j12
$$ y = [-95, -10, 102, -53, -123, 131, -127, -63, 162, -30, -58, 131, -23, -123, 151, -61, -59, 160, -37, -105, 98, 76, -76, 101, -4, -179, 55, 93, -129, -4, 57, -130, 29, 81, -124, -16, 138, -132, -59, 105, -22, 12, 142, -100, -55, 117, -29, -64, 75, -91, -119, 107, 10, -94, 76, -105, -121, 98, -4, -137, 49, 3, -46, 24, 93, -78, 67, 109, -84, -44, 52, 25, -19, 89, -62, 10, 100, -37, -82, 91, -55, -12, 75, -142, -81, 72, 40, -54, 51, -90, 27, 69, 8, -89, 64, 14, -121, -41, -64, -99, 17, 31, -16, 20, -3, -57, 39, 65, -17, -14, 47, -47, 23, -19, -87, 56, 90, -120, -8, 60, -67, 41, 167, -24, 11, 90, -10, -27, 34, -44, 54, 97, -44, -37, 75, -33, -15, 33, -70, -52, 122, -12, -58, 75, -23, -62, 21, -38, -49, 98, 44, -112, 17, -36, -57, 31, -29, -48, 45, 49, -56, 78, 79, -18, 48, 27, -47, 25, 114, -108, -20, 70, -118, 3, 100, -88, 16, 105, -41, -115, 47, -67, -88, 47, -41, -86, 41, -6, -69, 116, 28, -115, 42, 24, -116, 60, 71, -41]
5011d1O2Lo2M6O8j55R1J76k80L4J90j73l6J09r4m9J86j47NJ98j76k0Q9j8l8J26
5037I4j10j05J12k4q5J48O8l8l0K5r1N4pk2l1R6j71P5O6j01P9nr9P7J16l3p8J07
5065H7j81N5J25j7j56J28l5o1J07j16J8J12j6j50J45o1k9pK5J5OPj9j2J5j0JJ
5093b3j2J4qLL8O7q6k3Q7k5J8o4K5M4L8j32O2l0J4oJ0l1K1M6j09M2nQO9q8OL5
5125Ek9KL4n8O5N2k1m3l8R7j07O5j4J4Nj4l5l2KK3qJ6J6m7L0m4N7N8o0m6J4M9
5157HP5r6k9L8n9M9k5Q1Ql7j5J1p0O3K5L2qk1l0m4O9m2k5L8r7J50q6KL0RN3j27
5189g0J16k1k9M7k7q8L9Q2m3l4Q2j22J0J36k7q8N8no3O3l7J2K4K8o5Q8n5q7R1
5218A5M4p1oRm4O2j1k9M6L7k6l6l1oJ2N2L6j45J45r8J5O1l8j3J5M4r4Q4l3o1O0
$$ y = [-41, 21, 24, -38, 8, 76, -79, 12, 188, -92, -58, 132, -41, -77, 32, -62, -111, 75, -72, -67, 131, -45, -65, 24, 6, -32, 94, -16, -121, -9, -33, -118, 30, 98, 60, 30, 55, -36, 18, 11, -11, -42, 54, -117, -42, 24, -77, 2, -3, -102, -25, 91, 58, -20, 87, -94, -39, 86, 69, -87, 41, 6, -55, 52, -64, -46, 66, 50, -100, 45, -16, -45, -52, -27, -12, -6, 1, -18, -30, -15, -25, -24, -23, -35, -21, -29, -26, 12, 79, -7, -30, 57, 32, 50, -14, 11, 55, 93, -39, 23, -7, 7, 1, 11, -20, 1, 47, -62, -20, -25, -17, 52, -36, -30, 5, -24, -22, 12, -46, 19, 71, 50, 7, -31, 66, -41, 24, 10, 24, 29, 15, -20, -52, -50, -27, -35, -19, -3, -50, -20, -64, -7, 51, -9, -55, -41, 8, 83, -13, -42, -4, -63, -14, -39, 42, 50, 13, -2, 9, -61, 2, 27, 59, 51, 30, 0, -44, 25, -17, -42, -4, -101, 49, -37, -35, -5, 4, 57, -70, 46, 25, -4, 43, 16, -72, -33, 49, 6, -28, 54, -68, -58, 78, 51, -37, 21, 16, -47, 16, -21, -9, 15, 43, -22, 66, 11, -76, 15, 59, -12, -18, -9, -53, 9, -2, -31, 15, 52, 26, -10, -41, -47, -35, 17, 53, -92, 53, -45, -30, 31, -7, -20, -5, 39, -55, 29, -4, -65, -5]
5249eomm9R7q0N8N5q1J5L2M2p2L3n6kN6p0j3J70j29J8K2MJ3M1j10j1L4j0r9J61
5280E4lm2m4P1m2K3L2n0L3ll9l1R0o8K5L1r3L3L9M3m1M0r8j9J2j2L0J6M6m5m0
5311e2l3P2J6J0l0L5j6kj1ml1M3M7r0O5M2p2oK5m4K5J4k2ORj3Rl1N5Lk4pL4j14
5345i2K3J43l4q2P0j4n9nO0j09J38N0j79J25N3k05J87m1r6J6P3r1k9K06j98lJ73
5372H0r7k7J41n7r1R6j40m6K59r0j75K54l0j77K91r4k11J57N2k67J45J25j97J01
5396BJ37k94N2K39j73k0K38k89K5K42k64j03M02k01j45K42q1k31M72j40l58L60
5418A12L8l54K97jk99K65K05m34N2L24l78J77J94l24o9L86k74o4L59l09k6L37
5440B14k07j88L48r0k87L85j27k68L87j3l44K95N8l03J81P2l50J85K80l18k4K44
$$ y = [-5, -11, -15, -64, 33, -47, 11, 66, -15, 0, 32, 74, 2, 35, -21, -23, 33, -37, -50, 120, -9, 9, 31, 35, 48, 89, -21, -32, 2, -8, -107, 54, 51, 9, -35, 36, -6, 17, 49, -1, 32, 29, -10, -41, 49, -19, 6, 37, -56, -23, 16, 59, 18, 58, -40, -59, -47, -59, -29, -13, 33, -12, -52, -85, -13, 3, 13, -17, 18, 2, 0, -11, -15, -46, -3, 44, -46, 19, 61, -11, -17, 8, -36, -11, 3, -19, -13, -4, -17, -8, -39, 16, 19, -5, -12, 22, -92, -69, 74, 40, -42, 28, 14, -45, -50, 10, -99, 39, 89, -90, 35, 88, -117, 70, 29, -67, -51, 22, -69, -98, 108, -90, -93, 80, -17, -44, 97, 40, -51, 45, -95, -141, 118, 28, -147, 107, 77, -100, 191, 97, -114, 43, 95, -172, -27, 98, -99, 2, 139, -155, -103, 136, -37, -57, 181, -108, -83, 159, -105, -208, 194, -7, -152, 90, 9, -222, 250, 110, -248, 112, 150, -204, 93, 92, -207, 58, 263, -171, -119, 205, -173, 4, 198, -126, -195, 191, -83, -147, 212, -97, -123, 214, 7, -181, 167, 77, -210, 175, 48, -220, 167, 154, -190, 105, 163, -140, 41, 113, -237, -52, 228, -90, -114, 130]
5462A30l25J59K37l60q0M05j95q9K99k55j26L79p4k92K25P3k12J83j4k80J87K22
5484A97k60Q0K6j46J06N9j16k3J81j53p2J65r0j4J61q5j47J73p7o4J97p7j47J70
5508D4J01k23L1Q7J3M0p5j62J20J55oj55j0n9Q0P1j2j38N5J22l2j03oJ4JP8o9
5535c8j9R8Lr0P3k1K8jOq9P1O5k9r2J00j40L8K22j66j44O3K1J2J30m7k41K06M8
5563F7j48M4Q3j29J45N2k17K0J77j25L1J27k50j4K37q1j31K11j75o4K75j38j55
5586a58K27Qk06J70kj94K19P5l34K30J58k41K2J05k31J55K28l58J1L10j47r6J99
5609A50k41n6L21j13j92K82j70j10K04Jk41J84O4k76J87J87l72J37K84k78J12
5630F4L6k25Q8K85k82j15K88j35j17K15j62o2K54j71k01L41J7k02J13n8j73K47
$$ y = [130, -195, -36, 201, -159, -239, 166, -29, -118, 181, -74, -200, 179, 105, -187, 38, 111, -101, 82, 68, -212, -25, 197, -63, 17, 43, -103, 3, 62, -54, -77, 104, -49, -121, 44, -46, -60, 101, 16, -131, 42, -35, -99, 98, 21, -126, 44, 145, -78, -47, 40, 53, 93, 18, -144, -24, 131, 125, -30, -40, -99, -19, 52, 40, -98, -43, 79, 47, -56, -62, -48, -47, 31, -38, -57, 41, 44, -46, 27, 6, 34, 33, 39, -50, 21, 86, 57, -35, 65, -75, -37, 185, 19, -125, -62, -41, -29, 101, 54, -187, 19, 67, -81, -37, 46, -83, 62, 114, -103, -83, 94, -31, 0, 127, -123, -137, 100, 19, -112, 99, -76, -140, 135, -3, -158, 69, 77, -129, 41, 39, -155, 64, 139, -195, 35, 193, -48, -26, 79, -152, 3, 231, -127, -116, 194, 47, -49, 150, -91, -147, 174, 61, -131, 151, -19, -129, 75, 76, -165, 19, 83, -193, -6, 181, -191, -54, 230, -48, 64, 100, -125, -37, 248, -34, -149, 139, 4, -113, 102, -60, -122, 132, -39, -240, 101, 118, -84, 29, -29, -202, 45]
5652D5J05k98Q8J95j73L2P4k18J02K33j80p6J74j57QJ36n0j14K37j52r0J90n4
5675E7j48R3J5p0O0J7j20J90j6k51J37J07j10K1N4p2K8L9q4L9Q7K8j66P4m2J8
5701a5J48j31l3O6kq1L9oo9Q6ol7m1M6mK3M5l0p4R5J4o6L1k9j7J7J07J2j31R0
5731D7p3K3J9m9N7m3lM9k9L0%q6N9K0qj4n6M5P0j04J6ol9J09L4p0l5K2KQJ8R4
5763A07j26L4o4N3J0kj8j4Q7k1m0J2Mm6m3N5mnOl0J01o5%l6Q8o2l2J64j51PM2
5794A1k4PK3M2n2J5r4L6N0m0j8K3rM3K0o3j4J32o6r3L1O0M6j1L1j49J5J03k6j4
5824A5K6l9n4J08o3K6K2Nk9Nn3rj8P0L9l4r9J1P0R%L2l9n3J20p1L7j3K3p4K3K1
5856A4k9M8L8m2Pm5Nj6P3J3o0ln9L5Qk0JnM2o6j0P3No8J2L5K7O6l4l8K4l3nmM7
$$ y = [45, 150, -148, -60, 135, -38, -6, 68, -150, -48, 185, 5, -71, 103, -54, -46, 90, 40, -74, 163, 11, -79, 111, 57, -91, 2, 17, -53, 7, 24, -96, 94, 78, -173, -36, 71, -39, -18, 36, -36, -8, 31, -53, -14, 73, 101, -65, 9, -33, -15, 133, 2, -31, 35, 33, -48, -9, -15, -84, 2, -4, -41, -82, -36, -40, -17, 28, -2, -76, 19, 33, -33, -2, -31, -48, -31, 76, 88, -43, 47, -26, -3, 16, -33, 24, -19, -22, 27, -2, 28, 28, -58, 1, 21, 13, -1, -57, -12, 58, -46, -30, -36, -75, 34, 68, -2, -37, -15, -13, -5, 13, 107, -19, 15, -49, 4, 14, 12, -6, -20, 67, 46, 6, 18, 22, -24, -67, -12, -16, -21, -15, -45, 56, -9, -9, -45, 43, -19, -51, 113, -38, -31, 11, -13, -6, 17, 59, 7, 22, -72, -36, 14, -26, -44, -21, -30, 13, 33, -30, -44, 88, 22, -71, -40, 20, 66, 55, 86, -63, -48, 55, 29, 15, 41, 2, -52, 56, -7, 19, 41, 46, 17, 22, -31, -40, -58, 12, 51, 17, -82, -71, -1, 8, 8, 40, 1, -52, 68, -3, 34, 21, 44, -30, -7, 14, -15, 33, 71, 29, 36, -9, -4, -20, 53, 66, 6, 3, -56, -21, -13, -33, -32, -37, 5, -61, -71, 2, 7, -61, -49, -14, 13, 79, 45, 7, 31, -2, -7, -11, 36]
5891C6n1L8j07N3J0J2K2%J8m6N7q7K5OL7nl5J5p0O2K7j4j7j3K5J4J1l4J6M2m6
5922Ak1M0K9m8J5L5p1j9J2L2l5O5l0k9O9n1M6lk6j6K6M6n4k7L9Qk7k5L5K7K0m6
5954A7j6k7N4p7R3k0m9O4p3o0P4N2r1Q4M8o8j2J8oj1P5p6k4K4j6L6M8p4pJ16r1
5985En0L7nk9P0l9o7N4Qm6O4P6j14R3J8l7J9J6j37P8Nj1j1K2r2Q1Q5p3k2R4r5
6016cm8N1lk6Q1r2m3J25jj52P3N2JM3m7k08J66J72j41m3O9o1l9K53k16l6J49o
6044G0j17J22k7j72J45M4j64J21k0r3P1J14j07J9N0j11OJ95j58m7J05r7m9K11
$$ y = [36, -15, 23, -84, -31, -21, -9, 13, 13, 31, -15, 42, -45, -20, -14, 23, 18, -17, -2, -72, -10, 17, 3, -14, -27, -2, 12, 23, -11, 5, 47, 1, -20, 20, 49, 1, 16, 51, -20, -39, -27, 5, -30, 35, 5, -24, 45, -6, 40, 37, 11, -5, 21, 67, 13, -14, 25, 33, 6, -19, 16, 43, 63, 17, 1, -26, 28, -49, 44, 24, -25, 39, -34, -94, -20, 32, -59, 25, 73, 5, -7, 11, 5, -6, 69, -7, -31, -7, -23, 13, 61, -13, -20, 96, 5, -45, -8, -13, -42, 28, -11, -78, -24, -16, -62, 2, 78, -36, 57, 75, 38, 57, 73, -64, 14, 19, 8, -3, 19, -73, 8, 93, 20, -2, 92, -3, -51, 0, -3, -29, 52, -40, -83, 42, 41, -111, -38, 14, 15, 58, 11, -197, -31, 141, 0, -43, 26, -35, -74, 179, -37, -73, 76, 70, -47, 75, 48, -124, 21, 65, -99, 22, 2, -91, -20, 94, -13, 6, 56, -55, -49, 146, -12, -59, 46, -51, -100, 111]
$$ [...]
8191G2
##END NTUPLES=NMR FID
##END=
