##TITLE=1H_DE-64_EXT3
 CDCl3
 8 sc, 
 13.9.2024
##JCAMPDX= 6.0         $$ Bruker NMR JCAMP-DX V2.0
##DATA TYPE= NMR FID
##DATA CLASS= NTUPLES
##ORIGIN= UXNMR, Bruker Analytische Messtechnik GmbH
##OWNER= root
$$ XWIN-NMR		Version 3.5
$$ Fri Sep 13 14:18:24 2024 Russian Standard Time (UT+4h)  she@DPX200
##.OBSERVE FREQUENCY= 200.1318
##.OBSERVE NUCLEUS= ^1H
##.DELAY= (6, 6)
##.ACQUISITION MODE= SIMULTANEOUS
##.ACQUISITION SCHEME= undefined
##.AVERAGES= 8
##.DIGITISER RES= 18
##SPECTROMETER/DATA SYSTEM= spect
##.PULSE SEQUENCE= zg30
##.SOLVENT NAME= CDCl3
##.SHIFT REFERENCE= (INTERNAL, CDCl3, 0, 15.7039)
##AUDIT TRAIL= $$ (NUMBER, WHEN, WHO, WHERE, WHAT)
$$ ##TITLE= Audit trail, XWIN-NMR		Version 3.5
$$ ##JCAMPDX= 5.01
$$ ##ORIGIN= Bruker BioSpin GmbH
$$ ##OWNER= she
$$ F:/spectra/data/she/nmr/H-F/1/audita.txt
$$ ##AUDIT TRAIL=  $$ (NUMBER, WHEN, WHO, WHERE, WHAT)
(   1,<2024-09-13 14:17:04.78 +0400>,<she>,<DPX200>,
      <created by zg, POWCHK disabled, PULCHK disabled
       configuration hash MD5:
       00 E9 B6 7A A2 85 ED C7 34 08 36 98 17 FE 4E 26
       data hash MD5: 16K
       14 24 E1 94 46 2E 13 CC 98 CB D1 DF 40 33 76 C6>)
$$ ##END=
$$ 
$$ hash MD5
$$ 78 4F 9B 45 16 78 F5 67 95 C4 55 E2 1B C1 CB 5A
##$RELAX= 
##$RELAX= 
##$RELAX= 
##$RELAX= 
##$RELAX= 
##$RELAX= 
$$ Bruker specific parameters
$$ --------------------------
##$DU= <F:/spectra>
##$EXPNO= 1
##$NAME= <H-F>
##$PROCNO= 1
##$TYPE= <nmr>
##$USER= <she>
##$AMP= (0..31)
100 100 100 100 100 100 100 100 100 100 100 100 100 100 100 100 100 100 
100 100 100 100 100 100 100 100 100 100 100 100 100 100 
##$AQSEQ= 0
##$AQ_mod= 1
##$AUNM= <au_zg>
##$AUTOPOS= <>
##$BF1= 200.13
##$BF2= 200.13
##$BF3= 200.13
##$BF4= 200.13
##$BF5= 200.13
##$BF6= 200.13
##$BF7= 200.13
##$BF8= 200.13
##$BYTORDA= 1
##$CFDGTYP= 0
##$CFRGTYP= 5
##$CHEMSTR= <none>
##$CNST= (0..31)
1 1 145 1 1 1 1 1 1 1 1 1 1 1 1 1 1 1 1 1 1 1 1 1 1 1 1 1 1 1 1 1 
##$CPDPRG= <>
##$CPDPRG1= <>
##$CPDPRG2= <>
##$CPDPRG3= <>
##$CPDPRG4= <mlev>
##$CPDPRG5= <mlev>
##$CPDPRG6= <mlev>
##$CPDPRG7= <mlev>
##$CPDPRG8= <mlev>
##$CPDPRGB= <>
##$CPDPRGT= <>
##$D= (0..31)
0 1.2 0 0 0 0 0 0 0 0.06 0 0.03 0 0 0 0 0.0002 0 0 0 0 0 0 0 0 0 0 0 0 
0 0 0 
##$DATE= 1726222624
##$DBL= (0..7)
120 120 120 120 120 120 120 120 
##$DBP= (0..7)
150 150 150 150 150 150 150 150 
##$DBP07= 0
##$DBPNAM0= <>
##$DBPNAM1= <>
##$DBPNAM2= <>
##$DBPNAM3= <>
##$DBPNAM4= <>
##$DBPNAM5= <>
##$DBPNAM6= <>
##$DBPNAM7= <>
##$DBPOAL= (0..7)
0.5 0.5 0.5 0.5 0.5 0.5 0.5 0.5 
##$DBPOFFS= (0..7)
0 0 0 0 0 0 0 0 
##$DE= 6
##$DECBNUC= <off>
##$DECIM= 24
##$DECNUC= <off>
##$DECSTAT= 4
##$DIGMOD= 1
##$DIGTYP= 9
##$DL= (0..7)
0 120 120 120 120 120 120 120 
##$DP= (0..7)
150 150 150 150 150 150 150 150 
##$DP07= 0
##$DPNAME0= <>
##$DPNAME1= <>
##$DPNAME2= <>
##$DPNAME3= <>
##$DPNAME4= <>
##$DPNAME5= <>
##$DPNAME6= <>
##$DPNAME7= <>
##$DPOAL= (0..7)
0.5 0.5 0.5 0.5 0.5 0.5 0.5 0.5 
##$DPOFFS= (0..7)
0 0 0 0 0 0 0 0 
##$DQDMODE= 0
##$DR= 18
##$DS= 0
##$DSLIST= <SSSSSSSSSSSSSSS>
$$ [...]
##$SUBNAM2= <"">
##$SUBNAM3= <"">
##$SUBNAM4= <"">
##$SUBNAM5= <"">
##$SUBNAM6= <"">
##$SUBNAM7= <"">
##$SUBNAM8= <"">
##$SUBNAM9= <"">
##$SW= 24.0689170037331
##$SWIBOX= (0..15)
0 0 2 0 0 0 0 0 0 0 0 0 0 0 0 0 
##$SW_h= 4816.95568400771
##$TD= 16384
##$TD0= 1
##$TE= 0
##$TE2= 300
##$TE3= 300
##$TEG= 300
##$TL= (0..7)
0 120 120 120 120 120 120 120 
##$TP= (0..7)
150 150 150 150 150 150 150 150 
##$TP07= 0
##$TPNAME0= <>
##$TPNAME1= <>
##$TPNAME2= <>
##$TPNAME3= <>
##$TPNAME4= <>
##$TPNAME5= <>
##$TPNAME6= <>
##$TPNAME7= <>
##$TPOAL= (0..7)
0.5 0.5 0.5 0.5 0.5 0.5 0.5 0.5 
##$TPOFFS= (0..7)
0 0 0 0 0 0 0 0 
##$TUNHIN= 0
##$TUNHOUT= 0
##$TUNXOUT= 0
##$USERA1= <user>
##$USERA2= <user>
##$USERA3= <user>
##$USERA4= <user>
##$USERA5= <user>
##$V9= 5
##$VALIST= <valist>
##$VCLIST= <CCCCCCCCCCCCCCC>
##$VD= 0
##$VDLIST= <DDDDDDDDDDDDDDD>
##$VPLIST= <PPPPPPPPPPPPPPP>
##$VTLIST= <TTTTTTTTTTTTTTT>
##$WBST= 1024
##$WBSW= 4
##$XGAIN= (0..3)
0 0 0 0 
##$XL= 0
##$YL= 0
##$YMAX_a= 711584
##$YMIN_a= -702137
##$ZGOPTNS= <>
##$ZL1= 120
##$ZL2= 120
##$ZL3= 120
##$ZL4= 120
##$ABSF1= 10
##$ABSF2= 0
##$ABSG= 5
##$ABSL= 3
##$ALPHA= 0
##$AQORDER= 0
##$ASSFAC= 0
##$ASSFACI= 0
##$ASSFACX= 0
##$ASSWID= 0
##$AUNMP= <proc_1d>
##$AZFE= 0.1
##$AZFW= 0.1
##$BCFW= 1
##$BC_mod= 2
##$BYTORDP= 1
##$COROFFS= 0
##$CY= 11.3945322036743
##$DATMOD= 1
##$DC= 2
##$DFILT= <>
##$DTYPP= 0
##$F1P= 15.6554695791079
##$F2P= 12.8336369535428
##$FCOR= 0.5
##$FTSIZE= 0
##$FT_mod= 4
##$GAMMA= 1
##$GB= 0.15
##$INTBC= 1
##$INTSCL= 1
##$ISEN= 128
##$LB= 0.24
##$LEV0= 0
##$LPBIN= 0
##$MAXI= 10000
##$MC2= 0
##$MEAN= 0
##$ME_mod= 0
##$MI= 1.114404
##$NCOEF= 0
##$NC_proc= 0
##$NLEV= 6
##$NOISF1= 3.799351
##$NOISF2= 2.8
##$NSP= 1
##$NTH_PI= 0
##$NZP= 0
##$OFFSET= 15.70392
##$PC= 1
##$PHC0= -26002.54
##$PHC1= 13.78748
##$PH_mod= 1
##$PKNL= yes
##$PPARMOD= 0
##$PSCAL= 0
##$PSIGN= 0
##$REVERSE= no
##$SF= 200.130013532006
##$SI= 16384
##$SIGF1= 3
##$SIGF2= 2
##$SINO= 400
##$SIOLD= 16384
##$SREGLST= <1H.CDCl3>
##$SSB= 0
##$STSI= 0
##$STSR= 0
##$SW_p= 3612.71676300578
##$SYMM= 0
##$S_DEV= 0
##$TDeff= 0
##$TDoff= 0
##$TI= <>
##$TILT= no
##$TM1= 0
##$TM2= 0
##$TOPLEV= 0
##$USERP1= <user>
##$USERP2= <user>
##$USERP3= <user>
##$USERP4= <user>
##$USERP5= <user>
##$WDW= 1
##$XDIM= 8192
##$YMAX_p= 0
##$YMIN_p= 0
$$ End of Bruker specific parameters
$$ ---------------------------------
##NTUPLES= NMR FID
##VAR_NAME=  TIME,          FID/REAL,        FID/IMAG
##SYMBOL=    X,             R,               I
##VAR_TYPE=  INDEPENDENT,   DEPENDENT,       DEPENDENT
##VAR_FORM=  AFFN,          ASDF,            ASDF
##VAR_DIM=   8192,          8192,            8192
##UNITS=     SECONDS,       ARBITRARY UNITS, ARBITRARY UNITS
##FACTOR=    0.0002076,     1,               1
##FIRST=     0,             0,               0
##LAST=      1.7004516,     0,               0
##MIN=       0,             -702137,         0
##MAX=       1.7004516,     711584,          0
$$ Real data points
##PAGE= N=1
##DATA TABLE= (X++(R..R)), XYDATA
0@%%%%%Qj6J6j6K0k8M4o0O8q0R9j25J54j83K14k48K93l51M09m68N38o18P10q12
$$ 0 0 0 0 0 0 8 -8 8 -8 12 -16 28 -32 36 -44 55 -70 84 -99 115 -133 160 -191 218 -250 288 -330 380 -432
29d32R23j044J172j319J488j667J860k073K307k566K853l166L503l872M287m751
$$ -432 491 -553 619 -700 788 -879 981 -1092 1215 -1351 1502 -1664 1839 -2033 2254 -2497
45b497N261n827O462p179P999q944J0045j1339J2889j4798J7202k0322K4524l0420
$$ -2497 2764 -3063 3399 -3780 4219 -4725 5320 -6019 6870 -7928 9274 -11048 13476 -16944
59a6944L8833o1367O31474n80755n26915P33555j99831M8570O03222p67571o04408
$$ -16944 21889 -39478 591996 11241 -515674 217881 18050 66620 669842 -97729 -702137
70g02137J005515O413o63370N15205J60297l96308M24342k71049p48641P43959
$$ -702137 303378 309791 -353579 161626 321923 -74385 349957 78908 -669733 74226
80G4226M77104p85017J90539M32887n46200J18751K03122q01897L25437J022632
$$ 74226 551330 -233687 -43148 389739 -156461 -37710 165412 -636485 -311048 711584
90G11584n52965m72484N09544l43349k61337O38955k41163l32221P53414j05779
$$ 711584 158619 -313865 195679 -147670 -409007 229948 -11215 -343436 409978 304199
100C04199p38133L78556J53633m34706M05084J79227m25013M15523J37060q14093
$$ 304199 -433934 -55378 98255 -336451 68633 247860 -177153 238370 375430 -438663
110d38663J43959N51107l44174J09780L32059n71687L5535N81816n51427l04426
$$ -438663 -294704 256403 -87771 22009 354068 -217619 -182084 399732 -151695 -456121
120d56121O82971j04031k68067M85948k49139m98882M65245J1136m25876M98947
$$ -456121 226850 122819 -145248 340700 91561 -407321 57924 69060 -356816 142131
130A42131K26800n01777J36119J00925m10449K95457L01822m31200J50239L49994
$$ 142131 368931 -132846 3273 104198 -306251 -10794 291028 -140172 10067 360061
140C60061m43022n1026K91474l85529M5949N68745k85630k63039L59761k56444
$$ 360061 -82961 -133987 157487 -228042 -182093 386652 101022 -162017 197744 -58700
150e8700k65710N06575m3639l97415L41507P6826l65721K23896N9015l94673K41545
$$ -58700 -324410 182165 138526 -258889 82618 159444 -206277 17619 76634 -318039 -76494
161g6494K77384l01894Q7843J88722l21436L8936K16045k77285Q4150L50965k81901
$$ -76494 200890 -101004 -13161 175561 -145875 -106939 109106 -168179 -84029 266936 -14965
172a4965j13660L15790k04800j68378L06789j21674j22060M39144p5511m58912
$$ -14965 -128625 187165 -17635 -186013 120776 -898 -122958 316186 240675 -218237
182b18237J58983J08253j89031K44399J03509l15393J15391J49936l07154J9921
$$ -218237 -59254 48999 -140032 104367 207876 -107517 7874 157810 -149344 -129423
192a29423K22512j32805N6757J55933k44781l2044J85172k24169m4248L29239
$$ -129423 93089 -39716 17041 172974 -71807 -103851 81321 -142848 -187096 142143
202A42143p5008j33630J66539j58859j46267L15418j5675k65746K06586J11980
$$ 142143 67135 -66495 100044 -58815 -205082 110336 94661 -171085 35501 147481
212A47481k15610Q3765M5388k26662J18140J89633j64481K2604J42562j69639
$$ 147481 -68129 15636 61024 -165638 -47498 142135 -22346 258 142820 -26819
222b6819n1164J11752r7647L9587J62240j52081o5861J70519j04880j12656J52021
$$ -26819 -77983 33769 -63878 -24291 137949 -14132 -79993 90526 -14354 -127010 25011
233B5011l8079m8618K19665n7962k44497J11853P7308j32515J09036Q8113j59698
$$ 25011 -13068 -61686 157979 100017 -144480 -32627 44681 -87834 21202 109315 -50383
244e0383L9269R8944j40101Q79J20885p8937p227J03536o6658k9261N3237j07708
$$ -50383 -11114 87830 -52271 -51392 69493 -9444 -16671 86865 20207 -9054 44183 -63525
256f3525k1138J41646l9372n3619R5782o2365p8568J20504l3087j24202J27757
$$ -63525 -84663 56983 17611 -36008 59774 -2591 -81159 39345 6258 -117944 9813
267I813O5294j13757M7000K8285j45137K5368J17708m3652K0078P7269q8725n5078
$$ 9813 75107 -38650 8350 36635 -108502 -83134 34574 -9078 11000 88269 -456 -55534
279e5534N7027k0078O852P1556l4660j9382M8347o6027m6905P5140p699r047R7082
$$ -55534 1493 -18585 -11733 59823 25163 5781 54128 -11899 -58804 16336 8637 -410 96672
292I6672l8591j12223N3302K0376p2553O1804N1466r0642M594O0736o1716j8856
$$ 96672 58081 -54142 -840 19536 -53017 8787 60253 -30389 -25795 34941 -26775 -45631
304d5631N8401k9155j5491N8773o310l0998N786k8599p719M1785n524j228L5622
$$ -45631 12770 -16385 -31876 26897 20587 -10411 -4625 -33224 -40943 842 -4682 -5910 29712
317B9712k6371k2904M1506k2950m0958O2564K6265m7786K3653Q996p7995K625
$$ 29712 3341 -19563 21943 -1007 -41965 20599 46864 -922 22731 31727 -46268 -43643
329d3643O3073j3607k382M0134k9024m2350K0350Q220j3489J3647J0684m792m186
$$ -43643 19430 5823 3441 43575 14551 -27799 -7449 771 -12718 929 11613 6821 2635
342B635j5907p402Q296m898J4435L4715j5271k3664K3077q664l4180K5729K0139
$$ 2635 -13272 -20674 -12378 -17276 -2841 31874 16603 -7061 16016 7352 -26828 -1099 19040
355A9040l0517J2347L4619k9043k6937K0006l037j2417L3882K2286k6349k1245
$$ 19040 -11477 870 35489 6446 -20491 -485 -3522 -15939 17943 40229 13880 -7365
367g365k580j1357o851J8494K2009k666j5433N67l634k0112P867L3688J769j2551
$$ -7365 -9945 -21302 -28153 -9659 12350 9684 -5749 -5182 -8816 -28928 -21061 12627 14396 1845
381A845Q922j0209l3577Q349L1781l849j567K2589p899k6313J1050J6522j2603
$$ 1845 10767 558 -33019 -24670 7111 3262 1695 24284 16385 -9928 1122 17644 5041
394E041j473J8368o494j9839O195Q316j6412n927J7580J821j0221J1424J1430
$$ 5041 3568 21936 15442 -4397 1798 10114 -6298 -12225 5355 7176 -3045 8379 19809
407A9809k1586j7836J1810l00j1568J9078J4992k3300j2515J4224m976q304K5383
$$ 19809 -1777 -19613 -7803 -8103 -19671 -593 14399 -8901 -21416 -7192 -12168 -20472 4911
420D911J8162j7049o147P011j7660j3559K0978J7504o357j330M393j2298j3084
$$ 4911 23073 6024 -123 6888 -10772 -24331 -3353 14151 7794 6464 10857 -1441 -14525
433a4525J5594J8615r420o571J2891q868k2815R350J0403k0303M262K8949j0194
$$ -14525 1069 19684 10264 3693 16584 7716 -15099 -5749 4654 -15649 -11387 17562 7368
446G368j8161J6052j510k1562J4615J6969j6204m172J1996o527j0172K797K916
$$ 7368 -10793 5259 3749 -17813 -3198 13771 -2433 -6605 5391 -1136 -11308 -8511 -5595
459e595J681O491J3414Q154j8998k1180J2215R435r916J6077J0154l4809n642
$$ -5595 -3914 2577 15991 24145 5147 -16033 -3818 5617 -4299 11778 21932 -12877 -18519
472a8519K7895j6048j0836L5323l223k7269J8659O150l1316L833J6236j0892O596
$$ -18519 9376 -6672 -17508 17815 14592 -12677 5982 12132 -19184 -15351 885 -10007 -3411
485c411J2172j7301p003J0978N100J0764m007j9752J6851J4819k3264M371J3244
$$ -3411 8761 -8540 -15543 -4565 535 11299 7292 -12460 4391 19210 -4054 317 13561
498A3561l1774M354L9358k1245j3349L9903j8340m0159L5793J5950l3666J3978
$$ 13561 -18213 -13859 25499 4254 -9095 30808 12468 -27691 8102 24052 -9614 4364
510D364J0536k9945J2585J3592l5881J644L2885M97K939q094l4467J7203K8827
$$ 4364 14900 -15045 -2460 11132 -24749 -23105 9780 10277 13216 5122 -29345 -12142 16685
523A6685k6580K236K5781l3601m753L6909l1017j0724N7029k0037m3339N0979
$$ 16685 -9895 -7659 18122 -15479 -20232 16677 -14340 -25064 31965 11928 -31411 19568
535A9568J1390m9145J7915J0072l1838L2855K2474n3103Q31L6247j5538L040R058
$$ 19568 30958 -18187 -272 9800 -22038 10817 33291 -19812 -18981 17266 1728 4768 13826
548A3826l3292J6741L4860l8640o428K9782l9404n288N2471k8189j8162N2927
$$ 13826 -19466 -2725 32135 -6505 -12933 16849 -22555 -27843 24628 -3561 -21723 31204
560C1204l2429m4631O6995R459n8746L2750J7383m7543L1208K0682o1266J7330
$$ 31204 -1225 -45856 21139 30598 -28148 4602 21985 -25558 5650 26332 -34934 -17604
572a7604M9769l3456J580K3139m2629R734M1170m1968l81M1982m8934j3182O0991
$$ -17604 32165 -1291 289 23428 -19201 -9467 31703 -10265 -10646 31336 -17598 -30780 30211
585C0211l4348k7400O1088l0881m5110P8972P25p2270M5189J4308o4445M7477
$$ 30211 -4137 -31537 29551 -1330 -46440 32532 33257 -39013 6176 20484 -43961 3516
597C516L6807p1877J4439M5465m7233J5519M0198o1242L558O5214l7516j6469
$$ 3516 40323 -31554 -17115 28350 -18883 -3364 36834 -24408 -20850 44364 6848 -9621
609i621L3333n4377K34Q4313m6701n1706P3221j5351n1957O6257j0667o2981P6371
$$ -9621 23712 -30665 -30431 53882 7181 -44525 28696 13345 -38612 27645 16978 -46003 30368
622C0368J1313j00303M4567N9661p1012N526L8661n2869L4454N8247q9668j9510
$$ 30368 41681 -58622 -14055 45606 -25406 -19880 18781 -34088 366 58613 -31055 -50565
634e0565Q8348k2960k4009L1397n8816L245R9753n6144p3686Q3679K429n4049
$$ -50565 37783 14823 -9186 22211 -36605 -33360 66393 10249 -63437 20242 22671 -31378
646c1378O5799j3262p1448Q3868J4569j12991N4564P4058q8427J050N1724o0860
$$ -31378 34421 21159 -50289 33579 48148 -64843 -10279 63779 -24648 -23598 28126 -32734
658c2734K8392O3851r6800j3424J07676l8862m8288M8112m2046q600R1192n8771
$$ -32734 -4342 59509 -37291 -50715 56961 18099 -30189 17923 -24123 -32723 58469 -302
670c02o8635J03883k085q4919O7295J2350o8001P3613O152j13211P3792Q1038
$$ -302 -68937 34946 32861 -52058 15237 27587 -40414 33199 39351 -73860 -68 80970
682H0970j14202j1533P5806m8049J7816N7756j00379j1878J21807m4875o9252
$$ 80970 -33232 -44765 31041 -17008 808 58564 -41815 -53693 68114 23239 -46013
693d6013O0057k0286j8967Q0090n6216p4083J04593Q587q9141O2442K1959p3323
$$ -46013 14044 -6242 -25209 54881 -1335 -75418 29175 37762 -51379 11063 33022 -40301
705d0301O2708J6691j08387O3449Q4313j08692j1306Q0622n8224K128P5386q2975
$$ -40301 22407 39098 -69289 -5840 78473 -30219 -41525 39097 -19127 -16999 58387 -24588
717b4588k7143J11490l7616o3231O8552k5725m3996Q2772k1580p4958P6007M769
$$ -24588 -51731 59759 22143 -41088 27464 1739 -42257 40515 18935 -56023 19984 24753
729B4753p8209P1982K5016r2610M8533M3387q8541M2085O3608j03023L234R1540
$$ 24753 -53456 18526 43542 -49068 -535 42852 -45689 -3604 60004 -43019 -39785 51755
741E1755o8218j9354Q3785n7460l3334R1020l7572n5402P8854j7440o0824P1540
$$ 51755 -16463 -35817 47968 -9492 -42826 48194 10622 -44780 34074 16634 -44190 27350
753B7350k825o8383N8680P056o9999O5932L0167q8631L5301M6015p5892K9828
$$ 27350 24525 -43858 14822 21878 -48121 17811 47978 -40653 -5352 40663 -35229 -5401
765e401N9237q7255j383Q1045o0538k1530P9021m9427m0137Q3589j9770n3666
$$ -5401 53836 -33419 -34802 46243 -14295 -35825 43196 -6231 -46368 37221 17451 -36215
777c6215O1470j4127n5299O6569N381o8528M3891J7826n4929M7633K1112p4423
$$ -36215 25255 11128 -44171 22398 27779 -40749 3142 20968 -33961 13672 34784 -39639
789c9639L5973M7704o9010J5429N3148o7355k256O4903n5259j6132P6839m3024
$$ -39639 -3666 44038 -24972 -9543 43605 -23750 -26006 38897 -16362 -32494 44345 1321
801A321m5329P0154j1333m3604N3640j4070n2075N8881J0190o2606L2215J7948
$$ 1321 -44008 26146 14813 -28791 24849 10779 -41296 17585 27775 -34831 -2616 15332
813A5332m4562M0506J9541o4878K7605M2256n5521J3200M4455n9306j258N8426
$$ 15332 -29230 11276 30817 -34061 -6456 35800 -19721 -6521 37934 -21372 -22630 35796
825C5796m6283j6605O2584l6899l5945O3565j0060m2484M5304o522m4825M6091
$$ 35796 -10487 -27092 35492 -1407 -37352 26213 16153 -26331 18973 12451 -32374 13717
837A3717Q553n3023K8714J8395m0223K8455J7673m9742K2506L3473m6464J2324
$$ 13717 22270 -30753 -2039 16356 -23867 4588 22261 -27481 -4975 28498 -17966 -5642
849e642L8581m9630l804M6363l5894j0677N1777l2875l2168N5522n647l7007L6751
$$ -5642 32939 -16691 -20495 25868 -10026 -20703 31074 -1801 -33969 21553 15906 -21101 15650
862A5650m232l6351L9362P616m7143K1307J8389l1548J9978J4327l8885J9019
$$ 15650 11418 -24933 14429 22045 -25098 -3791 14598 -16950 3028 17355 -21530 -2511
874b511K7121l9151P937L1722l7938k756L6683l1420q460M3364k8952k6116M8165
$$ -2511 24610 -14541 -6604 25118 -12820 -15576 21107 -10313 -18773 24591 -4361 -30477 17688
887A7688m151l2022L0647l188l0615L2807O584l9029J8677J7499k8050J2254J3895
$$ 17688 13537 -18485 12162 8974 -21641 11166 17750 -21279 -2602 14897 -13153 -899 12996
900A2996k7965J4259K0356l1536P996K7482l1681n825K8830k1925m392L1764k6917
$$ 12996 -14969 -710 19646 -11890 -3894 23588 -8093 -13918 14912 -7013 -11405 20359 -6558
913f558k0545M2590j559k9731K1401J643k1745K4397M125l2633J4860J7520k3743
$$ -6558 -27103 15487 13928 -15803 5598 7241 -14504 9893 14018 -18615 -3755 13765 -9978
926i978N070J2706j6324R761J3096k3803N670K2544k2505o344K1010j4787l420
$$ -9978 -4908 7798 -8526 1235 14331 -9472 -3802 18742 -3763 -10107 10903 -3884 -7304
939g304K2074k1095j5340L3938q26k4839J7476L538j8501J6798M804k4585J0634
$$ -7304 14770 -6325 -21665 12273 11447 -13392 4084 7622 -10879 5919 10723 -13862 -3228
952c228J4057j8879J681J1890j2047M737J0203j4445M505J5037j6171n243J6564
$$ -3228 10829 -8050 -6369 5521 -6526 -1789 8414 -6031 -1526 13511 -2660 -7903 8661
965H661r775m618J5299j4373r133K4269k264j8970J4765M349j5363J0590N987
$$ 8661 -1114 -5732 9567 -4806 -13939 10330 8066 -10904 3861 8210 -7153 3437 9424
978I424j7217N152J0230j4030k64J1048p006k46P321p333J747Q743r646j979R829
$$ 9424 -7793 -2641 7589 -6441 -6705 4343 -2663 -2909 4412 -2921 -1174 7569 -2077 -4056 5773
993E773o786l606R146p969n936J5166j377j1973J0702M007j1879O682O125j1634
$$ 5773 -1013 -4619 4527 -3442 -9378 5788 4411 -7562 3140 7147 -4732 1950 8075 -3559
1007c559J098P492p995k095P313k748k526M876j322j96K696l237j24L821m415
$$ -3559 -2461 5031 -2964 -5059 2254 -494 -3020 1856 534 338 3034 -203 -327 3494 -921
1022i21k540N107m548l329R247j624o481P176K037p469M463N512p718j482N227
$$ -921 -3461 1646 -2902 -6231 3016 1392 -5089 2087 4124 -3345 1118 6630 -1088 -2570 2657
1037B657m158k984N136mk934K651J345r58K41N39N69J75l359K79J712l737n28
$$ 2657 -1501 -4485 651 647 -2287 364 1709 751 992 1531 2100 2275 -1084 -805 907 -2830 -3358
1054c358M420j806k683M801Q21m162K664L649m632j415L998k930l250L182R24
$$ -3358 1062 -744 -3427 1374 2195 -1967 697 4346 -286 -1701 2297 -633 -3883 -701 223
1069B23j881P03K550r03r13K272J637k387k257J641l14k804J078K343k526j482
$$ 223 -1658 -955 1595 692 -221 2051 3688 1301 -956 685 371 -2433 -1355 988 -1538 -3020
1085c020M380P63l282K410K123l729m44K792k943l246L412J161k424N56K129j396
$$ -3020 1360 2123 -1159 1251 3374 -355 -799 1993 -950 -4196 -784 377 -2047 -1491 638 -758
1101g58K46K588P85k277j150J094j37k007L55K241l448r90N601J40l531K847K136
$$ -758 -512 2076 2861 584 -566 528 391 -1616 -1261 980 -2468 -3458 2143 2283 -1248 1599 3735
1118C735l997L04L469m525k372L675k97l147K319J340j854J518K014k93l04k063
$$ 3735 -262 42 3511 -1014 -3386 289 -8 -3155 -836 504 -1350 168 2182 1889 1585 -478
1134d78j11J210j409j58J504l272j882O475P20n076L679L027n320J567M354o686
$$ -478 -589 621 -788 -946 558 -2714 -4596 1879 2599 -2477 1202 4229 -1091 476 4830 -1856
1150a856j737N961k577l987N056n26k835L756P16j630K020j457l017K952k22l054
$$ -1856 -3593 2368 -209 -4196 860 334 -2501 1255 1971 341 2361 904 -2113 839 617 -2437
1166b437L125k392m505P873K349q053M447M604p509K710O627r453k188R229n008
$$ -2437 688 -1704 -6209 1664 4013 -4040 407 5011 -2498 212 6839 -2614 -4802 4427 -581
1181e81m541P471k675n259Q421P65n415M626r74n249O409k86p128N545l98p558
$$ -581 -5122 2349 -326 -5585 2836 3601 -1814 2812 1838 -3411 2998 2712 -4416 1129 731 -6827
1197f827P853L730r780N494O151j1023K966J1310j2079m007J1589p007m933J1851
$$ -6827 1026 4756 -5024 470 6621 -4402 -1436 9874 -2205 -6212 5377 -1630 -6563 5288
1211E288n700q445J3045N85q803P365k73p787Q547J034j0807O594K268j1028Q628
$$ 5288 -412 -8857 4188 4773 -4030 3335 3062 -4725 3822 4856 -5951 643 2911 -8117 511
1226E11O232j2589M750R221j3521L687J4164j5620n519J6595q199q192J4360p263
$$ 511 6743 -5846 -1096 8125 -5396 -1709 12455 -3165 -8684 7911 -288 -8480 5880 -1383
1240a383r377J7016m57j4590J1627L471j2123R259J763j3599J0735M560j8156
$$ -1383 -10760 6256 5799 -8791 2836 6307 -5816 3443 5206 -8393 2342 6902 -11254
1253a1254Q475J2241j5269M478R501j6431O131J9095k0299q852K1628q287r953
$$ -11254 -2779 9462 -5807 -1329 8172 -8259 -2128 16967 -3332 -12184 9444 1157 -8796
1266h796J6988j0224j2337K3945j297k0971J5106N957j6204J2555K800j9000J2923
$$ -8796 8192 -2032 -14369 9576 8279 -12692 2414 8371 -7833 4722 7522 -11478 1445
1279A445R082k2416P609J5413j8648L596J5202j9140K388K3769k0902j0821K5821
$$ 1445 10527 -11889 -4280 11133 -7515 -3919 11283 -7857 -5469 18300 -2602 -13423 12398
1292A2398j0655j4296K2596q281j8603K5481L64k3616J9186O727k3128J3398J0610
$$ 12398 1743 -12553 10043 1762 -16841 8640 9004 -14612 4574 11301 -11827 1571 12181
1305A2181k2410R215J1627k3822Q275K0203k3185j635K1308j7464k16K4318k2255
$$ 12181 -10229 -1014 10613 -13209 -4934 15269 -7916 -9551 11757 -5707 -5923 18395 -3860
1318c860j2757L2269j0299k1582K4421m485k0535K5992P95k8443K1318J3627k7894
$$ -3860 -16617 15652 5353 -16229 8192 3707 -16828 9164 9959 -18484 2834 16461 -11433
1331a1433J0241J4232k3266R458J5610k8570M630K6056k2211n418K2411j7574
$$ -11433 -1192 13040 -10226 -768 14842 -13728 -9098 16958 -5253 -10671 11740 -5834
1343e834k426K7973k1097j7359L2765o762k3602K4952l437k4392K6799N464l1408
$$ -5834 -8260 19713 -1384 -18743 14022 7260 -16342 8610 5173 -19219 7580 13044 -18364
1356a8364J9183J5568k8635J0023J8283k5667N032J9574k5552J303K5705k2031
$$ -18364 819 16387 -12248 -2225 16058 -9609 -4577 14997 -10555 -9252 16453 -5578
1368e578p830K6262j4528q177K5849j6217j6365L1571p233k6228K5689K314k6405
$$ -5578 -13408 12854 -1674 -9851 15998 -219 -16584 14987 7754 -18474 7215 9529 -16876
1381a6876K0939O629k8341J9951J6220l2411P031K3984k1581n67J6905k2675J993
$$ -16876 4063 10692 -17649 2302 18522 -13889 -6858 17126 -4455 -5022 11883 -10792 -8799
1394h799K7989k2801j3843K7522p856r838K1658j6232j4481L2992n673k9163K2298
$$ -8799 19190 -3611 -17454 10068 2212 -7626 14032 -2200 -16681 16311 10638 -18525 3773
1407C773N560k3631J8963N545k8768J9067J9145l2489N083K4411k0910j363J8232
$$ 3773 9333 -14298 4665 10210 -18558 509 19654 -12835 -7752 16659 -4251 -5614 12618
1420A2618k1642p86K7210k0507j3174K6347p688j1799K1410j1205j5580K8083
$$ 12618 -9024 -9810 17400 -3107 -16281 10066 2378 -9421 11989 784 -14796 13287
1432A3287m472k6360K2780N533k5790J6549R002k5779J5746J6099k9366N319K5912
$$ 13287 8815 -17545 5235 10768 -15022 1527 10529 -15250 496 16595 -12771 -7452 18460
1445A8460k1737n319J9861j6304l701K3276j7748j2571K5732o459j4063J9030
$$ 18460 -3277 -8596 11265 -5039 -8740 14536 -3212 -15783 9949 3490 -10573 8457
1457H457o370j3944K3511l778k3438K0026O156k3941J3743R882k3460J1901J6243
$$ 8457 2087 -11857 11654 7876 -15562 4464 10620 -13321 422 10304 -13156 -1255 14988
1470A4988k5641L748K2509j9245m142K0247j5393p353K2243j1713j3052J9955
$$ 14988 -10653 -6905 15604 -3641 -7783 12464 -2929 -10282 11961 248 -12804 7151
1482G151n600j1392J9365n467j6937J9485J977j8471J4036K559k0724J6085J0827
$$ 7151 1551 -9841 9524 4057 -12880 6605 8582 -9889 4147 6706 -14018 2067 12894
1495A2894k5540P460J7680j8870J838J7224j7960j540K0864j5661j0485K0431
$$ 12894 -12646 -5186 12494 -6376 -4538 12686 -5274 -6814 14050 -1611 -12096 8335
1507H335o205j1341J4429n269r061J8001m116j6950J6165M735j5375R258J665
$$ 8335 2130 -9211 5218 -51 -9112 8889 4773 -12177 3988 8723 -6652 2606 4271
1520D271j5712J4615P512k3272O961J7817j6235j588J4661j3030j50J7074j5202
$$ 4271 -11441 3174 10686 -12586 -5625 12192 -4043 -5631 9030 -4000 -4150 12924 -2278
1533b278r503K0575l873j3979J0247j426n388J3600n191j4907J5423O683j4588
$$ -2278 -11781 8794 4921 -9058 1189 -237 -5625 7975 2784 -12123 3300 9983 -4605
1546d605M633K611j0033J1605M057k0662P309J6649j4309l214J2293q696J57J3146
$$ -4605 28 2639 -7394 4211 8268 -12394 -5085 11564 -2745 -5959 6334 -2362 -2205 10941
1560A0941j3447q110J8521k511j4138Q617P74n508J0636l442j2034J2693N492
$$ 10941 -2506 -10616 7905 5394 -8744 -127 647 -4861 5775 2333 -9701 2992 8484
1573H484j2473L797L123q499Q272L367j5602O046J2660j2692j777J2105p832k466
$$ 8484 -3989 -192 2931 -5568 2704 6071 -9531 -3485 9175 -3517 -5294 6811 -1021 -3487
1587c487J1836r675o331J4660l194j2091Q425K624p133O421K4p842Q106L538r709
$$ -3487 8349 -1326 -7657 7003 3809 -8282 143 2767 -4366 2055 2079 -5763 2343 5881 -3828
1602c828L591M025p318M190K948r959M305Q392j0358o04J0887o466l235R427n578
$$ -3828 -237 3788 -3530 660 3608 -6351 -2046 6346 -4012 -4616 6271 -195 -3430 5997 419
1617D19n981J0765k015r912O889L021p265M082K652n953M282K800n293K015K531
$$ 419 -5562 5203 3188 -6724 165 3186 -4079 3 2655 -3298 984 3784 -1509 506 3037
1632C037n218K142K993o541J644N321o866P97P592n983k406Q562l644n425P140
$$ 3037 -2181 -39 2954 -3587 -1943 3378 -3488 -2691 4901 -1082 -3488 5074 1430 -3995 3145
1647C145q10o761N065J753o098K925L278m689J362L282k399M85J321l193J296
$$ 3145 2335 -4426 639 2392 -3706 -781 2497 -2192 -830 2452 53 538 1859 -1334 -38
1662c8K198m308N73K678l652J133M792m767r88O184k520l881M966n46m873L356
$$ -38 2160 -2148 -1575 1103 -2549 -1416 3376 -1391 -2379 3805 1285 -2596 2370 1824 -3049 307
1678C07J725n064J642L516l063j97K836r08l88O85j216L92M99j987O78N56j981
$$ 307 2032 -3032 -1390 2126 -937 -1134 1702 794 406 1091 -125 267 766 -1221 -543 13 -1968
1695a968J411K146k980K88M173k410k641M181n24m212K604R19l408J143K856k632
$$ -1968 -557 1589 -1391 -1103 3070 660 -1981 2200 1676 -2536 68 987 -2421 -1278 1578 -1054
1711a054n67K915N0j162L69L51m39m46q00O46o17j233J741J198k364J210L010
$$ -1054 -1621 1294 1344 182 551 902 463 17 -783 -137 -754 -1987 -246 952 -1412 -202 2808
1728B808k576j330L395j087k749J724R56l029L84K560j690j042K429L02j175M67
$$ 2808 232 -1098 2297 1210 -1539 185 1141 -1888 -1504 1056 -634 -1676 753 1055 -120 347
1744C47J539j252j227N98L05j123p49J912R8j913J753J793k124l16K377j197k156
$$ 347 1886 634 -593 5 310 -813 -1562 350 448 -1465 288 2081 -43 -359 2018 821 -1335
1761a335J867M30k870L67K481j844q43K626R2j546R86J627j578j127J545l58j694
$$ -1335 532 962 -1908 -1541 940 -904 -1747 879 971 -575 411 2038 460 -667 878 520 -1174
1778a174p6J199n82m42J232J247k154O65K184j500j713K273l08k739R08J978k146
$$ -1174 -1250 -51 -633 -1075 157 1404 -750 -85 2099 599 -1114 1159 851 -1888 -980 998 -1148
1795a148o7K223j78j530J776R08k110j13R75l07j561K05P78m54p69J357J141j739
$$ -1148 -1215 1008 830 -700 1076 1984 -126 -239 736 429 -1132 -927 -149 -603 -1372 -15 1126 -613
1813f13L85K716k037j767K332R9l125J224K214k944k56L553j702j202K581K37
$$ -613 -228 2488 451 -1316 1016 1115 -2010 -786 1428 -1516 -1772 1781 79 -1123 1458 1695
1829A695k042N53Q51j178n08M36J30n45n01J238J257j923M02K190j477j559K476
$$ 1695 -347 206 1057 -121 -629 -193 -63 -608 -1109 129 1386 -537 -135 2055 578 -981 1495
1846A495n18l484K244J929l537L10L075j782j434L721q97k148K016O16k165L14
$$ 1495 977 -2507 -263 1666 -1871 -1561 1514 -268 -1702 2019 1122 -1026 990 1606 -559 -245
1862b45L28j060J66P0j3J260q37R8K247j660j594L075l08m066K331J958m130R79
$$ -245 83 -977 -811 -741 -754 506 -331 -233 2014 354 -1240 1835 1527 -2539 -208 1750 -2380 -1401
1880a401L325l245m71M478j486k848K943L6k552J688J85k097J223L9o51J368q56
$$ -1401 1924 -1321 -1792 2686 1200 -1648 1295 1331 -1221 467 652 -1445 -222 -183 -834 534 -322
1897c22n54K540m97k607L592n50m550L050K310n417J357M872m565j013N496k696
$$ -322 -876 1664 1167 -1440 2152 1602 -2948 102 2412 -3005 -1648 3224 -1341 -2354 3142 446
1913D46k371M399r14l644K774M23k998J700N9j570J954L60j839K618j72k754L774
$$ 446 -1925 2474 1560 -2084 690 1113 -1885 -185 -126 -1696 258 618 -1221 1397 1225 -1529 2245
1930B245n19m848L089K883n951J548M232m902n2O339l581l816N982o90m070L306
$$ 2245 1726 -3122 -33 2850 -3101 -1553 2679 -2223 -2275 4064 483 -3333 2649 1959 -2111 1195
1946A195N1m370L461J113l806K038R52j829L082m98l812M267J788o169K047K702
$$ 1195 1246 -3124 337 1450 -2356 -318 634 -1195 1887 1389 -2423 1844 3632 -2537 -490 2212
1962B212n312K724M319p654q5Q694l746m749N911r11l696N215j739n897N209K353
$$ 2212 -3100 -376 3943 -3711 -3796 4898 1152 -3597 2314 1403 -2293 2922 1183 -4714 495 2848
1978B848n419J445J352j528L091k32m647M036K607n474J125L208n331K213M175
$$ 2848 -2571 -1126 226 -1302 1789 1557 -3090 946 3553 -1921 -796 2412 -2919 -706 3469
1993C469p082l4R289n293m524P372j123m511M959j346n754O136J592p038J727
$$ 3469 -3613 -3647 5642 349 -4175 3197 2074 -2437 2522 1176 -4578 1558 3150 -3888 -2161
2008b161L816k401J547J41m100M767K898o911L24M546l906J108K915p148J667
$$ -2161 1655 -746 801 942 -3158 1609 4507 -2404 -2080 2466 -1440 -332 2583 -4565 -2898
2023b898R567o436n826Q179L2m343M302k203n429P641J550q582J923N225l542
$$ -2898 6669 233 -5593 2586 2618 -1725 2577 374 -5055 2586 4136 -4446 -2523 2702 -840
2038h40J333M54l969M424L525p034L68M202l797R37L073o746J074Q480n913m423
$$ -840 493 947 -3022 1402 4927 -2107 -1739 2463 -1334 -397 2676 -4070 -2996 5484 -429 -4852
2054d852Q547j852m794O175j851n584O142J141p620L471M066n183J425K616l503
$$ -4852 3695 1843 -2951 3224 1373 -4211 1931 3072 -4548 -1077 2989 -2194 -769 1847 -1656
2069a656K395K343n445J753L761n249P16M140n691O21O749n979k410Q341l214
$$ -1656 739 3082 -2363 -610 3151 -2098 -1382 2758 -2933 -2312 4437 -1542 -3952 4389 1175
2084A175m985P033j091o223N565J377o975L688L288n984J998M067m772J370L452
$$ 1175 -3810 3223 2132 -4091 1474 2851 -4124 -436 2852 -3132 -1134 2933 -1839 -469 2983
2099B983m377J400K910n593J402N421o495j108O719m073j907P055n015l797R390
$$ 2983 -1394 6 2916 -2677 -1275 4146 -2349 -3457 3262 -811 -2718 4337 -678 -4475 4915
2114D915j097r161N482L201o102K941J285n956M659M821o592q86N117j998K83
$$ 4915 3818 -5343 139 3340 -2762 179 1464 -4492 167 4988 -1604 -2490 2627 629 912
2129I12P83n279K685O001o563k890O377k111j728N197m870k886J0127j934r412
$$ 912 1695 -3584 -899 5102 -1461 -4351 2026 -85 -1813 3384 -1486 -4372 5755 3821 -5591
2144e591N583L757o083K538J298o134M745M742p060p97O294k453j136J807l662
$$ -5591 -8 3749 -2334 204 1502 -4632 113 4855 -2205 -3002 3292 839 -297 1510 -2152
2159b152J737M487o192j935O965k464l008M944l446j961Q378k929q276O838L537
$$ -2152 -415 4072 -2120 -4055 2910 446 -2562 2382 -1064 -3025 5353 2424 -5852 986 4523
2174D523p151J648K363m761L931L433p281L84P295l050k608K573k703J328L810
$$ 4523 -2628 -980 1383 -3378 553 3986 -3295 -2911 4384 1334 -1274 1299 -1404 -76 3734
2189C734n982j920O449j465k858L618k745j596P447k554p494O390L038o713K238
$$ 3734 -2248 -4168 2281 816 -2042 1576 -1169 -2765 4682 2128 -5366 1024 4062 -2651 -413
2204d13K441n332K676M514o175k33N899k739j861K971k085p88L396l432j354M063
$$ -413 2028 -3304 -628 3886 -2289 -2522 3377 638 -1223 1748 -337 -1125 2271 -1161 -2515 1548
2220A548k232j618M325k306k158N501j201n351N565R96o711L322L283n790J240
$$ 1548 -684 -2302 2023 -283 -2441 3060 1859 -3492 2073 3069 -3642 -320 2963 -2827 -1587
2235a587M604m600k41M500k920j678M006j383k069K898j878j068K644j820j662
$$ -1587 3017 -1583 -1824 2676 -244 -1922 2084 701 -1368 1530 -348 -1416 1228 -592 -2254
2250b254L726j309k480M532o81m791M651J581n975K785L101n796J344M310m177
$$ -2254 1472 163 -2317 2215 1534 -3257 1394 2975 -3000 -215 2886 -2910 -1566 2744 -1433
2265a433p25M348j843j696L155p47k334K373m61j938J722p58r37K311r74j756
$$ -1433 -2158 2190 347 -1349 1806 1059 -1275 1098 637 -1301 421 -337 -1274 1037 63 -1693
2281a693L220k19l291L000J201m047K063J710m769J155M133l171j398L982j234
$$ -1693 1527 1308 -1983 1017 2218 -1829 234 1944 -2825 -1670 2463 -708 -2106 1876 642
2296F42k208K899K2k690K177J44k091P53L04p66J300p97q37K515m66k258K510
$$ 642 -1566 1333 1355 -1335 842 986 -1105 -352 -48 -814 486 -311 -1148 1367 901 -1357 1153
2313A153K05k756J765J142l396Q60K838k633j321L608j259j754L108l75j916J134
$$ 1153 1358 -1398 367 1509 -1887 -1027 1811 -822 -2143 1465 206 -1548 1560 1185 -731 403
2329D03M97j664M68O40m80j76l9j19J051k20j063J686Rk099J720P40k744P11J921
$$ 403 900 -764 -296 344 -136 -312 -351 -470 581 361 -702 984 993 -1106 614 1354 -1390 -679 1242
2348A242k511m18L028r92j658K437j36j683J011Q59j522m92J208n26m37R7N70
$$ 1242 -1269 -1687 1341 349 -1309 1128 992 -691 320 1179 -343 -835 373 -153 -590 -493 77
2365G7K4j61j7J160l72j542J430K48k124J081J153k029j58K138q72j285J994N13
$$ 77 101 -60 -77 1083 711 -831 599 847 -1277 -196 957 -1072 -1230 908 36 -1249 745 1258
2383A258k147J146Q90j311m00J091p24l77j60Q99L3o00M80Q33p88j83Q59j25j852
$$ 1258 -889 257 1147 -164 -564 527 -197 -574 -734 165 198 -402 78 911 123 -60 799 674 -1178
2402a178J019Q10j609l30J996r77p79J971r7j244N42J231j668n08J104j84j540
$$ -1178 -159 651 -958 -1288 708 -269 -1048 923 826 -418 124 1355 -313 -821 283 99 -1441
2419a441J078O51l72l04Q05K02p08O8J042n67j058Q90K14j594N45J215r48p22
$$ -1441 -363 288 -84 -388 417 619 -89 -21 1021 454 -604 286 500 -1094 -549 666 -282 -1004
2437a004J807k6j652J061R36j434j41J272p52p38M49M75n61J18N95L23p47J32
$$ -1004 803 777 -875 186 1122 -312 -453 819 67 -671 -222 253 -308 -190 405 728 -19 113
2455A13J145j143p11J391m47r84K48R09j070k56K014o67j384J483P20j784K19
$$ 113 1258 115 -596 795 348 -636 -388 521 -549 -805 1209 542 -842 641 1361 -423 -204
2472b04J170j228o74J097k3p30L08J041p05k99R22O3p47l59J045l24j492O92Q88
$$ -204 966 -262 -936 161 138 -592 -284 757 52 -247 675 738 -9 -368 677 353 -1139 -447 441
2491D41j199k58K029q96r71J504P13j852O47Q85j528k38J494j126n15Q32L63m10
$$ 441 -758 -1016 1013 117 -854 650 1363 -489 158 1043 -485 -723 771 -355 -870 -38 325 -85
2509h5j46M56L79k66m51O97M3j623P57O75r07j75J500n04j302J902Q4j486R16
$$ -85 -231 225 604 338 -113 584 627 -996 -239 436 -471 -646 854 350 -952 950 1034 -452 464
2528D64Q36k083L3J308r24n88J183q0o23O56N11k85L7n52N31K33j209o4J136j634
$$ 464 1300 -783 -750 558 -366 -954 229 149 -474 182 693 408 445 -107 424 657 -552 -616 520 -1114
2548a114k85K451r25j319K194P3k198J385J223k708M39J916j830m00J616o81l27
$$ -1114 -1399 1052 127 -1192 1002 1075 -1123 262 1485 -1223 -784 1132 -698 -1098 518 -163 -490
2565d90J077j93n90R47o62j42N85j309M00J097j406n61K614o78j865K305m01j791
$$ -490 587 394 -196 751 89 -53 532 -777 -377 720 -686 -1247 1367 689 -1176 1129 728 -1063
2583a063J710J216l571Q75K799k437j297K569j031q17K361j123j210J720L27j249
$$ -1063 647 1863 -1708 -833 1966 -471 -1768 801 -230 -1047 1314 191 -1019 701 1028 -221
2599b21L15n95k48J554j563q40K563k58k153J872M08k202K269J021l764J121L136
$$ -221 94 -501 -749 805 -758 -1598 965 707 -1446 426 834 -1368 901 1922 -1842 -721 2415
2616B415l210m58K053j392n69K609j234j402K026L35j944R91np53R14j203o88
$$ 2415 -795 -1253 800 -592 -1161 1448 214 -1188 838 1173 -771 220 215 -538 376 -827 -1515
2633a515K232j34k420K398R38k591J936J071l950J446L004l217j350L263j611
$$ -1515 717 583 -1837 561 1499 -1092 844 1915 -2035 -589 2415 -802 -2152 1111 -500
2648e00j036L010j620j274K815l1k334J359M32j323R01o62j639K620L19k531J697
$$ -500 -1536 1474 -146 -1420 1395 1364 -970 389 821 -502 399 -263 -1902 718 1037 -1494 203
2665B03R38k407K285R74l780J016L488l871o51L390k296j201L461j385k157L398
$$ 203 1141 -1266 1019 1993 -1787 -771 2717 -1154 -1805 1585 -711 -1912 1549 164 -1993 1405
2681A405k95k374K010K14k244J931L9k399J929N54k316K124P01l331K358K264
$$ 1405 1110 -1264 746 960 -1284 647 686 -1713 216 770 -1546 578 1279 -2052 306 2570
2697B570l910P24K861l708j48L856l089j503M456j475k831L672m89k287K197K71
$$ 2570 -1340 -616 2245 -1463 -1611 2245 -844 -2347 2109 634 -2197 1475 986 -1301 896 1167
2713A167k563J692Q31k607J427O31k341K197J163l454K119J901l519N54L036l104
$$ 1167 -1396 296 1127 -1480 -53 578 -1763 434 1597 -1857 262 2163 -1356 -802 2234 -870
2729h70n90L870l282j205M268j850l325M245L24l154K091L67k409K355O68l227
$$ -870 -1460 2410 -872 -2077 2191 341 -2984 1261 1585 -1569 522 889 -1520 835 1503 -1724
2745a724P58K249k066Q02Q81k988K479K213l857k22L677k592m32K659l042j416
$$ -1724 -966 1283 -783 19 900 -2088 391 2604 -1253 -1475 2202 -390 -822 1837 -1205 -2621
2761b621N032j387m076L660J005l275K599M52l607K505K190m393R22K045k082
$$ -2621 2411 1024 -3052 608 1613 -1662 937 1389 -2218 287 2477 -1916 -994 1051 -1031
2776a031P92J458k872J466K515l180k46L296k895o11L387k800j493L886j224l485
$$ -1031 -239 1219 -1653 -187 2328 -852 -1098 2198 -697 -1308 2079 -721 -2214 1672 448 -3037
2792c037M279O96m045K529J275l195J834J134l344J252K322k697j79K456j857
$$ -3037 1242 1938 -2107 422 1697 -1498 336 1470 -1874 -622 1700 -997 -1176 1280 -577
2807e77J49K413l015J7L274k202j762L162j673j674L962j884k849L797Q44l874
$$ -577 -428 1985 -1030 -1013 2261 59 -1703 1459 -214 -1888 2074 190 -2659 1138 1982 -1892
2823a892K118J473l003J470J779l697P94K720k367l63J984j803Q1K555k685l11
$$ -1892 226 1699 -1304 166 1945 -1752 -958 1762 -605 -968 1016 -787 -706 1849 -836 -1147
2839a147K935j400j797K524j316j823L682j011l230L289Q12l682K608J706l720
$$ -1147 1788 388 -1409 1115 -201 -2024 1658 647 -2583 706 1518 -2164 444 2150 -1570
2854a570J430K233k990j73K831k850j31K558j543o88J807j063k75K229j941r06
$$ -1570 -140 2093 -897 -1070 1761 -1089 -1220 1338 -205 -893 914 -149 -424 1805 -136 -1042
2870a042K675j380j984K887q18k157K588N00k992J785K114l038M30K220k531J9
$$ -1042 1633 253 -1731 1156 338 -1819 769 1269 -1723 62 2176 -862 -432 1788 -743 -724
2886g24K065j996j141K390m98j188J963q80m61J951q69j659J988p48j154J933
$$ -724 1341 -655 -1796 594 96 -1092 871 -9 -470 1481 612 -1047 941 193 -961 972
2902I72r20k000K708N22k644J243K032l041P65K096k685J66K162j783r76J747
$$ 972 52 -1948 760 1282 -1362 -119 1913 -1128 -363 1733 -952 -786 1376 -407 -1383 364
2918C64k07j130J372K1j057J334m23j078J669p34j334J865o66j403J824L18k093
$$ 364 157 -973 399 420 -637 697 274 -804 865 131 -1203 662 -4 -1407 417 735 -1358
2935a358J762J036j961J32J549j644l87J907j527o75J816l43j329J056M08r18
$$ -1358 404 1440 -521 -389 1160 -484 -871 1036 -491 -1166 650 307 -1022 34 442 -476
2951d76J137k33p61Q28k63n36P90p47p07J407k17j370J368J301k114L17J332j428
$$ -476 661 428 -333 495 232 -304 486 -261 -968 439 222 -1148 220 1521 -593 -276 1056 -372
2969c72J74J147r94j117J510J22j409J149K81n56K86N12o08O4j76m67O25n39k2
$$ -372 -198 949 -45 -1162 348 470 -939 210 491 -65 221 733 125 189 13 -454 171 -368 -390
2988c90O26p3q77R42O0j017P51J000j223l75J333m71j368J306j02j045P00M83
$$ -390 236 163 -714 228 288 -729 22 1022 -201 -576 757 286 -1082 224 122 -923 -223 260
3006B60n58L92L92n22P8j1K1j97K24n95N72j32n67M60M93o30M71N06q76k04R78
$$ 260 -298 94 486 -36 42 31 52 -145 79 -516 56 -76 -643 -183 310 -320 151 657 -219 -423 555
3027E55j53j233Q49j07o70R00J38p99M00M33n4m61N08j86K73m79m62P77k34o80
$$ 555 402 -831 18 -89 -759 141 279 -520 -120 313 259 -202 306 120 393 -86 -548 229 -5 -685
3047f85Q66j47m35M29R26r81l06J152o94p38O27k95n37Q43K72q96M26O61m69n3
$$ -685 181 34 -401 28 954 -27 -333 819 125 -613 14 -281 -818 25 297 -599 -173 488 19 -34
3067c4J64l0m76J62R5m2o2j01O24l45n15M98L93n31O6O28n59m90O17q3p89O05
$$ -34 130 100 -376 -214 -119 -161 -223 -324 300 -45 -560 -62 331 -200 -134 494 -65 -555 62 -21 -810 -205
3089b05P46p04J20N48n44j54K48L54k84l02K14j75n26O90P1m06J48M87j77k16
$$ -205 541 -163 -43 505 -39 -193 55 409 125 -177 37 -138 -664 26 97 -309 -161 326 149 -67
3109f7J17P04r30N0L02l00o86L82R93q76J68M38q7q1N74j38m44j45J17j97j11
$$ -67 50 754 -176 -126 176 -124 -810 -428 565 -311 -143 295 208 127 701 563 119 -26 91 -106 -217
3130b17k8K80m01K34M86j26n22O50J65l73k82N93m08o09O15J35q63K88N76k86
$$ -217 -245 35 -366 -132 354 228 -294 356 521 148 -134 459 51 -558 57 192 -671 -383 193 -93
3150i3JN21j96l28Ql17K60j80L70P9k86K37K00j34k96M54N8l37k15N18l32l05
$$ -93 -92 429 233 -95 -87 -404 -144 -324 46 125 -161 76 276 142 -154 300 358 21 -194 324 -8 -313
3172c13L51k3m27J87P74l39m55Q20l78l96L38L7l82j70L96k25k1J49L54q7j90
$$ -313 38 15 -412 -225 549 210 -245 575 197 -199 139 176 -206 -376 20 -205 -226 -77 277 190 0
3193@J16J91k06l01O71j97r20N90K15o04K80O87q93M61O24l30r44Q88K60p82n9
$$ 0 116 307 101 -200 471 274 -646 -56 159 -445 -165 522 -371 90 714 384 -560 328 588 -194 -253
3214b53M89o46P0L20k24L03m3M9J61J07k03N69p88l46K81K15n06O79p5k60p5O90
$$ -253 236 -410 -340 -20 -244 59 16 65 226 333 130 699 -89 -435 -154 61 -445 234 159 -101 -176 514
3236E14n96q9M30Km88J36L2m25L74J30M6k7m14O08K89n02l94Q23k56l80N45m08
$$ 514 -82 -171 259 261 -227 -91 -59 -484 -110 20 66 39 -375 233 522 20 -374 449 193 -187 358 -50
3258e0l63K65O72q31O40K67n16o38Q89J1n76L18r4m94J83L49n29L97J39J80j40
$$ -50 -413 -148 524 -307 333 600 84 -554 335 346 -230 88 -6 -500 -317 32 -497 -100 39 219 79
3279G9O9K1L52o09j66O77l72o26O51L73j015O90M12o90l81Q35o1n19P25k77p48
$$ 79 148 169 521 -88 -254 423 51 -575 76 449 -566 124 536 -154 -535 300 239 -280 445 168 -580
3300e80K18K97k55j35N31K38J06p03N3K53J94m75M05N4j039O78L73o99K71N39
$$ -580 -362 -65 -320 -455 76 314 420 -283 -230 23 217 -258 147 201 -838 -160 213 -486 -215 324
3320C24o35L20N23l50p53P92kn28M6J49k79L83j18r1M02l00R8N75p52k51J003
$$ 324 -311 9 532 182 -571 221 219 -309 -263 -114 -393 -10 -128 -219 183 -117 -19 556 -196 -447 556
3341E56k30j007R10l67l12Q72J42p44j3R44m03n99N30q1o97N01L14r64N40J36
$$ 556 326 -681 229 -138 -450 422 564 -180 -193 751 348 -251 279 198 -499 2 316 -648 -108 28
3361B8l91N49j5l93L96J21n64N29J01j071N69L09n62K28P72r41J64R35m67l58
$$ 28 -363 186 171 -222 174 295 -269 260 361 -710 -141 168 -394 -166 606 -335 -171 764 297 -61
3381f1O89o14p29J142j31p05M54K5m48L80M96q32O81j84l04L66m2j116P56L85
$$ -61 628 14 -715 427 296 -409 45 70 -378 2 498 -334 347 163 -141 225 183 -933 -177 208
3401B08j002J092N6q81K07J065r52l76J444p57k88Q60o38o92J024l98n92O11M95
$$ 208 -794 298 354 -527 -320 745 -207 -583 861 104 -184 676 38 -654 370 -28 -620 -9 486
3420D86n48L47l36l01P76l5q62K91P37j412Q22N22j339M94J417q73o79J208m88
$$ 486 -62 285 -51 -352 424 389 -473 -182 555 -857 -35 487 -852 -358 1059 186 -493 715 227
3439B27q80J215o94n19O76K23o11O98j10n65M68J18k82K26k9o94Q72j98j058O23
$$ 227 -653 562 -132 -651 25 248 -363 335 225 -340 128 246 -36 190 161 -533 339 141 -917 -294
3459b94J009j354K26R52q11RJ365j336o01J204k2j212J070q9r12Q39N70j144M90
$$ -294 715 -639 -413 539 -272 -263 1102 -234 -835 369 347 -865 205 116 -796 43 613 -531 -41
3478d1N45q21N01J48q52P77M02j705M30J088r32L5J493j393j98J347m76j261J373
$$ -41 504 -317 184 332 -520 257 659 -1046 -616 472 -460 -425 1068 -325 -523 824 348 -913 460
3497D60R1j505Q75K54q27N27L89o78O11N01p72j04O95q63P8P79j075P7J625j441
$$ 460 551 -954 -79 175 -652 -125 264 -414 197 698 -74 -178 517 -346 -268 511 -564 -487 1138 -303
3517c03j77J053q41j88J397q22o64J377j55j551P57L82r30N48O38j191N49Q83
$$ -303 -480 573 -268 -456 941 119 -545 832 677 -874 -117 265 -665 -117 521 -670 -121 762
3535G62q66r6N00m85J81M14p48J27O58p49k27R83q73L24Q40m94q16J261r7j226
$$ 762 -104 -200 300 -185 -4 410 -338 -211 447 -302 -529 454 -419 -95 745 251 -565 696 599 -627
3555f27O93O90j599O79M70o18J10P93n13l97R27p53J20M45p97M7N98m51j69R35
$$ -627 66 756 -843 -164 306 -312 -202 591 78 -319 608 -145 -25 420 -377 -330 268 -183 -352 583
3575E83p06q4P98m99n74P61M5q38O34R0o41K41N36m46q0P66j94n16K80j07oL85
$$ 583 -123 -207 591 92 -482 279 324 -514 120 210 -431 -190 346 -100 -180 586 392 -124 156 49 43 428
3597D28p57k25Q14k24m41O69m61j25R40n23l66M94L98j085O64k93n04M40M08n85
$$ 428 -329 -554 260 36 -405 264 -197 -322 618 95 -271 223 621 -464 200 -93 -597 -157 251 -334
3617c34k58R93j00l23j4L6K84o3l21j57K62o0j35K49j89l57R41o03k52O81M3n72
$$ -334 -592 401 301 -22 -36 0 284 221 -100 -257 5 -55 -190 59 -130 -487 454 -149 -401 280 323 -249
3639b49J67L51p55N21N18q62m50J272r5j99K82m25qK67n17O5K10p1j75K43l34
$$ -249 -82 269 -486 35 553 -309 -759 513 418 219 501 76 68 335 -182 -117 93 22 -153 90 -244
3660b44n5O30j29o50P88O6m82K29J48q63N27L37p53j16R14k76k69L07R0o1K40
$$ -244 -299 331 202 -448 340 406 -76 153 301 -562 -35 302 -451 -567 347 71 -198 109 199 138 378
3681C78l21l55J06L0J77j48K43k8q8j37oN78r7o49K76K79p78M10L95m74k24J037
$$ 378 57 -298 -192 -162 15 -133 110 82 -6 -143 -149 429 332 -317 -41 238 -540 -130 265 -209 -433 604
3703F04n62k57L02M0j77J46ql5J04j55j93K01M4k16N69o00L51q3J65n35P68m11
$$ 604 42 -215 87 127 -50 96 88 53 157 2 -191 10 54 -162 407 -193 158 75 240 -295 473 62
3725F2l91K72J91j23k47M00j8r1J79q9j74r2L29j65k51J90j22J06q5Q3J31L22
$$ 62 -329 -57 134 11 -236 164 146 55 234 145 -29 -121 208 43 -208 -18 -140 -34 -119 -36 95 417
3747D17o54M75P9m31M87m75j28L8N67n79J61J34l47M01J95q2k76P8k47j54N37
$$ 417 -237 238 317 -114 373 -102 -230 -192 375 -204 -43 91 -256 145 340 258 -18 60 -187 -341 196
3768A96j83j01k9j75K52n7l18N12J74j39o8O4k7m28K85J20n86R9K32q9l2N83j82
$$ 196 13 -88 -117 -292 -40 -97 -415 97 271 132 64 128 101 -327 -42 78 -508 -409 -177 -266 -298 285 103
3791A03l76N80j99k49P7r0M88q01J92M9R5K68R6j54Kj03L9R9J04j17ql09%M89
$$ 103 -273 307 108 -141 -64 -154 334 -467 -275 -226 -131 137 233 79 81 -22 17 116 220 103 95 -214 -214 275
3815B75l49N1J99n0j68M69n32j29K53N60n49k24J76K5J06J61j55m6j64K3J3M96
$$ 275 -74 -23 176 126 -42 427 -105 -234 19 579 30 -194 -18 7 113 274 119 73 -91 -68 -55 441
3837D41m43L34j26o24K31K09k41J34M99j90l97O85m98j91L08j74r1p1K69r2j52
$$ 441 -2 332 206 -418 -187 22 -219 -85 414 224 -173 512 14 -177 131 -43 -134 -205 64 -28 -180
3858a80K4O5O8O1J01r8J0l31K92j69k95N03L42m55j48P57m91k50L03K39p02J12
$$ -180 -156 -91 -23 38 139 41 51 -280 12 -157 -452 51 393 -62 -210 547 56 -194 109 348 -354 -242
3880b42K52j15k86K97J57l84M70J6k07J42J2K52j10l03K24Om01M05l63j50k8M11
$$ -242 10 -105 -391 -94 63 -321 149 165 -42 100 112 364 254 -49 175 181 -220 185 -178 -328 -356 55
3902E5r1j68N79k34K2k35L44l20j56L65k02j10M88n13J14J06K14k97K95k71n0
$$ 55 -36 -204 375 141 163 -72 272 -48 -204 161 -41 -151 337 -176 -62 44 258 -39 256 -15 -65
3923f5Lk59J4L75r8k09N29k88m79O44O1q20Q94K4k86l26L32l95L61p3n3K38J35
$$ -65 -62 -321 -307 68 -30 -239 290 2 -477 167 228 -592 302 326 40 -286 46 -349 12 -61 -114 124 259
3946B59N0n05N49m00K27Q1k77k68M27l39j53M16k44L4N81k14p55P38K20m45k64
$$ 259 309 -196 353 -47 180 261 -16 -284 143 -196 -349 67 -177 -143 438 224 -531 207 427 -18 -282
3967b82O53o09j14O82m51p2L78m37J59K52n4j47N6p4m0N3m0k07N93m48l55N58
$$ -282 371 -238 -352 330 -121 -193 185 -252 -93 159 105 -42 14 -60 -100 -47 -87 -294 299 -149 -504 54
3989E4K11n51O51P3p22J43J48k42R4M25m55N8N58k23n22O89l16l40N43j43k98
$$ 54 265 -286 365 438 -284 -141 7 -235 -141 284 -171 -113 445 222 -300 389 73 -267 276 133 -165
4010a65M56k67k66N99j20p96P45K0k58M56K24j020L50L25q54J79L33j58j50R37
$$ -165 291 24 -242 357 237 -559 186 206 -52 404 628 -392 -42 283 -571 -392 -59 -217 -367 570
4030E70m26o58J167q46O8M39m5l48K67l77m7J30P9j35L60N7q11O88M03r88N19
$$ 570 144 -514 653 -193 -125 314 269 -79 188 -189 -236 -106 -27 -162 198 255 -556 132 535 -453 66
4051F6K38p28P6P67o38j19P65o83P2O82p34j49Q71m00l49K92j5n98P38M7l60M71
$$ 66 304 -424 -348 419 -219 -338 427 -256 -184 498 -236 -385 486 86 -263 29 14 -584 154 201 -159 312
4073C12l71k48N68K89q54N24N89j110j10P50m31l94Q99m04m10P67m7m18J29K33
$$ 312 -59 -307 261 550 -304 220 809 -301 -411 339 -92 -486 413 9 -401 366 319 -99 30 263
4093B63o62N35j79n28Q44Q9m43J83j42m17N22O08j020K56M49l98o86Q71o57J57
$$ 263 -399 136 -43 -571 273 362 -81 102 -40 -457 65 673 -347 -91 358 -40 -726 145 -512 -355
4113c55P33k14p81J027k8p74O70Q2o20L98p1j33l3M34p79K40P28o77K62J95o98
$$ -355 378 164 -617 410 382 -392 278 360 -260 138 67 -66 -99 335 -444 -204 524 -153 109 304 -394
4134c94M72L89q59j62Q44l69l31Q81l39p53Q91J35r13N69L45m76R0K63o73K70
$$ -394 78 467 -392 -554 290 -79 -410 471 132 -621 270 405 -508 61 406 -70 20 283 -390 -120
4154a20L83m44l9N25l15K88j98l82L54L02j78o16R91r60L68L24o18k02N63M50
$$ -120 263 -181 -220 305 -10 278 80 -302 52 354 176 -440 551 -409 -41 283 -335 -537 26 476
4174D76p20L7K87l08M03q1l80J44N98n88rM24m08K86J63m53OJ70R8j84N31m41
$$ 476 -244 -207 80 -228 175 94 -286 -142 456 -132 -141 283 -125 161 324 -129 -123 47 145 -39 492 51
4196E1k72L22j22n82N55N37p00J03N82o83J17L42k86k18J85k28K78M87o42K69
$$ 51 -221 101 -21 -603 -48 489 -211 -108 474 -209 -92 250 -36 -254 -69 -297 -19 468 -174 95
4216I5R4m45L47K77l62l82P15n21k19P14l42m55P84J84o80L35J63m23K45L90o49
$$ 95 189 -256 91 368 6 -376 339 -182 -401 313 -29 -484 300 484 -196 139 302 -121 124 514 -135
4237a35o2J44j04J15M6j25J21L68p43M09J35l37J11K03J05q10O07K5j07K63j15
$$ -135 -197 -53 -157 -42 4 -121 0 368 -375 34 169 -168 -57 146 251 -559 48 73 -34 229 114
4258A14m43K84L48k23k77R46p33j46o4L62j51Qj93L61Q7l50P5R5R2l55K9K76l55
$$ 114 -329 -45 303 80 -197 749 16 -130 -194 168 17 25 -168 193 280 -70 5 100 192 -163 -134 142 -213
4281b13L45k05k99O00p27L53J40K54k33K8K96m08j76M38m32J86K70l57j8L22K7
$$ -213 132 -73 -372 228 -499 -146 -6 248 15 43 339 -69 -245 193 -239 -53 217 -140 -158 164 191
4302A91j67L72m05r0L51m85K2M50m72J54L14%l86L95j18o00M87K01n93L99k05
$$ 191 24 396 -9 -99 252 -233 -211 239 -233 -79 235 235 -151 244 126 -474 13 214 -379 20 -185
4323a85J46J24l95K64L09j25j31m5K01K7Q7l54J0k45R6K34k85L42l04kK62K92
$$ -185 -39 85 -310 -46 263 138 7 -38 163 190 277 -77 -67 -312 -216 18 -267 75 -229 -231 31 323
4345C23o58J53L08j54j71N93o22k06M19m3j3J6P1J21k14K87k23L4l54O40l54J12
$$ 323 -335 -182 126 -28 -199 394 -228 -434 -15 -58 -71 -55 16 137 -77 210 -13 21 -333 307 -47 65
4367F5l48L51r8l17L82j50R7J48L65o31L1O9NJ60k92J28J36j01J04o7J60p9j3
$$ 65 -283 68 -30 -347 35 -115 -18 130 495 -136 -105 -36 -31 129 -163 -35 101 0 104 37 197 118 105
4390A05j2J07Q8n08o7M3M97l65J09j90K58j19O5K02j85q7L68j32m35O31l89l8
$$ 105 93 200 288 -220 -287 -244 253 -112 -3 -193 65 -54 11 213 28 -59 309 177 -258 373 -16 -54
4412e4J12L9r7j17kJ96K39l98j21L28l82M35k9n70J73K14J13p5oJ37k93L26QO0
$$ -54 58 97 0 -117 -119 77 316 -82 -203 125 -257 178 149 -421 -248 -34 79 4 -2 135 -158 168 176 236
4436B36k40N2K66l61p5o2K23N8L91l60j05j6Q6k12J91k07K03j17M2q7K12l13P6
$$ 236 -4 48 314 -47 -122 -184 39 97 488 128 23 7 93 -119 72 -135 68 -49 -7 -94 118 -195 -119
4459a19K78p7M3Jr6j26R1M3j76m7L89l12N2J80J4j92J02p3J96j83l7j67J44k94
$$ -119 159 82 125 126 30 -96 -5 38 -138 -185 204 -108 -56 124 138 -54 48 -25 171 -12 -49 -216 -72 -366
4483c66L47L74m88L98k28k95j2N54k27Q0J64l13m90O17j40J04o2J56l6J35k12
$$ -366 -19 355 -133 265 37 -258 -270 284 57 137 301 -12 -502 115 -25 79 17 173 137 272 60
4504F0K9j17j20L17j41o5L6r1j93J87K07j8J6l6Lk04L07j71J72j98p0L14m98K67
$$ 60 89 -28 -148 169 28 -37 -1 -92 -285 -98 109 91 107 71 74 -130 177 6 178 -20 -90 224 -274 -7
4528gN0L0j25K72j82o2P3M5l86J51N8K3j43K00J1j82O9J50K34j83l05L17k54J50
$$ -7 43 73 -52 220 38 -24 49 94 -292 -141 -83 -60 -203 -3 8 -174 -105 45 279 96 -209 108 -146 4
4552Dj87L21m85L26Nk41M12m6k28L9M50k16r4nN2J58n09R8K73k81L93l55K68n22
$$ 4 -183 138 -347 -21 -16 -257 155 109 -119 -80 370 154 60 55 107 265 -244 -146 127 -154 239 -116 152 -370
4576c70K70L66l91M7Q8L5m32K01Q0K16k7K36p6n46N23R4k63R8K0o8l08J61q7N3
$$ -370 -100 266 -125 -78 10 45 -387 -186 -106 110 83 319 243 -303 220 314 51 149 169 101 -207 -46 -133 -80
4600h0K90J48l03r7L08j22k26L04k00J53j59k88K33K96j45M2J59o77L41K23j49
$$ -80 210 358 55 -42 266 144 -82 222 22 175 16 -272 -39 257 112 154 313 -364 -23 200 51
4621E1j3j13K8n30O55K55j34j54K27k90K20l85K0J52j80K92l12L4P6Q2j37M02
$$ 51 38 -75 -47 -577 78 333 199 45 272 -18 202 -183 -163 -11 -191 101 -211 -177 -101 -19 -156 246
4643B46l30K11k29J52O6l36N18n68J54j42K79O3r2kL05l62jK00j67l88M38L27
$$ 246 -84 127 -102 50 116 -220 298 -270 -116 -258 21 84 -8 -10 295 -67 -68 132 -35 -423 15 342
4665C42l77k05N02o2j34k30M3L71n02L06R5l68L80Km17K37j11J01j68J2L09l55
$$ 342 -35 -240 262 200 66 -164 -121 250 -252 54 149 -219 161 163 -254 -17 -128 -27 -195 -183 126 -229
4687b29K13L81Ol38jm9P4j28n6J57k52j53N76j13j82L57J69m59j47K33k47l0M77
$$ -229 -16 365 371 33 32 -17 57 -71 -127 30 -222 -375 201 88 -94 263 432 -27 -174 59 -188 -218 259
4710B59m43n9N0M29m20K4L39k50L41k04L3j80o3K15Q7m75J34L99k32J1N05n04
$$ 259 -184 -243 -193 236 -184 -160 179 -71 270 66 99 -81 -144 71 158 -317 -183 216 -16 -5 500 -4
4732dK34m5k05q2N7j99L40k09J42Q0r5m2J7J00j49j52M15l1l58K75j10q9p6J47
$$ -4 230 185 -20 -102 -45 -244 96 -113 29 109 14 -28 -11 89 -60 -212 203 172 -186 89 -21 -110 -186 -39
4756c9k32O03m4k85n4K04Q5j96j71M6j6n7K53K19J23n31k0L00j98J17K72n30j05
$$ -39 -271 332 288 3 -51 153 238 42 -129 -83 -99 -156 97 316 439 -92 -112 188 -10 107 379 -151 -256
4779b56M64m17L2J32J85m75L16M69l97P9M5j29L77l15k64k48M79K7m4K07m43L74
$$ -256 208 -209 -177 -45 140 -335 -19 450 53 132 177 48 425 110 -154 -402 77 104 60 267 -176 198
4801A98k38n4L09k63j38J85L9K7j44J43K86m47K62l4K1j00K18l39j55J67J98k72
$$ 198 -40 -94 215 -48 -186 -1 38 65 -79 64 350 -97 165 131 152 52 270 -69 -224 -57 141 -131
4823a31l7M30j10j60j39J15p2k70O27j31j51P5J53k02k51L06j88j92L0O76m63
$$ -131 -168 262 152 -8 -147 -32 -104 -374 253 122 -29 46 199 -3 -254 52 -136 -328 -298 378 -85
4844h5K6O16l80l60K47o3J87k25j21K18Lj84n8K26O9R9j25l13L81K78m97l27L43
$$ -85 -59 557 177 -183 64 1 188 -37 -158 60 63 -121 -179 47 116 215 90 -223 158 436 -61 -388 -45
4867d5K79m82N39Jo78N04pJ04k79O21l03n05K13N4n4J00J29j84j90J08J42o9r4
$$ -45 234 -248 291 292 -386 118 111 215 -64 557 254 -251 -38 16 -38 62 191 7 -183 -75 67 -2 -96
4890i6k6K07q0k08J25L43k28K59k32k27K35p5J73k03K29k34K8r2K1n2J17K67l35
$$ -96 -122 85 5 -203 -78 265 37 296 64 -163 72 -3 170 -33 196 -38 -10 -102 -81 -133 -16 251 -84
4913h4L15p7L9j09j17r6M35k20k41M54p0l74L38pn13L28L06j41m33P69m77l84
$$ -84 231 154 193 84 -33 -129 306 86 -155 299 229 -145 193 186 -327 1 307 166 -267 502 25 -359
4935c59L18J82l30K39m8J1N1m0n6P8K19k4l36q0J60J19r0p1K51k40k47K41R0L5
$$ -359 -41 141 -189 50 2 13 64 24 -32 46 265 241 -95 -175 -15 104 14 -57 194 -46 -293 -52 38 73
4959G3PR5k31Rl8J29l79J50L72J15m44L46J17o52L71J79l99Q3k31M35M5l85K00
$$ 73 80 175 -56 -47 -85 44 -335 -185 187 302 -142 204 321 -331 40 219 -180 -97 -328 107 152 -233 -33
4982c3k2OJ22q0K45k59J82j03l52K75j78M4M07k76j44K11R0lk80mK68J80n80L63
$$ -33 -55 -49 73 -7 238 -21 161 58 -294 -19 -197 -153 254 -22 -166 45 135 132 -148 -152 116 296 -284 79
5006G9j94J63L9l01K8J77M13n09J70j13L33j99L5l3k15K4K12J4J47l17J93l91
$$ 79 -115 48 87 -214 -186 -9 404 -105 65 -48 285 86 121 88 -127 -103 109 123 270 -47 146 -245
5028b45L03j34m4q0K08j21L03l15RR3R4M5M8j21j05M0L32l73N7J42q1L5l78K88
$$ -245 58 -76 -120 -200 8 -113 190 -125 -116 -23 71 116 164 43 -62 -22 310 -63 -6 136 55 90 -288 0
5052@J84k38j99L0M68l33K07j80P7J99k66j61K66q4k3k8J0J07k74K92RK7k38K33
$$ 0 184 -54 -253 -223 245 -88 119 -61 16 215 -51 -212 54 -30 -53 -81 -71 36 -238 54 63 90 -148 85
5076H5p4l6O9P2j53J48k50l8J45J06j32rK12L76n60q6J55j28L6R7k6L4k25J46
$$ 85 11 -25 44 116 -37 111 -139 -177 -32 74 -58 -67 145 521 -39 -125 30 -98 -62 35 9 43 -182 -36
5100c6L1R5O3J48m24m07P01j13Oj3P6l38L08j02M8j30O0K56k9m57q4N33l57K97
$$ -36 -5 90 153 301 -123 -530 171 58 64 51 127 -211 97 -5 43 -87 -27 229 200 -257 -341 192 -165 132
5124A32j04j2R2K28n53nK23J24l2J78k78j14J7k0K21m6k2m61N60N4j00J84r8m54
$$ 132 28 16 108 336 -217 -222 1 125 93 271 -7 -121 -104 -124 97 51 29 -432 128 182 82 266 168 -286
5148b86K43j51oJ93O6R5k49J32J43lJ49l12j0M7l24K56L68l58j41L03n89L37K30
$$ -286 -43 -194 -200 -7 59 154 -95 37 180 177 326 14 4 51 -273 -17 351 -7 -148 155 -434 -97 133
5171A33j53j16J04J19p1P1M7J38k83j12P9m70N38j12p5j09L42m5P7m0K77m83J15
$$ 133 -20 -136 -32 87 16 87 134 272 -11 -123 -44 -514 24 -88 -163 -272 70 25 102 62 339 -144 -29
5194b9J63n20L64o3Q2m0K3KN1l6K8k29l9p8M11j63R5J76j69r7K4L82l94L30k6
$$ -29 134 -386 -22 -85 -3 -43 -20 -18 33 -3 25 -204 -243 -321 90 -73 22 198 29 -68 -44 338 -56 274 248
5219B48j72j01qK7l9J32K15n04J62J58k94J78L2J88n41J21k10J72K46K67m23J17
$$ 248 76 -25 -33 -6 -45 87 302 -202 -40 118 -176 2 34 222 -319 -198 -408 -236 10 277 -146 -29
5241b9L62j68R8j57l39K92j61Q6m63M44k85O8M89j99J72M7k19l7j69K85k61J71
$$ -29 333 165 263 106 -233 59 -102 -16 -479 -35 -320 -252 237 38 210 257 38 1 -168 117 -144 27
5263B7J15k8N1j27j44j15N50m42K22k75K50L55q18Q40j08k87j8k80R1J9J21q0
$$ 27 142 114 165 38 -106 -221 329 -113 109 -166 84 439 -379 461 353 66 48 -232 -141 -122 -1 -81
5285h1J16k34L10j54Q2j40N8M9j64N96o77L06k5j43K21O4r8P5j07J45J15j13j84
$$ -81 35 -199 111 -43 39 -101 -43 6 -158 438 -239 67 42 -101 120 184 86 161 54 199 314 201 17
5308A7k3Q7m27K2M50N2k20J91r7J03nj66nj44L73m09K08J06j39R8j10j77K79K8
$$ 17 -6 81 -346 -324 126 178 -42 149 52 155 150 -16 -21 -165 208 -201 7 113 -26 72 -38 -215 64 92
5332I2J40q2N4m45J64M9j34M9L72n01M00j17n0j09J26K66p64M39k21L48p1j58
$$ 92 232 150 204 -241 -77 -28 -162 -113 259 -242 158 41 -9 -118 8 274 -490 -51 -272 76 5 -153
5354a53J96j51K3m0K48j93j83J51J70m22K06K37r9J08l8M5j19j9j88J94j04N15
$$ -153 43 -108 -85 -125 123 -70 -253 -102 68 -354 -148 89 -10 98 60 105 -14 -33 -221 -27 -131 384
5376C84n61K02m4M5k05L21N7k35K84j17l7l0m8J9j15J1kJ68k15J78P4j58J86m38
$$ 384 -177 25 -19 26 -179 142 199 -36 248 131 94 64 16 35 -80 -69 -71 97 -118 60 134 -24 162 -276
5400b76M92m6j73K76k40n01L08k8l3K06r5l91L68L82o24N88q9p3k65J31K47l68
$$ -276 216 170 -3 273 33 -468 -160 -188 -221 -15 -110 -501 -133 249 -375 213 124 51 -214 -83 164 -204
5422b04j66K24K84k90K01N7k12K34l19J81k5J22J37l19lK35J26o6n23O83j91K00
$$ -204 -370 -146 138 -152 49 106 -106 128 -191 -10 -35 87 224 -95 -98 137 263 197 -326 357 166 366
5444C66k68J94k14K4l60K56L16m38Q5j75M28nL1l93L79Q1l64k71M90j53j81j2
$$ 366 98 292 78 102 -258 -2 314 -124 -39 -214 214 209 240 -153 226 307 -57 -328 162 9 -172 -184
5466a84M25k41K61K4m64L88nk12N4l83K94j5J71k71L35m41M29j5J24k17J55k6
$$ -184 241 0 261 285 -179 209 204 -8 46 -337 -43 -58 113 -158 177 -264 165 150 274 57 212 186
5488A86m16k6K48k22J56Jk66M74K78k85k62K77K14n30K09Rl17M35j15k64J20J61
$$ 186 -230 -256 -8 -230 -74 -73 -339 135 413 128 -134 143 357 -173 36 45 -272 163 48 -216 -96 65
5510F5PM1n1pk3qj49L50N5m85L66k4k26k4K27L6k32K5K88k83R5j5l4l13M62k98
$$ 65 72 113 62 55 32 24 -125 225 280 -205 161 137 -89 -113 114 150 -82 -57 231 -52 43 28 -6 -319 143 -155
5536a55j69N41j85l13N32j41l2J96j40j96K90j03k01N3M20o05L44J44m49M20k39
$$ -155 -324 217 32 -281 251 110 78 274 134 -62 228 125 -76 -23 397 -208 136 280 -169 251 12
5557A2k01K25K5k71L37k92J29P4p7j1j6J97jnr3l35N87k53jJ1m4J6k0N6J42l26
$$ 12 -189 36 61 -210 127 -165 -36 38 -39 -50 -66 131 130 125 32 -303 284 31 30 41 -3 13 -7 49 191 -135
5583a35JK38J28m2n1%j02j09K00k39L50p1l43k3K80j63N3J1l04K31j59L09j85
$$ -135 -134 104 232 190 139 139 37 -72 128 -111 239 168 -175 -198 82 -81 -28 -17 -321 -90 -249 60 -125
5606a25j77R7j12K73j12Q8P2kNj73j3K18K52j06j37j13j81Q6J47Q8J3%jj5l30
$$ -125 -302 -205 -317 -44 -156 -68 4 2 7 -166 -179 39 291 185 48 -65 -246 -160 -13 75 88 88 87 72 -258
5631b58M29j03j17J05l97L63j02n8k3K35j8K19k86J37k65L92k04r4J99j38K1j43
$$ -258 171 68 -49 56 -341 22 -80 -138 -161 74 56 275 -11 126 -139 253 49 -45 154 16 37 -106
5653a06O1j23K79K18j31O3j01m58J86J27m11O5K95k78K47L10n57O95l81J27p0
$$ -106 -45 -168 111 329 198 261 160 -298 -112 15 -396 -331 -36 -314 -67 243 -314 381 0 127 57
5674E7J93J7l14J79m2J10k80oM00p8j93j26R7j29j31L65o9j55L00l83N6M19k59
$$ 57 250 267 -47 132 90 200 -80 -86 314 236 43 -83 14 -115 -246 119 50 -105 195 -188 -132 287 28
5697B8j42j59L89l41J87m6M31k42k45K61k9j20k5k05L30k48L5M20j82j93P2M5
$$ 28 -114 -273 116 -225 -38 -84 347 105 -140 121 92 -28 -53 -258 72 -176 -141 279 97 -96 -24 21
5719B1L8j36j51k25L66m0Q8K18m35n4R0K85M7p3j33n4M06k88Q8j57M7J13RM05
$$ 21 59 -77 -228 -453 -87 -127 -39 179 -256 -310 -220 65 112 39 -94 -148 258 -30 58 -99 -52 61 70 475
5743D75n96J39J3j2j36J03J02j67l46M23R4k52J25L97n20R2M3j7n6J31n5K42n68
$$ 475 -121 18 31 19 -117 -14 88 -79 -425 -2 92 -160 -35 362 -158 -66 -23 -40 -96 35 -20 222 -346
5766c46L82j97R2J21k18q2L99n14L20q8M11k37k44J15K85j06l86M26l14J64R2
$$ -346 36 -161 -69 52 -166 -248 151 -363 -43 -131 280 43 -201 -86 199 93 -293 133 -181 -17 75
5787G5P3k39J17%R7o1k30J91j03q8M1J14J9L5J15Lj1k89R9L2K85m20O3J36p6l73
$$ 75 148 -91 26 26 123 62 -168 23 -80 -168 -127 -13 6 41 156 159 148 -141 -42 -10 275 -145 -82 54 -22 -395
5813c95N14ok13J06J12J11L8j31Nj50j37L22m65K48P5M2j77Q0k18J08J75l8J52
$$ -395 119 113 -100 6 118 229 267 136 141 -9 -146 176 -289 -41 34 76 -101 -21 -239 -131 44 6 158
5836A58l97M21j75J86p5M1k41P0O5j41J42l3mJ05j31j44K5K43l0j19J99l56M48
$$ 158 -239 182 7 193 118 159 -82 -12 53 -88 54 21 17 122 -9 -153 -128 115 85 -34 165 -191 257
5859B57l41L15q6J0l89O7N24k90k67L50rM7k57L96k53j7k42J41K59o29K57J75
$$ 257 -84 231 145 155 -234 -167 357 67 -200 150 141 188 -69 327 74 57 -185 -44 215 -414 -157 18
5881A8N3M44l99j29K01r3R4k00L38k13j23j50J95j8k7k51L74J69k06rK52o45L57
$$ 18 71 515 116 -13 188 95 189 -11 327 114 -9 -159 36 18 -9 -260 114 283 77 68 320 -325 32
5904C2j30J84K1k59M38k07L1M3p0Jj18K12m55K15J9j13R6q5k15M52j95L09n9l76
$$ 32 -98 86 107 -152 286 79 110 153 83 84 -34 178 -277 -62 -43 -156 -60 -145 -360 92 -103 206 147 -229
5928b29M26J20l83rJ33l8j01K52k06L8J08J70l12j39L41j22K05o7k43K58m06K16
$$ -229 197 317 -66 -75 58 20 -81 171 -35 3 111 281 -31 -170 171 49 254 187 -56 202 -204 12
5950A2k8K2on4No4K74j80L23m24O2J10j00o5R0k9o2l2R5QJ44l29J91P2j35K49
$$ 12 -16 6 0 -54 -49 -113 161 -19 304 -120 -58 52 -48 -113 -23 -52 -114 -146 -51 -43 101 -228 -37 35 -100 149
5976A49l39K72l84N99J3j50K53l61K5q8K74l86L43m06L55j57k8m7J62j20m7q3
$$ 149 -190 82 -302 297 310 160 413 52 77 -11 263 -123 220 -186 169 12 -16 -63 99 -21 -68 -151
5998a51j6J94N6J3J09l39J5j67L96J95j74K39k23j11R9Om63N55l95J53J4L88j87
$$ -151 -167 27 83 96 205 -134 -119 -286 110 305 131 370 147 36 135 141 -322 233 -162 -9 5 393 206
6021B06L5k12k2j43R6P8R1q9p1n1L60l7n20L73l0L8o6o7K32j93Q1J45N5m01J22
$$ 206 241 29 7 -136 -40 38 129 40 -31 -82 278 241 -279 94 64 102 36 -31 201 8 89 234 289 -112 10
6046A0J74m8j25j64K68pj17M3l3J28N3m68K45J03o4K7j98J09J48J80l94J41J42
$$ 10 184 136 11 -153 115 108 -9 34 1 129 182 -286 -41 62 -2 25 -173 -64 84 264 -130 11 153
6069A53k73L70k50J73l41J48k03L06j14P9qQ8q6k9J89m8l57j4M55k14J3k50o2
$$ 153 -120 250 0 173 -168 -20 -223 83 -31 48 40 128 42 13 202 154 -203 -217 238 24 37 -213 -275
6092b75L36J31k67l81N29Ml11L19J30J07k10k12j74K92j74L69m47l5N37j9r4m9
$$ -275 61 192 -75 -456 73 77 -234 85 215 322 112 -100 -274 18 -156 213 -234 -269 268 249 155 106
6114A06Q4k87L07q2J24l65k90O05P5l41K2k0J57l17K00k85L45K4k71J23K90l16
$$ 106 190 -97 210 128 252 -113 -403 202 277 -64 -42 -62 95 -222 -22 -307 38 62 -209 -86 204 -112
6136a12R3r4oL3m6L39J13j20j75j21n6K0O6N4j37m3L96l05q9R6R5K9l60N48k44
$$ -112 -19 -113 -119 -86 -132 207 320 200 25 -96 -152 -132 -66 -12 -149 -192 204 -101 -190 -94 1 30 -330 218 -26
6161b6J10n34L50M8J38j31M0p9O7K97j13j57j14J2k25K03J58J4k83M05j63j25
$$ -26 84 -450 -100 -52 86 -45 -5 -84 -17 280 167 10 -104 -92 -317 -114 44 58 -225 180 17 -108
6183a08L94nj15j33M5J30k97j7N0j94K27K65J45m89M82j68j96J61l66K81k03K26
$$ -108 286 281 166 33 78 208 -89 -106 -56 -250 -23 242 387 -102 380 212 16 177 -189 92 -111 115
6205A15j15J06j54RJ23rQ0k4j02J37o7k92N6J82K43j06k44K60n59L36J48J08l58
$$ 115 0 106 -48 -39 84 75 155 131 29 166 99 -193 -137 45 288 182 -62 198 -361 -25 123 231 -127
6228a27j7N7j06N33m25M05l57L1K9J50l24K67j34m4O9N3k93m6K58K43k88J4J32
$$ -127 -144 -87 -193 340 -85 320 -37 -6 23 173 -151 116 -18 -62 7 60 -233 -279 -21 222 -66 -52 80
6251H0j1J66j01l25K82P3j68q8j7K97j83J0Pk56J37j79L64N9k37K48Q0j36k03
$$ 80 69 235 134 -191 91 164 -4 -92 -109 188 5 15 22 -234 -97 -276 88 147 -90 158 238 102 -101
6274a01J43o4j7k2k56M49R1k33p5K2K7J27j39k7J94k71L12l64M9K5j87M48m7k24
$$ -101 42 -22 -39 -61 -317 132 223 -10 -85 -63 -36 91 -48 -75 119 -152 160 -204 -155 -130 -317 131 84 -140
6298a40Q5K77k93J32k4K56k46o55N99l7J67k0k51j20L95j48L5R1k79J84j45M93
$$ -140 -55 222 -71 61 37 293 47 -608 -9 -46 121 101 -150 -270 125 -23 12 103 -176 8 -137 356
6320C56k30j61J23Nk34P8K05j13J9nJ7J86j88k49R5j73L62K26j35m76M32K15m55
$$ 356 126 -35 88 93 -141 -63 142 29 48 43 60 246 58 -191 -96 -269 93 319 184 -292 140 355 -100
6343a00J70L5n9J05j68q3R3k7j79J81J05L16o77L26k1j86K78l57K00K86j76J62
$$ -100 70 105 46 151 -17 -100 -7 -34 -213 -32 73 389 -288 38 17 -169 109 -248 -48 238 62 224
6365B24r3m28L19k53JM17m0qq4J3m4NJ8o4k2L5L05l09J86k01J14mn50K66J29j
$$ 224 131 -297 22 -231 -230 187 147 139 55 68 24 29 47 -17 -39 -4 301 -8 178 -23 91 87 -463 -197 -68 -69
6391f9K02N5l17K91m52L87K7L5j77O9l70M68j19J17k71K14J12j25J5J15n02L71
$$ -69 133 188 -129 162 -290 97 124 159 -18 51 -319 149 30 147 -124 90 202 77 92 207 -295 76
6413G6Jl6O7k31P5J20m25L29L44k66m7l94J44J83m0K88j44o7k82M44l2k48J61
$$ 76 77 41 108 -123 -48 72 -353 -24 320 54 7 -387 -243 -60 -100 188 44 -23 -305 139 107 -141 20
6436B0k01K44j94QM16j84m1k27J18J49N3N5j72k16L63k55J09l5n3L67j33k90J33
$$ 20 -181 63 -131 -123 293 109 68 -159 -41 108 161 216 44 -172 191 -64 45 10 -43 324 191 -99 34
6459C4K36J68n52J08K39k92L50m51L0K74j10r6j09J13j67J81Mj67J08J34O3k85
$$ 34 270 438 -114 -6 233 -59 291 -160 -130 144 34 -62 -171 -58 -225 -44 -40 -207 -99 35 98 -187
6481a87M56o04N47j15p0j82K43j16n6L96n90O80m70K40o8m67O54n70K20j74L41
$$ -187 269 -335 212 97 27 -155 88 -28 -84 312 -278 402 -68 172 104 -363 291 -279 -59 -233 108
6502A08j89J67%j50p0o7j12L33o6J25q6j22K40J0r4L4j71K52K31l49j35m0K3J80
$$ 108 -81 86 86 -64 -134 -201 -313 20 -46 79 -7 -129 111 121 27 61 -110 142 373 24 -111 -151 -128 52
6526E2J22k1j88n2L75j61j43L5j28j31L41j33J50o3M2m5L5k07J10l42J94J56M4
$$ 52 174 153 -35 -87 288 127 -16 19 -109 -240 101 -32 118 55 97 52 87 -120 -10 -352 -158 -2 42
6549D2K55l11J4l6J34l46M3K32j3j22R7K85n8k66p5J50k14J21J25j63j81M85J42
$$ 42 297 -14 0 -36 98 -248 -205 27 14 -108 -11 274 216 -50 -125 25 -189 -68 57 -106 -287 198 340
6572C40l48o0J00j54K82k08n2k6J76Q5j51j12L65j43l06K17k18J95j86J67K50
$$ 340 -8 -68 32 -122 160 -48 -100 -126 50 135 -16 -128 237 94 -212 5 -213 -18 -204 -37 213
6593B13P5l23L0k24L31k76P9J63MJ79J69n68L90k45l98N53k67J76k70N87o20M19
$$ 213 288 -35 -5 -229 102 -174 -95 68 72 251 420 -148 242 -3 -401 152 -115 61 -209 378 -242 177
6615A77m1r8p9j12J01k57O8J1J18J26m4L4J9n6k68J51K04j39J30k03J55l58Q70
$$ 177 136 38 -41 -153 -52 -309 -241 -230 -112 14 -30 4 23 -33 -301 -150 54 -85 45 -158 -3 -361 509
6638E09o68r4M60j92j63J53J33k13KL5o5K4p0P4j6N6k12J07J57k3L11k14k93J59
$$ 509 -159 -253 207 15 -148 5 138 -75 -73 -38 -103 -79 -149 -75 -91 -35 -247 -140 17 -6 305 91 -202 -43
6662d3J43j45L08r3j15j79J48O1O4j25J67k25R9l39L6K96k6j73L36k86l8L24p0
$$ -43 100 -45 263 170 55 -124 24 85 149 24 191 -34 65 -274 -238 58 32 -141 195 -91 -129 195 125
6685A25j69p6j2J22j2J08k11KK28j55R0K31N7o19L52k63k49Q22n63j12N62L1l20
$$ 125 -44 -120 -132 -10 -22 86 -125 -123 105 -50 40 271 328 -291 61 -202 -451 371 -192 -304 258 289 -31
6708c1K5K03j24r8k49M86m49M13l22K06j50l60J86J85O1j09K26O1j54k4j44k0
$$ -31 -6 197 73 -25 -274 212 -237 176 -146 60 -90 -450 -264 -79 -18 -127 99 160 6 -18 -162 -182
6730a82n7J80l6K08k80L32l37qK11J90j74K64l83K88m73L97k5j92J5P2k53K87
$$ -182 -239 -59 -95 113 -167 165 -172 -180 31 221 47 311 -72 216 -257 140 115 -77 -62 10 -243 44
6752D4J13l83j31L05j47r0L78j16N1k08K50k66k6J36L47k94R6L75j35m76P8j9
$$ 44 157 -226 -357 -52 -199 -289 89 -27 24 -184 66 -200 -226 -90 257 -37 59 434 299 -177 -99 -118
6774a18J24p0K1J91k68m7K68j28L7q6JJ59P0%m09Q2K30M6j59J33r5K88k72j03
$$ -118 6 -64 -43 148 -120 -167 101 -27 10 -76 -75 84 154 154 -255 -173 57 103 -56 77 -18 270 -2 -105
6798a05j71L83K3k38J54L3j90K25k23J50N2k98J35P8p7j32M39k7l66J26J07L4
$$ -105 -276 107 130 -108 46 79 -111 114 -109 41 93 -205 -70 8 -69 -201 238 211 -155 -29 78 112
6820A12Jj09J7M8L8k96k8J23J57j70K07r7Nk24M00l03PJ74P0K28l73j02l1L8M14
$$ 112 113 4 21 69 107 -189 -217 -94 63 -107 100 3 8 -216 184 -119 -112 62 132 360 -13 -115 -146 -108 306
6845C06m47K02m79L01O4J06n8L3m9j37J39k90L11M5P3%K67k46P6k66m06O10j63
$$ 306 -141 61 -418 -117 -53 53 -5 28 -21 -158 -19 -309 2 47 120 120 387 141 217 -49 -455 155 -8
6868hJ88m2l75J80j1k81M42j33k45J50J68K10k02N2R2n04N15l54L51k34j67K01
$$ -8 180 138 -237 -57 -68 -349 93 -40 -285 -135 33 243 41 93 185 -319 196 -158 193 -41 -208 -7
6890gJ75j87M4J6j8o0J49j59K02k13m6n1L44j63k62L39j37J54j5l04m4K56Q4l0
$$ -7 168 -19 25 41 23 -37 112 -47 155 -58 -104 -155 189 26 -236 103 -34 120 105 -199 -243 13 97 67
6914F7k90K01K6K17l06R0RJ06L2p1j87J12m70O68j15N8j69j19K17J86n06R3K03
$$ 67 -223 -22 4 221 -85 5 14 120 152 81 -106 6 -464 204 89 147 -22 -141 76 262 -244 -151 52
6937E2r0Q4j38O7K45k59J34K06k44L43l33j30j29L86l11MQ4Q5m35K96R0J68k26
$$ 52 -38 46 -92 -25 220 -39 95 301 57 400 67 -63 -192 194 -117 -113 -29 56 -379 -83 7 175 -51
6960e1R8k59j88L79J66m7l22L8N7P6n4J85R6p7k05J76J66l71J72O0j93K05j56
$$ -51 47 -212 -400 -21 145 98 -224 -186 -129 -53 -107 78 174 97 -108 68 234 -137 35 95 -98 107 -49
6983d9K44j14j38J90k69J24J25Q4j76j6k28K80j62J34j6k86N60k01k19K37M9l6
$$ -49 195 81 -57 133 -136 -12 113 197 21 5 -223 57 -105 29 13 -273 287 86 -133 104 153 117
7005A17j07J14J00n55J54K00K02j46j80ll8L71k20p5J5J24k37PJ27J22p6j25r
$$ 117 10 124 224 -331 -177 23 225 79 -101 -104 -142 229 9 -66 -51 73 -164 -157 -30 92 16 -109 -118
7028a18k3L91r8j83k91K45K19j18l07J89K50k63J43J54n9j60n11L62K31m4L4j4
$$ -118 -141 250 152 -31 -322 -77 142 24 -283 -94 156 -107 36 190 131 -29 -540 -178 53 9 43 29
7050B9j96k25K07N61l19k73L65k47N6j06K80l36J89J21j21K06r2P5l41L28l22
$$ 29 -167 -392 -185 376 57 -216 149 -98 -42 -148 132 -204 -15 106 -15 191 99 174 -167 161 -161
7071a61O39o91j4L20K0k28J69J20k37krK41m00K36J61k72k7J35k08L03j73K09
$$ -161 478 -213 -227 93 113 -115 54 174 -63 -65 -74 167 -233 3 164 -108 -135 0 -208 95 -78 131
7093A31k82J35l4j35J51K46m79K3L66J63k39K84k87j19K74j74J19l22L81kl80
$$ 131 -151 -16 -50 -185 -34 212 -267 -244 122 285 46 330 43 -76 198 24 143 -179 202 200 -180
7114a80O5j75M0K75p0k75K67K50k78k59K45j58O08m64J77j12j31L91j96m32M41
$$ -180 -115 -290 -250 25 -45 -320 -53 197 -81 -340 -95 -253 355 -109 68 -44 -175 216 20 -412 29
7135B9J0m3l5o3Oj32R0K4O9k27J75M22n06J51o5k2K64r0o3o7J64k5j82m8R1J20
$$ 29 39 -4 -39 -102 -96 -228 -138 -114 -45 -272 -97 325 -181 -30 -95 -117 147 57 -6 -73 91 66 -116 -164 -73 47
7161D7j20Q1j91J35J22j10J00j58j99M09M4j78P1j34R8j1N4N4k29Q9j04J18k8
$$ 47 -73 8 -183 -48 74 -36 64 -94 -293 116 160 -18 53 -81 17 6 60 114 -115 -26 -130 -12 -40
7184d0J62m15J84J49o5J2L8k58K92k42M97l16J82m9j22Q0k9P8k56J00K1j60j04
$$ -40 122 -293 -109 40 -25 -13 25 -233 59 -183 314 -2 180 131 9 89 60 138 -118 -18 3 -157 -261
7207b61O86o03K73q0J28P4m10K53l50J23M0O5K37R7Q7l73J58j55M4K54n32K68
$$ -261 425 -178 95 15 143 217 -193 60 -290 -167 -127 -62 175 272 359 -14 144 -11 33 287 -245 23
7229B3K1L7k42O6L34j37J1J86k80J63l51J2L14r1k09n6L25j36K07m82K90l8k7
$$ 23 44 81 -161 -95 239 102 113 299 19 182 -169 -157 157 66 -143 -199 126 -10 197 -285 5 -33 -60
7252f0OQ7q4J14k76K66nj17L3Rk63K47K9r4J18m5q3P1L35k06J3k34J29qq7J16
$$ -60 -54 33 -51 63 -213 53 48 -69 -36 -27 -290 -43 -14 -108 10 -35 -118 -47 288 82 95 -139 -10 -18 -105 11
7278A1j34K55k12p8K99k8K9O0o2j73N1o8l4p6L80m97L50j31J17J06j04J40j95
$$ 11 -123 132 -80 -158 141 113 142 202 140 -33 18 -50 -84 -160 220 -277 73 -58 59 165 61 201 6
7301FJ40j88R7k74M74k37L7j75K8p7N8K22p1O0N4k62J57L76l54n2j81rJ53j34
$$ 6 146 -42 55 -219 255 18 55 -120 -92 -169 -111 111 40 100 154 -108 49 425 71 19 -162 -171 -18 -152
7325a52J40J69l60J12J26kl30M20k57K12Rj23n6J73l24j52O63J19k75j65r3K19
$$ -152 -12 157 -203 -91 35 33 -297 123 -134 78 87 -36 -92 81 -243 -395 268 387 112 -53 -146 73
7347G3j68J37K74m05L79j38j79l26L65K78m13j5L15l12O0J43j65J50R3j08k53
$$ 73 -95 42 316 -89 290 152 -27 -353 12 290 -123 -138 177 -135 -75 68 -97 53 146 38 -215
7368b15J34o7J46n3l1J45j21j00L01k14j02J73J30l61N80j58k12m0J13K25j27
$$ -215 -81 -148 -2 -55 -86 59 -62 -162 139 -75 -177 -4 126 -235 345 187 -25 -65 48 273 146
7389A46N2m09K99M8j87L32m29K88J63m34K58j37r0J2K9K65m1L8l57M20k40j80
$$ 146 198 -211 88 136 -51 281 -148 140 303 -131 127 -10 -100 -88 -59 206 165 203 -154 266 26 -154
7411a54L01m2q3o4J04P1k8j6j42l0K62p9J60l28K6j01q1M15k86P2K37p6j37L9
$$ -154 147 105 22 -42 62 133 105 89 -53 -83 179 100 260 -68 -42 -143 -224 191 -95 -23 214 138 1 40
7435D0M0j54k3k5J40Q8k66M09k32j02j51oL86j49J04j03k9L17k35m6j6m3q4K92
$$ 40 80 -74 -97 -122 18 106 -160 249 17 -85 -236 -242 144 -5 99 -4 -33 284 49 3 -13 -56 -140 152
7459A52k21J41j26j81K83lL20r9k0k11l67L35K7R5l4l45J7J65J2J14m04L84K9
$$ 152 -69 72 -54 -235 48 45 365 266 246 35 -332 3 30 125 91 -254 -237 -72 -60 54 -350 34 63
7482F3j43r9K38J79j50K72l59N7j78L01k83M09n02K74j35J62j69J17%q5m80O12
$$ 63 -80 -179 59 238 88 360 1 58 -120 181 -102 307 -195 79 -56 106 -63 54 54 -31 -511 101
7504A01K3qk90K71J04m37M13K53l70J13l12J34J4m00J93J85m4K94K01m73j93J52
$$ 101 124 116 -174 97 201 -236 177 430 60 173 -139 -5 9 -391 -198 -13 -57 237 438 -35 -228 -76
7526g6J93M4j73K58j84j29R3J7J51k54J92k11M48m10MkL0L5q6K23l67K4K85K50
$$ -76 117 161 -12 246 62 -67 26 43 194 -60 132 -79 369 -41 -37 -39 -9 26 -60 163 -204 -180 105 355
7550C55m10J02j84J23R2M3K3j18K61j74k09K92l71K81k46J6K77j70J8k43L6J93
$$ 355 -55 47 -137 -14 78 121 144 26 287 113 -96 196 -175 106 -140 -124 153 -17 1 -242 -206 -13
7572a3J05k81K04J78n2j15k02q8J49M3L4k21N7M2J81j15K41l41L85P6k39j51J86
$$ -13 92 -189 15 193 141 26 -176 -264 -115 -72 -38 -259 -202 -160 21 -94 147 -194 191 267 28 -123 63
7595F3j30K1K10k12ol9J65R8m5k2n8j65J90o1j73P35o77N00m33q2j17M80k68j90
$$ 63 -67 -46 164 -48 -54 -93 72 170 125 103 45 -120 70 9 -164 571 -106 394 -39 -121 -238 242 -26 -216
7619b16J62Ol13K97M9L0l6Q5k94J53O0J42j74P3J40k80p5K96J97k16N2k15p8L64
$$ -216 -54 -48 -361 -64 -15 15 -21 64 -230 -77 -17 125 -49 24 164 -116 -191 105 302 86 138 -77 -155 209
7643B09j04l17J9Q5J03J84l39M76k79K03j78j50j6o0J66j40J43L1k05L13j76j85
$$ 209 105 -212 -193 -108 -5 179 -160 316 37 240 62 -88 -104 -164 2 -138 5 36 -169 144 -32 -217
7665b17P1J31m03M55O7R5j7n98M30j11K07Mj07J76n3j25o2Q9j18J13j78N19n18
$$ -217 -146 -15 -418 37 104 199 182 -416 14 -97 110 114 7 183 130 5 -57 32 -86 27 -151 368 -150
7688a50o7N86k06k03K04J5j53K02jj98J48k05K83m76K92k2j44M4K20rj76K0j34
$$ -150 -217 369 163 -40 164 179 26 228 227 29 177 -28 255 -221 71 49 -95 -51 169 160 -16 4 -130
7711a30l7J08lP7l46N53K9l44K59j98L58l52L2L5j57J2L8K28k40O3K6J13j42j62
$$ -130 -167 -59 -62 15 -331 222 251 -93 166 -32 326 -26 6 41 -116 -104 -66 162 -78 -15 11 124 -18 -180
7735a80k8J4J8OK5L25o6J82l19j11K49J8l41K24j37j93J78p5K84k20q0J82K32
$$ -180 -208 -194 -176 -170 -145 180 114 296 -23 -134 115 133 -208 16 -121 -314 -136 -211 73 -147 -227 -45 187
7758A87k77r5J87l09J30R8K96l59K16k04K97L4l42N3L8L30m46P3J00o5J68k24
$$ 187 -90 -185 2 -307 -177 -79 217 -142 74 -130 167 201 -141 -88 -50 280 -166 -93 7 -58 110 -114
7780a14J18J05l16M32k8k89l3O7j8J17k11J13k3J93r1J41R1n40L9K67K53k39o5
$$ -114 4 109 -207 225 197 -92 -125 -58 -76 41 -170 -57 -80 113 22 163 254 -286 -247 20 273 34 -31
7803c1L81k77Oj29r6J02Q4j3l3k58J62m4j40J83L46n78K56N5R4K0j80QO2O9k23
$$ -31 350 73 79 -50 -146 -44 40 27 -6 -264 -102 -146 -286 -103 243 -335 -79 -24 70 90 -90 -82 -20 49 -174
7828a74k21J32O8P3K81k02mK01p7J22l86n8M79k72J35j11m1j23J20Nq4OK85j07
$$ -174 -395 -263 -195 -122 159 -43 -47 154 77 199 -187 -245 234 -38 97 -14 -55 -178 -58 -53 -137 -131 154 47
7852D7j4j41J4P3k23L76j84J11k90L08q2mL7Q2l00L53j63O4n5p9N8k80K45OK17
$$ 47 33 -108 -94 -21 -244 132 -52 59 -231 77 -5 -9 28 110 -190 163 0 64 9 -70 -12 -292 -47 -41 176
7877A76l13L49pk20L87j77m65N06l24j27L95J20j60j14J54L3j92L2J15j08M3j52
$$ 176 -137 212 205 -15 372 195 -270 236 -88 -215 180 300 140 26 180 213 21 53 168 60 103 -49
7899d9Km14J98K49o7M0qL5j46O43l65m19J90KJ18l30M88j14K32k93J59L06n76
$$ -49 -47 -461 -263 -14 -81 -41 -49 -14 -160 483 118 -301 -111 -109 9 -321 167 53 285 -8 151 457 -119
7922a19K62j99L7k29K18p3K92m9j07O5k61K15j06L0m1p6n1K4L46m17K68r8j36
$$ -119 143 -56 -19 -248 -30 -103 189 140 33 98 -163 52 -54 -24 -65 -141 -192 -168 178 -239 29 -69 -205
7945b05M65k62LJ28j27j76K55j3m17M39r5J70kj98j01K57j54K9J30j84K61Q5j52
$$ -205 260 -2 1 129 2 -174 81 68 -349 90 -5 165 163 -35 -136 121 -33 -4 126 -58 203 288 136
7968A36k06q9j25M02J34j98n1j71J23J47k61j3J74j12J14l06R6K75L6j62k3J98
$$ 136 -70 -159 -284 118 252 54 3 -168 -45 102 -159 -172 2 -110 4 -302 -206 69 105 -57 -80 118
7990A18k67J20P9k80J03J30j56J60K89j6n7k40j11k06N71k59J58P4k73N1KK76
$$ 118 -149 -29 50 -230 -127 3 -153 7 296 280 223 -17 -128 -334 237 -22 136 210 -63 -12 -10 266
8012B66l76Q8O5k08J17k0R0R1k76K40r4m3K04j56k90J48J05k24l8L13Q5j75N6
$$ 266 -110 -22 43 -165 -48 -68 22 113 -163 77 -17 -60 144 -12 -302 -154 -49 -273 -311 2 87 -88 -32
8035c2O7K0lJ43j77NN7K23k4k88J24j36p6m9K16j96l34N06q3k12K03j50K55j59
$$ -32 35 55 52 195 18 23 80 303 279 -9 115 -21 -97 -146 70 -126 -460 46 -37 -249 -46 -196 59 -100
8059a00l9R6J85k51J12J60j34p6K10n3r5J71k76K98q0j99J60N8q7k21K71r6J35
$$ -100 -139 -43 142 -109 3 163 29 -47 163 110 15 186 -90 208 128 -71 89 147 60 -161 110 14 149
8082A49o4k7kn1o7J89M5n5j74P0k67K19J38j8L6Q7k64J80j59n8O4p2N2K31k45
$$ 149 85 58 56 5 -62 127 172 117 -57 13 -254 -35 103 85 121 208 -56 124 -35 -93 -29 -101 -49 182 -63
8107f3r0L73m55J47J5K11K45k87R5K3q9q7J33l34lJ56m9K32j2l23J25K60l83J07
$$ -63 -153 220 -235 -88 -73 138 383 96 191 214 125 38 171 -163 -166 -10 -59 173 161 -162 -37 223 -160 -53
8131e3K30j98J8P3r4L6J43k8m4j39J05l51J20L81l33J3oj53J08N9K09J09k38j44
$$ -53 177 -21 -3 70 -24 12 155 127 83 -56 49 -302 -182 199 -134 -121 -127 -280 -172 -113 96 205 -33 -177
8155a77M04l72J15p8j70K34Lj69M62k59J2l19K35K63k23K16j31J2j61L4n2O1k3
$$ -177 227 -145 -30 -108 -278 -44 -41 -210 252 -7 5 -314 -79 184 -39 177 46 58 -103 -69 -121 -60 -83
8178h3j93Q8L64k24J37k7j13J00K73k16l97J74L23
$$ -83 -276 -188 176 -48 89 62 -51 49 322 106 -291 -117 206
8191B06
$$ Imaginary data points
##PAGE= N=2
##DATA TABLE= (X++(I..I)), XYDATA
0@%%%qK4l2L2m0N6q0J12j36J60k00K48l04L68m40N20o08P15q41R77j123J287j478
$$ 0 0 0 0 -8 16 -16 16 -24 32 -48 64 -72 88 -112 136 -168 200 -240 280 -328 387 -454 523 -600 687 -791
26g91J693j927K186k467K778l128L514l934M389m889N442o051O718p446Q242r124
$$ -791 902 -1025 1161 -1306 1472 -1656 1858 -2076 2313 -2576 2866 -3185 3533 -3913 4329 -4795
42d795J0105j1191J2399j3746J5261j6982J8954k1242K3923k7115L1004l5862
$$ -4795 5310 -5881 6518 -7228 8033 -8949 10005 -11237 12686 -14429 16575 -19287
54a9287M2127n0547O2526q1034J13594j87023O16225M5764j244130O55523K4176
$$ -19287 22840 -27707 34819 -46215 67379 -119644 496581 542345 -701785 -46262 -22086
65b2086j75568O55342j98867o82291Q37392N6793j073003K39971N87140l22697
$$ -22086 -197654 457688 258821 -423470 413922 470715 -602288 -362317 224823 -97874
75i7874L57875J14387p75731L01899M92639q86977j8072Q66349k42109j32752
$$ -97874 260001 374388 -401343 -99444 393195 -493782 -511854 354495 112386 -20366
85b0366L33124p00176j11096R45499l67371o16519P56510J04348n12062L76449
$$ -20366 312758 -387418 -498514 446985 79614 -536905 219605 323953 -188109 188340
95A88340j47952o01098O28306K99617o44217L37831M05903o24543m415K86201
$$ 188340 40388 -560710 67596 367213 -277004 60827 466730 -157813 -162228 123973
105A23973m03275K77601M70168o11005o1032N92001m32500l06060M43038k29304
$$ 123973 -279302 -1701 468467 -142538 -203570 388431 -44069 -350129 92909 -136395
115a36395k3083P02795l67052o24137N28781L5105m71146M67804J46625m82434
$$ -136395 -159478 543317 176265 -447872 80909 116014 -355132 112672 259297 -223137
125b23137L51806J56584o21277K08907L93255m34359R3958M04234l45738j0424
$$ -223137 128669 285253 -336024 -127117 266138 -168221 -74263 329971 -15767 -26191
135b6191K66772m75157o0068N37738k08762j54506L83457k90268k62099M55437
$$ -26191 240581 -234576 -294644 243094 34332 -120174 263283 -26985 -289084 166353
145A66353j62266l60333M73440P2315l63019L23457O49n67660K32412L50183k73062
$$ 166353 4087 -356246 117194 189509 -173510 149947 150596 -417064 -184652 165531 -107531
156a07531J62727K25524m29068k882L06096k86536j1634L81519j65636r1982K24686
$$ -107531 55196 280720 -148348 -151230 154866 -131670 -143304 238215 72579 -19403 205283
167B05283k78140j42963L56834j22230j55346L93977o0184l42061J89647l6472
$$ 205283 -72857 -215820 141014 18784 -136562 257415 197231 -144830 44817 8345
177H345k37604L66603J08771m33599J26091K40806k82422K0778J60883k56515
$$ 8345 -229259 137344 246115 -187484 -61393 179413 -103009 -82231 78652 -177863
187a77863Q8598L15801k29188j19835K12135j53121r6536K16224r0756m8593K48964
$$ -177863 -89265 226536 -2652 -122487 89648 -63473 -160009 56215 -34541 -83134 165830
198A65830j46946j95893K49100k5875k08931K11420M8371j63552K16849J813l74737
$$ 165830 18884 -177009 72091 46216 -162715 48705 97076 -66476 150373 152186 -222551
209b22551J09728K42032j64600M6763J55630k12189k4513J74779j69312n4078
$$ -222551 -112823 129209 -35391 11372 167002 -45187 -69700 105079 -64233 -118311
219a18311K28751o0268r3301J25447r0564r7449J31978p2641o8593K30363n716
$$ -118311 110440 50172 -43129 82318 -8246 -105695 26283 -46358 -114951 115412 109696
230A09696j81955R1036p328j28685J65769M8411k05191J09701J50259j84286k6504
$$ 109696 -72259 18777 11449 -117236 48533 96944 -108247 1454 151713 -32573 -59077
241e9077J02032j28607K4348J91714q1256p2671R4060r6856r0406J20578P387
$$ -59077 42955 -85652 -61304 130410 49154 -23517 70543 -26313 -116719 3859 11246
252A1246l2098Q7517o1444q6637R5004k7574r0679J18131L9832p7661Q5196j3356
$$ 11246 -20852 66665 5221 -81416 13588 -13986 -104665 13466 53298 -24363 60833 47477
264D7477j74907O8986J17522r2249L2380R7652j16361l2244J08850n6302l9221
$$ 47477 -127430 -58444 59078 -33171 -791 96861 -19500 -51744 57106 804 -38417
275c8417R9504k6414n2776P1828j5111o5277L1616j7937k3630Q1276m793n9696
$$ -38417 61087 34673 -18103 53725 38614 -26663 4953 -12984 -36614 44662 39869 -19827
287a9827M9875j2308p0677N9063Q585q3389O8966O7230r4242j0281M4932q0559
$$ -19827 30048 17740 -52937 6126 14711 -68678 288 67518 -26724 -37005 7927 -72632
299g2632J557J16424j3111m1619M2271l8813n9667N1505K5333j7147L0417k74
$$ -72632 -71075 45349 32238 -9381 32890 -5923 -65590 -14085 11248 -5899 24518 24244
311B4244k9098J2260j7544k2976M5600J6924j3502L5887j9162p4005K4168L4132
$$ 24244 -4854 7406 -10138 -33114 12486 29410 15908 51795 32633 -41372 -17204 16928
323A6928m2543K3651M8625n4054j9520N1806k7731l6287M3920Q140k5006L0096
$$ 16928 -25615 -1964 46661 -7393 -26913 24893 -2838 -39125 4795 12935 -12071 18025
335A8025J0096m2503j4983Q672L151J7601J4561K602K239j8733j5870J6912l216
$$ 18025 28121 -14382 -29365 -20693 -17542 59 14620 17222 19461 728 -15142 1770 -1446
348a446j0721L7776J2037m3516m360J0813l4607P541N5294m354k7502J5027p737
$$ -1446 -12167 25609 37646 -5870 -10230 583 -34024 -26483 28811 24457 -3045 11982 4245
361D245l4135J4079K5798j5155p342J6487l745j7237J242J0112j361k136J7701
$$ 4245 -29890 -15811 9987 -5168 -12510 3977 232 -17005 -15763 -5651 -7012 -9148 8553
374H553J3524j6062r160J2866r837j8837J7797J7111j3973N645K1372k0728k4127
$$ 8553 22077 6015 -3145 9721 -116 -18953 -1156 15955 1982 7627 28999 8271 -15856
387a5856J7871J0366j0438J6887J5876k7531k6954N949n6o963K1306K3117j5604
$$ -15856 2015 12381 1943 18830 34706 7175 -19779 -13830 -13886 -20849 457 23574 7970
400G970k0570K960l918j0298J7312K4732j0905j9241M745m045j7556J4134K6894
$$ 7970 -12600 -9640 -13558 -23856 -6544 18188 7283 -11958 -7213 -11258 -28814 -14680 12214
413A2214p239n815J8539n416k3255R205J5278j2595j238J8155p781j9400R136
$$ 12214 4975 -840 17699 12283 -10972 -1767 13511 916 -322 17833 10052 -9348 -212
426b12Q855j2902o48J6179K117r111N544L599k1975j5311J7924R266j0475R368
$$ -212 8643 -4259 -4907 11272 13389 4278 9822 13421 -8554 -23865 -5941 3325 -7150 2218
440B218J0233k5692j0020K5903J034j3905K1958R099k7561j967J1746j7302l915
$$ 2218 12451 -13241 -23261 2642 3676 -10229 11729 20828 -6733 -8700 3046 -14256 -18171
453a8171K5642O728r340k85k741p283K648J1095Q289j0068j6080R131P638j9041
$$ -18171 7471 14199 4859 4574 1833 -5450 -2802 8293 16582 6514 -9566 -435 7203 -11838
467a1838J385J4973j7826j321L5801r295k8357K0318J026k9737J9625K3934k4481
$$ -11838 -10453 4520 -13306 -14627 21174 11879 -16478 3840 4866 -24871 -5246 18688 -5793
480e793m253J7753j4283o550J7589m407j703J9707K208p944j1128k0712J2967
$$ -5793 -10046 7707 -6576 -13126 4463 56 -1647 18060 20268 12324 1196 -19516 -6549
493f549K6829j4964m386J6842k6894j2362L7168r516k2559L8277q74m7071K1911
$$ -6549 20280 5316 930 17772 -9122 -21484 15684 6168 -16391 21886 21012 -26059 -4148
506d148K2186m1345K263K9542j9046M860K1944l1920j0020L6449R1j0637K054
$$ -4148 18038 -23307 -21044 8498 -10548 -5688 16256 -15664 -25684 10765 10856 219 2273
519B273j8648J1061L0671k8873j8314L0555j3970j0340M3457j3511l1124M1474
$$ 2273 -16375 -5314 25357 -3516 -21830 8725 -5245 -15585 27872 14361 -16763 24711
531B4711p311n3501M1976L4004n2584K736K7619l4298R625L0430m2486n305N2347
$$ 24711 17400 -36101 5875 39879 -12705 -9969 17650 -16648 -7023 23407 -19079 -24384 27963
544B7963j1224k2237Q861k4651L107M2401k5403k1019L7096k1418k3445M9619
$$ 27963 16739 -5498 3363 -21288 -18181 24220 -1183 -22202 14894 -6524 -29969 19650
556A9650j0735l5443M8983l069n3846N0784K4115p2066J3290M3354m0187J1583
$$ 19650 8915 -26528 22455 19386 -34460 16324 40439 -31627 -18337 25017 -15170 -3587
568c587L7903n3641n293N8050k8639k3191L5523k2679q871M4206l3457k8499M6457
$$ -3587 34316 -19325 -24618 33432 4793 -18398 17125 -5554 -14425 29781 -3676 -32175 14282
581A4282k2956k6795O4765r564n1942M8633l367n8600O2652K8496q0025K4023
$$ 14282 -8674 -35469 29296 19732 -32210 16423 13056 -45544 17108 45604 -34421 -10398
593a0398M4719o3450J5513N5951o2926p509O8030l3972j8373M5202m5517k1507
$$ -10398 34321 -29129 -13616 42335 -20591 -28100 39930 5958 -12415 32787 -12730 -34237
605c4237P1684k1104m4358M0378k1956k3440P3963k3712p3784O8697K1858o8157
$$ -34237 37447 16343 -28015 12363 -9593 -33033 40930 17218 -56566 12131 33989 -34168
617c4168M4611J9664p5506M5280M2332r3210K0982Q7738o4732k9472N9983l3897
$$ -34168 10443 30107 -45399 -119 42213 -50997 -30015 57723 -7009 -36481 23502 -10395
629a0395k118O5160o4574m1226R5985p100o4735L1686j7867j6032Q9731k8273
$$ -10395 -12513 52647 -11927 -53153 42832 35732 -29003 2683 -15184 -31216 58515 30242
641C0242r5904P3949L8180p7127L7644K5187p6571N1766M7386j09764J8964J00219
$$ 30242 -65662 8287 46467 -30660 6984 32171 -44400 7366 54752 -55012 -36048 64171
653F4171p8243l5448Q1262l5019j4463O8930o9954m4290J11937j3572q3605N1436
$$ 64171 -14072 -49520 31742 -3277 -17740 51190 -18764 -63054 48883 35311 -48294 3142
665C142J956l5725P3059k5345q7630Q9856L9013j01354L8983N1688p9351L0887
$$ 3142 5098 -30627 42432 17087 -70543 19313 58326 -43028 -4045 47643 -31708 -821
677h21M3297j00494L6938J05943j02825n0088J03206k3507l1744O2503o2130l9487
$$ -821 42476 -58018 -21080 84863 -17962 -68050 35156 11649 -20095 42408 -19722 -59209
689e9209J20958k0435j06588N8251K5222m5165N9636j6107q5942Q6113M4452j05763
$$ -59209 61749 41314 -65274 -7023 18199 -26966 32670 16563 -69379 16734 61186 -44577
701d4577L1047O2429p5650K2446N0871r4474K2086J03542r3711m9336J05535k6020
$$ -44577 -13530 48899 -26751 -4305 46566 -47908 -25822 77720 -15991 -65327 40208 14188
713A4188m2802P4251m7645n8644J05781o400r4669O0413J9348o4905N9570J2234
$$ 14188 -28614 45637 -2008 -60652 45129 38729 -55940 4473 23821 -41084 18486 30720
725C0720q7851N5190M6228q3367L7824N6343r3024J1036P5623p5259k04Q5455
$$ 30720 -57131 -1941 44287 -39080 -1256 55087 -37937 -26901 48722 -26537 -26741 58714
737E8714p9149l3756J06226m0708n9578Q6225k0405o3877Q1993l777q2841O3273
$$ 58714 -20435 -54191 52035 11327 -48251 37974 17569 -46308 35685 31908 -50933 12340
749A2340K0105p7543N0794L2955p7935L4587M1907p2405L2196N6150q4966L205
$$ 12340 32445 -45098 5696 38651 -39284 -4697 37210 -35195 -2999 53151 -31815 -28610
761b8610P4628o2850j0672P3755o4960l2838R4207l1610n5342P7325j5922o6116
$$ -28610 46018 -16832 -27504 46251 -18709 -51547 42660 11050 -44292 33033 17111 -49005
773d9005P3252J0454p5234M6742K0841o5420M4530L2414p5585K3117M9395n3825
$$ -49005 24247 34701 -40533 6209 27050 -38370 6160 38574 -37011 -13894 35501 -18324
785a8324J6916M2144o8737O812O6339n7379j7938O7646m5846l1221P3144k9768
$$ -18324 -1408 40736 -28001 -21189 45150 -12229 -30167 37479 -8367 -39588 33556 3788
797C788m4451P2905j3961o5698O3299J7418o4006L5444J5894n8950M0628L4823
$$ 3788 -40663 32242 18281 -47417 15882 33300 -30706 4738 20632 -38318 2310 37133
809C7133o6503J3699M4696m3772J2455L6917n7917M324N9992m6714j6989N4078
$$ 37133 -29370 -15671 29025 -14747 -2292 34625 -23292 -18968 41024 -5690 -22679 31399
821C1399m1029k5837O5888k3537m0906O0386j2415n3901N5265J3622n8579L1821
$$ 31399 -9630 -35467 30421 6884 -34022 26364 13949 -39952 15313 28935 -29644 2177
833B177J9107n0736K8778K8909n5307J2241M0455l8135O758L3500m3917J472M6169
$$ 2177 21284 -29452 -674 28235 -27072 -14831 25624 -12511 -5753 27747 -16170 -14698 31471
846C1471l8098j1823M6578l3731k3826N2657j7625l1708M8819j1418m5156M8772
$$ 31471 -6627 -18450 28128 -5603 -29429 23228 5603 -26105 22714 11296 -33860 14912
858A4912J3703n0851K3311J6143m1352K4269K4766m7845Q284L6117l0433J643
$$ 14912 28615 -22236 1075 17218 -24134 135 24901 -22944 -14660 21457 -8976 -7333
870g333K6233l2561K521L7445l2019j1747L8187k5951j9610M2566j5208k4804
$$ -7333 18900 -13661 -11140 26305 -5714 -17461 20726 -5225 -24835 17731 2523 -22281
882b2281M1987j1054l7911M2483J1763m3550J9521J5448l4315J9573J9819m0352
$$ -22281 19706 8652 -29259 13224 24987 -18563 958 16406 -17909 1664 21483 -18869
894a8869O827L1666k6142j250K3903k3337Q8K6506k5380p507L2193k1895j8230
$$ -18869 -12042 19624 -6518 -7768 16135 -7202 -7114 19392 -5988 -13495 18698 -3197 -21427
907b1427L3131q881j8686K9353j1198k7790L8704J0217l9427J3129J5858k5506
$$ -21427 11704 2823 -15863 13490 2292 -25498 13206 23423 -16004 -2875 12983 -12523
919a2523J3396J4669l1495O227K7482k1928o011K0475j1921r05J7697j9623m919
$$ -12523 873 15542 -15953 -9726 17756 -4172 -10183 10292 -1629 -2534 15163 -4460 -9379
932i379K4586j6235j6117K3976m149j3893K0644q611k0433K9836Q109l1883J0663
$$ -9379 15207 -1028 -17145 6831 2682 -11211 9433 822 -19611 10225 18334 -13549 -2886
945b886J4600k0293P405J2415k3269L254K1131j5817o330J8177p364m075J2373
$$ -2886 11714 -8579 -1174 11241 -12028 -8774 12357 -3460 -9790 8387 1023 -3052 9321
958I321j0242m265J6406j1548j1291J8736l953j2183J4505n116j3206K1524M519
$$ 9321 -921 -5186 11220 -328 -11619 7117 3164 -9019 5486 370 -12836 8688 13207
971A3207k3320Q896J1714j6939L235J1541j5486l60J4877j0949n371J4571l820
$$ 13207 -10113 -1217 10497 -6442 -3207 8334 -7152 -7512 7365 -3584 -8955 5616 1796
984A796n691R007m139l230Q829p213o107J0493k798p445R383k270q078J2953L012
$$ 1796 -3895 5112 973 -2257 6572 -641 -6748 3745 947 -6498 2885 615 -7463 5490 8502
999H502j4933O705Q436j2338J288R472j0781k986J0300m986m586Q807o61n040
$$ 8502 -6431 274 8710 -3628 -2340 7132 -3649 -6635 3665 -1321 -5907 2900 2239 -2801
1013b801M883l8l026K778k233j703L657k708l663N015p41l878P819J217p948M553
$$ -2801 2082 2044 -982 1796 -437 -2140 1517 -1191 -4854 161 -580 -4458 3361 4578 -3370 1183
1029A183M635p983O31O905p031l418O846k107l684N144J882m022J545K458k229
$$ 1183 5818 -2165 -1534 5371 -1660 -5078 1768 -339 -4023 1121 3003 -1019 526 2984 755
1044G55l16M14q93j8k483k96K799j732p09M484o38l608L885K210m695O04L552
$$ 755 439 853 -40 -58 -2541 -2837 -38 -1770 -2479 2005 1367 -2241 1644 3854 -841 -237 3315
1061C315l748l381M452q65l472L543K910k784L50K239r21j366J155N37k251k294
$$ 3315 -433 -3814 638 -227 -3699 -156 2754 -30 320 2559 1638 272 1427 1964 -287 -2581
1077b581J068J436k371Q89K693j168j861M012J081m345P25K574l668j527L490
$$ -2581 -1513 -77 -2448 -1559 1134 -34 -1895 2117 3198 -1147 -422 2152 -1516 -3043 447
1092D47j567k947L482K631k776n4K978l99j189J336J99k585j881J709Q63j605
$$ 447 -1120 -4067 -585 2046 -730 -784 2194 1795 606 1942 2141 -444 -2325 -616 247 -1358
1108a358L45K266j513j694M752R65m751J470K294l820j150L244k755l258M859
$$ -1358 -1013 1253 -260 -1954 2798 3763 -988 482 2776 -1044 -2194 1050 -1705 -4963 -104
1123a04J822l685J488K616j878K52K241j420j711r68n84J791n35r61K092q67j870
$$ -104 1718 -1967 -479 2137 259 511 2752 1332 -379 -1347 -1931 -140 -675 -1636 456 -411 -2281
1140b281N272J480n703J057L972m528j173M713m851l093O691j58n649M705K287
$$ -2281 2991 4471 -1232 -175 3797 -731 -1904 2809 -2042 -5135 1556 1398 -4251 454 2741
1155B741m046K458K237l455K13Kl241K553J365l054J436P53l563N552M194q135
$$ 2741 -1305 1153 3390 -65 148 150 -3091 -538 827 -2227 -791 -38 -3601 1951 6145 -1990
1171a990M87P175o566j250P255o736n528J0300j120p273P215N86o242O035L197
$$ -1990 -1503 5672 -894 -2144 5111 -1625 -7153 3147 2027 -5246 1969 2555 -3687 2348 5545
1186E545p570K019K126n518L406K882p727L137M065o655M911O015r355P33Q875
$$ 5545 -2025 -6 2120 -3398 8 2890 -4837 -1700 2365 -4290 621 6636 -2719 -1986 6889
1201F889r164j693J1427q384p961J2389j402r394J0850k0j0753J0201N415j2074
$$ 6889 -2275 -3968 7459 -925 -8886 3503 2101 -7293 3557 3537 -7216 2985 8400 -3674
1215c674L226M694r254N176M983j1016K655P660r697L520J0196j1665p88J2255
$$ -3674 -448 4246 -5008 168 5151 -5865 -3210 4450 -5247 -1727 8469 -3196 -3984 8271
1229H271r998l825J5117j0902j0648J7592j815j3395J2653J147j3202J3503M939
$$ 8271 -1727 -5552 9565 -1337 -11985 5607 3792 -9603 3050 4197 -9005 4498 9437
1242I437j7494P437R248j3628L119P863j3316N029J0519j5992K920J6535j2714
$$ 9437 -8057 -620 8628 -5000 -1881 5982 -7334 -2305 8214 -7778 -4858 11677 -1037
1255a037m541J4030j1446k666J9423j4640j5845K2965M47j7424J4015M04j5843
$$ -1037 -5578 8452 -2994 -5660 13763 -877 -16722 6243 6690 -10734 3281 3685 -12158
1268a2158J8622O500k4663R335J4326j7722L007J1108j7652N042J5851j9438l32
$$ -12158 6464 12964 -11699 -2364 11962 -5760 -2753 8355 -9297 -4255 11596 -7842 -8174
1281h174K1002j4272o561J9523j2979p396K3667j3302j9186K5483m8k2282J8894
$$ -8174 12828 -1444 -8005 11518 -1461 -8857 14810 1508 -17678 7805 7757 -14525 4369
1294D369L462k2586J8544J0748k6359R840J6675k3517L088J8546j9832j457J9451
$$ 4369 7831 -14755 3789 14537 -11822 -1982 14693 -8824 -5736 12810 -7022 -8479 10972
1307A0972j8343j414K4796j7510j2035K5192q799j2265K3165j2210k0554K9223
$$ 10972 -7371 -8785 16011 -1499 -13534 11658 2859 -9406 13759 1549 -19005 10218
1319A0218J156k8941J8920R330k4810J7213J2331k9845J1363K2864k7813j594
$$ 10218 11374 -17567 1353 10683 -14127 3086 15417 -14428 -3065 19799 -8014 -9608
1331i608K3078j8903l804K2280k0294o470L0141j4498j7330K5648o673j4581K5431
$$ -9608 13470 -5433 -9237 13043 -7251 -13721 16420 1922 -15408 10240 3567 -11014 14417
1344A4417j0076k5389K8803O132l1110J7819J0637k6775J6884J6726l2106P992
$$ 14417 4341 -21048 7755 13887 -17223 596 11233 -15542 1342 18068 -14038 -6046
1356f046K6002k6781k925K5850k0439p680K5245j6957j0348K8709j2457j8653
$$ -6046 19956 -6825 -9750 16100 -4339 -12019 13226 -3731 -14079 14630 2173 -16480
1368a6480K7186l825j9312K2683l876k4650K6387N025l2318J8213J5420k8161
$$ -16480 10706 6881 -12431 10252 6376 -18274 8113 13138 -19180 -967 14453 -13708
1380a3708J0730J8852k7746P346K4859k8904n055L1086j6717j3613K1936j2513
$$ -13708 -2978 15874 -11872 -4526 20333 -8571 -13626 17460 743 -12870 9066 -3447
1392c447q707K8675j3647k2852K7911K957k0205J6897l827k0685K6521N243l3923
$$ -3447 -12154 16521 2874 -19978 7933 10890 -9315 7582 3755 -16930 9591 14834 -19089
1405a9089J5138J8765k5460P528J7051k6309P794K6131k8503p564L0917j4736
$$ -19089 -3951 14814 -10646 -3118 13933 -12376 -4582 21549 -6954 -14518 16399 1663
1417A663j4343K2127j1870j0553K7040j0710k1778K5831L067k0931J6752q6k1226
$$ 1663 -12680 9447 -2423 -12976 14064 3354 -18424 7407 10474 -10457 6295 6209 -15017
1430a5017K2225N730k9903J4362J7346k6718O697J9509k3178L846K3055k5141
$$ -15017 7208 12938 -16965 -2603 14743 -11975 -5278 14231 -8947 -5101 17954 -7187
1442g187n558L0480j6229j6335K3130o987j3194K2469p871j9405K4202L672k2161
$$ -7187 -12745 17735 1506 -14829 8301 1314 -11880 10589 2718 -16687 7515 11187 -10974
1455a0974J4274M283j9029J6734N910k6172J2739J5821k4086M710J8936k0585
$$ -10974 3300 7583 -11446 5288 11198 -14974 -2235 13586 -10500 -5790 13146 -7439
1467g439J251K2279k0515o931K6337j2506j5768K1835o624j5172K1421k372j9527
$$ -7439 -6188 16091 -4424 -11355 14982 2476 -13292 8543 1919 -13253 8168 5796 -13731
1480a3731J7680M105j7170J3903L552k0674J3508J0520k1317O528J1766j8939
$$ -13731 3949 8054 -9116 4787 8339 -12335 1173 11693 -9624 -3096 8670 -10269
1492a0269P240J7318k2161j672K3784j4355q897J9868j0942j0632K0998p682j7296
$$ -10269 -3029 14289 -7872 -9544 14240 -115 -9012 10856 -86 -10718 10280 2598 -14698
1505a4698K0086K078j8213J2346L805j3158J3220L010j9872J1195J1899j8102
$$ -14698 5388 7466 -10747 1599 5404 -7754 5466 8476 -11396 -201 11698 -6404
1517f404K598R685j3965O369J3959k0861k62K2489j2462r932J6799o909q473J6393
$$ -6404 -3806 5879 -8086 -1717 12242 -8619 -8881 13608 1146 -8786 8013 1104 -7369 9024
1531I024q208j4697J9543K537j8466Q471P075r020Q543O20j5843J1148J1662j7064
$$ 9024 816 -13881 5662 8199 -10267 -1796 5279 -3741 4802 5422 -10421 727 12389 -4675
1545d675j056R630q772M676Q362j7158J674K0526j1719j0631J5042l606p367J2547
$$ -4675 -5731 3899 -4873 -197 8165 -8993 -7319 13207 1488 -9143 5899 2293 -5074 7473
1559G473p678j1821J7256L010j7971O366Q420p851N984J081j2372Q605R679j3782
$$ 7473 -205 -12026 5230 8240 -9731 -3365 5055 -2796 3188 4269 -8103 502 10181 -3601
1573c601j256Q762p557K874O790j2372J171J5354r833p668J3629l654q029J0400
$$ -3601 -4857 3905 -3652 -778 6012 -6360 -5189 10165 332 -7336 6293 2639 -5390 5010
1587E010l913r601J2382J752j4270O874P391q412K805M128q159M651O246r996
$$ 5010 1097 -8504 3878 5630 -8640 -1766 5625 -2787 18 4146 -4013 638 6884 -3112
1601c112k07P454o551K33N767p622L38J0557p470n007J1906l511p980Q955j605
$$ -3112 -3319 4135 -2416 -2183 3584 -4038 -3700 6857 -613 -5620 6286 2775 -5205 3750 2145
1616B145q427Q762J628j0690M947O733p559R63N517n666J468M852o268m88M610
$$ 2145 -6282 2480 4108 -6582 -1635 5098 -2461 -1498 4019 -1647 -179 4673 -1595 -2083 2527
1631B527m411j75M608n063n69P015m740k306Q185l427o006P769n22q074N880K330
$$ 2527 -1884 -2059 2549 -2514 -3083 3932 -808 -3114 5071 1644 -4362 3407 2885 -5189 691 3021
1647C021p808L601M413n698J251N086m213o10L795k522j244J948k371o29L523
$$ 3021 -4787 -1186 3227 -2471 -1220 3866 -347 -957 2838 316 -928 1020 -1351 -1980 1543
1662A543k786p62L626k196p66N186l492k966N442n91n547L841J507n458K247L272
$$ 1543 -1243 -2005 1621 -575 -1341 3845 353 -2613 2829 2238 -3309 532 2039 -3419 -1172 2100
1678B100l982K36M697k903j424L211o58j593M79p57l74J043j194j15J963j440
$$ 2100 -1882 -1646 3051 148 -1276 1935 1277 -316 163 -594 -968 75 -1119 -1234 729 -711
1694g11M59K235j877j598L905r69l792K962R36m198J098K917k889p7L743j449
$$ -711 -252 1983 106 -1492 2413 1444 -2348 614 1550 -2648 -1550 1367 -1522 -1599 2144 695
1710F95k021K862O8k360P74N10q02m46k19M29J48n21J049J367j553l33K807j889
$$ 695 -1326 1536 1604 -756 18 528 -274 -720 -939 -510 -362 -883 166 1533 -20 -353 2454 565
1728E65k442K894j30l105J432K027k881J37L030j152j271K211L48k004r5J175
$$ 565 -1877 1017 887 -2218 -786 1241 -1640 -1503 1527 375 -896 1315 1663 -341 -436 739
1744G39r29r65L16R60j156j88J677Q38j811Q32J889k039j292K386n20l129J800
$$ 739 -190 -1155 -839 121 -1035 -1223 454 1292 -519 313 2202 163 -1129 1257 737 -2392 -592
1761e92J359k251J49L090j650j172K379J51j926N6J741j444j488J391L87j115
$$ -592 767 -1484 -1335 1755 105 -1067 1312 1463 -463 -407 1334 -110 -1598 -207 180 -935
1777i35k33J905p9j153J277J258k107m30J878j121k069J818R45k658M78K682j471
$$ -935 -1168 737 658 -495 782 2040 -67 -497 1381 260 -1809 9 954 -1704 -1226 1456 -15
1794a5q37K058M77k419J057J319k274n36J251k52j078K92J319m94n43J382Q86
$$ -15 -852 1206 1683 -736 321 1640 -634 -1170 81 -171 -1249 -957 362 -132 -675 707 1593
1811A593j500n18J987j195k290J771P36k786Q90L266k380o46K649l36k505K477
$$ 1593 93 -425 1562 367 -1923 -152 584 -2202 -1312 1954 -426 -1072 1577 1241 -1264 1213
$$ [...]
8191A49
##END NTUPLES=NMR FID
##END=
