##TITLE=1H_DE-64_EXT2
 CDCl3
 8 sc, 
 13.9.2024
##JCAMPDX= 6.0         $$ Bruker NMR JCAMP-DX V2.0
##DATA TYPE= NMR FID
##DATA CLASS= NTUPLES
##ORIGIN= UXNMR, Bruker Analytische Messtechnik GmbH
##OWNER= root
$$ XWIN-NMR		Version 3.5
$$ Fri Sep 13 14:30:15 2024 Russian Standard Time (UT+4h)  she@DPX200
##.OBSERVE FREQUENCY= 200.1318
##.OBSERVE NUCLEUS= ^1H
##.DELAY= (6, 6)
##.ACQUISITION MODE= SIMULTANEOUS
##.ACQUISITION SCHEME= undefined
##.AVERAGES= 8
##.DIGITISER RES= 18
##SPECTROMETER/DATA SYSTEM= spect
##.PULSE SEQUENCE= zg30
##.SOLVENT NAME= CDCl3
##.SHIFT REFERENCE= (INTERNAL, CDCl3, 0, 15.7039)
##AUDIT TRAIL= $$ (NUMBER, WHEN, WHO, WHERE, WHAT)
$$ ##TITLE= Audit trail, XWIN-NMR		Version 3.5
$$ ##JCAMPDX= 5.01
$$ ##ORIGIN= Bruker BioSpin GmbH
$$ ##OWNER= she
$$ F:/spectra/data/she/nmr/H-F/1/audita.txt
$$ ##AUDIT TRAIL=  $$ (NUMBER, WHEN, WHO, WHERE, WHAT)
(   1,<2024-09-13 14:28:56.50 +0400>,<she>,<DPX200>,
      <created by zg, POWCHK disabled, PULCHK disabled
       configuration hash MD5:
       00 E9 B6 7A A2 85 ED C7 34 08 36 98 17 FE 4E 26
       data hash MD5: 16K
       F4 30 61 B6 69 F2 FC 01 9F 36 35 3A F0 DD E4 92>)
$$ ##END=
$$ 
$$ hash MD5
$$ D0 5C D8 33 A1 7D 19 17 34 0F 39 F8 36 EC CF DA
##$RELAX= 
##$RELAX= 
##$RELAX= 
##$RELAX= 
##$RELAX= 
##$RELAX= 
$$ Bruker specific parameters
$$ --------------------------
##$DU= <F:/spectra>
##$EXPNO= 1
##$NAME= <H-F>
##$PROCNO= 1
##$TYPE= <nmr>
##$USER= <she>
##$AMP= (0..31)
100 100 100 100 100 100 100 100 100 100 100 100 100 100 100 100 100 100 
100 100 100 100 100 100 100 100 100 100 100 100 100 100 
##$AQSEQ= 0
##$AQ_mod= 1
##$AUNM= <au_zg>
##$AUTOPOS= <>
##$BF1= 200.13
##$BF2= 200.13
##$BF3= 200.13
##$BF4= 200.13
##$BF5= 200.13
##$BF6= 200.13
##$BF7= 200.13
##$BF8= 200.13
##$BYTORDA= 1
##$CFDGTYP= 0
##$CFRGTYP= 5
##$CHEMSTR= <none>
##$CNST= (0..31)
1 1 145 1 1 1 1 1 1 1 1 1 1 1 1 1 1 1 1 1 1 1 1 1 1 1 1 1 1 1 1 1 
##$CPDPRG= <>
##$CPDPRG1= <>
##$CPDPRG2= <>
##$CPDPRG3= <>
##$CPDPRG4= <mlev>
##$CPDPRG5= <mlev>
##$CPDPRG6= <mlev>
##$CPDPRG7= <mlev>
##$CPDPRG8= <mlev>
##$CPDPRGB= <>
##$CPDPRGT= <>
##$D= (0..31)
0 1.2 0 0 0 0 0 0 0 0.06 0 0.03 0 0 0 0 0.0002 0 0 0 0 0 0 0 0 0 0 0 0 
0 0 0 
##$DATE= 1726223336
##$DBL= (0..7)
120 120 120 120 120 120 120 120 
##$DBP= (0..7)
150 150 150 150 150 150 150 150 
##$DBP07= 0
##$DBPNAM0= <>
##$DBPNAM1= <>
##$DBPNAM2= <>
##$DBPNAM3= <>
##$DBPNAM4= <>
##$DBPNAM5= <>
##$DBPNAM6= <>
##$DBPNAM7= <>
##$DBPOAL= (0..7)
0.5 0.5 0.5 0.5 0.5 0.5 0.5 0.5 
##$DBPOFFS= (0..7)
0 0 0 0 0 0 0 0 
##$DE= 6
##$DECBNUC= <off>
##$DECIM= 24
##$DECNUC= <off>
##$DECSTAT= 4
##$DIGMOD= 1
##$DIGTYP= 9
##$DL= (0..7)
0 120 120 120 120 120 120 120 
##$DP= (0..7)
150 150 150 150 150 150 150 150 
##$DP07= 0
##$DPNAME0= <>
##$DPNAME1= <>
##$DPNAME2= <>
##$DPNAME3= <>
##$DPNAME4= <>
##$DPNAME5= <>
##$DPNAME6= <>
##$DPNAME7= <>
##$DPOAL= (0..7)
0.5 0.5 0.5 0.5 0.5 0.5 0.5 0.5 
##$DPOFFS= (0..7)
0 0 0 0 0 0 0 0 
##$DQDMODE= 0
##$DR= 18
##$DS= 0
##$DSLIST= <SSSSSSSSSSSSSSS>
$$ [...]
##$SUBNAM2= <"">
##$SUBNAM3= <"">
##$SUBNAM4= <"">
##$SUBNAM5= <"">
##$SUBNAM6= <"">
##$SUBNAM7= <"">
##$SUBNAM8= <"">
##$SUBNAM9= <"">
##$SW= 24.0689170037331
##$SWIBOX= (0..15)
0 0 2 0 0 0 0 0 0 0 0 0 0 0 0 0 
##$SW_h= 4816.95568400771
##$TD= 16384
##$TD0= 1
##$TE= 0
##$TE2= 300
##$TE3= 300
##$TEG= 300
##$TL= (0..7)
0 120 120 120 120 120 120 120 
##$TP= (0..7)
150 150 150 150 150 150 150 150 
##$TP07= 0
##$TPNAME0= <>
##$TPNAME1= <>
##$TPNAME2= <>
##$TPNAME3= <>
##$TPNAME4= <>
##$TPNAME5= <>
##$TPNAME6= <>
##$TPNAME7= <>
##$TPOAL= (0..7)
0.5 0.5 0.5 0.5 0.5 0.5 0.5 0.5 
##$TPOFFS= (0..7)
0 0 0 0 0 0 0 0 
##$TUNHIN= 0
##$TUNHOUT= 0
##$TUNXOUT= 0
##$USERA1= <user>
##$USERA2= <user>
##$USERA3= <user>
##$USERA4= <user>
##$USERA5= <user>
##$V9= 5
##$VALIST= <valist>
##$VCLIST= <CCCCCCCCCCCCCCC>
##$VD= 0
##$VDLIST= <DDDDDDDDDDDDDDD>
##$VPLIST= <PPPPPPPPPPPPPPP>
##$VTLIST= <TTTTTTTTTTTTTTT>
##$WBST= 1024
##$WBSW= 4
##$XGAIN= (0..3)
0 0 0 0 
##$XL= 0
##$YL= 0
##$YMAX_a= 593368
##$YMIN_a= -506585
##$ZGOPTNS= <>
##$ZL1= 120
##$ZL2= 120
##$ZL3= 120
##$ZL4= 120
##$ABSF1= 10
##$ABSF2= 0
##$ABSG= 5
##$ABSL= 3
##$ALPHA= 0
##$AQORDER= 0
##$ASSFAC= 0
##$ASSFACI= 0
##$ASSFACX= 0
##$ASSWID= 0
##$AUNMP= <proc_1d>
##$AZFE= 0.1
##$AZFW= 0.1
##$BCFW= 1
##$BC_mod= 2
##$BYTORDP= 1
##$COROFFS= 0
##$CY= 11.3945322036743
##$DATMOD= 1
##$DC= 2
##$DFILT= <>
##$DTYPP= 0
##$F1P= 15.6554695791079
##$F2P= 12.8336369535428
##$FCOR= 0.5
##$FTSIZE= 0
##$FT_mod= 4
##$GAMMA= 1
##$GB= 0.15
##$INTBC= 1
##$INTSCL= 1
##$ISEN= 128
##$LB= 0.24
##$LEV0= 0
##$LPBIN= 0
##$MAXI= 10000
##$MC2= 0
##$MEAN= 0
##$ME_mod= 0
##$MI= 1.114404
##$NCOEF= 0
##$NC_proc= 0
##$NLEV= 6
##$NOISF1= 3.799351
##$NOISF2= 2.8
##$NSP= 1
##$NTH_PI= 0
##$NZP= 0
##$OFFSET= 15.70392
##$PC= 1
##$PHC0= -26003.68
##$PHC1= 15.98748
##$PH_mod= 1
##$PKNL= yes
##$PPARMOD= 0
##$PSCAL= 0
##$PSIGN= 0
##$REVERSE= no
##$SF= 200.130013532006
##$SI= 16384
##$SIGF1= 3
##$SIGF2= 2
##$SINO= 400
##$SIOLD= 16384
##$SREGLST= <1H.CDCl3>
##$SSB= 0
##$STSI= 0
##$STSR= 0
##$SW_p= 3612.71676300578
##$SYMM= 0
##$S_DEV= 0
##$TDeff= 0
##$TDoff= 0
##$TI= <>
##$TILT= no
##$TM1= 0
##$TM2= 0
##$TOPLEV= 0
##$USERP1= <user>
##$USERP2= <user>
##$USERP3= <user>
##$USERP4= <user>
##$USERP5= <user>
##$WDW= 1
##$XDIM= 8192
##$YMAX_p= 0
##$YMIN_p= 0
$$ End of Bruker specific parameters
$$ ---------------------------------
##NTUPLES= NMR FID
##VAR_NAME=  TIME,          FID/REAL,        FID/IMAG
##SYMBOL=    X,             R,               I
##VAR_TYPE=  INDEPENDENT,   DEPENDENT,       DEPENDENT
##VAR_FORM=  AFFN,          ASDF,            ASDF
##VAR_DIM=   8192,          8192,            8192
##UNITS=     SECONDS,       ARBITRARY UNITS, ARBITRARY UNITS
##FACTOR=    0.0002076,     1,               1
##FIRST=     0,             0,               0
##LAST=      1.7004516,     0,               0
##MIN=       0,             -506585,         0
##MAX=       1.7004516,     593368,          0
$$ Real data points
##PAGE= N=1
##DATA TABLE= (X++(R..R)), XYDATA
0@%%%%%Qj6J6j6J6k4M0m8M8n6P5r6J17j40J63j88K25k71L14l58M10m72N43o21
$$ 0 0 0 0 0 0 8 -8 8 -8 8 -16 24 -24 24 -32 43 -53 64 -76 87 -101 124 -147 167 -191 219 -253 290 -331
29c31P06p96Q97j011J140j279J426j591J771j970K190k428K689k976L296l651
$$ -331 375 -421 476 -535 605 -674 752 -839 932 -1038 1152 -1276 1413 -1563 1733 -1918
45a918M040m471M956n504O131o851P683q658R822j1243J3014j5269J8212k2070
$$ -1918 2122 -2349 2607 -2897 3234 -3617 4066 -4592 5230 -6013 7001 -8268 9944 -12126
59a2126K6382k6406O05518m77829m74285N15475k84817K8138O17447n46800m77282
$$ -12126 14256 -12150 593368 115539 -358746 156729 -128088 -99950 517497 -29303 -506585
70e06585Q64588n362o53814L61022J04134l78393M92936L9916o80906L87898M22301
$$ -506585 358003 352641 -301173 59849 163983 -214410 278526 318442 -362464 25434 447735
81D47735o20087M7491M20329l81038L3092L50217m74829l6460N84655l06122l18359
$$ 447735 -172352 -124861 295468 -85570 -52478 297739 -177090 -213550 371105 64983 -253376
92b53376M63014q9078k83038L62855j02791l34862M30444L8304m81233K75437
$$ -253376 209638 120560 -162478 200377 97586 -237276 193168 231472 -249761 25676
102B5676K24276l81067J32454J99402l21625J52084K42068m31028k903M30278
$$ 25676 249952 -131115 1339 200741 -120884 31200 273268 -157760 -160663 269615
112B69615k19999j90137K16101j64329k0223L72009k28598l13395L40008P3891
$$ 269615 49616 -140521 75580 -88749 -108972 263037 34439 -278956 61052 134943
122A34943k12999J56612n4549k07628K74197O2095l23494J09059J68772j73932
$$ 134943 -78056 78556 24007 -183621 90576 152671 -170823 -61764 107008 -66924
132f6924P0507R4083k25508N9396J98427j67007k7783J48755j56537m7429J76076
$$ -66924 3583 97666 -127842 -68446 129981 -37026 -64809 83946 -72591 -120020 56056
143E6056r3682o2123J49539q5117q4761J52338l6976r2973J37030j4719j25650
$$ 56056 -37626 -99749 49790 -35327 -120088 32250 -4726 -97699 39331 24612 -101038
154a01038J01627K2504j04844Q3365J7126j12886J09412P2169j46942J6358P5212
$$ -101038 589 23093 -81751 1614 18740 -94146 15266 87435 -59507 -43149 32063
165C2063o1789O9085M6840j62573N646J22832o8310j1210P0701r1317j103J19222
$$ 32063 -29726 39359 86199 -76374 -70728 52104 -16206 -27416 43285 -48032 -49135 70087
177G0087q3687m9983J21283m6696n4796J09932o0217r0312J23455k518p6619J03839
$$ 70087 -13600 -63583 57700 11004 -43792 66140 5923 -84389 39066 36548 -40071 63768
189F3768k5479j18761J19960N9074j10740M8261K0994j11685Q5614P7262j50802
$$ 63768 38289 -80472 39488 98562 -12178 36083 57077 -54608 31006 108268 -42534
200d2534J1019J06671r5151M598R5199j07374p343J28775r9592o0130J34545m9168
$$ -42534 -31515 75156 -19995 -15397 79802 -27572 -34915 93860 -5732 -65862 68683 19515
212A9515q6762J00023k8943p1086J23737j9610j37409J09769P1967j12607L9895
$$ 19515 -67247 32776 3833 -67253 56484 36874 -100535 9234 81201 -31406 8489
223H489L2045j12366P6583Q6805j44318j554J11664q2282j4221R3044q4534k3075
$$ 8489 40534 -71832 4751 91556 -52762 -54316 57348 -24934 -39155 53889 -30645 -53720
235e3720J27913o2367q2761J02381k5985p8706J07733N74j06893P2994J7455r1323
$$ -53720 74193 11826 -70935 31446 5461 -73245 34488 35062 -71831 1163 18618 -72705
247g2705R2685N7007j19400K1479O6294p8458K5793P1361r6048j3702R4900o0273
$$ -72705 19980 76987 -42413 -20934 45360 -33098 -7305 64056 -31992 -45694 49206 -11067
259a1067l8573Q5619l8600m1543Q8097l1425o9778P4962l224p0548O3681J4274
$$ -11067 -49640 35979 -2621 -44164 43933 12508 -57270 17692 14468 -56080 7601 21875
271B1875p7061M0829L1089o2702L8792M9112o9421P343O0373m8946q911N1607
$$ 21875 -55186 -14357 16732 -45970 -7178 41934 -27487 -20144 40229 -8717 -17628 33979
283C3979m7041j1642O7997l6186m2366N3040m884k2519M9128j4203n1967L6875
$$ 33979 -13062 -24704 43293 7107 -35259 17781 12897 -9622 39506 25303 -26664 10211
295A0211J5979l6341K4676P586n1264J6715L3370k8892J1165K3010l9390L753
$$ 10211 26190 -10151 14525 22111 -29153 -12438 20932 -7960 3205 26215 -13175 -9422
307i422L9333k2771j0119K2894k2051j0106K7616j3341j6987K6015O04j7667J7225
$$ -9422 29911 7140 -2979 19915 -2136 -12242 15374 2033 -14954 11061 11665 -6002 11223
320A1223j733k1305K0999Q826k4572L170J182j9136J3618J3635j7404J198R710
$$ 11223 9490 -11815 9184 18010 -6562 -3392 -2210 -21346 -7728 5907 -11497 -10299 -589
333e89r124O482J2908j3091m968J3087o188n176Q989j1819p561K1107N027o763
$$ -589 -9713 -3231 9677 -3414 -8382 4705 -1483 -6659 2330 -9489 -17050 4057 9084 2321
347B321N170q294o724J8357M276j0827j115o736r846P629Q229n823J204L305q287
$$ 2321 7491 -803 -7527 10830 15106 4279 3164 -3572 -13418 -5789 2440 -3383 -2179 1126 -7161
362g161K507R413n621J318O989j0663n235M331n462L500J1196m525n747M902J749
$$ -7161 -4654 4759 -862 456 7445 -3218 -8453 -4122 -9584 -6084 5112 587 -5160 -258 1491
377A491O67P961o51j1175J43K211m959M045J02r812M117Q215l582K044K042o122
$$ 1491 2158 10119 9468 -1707 -1564 647 -4312 -267 -165 -9977 -5860 2355 -1227 817 2859 -3263
393c263K800N615m880m430J311l257p69Q540N76m589N253R51j717R331O84q610
$$ -3263 -463 5152 272 -4158 -2847 -6104 -6873 1667 2243 -2346 2907 3858 2141 11472 12156 3546
409C546K642n47p175L355K515l993J533J326m545J974P291q85j315O34r922l886
$$ 3546 6188 5641 -1534 1821 4336 343 1876 3202 -1343 631 7922 7037 5722 6356 -3566 -7452
425g452P919o70k202K238p834l627J1334L336j42L822m940o789M796K392m707
$$ -7452 467 -203 -2405 -167 -8001 -11628 -294 3042 2900 6722 1782 -5007 -211 2181 -2526
440b526K054j208q993L795P733n677L124N990p289K325O300r048j730O105p654
$$ -2526 -472 -1680 -10673 -6878 855 -4822 -1698 4292 -2997 -672 5628 -3420 -5150 955 -6699
455f699o56Q861n461m223R009r13k641J3404j50j1850O716l12j0610J0812L936
$$ -6699 -7355 1506 -3955 -8178 831 -82 -2723 10681 10531 -1319 5397 5085 -5525 5287 9223
470I223j3969M726L415j1074J0079J2351j2270j936P553j1096k202J2643r500
$$ 9223 -4746 -20 3395 -7679 2400 14751 2481 545 8098 -2998 -5200 7443 -2057
483b057q810J1562p551q671J7571p16j0159J4455j669j4216J2773M083j4555Q246
$$ -2057 -10867 695 -6856 -15527 2044 1328 -8831 5624 3955 -10261 2512 6595 -7960 286
497B86M761j8218O170J5649j2457J781J2541j3554J5J9908j3921j0179J6499q576
$$ 286 5047 -13171 -7001 8648 -3809 -2028 10513 -3041 -3026 16882 2961 -7218 9281 705
511G05r678J4880q235j0728J9602K14j6009J3025O804j2789P554L032j7456J1487
$$ 705 -8973 5907 -2328 -13056 6546 6760 -9249 3776 10580 -2209 5345 8377 -9079 2408
525B408J1603k1862j358J4149q506N068J1073j6012J94J7219j1230q948J2517
$$ 2408 14011 -7851 -9209 4940 -3566 1502 12575 -3437 -3243 13976 2746 -6202 6315
538F315l446p012N060r440o723J9221K905j4147N188J290o505J1676K120j1047
$$ 6315 2869 -4143 917 -8523 -15246 3975 6880 -7267 -2079 -789 -7294 4382 6502 -4545
552d545M400k704j1104J1457Q169r208j135K016j137J3128L015j8809J720J4491
$$ -4545 -145 -2849 -13953 -2496 5673 -3535 -4670 -2654 -3791 9337 12352 -6457 -4737 9754
566I754n397m835j524j0013J2354J2442k0221l750J9738j860k681J782j6030Q332
$$ 9754 4357 -478 -2002 -12015 339 12781 -7440 -11190 8548 6688 4007 5789 -10241 -1909
580a909K3906j9783k1445J7879M255m499J1314j5269j0932L4660l24l3040J5694
$$ -1909 21997 2214 -19231 -1352 2903 -1596 9718 -5551 -16483 18177 17853 -15187 507
593E07J2551j6883J2574m787l2725K7815K5766l6223k727K2952j9147Q060K6556
$$ 507 13058 -3825 8749 3962 -28763 -948 24818 -11405 -14132 8820 -10327 -2267 24289
606B4289l3544r831L7783k1583j9172L7455j6359k7344M0181l655l1273L5194
$$ 24289 -9255 -19086 18697 -2886 -22058 15397 -962 -28306 11875 8220 -23053 12141
618A2141J491l6686L6251J4794n1216J6820K9685l6649J0759K5988m7381Q401
$$ 12141 13632 -23054 13197 27991 -23225 -6405 23280 -13369 -2610 23378 -24003 -15602
630a5602N3809l9778k1044M7755k2176j8940M5797k9231l5799N7509n033n1443
$$ -15602 38207 -1571 -22615 25140 2964 -15976 29821 590 -35209 22300 17267 -34176
642c4176L9746J1099m2969L7288J3570n8927L3726M3041n9930R45L9750m5428
$$ -34176 5570 16669 -26300 10988 24558 -34369 -643 42398 -17532 -16587 23163 -22265
654b2265Q763N4303n5519k4844O4207k0439k5376N0310k8208m0676O4637J80o1528
$$ -22265 -13502 40801 -14718 -39562 24645 4206 -21170 29140 932 -39744 24893 25073 -36455
667c6455L7471J5036m6524L9766J5969o7198L1387N3002n2187l030L5464m1272
$$ -36455 1016 16052 -30472 9294 25263 -41935 -10548 42454 -9733 -12763 22701 -18571
679a8571R955N2423n3477k8511O1288j3008l1145M0666j6476l1646N4914k093
$$ -18571 -8616 43807 -9670 -38181 23107 10099 -21046 19620 3144 -28502 26412 24319
691B4319n5023L7422J9953m7080K0566J8093m3772K1921L1300m8185K929M3275
$$ 24319 -30704 6718 26671 -20409 157 18250 -25522 -3601 27699 -20486 -17557 25718
703B5718k9922q923L6893k7558j7892M0228j5256k4374L5073j2573l1394L9208
$$ 25718 -4204 -13127 23766 -3792 -21684 18544 3288 -21086 13987 1414 -29980 9228
715I228R289l4811J6610Q022k2171K5226Q056m2913J0309L4427k1023j1201R407
$$ 9228 18517 -16294 316 8338 -13833 11393 19449 -23464 -13155 21272 249 -10952 -1545
728a545j4116J5254K8779l2035k1007L1194O394r190L423j7133l817K8590m521
$$ -1545 -15661 -407 28372 -3663 -24670 6524 12918 3728 7151 -9982 -13799 14791 10270
741A0270k5077R956J1483l404L593o519p622J7464M884j9997q36P732j055L924
$$ 10270 -14807 -4851 6632 3228 6821 302 -7320 10144 15028 -4969 -5805 1927 872 4796
755D796o889j1306J3722Q587j0228O70P77l482R515j377j4285P852N823j3014
$$ 4796 -2093 -13399 323 8910 -1318 -648 129 -3353 6162 4785 -9500 -1648 4175 -8839
769h839M621P413j1318N754J1315j4345L031J3348j8001J166K1390j6361j1956
$$ -8839 -4218 3195 -8123 -2369 8946 -5399 -2368 10980 -7021 -5855 15535 -826 -12782
782a2782J6049q432k087K4268j6980k1018K8378O186j9648J3942l005k1643K4879
$$ -12782 3267 -5165 -7252 17016 36 -20982 7396 13582 -6066 7876 4871 -16772 8107
795H107P988l4517J3060K0198k5750Q196J9222k7757P519K8712k9949q612L2495
$$ 8107 16095 -18422 -5362 14836 -10914 -2718 16504 -11253 -3734 24978 -4971 -13583 18912
808A8912j7956j5735K8880j5585j9142L6352p034l1777L1191O850l1680K3408
$$ 18912 956 -14779 14101 -1484 -20626 15726 8692 -23085 8106 14956 -16724 6684
820F684P827l5042K1143J9341l9075P061K8636k8787J585L0418k8635q556L8301
$$ 6684 14511 -20531 612 19953 -19122 -12061 16575 -12212 -10627 19791 -8844 -17400 20901
833B0901j9385j7396L4385j5716k8130L5912Q5l0022K6537K248l2594K9212J7191
$$ 20901 1516 -15880 18505 2789 -25341 10571 10656 -19366 7171 9419 -23175 6037 23228
846B3228l7853J1228K3257k9531N264K4035l1662j794L4376k4073j4147L3337
$$ 23228 -14625 -3397 19860 -9671 -4407 19628 -12034 -13828 20548 -3525 -17672 15665
858A5665j3482j6404L1169j0030k4170K9192l61k9016K1382P907k8883J5099J4824
$$ 15665 2183 -14221 16948 6918 -17252 11940 11579 -17437 3945 11852 -17031 -1932 12892
871A2892k5761J0686J9869k8246J317K7141j9665p654K0553j7848q733K8148j1305
$$ 12892 -12869 -2183 17686 -10560 -9243 17898 -1767 -9421 11132 -6716 -15449 12699 1394
884A394j8691K1762l22j6246J8839K227k0857J4808P719k2701R580J4371k0157
$$ 1394 -17297 4465 4143 -12103 6736 8963 -11894 2914 10633 -12068 -2488 11883 -8274
897h274J769J4034j3876K998J6557j4723n234J7620p046r884J2029l870r074J2052
$$ -8274 -6505 7529 -6347 -3349 13208 -1515 -6749 10871 3825 -6059 5970 2100 -6974 5078
911E078k550j3163J1878O448j1144N282L831j0216N475O942r770n54N138p703
$$ 5078 2528 -10635 1243 7691 -3453 1829 5660 -4556 919 7861 -1909 -2463 2675 -5028
925e028j69R206l608m857N008o99j218P562l161p955L801K458l126J319j031m414
$$ -5028 -5197 4009 401 -4456 552 -147 -1365 6197 3036 -4919 -1118 1340 -1786 -467 -1498 -5912
941e912L831L424k958J304K366j803l8J210k156j74K069j959j705J003N78J035
$$ -5912 -2081 1343 -1615 -311 2055 252 214 1424 -732 -906 1163 -796 -2501 -1498 -920 115
957A15J527r71Q79J165j336P54K52j441N32j946k641J678K752n85K97j65k298
$$ 115 1642 671 1550 2715 1379 2133 2385 944 1476 -470 -3111 -1433 1319 734 1031 866 -1432
974a432K938K956k313k343O60k712K63L697k840l190L128j60O97L444k293k430
$$ -1432 1506 4462 2149 -194 466 -2246 -1983 1714 -1126 -4316 -1188 -1348 -651 2793 500 -1930
990a930L037M24k792R68O8l156J339K026l077J231L806j925k86L111k420j022
$$ -1930 1107 1531 -1261 -293 -225 -3381 -2042 -16 -3093 -1862 1944 19 -267 2844 424 -598
1006e98K471j888j697J894j792j703L649J893k316N14J199j425K529K243m295
$$ -598 1873 -15 -1712 182 -1610 -3313 336 2229 -87 427 1626 201 2730 4973 678
1021F78j406J328k155J111K779k725j416K353j35M96K893j381l065J187Q3k158
$$ 678 -728 600 -1555 -444 2335 -390 -1806 547 412 908 3801 2420 -645 542 625 -1533
1037a533J248k54l121J556J911j901K357J249j685N25K88j268QO46j124j390K57
$$ -1533 -285 -539 -3660 -2104 -193 -2094 263 1512 -173 352 640 -628 -620 26 -1098 -2488 -2231
1054b231L00K69K353k64j505J308J109m10J384m30l403m54J287K73P83k93r62
$$ -2231 -1931 -1662 691 427 -1078 230 1339 929 2313 1883 -1520 -1974 -687 -414 369 76 -886
1071h86k84K586J642m83q7j520j642J506l2j252N19j147r28K353Q38m48M87k91
$$ -886 -1170 1416 3058 2575 2488 968 -674 832 800 -452 67 -1080 -2008 345 1183 735 1222 931
1089I31M8k4K01j519o09n7n42o72R47Q9M53J655q74n18J568p27p68J034j224j321
$$ 931 979 955 1156 -363 -972 -1029 -1571 -2243 -1296 -1207 -754 901 27 -491 1077 350 -418 616 -608 -1929
1109a929j30J77N07J116K44q64R39J862j63l55n1j860k27J079j080O6N31p51P69
$$ -1929 -2059 -1882 -1375 -259 -15 -879 60 1922 1759 1404 1353 -507 -734 345 -735 -669 -138 -889 -120
1128a20J048O95K08q9j37j420M06L39j245n2J71j806O88J730J88P82k96m68k09
$$ -120 928 1623 1831 1742 1605 185 591 930 -315 -367 -196 -2002 -1314 416 604 1386 1090 622 413
1147D13O18j45l65j225j195o53R63J231j56r6m7K24J119O01j03j160j243j23l69
$$ 413 1031 886 521 -704 -1899 -2552 -1589 -358 -514 -610 -657 -433 686 1287 1184 24 -1219 -1342 -1711
1166a711K98J156p20j339J323J542K18J624p80j804P85M38o27l24j2j976K88K876
$$ -1711 -1413 -257 -977 -2316 -993 549 767 2391 1611 -193 592 1030 403 79 67 -1909 -1621 1255
1184A255n30q05K489j118o98K179j893j724K654j273l457J630J258j356K738N29
$$ 1255 725 -80 2409 1291 593 2772 879 -845 1809 536 -2921 -1291 -33 -1389 1349 1878
1200A878m524K231M183l238j033K410l740n13L813l616j876N958k283k963N059
$$ 1878 -2646 -415 3768 530 -503 1907 -1833 -2346 1467 -2149 -4025 1933 -350 -3313 1746
1215A746q50k983M811k33o670L961K614o193K456L463o632J863P143n629k53O542
$$ 1746 896 -2087 2724 2491 -4179 -218 2396 -3797 -1341 2122 -4510 -2647 4496 -1133 -1386 5156
1231E156n728j934P791m480n058P141j713n881O745M10p003P360L021r456L689
$$ 5156 -572 -2506 5285 805 -4253 2888 1175 -4706 2039 2449 -4554 2806 5827 -3629 60
1246F0N394p358K571M451j0567P59J0387o176m119P400l750k517R875m423q267
$$ 60 5454 -1904 667 5118 -5449 -4690 5697 -479 -4598 2802 -948 -3465 6410 1987 -6280
1261f280R506J062j0000N575J561p841P284L353j1914M655R656p673m68O141q037
$$ -6280 3226 4288 -5712 -137 1424 -6417 867 4220 -7694 -3039 6617 -1056 -1524 4617 -3420
1276c420m3J0049o828o721Q685j923n204R100j243q053Q685K340r123N441K962
$$ -3420 -3463 6586 -242 -6963 1722 -201 -5405 3695 2452 -5601 3084 5424 -3699 1742 4704
1291D704q581L986M533r024R89Q082n119j582O369n135j699R253l558p319N473
$$ 4704 -3877 109 4642 -4382 -3393 4689 -430 -2012 4357 -778 -2477 6776 3218 -4101 1372
1306A372n02m297N620j024p262N265M938n596L68L770m301J751L953o310j974
$$ 1372 870 -3427 2193 1169 -6093 -828 4110 -1486 -1118 2652 -1649 102 4055 -2255 -4229
1321d229O213j309l913K366j232n68N920j024n350K150L484j960n06N09l175O85
$$ -4229 1984 675 -3238 -872 -2104 -2672 3248 2224 -3126 -976 2508 548 42 551 -2624 -1939
1337a939L044j538k140L126N38j515J389O31j464P73J408k232j906J844K02j776
$$ -1939 1105 -433 -2573 553 1091 -424 965 1596 132 905 2313 81 -1825 19 221 -1555
1353a555K702N3l312K474L005k981J002Q36l922K19M881l977l103M753j550k418
$$ -1555 1147 1200 -2112 362 3367 386 1388 2224 -1698 -1479 3402 -575 -3678 1075 -475 -2893
1369b893M988q35m636O389R14q176L944M283p280K259L364p757K572P880o652
$$ -2893 2095 1260 -3376 3013 3927 -4249 -305 3978 -3302 -1043 2321 -5436 -2864 5016 -1636
1384a636k461Q223l958l685Q514m056p004R918j629r764Q987K471r709O439M177
$$ -1636 -4097 4126 168 -3517 4997 941 -6063 3855 2226 -7538 1449 3920 -5789 650 4827
1399D827r659N712P127j1629P67J0812j0052l155J0744o576m390J2181o615q426
$$ 4827 -4832 880 8007 -3622 -2855 7957 -2095 -5250 5494 -1082 -5472 6709 94 -8332
1413h332J4507l85j1671R151J069j1012R726L576j4937N678R302j2513K156J1089
$$ -8332 6175 5790 -5881 3270 4339 -6673 3053 6629 -8308 -2630 6672 -5841 -3685 7404
1427G404j1096p13J3121j0628m592J4389p228r205J2546l056r882J2607K12j2382
$$ 7404 -3692 -4405 8716 -1912 -6504 7885 657 -8548 3998 942 -8940 3667 3879 -8503
1441h503J0300M632j3554P742Q132j3672J626J0051j0931J61J1461j1091l132
$$ -8503 1797 6429 -7125 617 8749 -4923 -3297 6754 -4177 -4016 7445 -3646 -6778
1454f778J4062n754p211J1326k582q049J0371j808j1344R759M701j2636M333O171
$$ -6778 7284 1530 -5681 5645 3063 -4986 5385 3577 -7767 1992 6693 -5943 -1610 4561
1468D561r227N096P624j2117PJ1686p156l812P804o403m024J0819l599q739R183
$$ 4561 -4666 430 8054 -4063 -4056 7630 474 -3338 4466 -1937 -5961 4858 1259 -7480 1703
1483A703J258p301O651J424q869N898N062r651J299M921n754J783N902p706j570
$$ 1703 2961 -4340 2311 3735 -5134 764 5826 -3825 -2526 2395 -3359 -1576 4326 -3380 -4950
1498d950R054k439l517M503k700l046O758j665o913M003L589m358J410R47l276
$$ -4950 4104 1665 -1852 2651 -49 -3095 3663 1998 -4915 -912 2677 -1681 -271 676 -2600
1513b600M322L538n954j906M819l40j756Q27k904r10M615O4l622J365J441r51
$$ -2600 1722 5260 -694 -2600 2219 1879 123 950 -1954 -2864 1751 1815 -1807 -442 999 48
1529D8J054J012k543l3J441j557p60J143m17j113J928N72k174P22K098m80n7m87
$$ 48 1102 2114 -429 -462 979 -578 -1338 -195 -612 -1725 203 775 -1399 -677 1421 941 884 397
1547C97k517L39L720j088l500k74K915Q58Q85j000l187K670L892l683k794K498
$$ 397 -2120 -1781 1939 851 -2649 -2923 -8 850 1735 735 -2452 218 4110 427 -2367 131
1563A31l1l82J401l249q63O229R5n525J490K694j607K213j035n676L010M492l789
$$ 131 100 -282 1119 -2130 -2993 3236 3331 -2194 -704 1990 383 2596 1561 -4115 -1105 3387 -402
1580d02j723K997j772O46L650l773j764N099j384l861L121o81k996L143J201m789
$$ -402 -2125 872 -900 -254 3396 -377 -2141 2958 1574 -2287 834 153 -2843 300 1501 -3288
1596c288K546K487l643K397K500m408K6L726l005q55K473l055r56M804j231l322
$$ -3288 -742 1745 -1898 499 2999 -1409 -1383 2343 -662 -1517 956 -2099 -3055 1749 518 -2804
1612b804L921R44l239K952J6m183L231J798n152P72K920k162J290J830l204k38
$$ -2804 1117 2061 -1178 1774 1790 -2393 838 2636 -2516 -1744 1176 -986 304 2134 -1070 -1308
1628a308M880j915k655K605j415j889L115j327l004L698N77l248K142J514k158
$$ -1308 3572 1657 -998 1607 192 -1697 1418 91 -2913 785 1362 -1886 256 1770 -388
1643c88J446P93l442O79K271k097l81J394k230q8L495q96j560J828m67j125J929
$$ -388 1058 1851 -1591 -912 1359 -738 -1119 275 -1955 -2043 1452 556 -1004 824 357 -768 1161
1660A161l50j983O55J34j334J004J512j355m8J538r94J43J959j207j170J087j057
$$ 1161 811 -1172 -517 -383 -1717 -713 799 -556 -604 934 -60 83 2042 835 -335 752 -305
1677c05o22J421p62q70J128M63m26J267J05j017K66K04j063k25Q26j135j90J037
$$ -305 -927 494 -268 -1138 -10 453 27 1294 1399 382 648 852 -211 -436 390 -745 -935 102
1695A02q46M41J085n4n0q5n14o5K64j88j048n56O08k96P42N41l19L29M63j80m38
$$ 102 -744 -303 782 728 678 593 79 14 278 90 -958 -1514 -906 -1202 -460 81 -238 91 554 374 -64
1716f4N22m85o07k61P7J82o2M04N5L39J8R0N69O8j09n58j54q0n2J77k55r6L9L20
$$ -64 458 -27 -634 -895 -818 -636 -698 -294 -239 100 118 208 777 845 736 178 24 -56 -108 69 -186 -282 -243 77
1740G7O81L37j77k65l47j28J02j28l03k09m78J28Q19J38j03J44j54J73P3M22p05
$$ 77 758 1095 918 653 306 178 280 152 -151 -360 -838 -710 109 247 144 288 134 307 380 802 97
1761I7p75k31J34K08p1K16J00P4R7M57K27J62n79l51k00q0K45l36j35M75l15P98
$$ 97 -678 -909 -775 -567 -638 -422 -322 -248 -151 306 533 695 116 -235 -435 -515 -270 -606 -741 -266 -581 217
1783B17M18m3o8j23k16j40L36m25k51n96K69J74P00L41K29k87rp3M48j63o67k01
$$ 217 635 592 524 401 185 45 381 -44 -295 -891 -622 -448 252 593 822 535 526 453 901 738 71 -130
1805a30k16j20j61N31P2j03M63Kj90N02l9m41k42j48n63P6M56p51M20P13l05J11
$$ -130 -346 -466 -627 -96 -24 -127 336 338 148 650 611 170 -72 -220 -783 -707 -251 -1002 -582 131 -174 -63
1827f3Q69n60m90K61N6p70P48R2j005M01L97o95J247R26j368O07L80q60N0M91
$$ -63 806 246 -244 17 73 -697 51 143 -862 -461 -64 -759 488 1414 46 653 1033 173 223 714
1847G14j254l35J012l66k99J359n41q09J454q6p34Q15k11j684O54M18r69K38J098
$$ 714 -540 -875 137 -229 -528 831 290 -519 935 849 115 930 719 -965 -311 107 -862 -624 474
1866D74j297K58J400m24m72J097q21j259J118k47j254J211q3j593J700O64j001
$$ 474 -823 -565 835 411 -61 1036 215 -1044 74 -173 -1427 -216 -299 -1892 -192 472 -529
1883e29J008J43j119L95J097j545M2J118j456o35J791n28l80J807p10j155J416
$$ -529 479 622 -497 -102 995 -550 -508 610 -846 -1481 310 -218 -598 1209 499 -656 760
1900G60M80o09k57K71j547L19Q30n49k81J135j49p46J424k08n97O60o59j318R65
$$ 760 1240 631 374 645 -902 -583 247 -302 -583 552 403 -343 1081 873 276 936 277 -1041 -76
1919g6K32j221J55P39n89J45J428m13l00O67m16j575J444k02j591J108l01m86
$$ -76 156 -1065 -910 -171 -760 -615 813 400 100 767 351 -1224 220 18 -1573 -465 -766 -1252
1937a252O86J487j114j55J108l77r31J604r08j186J192m47j036J316M41j393J114
$$ -1252 -566 921 -193 -348 760 383 -548 1056 148 -1038 154 -293 -1329 -13 428 -965 149
1954A49J249j518K51J602j798m87J478j298p79K400j292j935K892J38j988K536
$$ 149 1398 -120 131 1733 -65 -552 926 -372 -1151 1249 -43 -1978 914 1052 -936 1600
1970A600K26l397K273J185l504O42K340k694K7K565k551l66M135k144j973L416
$$ 1600 1826 -1571 702 1887 -1617 -975 1365 -1329 -1302 1263 -1288 -1654 2481 337 -1636 1780
1986A780j082k218K925r07l921L315J466l740K014J977l515J839L032m029k08
$$ 1780 698 -1520 1405 498 -3423 -108 1358 -2382 -368 1609 -1906 -67 2965 -1064 -1272
2001a272M116l363j602L921k654k326N565j508l952M109N50l315M356l40n318
$$ -1272 2844 -519 -2121 1800 -854 -3180 2385 877 -3075 1034 1584 -1731 2625 2285 -3033
2016c033K755L638n060M20L317m499J028M951m428j653N746j821l554M352j969
$$ -3033 -278 3360 -1700 -1280 2037 -2462 -1434 3517 -911 -2564 3182 1361 -2193 2159 190
2031A90k893N216j054o088L961L199m508K267J802n058K494M590n233r85M422
$$ 190 -2703 2513 1459 -4629 -668 2531 -1977 290 2092 -2966 -472 4118 -1115 -2100 2322
2046B322l300j345M874l179k948N668q58l989M247J61m349M014J831o217K105
$$ 2322 -978 -2323 2551 -628 -3576 2092 1234 -2755 1492 1653 -2696 1318 3149 -3068 -963
2061i63L527m144Q48L004m800P51N843l231l071L746j153j350M018k619m694N121
$$ -963 2564 -1580 -732 2272 -2528 -1777 4066 835 -2236 1510 357 -993 3025 406 -4288 833
2077H33J823m687J161J700k294K983J822n886L86N612k629k432J572j902M63M213
$$ 833 2656 -2031 -870 830 -1464 1519 3341 -2545 -2159 3453 824 -1608 -36 -1938 -1475 2738
2093B738k661l890M051J962k680J154l03k547L350J099m487k13L308j297j03J625
$$ 2738 77 -3813 238 2200 -480 674 371 -2176 1174 2273 -2214 -2427 881 -416 -519 1106
2109A106j984n80L839q06k466R89K63j642K204N83l778R50K682j186n5Q56j604
$$ 1106 -878 -1458 2381 1575 -891 98 361 -1281 923 1506 -2272 -1322 1360 174 119 975 -629
2126f29J51L002j480k787K182P42j485M21q10j435K699K360l468j272K631K49
$$ -629 -478 2524 1044 -1743 439 1181 -304 117 -693 -2128 571 2931 -537 -1809 822 1071
2142A071j72N41k678r79L563K35l431R35R86j344K210L60l168J343K888k031j455
$$ 1071 899 1440 -1238 -2217 1346 1581 -1850 -915 71 -1273 937 1297 -1871 -528 2360 329 -1126
2159a126J794j750J51K997k625k784L150K067k192J372r62k199L352K041m679
$$ -1126 668 -1082 -931 2066 -559 -3343 -193 1874 -318 1054 92 -2107 1245 3286 -1393
2174a393m52K473j224N38J680l346j16M825j269l058K108j41j393K998j366m511
$$ -1393 -1845 628 -596 -58 1622 -1724 -1840 2985 1716 -1342 766 625 -768 2230 864 -3647
2190c647L394K465l111L99J298k286K375K462m475n54L723j633j533K083k118
$$ -3647 -253 2212 -899 -500 798 -1488 887 3349 -1126 -1680 2043 410 -1123 960 -1158
2205a158j793M375l75l571K670R70k316K213N12l793J644K607k830o05K264k408
$$ -1158 -2951 1424 1049 -2522 148 1118 -1198 1015 1527 -2266 -622 1985 -845 -1450 814 -1594
2221a594K20M125k525k634L955m96k000K404j431k227L072P50l984J486K036j751
$$ -1594 -1374 2751 226 -2408 1547 1051 -949 1455 24 -2203 869 1619 -2365 -879 1157 -594
2237e94J248R20l236J282L455k974j451J722q17m17K575k095k356L148R44k314
$$ -594 654 1574 -1662 -380 3075 101 -1350 372 -445 -862 1713 -382 -2738 410 1354 -960
2253i60J369M75j991J950O89k639J86K035j575p87J827j098m69K949j477j886
$$ -960 409 884 -1107 843 1532 -1107 -921 1114 -461 -1248 579 -519 -988 1961 484 -1402
2269a402K073J71j224R16lk359J639Q04j354M50P91j212P50J864j871l64Q94k28
$$ -1402 671 842 -382 534 531 -1828 -189 615 -739 -289 502 -710 40 1904 33 -331 563 335
2287C35o63M82n45n45J626l32j359J074O54n45M32K14j409M08J266j180q80R05
$$ 335 -328 154 -391 -936 690 358 -1001 73 727 182 614 828 -581 -173 1093 -87 -967 -62
2305f2m31M76N53o66LP80L05r84K86m6o93K46m2m26k46J079Pn51O41l21O8L53
$$ -62 -493 -17 536 -130 -127 653 958 -26 260 214 -479 -233 -275 -701 -947 132 139 -412 229 -92 -24 329
2327C29j60m33K81m5j61l6L03k08l50Q13n66K97J14K71P0j77k36m21O62k10l89
$$ 329 169 -264 17 -28 -189 -225 78 -130 -480 333 -233 64 178 449 519 342 106 -315 347 137 -252
2348b52J93J3j15L49O53l18m61K48k02m1L25m20n06M94n32L17J65L74m06k7N64
$$ -252 -59 -46 -161 188 841 523 62 310 108 67 392 -28 -534 -40 -572 -255 -90 284 -122 -149 415
2369D15j33K3P3k83r87Q14m49K58K68m48j64M38N01K32J83l83l64K1j53r8j23
$$ 415 282 305 378 95 -892 -78 -527 -269 -1 -449 -613 -175 326 558 741 358 -6 15 -138 -236 -359
2390c59J76l44K63N58m4j44N05m64k08M10n78K2k7K06l26L24K06r8R7L95k42k41
$$ -359 -183 -527 -264 294 250 106 611 147 -61 349 -229 -207 -234 -28 -354 -30 176 78 175 570 328 87
2412H7L70m90k11K95k72qj22J24r5K32m1K22n4K76l04P0p1l39J93K8ln69J71J64
$$ 87 457 -33 -244 51 -221 -229 -351 -227 -322 -90 -131 91 37 313 9 79 8 -331 -138 -110 -113 -682 -511 -347
2436c47L12n2L82k3n5m56K73K46l82Nm12M23k45J39K39L93j87j61J96n6j1j57
$$ -347 -35 -87 295 272 217 -239 34 280 -102 -97 -509 -86 -331 -192 47 440 253 92 288 232 221 64
2458F4j14k9k89J22J93r6K19K90k28J19l2J25o0j89l40k61K26L00K9l77l7N9O13
$$ 64 -50 -79 -368 -246 -53 -149 70 360 132 251 219 344 284 95 -245 -506 -280 20 49 -328 -365 -306 307
2481C07J22r5r3l73l6j21O4k26j21N81k12q3L15L3J99R9j6k32l3l7J04n09L86
$$ 307 429 334 241 -132 -168 -289 -225 -451 -572 9 -203 -286 29 62 261 360 344 112 79 42 146 -363 23
2504B3k81J63L74n21M11L69N2n1k31l43j98j52M3l8L4M95l70K7J59K19j91N80
$$ 23 -258 -95 279 -242 169 538 590 539 308 -35 -233 -385 -342 -380 -346 149 -221 -194 -35 184 -7 573
2526E73k26o97L80j25l00M05R7p30M57M12j02j1L66m23L3P06r39l59N34j07n86
$$ 573 347 -350 30 -95 -395 10 107 -623 -166 246 144 133 499 76 109 815 -124 -483 51 -56 -642
2547f42K32J37n3O63K65n77k20N81m25O7J36m59k54P93l51l25O27R2j82L55rm48
$$ -642 -410 -273 -326 337 602 25 -195 386 -39 28 164 -295 -549 244 -107 -432 195 287 105 460 451 3
2569CK85J39p87J32K35n86M4R34o85k15J385j042O6M89j59p60P31r9o49M4P15
$$ 3 288 427 -360 -228 7 -579 -535 399 -286 -501 884 -158 -92 397 238 -522 209 110 -539 -495 220
2590B20j190P95N80q02L85N71o59k00J052o12p72J144o88j098J636Jr47L43N36
$$ 220 -970 -175 405 -397 -12 559 -100 -300 752 140 -632 512 -176 -1274 362 363 -584 -241 295
2609B95r72J487J26j479K44P79p70k80J113j341J13J341m18o34J297k18r51R90
$$ 295 -677 810 936 -543 -299 480 -290 -570 543 -798 -685 656 238 -396 901 683 -268 722
2627G22p91q30J207M47j704O03P19j127J123N11j460p9J423o75l10P06p37n91
$$ 722 -69 -899 308 755 -949 -346 373 -754 369 880 -580 -659 764 89 -221 485 -252 -843
2645h43J366l64j180R81P40j195Q11k60j042J061J337k113j48R06m27J61O44r80
$$ -843 523 159 -1021 -40 700 -495 316 56 -986 75 1412 -701 -849 57 -370 -209 435 -545
2663e45m41J625K80j054J45J80m49Q24K9j719N73J290j002K62N63j053K09J859
$$ -545 -986 639 919 -135 10 190 -259 565 594 -1125 -552 738 -264 -2 561 -492 -283 1576
2681A576j270j216J418n6o51N70o42j030J449Q23j607K68N81l35P02L37j815j23
$$ 1576 306 -910 508 452 -199 371 -271 -1301 148 971 -636 -368 213 -122 580 917 -898 -1021
2699a021J862k63j476O00j0m32J636o78j553J197J340j097L0j87j049J170P29
$$ -1021 841 578 -898 -298 -308 -740 896 218 -1335 -138 1202 105 135 -52 -1101 69 798
2716G98j426o21J686k73m74Q88o93m70J415L55k250J021L29p57R13K17j800N09
$$ 798 -628 -1249 437 164 -310 578 -115 -585 830 1185 -1065 -44 285 -472 441 658 -1142 -633
2734f33J995j365nN13q50j1J955r96k064J519N30q67N63j24j584J764J362k095
$$ -633 1362 -3 -8 505 -345 -356 1599 603 -1461 58 588 -279 284 160 -1424 340 1702 -393
2752c93rJ071l79l13O62j770k32K695o92j770M25O69l07J356m52k172J511J652
$$ -393 -402 669 290 -23 639 -1131 -1363 1332 640 -1130 -705 -36 -343 1013 561 -1611 -100 1552
2770A552j661m30N44j033J122J331j889j203K440j90r95J118p60j001K494o07
$$ 1552 -109 -539 5 -1028 94 1425 -464 -1667 773 583 -412 706 -54 -1055 1439 832
2786H32k020Q35O11m73O56J45j955J290J675j686l50J204j278jJ965j883j044
$$ 832 -1188 -353 258 -215 441 586 -1369 -79 1596 -90 -440 764 -514 -515 1450 -433 -1477
2803a477J696K56j117J141m07j206K036N45k279J07J605j167K10O70j686M3K367
$$ -1477 219 475 -642 499 92 -1114 922 1467 -812 -705 900 -267 -57 613 -1073 -1030 1337
2820A337j004j157J433l44p66J284m35j925J963P24j716O8P42j151J223P77j385
$$ 1337 333 -824 609 265 -501 783 348 -1577 386 1110 -606 -538 204 -947 276 1053 -332
2837c32n80J750m03m04M84j222l86J869p66p82Q90K15m00M42L75j683J118J163
$$ -332 -912 838 435 31 515 -707 -1093 776 10 -772 118 333 -67 375 750 -933 185 1348
2855A348j603o24R39m50L28L69n73q09J470M58r02N34p14j25P59L54j325j57Q84
$$ 1348 -255 -879 60 -390 -62 307 -266 -1075 395 853 -49 485 -229 -354 405 759 -566 -723 161
2874A61j85k9K09m83K25P78k12o01K33L9l87N26k33p97R05N50j002K20N44n30
$$ 161 -24 -53 156 -327 -102 676 464 -137 96 135 -252 274 41 -756 149 699 -303 -83 461 -69
2894f9N9P03r14j92P02k72N7k45k7j88P93K73j005N46L51m85qN59r98R1N75m07
$$ -69 -10 693 -221 -413 289 17 74 -171 -198 -386 407 680 -325 221 572 87 79 638 -360 -269 306 -101
2916a01m59O46k33K35J87o4n17L27M20o12J97k07k92M36M65r80M13O38l94l23
$$ -101 -560 86 -147 88 275 211 -306 21 441 -171 26 -181 -473 -37 428 -552 -139 499 105 -218
2936b18P66k80n89N22J1q86O45K55q42L40N70n50L29Q49j092J16O73k18m39M21
$$ -218 548 268 -321 201 212 -674 -29 226 -616 -276 294 -256 73 922 -170 -54 619 401 -38 383
2956C83j94p44J012n28l30M29K21m74M64j01j82L64K8k88k62O00q63J04L65q2
$$ 383 189 -555 457 -71 -401 28 249 -225 239 138 -44 320 348 60 -202 398 -465 -361 4 -78
2976g8r2L67k53J48J15J64n97L11pm73J51M76m33J06M39o27M07M44n75J6J31j40
$$ -78 -170 197 -56 92 207 371 -226 85 78 -395 -244 232 -201 -95 344 -283 124 568 -7 9 140 0
2998@k66M19j33p53N78K06l46M00K81n44M37m4n92N04M2k22k81L16j80j30N82
$$ 0 -266 153 20 -733 -155 51 -295 105 386 -158 279 235 -357 147 189 -33 -314 2 -178 -308 274
3019B74j55J3K59k12J16P9m22jJ81j72j2j08K36l13M01J08k53K38q1j13L7J06
$$ 274 119 132 391 179 295 374 -48 -49 132 -40 -52 -160 76 -237 164 272 19 257 176 63 100 206
3041B06n11K50K57n03J1M18j87nP1K91j0k55L69l80J37k34m33K15NK22k1K51m0
$$ 206 -305 -55 202 -301 -290 128 -59 -64 7 298 288 33 402 22 159 -75 -508 -293 -288 -66 -87 164 124
3064A24o7O8j60L68j1l33j52L3j70K07j10p5L68k14J71K67l82K62j62L7j11K4
$$ 124 57 125 -35 333 322 -11 -163 -130 -300 -93 -203 -278 90 -124 47 314 -68 194 32 69 -42 -18
3086a8N6j93K4K69M1m49L14O8j62J50j99J54Pk34K2J13k09Q7P4K38k38L92j70
$$ -18 38 -155 -131 138 179 -270 44 112 -50 100 -99 55 62 -172 -150 -37 -246 -159 -85 153 -85 307 137
3109A37J21N6j20m8m10j2K02j86L09j90N9j08J02K59k58K8M7Kj43K88k77K75n91
$$ 137 258 314 194 146 -264 -276 -74 -260 49 -141 -82 -190 -88 171 -87 -59 -12 -10 -153 135 -142 133 -458
3132d58M88J7Q4J00l95K45k02K19k08j65kN6j92K69J31kK0Q7j12K01l04K01m2
$$ -458 30 47 131 231 -164 81 -121 98 -110 -275 -277 -221 -413 -144 -13 -15 5 92 -20 181 -123 78 36
3155C6m6M7m82M90q8l8L99m74K56j53j47L82k74j7p3Q6o9k2M79k06k53K61q6R5
$$ 36 -10 37 -445 45 -43 -81 318 -156 100 -53 -200 182 -92 -109 -182 -96 -165 -187 292 86 -167 94 8 103
3179A03j93K06j38j36QLQ7L12o83M01M2l17j45N72j10R7j95K30j71L0J31m64Q7
$$ 103 -90 116 -22 -158 -150 -147 -60 252 -431 -30 12 -305 -450 122 12 109 -86 144 -27 3 134 -330 -243
3202b43J59J58k4J2l13J19j50K82k35M75n82j8N62n98J73L35j86o9Q3L0j24o5
$$ -243 -84 74 50 62 -251 -132 -282 0 -235 240 -342 -360 202 -396 -223 112 -74 -143 -60 -30 -154 -219
3224b19K39j70N8J74k40K33k72j37p4P63m14L54K71m91k14j04J89J30J69m76J93
$$ -219 20 -150 -92 82 -158 75 -197 -334 -408 355 -59 295 566 75 -139 -243 -54 76 245 -231 -38
3245c8j76K23oj61M9m5L28K30m98J87k63k92J98J22J07J65k12j1l33N07J40k27
$$ -38 -214 9 3 -158 -109 -154 174 404 -94 93 -170 -462 -264 -142 -35 130 -82 -93 -426 81 221 -6
3267fK34k78K48j83p7k34M7J78K04k71L45j6l72m0J55j07K04q8o1J38J81j56p7
$$ -6 228 -50 198 15 -62 -296 -249 -71 133 -138 207 191 -181 -221 -66 -173 31 -57 -118 20 201 45 -32
3290c2J55k54R6J59J13j18K5j85j13K85j01q0j50K99l58J86P9J74j79j1K7l24
$$ -32 123 -131 -35 124 237 119 144 -41 -154 131 30 -50 -200 99 -259 -73 6 180 1 -10 17 -307
3312c07K95O6m10K18K22l57N72K3n22M79j00k86K90k36O6r6n2J45l43L27N3k34
$$ -307 -12 54 -356 -138 84 -273 299 322 -200 279 179 -107 183 -53 13 -83 -135 10 -333 -6 47 -187
3334a87K63p1m9M65l02l45L17q7k81O14Jp27K11L46J2k34L09R1m90M51m26k67
$$ -187 76 5 -44 421 119 -226 91 4 -277 337 338 -389 -178 168 180 -54 255 346 -144 307 -119 -386
3356c86M03L92o17M45l66k8M07K32m44q7O22p03L34L57p58j54N52k27l10N63J6
$$ -386 17 409 -208 237 -129 -157 250 482 38 -49 573 -130 204 561 -197 -351 201 -26 -336 227 243
3377B43n91Q18n46k12K82N26o99n3N42o92Q1M74m90J8P11j30o1k2k13l5K95k28
$$ 243 -348 470 -76 -288 -6 520 -179 -232 310 -382 -301 173 -317 -299 412 282 221 199 -14 -49 246 18
3399A8k94J94Qk47M56k74J23N6L70j60j70J15P7l30K79j21m64L60J9L1j40k3n4
$$ 18 -276 -82 -74 -321 135 -139 -16 40 410 250 80 195 272 -58 221 100 -364 -4 15 46 -94 -117 -171
3422a71L75K65o09k63P52n83j19M16p6n6N40o47j15J11J59N9J34j04m06M58J88
$$ -171 204 469 -140 -403 349 -234 -353 63 -13 -69 471 -176 -291 -180 -21 38 172 68 -338 120 308
3443C08l29J63P7n60M87J30n15j32O71l64j37L50m83LN35M2m43K64j32Q2L41j44
$$ 308 -21 142 219 -341 146 276 -239 -371 300 -64 -201 149 -334 -331 204 246 -197 67 -65 17 358 214
3465B14l31L54J81m14L8p7j58Q8N12n19J48K34j34j10J81j20n08L55J40l84K77
$$ 214 -117 237 418 4 42 -35 -193 -105 407 -112 36 270 136 26 207 87 -421 -66 74 -310 -33
3486c3L13l36P5K43m19k60O05q7k75J56M30o71L01J4Pj8j21L46l84L73l67M4K74
$$ -33 280 -56 19 262 -157 -417 188 101 -174 -18 412 -259 42 56 63 45 -76 270 -114 259 -108 -64 210
3509B10n76N89k96p7J35K91l71n1N97j25k49L27j93l01J45Lj55J98L50m92r7L94
$$ 210 -366 223 -73 -150 -15 276 -95 -146 451 326 77 404 211 -90 55 58 -97 101 451 -41 -138 256
3531B56q3k19J91r2k86Q9M36n67L79j67J42l83N55o23J65L27Q1m46L45K24m58
$$ 256 173 -46 145 53 -233 -144 292 -275 104 -63 79 -304 251 -372 -207 120 201 -245 100 324 -134
3552a34K56j18o7R8J33m79M08k42J19K74J33l17j70K96l64J06n0k64K58K53p3
$$ -134 122 4 -63 35 168 -311 97 -145 -26 248 381 64 -106 190 -174 -68 -118 -382 -124 129 56
3573E6j29K4K49l85r8K41P6J91L2j90k89L61j92J09j85J7J37p0P5j0j01K54j38
$$ 56 -73 -49 200 -185 -283 -42 34 225 257 67 -222 139 -53 56 -129 -112 25 -45 30 20 -81 173 35
3596C5J90j42n4j38J02j10K56K54k44j54J17k33R2J88l5j25n3q4M6K15J96m28
$$ 35 225 83 29 -109 -7 -117 139 393 149 -5 112 -121 -29 159 124 -1 -54 -138 -92 123 319 -109
3618a09L54k28J09k54j75L56J08j25m01J84L86j17j55K69j78k2K23j28k60L96
$$ -109 245 17 126 -128 -303 53 161 36 -365 -181 205 88 -67 202 24 2 225 97 -163 233
3638B33k74J88k9n32L08J1K16m45K74j54K53N3j59J11k8o3Q6k08J22Q8j22J44
$$ 233 -41 147 118 -414 -106 -95 121 -324 -50 -204 49 102 -57 54 26 -37 49 -159 -37 51 -71 73
3660G3O2j84J12O4j27jk1k2K27k48k96L14J95j34J63J6l12R8J90j5n1k14L06m76
$$ 73 135 -49 63 127 0 -1 -22 -44 183 -65 -361 -47 148 14 177 193 -119 -21 169 154 103 -111 195 -281
3684b81L00j3k27J15J39j74O3L0K16j9p1j42j40R8L9J17L39n93J81K0j13j23N45
$$ -281 19 6 -221 -106 33 -141 -78 -48 168 149 78 -64 -204 -106 -67 50 389 -204 -23 -3 -116 -239 306
3707C06l91j50J67L86k87l49J29J8L61K4q1M3K43n08L0L1J59K8n42N24j68j75
$$ 306 -85 -235 -68 318 31 -318 -189 -171 190 214 133 176 419 -89 -59 -28 131 159 -383 141 -27 -202
3729b02L45j37J70j13j45o5J80j20M9K88k70J65k32j08K1L13k75K12p3J76j62
$$ -202 143 6 176 63 -82 -147 33 -87 -38 250 -20 145 -87 -195 -174 139 -136 76 3 179 17
3750A7J96j96m1K04J01k67n4JK86j07k43K06k9k93K67j31K05RO2l09J0P5J39P3
$$ 17 213 17 -24 180 281 14 -40 -39 247 140 -103 103 74 -219 48 -83 122 131 193 -116 -106 -31 108 181
3774A81j69n2P6j70nJ82j07p3J95j57L67l95J74j80J90O4J96j75k11K25n1l0k05
$$ 181 12 -40 36 -134 -139 43 -64 -137 58 -99 268 -127 47 -133 57 121 317 142 -69 156 105 75 -130
3797a30K09j56J23p0j86K84OQ1n51K41L23k15R6L79n21JN6j59L30j85K99l41J
$$ -130 79 -77 46 -24 -210 74 80 161 -390 -149 174 -41 55 434 -87 -86 -30 -189 141 -44 255 -86 -85
3820h5j58M86J19o04M15k25o6K79J11k11j69P5jK4J87p6J19j17k87K95Lm35M17
$$ -85 -243 243 362 -242 173 -52 -118 161 272 61 -108 -33 -34 -10 177 101 220 103 -184 111 114 -321 96
3843I6r1k8m3M0m3K7%k68K05j7K01p0K19l29n6K96p4J30L0j04l23pr2L71J92m48
$$ 96 5 -23 -66 -26 -69 -42 -42 -310 -105 -122 79 9 228 -101 -157 139 65 195 225 121 -202 -209 -301 70 262 -186
3869a86J21J35J83q1j66l5J04j82K84l16N6K13l24J32mj92J19o3J82k46j93N16
$$ -186 -65 70 253 172 6 -29 75 -107 177 -139 -83 130 -194 -62 -66 -258 -139 -202 -20 -266 -459 57
3891E7k66M95n99K45K7K38n9K9j19L5n6K57k10N5j68L0J34j90k40K48J98j55j87
$$ 57 -209 286 -313 -68 -41 197 138 167 48 83 27 284 74 129 -39 -9 125 -65 -305 -57 141 -14 -201
3914b01L53R6k50J77m02J66J05o5K85l26K95l19j95K36K92k28P1N5j58K01k02
$$ -201 152 248 -2 175 -227 -61 44 -21 264 -62 233 -86 -281 -45 247 19 90 145 -13 188 -14
3935a4o5K01l13K74j54nn6K08J24l73p8K96k92L71k12J86M6j93L29l27N4K88P8
$$ -14 -79 122 -191 83 -71 -76 -132 76 200 -173 -251 45 -247 124 -88 98 144 -49 280 -47 7 295 373
3958C73o65L52j93J84j02J49k53j77L11L6J66j37j46J53J13j05k13K01k47K24
$$ 373 -292 60 -133 51 -51 98 -155 -332 -21 15 181 44 -102 51 164 59 -154 47 -200 24
3978B4J2L38o53J48RJ34J10o2j21K14J10j62k33k2N08m21K16k22k69M15l5m5N9
$$ 24 36 374 -279 -131 -122 12 122 60 -61 153 263 101 -132 -154 354 -67 149 -73 -342 73 38 -7 52
4001E2j44j0J94j36Ko9M74n44J74QK0o2Ro0L01pl86J57J8K11n4k89L24J18l14
$$ 52 -92 -102 92 -44 -42 -111 363 -181 -7 1 21 -41 -32 -92 209 202 -184 -27 -9 202 148 -141 183 301 -13
4026a3K34j77j54Q2L42n52K07r8Q4K17m80K04K07R7l24J71q2J66k07K86l29r4
$$ -13 221 44 -110 -28 314 -238 -31 -129 -45 172 -308 -104 103 200 -124 47 -35 131 -76 210 -119 -213
4048b13K34k54J76K47l01K7M25k97OL08n19n6M48k64l02L47J2j93L6Lm1M26j53
$$ -213 21 -233 -57 190 -111 -84 341 44 50 358 -161 -217 231 -33 -335 12 24 -169 -133 -130 -171 255 102
4071A02j1KJ55j51r5Qj21K4J83k12R4J95m3o5m2k52k5K76P9m4j13O1N9j86J62
$$ 102 91 93 248 97 2 10 -111 -87 96 -116 -22 173 130 65 23 -229 -254 22 101 57 -56 5 64 -122 40
4096D0l4J72J9k7j60J93o7k74K00q2k02K35J68m58J39j63K33l1r6j4M57j10l69
$$ 40 6 178 197 170 10 203 136 -138 62 -20 -222 13 181 -277 -138 -301 -68 -99 -195 -209 248 138 -231
4119b31L01j26J22j33j43J91J18pJ17ok10K5N4k47J37j05k4O9K26l21J79K3jO4
$$ -231 70 -56 66 -67 -210 -19 99 92 209 203 -7 18 72 -175 -38 -143 -167 -98 128 -193 -14 9 8 72
4143G2K5m1j22N8k14M03nj3k90L38k10o4K47k02m22L15M58k65k90L69l75J50k70
$$ 72 97 56 -66 -8 -222 181 176 163 -127 211 1 -63 184 -18 -440 -125 333 68 -222 147 -228 -78 -348
4166c48J68M23m42K69m1J32Q2m24K54O4k53J35N2m41K71K71j21r7K09j74J14j20
$$ -348 -180 243 -199 70 29 161 243 -181 73 137 -116 19 71 -370 -99 172 51 -46 163 -11 103 -17
4188a7L54k64n3k9K83m45M83l99L7r9K57j14L14j02l17L39k82J55k41L25k71L18
$$ -17 337 73 20 -9 274 -171 312 -87 -50 -149 108 -6 308 206 -111 228 -54 101 -140 185 -86 232
4210B32k83K26J86m35K23%j41q5J19j16j20L55k17k36M45J53m99l8N51l89L32
$$ 232 -51 175 361 -74 149 149 8 -77 42 -74 -194 161 -56 -292 153 306 -193 -231 320 -69 263
4231B63j04j44N3j26J48j31K91J14m59j27K58q9L0k03K03J34J08l18r6L06k00
$$ 263 159 15 68 -58 90 -41 250 364 -95 -222 36 -53 -23 -226 -23 111 219 -99 -195 111 -89
4252h9M8k6o7N7K45J44m36k93O35k31r8M4P8q8p1L84n40Q4j39J92K17O8m43M46
$$ -89 -41 -67 -134 -77 168 312 -124 -417 218 -13 -111 -67 11 -77 -148 236 -304 -220 -359 -167 50 118 -325 121
4276A21j96nMpJ5K74P6m23J56m9j0q9L89j48k88K19J84l38K2J26L9jj80J1l0L86
$$ 121 -75 -80 -76 -83 -68 206 282 -141 15 -34 -44 -133 256 108 -180 39 223 -115 -93 33 72 71 -109 -98 -128 258
4302B58j01p31K53M89Kj14l63L24L7m1p9K69n17J37J55k4Q7N8k02R0K0Q5k5L7
$$ 258 157 -574 -321 168 170 56 -307 17 54 13 -66 203 -314 -177 -22 -46 41 99 -103 -13 7 92 67 104
4326A04l31LK28J2j09r8J83L9j56J26J50O0l09J3L78l27M03k73R8n15mK81J01
$$ 104 -227 -224 4 16 -93 -191 -8 31 -125 1 151 211 -98 -85 293 -34 369 96 194 -321 -325 -44 57
4349E7K59k63m2k86J22N9P5K6O7k90J56O4K21k00J46LM9j93k03M30j89n6J88k56
$$ 57 316 53 11 -275 -153 -94 -19 7 74 -216 -60 4 225 25 171 174 223 30 -173 257 68 12 200 -56
4373e6q5OJ84k65J22k42M70j20j75J39k33J97J50k91K64oK2j65qJ07K13N3l15
$$ -56 -141 -135 49 -216 -94 -336 134 14 -161 -22 -255 -58 92 -199 65 59 81 -84 -92 15 228 281 -34
4396c4J39j06K04l9k00k9K86l43K3n1J59J01k18k11O26l11K07j87M5R0K64k60
$$ -34 105 -1 203 164 -36 -65 221 -122 -99 -150 9 110 -108 -319 307 -4 203 16 61 151 415 155
4418A55K01o8n8m6m76M75j74J00K38l60K10k53O9Jo0n4K42j61JK4m0J32P3n6j95
$$ 155 356 288 230 184 -292 183 9 109 347 -13 197 -56 13 14 -46 -100 142 -19 -18 6 -34 98 171 115 -80
4443h0J79O8m8l47j11K82K61l73K87K2J37j34l38R9K02j65K9L6K93j50l07N01
$$ -80 99 167 119 -228 -339 -57 204 -169 118 140 277 143 -195 -96 106 -59 -30 6 299 149 -158 343
4465C43n19L5k98N90j84L73m50o4L84k43L07k53j33K95m80M04J31l77M35j46j93
$$ 343 -176 -141 -439 151 -33 340 -110 -174 210 -33 274 21 -112 183 -297 107 238 -139 296 150 -43
4486d3M61p31J89K23q2p4J80j61oJ54k95n7L28J44l73j14O02l51q0N4J23l66J74
$$ -43 418 -313 -124 99 17 -57 123 -38 -44 110 -185 -242 86 230 -143 -257 345 -6 -86 -32 91 -275 -101
4509a01j81N00l9j46J26k28P5J59k51oK65o03K80L29k87K3J2L20k64L24k23o0
$$ -101 -282 218 179 33 159 -69 6 165 -86 -92 173 -430 -150 179 -108 -85 -73 247 -17 307 84 24
4531B4J04k59K39k88P4K30k55J88l5Q2j2l24L88o0R0j01oL7r5M2j14rj42N16k94
$$ 24 128 -131 108 -180 -106 124 -131 57 22 104 92 -232 156 96 186 85 79 116 21 63 -51 -60 -202 314 20
4556B0l17K63L6K14k46p7L73l25Q9J3q2J31m54M23k3l8J33J59k34j98K55r7p2
$$ 20 -297 -34 2 216 -30 -107 266 -59 30 43 -39 92 -362 61 38 0 133 292 58 -140 115 18 -54
4579e4J9j17J71J5J15j39k32k01N14J88k08K17l62l18O37j76j48K3L4p8K20J01
$$ -54 -35 -152 19 34 149 10 -222 -423 91 279 71 288 -74 -392 245 69 -79 -56 -22 -100 120 221
4601B21j30j26j27rJ61j2NJ89l60L76k87J36j09J59k8p8J37k73N08l68j61L8L69
$$ 221 91 -35 -162 -171 -10 -22 -17 172 -188 188 -99 37 -72 87 59 -19 118 -155 353 -15 -176 -138 231
4624B31k40J09k32L04l37j02J17L40q5l41k53K77K75j71M22k04j81L57j03j66
$$ 231 -9 100 -132 172 -165 -267 -150 190 105 -236 -489 -212 63 -108 314 110 -71 286 183 17
4644A7J25k09K20k44j55O1K10j65K81M7K6N6l17J52P6j86R1j24j33L60o0j91m5
$$ 17 142 -67 153 -91 -246 -185 25 -140 141 188 214 270 -47 105 181 -5 86 -38 -171 189 129 -62 -107
4667a07L4N3J86m20K29J54K6r1j57L24k89N0j5n2J6K45j86j01l4p5J38K1o1K05
$$ -107 -73 -20 166 -254 -25 129 155 64 -93 231 -58 -8 -23 -75 -59 186 0 -101 -135 -210 -72 -51 -112 93
4691I3l95R0J25N4l8P0k24L61j35j93J98L6K03r3j35K6l77M96km02N11l17J10
$$ 93 -302 -212 -87 -33 -71 -1 -225 136 1 -192 6 42 245 152 17 43 -334 162 160 -242 269 -48 62
4714F2j4j04l6J22k80K54K06p2k77j14J27L95n15K91K20l80K68k7K6J48k45o4
$$ 62 48 -56 -92 30 -250 4 210 138 -139 -253 -126 269 -246 45 265 -115 153 126 152 300 55 -9
4736iL23k05k71N02k66m3K09j54l0o8K55k66L67l51j69J66K09j36OK18m14o4J59
$$ -9 314 109 -162 340 74 31 240 86 56 -12 243 -23 344 -7 -176 -10 199 63 69 287 -127 -191 -32
4759c2P7O3j42J12j97K38o8J20k62L87k55l5j18M72m41K75K9n38K88r5O9K27N8
$$ -32 45 108 -34 78 -119 119 51 171 -91 296 41 6 -112 360 -81 194 223 -315 -27 -122 -53 174 232
4782B32n24M37j04k57L82r4L9J3J97n28m3L9L54k28n3J26J8K9J85k54Q3j97K66
$$ 232 -292 145 41 -216 166 72 111 124 321 -207 -250 -211 143 -85 -138 -12 6 35 220 -34 49 -148 118
4805A18j01l8K10l41L64l02m5K46O6k33K3o0k78L45O3j62k27L20q7J44l3P1J4
$$ 118 17 -21 189 -152 212 -90 -135 111 177 -56 -33 -93 -371 -26 37 -125 -352 -32 -119 25 -8 63 77
4828G7q3K08l8j85j08M7R8J00m30K80j87K38K3R5m72M65j2n5m8j5l22L45MN8k24
$$ 77 -6 202 164 -21 -129 -82 16 116 -314 -34 -221 17 40 135 -337 128 116 61 13 -2 -324 21 25 83 -141
4853a41K83j82K42l19k8l8j42K74KJ29qp0j76L77K9p9J42k36L71l75k58J10J57
$$ -141 142 -40 202 -117 -145 -183 -325 -51 -49 80 72 2 -174 203 232 153 295 59 430 55 -203 -93 64
4876F4J95l37J48O5j86m3p5L8K04j94J14n9K67mr3J73j20k33kJ40j47N5l0L51
$$ 64 259 -78 70 135 -51 -94 -169 -131 73 -121 -7 -66 201 197 104 277 157 -76 -78 62 -85 -30 -60 291
4900B91l32J05J34m98M87m27K28jj23L93k25K69j25q2J14l97k20M48Q9n34K80
$$ 291 -41 64 198 -300 187 -240 -12 -13 -136 257 32 301 176 94 208 -189 -409 39 128 -406 -126
4921a26K79J16l24M7K26K7j73Pk03L48pj12j58k62O82m12L45k30k97LL26Kj95
$$ -126 153 269 -55 -8 218 245 72 79 -124 224 217 105 -53 -315 367 -45 300 70 -227 -224 102 104 -91
4944i1j27J24j3m25N23j64M50j42j45K1j48P34n56j53p6J81K88l29J47m17M43
$$ -91 -218 -94 -107 -532 -9 -173 277 135 -10 11 -137 597 41 -112 -188 -7 281 -48 99 -318 125
4965A25q4k18J24J40q8J04O3n51J81M66k36J20q0m38J83L57l44J22j05R6j8k40
$$ 125 41 -177 -53 87 -1 103 166 -385 -204 262 26 146 66 -372 -189 168 -176 -54 -159 -63 -81 -321
4987c21M47j67L7n9J57j84j07K85j90J93l1k65L89j60R8k55J28n7J28o2l85K19
$$ -321 126 -41 -4 -63 94 -90 -197 88 -102 91 60 -205 184 24 122 -133 -5 -62 66 4 -381 -162
5009a62K19l78L56k02L12l43J95j44M53k23r3p2K01n9r4j72J41J76J04j52K15
$$ -162 57 -321 35 -167 145 -198 -3 -147 306 83 -10 -82 119 60 -34 -206 -65 111 215 63 278
5030B78k04l26L87j48K39k40O8M9J01p6k57N8L25l66L02k89J69o1J75l49OK91
$$ 278 74 -252 135 -13 226 -14 54 103 204 128 -129 -71 254 -112 190 -99 70 9 184 -165 -159 132
5052A32k49J39L14n35J67J66N9L73o95%J52j84J58j2j69J7K34l29M26P8k12M2
$$ 132 -117 22 336 -199 -32 134 193 566 -129 -129 23 -161 -3 -15 -184 -167 67 -262 164 242 30 72
5074G2J03k60M38j40o12J66K06j05J50l4K12n29J67J88K56n68jL58k5k75K45j06
$$ 72 175 -85 353 213 -399 -233 -27 -132 18 -16 196 -333 -166 22 278 -290 -291 67 42 -233 12 -94
5096i4j38J72N6k2N9P9j7R3k33J89j91P9K8L28k23K28l41lj23R0R8l44L14J91
$$ -94 -232 -60 -4 -26 33 112 95 188 -45 144 -47 32 60 388 165 393 52 49 -74 16 114 -230 84 275
5120B75p18J72J77Q0J58j12N7k24J41K76k55J21l95L92j55J64j41J66j92k54N05
$$ 275 -443 -271 -94 -14 144 32 89 -135 6 282 27 148 -247 145 -10 154 13 179 -13 -267 238
5141B38k55N0J29J11r3m4j32j50J52Nj03J52K2mRj44J35k06j51O76n27j13%N58
$$ 238 -17 33 162 273 180 136 4 -146 6 11 -92 60 82 78 87 -57 78 -128 -279 397 -130 -243 -243 315
5165C15l50j36Q5L8K90j76k9p0J2L3k65K22R7j76p4J55m0J06J59P5k94r4K50j6
$$ 315 -35 -171 -86 -48 242 66 37 -33 -21 12 -253 -31 66 -110 -184 -29 -69 37 196 271 -23 -117 133 117
5189A17l09M9K95j20J21J31m25K1J79J21k69K90l02J09J26pkL4k90L16J07j52
$$ 117 -192 -143 152 32 153 284 -141 -120 59 180 -89 201 -101 8 134 127 125 159 -131 185 292 140
5211A40j55L4j08M8P1j12j2J91j45q0Q3j5L9j6K13j21J27k70Q1N9k2pj30K1L68
$$ 140 -15 19 -89 -41 30 -82 -94 97 -48 -128 -45 -60 -21 -37 176 55 182 -88 -7 52 30 23 -107 -86 282
5236B82l79j37J43LJ01J72l97M04k77P5o7K85k19K8j79R3J37K9J85k37k7k2J03
$$ 282 -97 -234 -91 -88 13 185 -212 192 -85 -10 -77 208 -11 17 -162 -69 68 97 282 45 18 -4 99
5259I9j18l3p1M04p4j27j86m5J26L58r5k44J42J49m55L6N1k25M76l07j90%J33
$$ 99 -19 -52 -123 281 207 80 -106 -151 -25 333 238 -6 136 285 -170 -134 -83 -308 168 -139 -329 -329 -196
5282a96K03J29nm90K81K71N9m17K27J07r2J00k51J88j74r2K52k75P0L1K58m24
$$ -196 7 136 131 -359 -78 193 252 -165 62 169 77 177 -74 114 -60 -152 100 -175 -105 -74 184 -240
5304b40K99MJ2m23K00J65p3K44l12j25K28J59l03K35j59K70j47K1j55N6k7J15
$$ -240 59 63 75 -348 -148 17 -56 188 -124 -249 -21 138 -165 70 -89 181 34 55 -100 -44 -71 44
5326D4k6m1j41L8k16L13J0Q8r1K40l23M79l02m5M1k90L95j4J49k54Qk29j91M18
$$ 44 18 -23 -164 -126 -342 -29 -19 69 -22 218 -105 374 72 27 68 -222 173 159 308 54 62 -167 -358 60
5350F0k13L38j84Q2P5q6j90J26j15L1J17j13J02j33J29l37L04j02m9P9N4l9J10
$$ 60 -153 185 1 83 158 72 -118 8 -107 -76 41 -72 30 -103 26 -311 -7 -109 -158 -79 -25 -64 46
5373D6J63q2q6Q5j52k8L43l26p5K65j5m46M33j94K0J29P3k85K55O8l81J38m6Q6
$$ 46 209 127 41 126 -26 -54 289 -37 -112 153 138 -308 125 -69 -49 80 153 -132 123 191 -190 -52 -98 -12
5397a2M8j5o8j78J41k03J64Kj59L98l94J31K37O5l12Q6K59J34j23j5l00L81l71
$$ -12 36 21 -47 -225 -84 -287 -123 -121 -280 118 -276 -145 92 157 -155 -69 190 324 201 186 -114 267 -104
5420a04%O8k89K74K74k69m6k04J45P9J44mk13j10L98r2j7p2j70P8mL06l16l3l44
$$ -104 -104 -36 -325 -51 223 -46 -92 -296 -151 -72 72 68 -145 -255 143 51 34 -38 -208 -130 -134 172 -144 -177 -521
5445e21L50K73K8n70L31%J94j22k6k55J18N3M09j57j1J09j87j11J64j63K4J13
$$ -521 -171 102 130 -440 -109 -109 85 -37 -63 -318 -200 -147 262 105 94 203 16 -95 69 -94 -70 43
5467D3j06J16l81L25K33l97K8K64k4k40L41j22J01l25M14r7j97j63L56m47mJ35
$$ 43 -63 53 -328 -3 230 -167 -139 125 101 -139 202 80 181 -144 270 173 -24 -187 169 -278 -282 -147
5489a47L89k99L9J4j72J08k26K70L58J10m15P0Kl6o9j60N4J03J82r9j94nk8m1
$$ -147 242 -57 -18 -4 -176 -68 -294 -24 334 444 29 99 101 65 -4 -164 -110 -7 175 76 -118 -123 -151 -192
5513a92N3O8r3J3L53l48L32o6j62J06K03j42j71Q7k57K28k4J60k11J83j69j4R9
$$ -192 -139 -71 -164 -151 202 -146 186 120 -42 64 267 125 -46 41 -216 12 -12 148 -63 120 -49 -63 36
5536C6K01n03M55p4r2r1j03J71mK26j84j28j08K46n75L91O9K4J63k71K93J3k7
$$ 36 237 -266 189 115 23 -68 -171 0 -4 222 38 -90 -198 48 -527 -136 -67 -43 120 -151 142 155 128
5559A28N1l30J81P5j86K52j03l15N44l30J27k54j26K51j97K35P1N2K8l21L20R0
$$ 128 179 -151 30 105 -81 171 68 -247 297 -33 94 -160 -286 -35 -232 3 74 126 154 -167 153 243
5581B43r2m70J40K37j47j6o5J59j22K30J10j65j70K2J95K3n7J2L5Q1k66k41M13
$$ 243 151 -319 -179 58 -89 -105 -170 -11 -133 97 207 42 -128 -106 89 112 55 67 102 183 -83 -324 89
5604H9J38k75J05J60l38J99l26L66k90M77j75k14J9Kp1P4K4J8n4j60j71K77j73
$$ 89 227 -48 57 217 -121 78 -248 118 -172 305 130 -84 -65 -63 -134 -60 -36 -18 -72 -232 -403 -126 -299
5627b99L25j51J44R8mo1r0K54k87N6L35k31j99J14l22M32j48J17l56N47nm59L01
$$ -299 26 -125 19 117 113 52 -38 216 -71 -15 320 89 -110 4 -318 114 -34 83 -273 274 269 -190 111
5650A11j26P8Qk72K59j96J50r3K38l23K60j66K3K16k16l45M81l29K28o9N7M3K21
$$ 111 -15 63 71 -201 58 -138 12 -81 157 -166 94 -72 -49 167 -49 -394 87 -242 -14 -83 -26 17 238
5673B38l62K44l24M13j64j71J88j11Kj52L62k04K52k17m1J99j37m9M8k42L99L6
$$ 238 -124 120 -204 209 45 -126 62 -49 -47 -199 163 -41 211 -6 -47 152 15 -34 14 -228 171 207
5695B07p2k16J51j49l1L37j12k30J31j35k4K06k62L22j6j0J07l06J40M9k40r1
$$ 207 135 -81 70 -79 -110 227 115 -115 16 -119 -143 63 -199 123 107 97 204 -102 38 87 -153 -244
5717b44MN01k11j6J8j23l0J70j97M3J67k07L0PM34m90P3l0q6L95j76lN8J25n18
$$ -244 -240 261 50 34 52 -71 -101 69 -128 -85 82 -125 -95 -88 346 -144 -71 -101 -187 208 32 29 87 212 -306
5742c06L54l26K89K52l57P0K93l53J63J31l89K33n7J15j13o4K17M2j06j31K37
$$ -306 48 -278 11 263 -94 -24 269 -84 79 210 -179 54 -3 112 -1 -65 152 194 88 -43 194
5763A94j60J39m29K10j42J46J98q5n72O99j68J13Pl03lK34k46R4J73p05N64l31
$$ 194 34 173 -256 -46 -188 -42 156 71 -501 198 30 143 150 -153 -156 78 -168 -74 99 -606 -42 -373
5785c73L18K61l95K05k65L40K79p4k12j89J48k45J09J71k85K27J09J1J63k03P2
$$ -373 -55 206 -189 16 -249 91 370 296 84 -105 43 -202 -93 78 -207 20 129 140 303 100 172
5806A72j08j39L7L18m44L27k24M68l93J2M7J37l55J44K9j01K94r4K1k70P9n5K31
$$ 172 64 -75 -38 280 -164 163 -61 407 14 26 73 210 -145 -1 28 -73 221 127 148 -122 -43 -98 133
5829A33j7K45k5k86lk85J69R6O4j80K75m04J16K23q7J21pj55l06N95m35K34k25
$$ 133 116 361 336 50 47 -238 -69 27 91 -89 186 -218 -102 121 34 155 148 -7 -313 282 -153 81 -144
5852a44N4J71m39L22Q3j48J56k80KL39k2k05m9J83J38k4k88J84J38k14n4J44k0
$$ -144 -90 81 -358 -36 47 -101 55 -225 -223 116 94 -111 -160 23 161 137 -151 33 171 -43 -97 47 27
5875B7K90l83N7k35K35J48j46M8j16o9L24k11K20k49l18L25jMp4L06Q4l76q5J57
$$ 27 317 -66 -9 -244 -9 139 -7 41 -75 -144 180 -31 189 -60 -378 -53 -54 -50 -124 182 266 -110 -195 -38
5899c8j59J65j95Q0o8k40R40n80L5k69J42M66l85o2M20l80P0M3J3L3O9n6j85J02
$$ -38 -197 -32 -227 -147 -215 -455 485 -95 -60 -329 -187 279 -106 -168 252 -128 -58 -15 -2 31 100 44 -141 -39
5923c9K98k06p4J39l46K12j35J51l49K47M90m11M43l81j13p2n5K53q7m2K20l85
$$ -39 259 53 -21 118 -228 -16 -151 0 -349 -102 388 -23 420 39 -74 -146 -201 52 -35 -77 143 -242
5945b42N10l51qR9k20O20k97O4k5k04J02j3J32k03j5p6N9J84l00J61p1L9K6%j63
$$ -242 268 -83 -91 8 -212 408 111 175 150 -54 48 35 167 -36 -51 -127 -68 116 -184 -23 -94 -55 -29 -29 -192
5970a92K4J90J05N6j55mR6j04J90m63J37MJ44Q3l31J41K25k70j0K26k72K51p9
$$ -192 -168 22 127 183 28 24 120 16 206 -257 -120 -116 28 111 -220 -79 146 -124 -134 92 -180 71 -8
5993hm08K83R9l9J34k5k52q4K28J45q8L46l40r2J95j5j53J03j75K99j17q1J00
$$ -8 -416 -133 -34 -73 61 36 -216 -300 -72 73 -15 331 -9 -101 94 79 -74 29 -146 153 36 -45 55
6016E5J50p3l97M60j80J11rk01J53J37j17K0m31L05L01m69J35j80M57k14l5l10
$$ 55 205 132 -265 195 15 126 117 -84 69 206 89 109 -322 -17 284 -185 -50 -230 227 13 -22 -332
6038c32J68M07l42nO6j02m4K18J7r6p4p1L54j11l2o5K2P0Q3l37K19R7k22k6O1
$$ -332 -164 243 -99 -104 -38 -140 -184 34 51 -45 -119 -190 164 53 21 -44 -22 48 131 -206 13 110 -112 -138 -77
6063g7R5k32K54P0K05k44J41m46N37m64k15L84j6J58j07l9K5P1O7l07L41M3Jk20
$$ -77 18 -214 40 110 315 71 212 -234 303 -161 -376 8 -8 150 43 4 29 100 167 -140 201 244 245 25
6087B5n0N9l70L21k4p4J18O1j02J37k92L6J51k60J04K68j13p8N0K23M3k82q0O8
$$ 25 -25 34 -336 -15 -39 -113 5 66 -36 101 -191 -155 -4 -264 -160 108 -5 -83 -33 190 233 -49 -129 -61
6111f1J59j72J87J51k17k04J94O1J8n18L70J69k26R4p7J36L0m4n5L6p4j01l8n4
$$ -61 98 -74 113 264 47 -157 37 98 116 -402 -32 137 -89 5 -72 64 94 50 -5 31 -43 -144 -182 -236
6135b36K32J25m75O18j83j24L04l87K12J40k17l58J17K28O9j13L6R4Q9j23j18
$$ -236 -4 121 -354 264 81 -43 261 -126 86 226 9 -349 -232 -4 65 -48 -12 82 171 48 -70
6156g0l46N00k26j11J09J9L16k08K13k83K88M9m47J69j91J95j2J29J58k82m78
$$ -70 -416 84 -142 -253 -144 -125 191 -17 196 -87 201 250 -197 -28 -219 -24 -36 93 251 -31 -509
6177e09P52J24m33L25j35j70J32r7j44J51j75N7l44P67k80J7l8J54J28k51J92
$$ -509 243 367 -66 259 124 -46 86 -11 -155 -4 -179 -122 -466 301 21 38 0 154 282 31 223
6198B23l23k8J83q4j16K27q0m48K95K96l82O6qL92l07J83p9N5Q8q6N5l1j38l08
$$ 223 -100 -128 55 -29 -145 82 2 -446 -151 145 -237 -171 -179 213 -94 89 10 65 153 67 122 91 -47 -355
6222c55L20j58J98N6O6P2J04l66M8j96K71p2j67p9L16j57r0J86Q2n1K3J95m67
$$ -355 -35 -193 5 61 127 199 303 -63 -15 -211 60 -12 -179 -258 58 -99 -189 -3 79 28 51 246 -221
6245b21J57Q8L80k79k12M2j6K79k95J29N7j15K2k55J98L66l04P9j85k24L40j72
$$ -221 -64 24 404 125 -87 -45 -61 218 -77 52 109 -6 16 -239 -41 325 21 100 -85 -309 31 -141
6267a41M0K39L23k69j72l3l6O4R5N1k19P3N7k8j11q5nO01l52m08K02J62%l09K72
$$ -141 -101 138 461 192 20 -13 -49 15 110 161 -58 15 72 44 -67 -152 -157 444 92 -316 -114 48 48 -261 11
6292A1m0M28l10k75M11m85L62m78K43N5P7J49j28J01j32J11l6J1k42L79l48J25
$$ 11 -29 399 89 -186 225 -260 102 -376 -133 -78 -1 148 20 121 -11 100 64 75 -167 212 -136 -11
6314a1J16j28j50K58K7k66K12m6JN4j82K45q6r7O9rJ98L9l19K75K4k69L5P8J52
$$ -11 105 -23 -173 85 112 -154 58 12 13 67 -115 130 44 -53 16 7 205 244 -75 200 224 -45 -10 68 220
6339B20j48R2j34o7O6k20L16q8K3m5N9R7j29j20J56nJ99j45Q1j53l72M28L86o08
$$ 220 72 164 30 -37 29 -191 125 37 60 15 74 171 42 -78 78 73 272 127 208 55 -317 111 497 -111
6363a11K21l31M30k27k94M93n2j77J78pk21K54k11j19K81m4k93K47j11l6J31j55
$$ -111 110 -221 209 -18 -312 181 129 -48 130 123 -98 156 -55 -174 107 63 -230 17 -94 -130 1 -154
6385a54J3J3j28L09J50j5k90J45o8K5Q9k18r3J39j13M14k31j35J07K76l22J05
$$ -154 -141 -128 -256 53 203 188 -102 43 -25 0 89 -129 -222 -83 -196 218 -13 -148 -41 235 -87 18
6407A8j32j62L00j55J49J43j33m2J66j04lj27J66l11M7N84m73P8J11p5j00M1q4
$$ 18 -114 -276 24 -131 18 161 28 -14 152 48 45 -82 84 -227 -180 404 -69 9 120 45 -55 -14 -98
6430i8j0J58K93l92J56k55m4K48q5R8j47N8K05R0l19J51l22K05J3m2K74l99J19
$$ -98 -108 50 343 -49 107 -148 -192 56 -29 69 -78 -20 185 275 -44 107 -215 -10 3 -39 235 -164 -45
6453d5K3K7L94o05M21m76L18Q7j78L55j28j66P7jm67L05j09q1J06J84l63L96L9
$$ -45 -22 5 399 -206 215 -261 57 144 -34 321 193 27 104 103 -364 -59 -168 -249 -143 41 -322 74 113
6476A13k44R2k3J73o9k06K0j44R0L03J72j77m9p6Q0K26k94O3N6k84L77j67qj0
$$ 113 -131 -39 -62 111 42 -164 -144 -288 -198 105 277 100 51 -25 55 281 -13 50 106 -178 199 32 24 14
6500A4J27K78k22m8k85K82k59L77k47L1j68JR8l0L92m16J11n1O8J9k36L45j20
$$ 14 141 419 197 149 -136 146 -113 264 17 48 -120 -119 -21 -51 341 -75 36 -15 53 72 -164 181 61
6523F1m07N07j76N4K8k15J92R2j88K16k50J72l18K74p8J28j7k14k14L06K12j2
$$ 61 -346 161 -15 39 67 -148 44 136 -52 164 -86 86 -232 42 -36 92 75 -139 -353 -47 165 153
6545A53p9k89J08qn2K06j7R8n7J47k07l41K61j24J32R4K59l29j45K53M7QK3m2
$$ 153 74 -215 -107 -115 -167 39 22 120 63 210 3 -338 -77 -201 -69 25 284 -45 -190 63 110 118 141 99
6569I9j47j14N1L20n10J37O4N9Q2k23K67j32J36o3J57kj67K2l7j21M66Oo56L76
$$ 99 -48 -162 -111 209 -301 -164 -100 -41 41 -182 85 -47 89 26 183 181 14 36 -1 -122 344 350 -306 70
6593G0p3m58O27k8k53j32K29P0K09n9l77N0O2J92j41j99O2R4j79N4J93K06J26
$$ 70 -3 -461 166 138 -115 -247 -18 52 261 202 -175 -125 -63 129 -12 -211 -149 -55 -234 -180 13 219 345
6616C45l5j40j72j88M50p2q2L1r9mk47K10q4j8J13J39k77L45l6l43K45k38M10
$$ 345 310 170 -2 -190 260 188 106 137 38 34 -213 -3 -87 -105 8 147 -130 215 179 -164 81 -157 253
6639B53m59M3M04l02MOL89n26q2L13r3M53l73Q6j85q8K92Q3Qk99J45%J07l1l81
$$ 253 -206 -163 241 -61 -57 -51 338 -188 -270 43 -50 403 30 116 -69 -157 135 218 226 -73 72 72 179 148 -233
6664b33M89k04j5L63l77j13K71j37nl17J79J0K48MJ6o3o2N3l48M35l13j3Jr7J10
$$ -233 256 52 37 400 23 -90 181 44 39 -278 -99 -89 159 163 179 116 54 107 -241 194 -119 -132 -131 -228 -118
6689a18M4nN14n37J33J47j74j14J55J68n2j61j90j8K21Jp8Q1N5j46K36k01P4k38
$$ -118 -74 -79 435 -102 31 178 4 -110 45 213 161 0 -190 -208 13 14 -64 17 72 -74 162 -39 35 -203
6713b03K44N9K1p7p0K16j73k72L11k13N2L98l70J28k26OP5L11p4K5N3k11J0j14
$$ -203 41 100 121 44 -26 190 17 -255 56 -157 -105 293 -77 51 -175 -169 -94 217 143 168 221 10 20 -94
6737i4K93j39k21Q3J10j9j14P4N1J99k60j68J39M80m34P0k34L54O1n41M8L43r3
$$ -94 199 60 -161 -78 32 13 -101 -27 24 223 -37 -205 -66 414 -20 50 -184 170 231 -310 -262 81 -12
6760a2j10K66j65J69J77m88J17K71j1j66j66o2M2K02j28j11J12K16j25L50n36
$$ -12 -122 144 -21 148 325 -163 -46 225 214 48 -118 -180 -138 64 -64 -175 -63 153 28 378 -158
6781a58K90j91R6J87j14j57Q7p8n8K62l08q4J35J34K0p4R7k0K4Mk18N3k7L0K00
$$ -158 132 -59 37 224 110 -47 40 -38 -96 166 -142 -226 -91 43 63 -11 86 66 90 94 -124 -71 -98 -68 132
6806A32M6J36n18J16j69K78J0J06n37K69J89k78M80l47p0j05L59m17J67O6M7L2
$$ 132 178 314 -204 -88 -257 21 31 137 -400 -131 58 -220 260 -87 -157 -262 97 -320 -153 -87 -40 -8
6828hm27L29R0m18K44K90k72kJ27Qj2j33J88k77J43l16L71j33J35J72l70K58J30
$$ -8 -435 -106 -16 -434 -190 100 -172 -174 -47 -39 -51 -184 4 -273 -130 -446 -75 -208 -73 99 -271 -13 117
6851A17j62j94L46r3j4k25K32k52Q4K65J67k44J30j86l5K36k03q7N2J66k96K06
$$ 117 -45 -239 107 14 0 -225 7 -245 -161 104 271 27 157 -29 -64 172 -31 -118 -66 100 -196 10
6873A0Q8j84J61L52l12J03j17j63K23n6q9JK31l79J71l89L55j03R9p1k77M16j26
$$ 10 98 -86 75 427 115 218 101 -62 161 105 16 17 248 -131 40 -349 6 -97 2 -69 -346 70 -56
6896e6N4k37K28l57K27O1k88L69j10K5M68l34j74m8K41o0l06J99j03Q5K83n45
$$ -56 -2 -239 -11 -368 -141 -80 -368 1 -109 -84 384 50 -124 -172 69 9 -297 -98 -201 -116 167 -378
6918c78O16m21J14k7J8nN1Q0k06J37N6J34m0k7k29K54j55L25l55k29K47k15L78
$$ -378 238 -183 -69 -96 -78 -83 -32 48 -158 -21 35 169 129 102 -127 127 -28 297 -58 -287 -40 -255 123
6941A23k4k75K17M5J6nj04qP3K61k93k55J17K67l2j10J39k09r2N36r7m70n7L13
$$ 123 99 -176 41 86 102 97 -7 -15 58 319 26 -229 -112 155 123 13 152 -57 -149 387 290 -180 -237 76
6965G6m01O43m90K53m6%q9q9J72q4j77K35J85l17M38r6l39Q0l6M4q9L38l26R1
$$ 76 -325 318 -172 81 35 35 -54 -143 29 -55 -232 3 188 -129 309 213 -126 -46 -82 -38 -127 211 -115 -24
6989b4J73j59q3p6K71k24k09R9K71k03O0R0J2n1K32r5K22l71j6K15q0J65k32n6
$$ -24 149 -10 -93 -169 102 -122 -331 -232 39 -164 -104 -14 -2 -53 179 84 306 -65 -81 134 54 219 -13 -69
7013f9j98J24l9L1J54L3j56M5MN1Q3R2p9p9O7k34J23k06J22L11j13K32k53l87
$$ -69 -267 -143 -182 -151 3 36 -120 -75 -71 -20 63 155 76 -3 64 -170 -47 -253 -131 180 67 299 46 -341
7037c41J69J44n17K23K63L1M25n12J28n7Q5j79M23k03l99L72J88k76K04k82J20
$$ -341 -172 -28 -545 -322 -59 -28 397 -115 13 -44 41 -138 285 82 -317 55 243 -33 171 -111 9
7058IP2l15L92l12l2N12k64j56Q6k27K20jj43p3J50k59N67j84J24j31k39R5r4
$$ 9 81 -234 158 -154 -186 326 62 -94 -8 -235 -15 -16 -159 -232 -82 -341 226 42 166 35 -204 -109 -203
7081b03R5QL53l03K74l54L36J34n70J69k45J38J59J30m7k12j0n8rK76n1K47l01
$$ -203 -108 -100 253 -50 224 -130 206 340 -230 -61 -306 -168 -9 121 74 -138 -148 -206 -215 61 10 257 -44
7104d4k8j71K60k8l0O6J06k50L07K7k46j65O7J97q3j34L59Lk89p7L93k46L6n6
$$ -44 -72 -243 17 -11 -41 25 131 -119 188 215 -31 -196 -129 68 -15 -149 210 213 -76 -153 240 -6 30 -26
7128b6K7n8j27K95j69L11j71j34K18kl46L04n2j21k15L15j2nQ6J53k26o1K02j60
$$ -26 1 -57 -184 111 -58 253 82 -52 166 164 -182 122 70 -51 -266 49 37 32 118 271 45 -16 186 26
7152B6J02J4j99p6K38n27M09K22P0l16L52n25K62j3j60M6J35j66J65N1J4k63k8
$$ 26 128 142 -57 -133 105 -422 -13 209 279 -37 315 -210 52 39 -121 -75 60 -106 59 110 124 -139 -167
7175a67L37j0k39J73L1kj10k33N03k52J12j77O3J15n4N8k67L16m20K95L5k2k16
$$ -167 170 160 -79 94 125 123 13 -220 283 31 143 -34 29 144 90 148 -119 197 -223 72 107 85 -131
7198a31M1J82j51P2Q3k88K51j0j24P2P0nj16p7K5k5K68j03o1M9k31L69j82N7k78
$$ -131 -90 92 -59 13 96 -192 59 49 -75 -3 67 62 -54 -131 -106 -131 137 34 -27 22 -209 160 -22 35 -243
7223b43K37m9J23j8l47M90k22K79l0k51J18j52J12l82L38k12J96J70j03j18K19
$$ -243 -6 -55 68 50 -297 193 -29 250 220 -31 87 -65 47 -335 3 -209 -13 157 54 -64 155
7244A55j7l21N9K27l58R9M96m04J72k73K03J2K23j87k31K04N7L7q6j96J62J37
$$ 155 138 -183 -124 103 -255 -156 340 -64 108 -165 38 50 273 86 -145 59 116 153 67 -129 33 170
7266A70j71QJ47P6m22L95l9j51L00l53j33J55R6l56J97q3K40J2k65j56M07m7R1
$$ 170 -1 7 154 230 -192 203 164 13 313 -40 -173 -18 78 -278 -81 -164 76 88 -177 -333 74 27 118
7289A18j34J93r9J8J91k26j41j47R1K20Q7Jk68J16k09QN0K55k6K14p1k80K5J05
$$ 118 -16 177 78 96 287 61 -80 -227 -136 84 171 172 -96 20 -189 -181 -131 124 98 312 241 -39 -14 91
7313I1k21J77R6k08k18K78Q2m88K22J20J69k37O5K62l14J18K8k09K5j8L25j65
$$ 91 -130 47 143 -65 -283 -5 77 -411 -189 -69 100 -137 -72 190 -124 -6 22 -187 -162 -180 145 -20
7335b0j15J90o5J13N2P4J5m3j48K39k56m0J83l45q1M89k18k34K55p3o3oj0J14
$$ -20 -135 55 -10 103 155 229 244 201 53 292 36 -4 179 -166 -247 242 24 -210 45 -28 -91 -97 -107 7
7359GMj52r0l7L83l54J53P9k05J65J40j03J25o5j76K37l1p1K28m45O1J85J5l09
$$ 7 11 -141 -231 -268 115 -239 -86 -7 -212 -47 93 -10 115 50 -126 111 80 9 237 -208 -147 38 53 -256
7383b56K09L67j31j48K07j82Kk21J34J61r9P4k95J49l36M90J67k75J67l61L59
$$ -256 -47 320 189 41 248 66 68 -153 -19 142 43 117 -178 -29 -365 125 292 17 184 -177 182
7404A82j69P5l26L27J26j27J74k28j81jJ55j62K74j68k17M92j10M0L9r2j8j37
$$ 182 13 88 -238 89 215 88 262 34 -147 -148 7 -155 119 -49 -266 226 116 156 195 103 85 -52
7426e2K9m6K87L7k61J47Kk41L95l02J96j08k71J01j0N9J92l48L58O3k49K3J95
$$ -52 -23 -69 218 255 -6 141 143 -98 297 -5 191 83 -188 -87 -97 -38 154 -194 164 227 -22 1 196
7449A96m3J8q1k9k38Q1k9o5R2J23No4K42k79M12m28j07J53m0L09o1L8p8p2J15
$$ 196 153 171 90 61 -177 -96 -125 -190 -98 25 30 -34 208 -71 341 -87 -194 -41 -81 228 167 205 127 55 170
7474A70j06L00j02m61K27q6J46j14j99Q4k0L89j88P7k8l16P4N03n37L70l06J05
$$ 170 64 364 262 -199 28 -58 88 -26 -225 -141 -161 228 40 117 89 -227 -153 350 -187 183 -123 -18
7496a8k9n7L9M4KJ27j52K24pk02M28k89J91k91p8J13k9Q5j24N0q9J56J5j61J57
$$ -18 -47 -104 -65 -21 -19 108 -44 180 173 -29 399 110 301 10 -68 45 16 101 -23 27 -62 94 109 -52 105
7521A05j67J48j85R3J4K5j31n7J30L6n1%K04k62Q3k72L75j81J91op0k4j04L1K58
$$ 105 -62 86 -99 -6 8 33 -98 -155 -25 11 -40 -40 164 -98 -15 -287 88 -93 98 92 22 -2 -106 -75 183
7546A83j38J25J3l99L73m9l6k20j1J51j65J95m01M10N4j59K72j32J91n42K8M11
$$ 183 45 170 183 -216 157 108 72 -148 -159 -8 -173 22 -379 31 85 -74 198 66 257 -285 -257 154
7568A54o1k00n9J64k33L70J7Rk99j42J27L29j1k71j5M08k55q7O6J88n8j89l8J54
$$ 154 93 -107 -166 -2 -235 135 152 161 -138 -280 -153 176 165 -106 -121 287 32 -55 11 199 141 -48 -86 68
7592F8O7o9q5J94j92n7j32J52K20j15J90j0m56K65j18J3j18M39l58r3L19J2k92
$$ 68 135 66 -19 175 -17 -74 -206 -54 166 51 241 231 -225 40 -78 -65 -183 256 -102 -195 124 136 -156
7615a56K0p3Q9K47k67L96k09K50l18M11l91J59j06j5R9j14K16n1l22r8O3nM59
$$ -156 -136 -209 -120 127 -140 256 47 297 -21 390 -1 158 52 37 136 22 238 187 -135 -233 -170 -175 284
7638B84j76j55j79M4N3K12M8j24p6j9L47j25j42j25o5L52j42J98l69L65k09q5
$$ 284 108 -47 -226 -182 -129 83 131 7 -69 -88 259 134 -8 -133 -198 154 12 210 -159 206 -3 -88
7660h8j91J1J4L30n8j4j20L05l40L15r4l23L98j03j05K62j50L8L2j28k06K75k46
$$ -88 -279 -268 -254 76 18 4 -116 189 -151 164 70 -253 145 42 -63 199 49 87 119 -9 -215 60 -186
7683a86J51J27P3m87J28n9J11K19J14m79L75N4k61L52m16K61j82o8J9J59Q2k0
$$ -186 -35 92 165 -322 -194 -253 -142 77 191 -288 87 141 -120 232 -184 77 -105 -173 -154 5 87 67
7705F7J39j3m69K02L70l74l26K20KK55j14K48J6j90j55J23p7k25L92rp9l6J24
$$ 67 206 193 -276 -74 296 -78 -404 -184 -182 73 -41 207 223 33 -122 1 -76 -301 91 82 3 -33 91
7728I1j47j49o3L86j47K1m0k40L46p2l67J73k54L58j00j47M06k31K18pq9K78l72
$$ 91 -56 -205 -268 118 -29 -8 -48 -288 58 -14 -381 -208 -462 -104 -204 -351 55 -176 42 35 -54 224 -148
7751a48J2o6J73J6j71L02j71mJ67n38L07J39q9K79m87J40j11K59J65l26L54m6
$$ -148 -136 -202 -29 -13 -184 118 -53 -57 110 -428 -121 18 -71 208 -279 -139 -250 9 174 -152 202 156
7773A56j56j42J95k12K66k70K9P5R7J8l68K96J24J25k47OK25j86l10O37l35pJ52
$$ 156 0 -142 53 -159 107 -163 -134 -59 38 56 -312 -16 108 233 -14 -8 217 31 -279 358 23 16 168
7796A68j09J37j05N7l13K19J76j63j18j98K09r6K76l92L20k20J36J39m0R7Q9l83
$$ 168 59 196 91 148 -165 54 230 67 -51 -249 -40 -136 140 -252 68 -152 -16 123 83 180 269 -114
7818a14J23K8r3k03O9lL13n4k97k7K85Q8m61L64o0PK17q4p0j97J46P2j4k7j67
$$ -114 9 37 -56 -259 -190 -193 120 66 -231 -258 27 115 -346 18 -42 -35 182 98 28 -169 -23 49 35 8 -159
7843a59K06J86k12k23j40M13j18Jo3R5p5M4j27J7R5p0K67j64J57k4k93m02P41
$$ -159 47 233 21 -202 -342 71 -47 -46 -109 -14 -89 -45 -172 -155 -60 -130 137 -27 130 106 -187 -589 152
7866A52j79M1j40K50j34K78j10m16K90K66l40K53m16K12J25k41j27J88J21J93
$$ 152 -27 14 -126 124 -10 268 158 -258 32 298 -42 211 -205 7 132 -109 -236 -48 73 266
7886B66l86N3L2l22M38k45P0J8n8K6M21l70m0L26l33J00K07J9K15l19q1k61K87
$$ 266 -120 -67 -35 -357 81 -164 -94 -76 -134 -108 313 -57 -97 229 -104 -4 203 222 437 118 37 -224 63
7909F3L02l75m29N61l98Q7K06J29m96K15J63%k3j12M59n78M17j01K78l09n2o2
$$ 63 365 -10 -439 122 -276 -189 17 146 -350 -135 28 28 5 -107 352 -226 191 90 368 59 7 -55
7931e5K42n8l6k36J12M7K23J20o08J72j4j49L44j62l3K36n9l05L31K13p89L84
$$ -55 187 129 93 -143 -31 16 239 359 -249 -77 -91 -240 104 -58 -91 145 86 -219 112 325 -464 -80
7953h0q3N7J49o2m7m7M34l10l61M36k98L50j80j30J34L7L5J77J9j05p4K31m4o60
$$ -80 -163 -106 43 -19 -66 -113 321 11 -350 86 -212 138 -42 -172 -38 -1 34 211 230 125 51 282 238 -422
7977d22M85l69M95p7J44l31Kj71l0J79K33Lm20K79K53k27k02K62k72K55j03K5
$$ -422 63 -306 189 112 256 -75 -73 -244 -274 -95 138 141 -279 0 253 26 -176 86 -186 69 -34 -9
7999il07L77K02l45L95k81K65m89K43J00k40K32k59M6K05l46j30K10J41J03l7
$$ -9 -316 61 263 -82 313 32 297 -192 51 151 -89 143 -116 -70 135 -211 -341 -131 10 113 76
8020G6J9nm5j23j08K56k5Q0O8j15k20K73k12R4K4q5n9J86n4n1J36k09K47k64j3
$$ 76 95 90 45 -78 -186 70 45 125 193 78 -142 131 -81 13 37 -48 -107 79 25 -26 110 -99 148 -116 -129
8045a29K81k5m52L27L49n19K37j98r1K53l55K33K94p1mj15j73p4M31n7j91k1J46
$$ -129 152 127 -325 2 351 -168 69 -129 -220 33 -322 -89 205 134 130 15 -158 -232 199 142 -49 -70 76
8068G6m15L34k1k58K04k54K38j62K52J4M4O1l1J52j93j50M29k71p4J85J38m86
$$ 76 -339 -5 -26 -284 -80 -334 -96 -258 -6 8 52 113 82 234 41 -109 320 49 -25 160 298 -188
8090a88L35l23l4K29j22J52q7M0J83r2l47J59K1q7K1O1N5O5m21M26r9L0l7ML2
$$ -188 147 -176 -210 19 -103 49 -38 2 185 93 -254 -95 -74 -161 -140 -79 -24 41 -380 46 -53 -23 -60 -56 -24
8115b4j45J03j46J41J86k52P8j26k85M67J69qj54J68p6J16K43l65j62oP7r6J24
$$ -24 -169 -66 -212 -71 115 -137 -59 -185 -470 -3 166 158 4 172 96 212 455 90 -72 -78 -1 -97 27
8138B7j9o5K10j36k99M05j13J8j70J03J30nKj07K15j37l76L98O5q9R2j90L6K71
$$ 27 8 -57 153 17 -282 123 10 28 -142 -39 91 86 88 -19 196 59 -317 81 146 57 149 -41 -5 266
8162B66q9j08j62L3J41l10J70n5K7J63J2l84L75l00L39k46r0J75Ko7k3N31l90
$$ 266 177 69 -93 -60 81 -229 -59 -114 -87 76 88 -296 79 -221 118 -128 -218 -43 -41 -108 -131 400 10
8185A0m2Pj03J54j04J22
$$ 10 -32 -25 -128 26 -78 44
8191D4
$$ Imaginary data points
##PAGE= N=2
##DATA TABLE= (X++(I..I)), XYDATA
0@%%%qK4l2L2m0N2o8R0j14J36j60K00k48K98l54M18m92N80o84P96r12J045j200
$$ 0 0 0 0 -8 16 -16 16 -24 28 -40 50 -64 72 -88 112 -136 162 -192 226 -266 314 -370 426 -486 559 -641
26f41J375j566J774k003K257k542K855l195L565l971M420m915N457o049O699p414
$$ -641 734 -832 942 -1061 1196 -1346 1509 -1686 1879 -2092 2328 -2587 2870 -3179 3520 -3894
42c894Q208r091J0070j1165J2397j3794J5397j7254J9429k2020K5174k9116L4198
$$ -3894 4314 -4777 5293 -5872 6525 -7269 8128 -9126 10303 -11717 13457 -15659 18539
55A8539m1024N0731o5722R2083j51551N06281N67q90540O54764L479k28799M68082
$$ 18539 -22485 28246 -37476 54607 -96944 409337 409904 -480636 174128 177607 -51192 416890
67D16890k70807o41937P79101K22473q05390J96773M19679m38162K29026K25121
$$ 416890 146083 -495854 283247 505720 -299670 -102897 316782 -121380 107646 332767
77C32767o44853J66573O02081n61797j87770N61343k47547k16162M17104k82272
$$ 332767 -312086 -145513 456568 -105229 -292999 268344 20797 -195365 221739 -60533
87f0533k09941N79483j43081m91340M23033J10233m13027K53072R9749l93891
$$ -60533 -270474 309009 165928 -325412 97621 207854 -205173 47899 147648 -246243
97b46243K90387K04022m99084J31113L82078l65817m1087L20957k61379l4206
$$ -246243 44144 248166 -250918 -119805 262273 -103544 -144631 176326 -85053 -119259
107a19259L10147l19856j34926M66095j27175l34987K49867J2107j33418L00008
$$ -119259 190888 -128968 -263894 202201 75026 -259961 -10094 2013 -131405 168603
117A68603j08698l73962L12475K06255l04749N5035Q4703k11250J80030J50696
$$ 168603 59905 -314057 -1582 204673 -100076 -45041 39662 -171588 8442 159138
127A59138l24969L1089K67868j59545m8301J49610j67426j9807K35638j27117
$$ 159138 -165831 -134742 133126 -26419 -74720 74890 -92536 -112343 123295 -3822
137c822j25143J72795p5907j05496J90606k3327j27318J40367j2452j27144J36769
$$ -3822 -128965 43830 -32077 -137573 53033 29706 -97612 42755 30303 -96841 39928
148C9928K8418j32833R7702M1022j45040O5801Q1967j14489L7750P2467j07542
$$ 39928 68346 -64487 33215 74237 -70803 -5002 76965 -37524 226 72693 -34849
159c4849N0275J01039j42907k8716J23448m8330o216N9528j30977k4570J57431
$$ -34849 15426 116465 -26442 -55158 68290 19960 13744 73272 -57705 -82275 75156
170G5156l9798o9869Q1143m5404m1411J18731m2320r2845J13385J099j00035Q6091
$$ 75156 35358 -34511 46632 1228 -40183 78548 36228 -56617 56768 57867 -42168 43923
182D3923k830j11184J04778N0645j12108N9255K8542j23991P9740R5603j31502
$$ 43923 41093 -70091 34687 85332 -26776 32479 61021 -62970 16770 112373 -19129
193a9129q354O9918r3166L1181J04179j30488l7475J41015n9976n5406J07847
$$ -19129 -27483 42435 -50731 -19550 84629 -45859 -83334 57681 -2295 -57701 50146
204E0146o2661o0540J30323n0571j05481J27919L960j20689Q5770L3139r4476
$$ 50146 -12515 -73055 57268 6697 -98784 29135 33095 -87594 -1824 31315 -63161
215f3161Q5242L1356j41229P1285J13767j24015j7855P9679q7186K2259J10918
$$ -63161 22081 53437 -87792 -16507 97260 -26755 -44610 35069 -52117 -29858 81060
226H1060j20671m8214J40280m4989o6515R9715l8312o5127J16356k2203j16062
$$ 81060 -39611 -87825 52455 7466 -59049 40666 2354 -62773 53583 31380 -84682
237h4682Q9249L1849r8439P5269M4320j18875M2392P1391q8361M2367Q1294j18394
$$ -84682 4567 36416 -62023 13246 57566 -61309 -18917 52474 -35887 6480 87774 -30620
249c0620k0533R9887n7300k1553Q2007o8202m7929J04290k5025p1618Q1918K38
$$ -30620 -51153 48734 -8566 -30119 51888 -16314 -64243 40047 15022 -56596 25322 25560
261B5560p0885O9706M857q8499N8856L6364p9396L9017M7138p6831J7785O1765
$$ 25560 -45325 24381 29238 -59261 -405 35959 -43437 -4420 42718 -34113 -16328 45437
273D5437n4943O629O2037n8977k2745P0105l3154l8784N5829k1571l5256O2779
$$ 45437 -9506 -2877 59160 183 -22562 47543 14389 -24395 31434 9863 -25393 37386
285C7386j4072n9751N0321J9991m2088K8839K625n7668K6597L5681m0850M020
$$ 37386 23314 -36437 13884 33875 -8213 20626 23251 -34417 -7820 27861 -12989 -8969
297h969K3962m1685N520M8851k4723j1286K9524k8623j0855M2612j5830k7813
$$ -8969 14993 -26692 -21172 27679 2956 -8330 21194 -7429 -18284 24328 8498 -19315
309a9315K4207q442j8199K7688j204k3939K2408R572k4662Q860Q125k2052J1664
$$ -19315 4892 -3550 -21749 5939 4735 -19204 3204 12776 -11886 -3026 5099 -16953 -5289
322e289J5710k7163l323J4799j2013R195J9487j6508m607J6074o020p37J2125
$$ -5289 10421 -16742 -20065 -5266 -17279 -8084 11403 -5105 -9712 6362 342 -395 11730
335A1730j0786j0526J4196r63j0073Q440k330p864J8847P207j5700Q6j720p323
$$ 11730 944 -9582 4614 3651 -6422 2018 -312 -8176 10671 17878 2178 2264 544 -6779
349f779J3798M866j6890m831Q14m141Q932J1181o096l687N213m662j18R739m908
$$ -6779 7019 11885 -5005 -9836 -9022 -13163 -4231 6950 854 -2833 2380 -2282 -2400 7339 2431
364B431m766O235o970p128Q982N41R03J0245l805r177N293M304k699K162k010
$$ 2431 -2335 3900 -3070 -10198 -1216 -675 228 10473 6668 -2509 2784 7088 4389 6551 4541
379D541j1643n86O846k525Q90M007p220L140J1089m315k720L240n295L5O214m569
$$ 4541 -7102 -7688 -842 -3367 -2477 1530 -5690 -2550 8539 4224 1504 4744 -551 -516 5698 1129
395A129n754L290J336O8P512J798o885K739L167m347L243N84j1310J89L218n962
$$ 1129 -4625 -1335 1 69 7581 9379 2494 5233 8400 4053 7296 7880 -3430 -3241 -23 -5985
411e985K547M898l994K12K699l280Q13O374k374n983n22m688l227R997K542n017
$$ -5985 -3438 1460 -2534 -2322 377 -2903 -2090 4284 1910 -4073 -4595 -9283 -12510 -2513 29 -4988
427d988K315k276k534J1819M123n839k33m027o701N402M295n305J78K023n486
$$ -4988 -2673 -4949 -7483 4336 8459 2620 2387 -1640 -8341 -2939 1356 -3949 -3771 -1748 -7234
442g234L112J0458m200k419O720n734k755O737o714m742Q793l016k896R702j580
$$ -7234 -4122 6336 2136 -283 6437 703 -2052 4685 -2029 -6771 2022 -994 -3890 5812 4232
457D232o454Q810K416o122P270L84j4647K353N660j0086N514Q483j3872RJ0089
$$ 4232 -2222 6588 9004 2882 10152 10536 -4111 -1758 3902 -6184 -670 7813 -6059 -6050 4039
472D039q017M019J2337j3186q378R591n792n359J2830m516j1564J2488J648j0124
$$ 4039 -3978 41 12378 -808 -9186 405 -5387 -10746 2084 -2432 -13996 -1508 140 -9984
486i984J5036N838j5523Q444M763j6427Q008J0199j5637J925J0404j3777J986
$$ -9984 5052 10890 -4633 3811 8574 -7853 155 10354 -5283 -3358 7046 -6731 -4745
499d745J8471r174p179J3324q252p656J7895q912j7105J6551J14j5213J3979J516
$$ -4745 13726 4552 -2627 10697 2445 -5211 12684 3772 -13333 3218 3332 -11881 2098 3614
513C614j3892J6486O274j9175P225J1881j5069P5P868j4193M407J5789j8368o765
$$ 3614 -10278 6208 12482 -6693 532 12413 -2656 -2581 5287 -8906 -4499 11290 -7078 -13843
527a3843K0839l878m813J1622j2331p233J7973p034j4904J2926K316j1753M899
$$ -13843 6996 3118 -1695 9927 -2404 -9637 8336 1302 -13602 -676 1640 -10113 -5214
540e214n93m875J6290N901j7368J254Q434o818O115M836j3650J179M541p886Q671
$$ -5214 -5807 -10682 5608 11509 -5859 -4605 3829 -2989 3126 7962 -5688 -4509 32 -7854 817
555H17J1336j1395l592O440k52N741J752j7129j728J6861m488j0859K948k640
$$ 817 12153 758 -2834 3606 3354 9095 10847 -6282 -8010 8851 4363 -6496 -3548 -6188
569f188O725J3451j6598q849K2258J36j2651K774q347K221K1477j5094k4735K0456
$$ -6188 537 13988 -2610 -11459 10799 10935 -1716 1058 -7289 -5068 16409 1315 -23420 -2964
583b964J4423j1753M740m507j3073K6263O175l6915P731K4434k0120j00Q281k5074
$$ -2964 11459 -294 4446 -61 -13134 13129 19304 -17611 -9880 14554 -5566 -5666 2615 -22459
597b2459J7098L2735l4240j4809L3331r794p837K5635k3702k0881L8753o407l0800
$$ -22459 -5361 27374 -6866 -21675 11656 1862 -5975 19660 -4042 -24923 13830 7423 -23377
610b3377L2783K775l5272L1937J3838l9744K2274J8967m0766J8133K7870m8852
$$ -23377 9406 12181 -23091 8846 22684 -17060 5214 24181 -16585 1548 29418 -19434
622a9434J302M4438l0056j0727L5137l1038j0254N5689k5867m1615M7760j426
$$ -19434 -18132 26306 -3750 -14477 20660 -10378 -20632 35057 9190 -32425 15335 13909
634A3909l7730L6982n789m5652M7582J6746n8426K5586L4386m5482J4270L2297
$$ 13909 -23821 13161 7372 -38280 9302 26048 -32378 -6792 27594 -17888 -3618 28679
646B8679n2782J0074N5064n2064k3682N5605k6039j7145N5760l5012m2702O6702
$$ 28679 -24103 -14029 41035 -11029 -34711 20894 -5145 -22290 33470 -1542 -44244 22458
658B2458K156m9129L9134j581n1029N0262K1614o8471K0805M2287m6119J3925
$$ 22458 24614 -24515 14619 13038 -37991 12271 33885 -34586 -13781 28506 -17613 -3688
670c688L6165n7911Q114O6006m6059l0608M8451k2151j5713N1654l4052m4339
$$ -3688 32477 -25434 -17320 48686 2627 -27981 20470 -1681 -17394 34260 208 -44131
682d4131O2597Q128n0231L0908P925m0557L8857J6055o0670K0782M0192m7613
$$ -44131 18466 26594 -23637 7271 15196 -25361 13496 29551 -31119 -10337 29855 -17758
694a7758J141L6349l6088K803M1818l8156j4927N0158j8383k8292L6815j1292
$$ -17758 -16617 19732 -16356 -13553 28265 -9891 -24818 25340 6957 -21335 15480 4188
706D188l0557L7548J279l6100K8236O823l5895K9698K2329m0768N071K3077k2198
$$ 4188 -26369 11179 12458 -23642 4594 11417 -24478 5220 27549 -13219 -8148 14929 -7269
719g269Q524J6941l7147O01M1338j7321k3297J8433k026K896K4117k5261k7390
$$ -7269 1255 18196 -18951 -18350 22988 5667 -17630 803 -1223 1673 25790 529 -26861
732b6861L4091J3878k2339q70n092m822K5088J36k8278Q583J9204p373l456j802
$$ -26861 7230 21108 -1231 -2101 -7193 -12015 13073 13209 -15069 -6486 12718 5345 1889 87
746H7p818J2405O495k0803l232J4794j138j094k060q701J1603J1408j2726m666
$$ 87 -7731 4674 11169 -9634 -12866 1928 790 -304 -2364 -11065 538 11946 -780 -5446
760e446O276l175M304J653j2976L847J1286j0663l47J2256q354o56J2964j0845
$$ -5446 830 -2345 1959 3612 -9364 -5517 5769 -4894 -5241 7015 -1339 -1995 10969 124
774A24n529J5625j1621p960K1461r851j8685J8705K135r987J8863q010k4204K4811
$$ 124 -5405 10220 -1401 -9361 12100 2249 -16436 2269 4404 -5583 13280 5270 -18934 5877
788E877J4556k6643L972Q949k0496J4616J6876l2247L059L0470k1792o070K5458
$$ 5877 20433 -6210 -2238 6711 -13785 831 17707 -14540 -11481 18989 -2803 -8873 16585
801A6585k0288p194L1107k0801k1138L3606n637k6523K5789N52k6581K8730P575
$$ 16585 -3703 -10897 20210 -591 -21729 11877 6240 -20283 5506 6058 -20523 8207 15782
814A5782l6818K0855K0853l5380Q915K2307l2942O757L0311l3047o350L8470j9702
$$ 15782 -21036 -181 20672 -14708 -5793 16514 -16428 -9671 20640 -12407 -18757 19713 11
827A1j4312L3433j6938k1364L6651n987l0886K8941N32l4256K8912J5696l6550
$$ 11 -14301 19132 2194 -19170 17481 11494 -19392 9549 10081 -24175 4737 20433 -16117
840a6117J5234J8306l1911J4108K7407l6749l724L2456k3104r703K9640k0409
$$ -16117 -883 17423 -14488 -380 27027 -9722 -13446 19010 -4094 -13797 15843 -4566
852d566j4609L6865j2217k6190L1928L83k7222K4297K774l0977K1528J2510l2193
$$ -4566 -19175 17690 5473 -20717 11211 11594 -15628 8669 11443 -19534 1994 14504 -17689
865a7689J2313J9853k7438M731K4226k2563j819K5616k1999j0233L0192j2138
$$ -17689 -5376 14477 -12961 -8230 15996 -6567 -8386 17230 -4769 -15002 15190 3052
877C052j9725K2693n626j5947K5426j298k4779J8631J0488k0775J1060R587k2053
$$ 3052 -16673 6020 394 -15553 9873 8575 -16204 2427 12915 -7860 3200 12787 -9266
890i266O362J5007k0300J233K0415j6642o037J8996q569n574J6839r872j2197
$$ -9266 -2904 12103 -8197 -6964 13451 -3191 -9228 9768 1199 -4375 12464 2592 -9605
903i605J7192j761j5317J0501K705j1978R312L723j3988Q481J1042j2543n84Q047
$$ -9605 7587 5826 -9491 1010 3715 -8263 1049 4772 -9216 -735 10307 -2236 -2820 5227
917E227r115N51R145q473m332P937l816k415R443j445p094N006J958l137M059
$$ 5227 -3888 -3337 5808 -2665 -6997 940 -2876 -5291 4152 2707 -4387 619 2577 -560 3499
932C499j402q663L573N159l808P0J298l014L482M170k912q85K268j515j503R63
$$ 3499 2097 -6566 -2993 2166 -1642 -1572 -274 -3288 194 4364 1452 567 2835 1320 -183 780
948G80j136m88J666p61j993K256J591P10J88j084j65O34j765n75M44j766m7O1
$$ 780 -356 -844 822 61 -1932 324 1915 2625 2813 1729 1564 2198 433 -142 302 -1464 -1511 -1450
966a450k208K799L408j579r03L02j636J438K746l089l668J622l30k62L542j056
$$ -1450 -3658 -859 2549 970 67 369 -1267 171 2917 -172 -3840 -2218 -2548 -2810 732 -324
982c24l106L616J518j320K221j245l819K244J685l618J23J692j943R80L319j974
$$ -324 -3430 186 1704 384 2605 1360 -2459 -215 1470 -2148 -2025 -333 -2276 -1296 2023 49
998D9m65M158j326k560K481j395k674K715n69k469J910J97j289L306J935k998
$$ 49 -416 3742 2416 -144 2337 942 -1732 983 414 -2055 -145 52 -1237 2069 4004 1006
1014A006q25K032j424o3J923m198k328L179q81M10K985j872k076K904O68j186
$$ 1006 181 2213 789 726 2649 -1549 -3877 -698 -1579 -1169 1816 -56 -2132 772 1440 254
1030B54J686j550l693J058J734j597L81J272j993Q16L204j020j7J771k316p76
$$ 254 1940 390 -3303 -2245 -511 -2108 -1727 -455 -2448 -1632 1572 552 535 2306 -10 -786
1046g86J198j315l50J066l93j156J217J085O61J134P5k319P95J502j233l94o95
$$ -786 412 -903 -1253 -187 -580 -1736 -519 566 1227 2361 2436 117 912 2414 1181 787 92
1063I2k662N78K326N09M44l02j054J07K189R89k102r68j065j247J434P48j426
$$ 92 -2570 -1992 334 843 1287 985 -69 38 2227 3216 1114 146 -919 -2166 -732 16 -1410
1080a410J13N73n57J707J393j073o04l03m76r6k71j104l04J027k17k70J602O40
$$ -1410 -1297 -724 -1281 426 1819 746 142 -161 -637 -733 -1004 -2108 -2412 -1385 -1602 -1872 -270 370
1098C70o2J292n44j356O68Jj191L85k89o86L04J621L64O30k9o14L27J535j065
$$ 370 308 1600 1056 -300 368 369 -822 -437 -726 -1412 -1108 513 877 1507 1478 864 1191 2726 1661
1117A661j813L41j532K04J167k31r0O05l99O67J157L83j013o38m45j227J10Q32
$$ 1661 -152 189 -1343 -1139 28 -203 -293 312 -87 580 1737 2120 1107 469 24 -1203 -1093 -261
1135b61j022K67K8l40M97K455k18q75m19r63k67P30r1l25j492k09N11J679J359
$$ -261 -1283 -1016 -988 -1328 -831 1624 1406 531 112 -851 -1118 -388 -479 -804 -2296 -2505 -1994 -315 1044
1154A044m26n55K07J04N76K15p57j095j069Q48N74L83J031j08j322J512J244m73
$$ 1044 618 63 270 374 950 1165 408 -687 -1756 -908 -334 49 1080 972 -350 1162 2406 1933
1172A933K51j216k333N91J505j196l23L58q56R54K637m69j850J614m79j977J367
$$ 1933 2184 968 -1365 -774 731 -465 -788 -430 -1286 -332 2305 1836 -14 1600 1121 -856 511
1189E11o58k691K748q7l354K051K579j252Q61J209l722R37M057l138l166L354
$$ 511 -147 -2838 -90 -177 -3531 -1480 1099 -153 708 1917 -1805 -868 3189 51 -3115 239
1205B39j898j560M175j380l248O065l42m358L628J793m732K801J244o088J590
$$ 239 -1659 -3219 956 -424 -3672 2393 2051 -2307 1321 3114 -1618 1183 2427 -3661 -2071
1220b071N037m714k18N807m741j094P958m259l649O370l567m931P392j485p054
$$ -2071 2966 -1748 -1966 3841 -900 -1994 5964 1705 -1944 4426 859 -4072 3320 1835 -5219
1235e219N755K495p072N002L170p188L853N467r528k7Q367o741j568O525p543
$$ -5219 536 3031 -4041 961 4131 -3057 796 6263 -3265 -3292 5075 -1666 -3234 3291 -4252
1250d252k078J2029l840p509P736j09n409P589j225r882O684N049j0659K648O807
$$ -4252 -6330 5699 1859 -5650 2086 1977 -3432 4157 2932 -6950 -266 4783 -5876 -3228 3579
1265C579p685L414O585r928Q46J1374o797n292P233m409l749J0015l377r114Q638
$$ 3579 -4106 -692 5893 -4035 -3189 8185 1388 -3904 3329 -1080 -4829 5186 1809 -7305 1333
1280A333K652p179O008K287r161N323N604r855J399O342p945O27O745o875j440
$$ 1333 3985 -3194 2814 5101 -4060 1263 6867 -2988 -1589 4753 -3192 -2565 4180 -2695 -4135
1295d135R085l153n159O658k019m632P398j176r453M851L321n408L826J949p083
$$ -4135 4950 1797 -3362 3296 1277 -3355 4043 2867 -6586 -1735 1586 -3822 4 1953 -5130
1310e130L671O732n745j958M811k724j335L784l962k995O772M28o034K988J463
$$ -5130 -1459 5273 -472 -2430 2381 -343 -1678 2106 -1856 -4851 1921 2349 -3685 -697 766
1325G66j663M159m6o064J788L980k031j971R67j502J06L335n63k408K445J587
$$ 766 -897 3262 3216 -2848 -1060 2920 889 -1082 -115 -1617 -1511 1824 1261 -1147 1298 2885
1341B885k495O82L38j820L38J105j755j824K262J187j687J299R40l087J462L629
$$ 2885 390 1072 1410 -410 -72 1033 -722 -2546 -284 903 -784 515 1455 -1632 -170 3459
1357C459l084j903K070k352j051M556k052m118M790J195l857L706J540n888L791
$$ 3459 375 -1528 542 -1810 -2861 1695 -357 -4475 315 1510 -2347 1359 2899 -2989 802
1372H02K929p998J738O546o343q63N474n046j59Q691m236o180Q156n70o928P025
$$ 802 3731 -4267 -2529 4017 -2326 -3189 2285 -2761 -2920 5771 1535 -4645 3511 2941 -3987 3038
1388C038l20q703P365K876j0444N957P139j0165J665Q194q842O88Q972r373l889
$$ 3038 2718 -5985 1380 4256 -6188 -231 6908 -3257 -1592 6602 -2240 -1552 7420 -1953 -5842
1403e842J1895n819p775J1444j895q544J1032j082j1508J1817L950j4439N163
$$ -5842 6053 234 -7541 3903 2008 -6536 4496 3414 -8094 3723 7673 -6766 -1603
1416a603O718j0912M504P491j3060J320J3307r629l878J3440p503o514J2889n371
$$ -1603 5115 -5797 -1293 6198 -6862 -5542 7765 -1864 -5742 7698 195 -6319 6570 1199
1430A199r526J3025j255j3074J1393L246j2261Q716N934j3635N471R062j2268
$$ 1199 -8327 4698 3443 -9631 1762 5008 -7253 1463 7397 -6238 -767 8295 -3973
1443c973J392J1233j1921l515J3437p302n172J2420o136p782J3846j238j1730
$$ -3973 -2581 8652 -3269 -6784 6653 -649 -5821 6599 463 -7319 6527 5289 -6441
1456f441R387J819j0517P171L022j2001O740Q435j2324K48J0299p495k07R275
$$ -6441 2946 4765 -5752 1419 4441 -7560 -820 7615 -4709 -4461 5838 -1657 -1864 7411
1470G411r853m291J2952m508q409Q448k018n940R760k53j0130P488N055q968K824
$$ 7411 -2442 -6733 6219 1711 -6698 1750 -268 -6208 3552 3299 -6831 657 5712 -3256 -432
1485d32N214r058K606P125q416k011Q323m146j438O686m912l771Q886o97o630
$$ -432 4782 -4276 -1670 5455 -2961 -4972 3351 -795 -2233 4453 -459 -4230 4656 3959 -2671
1500b671L710L83m323M845P83p504L541N571m552p28K773k204J327L832n948k823
$$ -2671 1039 1422 -2901 1944 2727 -4777 -1236 4335 -217 -945 1828 -376 951 4783 -1165 -3988
1516c988N224Q51l242J95m14j147M206Q69m126N52K566j496J23N20k342j14J838
$$ -3988 1236 2087 -1155 -960 -1374 -2521 1685 2554 -1572 -1020 1546 50 173 693 -1649 -1763 75
1533G5o06j526J871N51j320J474J111k204k6K244q79j211m98r51O56K731l6l936
$$ 75 -531 -2057 -186 365 -955 519 1630 -574 -600 1644 765 -446 -944 -1895 -1239 1492 1456 -2480
1551b480N13L964M37r34p55j938J113L909l542l464L019J503j679Q25r12j060
$$ -2480 -1967 1997 2434 1500 745 -1193 -80 3829 287 -3177 -158 1345 -334 491 -421 -1481
1567a481M848K07o052P98M320j684j110M45l918J631N770l910k997M122l63r33
$$ -1481 3367 3574 -2478 -1680 2640 956 -154 291 -3627 -1996 3774 -136 -3133 989 626 -307
1583c07K475j921l268M322L25m977K282J607l188K360K563m718J711L796l509
$$ -307 2168 247 -3021 1301 1626 -3351 -1069 538 -2650 -290 2273 -2445 -734 3062 -447
1598d47k30L584l758j762M441j945k424L589j105k318M615M10m524K667K389m346
$$ -447 -677 2907 -851 -2613 1828 -117 -2541 1048 -57 -2375 2240 2650 -1874 793 3182 -1164
1614a164J218J811l989J854K911m570m52M753j500j248K812k723j329M414j082
$$ -1164 54 1865 -2124 -270 2641 -1929 -2381 2372 872 -376 2436 -287 -1616 2798 1716
1629A716m304K402O84l164K718Q01l464K668K041l365Q94K483k539N1J250k854
$$ 1716 -2588 -186 498 -2666 52 853 -2611 57 2098 -1267 -373 2110 -429 -378 872 -1982
1645a982l55L344j194j725K057o39j113L274N5k837J785k0j888J605P87k873M15
$$ -1982 -2337 1007 -187 -1912 145 -494 -1607 1667 1722 -1115 670 650 -1238 367 1154 -1719 -1304
1662a304J700r75L90J743j187m45J639j125n38J259n83j723R44r9p79J693k32
$$ -1304 396 -579 -189 1554 367 -78 1561 436 -102 1157 574 -1149 -205 -304 -1083 610 378
1679C78r41O73R93p65O47J6j324k95M80p40l54R67k64k02O62M35n58R34m59o87
$$ 378 -563 110 1103 338 985 1001 -323 -618 -138 -878 -1232 -265 -529 -731 -69 366 -192 742 283 -404
1699d04K17M0m80J37k15m49M87M82K74K99L13j58o75N81l10k8k07m71j43L27L14
$$ -404 -187 -147 -627 -490 -705 -1154 -667 -185 89 388 701 543 -132 449 139 111 -96 -567 -710 -383 -69
1720f9Q0M02K02P3j6M6Q8k49j18n36on02K54J59r0L74K0J39J79O42l9r63k74o07
$$ -69 11 413 615 688 672 718 806 557 439 -97 -103 -605 -351 -192 -282 92 112 251 430 1072 1033 70 -204 -811
1744h11K22K37m9k75n40L40Q54O68L34p62n7Pj60j35N03j660J5K11M56P17L82
$$ -811 -589 -352 -401 -676 -1216 -876 -22 646 980 218 161 168 8 -127 376 -1284 -1269 -1058 -602 115 497
1765D97o07P04l17K96L33k51m71n20l91R7L24N47k04k46O39o2L28N29m01m56n01
$$ 497 -110 594 277 573 906 655 184 -336 -727 -630 -306 241 37 -209 430 368 696 1225 824 368 -133
1786a33N4%J39j66k69j30K45N86L98j14k57k5n0j65k95J96p87j21K62O8m3J131
$$ -133 -79 -79 60 -106 -375 -505 -260 326 724 610 353 328 278 113 -182 14 -773 -894 -632 -564 -607 524
1808E24l65k58N32K43m00k25J71q48k1J36m57M92O72k41j15J266m59K5J69l64
$$ 524 159 -99 433 676 276 51 222 -626 -647 -511 -968 -476 196 -45 -160 1106 647 672 841 477
1828D77p36J00j44l80N89L07p29O08O43j75K92Q13j619j71P54p19j97P41r37q88
$$ 477 -259 -159 -303 -683 -94 213 -516 92 735 560 852 1665 46 -125 629 -90 -287 454 -483 -1371
1848a371J516J14P3O15o38p45P04M97j298L87L18j944N93J184r96K79J641j340
$$ -1371 145 259 332 947 309 -436 268 765 -533 -146 172 -1772 -1179 5 -991 -712 929 -411
1866d11j11J531n35p32N02j67j556J274M1r01Q67O70j317J085J511j370J50N94
$$ -411 -522 1009 474 -258 244 77 -1479 -205 -164 -1065 -198 472 -845 240 1751 381 531 1125
1884A125j186n39J335j073m55J372p33o94J774K01j121J101l3j379Q10O78j844
$$ 1125 -61 -600 735 -338 -793 579 -154 -848 926 1127 6 1107 1074 -305 505 1183 -661
1901f61n5R11j198O50P15k94n86J266o0r65R18M8j646O03mj424J334N67r57J54
$$ -661 -716 195 -1003 -353 362 68 -518 748 688 -277 641 689 -957 -354 -358 -1782 -448 119 -838 -684
1921f84J163p49N09R26m20j033M20k47r55O38L05q70K75Q93m72P19Q81q10p85
$$ -684 479 -270 239 1165 745 -288 132 -115 -1070 -432 -127 -997 -722 171 -301 418 1299 489 -296
1940b96J053l93r97O83J82j377R20M00r33J028J478j640p1J615j805r9J744j757
$$ -296 757 364 -633 50 232 -1145 -225 175 -758 270 1748 108 37 1652 -153 -252 1492 -265
1958b65j535K355p67j489K533j51k420J966J825k656J041N17k510P19J891k589
$$ -265 -1800 555 -212 -1701 832 681 -1739 227 2052 -604 437 954 -1556 -837 1054 -1535
1974a535j20L010k008p96K768j324j404L432q71l665L142Q14l593K220P11l801
$$ -1535 -1655 1355 -653 -1449 1319 -5 -1409 2023 1152 -2513 629 1443 -2150 70 781 -3020
1990c020K586K973l783P23L233l358j44L639k936k321M255j433l309M099n55l263
$$ -3020 -434 2539 -1244 -521 2712 -646 -790 2849 -87 -2408 1847 414 -2895 1204 649 -2614
2006b614M457P28n426L239K129l541J438J869n348J452M911m270j749M499k523
$$ -2614 1843 2571 -2855 384 2513 -1028 410 2279 -3069 -1617 3294 -976 -2725 1774 -749
2021g49j153N109k964l399N840q82m762L319O63m384M108J454o357K908N122m414
$$ -749 -1902 3207 243 -3156 2684 1802 -2960 359 1022 -3362 746 2200 -4157 -1249 3873 -541
2037e41o11L590l932L10N350m734l403N675j498k958M871j017m126M566J508n469
$$ -541 -1152 2438 -1494 -1184 4166 -568 -3971 1704 206 -2752 2119 1102 -3024 1542 3050 -2419
2053b419K863K263m664J503L235n044J85M824k989j389L949l092j383O221k038
$$ -2419 444 2707 -1957 -454 2781 -2263 -2078 2746 -243 -1632 2317 -775 -2158 4063 2025
2068B025n205L830N88k910K957p86m934M151M174n490k86L667k274J216J769m644
$$ 2025 -3180 650 1238 -1672 1285 499 -4435 -284 3890 -1600 -1886 1781 -493 723 2492 -2152
2084b152p84N716k044m047K648J38n72L407j394m342L468L137l792j15J531k429
$$ -2152 -2936 2780 736 -3311 -663 -525 -1097 2310 916 -3426 42 3179 -613 -728 803 -1626
2100a626J681J966l708p84M213o39j633J550q13j224K943J32l506M78J906j776
$$ -1626 55 2021 -1687 -2471 1742 1103 -530 1020 207 -1017 1926 2058 -1448 -970 936 -840
2116h40J166P12k837M78L181r12j075Q37r13k44K232j514k730J722K130j568q24
$$ -840 326 1038 -1799 -1321 1860 948 -127 710 -203 -447 1785 271 -2459 -737 1393 -175 -999
2133i99O72r95K220K048l660j507K825R48j480j22j637r78L676J156l967N42K123
$$ -999 -327 -1322 898 2946 -714 -2221 604 1552 72 -50 -1687 -2665 1011 2167 -1800 -1258 865
2150H65q99R05P82l207K83L438j642k678J877q3k17K142j046l045L178K102k731
$$ 865 -34 871 1653 -1554 -1271 2167 525 -2153 -276 -359 -576 1566 520 -2525 653 2755 24
2167B4l67J027k215K087K535m662j459M304n79j500K253k517p86M681n94m621
$$ 24 -343 684 -1531 556 3091 -1571 -3030 1274 695 -805 1448 -1069 -1855 2826 2232 -2389
2183b389K045J525k177J332K31m151K906L865l933j025L044j752L03K638l518
$$ -2389 -344 1181 -996 336 567 -3584 -678 3187 -746 -1771 1273 -479 -176 2462 -1056
2198a056j725M129n60l006K231K23k123L309O95m367K018K655l043N10J449l440
$$ -1056 -2781 1348 788 -2218 13 236 -1887 1422 2117 -2250 -232 2423 -620 -110 1339 -2101
2214b101R19L338k896j313K950j169q71L689j767l057L269J215l414J413K77k615
$$ -2101 -1182 2156 -740 -2053 897 -272 -1143 2546 779 -2278 991 2206 -1208 205 482 -2133
2230b133K519J481l587P02L114j973o97J846k072k06L615j921l273K509M66j229
$$ -2133 386 1867 -1720 -1018 2096 123 -574 1272 -800 -1006 2609 688 -2585 -76 390 -839
2246h39J717p40k475K740J794l075M77J272j493L21J645k842J36K437j243j232
$$ -839 878 138 -2337 403 2197 -878 -401 871 -622 -301 1344 -1498 -1362 1075 -168 -1400
2262a400J752m2p40K133r37k356J814J027k123P19M13j937J396J870j809k09J661
$$ -1400 352 310 -430 1703 766 -1590 224 1251 -872 -153 260 -1677 -281 1589 -220 -429 1232
2279A232r19k46J557j610j053J512j52j245P05L50r83J152M75j549Q11J200j054
$$ 1232 313 67 1624 14 -1039 473 321 -924 -219 131 -852 300 775 -774 37 1237 183
2296A83m10N69j120K94J000o43j159J016K22j96R00m24q15P46M83j551J63Q53
$$ 183 -227 342 -778 -484 516 -127 -1286 -270 -48 -244 656 232 -583 163 646 -905 -742 111
2314A11n85r7P70o31n7J175k07o84N89j92l54N02k8p26j06N01n07M69Q01n13n3
$$ 111 -474 -571 199 -432 -489 686 479 -205 384 192 -162 340 312 -414 -520 -19 -526 -57 744 231 178
2335A78N95n04p4N88m57m98K81l75m11P23J43m61J89J2M81J87K79o44m02M37l12
$$ 178 773 269 195 783 326 -172 109 -266 -677 46 189 -272 -83 -71 410 597 876 232 -170 267 -45
2356d5o13M24j31n06N38L09k73O49K21n42j69M01j29l43jm91j24Q46K1j71L97
$$ -45 -658 -234 -365 -871 -333 -24 -297 352 573 31 -138 263 134 -209 -210 -701 -825 21 42 -129 268
2377B68j52J03J11nj43Qo5p14L33K29lk04K02J06J57O17m33l18K21N9p27M47n69
$$ 268 116 219 330 325 182 190 125 -589 -256 -27 -30 -234 -32 74 231 848 415 97 318 377 -350 97 -472
2400d72L17j77J92Q0J3P40m02o9J80k49j62J25k85l84K63o5Q3j07K98M89k25n0
$$ -472 -155 -332 -140 -60 -47 693 291 222 402 153 -9 116 -169 -553 -290 -355 -272 -379 -81 408 183 133
2422A33N0Qj22J18k94k09j81M33k18K56j60L25j86p0L98k29J78l09k77L42r4j
$$ 133 183 191 69 187 -107 -316 -497 -64 -282 -26 -186 139 -47 -117 281 52 230 -79 -356 -14 -108 -109
$$ [...]
8191a86
##END NTUPLES=NMR FID
##END=
