##TITLE=1H_DE-63_pH6
 D2O
 8 sc, 
 27.12.2024
##JCAMPDX= 6.0         $$ Bruker NMR JCAMP-DX V2.0
##DATA TYPE= NMR FID
##DATA CLASS= NTUPLES
##ORIGIN= UXNMR, Bruker Analytische Messtechnik GmbH
##OWNER= root
$$ XWIN-NMR		Version 3.5
$$ Fri Dec 27 14:06:43 2024 Russian Standard Time (UT+4h)  she@DPX200
##.OBSERVE FREQUENCY= 200.1315
##.OBSERVE NUCLEUS= ^1H
##.DELAY= (6, 6)
##.ACQUISITION MODE= SIMULTANEOUS
##.ACQUISITION SCHEME= undefined
##.AVERAGES= 8
##.DIGITISER RES= 18
##SPECTROMETER/DATA SYSTEM= spect
##.PULSE SEQUENCE= zg30
##.SOLVENT NAME= D2O
##.SHIFT REFERENCE= (INTERNAL, D2O, 0, 15.7039)
##AUDIT TRAIL= $$ (NUMBER, WHEN, WHO, WHERE, WHAT)
$$ ##TITLE= Audit trail, XWIN-NMR		Version 3.5
$$ ##JCAMPDX= 5.01
$$ ##ORIGIN= Bruker BioSpin GmbH
$$ ##OWNER= she
$$ F:/spectra/data/she/nmr/H-F/1/audita.txt
$$ ##AUDIT TRAIL=  $$ (NUMBER, WHEN, WHO, WHERE, WHAT)
(   1,<2024-12-27 14:05:16.78 +0400>,<she>,<DPX200>,
      <created by zg, POWCHK disabled, PULCHK disabled
       configuration hash MD5:
       00 E9 B6 7A A2 85 ED C7 34 08 36 98 17 FE 4E 26
       data hash MD5: 16K
       FD 87 6D 9F E2 F1 A1 F7 B6 59 D7 93 09 1F 45 DE>)
$$ ##END=
$$ 
$$ hash MD5
$$ 82 57 8E 0E 00 AB 4B 63 5F A4 A8 09 D6 19 22 DC
##$RELAX= 
##$RELAX= 
##$RELAX= 
##$RELAX= 
##$RELAX= 
##$RELAX= 
$$ Bruker specific parameters
$$ --------------------------
##$DU= <F:/spectra>
##$EXPNO= 1
##$NAME= <H-F>
##$PROCNO= 1
##$TYPE= <nmr>
##$USER= <she>
##$AMP= (0..31)
100 100 100 100 100 100 100 100 100 100 100 100 100 100 100 100 100 100 
100 100 100 100 100 100 100 100 100 100 100 100 100 100 
##$AQSEQ= 0
##$AQ_mod= 1
##$AUNM= <au_zg>
##$AUTOPOS= <>
##$BF1= 200.13
##$BF2= 200.13
##$BF3= 200.13
##$BF4= 200.13
##$BF5= 200.13
##$BF6= 200.13
##$BF7= 200.13
##$BF8= 200.13
##$BYTORDA= 1
##$CFDGTYP= 0
##$CFRGTYP= 5
##$CHEMSTR= <none>
##$CNST= (0..31)
1 1 145 1 1 1 1 1 1 1 1 1 1 1 1 1 1 1 1 1 1 1 1 1 1 1 1 1 1 1 1 1 
##$CPDPRG= <>
##$CPDPRG1= <>
##$CPDPRG2= <>
##$CPDPRG3= <>
##$CPDPRG4= <mlev>
##$CPDPRG5= <mlev>
##$CPDPRG6= <mlev>
##$CPDPRG7= <mlev>
##$CPDPRG8= <mlev>
##$CPDPRGB= <>
##$CPDPRGT= <>
##$D= (0..31)
0 1.2 0 0 0 0 0 0 0 0.06 0 0.03 0 0 0 0 0.0002 0 0 0 0 0 0 0 0 0 0 0 0 
0 0 0 
##$DATE= 1735293916
##$DBL= (0..7)
120 120 120 120 120 120 120 120 
##$DBP= (0..7)
150 150 150 150 150 150 150 150 
##$DBP07= 0
##$DBPNAM0= <>
##$DBPNAM1= <>
##$DBPNAM2= <>
##$DBPNAM3= <>
##$DBPNAM4= <>
##$DBPNAM5= <>
##$DBPNAM6= <>
##$DBPNAM7= <>
##$DBPOAL= (0..7)
0.5 0.5 0.5 0.5 0.5 0.5 0.5 0.5 
##$DBPOFFS= (0..7)
0 0 0 0 0 0 0 0 
##$DE= 6
##$DECBNUC= <off>
##$DECIM= 24
##$DECNUC= <off>
##$DECSTAT= 4
##$DIGMOD= 1
##$DIGTYP= 9
##$DL= (0..7)
0 120 120 120 120 120 120 120 
##$DP= (0..7)
150 150 150 150 150 150 150 150 
##$DP07= 0
##$DPNAME0= <>
##$DPNAME1= <>
##$DPNAME2= <>
##$DPNAME3= <>
##$DPNAME4= <>
##$DPNAME5= <>
##$DPNAME6= <>
##$DPNAME7= <>
##$DPOAL= (0..7)
0.5 0.5 0.5 0.5 0.5 0.5 0.5 0.5 
##$DPOFFS= (0..7)
0 0 0 0 0 0 0 0 
##$DQDMODE= 0
##$DR= 18
##$DS= 0
##$DSLIST= <SSSSSSSSSSSSSSS>
##$DSPFIRM= 0
$$ [...]
##$SUBNAM2= <"">
##$SUBNAM3= <"">
##$SUBNAM4= <"">
##$SUBNAM5= <"">
##$SUBNAM6= <"">
##$SUBNAM7= <"">
##$SUBNAM8= <"">
##$SUBNAM9= <"">
##$SW= 24.0689530833862
##$SWIBOX= (0..15)
0 0 2 0 0 0 0 0 0 0 0 0 0 0 0 0 
##$SW_h= 4816.95568400771
##$TD= 16384
##$TD0= 1
##$TE= 0
##$TE2= 300
##$TE3= 300
##$TEG= 300
##$TL= (0..7)
0 120 120 120 120 120 120 120 
##$TP= (0..7)
150 150 150 150 150 150 150 150 
##$TP07= 0
##$TPNAME0= <>
##$TPNAME1= <>
##$TPNAME2= <>
##$TPNAME3= <>
##$TPNAME4= <>
##$TPNAME5= <>
##$TPNAME6= <>
##$TPNAME7= <>
##$TPOAL= (0..7)
0.5 0.5 0.5 0.5 0.5 0.5 0.5 0.5 
##$TPOFFS= (0..7)
0 0 0 0 0 0 0 0 
##$TUNHIN= 0
##$TUNHOUT= 0
##$TUNXOUT= 0
##$USERA1= <user>
##$USERA2= <user>
##$USERA3= <user>
##$USERA4= <user>
##$USERA5= <user>
##$V9= 5
##$VALIST= <valist>
##$VCLIST= <CCCCCCCCCCCCCCC>
##$VD= 0
##$VDLIST= <DDDDDDDDDDDDDDD>
##$VPLIST= <PPPPPPPPPPPPPPP>
##$VTLIST= <TTTTTTTTTTTTTTT>
##$WBST= 1024
##$WBSW= 4
##$XGAIN= (0..3)
0 0 0 0 
##$XL= 0
##$YL= 0
##$YMAX_a= 255171
##$YMIN_a= -337111
##$ZGOPTNS= <>
##$ZL1= 120
##$ZL2= 120
##$ZL3= 120
##$ZL4= 120
##$ABSF1= 10
##$ABSF2= 0
##$ABSG= 5
##$ABSL= 3
##$ALPHA= 0
##$AQORDER= 0
##$ASSFAC= 0
##$ASSFACI= 0
##$ASSFACX= 0
##$ASSWID= 0
##$AUNMP= <proc_1d>
##$AZFE= 0.1
##$AZFW= 0.1
##$BCFW= 1
##$BC_mod= 2
##$BYTORDP= 1
##$COROFFS= 0
##$CY= 11.3945322036743
##$DATMOD= 1
##$DC= 2
##$DFILT= <>
##$DTYPP= 0
##$F1P= 15.6554695791079
##$F2P= 12.8336369535428
##$FCOR= 0.5
##$FTSIZE= 0
##$FT_mod= 4
##$GAMMA= 1
##$GB= 0.15
##$INTBC= 1
##$INTSCL= 1
##$ISEN= 128
##$LB= 0.24
##$LEV0= 0
##$LPBIN= 0
##$MAXI= 10000
##$MC2= 0
##$MEAN= 0
##$ME_mod= 0
##$MI= 1.114404
##$NCOEF= 0
##$NC_proc= 0
##$NLEV= 6
##$NOISF1= 3.799351
##$NOISF2= 2.8
##$NSP= 1
##$NTH_PI= 0
##$NZP= 0
##$OFFSET= 15.70392
##$PC= 1
##$PHC0= -26585.95
##$PHC1= 24.78744
##$PH_mod= 1
##$PKNL= yes
##$PPARMOD= 0
##$PSCAL= 0
##$PSIGN= 0
##$REVERSE= no
##$SF= 200.130013532006
##$SI= 16384
##$SIGF1= 3
##$SIGF2= 2
##$SINO= 400
##$SIOLD= 16384
##$SREGLST= <1H.CDCl3>
##$SSB= 0
##$STSI= 0
##$STSR= 0
##$SW_p= 3612.71676300578
##$SYMM= 0
##$S_DEV= 0
##$TDeff= 0
##$TDoff= 0
##$TI= <>
##$TILT= no
##$TM1= 0
##$TM2= 0
##$TOPLEV= 0
##$USERP1= <user>
##$USERP2= <user>
##$USERP3= <user>
##$USERP4= <user>
##$USERP5= <user>
##$WDW= 1
##$XDIM= 8192
##$YMAX_p= 0
##$YMIN_p= 0
$$ End of Bruker specific parameters
$$ ---------------------------------
##NTUPLES= NMR FID
##VAR_NAME=  TIME,          FID/REAL,        FID/IMAG
##SYMBOL=    X,             R,               I
##VAR_TYPE=  INDEPENDENT,   DEPENDENT,       DEPENDENT
##VAR_FORM=  AFFN,          ASDF,            ASDF
##VAR_DIM=   8192,          8192,            8192
##UNITS=     SECONDS,       ARBITRARY UNITS, ARBITRARY UNITS
##FACTOR=    0.0002076,     1,               1
##FIRST=     0,             0,               0
##LAST=      1.7004516,     0,               0
##MIN=       0,             -337111,         0
##MAX=       1.7004516,     255171,          0
$$ Real data points
##PAGE= N=1
##DATA TABLE= (X++(R..R)), XYDATA
$$ [...]
2255B428k672r86K8j109l48K501K937N19j957j875p37n50n96N27K684K227k9k202
2273G90j898n48n04l01Q13L578J895j258l023p84j03q77n80K969L167J79k500
2290A015j989q3o99j043J169L234J928j371j599j281m98q39o51K174K869J156
2306C492j717j891p58o75j186L77K803K950n84k200r61m10j201r08J253L493J324
2323C201j707j061p95o19j589p6K411K506M78j549j294m84j259p89O34K790K405
2340C203n69j572j295l18j648p08K185K881O99j265j506l48q81j673L26L026K205
2357B742k07j322q69j020j356r36J767K518J601j042j392j24j147j673l17J920
2373h57L077L25j086j147j80j754j170N51K944J830l20j191n84r00j983k59J601
$$ plain form
2255 2428 -244 -1230 -1202 -2311 -2659 -158 2779 3298 1341 -534 -1271 -1821 -2417 -1890 794 3021 2992 790
2273 790 -1108 -1656 -2160 -2461 -1648 1930 3825 2567 -456 -1240 -1343 -2220 -2800 169 3336 3515 1015
2290 1015 -974 -1057 -1756 -2799 -1630 1604 3532 2161 562 -719 -1217 -2056 -2707 -533 2336 3492
2306 3492 1775 -116 -874 -1549 -2735 -2358 445 3395 2811 611 -350 -760 -1961 -2869 -1616 1877 3201
2323 3201 1494 433 -362 -981 -2570 -2646 -235 2271 2749 1200 -94 -578 -1837 -2626 -1992 798 3203
2340 3203 2634 1062 -233 -551 -2199 -2907 -722 2159 2858 1593 87 -261 -1142 -2815 -2489 537 2742
2357 2742 2535 1213 344 -676 -2032 -2968 -1201 1317 2918 1876 484 360 -787 -2460 -2777 -857
2373 -857 2220 2545 1459 312 132 -1622 -2792 -2241 703 2533 2213 1022 438 -462 -2445 -2704 -1103
2390a103K397J168j183l97q73j049j925N62K602J955j22q47o02p73j761r09J219
2407a641K512J537p65p51l1j208k016m95K320K355M20o36p25n07j787j814J361
2424a871K057K040j57p99j35j359j792q56J709K348O54k59o51l45j572j627K69
2441b346K269J784j70k33r5p44j946j623J505K310N41L06J57l57j785k001pJ669
2459g66J832O16m6j13q95k032j386P21K143J644j91j17l61j079j901q30J534K047
2477H20P91p43J025q76j773j585m2K077J423M00K21Mj608j658j051N77K292M23
2495G17Q27k63l87j297j863k52J328J950M49M08Qq34k002j283N8K427R51N14L50
2514A806l11j193k160m21J013J413J107J22M51n80j867j571j69J479J774J82L77
$$ plain form
2390 -1103 1294 2462 1279 882 9 -1040 -2965 -2403 199 2154 2032 1185 583 -190 -1951 -2860 -1641
2407 -1641 871 2408 1643 892 861 -347 -2363 -2858 -538 1817 2237 1601 876 369 -1418 -3232 -1871
2424 -1871 186 2226 2069 1270 1135 -224 -2016 -2872 -1163 1185 1839 1580 929 584 -988 -2615 -2346
2441 -2346 -77 1707 1537 1304 1209 465 -1481 -3104 -1599 711 1252 1558 1715 1358 -427 -2428 -2435 -766
2459 -766 1066 1682 1636 1523 628 -1404 -2790 -2069 74 1718 1527 1410 1049 -30 -1931 -2761 -1227 820
2477 820 1611 868 1893 1017 -756 -2341 -2383 -306 1117 1517 1738 1742 134 -1524 -2575 -1998 294 717
2495 717 1544 1281 894 -403 -2266 -2518 -1190 760 1209 1617 1625 791 -1211 -2494 -2436 -9 942 1456 1806
2514 1806 1495 302 -1858 -2279 -1266 147 1254 1376 1827 1247 -620 -2191 -2360 -881 893 1075 1452
2531A452K33q81k208j167J067J743P06P4O25J35j741k156j38J351J053M04R56
2548A508L20o51k035j242J97J441J131O74M41pj458j640j343Q92J665P53M83P13
2566A842j02j852k077K53J222Q20O96N23Q97j202k258r61Q18J055L89J201M53
2583A717j04j312j648m27O17R96J023L71L40n00j598j278k47J378Q73L94Q08N40
2601A943j683j714q32J115Q62L57J223R31n62j994j167J51L09O80Q11J270Q9j130
2619F59j000j503K04Q64P01N47J018P4o19k292n52J087O27J28R76R58m94k105
2637g22j298N73O07J68J523J052L33j402j439o23l45O84P14J419K08l72p29j419
2655a068o72J015L58O25R34Q08n00k281p56M90O17k56J040J598K1j687j386MJ31
$$ plain form
2531 1452 1685 804 -1404 -2571 -1504 239 945 1019 1644 1779 38 -2118 -2256 -905 148 552 1508
2548 1508 1828 1177 -858 -2100 -1903 -462 669 1343 1784 1777 319 -1321 -2664 -1772 -107 646 1129 1842
2566 1842 1740 -112 -2189 -1936 -714 106 802 1325 2222 1020 -1238 -2199 -1381 -326 63 1264 1717
2583 1717 1613 301 -1347 -1774 -1157 -161 862 1233 1573 1073 -525 -1803 -2050 -672 201 595 1403 1943
2601 1943 260 -1454 -2286 -1171 -309 48 1271 2202 1640 -354 -1521 -1370 -1061 -381 430 1700 1789 659
2619 659 -341 -1844 -1640 -776 -75 472 1490 1564 945 -1347 -1899 -812 -185 -57 919 1877 1383 -722
2637 -722 -2020 -1447 -840 -672 851 1903 2236 834 -605 -1228 -1573 -889 -175 1244 1452 1080 351 -1068
2655 -1068 -1740 -725 -367 258 1192 2000 1500 -781 -1537 -1047 -430 -686 354 1952 1973 286 -1100 -1096 -965
2674i65l73J261J660O2l32j364q71m59r2R89R96P82O38n87j819j214N08M82R2
2693f06Q84J507K87j637j521j56K99j75Q28J722P19j171j164n83k44j94Q45J047
2711F87Q74k36n30j138j134k05R14P20N00J349J47k015j060Q8M18l51O91J639
2729A358P46j422j319k33l15l21P25J610N23k84p75k82j097o37N72J196J043O23
2747A711k00j196j468k84J23M26J218J367M01j175j552l79J12n60L94K292R92
2764B222j100r26n13o22l53K33J071J339k30l97l28j002p40J04Q61O37N36Q76
2782A668p38j639m62K83m37O65J395J062m89j435m21o22k79K21J384J382j43r50
2800D45N2j139o70m88J346J264K31J81j16j199q19j19J83L93Q52J114k65j156
$$ plain form
2674 -965 -1338 -77 1583 1645 1313 -51 -922 -1381 -1473 -484 512 1294 1932 1345 -474 -1688 -1180 -698 -606
2693 -606 278 1785 2072 435 -1086 -1242 -943 -1118 -290 1432 2151 980 -184 -767 -1011 -1205 -360 687
2711 687 1561 1325 795 -343 -1477 -1682 -768 -48 452 1801 1948 -67 -1127 -1039 -621 -972 -281 1358
2729 1358 2104 682 -637 -870 -1185 -1506 -781 829 1352 1068 293 11 -1086 -1723 -1151 45 1088 1711
2747 1711 1511 315 -1153 -1437 -1314 -888 330 1697 2098 923 -629 -1008 -896 -1456 -1062 1230 2222
2764 2222 1122 196 -317 -939 -1292 -1059 12 1351 1121 724 396 -606 -1346 -1242 -381 256 792 1668
2782 1668 930 -709 -1171 -888 -1325 -660 735 1797 1308 -127 -548 -1170 -1449 -1228 156 1538 1395 445
2800 445 497 -642 -1312 -1800 -454 810 1041 1222 1106 -93 -912 -1031 -848 -455 397 1511 1246 90
2818I0n15o2r75K63J288J432k25l62p21l13j449j84J100J215N90k93m5p82r09
2837h57r19Q99J090L63Q43j50r84o05r16N6M14J148Q26L4k81r96l85q55p8R88
2857c65J283J3L8k14m06j392p26Q08J367L80J33J2m01j184m08n1Q77P61P36J17
2877A378o13r81n77k64j75Q16J136N59l61n97n8j065p69P60J024N59K57j99l27
2896E03j005r00J23J122O95N50k0n35m05j086l43J41Q68J250J53k47n85n44o05
2915h70k79K84J160R18p80K37j66j001r90L99P04J022K37j64J57m17j340k13M21
2934f81P88K61Q06K50j024q27n43j34L40Q69M07N03J07r95n87r46J03J263K12
2953A72M88K01J12j065j214k6O13O00R12M0N59p15r29j036K99P05N65M95L15l99
$$ plain form
2818 90 -425 -487 -1462 -1199 89 1521 1296 934 213 -100 -1549 -1733 -633 582 1172 879 834 52 -857
2837 -857 -1776 -877 213 576 1419 1269 285 -320 -1236 -1180 -766 382 1208 1242 961 -35 -420 -1275 -1353 -365
2857 -365 918 931 969 755 349 -1043 -1769 -961 406 786 919 931 530 -654 -1062 -1113 -236 525 1261 1378
2877 1378 765 -216 -793 -1057 -1232 -416 720 1279 918 321 263 -802 -1571 -811 213 772 1029 830 503
2896 503 -502 -1402 -1279 -157 538 1088 1068 533 128 -958 -1301 -1160 -292 958 1111 864 279 -265 -870
2915 -870 -1149 -865 295 1213 433 670 504 -497 -1487 -1088 -384 638 875 711 868 451 -889 -1102 -681
2934 -681 107 368 1174 1424 400 -427 -970 -1104 -764 105 512 1015 1122 127 -460 -1406 -1303 -40 172
2953 172 660 861 973 -92 -1306 -1332 -719 -119 793 833 1392 677 -252 -1288 -989 -284 281 776 1091 692
2973F92l73r59o21R8J227O43k0R4l3o75j266l71R47J045J45M18j06j99j212o46
2993a172L06O00Q45J28M41k4j097p77m28M54N25N40N03K06l87j068q33j00Q47
3012d91P76k73R50M76p64j112r60L96Q60N01l6N85R5j011j180M2N48N77K24P38
3032I41K03n13o53j113j48Q30N80L76L98L17j041q74l82J92O80J38R62J11J3j175
3052a58q11j29K99O29M34Q55n2o32r89l15K9K26O43M09P45k1j075p76m39L83M12
3073c33L57O35M84l49q93j098L34L67N93K76O06K4n81p42m60r7N52L48P38M59
3093A220l38p17j169L99M33l03N65Q12L42p24r49o21K56K72L04L50J377l05n15
3112F89j338j86R3K1L38R31P86o11j019l71K3m1L0L58J261Q2n23j010l26J26j28
$$ plain form
2973 692 319 -640 -1261 -1163 64 707 687 781 748 73 -1193 -1564 -617 428 573 991 885 686 -526 -1172
2993 -1172 -866 -266 579 707 1148 1124 27 -750 -1178 -724 -199 341 844 1050 663 -405 -1238 -1338 -491
3012 -491 285 12 962 1438 674 -438 -1398 -1002 -142 359 323 908 1003 -8 -1188 -1146 -598 -21 203 941
3032 941 1144 631 -22 -1135 -1283 -453 127 503 901 1218 177 -697 -1079 -887 -207 -69 893 1004 1017 -158
3052 -158 -969 -1098 -799 -170 264 1119 1067 435 -554 -869 -840 -614 29 438 1183 1162 87 -689 -1128 -745 -333
3073 -333 24 659 1143 794 -99 -1197 -863 -496 97 373 979 1003 422 -320 -780 -877 -325 23 761 1220
3093 1220 882 165 -1004 -605 -172 -475 90 902 1244 520 -429 -1050 -794 -522 -218 132 1509 1204 689
3112 689 -649 -835 -742 -721 -383 548 1334 723 -296 -667 -644 -685 -655 -297 964 1046 523 -487 -813 -687 -815
3133h15M59O95Q01k78r19m26j99L52q9Q6J412Jl76r85l12o6n14Q74L94J083J47
3154A325r84n77l07R3j51N69P73M53r7j129o90O7N5j95J098M47J83k96q05o19
3174g87K96j07J92Q09Q86m60o77o80J56m27j34J056N62M24m96o59n41Q1n16P23
3194b99J91R56R3k99q17n05oq8N83P09P51k90o21m85j10n52j40R06Q92J68o83
3215C54l74k45j09l25J98P91J91M0k62l06m70n8k28P63L73Q45l03j102J41j84
3235b70m60M4L89J167K12o00n36q1n14k12L41J153M30m68l51k35k48o35J44O50
3255h0R21M9m54j25l83m41n8j34N97J157J29j204J03j48m67k62K80J415Jm84j93
3276B19m9o66n51N5J252O03l14L6m14k16o57n09J042N30L58K67q51J9l39j21n44
$$ plain form
3133 -815 -356 339 1140 862 -57 -483 -682 -330 -419 -333 1079 1080 704 -281 -593 -659 -1173 -299 95 1178 1325
3154 1325 341 -236 -543 -450 -601 -32 741 1194 1097 -32 -722 -655 -600 -795 303 750 933 637 -168 -787
3174 -787 -491 -598 -406 403 1289 829 152 -528 -372 -799 -933 123 685 1109 613 -46 -587 -506 -1022 -299
3194 -299 -108 848 941 642 -175 -680 -686 -774 -191 518 1269 979 358 -127 -237 -789 -929 -23 869 1037 354
3215 354 -20 -265 -374 -699 -501 290 481 521 259 -47 -517 -575 -803 -40 333 1178 875 -227 -86 -270
3235 -270 -730 -686 -297 870 1082 482 -54 -135 -649 -861 -520 633 1063 595 244 9 -239 -874 -730 -80
3255 -80 841 890 436 311 -72 -513 -571 -705 -108 1049 1178 -26 77 -71 -538 -800 -520 895 896 412 219
3276 219 170 -496 -1047 -992 260 863 549 585 171 -45 -702 -1211 -169 361 719 986 135 154 -185 -306 -850
3297h50O38Q80N70j129J3l60L4j063L71P78J120n39k07M1n10l95l46P51M89L41
3317F27k61p8j34m79o93O08K48J022n1m54p7l33k7j395P04J106O26k24m12q0l81
3338a38p58k38P34J012J91n93O2K01p45j050O87P25M39j13j15N9k36n50n29M29
3358e26R19N94m13n68J61l69p38l3N87J023k53k74M14n97o28m31N07Q09M20n21
3378H3O69j62n41r65K65N02J48P84k22l0m43p2p86j70J016Q39k54p09M95m5j002
3399f00p08O39J025J31l53K56K69j050n71M9Q99J11O7L56K54r30l01m21k5O37
3419b66M79J49k0L82p75o71o41R53R96j72j51L0L31r58p41K05J257k08M4K03M97
3440I23r03r79R9N24N64j07L77J85Lo70o41k91L69P04P22n62j03J67q81o06J50
$$ plain form
3297 -850 -212 668 1238 109 122 -238 -204 -1267 -896 -118 1002 463 256 297 -213 -608 -954 -203 286 627
3317 627 366 288 154 -325 -1018 -410 -162 860 809 355 278 -55 -82 -1477 -773 333 959 735 323 243 -138
3338 -138 -896 -1134 -400 612 803 210 272 473 -272 -1322 -635 90 529 416 301 360 124 -426 -955 -526
3358 -526 393 987 574 6 167 -202 -940 -973 -386 637 384 110 524 -73 -701 -1132 -625 184 604 83
3378 83 752 590 49 -916 -651 -149 -1 783 561 531 88 16 -770 -940 76 915 661 -48 447 402 -600
3399 -600 -1308 -669 356 487 134 390 659 -391 -962 -913 -14 97 164 520 774 -156 -457 -878 -903 -266
3419 -266 213 362 342 724 -51 -722 -1363 -410 586 414 263 293 624 -334 -1075 -870 387 179 223 426 923
3440 923 20 -959 -860 -336 228 121 498 683 686 16 -625 -916 -547 157 879 317 214 381 -500 -1106 -956
3461i56J413J2m46J97N50o68j184Q2P45P07m02L23N62m63o52m61l3L95M87K18
3481D26Q6K9o9o88m14J39M26L95k89O42K68p44r48o18J341J51J55L19K28n48p51
3502d64l06N29K98j38K96L00K53n27q07r5J10P86Lj01M91j07k29r41j02O74L72
3523B95m20O80L00m29r92m32O10O46l23K83O52K4q25n38r0J88L19L45P0L00l24
3544C39o23j71k72K72P61N2J18N55m90j115n29R18L58K6q7R77n93n04o67O5Q9
3565e21N47J57M49J31k14p93l74L61j02K38o6Q10k06k54k93o32Q89j58j32L87
3585B24P37k08j003q03P73L76m07J71P63R1n28o54j55K39J32n9M78N45P6o69m59
3606c40J8j00K09Q8J99O49k35p20m21J2M52J90M1L03N37r26q23N17K64n83L32
$$ plain form
3461 -956 457 469 23 220 770 102 -1082 -1000 -255 452 50 373 935 472 -180 -641 -674 -279 208 426
3481 426 512 541 472 -216 -630 -491 -65 330 41 683 951 207 -741 -1359 -18 133 288 607 835 287 -464
3502 -464 -770 -241 57 -81 215 515 768 241 -566 -661 -551 235 238 137 628 521 292 -649 -751 -77 295
3523 295 -125 555 855 426 -566 -998 -388 258 -65 218 870 894 69 -469 -559 -371 -52 293 363 663 339
3544 339 -284 -455 -727 -455 306 358 476 1031 541 -574 -1103 -185 173 199 112 1089 496 -8 -675 -610 -521
3565 -521 26 183 632 763 549 -244 -618 -257 -359 -121 -187 623 417 163 -130 -762 127 -31 -163 224
3585 224 961 753 -250 -1053 -280 96 -311 -140 623 714 186 -468 -623 -384 -252 -311 167 712 788 119 -340
3606 -340 -322 -422 -213 -125 74 723 488 -232 -653 -641 -189 1 42 345 882 -44 -867 -350 -86 -669 -337
3627c37M84P74m74o68k48N42l24J39J11M36L94n24o32k30JK53L3M49M38j11o88
3648a82j85O8K07l34K39N57N88k50r80K1J26j90l41Q31O67J97j056j62k52Q5j57
3669e03Q3O25M97P8o81m98K49k15Q8J4O96K21n6q06o4k56L2j33P38P85m29m63
3691Bm28J51j15q3K08P10K6Rn22k21k33n01M33N06N43L10m21q95K36l5N9J32L26
3714A97O13k33n63q5m4l0k63J20N45O00q52j49p4q6m42L14L96P76k31p62m4K11
3736h6j24m78J98P59M43j85p51k47L53m35J78N53J67N72o91l26N5k75k07O4Q70
3757D07M1l0r8m99l56K72k22K60P04M89m62n59j7k25K74m90N42N28J57o84j81
3778a49K25l22j97M5O01O99m42n80n3n0j66p9N37K56L39m53q4k49j67%j16O04
$$ plain form
3627 -337 147 921 447 -221 -469 73 -251 -112 -1 435 829 305 -327 -557 -556 -303 -270 179 617 506 -182
3648 -182 -367 -299 -92 -426 -187 370 958 708 -272 -251 -125 -315 -656 175 842 1039 -17 -179 -431 -346 -503
3669 -503 -420 205 702 780 99 -399 -150 -365 -277 -263 433 654 598 -208 -272 -528 -496 -629 109 894 465 2
3691 2 -426 -275 -390 -473 -265 445 471 480 -42 -263 -496 -997 -564 -58 485 795 374 -521 -285 -320 -261 -129 197
3714 197 810 577 14 -71 -115 -145 -408 -288 257 857 5 -144 -218 -304 -746 -432 -36 740 509 -253 -297 -86
3736 -86 -210 -688 -490 269 712 527 -224 -471 -118 -553 -375 178 345 917 226 -100 -45 -320 -527 -463 407
3757 407 448 418 320 -179 -535 -263 -485 -225 479 968 506 -53 -70 -295 -21 -511 31 559 716 32 -149
3778 -149 76 -246 -443 -398 203 902 460 -120 -173 -223 -389 -468 69 325 664 211 127 -122 -289 -289 -405 199
3800A99J26J61r12L11J17o33j1K46O09L66j05n44M02l77o00J82O81K14N1r5j43
3821B45j76n36j91L14O15K90j27l94J4l87k11k18N56R64l16j06n80M93j48q65
3841g64M89M23N35n44j19K21l16p2q24J054M96k39l52M01r9m12k80o5M56O46k46
3862C89j87k41O9M2p11L71R05p5l74l72K21r5m43k1N06M07j84j25L65l81j84l57
3884d75j4N68N54j42j31l03l10J78q50N69N58L67l51J45k84l70l15O3P62K15l32
3905A02J18R7k92m61n1l5J204k87k09k33K86l46q15L36K85N39q3Q2N4j60k48l95
3927e12k24J009Q8O2l36R9J01n33k11K51N08Q4n60M05J86m55n57j05N40O42k27
3948B55J08o7j71m46m73M21K13K35J33Q6J39j34l66n88M59L87R7n3L20P0p64p96
$$ plain form
3800 199 325 486 -426 -115 2 -631 -642 -396 213 579 474 -70 332 -45 -645 -463 218 432 483 388 245
3821 245 69 -467 -658 -344 271 561 434 40 54 -333 -544 -762 -206 758 442 336 -244 249 101 -764
3841 -764 -275 148 683 139 20 241 -75 -147 -971 83 579 340 -12 389 290 -122 -402 -467 -11 635 389
3862 389 202 -39 30 72 -639 -268 637 562 188 -184 37 -58 -501 -522 -16 391 207 82 447 66 -118 -475
3884 -475 -489 79 633 491 360 57 -253 -75 -925 -356 202 569 218 363 79 -291 -606 -543 219 434 102
3905 102 220 317 25 -436 -487 -522 682 395 186 -47 239 -107 -922 -586 -301 238 155 237 291 131 -117 -512
3927 -512 -736 273 361 423 87 186 287 -246 -457 -206 302 386 -174 231 417 -38 -595 -700 -160 482 255
3948 255 363 296 125 -321 -794 -373 -160 75 208 294 433 299 -67 -655 -196 191 288 235 555 625 -139 -935
3970i35L30O52N05m18J95k0l79n01J38L98J2J00j27P24o07P5m23l57P70J53N2
3991C37p3N9j16k34k59N4M14O7L4N0M05o04m91j21L49M07k86J19K72j0p74K4k4
4014d01L56L22k11M60q6k79k50k16k3p4L26J69K15J64l95o26j64Q96Q9j56J53
4035B69j53L43p20p1P6L79o6J93L29k74j04o27p3K47n7N08r5K67m28q2l30J19
4057c50K74K47K10k33J90l30l23m29N89L45q7OM50j35p34lJ64L30q2j83N53J37
4079F06n62l15J80l53L93P5L68k55J87K9n26m19M18J38k65M02N16Q2j068j67L08
4100b28Rl9L40J79J92k53m43j67J05L67j23L63J55k89l27j52J66qJ11L41k10J51
4122B40K73o17N7j80M07k33J27K00K36n70l86L56k12k10P00M16K8k53n47l76M56
$$ plain form
3970 -935 -605 47 552 134 329 309 -70 -571 -433 -35 -23 77 -50 674 67 142 -281 -638 132 285 337
3991 337 264 323 207 -27 -286 -232 182 249 283 333 738 134 -357 -478 -129 278 -8 111 383 373 -401 -377 -401
4014 -401 -45 277 66 526 440 161 -89 -305 -328 -402 -76 93 308 472 77 -549 -713 183 272 116 269
4035 269 116 459 -261 -332 -256 123 57 250 579 305 201 -426 -499 -252 -309 199 104 371 -57 -139 -469 -350
4057 -350 -76 171 381 148 338 8 -315 -744 -155 190 103 109 559 424 -310 -313 -149 181 99 -84 469 606
4079 606 44 -271 -91 -444 -51 24 392 137 324 353 -173 -592 -174 -36 -301 101 617 699 -369 -536 -228
4100 -228 -219 -258 82 261 453 200 -243 -410 -305 62 -61 302 457 168 -159 -311 -145 -153 -42 299 89 240
4122 240 513 -104 -47 -227 180 -53 74 274 510 -60 -446 -90 -302 -512 188 604 632 379 -168 -544 -88
4143h8m33K38K86N79K7m04k78l70m1Q0K68M2N13k26p2n84j05L76r1J77J14O13
4165F21m85p47L17Q7P5k4L97M0M08l23o17n4j83M0L03M45m7J6j16j88j14j37%
4188b86NJ49Q31l08j020N33l94M49l03K95R2M69o46j49M59k38l00L21K23M11l25
4209B68k53m89N90k14k08L89L20k56k16j51K10j04q1L1K15O07k8o17k81R1j61
4230c38n3J67P70r3j59n98P8K86l66R6K84M84j40k86k86JJ58r2N5M6O15n70m05
4253c46K66m5j77K38P4K92K8l88k92J02j49j24K03M21L66Ok77j69J5o80K40L61
4275c5J81J41N7l53j96m0J07j45L21K52j61r7m49M24j36j02m2N92j30K28m41j52
4297a76L33l04k4J94L21O6j13j73%m14k75N16m1L22O1j67j85J40j61m60J77P05
$$ plain form
4143 -88 -521 -283 3 582 609 205 -73 -443 -484 -404 -136 -94 419 193 121 -463 -568 -192 -283 -106 8 621
4165 621 136 -611 -294 -207 -132 -156 241 281 689 366 -251 -305 -488 -448 -145 300 253 269 153 -35 -149 -286 -286
4188 -286 -281 -132 699 391 -629 -96 -490 -41 -344 -49 43 512 -134 -283 176 -62 -362 -41 182 593 268
4209 268 15 -474 116 -98 -306 83 403 147 -69 -220 -10 -114 -195 -164 51 658 630 13 -268 -177 -338
4230 -338 -391 -224 546 453 294 -304 -226 60 -306 -210 74 558 418 132 -154 -153 5 -87 -32 14 629 59 -346
4253 -346 -80 -125 -302 -64 10 302 330 -58 -350 -248 -397 -521 -318 103 469 475 198 29 44 -636 -396 -35
4275 -35 146 287 344 -9 -205 -245 -138 -283 38 290 129 32 -417 7 -129 -231 -273 319 189 417 -24 -176
4297 -176 157 -147 -171 23 344 410 297 124 124 -290 -565 -49 -90 232 293 126 -59 81 -80 -540 -363 342
4319C42k84M01r8k88k31k00l11R03L42k27k82k65J64j29l7P0K31L68l62J1l90
4340b72L20m54p5K59N56J11m89M20m07N0r6m41O60L26j52j00j99Lk99m8QO86j99
4363A68k3l32O52m35j97o9K82L53q9q3k33p7n2j74J11K80J23j5R5j24K8l16l69
4386d96L36J62K66j24k17J46j80j01k81M07L54j06K1k8n9l98J63K79J52o2J66
4407D00j98j53J01l04m29O71L94k27k30J59l3m23j05M1M66j84J93j77M6P1o62
4428e83J79K40L81k09j25J90J55n16j57L63L8K89q9pK21n21J9J18r2L76l73J46
4450D3J51m8m9m29N0q9N64L0k70J48N4o21K44k52J14M65L18J8k70k31n45M92l81
4473d94O19J93l85J02K29k82j08j57M72r9qK89l58J47m78k76N30R3J84j10J11
$$ plain form
4319 342 58 459 361 73 -158 -358 -669 234 576 349 67 -198 -34 -163 -200 -130 101 469 107 118 -272
4340 -272 48 -406 -481 -222 334 445 -44 376 -31 19 -77 -518 142 468 316 216 17 20 -279 -327 -319 367 168
4363 168 145 -187 465 30 -167 -236 46 399 310 227 -6 -83 -135 -309 -198 82 205 190 285 161 189 -127 -496
4386 -496 -160 2 268 144 -73 73 -107 -208 -489 -82 272 166 187 159 100 -298 -135 144 296 234 400
4407 400 202 49 150 -154 -583 88 482 255 25 184 151 -272 -377 -336 130 -54 139 -38 8 79 -583
4428 -583 -404 -164 217 8 -117 73 228 -288 -445 -82 -44 245 156 149 370 -151 -132 -14 -106 270 -103 43
4450 43 194 146 97 -332 -282 -371 193 223 -47 101 155 -466 -222 -474 -360 105 423 441 171 -60 -605 -113 -494
4473 -494 125 318 -67 35 264 -18 -126 -283 189 90 82 371 13 160 -318 -594 -64 29 213 103 214
4494B14M0m35R2j93K20k3M49k52k30J74rl17m2N11j59K17k32K86m75k59K85k41
4516c79O27j59K14J02l28k46j0N6j54N59Jj15j13jj29K11k62k98Q47l33K27l34
4538a7j29r7J29p3L48j8jK57l42k48N4j46K63k02L10L50l29K76o26p2P8q4M37
4561A18K27P9l09L3l92o6K19L79j47r8l9j76J34l02N28j08k60P01l48J41l92j63
4583b41j08L10Q4J26J10l9J22n96J46m65L46K69L2j37J81k84K19o6J77m68N11
4604B29o5j49M37n99q4J45J49l26L78j01N52o30k76K5M26k39j23O53j09j19m0
4625A34n85L15N1o0j81J58J19K43k87k5o4q4L31M8J34j05j31l27K51L44n54J24
4647a51O18n11K60k66M9k3j13K35J1k14L52j05r5m18k2O9M17J76l6M9j39j19l24
$$ plain form
4494 214 254 -181 -89 -282 -62 -85 364 112 -118 56 47 -270 -312 199 40 257 25 311 -164 -423 -138 -379
4516 -379 248 89 303 405 77 -169 -179 -123 -277 282 283 168 55 54 -75 136 -126 -424 423 90 317 -17
4538 -17 -146 -243 -114 -187 161 143 142 399 57 -191 -137 -283 -20 -222 88 438 109 385 -241 -313 -235 -319 118
4561 118 345 424 115 148 -244 -310 -91 288 141 43 4 -172 -38 -340 188 80 -180 521 173 314 -78 -241
4583 -241 -349 -39 45 171 281 242 364 -232 -86 -551 -205 64 96 -41 140 -144 75 9 186 -282 229
4604 229 164 15 452 -147 -231 -86 63 -263 115 14 566 -64 -340 -315 111 -128 -251 402 293 174 134
4625 134 -451 -136 -85 -145 -326 -168 -49 194 -93 -118 -182 -266 65 113 247 142 11 -316 -65 279 -275 -151
4647 -151 467 -44 216 -50 -1 -24 -137 98 109 -105 247 142 47 -371 -393 -324 93 269 233 282 143 24 -300
4670c00K07M38k93L48k49L1j55k81J81M1j47J91m9K64k9o5j65N3L0k18M38K04
4692D75m87%j73nj05O66m87J95J46q6N7k89P1j40M22k29n9n5L15j72j91j12J54
4715h9K82l4O0p0l8l46L75k57k7K34K30J11m07j14n4N6k97L11K77p3j61N2j99
4738a78M06l15M7J18K62J98p71N91l24n05J54J11K92k78L80J39m69J55n35M82
4758d0L7O3Q8R5j42m4n14k4K83J30L71o9k44N4k0k73J16j17L11L13j40j92j51
4781a09k3L05k47K20l23M55l47J22j53R7P1k80L80P1K11j47n9k40l68k7J36O65
4803D10q1l76K4Q4p4k39nM89Q0m99K91k3l43J96J06j62J98j9K06k98Po5j64N1
4827b06j35O04M6l33r6J91n58L31j03L10K26J43j53j86j1j13J12j94K32Q0R8l
$$ plain form
4670 -300 -93 345 52 400 151 182 27 -254 -73 -32 -179 12 -37 227 198 133 -32 21 51 -167 271 475
4692 475 -12 -12 -185 -190 -295 371 -116 79 225 139 196 -93 -22 -162 260 31 -28 -83 232 60 -131 -243 -89
4715 -89 193 159 219 149 111 -235 140 -117 -144 90 320 431 24 -90 -144 -88 -385 -74 203 130 -31 21 -178
4738 -178 228 -87 -40 78 340 538 -233 358 34 -471 -317 -206 86 -192 188 327 -142 13 -522 -40
4758 -40 -3 60 148 243 101 57 -457 -481 -198 -68 303 234 -10 44 24 -249 -133 -250 61 374 234 42 -109
4781 -109 -132 173 -74 146 -177 278 -69 53 -100 -3 68 -212 168 239 450 303 244 4 -364 -391 -255 410
4803 410 329 -47 -23 61 -13 -252 -257 232 312 -187 104 81 -262 -66 40 -122 76 57 263 -35 -28 -93 -257 -206
4827 -206 -341 263 309 -24 -120 71 -487 -156 -259 51 277 420 267 81 70 -43 69 -125 107 187 285 282
4849B82p3j54j99j77M72j0j17J28j17k1j9l29N01j55P9j41J52Nk55j33m54R93
4871B58k13K9O9M1j61k57j05J50J17J89J2Q3j85j41M8l12L75K3P5Q5j83J9m1j42
4895a67j5K68M7J4p8j95K78m30j5M92l29N1K43l9r8k02J31j46L08K05l13Q3J06
4918A99p3j25j07j20M33o5J32m75R1J24r9l6j10M25k20l6K59J44k36k03K67j68
4940Ak00J61L78Mk93k49j34J64J37O7O9K2n8j12l77K60J39n6K74j21J74l41K94
4963B03k06j59M25k35K03p2j59O4J2j40J64j52K89j86L92l30m22J86p5L85j50
4984C7M3R0j71J14j4n5j61J88J08j89J48M63n82n1j9k48K76K7L86m31K89k47j54
5007a53J6r7M24J54j63P7k28j70m67K99L75j48J14K75j42j2l06M7K57j31L05J0
$$ plain form
4849 282 209 55 -144 -321 151 141 24 152 35 14 -5 -334 167 12 91 -50 102 107 -148 -281 -735 258
4871 258 45 74 143 184 23 -234 -339 -189 -72 117 129 212 27 -114 -66 -378 -3 20 95 180 -3 16 -25 -167
4895 -167 -182 86 133 147 69 -126 152 -278 -293 199 -130 -79 164 125 27 -175 -44 -190 118 323 10 93 199
4918 199 126 1 -106 -226 207 142 274 -201 -110 14 -85 -121 -231 194 -26 -62 197 341 105 -98 169 1
4940 1 -199 -38 340 344 51 -198 -332 -168 -31 36 105 127 69 -43 -420 -160 -21 -77 197 76 250 -91 203
4963 203 -3 -162 263 28 231 159 0 64 76 -64 100 -52 237 51 443 113 -309 -123 -198 187 37
4984 37 80 170 -1 113 99 44 -117 71 179 -10 138 601 19 -32 -51 -299 -23 4 390 -41 248 1 -153
5007 -153 -137 -234 190 344 181 258 30 -140 -607 -308 67 -81 33 308 166 154 -152 -105 152 21 326 336
5029C36p6k17j82L9j3k06K09L81k33j71L18j14k86j10J60J84K80J08l45J44l93
5050a87M5J09j58J70j09J99j19m59M53j08j18K40J39p5J95l95K75j26j29J79k06
5071a85L85j03l61L67m6j45K09p4N3J46R2k59l62J26J47o8K74P9l8n85K77q2J59
5094Fn2k34J77j6K93o9k59%M4J23j28P6K40k62o4R2q5j12J77J35L61k4m0n86L7
5119a70K29q3l8J56L45k39j46k75O0J00o0K14l33L68M32o01l65J23K70L11l55
5140e7J71L8P2j75k23J77p7k6K41k16n0m6m6K08J48k28O8L28J08l40m57M68j20
5163c4n3K42o4P3M0K2k12k2k82j96Q41m40M44j53J26p22K61P4l3J57J38j31ol3
5187C7k35O6R1J81M2m0K24l80o3j03J45J87k63N37k83j84m5q9K40k91j8L20r5
$$ plain form
5029 336 260 43 -139 -100 -113 -319 -110 271 38 -133 185 71 -215 -325 -165 19 299 407 62 206 -187
5050 -187 -142 -33 -191 -21 -130 69 -50 -509 -56 -164 -282 -42 97 22 217 -178 97 -29 -158 21 -185
5071 -185 200 97 -264 103 57 -88 121 47 100 246 338 79 -283 -157 -10 -78 196 275 237 -348 -71 -153 6
5094 6 -46 -280 -103 -119 174 105 -154 -154 -110 13 -115 -39 201 -61 -125 -33 -118 -230 -53 82 443 419 379 -207 -170
5119 -170 59 -24 -62 94 439 200 54 -221 -161 -61 -121 93 -240 128 560 -41 -406 -283 -13 298 -57
5140 -57 114 152 224 49 -174 3 -74 -100 141 -75 -125 -171 -217 -9 139 -89 -21 307 415 75 -382 86 -34
5163 -34 -87 155 91 164 204 226 14 -8 -290 -486 355 -85 359 206 332 -390 -129 -55 -88 69 207 76 70 37
5187 37 -198 -132 -41 140 182 142 366 -14 -77 -180 -35 152 -111 426 143 -41 -86 -175 65 -226 -244 76 -19
5210a9J18O5l3Ll74J78j14L40P0J81l03m20J92O0k81J99L72j81L48m34j07J46
5232FJ4r0J16k03L34o0n03L02k90J69k5L72j80m8r4L42Q1m12KK84j7L5j99r0J40
5257a4j49K07o8R2k09K24J1l55J17N1j82K50J84l28J5k0J37m71M68j80P43l83
5279A40rl97N02j27m99K59k06M70j46J31K4j47j82n8L05n4J58j23J61j10j8K73
5301C47k23k54J26J74j57q0L3J46m55o9O98k87K65m2k54O3n2l43M30J85n7m5p0
5324G9j09k72L86P9j76m06L41k07M64r5L5n8q2M47J20p12J46P8J86j97j23j65
5346b41M36j49m5N35m92k79n8K55K07j83J2m2k33L94j55L2O2l61O58l34J02q9
5368C2R0o01L94J57j50J81k19K71j06J3m04L53J62o4j68MM9P5k56J18l2J70k25
$$ plain form
5210 -19 99 164 131 134 -240 -62 -176 164 234 415 112 -308 -116 -56 -337 -138 234 53 401 -33 -140 6
5232 6 20 -70 46 -157 177 117 -386 -84 -374 -205 -230 142 -38 -86 -180 162 243 -169 -167 117 100 135 -64 -154 -14
5257 -14 -163 44 -24 68 -141 83 94 -261 -144 -93 -275 -25 159 -169 -154 -174 -37 -508 -40 -220 523 140
5279 140 131 -266 236 109 -390 -131 -337 133 -13 118 142 -5 -187 -245 60 6 164 41 202 92 74 347
5301 347 124 -130 -4 170 13 -67 -34 112 -343 -412 286 -1 264 222 -32 31 -21 -364 66 251 194 149 79
5324 79 -30 -302 84 163 -13 -419 -78 -285 179 84 119 61 -21 426 546 -166 -20 58 244 47 -76 -241
5346 -241 195 46 1 536 44 -235 -293 -38 169 -14 -2 -44 -277 117 -38 -6 56 -305 353 19 121 32
5368 32 122 -479 -85 72 -78 103 -116 155 49 62 -342 11 173 109 -59 -55 -6 69 -187 -69 -101 69 -156
5391a56K14j25N2j7k31O8j51M33j5j64r9RJ68k83K04P0O7k22K16j64K06l11P0
5414a61l1K54N7m3N7j3R1k42q0K19M57n49K37l25M31m24l63J57J58j3P7J30j85
5437a04K52k34pK00J32k58K39l37J6l00P0L4M56k37K10k61j37L25p9j78J46M18
5459C66k28l40L71P0k70k5j49K13J63p2K36k48J8M6R4k25j47J89Q7K41k16j78
5481dK89k10j44l8O5J19p4J2j30k83R2J95J75j94P10l54k1o26L14R1L3j45K83
5504A55l6n4mm52N93q3j54k71L81k3M3k86Rq8J52L62j63k07L32L5k36%K15p8k51
5529a09M97m24qN51q32M65j07J97k27j2j8j12M4l1J90l0m1K74k62l8j80K04K00
5552A91m39K04j94J80M51Q1n57j55J75M3m8M6O2j27J23j06k39K52k0J8K46M00
$$ plain form
5391 -156 58 -67 -15 -32 -263 -195 -346 87 72 -92 -191 -182 -14 -297 -93 -23 44 -178 38 -126 80 -231 -161
5414 -161 -192 62 119 76 133 120 211 -31 -111 108 565 16 253 -72 359 -65 -428 -271 -113 -126 -49 81 -104
5437 -104 148 -86 -93 107 239 -19 220 -117 -101 -401 -331 -297 159 -78 132 -129 -266 59 -20 -198 -52 366
5459 366 138 -202 169 239 -31 -56 -205 8 171 99 335 87 105 151 245 20 -127 62 149 390 174 -4
5481 -4 285 75 -69 -107 -42 77 3 15 -115 -398 -306 -111 64 -130 580 226 205 -421 -107 -16 17 -128 155
5504 155 119 65 61 -391 202 119 -35 -306 75 52 95 -191 -182 -270 -118 244 81 -126 206 241 5 5 220 142 -109
5529 -109 388 -36 -44 507 -325 140 33 230 3 -9 -27 -139 -95 -126 64 34 -7 267 5 -33 -213 -9 191
5552 191 -248 -44 -238 -58 393 474 -83 -238 -63 -20 -68 -22 40 -87 36 -70 -309 -57 -77 -59 187 587
5574E87n83l80N61k68M24l40K9j52N14j09l45j45Q0J41Lp2L03p8l9k18l54M50
5596IL71n96O08l38K19m08J19L5J23l95M72j16r4lm0k18K21k06L61J52k60K21
5618B37m90K73J62j03j0J21j36M32l79j83n5J72N2k75K2K57l1j12j32L23J1l19
5640a63K32j2Rj7k76J19K64k1n10K69Q9L41j26k16r8k63N09l85L5L63j72J03j81
5663a07j80m9K77K4K05k07J48k17J28p1qR7J39K96l19p0R4l47L70j03l55L99k91
5686a47K23o9j1L38m09J18j47o3K52J00K33m63M3J62k50K02N3J7l38O5m4K4J88
5709G7K08l26K03j48m06K96j99K07J13P0J15k37J44j42j59J35l31K68M4J14Jk63
5731b16N9L67l74M1k88M61k9J39j48k07kJ87k71N65m00L83j60k91L02k16R4l5
$$ plain form
5574 587 4 -376 185 -83 341 1 30 -122 392 283 -62 -207 -127 14 17 -55 248 170 131 -87 -441 9
5596 9 380 -216 392 54 273 -135 -16 19 142 -253 219 103 9 6 -34 -252 -31 -237 124 276 16 237
5618 237 -253 20 182 79 69 190 54 486 107 -76 -131 41 93 -182 -160 97 66 -46 -178 145 156 -163
5640 -163 69 57 66 49 -227 -108 156 135 -375 -106 -17 324 198 -18 -116 -379 130 -255 -220 143 -29 74 -107
5663 -107 -287 -336 -59 -35 170 -37 111 -106 22 -49 -57 40 179 475 156 86 180 -167 203 100 -255 144 -147
5686 -147 76 7 -4 334 -75 43 -104 -167 85 185 418 -45 -2 160 -90 112 165 182 -156 -91 -135 -111 77
5709 77 285 -41 162 14 -392 -96 -295 -88 25 95 210 -27 117 -25 -184 -49 -380 -112 -68 46 47 -216
5731 -216 -157 210 -164 -123 -411 50 21 160 12 -195 -197 -10 -281 284 -116 267 107 -184 118 -98 -4 -39
5753c9l3K09J94l99o2l8K9j80N99k71P1K6j52K06n3l7o2L04j26j54j65n4Q9K23
5777A25k37N74m57J18J18l19q2R9L2k60J83K02j40J67k75N78k86j50j78J41J88
5798A41K75k68j38O8l48L38j9jL07l31k47N62r5l57j6L33j38j03J99m44Q4J23
5820g5Q5n2L57o0j28k09m3J78k89J95PK17K06n05J56j38q9J90J02j19k4j29K36
5843F9q1j28J21K65m06M34j06j99RK17Jk95j40J79J76j28K54l55M8N7n13L82k
5866a41N90l91J46k90R1k54n9L36Q7L70l54L8j12k70J41Q0L97k78r2n6R6Q6k03
5889d2j02J70K60j16l22q9L49j69L5J12L1l17K72k38K68qj06k33Q7M73o2j58j62
5912f7J50j56mJJ18O3K3o1J07j99j7L6P9Q1L5k9l17J38k54L31j80K49j40J14n
$$ plain form
5753 -39 -72 137 331 -68 -130 -168 -139 -319 280 9 80 106 -46 160 107 70 8 312 186 32 -133 -187 -98 125
5777 125 -112 462 5 123 241 -78 -160 -61 -29 -289 -106 96 -44 123 -152 426 140 -10 -188 -47 141
5798 141 416 148 10 78 -270 68 49 48 355 24 -223 339 244 -113 -129 204 66 -37 162 -282 -198 -75
5820 -75 10 -42 315 255 127 -82 -125 53 -236 -41 -34 183 389 -116 40 -98 -187 3 105 -14 -38 -167 69
5843 69 -12 -140 -19 246 -160 274 168 -31 -22 195 196 -99 -239 -60 116 -12 242 -113 -65 -8 -521 -139 -141
5866 -141 449 58 204 -86 5 -249 -308 28 115 485 131 169 57 -213 -72 8 405 127 35 -21 75 161 -42
5889 -42 -144 26 286 170 -152 -241 108 -61 -26 86 117 -200 72 -166 102 94 -12 -245 -158 315 253 95 -67
5912 -67 83 -73 -77 -76 42 105 128 67 174 -25 -42 -6 73 154 189 160 -157 -19 -273 58 -122 127 -13 101 96
5937I6k0jr9J02n12J63J79J92K53l28l6m4J36Mj26j47J40J30%l39L20q0N9K69
5961C11k4l68k0J28O6oK15o25K47J69j66K38P3m11M8M1J38j84j75O94l81k73L28
5984F3M4j60J75n3P5q9J39k68L6r8L28p9l26K89Q3l34OK58Q2nQ8k71J62m66J97
6009a24o7n2J93L89l75J04j42J88m60K12R3J04j69o1K96m15M18J4N0k60K29k81
6031a16j91P87m60k67M85k36J13K0j21Q7K91l68K66m16J0J55j09J2J27j15p3K25
6053A06l41j18M35K6l2m3k52k6J1J78j76M25j65J48m4l49K5L04j3l79L11q8Q9
6076C2n2k92J75J59r3J33l6R6k37K84j18l76J5L47m8K7Q8P7l21Pj78M82j86m78
6100d93O00j46K48l47r6J55K16q4L1Q4j30j70K20m2k84K67K87j25j72k98M43j91
$$ plain form
5937 96 76 75 -24 78 -434 -271 -92 100 353 25 -11 -55 81 85 -41 -188 -48 82 82 -257 63 -17 42 311
5961 311 287 -81 -101 27 93 87 302 -323 -76 93 -73 165 238 -173 -125 -84 54 -130 -305 389 8 -265 63
5984 63 107 -53 122 69 144 55 194 -74 -38 -136 192 113 -213 76 159 -175 -169 89 171 166 254 -17 145 -321 -124
6009 -124 -191 -243 -50 339 -36 68 -74 114 -346 -134 -41 63 -106 -167 129 -286 132 146 196 -64 165 -116
6031 -116 -307 480 20 -247 238 2 115 135 14 101 392 24 290 -126 -116 39 -70 -58 69 -46 -119 106
6053 106 -235 -353 82 108 76 33 -219 -245 -234 -56 -232 193 28 176 132 -217 -192 112 99 -280 31 -57 32
6076 32 -20 -312 -137 22 -71 62 26 122 -115 169 51 -325 -310 37 -11 16 104 181 -140 -133 -311 171 -15 -493
6100 -493 107 -39 209 -138 -234 -79 137 53 84 168 38 -132 88 46 -238 29 316 191 19 -279 164 -27
6122b7Q1r5J22m39K64p3K55j25j4J23n4j60K85m7m33M24l98L09j83J99J1n3J92
6145A64m9Q3j00j42k28L28J40l75M61l71l08R1L1K76N7L8K38n5k98J62l75j3J0
6168b35M0K70J09k5l01M6MJ1j02K63l2J01p2j45J30l38J94J93j38mM65o31J61
6191c6J24rj32K23m2j68J80k40J67L0J25l59K53L43k68j30O5k33K36K4k63M23
6213C13j50K3j38q4p8L76l34J24J19k1j43j71N4O0q1o7J43M89n36P6nk75K38j38
6237b06K57J19l17L07j56kM92l15k20J5j11L58k4j06k64L60k87p5K98j8p2l47
6259c14M14r9k4n7J74M22n51K8J28M7l33M16k32M7K11l84J66k17K20r2j24J03
6281e1J40r6l0P0j65j0J23j45L79k41J33K36k48r5m5N72o31L6J54m5m88L82R8
$$ plain form
6122 -27 54 -41 81 -358 -94 -167 88 -37 -51 72 18 -142 143 96 -337 87 -311 -2 -185 14 25 -28 164
6145 164 115 198 98 -44 -272 56 196 -179 282 -89 -397 -306 -275 1 58 96 334 279 -19 143 -232 -245 -235
6168 -235 -195 75 184 159 -142 -96 -92 -81 -183 80 48 149 77 -68 62 -276 -82 111 -27 -31 434 -197 -36
6191 -36 88 79 -53 170 128 -40 140 -100 67 97 222 -137 116 459 191 61 126 -107 129 153 -110 313
6213 313 163 186 48 -36 -114 262 -72 52 171 150 7 -164 -110 -50 -131 -198 -55 434 -102 -26 -31 -306 -68 -206
6237 -206 51 170 -147 160 4 2 494 179 -41 -26 -137 221 197 91 -173 187 -100 -175 123 105 33 -314
6259 -314 100 1 -23 -80 94 516 -35 -7 121 168 -165 251 19 66 277 -107 59 -158 62 -30 -154 -51
6281 -51 89 -7 -37 33 -132 -142 -19 -164 215 -26 107 343 95 0 -45 527 -104 -68 86 41 -447 -65 33
6304C3m5l41M75j2Q7k54J90qOk49K40p6j27J56k12j54M89l4k48j91N57r8j67O7
6328H4j15k1j28M53j44p6K6Q8r2Q7k09l24J43J99k45K27N0l24L3K52R0q0L26l51
6352e1O3nj54M3J02Q4K00m54K89R2j51k56k5K39K35J01j10l35k29N53n97L01N6
6375iQ0j93J54L5J5j82p0K09o0J7L0lj04J63k52Q6JM69k26l78L35j22l0L9j28
6400a24J93l15N74j31j35j01K71m66L02J03M7k55l5L25k31l45J58J67J72n5m4
6421G5j7q3O0j43K22l44K02N9Q4k93L80j80J18k15K31N7jk90J71K68m55M5P2L3
6445E6P0j4n7o4J56k58j69K86J32k36KJ24j11j6J26K57k37l7J26J65o15L23Q0
6468H9p6J35j53j12k2L31j68J5l82K97p0Q6J26O4J48j22n2K13m47K63j96K41k70
$$ plain form
6304 33 -12 -353 122 110 197 -57 133 125 131 -118 122 46 -81 75 -137 -291 198 164 -84 -275 282 184 17 84
6328 84 -31 -52 -180 273 129 53 79 167 75 162 -47 -371 -228 -29 -274 -47 3 -321 -288 -36 54 -26 300 -51
6352 -51 12 7 -147 -104 -2 82 282 -172 117 209 58 -198 -223 16 251 352 242 -93 -322 231 -366 -65 -9
6375 -9 71 -122 32 67 82 -100 -170 39 -21 -4 26 23 -81 82 -170 -84 -83 386 160 -218 117 -5 -35 4 -124
6400 -124 69 -246 328 197 62 -39 232 -234 68 171 218 -37 -72 253 22 -323 -165 2 174 119 75
6421 75 58 -25 35 -108 114 -230 -28 31 115 -178 202 22 140 -75 156 213 212 -78 93 361 -94 -49 23 56
6445 56 126 112 55 -9 147 -111 -280 6 138 -98 -96 28 -83 -99 27 284 47 10 136 301 -314 9 89
6468 89 13 148 -5 -117 -139 192 24 39 -343 -46 -116 -30 96 160 308 186 134 347 -100 163 -33 208 -62
6491f2JO7Q0j65J56j1j50Q9j30R7k19J43k3jN0n2N01k63k6j93K22k88M68M0j82
6516A49J37k93n3O7j92q8L81k71L86n20K50K73k11j71L3Q7J06p9J32q9j90J72
6538A6j84L02q3J09P8m4k61K1j36J80k42J94M24l67K96r4m13J99k21M5M62r6N1
6561B36j93K1J29J3l66J62J83o7k46j06K75n0K87k62j97J28j13J07j14J09j2M0
6583c6j91K62k08m4%J50k10M07M9k52o2L85l37n8M8n7K93Pm66O88j69r2r3K9J46
6608A89m64N01q0k5O7l68M9j78J19Q8L43q2J05l36K45j72P7j95K9R1j48J72J80
6631B07j0m19m4J77L8k15L77R7l59K47J00k47j23L87Oj5j10r0j3K92j93oj52N15
6655D47l74j16j1O3q1K07k58K25Kk33M54m34L62q2k89nQ2p3J51n6K40n33J84M8
$$ plain form
6491 -62 -61 6 86 -79 77 66 -84 5 -125 -28 -247 -104 -127 -128 -78 -130 371 108 82 -111 111 -177 291 331 149
6516 149 286 -7 -60 7 -185 -273 108 -163 223 -297 -47 226 15 -156 -123 -36 70 -9 123 34 -156 16
6538 16 -168 134 51 160 238 194 -67 -46 -182 -2 -244 -50 374 7 303 209 -204 -5 -226 -181 281 185 236
6561 236 43 64 193 206 -160 2 185 118 -128 -234 41 -9 278 16 -181 -53 -166 -59 -173 -64 -76 -36
6583 -36 -227 35 -173 -217 -217 -67 -277 130 179 -73 -135 250 -87 -145 -97 -154 139 146 -320 368 199 107 14 43 189
6608 189 -275 226 146 121 188 -180 -131 -309 -190 -102 241 159 264 -72 173 1 78 -117 -88 3 -145 27 207
6631 207 197 -222 -266 -89 -51 -266 111 208 -151 96 196 -51 -174 213 219 204 94 4 -9 283 90 84 -68 447
6655 447 73 -43 -54 9 -72 135 -123 102 104 -129 325 -109 253 171 -118 -123 -41 -114 37 -19 221 -312 -128 -80
6679h0rK83l30K40M2k72Q3j11J90M6k28L64j04k01J57J28l84M8K22q5k12J21M1
6702e1L84l45K34J9j07o6j39j89L23r6j31L82Q9k38L63m13j54l9O9L03j83j53
6724a38N7p2J71k60j91P26j90O2j49J47r5J53k92K14k30O6J30m3j32j00P2j18
6746b12J38J08m2L6J31r1Ll3j39k41L07l5n0J34l0K39l51pR9M09m54J10K65k29
6770F5k45L69k58r2K89L38m53o5R1j62J85k22N2J62J48j1n01K69K51j32J7K4j58
6793c9K36k73k63M41M7l61M54l28R9j54M8L03k27n4j65L76l99L56K9J9o9k02K1
6816a05J01j46L79k03j10j64K82J18k46k2K38p2j34J69k64K94o4j4j55K87R9k84
6838a6l21L56o0p1m9K71j64j75L49k13n2l42L82J03K14k72r1N3Oq7Kj41M44p3
$$ plain form
6679 -80 -89 194 -136 104 146 -126 -43 -154 36 82 -146 218 114 -87 70 198 -186 -138 84 -1 -213 -92 -51
6702 -51 333 -12 222 241 134 68 -71 -260 63 -33 -164 218 307 69 432 19 -135 -174 -105 198 15 -138
6724 -138 -81 -153 18 -242 -433 293 103 165 16 163 68 221 -71 143 -87 -21 109 66 -66 -166 -94 -212
6746 -212 -74 34 -8 28 159 68 71 38 -101 -342 -35 -70 -120 14 -16 223 -128 -135 -36 373 -81 29 294 65
6770 65 -180 189 -69 -161 128 466 13 -52 39 -123 62 -160 -108 54 202 191 -310 -41 210 78 95 119 -39
6793 -39 197 -76 -339 102 149 -212 242 -86 13 -141 -93 210 -17 -71 -236 140 -259 97 126 145 76 -126 -105
6816 -105 -4 -150 229 26 -84 -248 34 152 -94 -116 122 50 -84 85 -179 115 51 37 -118 169 268 -16
6838 -16 -337 19 -41 -112 -161 110 -54 -229 120 -93 -145 -487 -105 -2 212 -60 -151 -98 -92 -179 -177 -318 126 53
6862E3q1P2L5j79j9J41O2P8j85J49O4l1k42j03J45K29j19k01J07K39l9j82J04
6885I7j99j99J19L05N6Kl42Q5O5M39l61K70l68j57k80M13n4L17p4j39K49n6j01
6908H7l9k22n5J8K54pj99N9P4n9j96P13n28o8J97j31J79o0j34m4k61M24J18o4
6932E6j61Q6j71k7R3J30K93j47m8m57K83P4j32J14n0o9K22J48k22l1j29PO30m59
6956C3r3J97k40L4J15Mr5J0K92n6qk5l85rL09j13l7l7O25k20m08J91k22R4k05
6981b49K95K1L8j82N2m8q9J14M45J64o11k62L28K53k87j25L13j13r2K06l11P3
7003f7K05l32M7J55Rj50L03j60L1j13K37j21k23K16J38j38Q5j92j8K85J59j78
7025A78q8j53K76k17j25Q8K07K68l81j13K02j2k86K90k32J03k04M39k15J68k74
$$ plain form
6862 53 -28 44 79 -100 -119 22 84 162 -23 126 190 159 -83 -186 -41 188 69 -132 -25 214 175 -7 97
6885 97 -102 -301 -182 123 179 181 -161 -76 -11 428 67 337 -31 -188 -468 -55 -109 208 134 -5 244 188 87
6908 87 48 -174 -229 -211 43 36 -163 -104 -30 -89 -285 428 -100 -168 29 -102 77 17 -117 -161 -422 2 120 56
6932 56 -105 -19 -190 -217 -124 6 299 152 104 -353 -70 4 -128 -14 -64 -133 89 237 15 -16 -145 -138 492 33
6956 33 -60 137 -103 -69 46 50 -45 -35 257 201 193 168 -217 -226 83 -30 -67 -104 521 301 -107 84 -138 -44 -249
6981 -249 46 67 105 -77 -25 -73 -162 -48 397 561 -50 -312 16 269 -18 -143 170 57 -35 171 -140 -67
7003 -67 138 -194 -147 8 17 -133 170 10 41 -72 165 44 -179 37 175 37 122 -70 -88 197 356 178
7025 178 90 -63 213 -4 -129 -41 166 434 53 -60 142 130 -156 134 -98 5 -199 240 25 193 -81
7046h1R2l7l80M86m6j99M24l01J9M0j18o9K51o1P9r0K66k37k2K8n5j87L81j17
7070F6k00K66l99M02j49o4R2k39M95l70L47k21k47j06L85M14k79N0k46l3M86m59
7092im67K98J56K32k74J33J83m46k00O2L73J04j39j35J63k29J89k99L65l06R3
7113a53n3J50M4J30K13m02J45K69m16k4J64J62j34p0k61L35j27N6K54l43J19L3
7135I1N7l28R1r5K38P1k51J20k3j49J04j63M13k39J47k45K75n56K84J43P9n2J74
7158A86j22p9J02j87L21l28L90m56K61m92K7L47l8q4L34j75k0k42J67k16L31j8
7180Ik70L48r6K49l14J43Q9j74j7K1O1j30J27K32k65J16P9k4pk27Q7r3Kk48K40
7205f2JR0QK26k73K2O6n0j73J8K90J80l48q0K4j6M0J03j2LK20p9k13k01r6M51
$$ plain form
7046 -81 11 -26 -406 80 34 -165 259 -42 -23 17 -101 -170 81 20 99 9 275 38 16 44 -11 -198 183 66
7070 66 -134 132 -267 135 -14 -78 14 -225 270 -100 247 26 -221 -327 58 472 193 243 -3 -36 450 -9
7092 -9 -476 -178 -22 210 -64 69 252 -194 -394 -332 41 145 6 -129 34 -195 -6 -305 60 -246 -153
7113 -153 -206 -56 -12 118 331 -71 74 343 -73 -97 67 229 95 25 -236 99 -28 28 282 -61 58 91
7135 91 148 -180 -89 -184 54 125 -126 -6 -29 -178 -74 -237 176 -63 84 -161 114 -442 -158 -15 64 12 186
7158 186 64 -15 87 -100 221 -107 283 -173 88 -404 -377 -30 -68 -152 182 7 -13 -255 -88 -304 27 9
7180 9 -261 87 -9 240 -74 69 158 -16 -33 -12 49 -81 46 278 13 129 208 184 177 -50 37 -56 -54 -302 -62
7205 -62 -61 29 37 263 -10 12 78 28 -145 -127 163 343 -5 -85 -61 -77 -37 66 54 57 277 198 -15 -216 -312 139
7231A39l6k58L57n7J0m63L71O9k09k19L42q8P1j39M2O4j91J69O0J1L6j01k0K50
7255B10j83J13K8l91J00JL9j81P3O5J76j56N64l82l90K31O17l36o6R5m16K76j14
7278b7j73K69p9K42m06M0J63j8p1M92n04K10j94N4l4K32m46L69l51M85k85m7K31
7301A52k72K40k31K94r0k13L11k09l65M87J12l82L36k90j20L79p6J68k93N01j93
7322B46k01N7n52K93J74N5J0mK29o1l29k43P1N13l71K36j1m3j21K21o9k43K13
7345G0j43L0K81P1j43j01k09M20l7j88k49J67k02K04n2m6J54Q2j41k6J45r1j29
7368a33M69l21o8j1k69L36PL5k66K13J22j52J67j48RN6m4k3J82j53k54K11j42
7391a77M16p6k42K77l73K25j45K8l5R1j99J31k3L33l70Q1L0j03J89m4k74J30M1
$$ plain form
7231 139 103 -155 202 145 155 -308 63 132 -77 -296 46 -42 29 -110 -68 -4 -195 -26 34 45 81 -20 -40 210
7255 210 27 140 168 -223 -123 -122 -83 -264 -191 -126 50 -106 458 76 -314 -83 534 198 132 227 -189 87 -27
7278 -27 -200 69 -10 232 -174 -134 29 11 -60 432 -72 138 -56 -2 -36 196 -250 119 -232 253 -32 -79 152
7301 152 -120 120 -111 183 93 -120 191 -18 -383 104 216 -166 170 -120 -240 139 63 231 -62 439 246
7322 246 45 102 -450 -157 17 72 82 78 307 246 -83 -326 -255 258 -113 123 112 69 -52 169 100 -143 70
7345 70 -73 -43 238 309 166 65 -144 276 239 51 -198 -31 -233 -29 -81 -127 27 109 -32 -58 87 -4 -133
7368 -133 336 15 -53 -64 -333 3 10 45 -221 -8 114 -38 129 -19 -10 46 2 -21 161 8 -246 -35 -177
7391 -177 239 163 -79 198 -175 50 -95 -67 -102 -11 -210 -79 -102 231 -139 -58 -28 -131 58 14 -260 -130 -89
7414h9k32J22K66m8L02p26oM76rJ38J9k86j32K35j49o1J84j76L32l28nM62k51
7437C8k53L27J01j40N3R8k27L08m99J54l5J61L2j91m3N0J35J03j47j20N21o73
7459b47K55p8o1J10P4K1r5J89N1l9l45j7m5K14J10j86L06j75n4J36l13K48j30
7482g1N1j15M14j31j88n6J89m08J48K99j15J57j07p8K1J45k91m4K35r5J87N4l8
7505A63k43K09j11m2Q8O4j90J88M2l53K85J03k16l85J38P73n86p3O3L43J13n06
7527a33K89l97O4M16m91L7K59J84l04K91j20M0k74J05m02K78L5J88J10k48j16
7548a89K44j85R1j2l3L18K4P8k58j71J03r8R5l01K23J03l4k09Q8K01J34n8j23
7571C1NJ34J4j50j57j03J46J79K69l46j68P9L60n57O33l01J99o0m79L34J3l73
$$ plain form
7414 -89 -321 -199 67 19 321 -405 -411 65 56 194 213 -73 -205 30 -119 -180 4 -172 160 -168 -173 289 38
7437 38 -215 112 213 73 126 224 -3 305 -194 -40 -75 86 118 -73 -116 -66 69 172 25 -95 426 -247
7459 -247 8 -70 -131 -21 53 74 -21 168 219 180 -165 -182 -227 -13 97 -89 217 42 -12 124 -189 59 -71
7482 -71 -20 -135 279 148 -40 -96 93 -315 -167 132 17 174 67 -11 10 155 -136 -180 55 -40 147 201 163
7505 163 -80 129 18 -24 64 128 -62 126 168 -185 100 203 -13 -398 -260 513 -73 -146 -83 260 373 -133
7527 -133 156 -241 -177 239 -252 -215 44 228 -76 215 95 135 -139 -34 -436 -158 -123 65 175 -73 -189
7548 -189 55 -130 -39 -51 -84 234 258 336 78 -93 10 -88 7 -294 -71 32 -2 -211 -123 78 212 154 31
7571 31 36 170 184 34 -123 -226 -80 99 368 22 -146 -67 293 -264 369 68 267 207 -272 62 75 -298
7593b98M96m12M61J8Mj80m7L30n52K39k08j8L83j3k71J44K6j73J19n0j49j27M00
7616A22j11P7l72N08k44J6JK35m44M38k35J45j25MJ85p6o3O4m53M47n8k01K63
7639A23k96N0L86j35o02M11k22O13j13J13l50l2k38L77P4O1j56J50n40K79J70
7660A23K36m24j07K4J21R0K23j08j26k09p0Q6K43K43l05k38O1m8N0p0J25k5K08
7683A03q6p4j41K84m76N08j83n2O6M22n66L86k34J61r8j18OQ6j74J23N6j20nO3
7707f3J09j20lj80M71l80k56O05r7k79K93J49m61K43m72J28M42M9k50L70O3m49
7729h8r2J13J39J55k27j54L32j69k08L47L4j91k14J02J5L23j05j56J95k72q2N52
7751C49j98o1q7O7L3j80P5j74j58L94Lk65K14J54ro4j7k05M55m08j61N22k97M7
$$ plain form
7593 -298 198 -214 247 265 269 89 42 372 -180 59 -149 -167 216 203 -68 76 102 -71 48 -2 -151 -278 122
7616 122 11 88 -284 224 -20 -4 -3 232 -212 226 -9 136 11 15 200 124 61 125 -328 119 61 -140 123
7639 123 -173 -123 263 128 -474 -63 -285 328 215 328 -22 -54 -292 85 159 220 64 214 -326 -47 123
7660 123 359 -65 -172 -148 -27 63 286 178 52 -157 -227 -141 102 345 40 -198 -137 -185 -135 -205 -80 -105 103
7683 103 17 -57 -198 86 -390 118 -65 -117 -51 371 -195 191 -43 118 20 -98 -92 -6 -180 -57 -1 -121 -126 -63
7707 -63 46 -74 -77 -257 214 -166 -422 183 86 -193 100 249 -212 31 -441 -313 129 178 -72 298 361 -88
7729 -88 -180 -67 72 227 0 -154 178 9 -199 148 182 -9 -223 -121 -106 217 112 -44 151 -121 -203 349
7751 349 151 90 3 70 103 -77 -2 -176 -334 60 63 -202 12 166 157 93 76 -129 326 -82 -243 279 -18 29
7775B9k10o7N07m21L2N3J90K0k24L1P5q4J02N0m9l56O38r8l63K46k21K84j78P3
7799E9j03q3J70j66J37J32k24L02P5n52j85M40P0L31l51k08L8K96k95r0K40J71
7821B04n22L52K02k13Q5l07K49l85M28k0m02L03L2k68L52J24l78K14o0j6J28j57
7843e5M89k16o2R4j08Kk43J00k02L67j57K18k87J05l5M53n13J48l44J5J47j02
7865a86L41k78K33j99J32j26k45K03K86R4m18J93J06k35K8J16Q0k59k1K63k9l77
7887b98K06K84j98J39l2K07k38p4p5Q1L6n1n2P6L91m56K44j62Q9J65j86j47Q1
7910C0J32j53N9j47J89j67K02J99l55J81l34J70r9J17J15k32J75j17M19n85l1
7931b32N89n18J96l5J9n3J09j03q9J74J44k42j61L48m0p2K29m90k83M52J90j14
$$ plain form
7775 29 -181 -248 259 -162 -130 -77 113 133 -91 -60 15 -69 33 83 34 -322 316 218 -145 101 -120 164 -14 59
7799 59 -44 -127 43 -123 14 146 -78 224 299 -253 -438 2 72 403 52 -156 -118 178 -117 -207 33 204
7821 204 -318 34 236 23 108 -199 50 -335 93 73 -329 -26 6 -262 90 214 -164 50 -10 -26 102 -55
7843 -55 434 218 156 250 142 144 -99 1 -201 166 9 227 -60 45 10 463 -50 98 -246 -231 -84 -186
7865 -186 155 -123 110 -89 43 -83 -328 -125 161 255 -163 30 136 -99 -71 45 125 -134 -155 108 79 -298
7887 -298 -92 192 -6 133 101 308 70 -4 -79 2 38 -13 -65 11 402 -54 190 28 117 282 96 -51 30
7910 30 162 9 68 -79 110 -57 145 344 -11 170 -164 6 -93 24 139 -93 82 -35 384 -201 -232
7931 -232 357 -161 35 0 19 -34 75 -28 -117 57 201 -41 -202 146 106 34 263 -227 -510 -58 132 18
7953A8J5J48Q9j75J6j93M11m10j13J46j33J53o2J65N9l88J45K83l79P3J19J78
7975A65k31q3j2J82K71l98k73M11j91K92r5k46J73O8k81j1J54J75j7o6L34j95
7997A26m79L65K12j38k3k24K62k58k4j82N39m8K9J68k06j40J02j10m6K97R3l30
8019a5J58j40J62j29n9j23J97J57k7k73L65l62J43J14l19o3M64ll47K04M6j53
8041cO8N1k10m4p2K68R9k33J90l4j54j88L13P6k23kR2n4j39P1j09K08K18k61K22
8066A50k6j97N2J53j43R8P3K5Pj00j45J28j21prO7K01m06J37q3L42m59n9K96j58
8091a84M53p18N71k85K0L69l25K0lr2J06L69k14L5j31l1m69R33j58m26L4J83j67
8114a10J36L3j07R8K24m08J54j78K21L6n7K54j49k36p0J75l99J79K6K73N0JK5
$$ plain form
7953 18 33 181 270 95 111 -82 329 -81 -194 -48 -181 -28 -90 75 134 -254 -109 174 -205 -132 -13 165
7975 165 -66 -149 -161 21 292 -106 -379 32 -159 133 38 -208 -35 33 -248 -259 -105 70 53 -13 321 126
7997 126 -353 12 224 86 63 -161 101 -157 -181 -363 176 128 157 325 119 -21 81 -29 -75 222 315 -15
8019 -15 143 3 165 36 -23 -146 51 208 181 -92 273 -89 54 168 -151 -214 250 247 -100 104 150 -3
8041 -3 65 116 -94 -138 -210 58 157 -76 114 80 -74 -262 51 127 -96 -98 -6 -60 -199 -128 -237 -29 189 -72 150
8066 150 124 -73 -21 132 -11 87 160 185 192 92 -53 75 -46 -53 -62 5 206 -200 -63 -146 196 -263 -322 -26 -184
8091 -184 269 -449 122 -163 -143 226 -99 -79 -82 -174 -68 301 87 122 -9 -40 -509 424 266 -160 -126 57 -110
8114 -110 26 59 -48 50 274 -134 20 -158 63 99 42 296 147 -89 -159 16 -383 -204 -178 95 145 146 171
8137A71j42k58L7J18k5P9l03M36m02N27k75J73l66L6J76k84L67k07L20KPl08N0
8160g1J2K21nk4l10J61J85l25o8N08l60R4j38q1L76n1pr8j96J37J92k01k6Ok5
8185i4L30k3m30K82k08m8
$$ plain form
8137 171 29 -229 -192 -74 -99 -20 -323 113 -289 238 -37 136 -230 -194 -18 -302 65 -142 178 180 187 -121 -71
8160 -71 -59 162 157 133 -177 -16 169 -156 -224 284 -76 18 -120 -201 175 124 117 19 -177 -40 152 -49 -75 -69 -94
8185 -94 236 213 -217 65 -143 -191
8191a91
$$ Imaginary data points
##PAGE= N=2
##DATA TABLE= (X++(I..I)), XYDATA
0@%%%%qQqJ6j6K4l2M0n6O4p2Q9j08J31j55J82k16K52k94L42l92M49n13N85o64
29c52P49q48R55j070J198j338J494j662J846k054K279k523K796l098L428l794
45a994M207m671N194n794O488p299Q266r436J0892j2761J5257j8796K4234l3755
59a9968N5294j90929J4714L41366o8446r2729L9561N1033k17239j89901R4814
70a82430K66002P0029r2057m2371O3594l2737j49649q7292J25290J74700K0162
81A33241j01701o52Q1415n9870k13717o0622J89890J53294o4739n0212J12716
92A19043L4177k17140j90605R7770J97185K0808n3865O6903P3101j20266j97574
103a70463k2305J49596J13910L277p279L1816j8772j27101j26253L0312J56132
$$ plain form
0 0 0 0 0 0 -8 0 -8 8 -8 16 -16 24 -32 32 -40 49 -59 72 -83 99 -117 135 -159 183 -209 240 -273 312 -352
29 -352 397 -451 504 -566 632 -706 788 -874 972 -1082 1197 -1326 1470 -1628 1800 -1994
45 -1994 2213 -2458 2736 -3058 3430 -3869 4397 -5039 5853 -6908 8349 -10447 13787 -19968
59 -19968 35326 -155603 -140889 200477 132031 39302 78863 129896 -87343 -277244 -182430
70 -182430 83572 153601 61544 19173 82767 50030 -99619 -186911 -61621 113079 133241
81 133241 31540 30888 112303 52433 -161284 -221906 -32016 121278 56539 6327 119043
92 119043 153220 -63920 -254525 -156755 40430 61238 7373 74276 147377 27111 -170463
103 -170463 -192768 -43172 70738 74015 66736 98552 79780 -47321 -173574 -143262 12870
114A2870R2485l4944k0476N6913k0593j66652j05206J03466J37147j4827m4188
125d005Q1736O4762j24217j70547Q743J23300M3767j7497N1238P1316n5262j54545
137h1211q4440N3726R9855N6669K2756L0545J0662p8002j37076n4659R0587J11672
149D1084J5105j1595M9175J5420j19683j29825L0495J17537L2064k5528M3018
160E7267N8412o5846j40943m3982P3203O4635J3957K8075N0759p081r4828j01534
172a07906j7165O5640O8122K5751K0105L7472j2145j05079r7618K5757R4526L3210
184C0670j1041M1922M8699o4310j29106l1431P8403N3218n679K7061O2958j0819
196I0545j08350q7511J1272N7195L3182K2720M5750L4768m0308j04843p0171K8638
$$ plain form
114 12870 105355 70411 49935 106848 86255 -80397 -185603 -82137 55010 40183 -4005
125 -4005 77731 142493 18276 -152271 -143528 -20228 23539 6042 57280 128596 73334 -81211
137 -81211 -165651 -111925 -12070 44599 67355 97900 108562 30560 -106516 -161175 -70588 41084
149 41084 56189 44594 93769 109189 -10494 -140319 -109824 7713 39777 14249 57267
160 57267 115679 49833 -91110 -135092 -61889 2746 16703 44778 95537 88456 -6372 -107906
172 -107906 -125071 -59431 8691 34442 54547 92019 79874 -25205 -122823 -97066 -2540 30670
184 30670 19629 61551 110250 45940 -83166 -114597 -36194 17024 11345 38406 101364 90545
196 90545 -17805 -105316 -94044 -36849 -3667 19053 64803 99571 59263 -45580 -115751 -87113
208h7113O8817K9181J1358M7071L0321p3646j16577j9015P7781M7705n682L0810
220D1011O1753k2053j15766p1480L8822N8998J0899J5610N9005K8049o5462r9767
232f0381l2953L7975L8168J2848K9951N3966O797p9753r0496l556N5378K6903
244e153K068M4706N6079l4051j09818n5068M3963M6997K413K4947P0006J8133
256A05222q5103r3032o356M3603J8272R274N0462N5060k1376q9464o1276J4249
268f0465L5643Q472J4703N5996L7838n1335r3542l0164L9543K6235j167L6429
280A8186O9022J987q9004p5807Q955L5369L442J4453O6123N0510m1789q8411l7967
293f4931K1219J6244N42L4130O3788J6635o3599p3777j0849K7215Q998O561M9553
$$ plain form
208 -87113 -18296 10885 22243 69314 99635 25989 -90588 -109603 -31822 15883 10201 41011
220 41011 102764 80711 -35055 -106535 -67713 -8715 2184 17794 76799 104848 39386 -60381
232 -60381 -93334 -55359 -17191 -4343 25608 79574 86371 6618 -83878 -87434 -32056 -5153
244 -5153 -3085 41621 97700 63649 -46169 -101237 -57274 -10277 -7864 17083 87089 105222
256 105222 20119 -72913 -79269 -35666 -17394 -8120 42342 97402 76026 -13438 -74714 -60465
268 -60465 -24822 -16350 -1647 54349 92187 40852 -52690 -82854 -43311 -17076 -18243 18186
280 18186 87208 89195 191 -75616 -66661 -31292 -27850 -13397 52726 103236 61447 -26964 -64931
293 -64931 -43712 -27468 -26926 7204 70992 87627 24028 -49749 -60598 -33383 -24385 -17824 31729
306C1729N6510j8204q2761n3393J2456K0581j287K5852O9204L4206n2179p7037
318c4323k1939J7872K312K789M8572O2462j010o7904n4186k1J3703j086J8137
331a4622N9967M1762l3887p3129l3826J1415O817j18L9352O6491J6511n8713o3034
344c5014j1077R879o580R975N8398N5088j6265o5939l8971M441K095o621K9147
357a1444O4236K7943m4401o0904j7927Q212n925L319N0448O1154P2n9211m7119
370c1547n069q5j1220K0448O4651M4215k8169n9604k5641K233q370n455M0246
383c367O3234J3503m9099m8428q951j52j2141J1981N7652N0856j5146n5871l2672
396b8601k460r483j0257L1482O5552K9215l6090m8554j4818l131j6856O21M9260
$$ plain form
306 31729 88239 70035 -12726 -66119 -53663 -33082 -34369 -8517 60687 94893 42714 -34323
318 -34323 -56262 -38390 -36078 -33289 15283 77745 76735 8831 -45355 -45376 -31673 -32759 -14622
331 -14622 45345 87107 53220 -19909 -53735 -42320 -35503 -35621 3731 70222 86733 28020 -35014
344 -35014 -46091 -36212 -42792 -32817 25581 80669 64404 -1535 -40506 -36065 -33970 -40591 -11444
357 -11444 52792 80735 36334 -24570 -42497 -34285 -40210 -36891 13557 74711 74783 15572 -31547
370 -31547 -36616 -36701 -47921 -27473 37178 81393 53224 -6380 -32021 -29788 -38158 -43613 -3367
383 -3367 59867 73370 24271 -24157 -33108 -33260 -45401 -33420 24232 75088 59942 4071 -28601
396 -28601 -31061 -40544 -50801 -19319 46233 75448 39358 -9196 -24014 -27145 -44001 -43380 5880
409E880N7005R21m7771l4062n262r360j6463K0937O1731L9063k3894m8324k1665
422b1264o150j7802o149M2245O1758J4859l8436l8412j0400j0756k0179J0321
434d0365N5661M7345j0480m2523k3249o056j7194j3532L1242N9438K4925k8198
446C7014l6853j3815j2793k1703K614M8226N1752M068l4186k8255j2112j9107
458c5150j7189J9690N4644L6687j4502l4893j8552j1515k2103o812L7677N3951
470D1933J4935k8498k8132j1569j8026k1626J1632N1330M1229m701k9019j9946
482d58j4708k4335j1852K8192N0858K6129j5101k6875j6553j6815k2978j381M0318
495e559M8713Q643k7167k3430j0928k1476k1394J7919N3051L4332j2527k6359
$$ plain form
409 5880 62885 63806 16035 -18027 -23289 -32649 -49112 -28175 33556 72619 48725 401 -21264
422 -21264 -27414 -45216 -51365 -9120 52638 67497 29061 -9351 -19751 -30507 -50686 -40365
434 -40365 15296 62641 52161 9638 -13611 -19667 -36861 -50393 -19151 40287 65212 37014
446 37014 161 -13654 -26447 -48150 -45536 2690 54442 58510 24324 -3931 -16043 -35150
458 -35150 -52339 -32649 21995 58682 44180 9287 -9265 -20780 -42883 -49695 -12018 41933
470 41933 56868 28370 238 -11331 -29357 -50983 -39351 11979 53208 48507 19488 -458
482 -458 -15166 -39501 -51353 -23161 27697 53826 38725 11850 -4703 -21518 -44496 -45877 -5559
495 -5559 43154 51797 24630 1200 -9728 -31204 -52598 -34679 18372 52704 40177 13818
507A3818j3440j7167k7997n801L6322M7260J4493j6185j9357j4757k2211k1077
519d6099O953M1076L9371M230k2228j8464j2572k3182j8481K0622N0666K8299
531E0191j4727k2551j0190j8557l2076k695M3324M4358N247j7558j1928j4991
543b153k9761j9972J8797M2364K8506j306j5275j4619j7875k3433j0066K4348
555b0445M4163K0790j3616j7862p820j9959l0985n86M4239M1065p46j6594m720
568A6924j4183l7652k1540K7719M5489J8252n579o423j1531k9022k7477J876L2276
581a0871L4459J3118q933j3783j3928k1842k2455P217M0729L3280l343j4707k667
594A6274j3032l6704j9286L0848M3222R741p555K504o756l6614l3014J0316L6283
$$ plain form
507 13818 378 -16789 -44786 -50587 -14265 32995 47488 31303 11946 -2811 -25022 -46099
519 -46099 -39146 1930 41301 45531 23303 4839 -7733 -30915 -49396 -28774 21892 50191
531 50191 35464 12913 2723 -15834 -47910 -50605 -7281 37077 42324 24766 12838 -2153
543 -2153 -31914 -51886 -33089 9275 37781 36475 21200 6581 -11294 -34727 -44793 -20445
555 -20445 23718 44508 30892 13030 5210 -14749 -45734 -46320 -2081 38984 38238 21644 16924
568 16924 2741 -34911 -56451 -28732 16757 35009 29430 23007 11476 -17546 -45023 -43147 -10871
581 -10871 23588 36706 27773 13990 62 -21780 -44235 -37018 3711 36991 33648 18941 16274
594 16274 3242 -33462 -52748 -21900 21322 31063 23508 26012 19256 -17358 -50372 -40056 -3773
607c773K4795P209J707p830k5367l0616j1805J6721L4631K6130J915j2126j1194
620A0397j8034k8572r807L1033L8857O638j0810J444m413l3426l0030J4457L6550
633D284J4729n18Q665J648k8894l5430n969K0882K2993J7705J2576j446j9084
646A2141k7448k3305l636K5036L4908J4722n629o730j1768l0784k5447J6537M0011
659H608J6506n511L832R68k8492l4570J896K8883J7209M636J1749N715j9669l0677
673a8917j4310M500J5185K1266J8235M440q396j6764k6036k0980Q304L2988K3205
686B2720J320Q47j544k7652l6516j344L2849K2784L719Q253O574k1986l6445j1279
700c7700J6940J7276J1451J5756Q936j2220k4087j8998q378O880K1308K1472P184
$$ plain form
607 -3773 21022 28231 29938 22108 -3259 -33875 -45680 -28959 5672 31802 33717 21591 10397
620 10397 -7637 -36209 -46016 -14983 23874 30512 19702 21146 16733 -16693 -46723 -32266 4284
633 4284 19013 18495 27160 28808 -86 -35516 -41485 -20603 2390 20095 32671 31225 12141
646 12141 -15307 -38612 -42248 -17212 17696 32418 26789 20059 8291 -22493 -47940 -31403 8608
659 8608 25114 19603 23435 24403 -4089 -38659 -36763 -7880 9329 13965 25714 31429 11760 -18917
673 -18917 -33227 -28727 -13542 7724 25959 30399 22003 5239 -20797 -41777 -33473 -485 22720
686 22720 24040 24887 23343 -4309 -40825 -42169 -9320 13464 17183 25436 32010 10024 -26421 -37700
700 -37700 -20760 -3484 7967 23723 32659 20439 -3648 -22646 -31024 -24144 -2836 18636 25820
713B5820k052o560k1926k9687m958K6422K4448N351O205P744j9104l9077j4667
726d2041K0947K1435P864J2759J4125j2822l3166j9253M418J0924J2875J8353
738A6418J2528m165j5399j9297j6418l250J7090K1144Q686M795L850j5013l2598
751b1629j6287J6163K0112P132J2068J6793q239l6908k3852O589J4812R271J7536
764A3561J9896k207k7008k3564p389L173J1577J9648J6308L071q709j6524k1489
777a9656j0599J1400J7953R629Q417J0947o695k9800k2103N984J3184N777J3377
790G815K3575K430k8633k7028m069M551N436J7665K5294P692j7116k3159j6532
803b2079n722P018J8519J8264R573l1j3412k4057j6434O129J4686Q995R870J5330
$$ plain form
713 25820 23768 17208 -4718 -34405 -39363 -12941 11507 16858 23063 30807 11703 -27374 -42041
726 -42041 -21094 341 8205 20964 35089 22267 -10899 -30152 -25734 -14810 -1935 16418
738 16418 28946 24781 9382 -9915 -26333 -29583 -12493 8651 17337 22132 25982 10969 -21629
751 -21629 -37916 -21753 -1641 5491 17559 34352 26113 -10795 -34647 -28058 -13246 -3975 13561
764 13561 33457 31250 4242 -19322 -26711 -23538 -11961 7687 23995 27066 18357 1833 -19656
777 -19656 -30255 -18855 -902 8727 17144 28091 21396 -8404 -30507 -24523 -11339 -5562 7815
790 7815 31390 33820 5187 -21841 -25910 -21359 -15923 1742 27036 34728 17612 -5547 -22079
803 -22079 -27801 -20783 -2264 16000 25573 25542 12130 -11927 -28361 -22232 -7546 1449 11319 26649
817B6649j42k4641k2825q1O624J530J0820K3690J0685j6635k2532j0172l956j376
831b2362J2127K3628J5604l696j5603j9069j4716j865J1793J6953J5281J0471
843B8546n021k2614k1816l173Q004P195J2777K0228O259j8637k2744p014J008
856a7002q35Q577K3079J4801p391j7719j2615q481n607O570J8408J8216N800p178
870A8623j6944j7339p511L352J0431J6250J7203M652j6741k1749r033L49J451
883a7006J0135K2966J3791j0158j9828j0420n488n493M999K0494J8742J315j1491
896A2558j2824j2246q908L87J2854J7948J3254J87j3097j6955j0928k410L548
909a6632J2621K0107J1653q964j7827j1887n935l828N564K0372J8571o7j3654
$$ plain form
817 26649 26507 1866 -20959 -21040 -14416 -12886 -2066 21624 32309 15674 -6858 -17030 -20986 -22362
831 -22362 -10235 13393 28997 25301 9698 -9371 -24087 -25952 -14159 2794 18075 28546
843 28546 23525 911 -20905 -24078 -16074 -8879 3898 24126 30385 11748 -10996 -18010 -17002
856 -17002 -17837 -9260 13819 28620 21229 3510 -9105 -17586 -23193 -16623 1785 20001 25801 18623
870 18623 1679 -15660 -23171 -19819 -9388 6862 24065 28717 11976 -9773 -18806 -18457 -17006
883 -17006 -6871 16095 29886 19728 -100 -10520 -16008 -21501 -16502 3992 22734 24049 12558
896 12558 -266 -12512 -21420 -21033 -8179 9769 23023 23210 10113 -6842 -17770 -20180 -16632
909 -16632 -4011 16096 27749 18785 958 -10929 -16864 -20692 -15128 5244 23815 23748 10094
922A0094j2197r607q991k19J4758J9529R193l875j0980j3142j1300m814N835J5169
936e47J6791P670p414j4595j1953p597k715P619J8563J6369n05j2201j1715r272
950a1502r001L1J5538J9682P594o195j0376j0140j1772n904P651J6745J4796L094
964B0241o393j1086j1774r688j643J0141J7872J2589o23r626j1460j0546r214
977b1210J820J5938J8715O022n981r348j0726j2191n609R246J8602J2563P60o135
991A2466r533j2442j0327N38J2678J6096Q755j417p559j0413j1605p400M074J4802
1005a287J5046M696m307q044j0637j2089m656R183J7363J1069Q30m844q955j2746
1019i378j1255J348J4229J5379P101r35o554j1834j2891o298O540J6236J2921
$$ plain form
922 10094 -2103 -11710 -20701 -20920 -6162 13367 22560 18685 7705 -5437 -16737 -21551 -15716 -547
936 -547 16244 23914 16500 1905 -10048 -17645 -20360 -12741 5822 22191 21686 9485 -2230 -11502
950 -11502 -20503 -20472 -4934 14748 22342 16147 5771 -4369 -16141 -22045 -14394 2351 17147 20241
964 20241 13848 2762 -9012 -18700 -20343 -10202 7670 20259 19636 10010 -1450 -11996 -21210
977 -21210 -19390 -3452 15263 21285 15304 5956 -4770 -16961 -22570 -13324 5278 17841 18601 12466
991 12466 2933 -9509 -19836 -19298 -6620 9476 18231 16814 9255 -1158 -12763 -20163 -16089 -1287
1005 -1287 13759 18455 14148 6104 -4533 -16622 -21278 -12095 5268 16337 17167 12323 3368 -9378
1019 -9378 -20633 -19285 -5056 10323 17424 16489 9935 -1899 -14790 -21088 -14548 1688 14609
1032A4609K495l756q230j1426j1150k004J0931J5470Q800m06m380q363j2472r578
1046a9460K488J3802J3096N273l71n299j0374j3996n294P494J4636J0790L155
1059A5940k380p340j2878j1942l93J1749J4596P550P56m082r767j3510q208M724
1073a5185J4378J1133M070n20n422j1631j2971k877R538J3573P816K203j461p072
1087E572j3530r962J561J1840J0714O210J802k509r816j4232p271O375J2453R728
1101H935M630J179n169j3382j3000j773J0343J1819O761M039m9r275j5137r164
1115a9243M716J1258R736N720K972l567j2430j3807l461P661J1469Q149M148Q55
1129A4176o793j2946j0851J203R640R286N637L926R5r454j4602o914N639R590
$$ plain form
1032 14609 17104 13348 5118 -6308 -17458 -19462 -8531 6939 15739 15333 10953 2590 -9882 -19460
1046 -19460 -16972 -3170 9926 15199 14828 9529 -845 -14841 -20135 -12641 1995 12785 15940
1059 15940 13560 6220 -6658 -18600 -18993 -7244 7352 14902 15658 11576 1809 -11701 -19909 -15185
1073 -15185 -807 10326 14396 13876 8454 -3177 -16148 -19025 -9487 4086 11902 14105 12644 5572
1087 5572 -7958 -17920 -16359 -4519 6195 12405 14207 11698 1882 -12350 -19621 -13246 -793 8935
1101 8935 13565 14744 9575 -3807 -16807 -18580 -8237 3582 10343 14382 14333 5058 -10079 -19243
1115 -19243 -14527 -3269 6467 12187 15159 11592 -838 -14645 -18106 -10445 1024 9173 13321 14176
1129 14176 7383 -5563 -16414 -15211 -5571 3715 9352 13278 13373 3919 -10683 -17597 -11958 -2368
1143b368O942O133M651l736j3949j2808r20P643Q331P226O711J333q872j3650
1157g333q489K040Q428Q283O449N090j423j1472j3515m616O216Q680O116O431
1171A0885N065n186j5209j1223J787P525N700O713Q618N47j1237j3144n387L556
1185a0990N669O517Q758N578l691j1801j1627l253M750P364P142P545L918o872
1199I007j4913r492K536P535M895O770Q844N6j3476j3181j933M652L878N719R853
1214A0750N930p190j2610p662n60K373M884R163Q024J066q155j1795p444J590
1228a1636N451N658P595Q086j139j2711j2656j383M747K906N095J1738N565r039
1242H277j3858m922J081O20M205J0861R201k715j0392q474m080m20L573P289Q436
$$ plain form
1143 -2368 4574 10707 15358 11622 -2327 -15135 -16055 -8412 -81 7145 13856 15189 6317 -7333
1157 -7333 -15822 -13782 -5354 2929 9378 14468 13045 1573 -11942 -16558 -10342 -1662 4454 10885
1171 10885 15950 10764 -4445 -15668 -13881 -6356 -656 6057 14675 15222 3985 -9159 -14546 -10990
1185 -10990 -5321 1196 9954 15532 11841 40 -11587 -14840 -10090 -2726 4416 11961 15879 9007
1199 9007 -5906 -15398 -12862 -5327 -432 6338 15182 15238 1762 -11419 -13352 -8700 -4822 897 10750
1214 10750 16680 9490 -3120 -10782 -11342 -8969 -4085 5078 13102 14168 6013 -5782 -13226 -11636
1228 -11636 -6185 -527 7068 15154 14015 1304 -11352 -12735 -7988 -5082 13 11751 17316 8277
1242 8277 -5581 -10503 -9422 -8802 -4597 6264 15465 12750 2358 -6116 -10196 -10616 -7043 246 8682
1257H682N249k916j0482r918j810L412K563O193J0024N633q925j3445m715J948
1271h507k42L127J2392J0232l985j3059p301j665j440J672J0187J0722J705o684
1285G154q812o816k529K058N359P260P101K566p429j1262m085J897L54K319J0430
1300E565J0100l732j2299o179K57l216m88J0239J3299J459r230p705l807m787
1314a0524r91P376J1175N793j635o997q910n215N66K598N404Q604O934m157j1891
1329a870n606P81o07j262Q581J2925P40j0519n881o27m106m495N989J3524N805
1344A3372m336n884n285n845m247L572R123Q453L984l612r853o782j280R4K020
1359f506Q725J1266k93j0849p133M13k332m025N882J3813M133o994n959j115m306
$$ plain form
1257 8682 13931 11015 533 -9385 -11195 -7783 -5220 973 10997 16630 7705 -5740 -10455 -8507
1271 -8507 -8749 -5622 6770 17002 13017 -42 -7343 -9008 -10448 -8776 1411 12133 13838 7154
1285 7154 -1658 -8474 -11003 -8945 -3586 3674 10775 13341 5912 -5350 -9435 -7538 -7184 -4865 5565
1300 5565 15665 11933 -366 -6545 -6288 -9504 -9992 247 13546 15005 5775 -1930 -5737 -10524
1314 -10524 -11515 -4139 7036 12829 11194 4197 -4713 -9928 -9362 -6764 -1360 7244 14178 10021 -1870
1329 -1870 -7476 -6695 -7302 -8564 17 12942 13682 3163 -2718 -3345 -7451 -11946 -5957 7567 13372
1344 13372 9036 3152 -2133 -7978 -12225 -8653 470 8923 12907 9295 -558 -7340 -8620 -8526 -6506
1359 -6506 2219 13485 13192 2343 -4790 -4377 -6709 -10734 -4852 8961 13094 6100 141 -974 -5280
1374e280o608K274J1241Q075M46l595m724o494m634r65M549R065Q395M37q518
1389C664p195k462k251k358O946J3556M000p961p522m66k926p039K858J3360P501
1404A1705l846m831j470l993p393p97P529Q440L880o16m092n935m339l399l89
1419i546P097J0583M432n582o858k384l768o161L380J3100Q570m614o027j074
1433A148l922q153r83J0934R256K86l024j756l750o663l874L520P867O161J743
1448H790k962m319l655m311l990L177J1016O875k598n031j056l958r310j039J1366
1463a005J0406q00l625q38l319r137m142O551R584L954p27j480l397n478n339
1478h792p87N810Q170M511j970l639j941m488o862l76R463R145q27l406L49k725
$$ plain form
1374 -5280 -11888 -9614 1627 9702 10148 6553 1829 -4665 -9299 -10264 -5715 3350 11745 12182 3664
1389 3664 -3531 -5993 -8244 -10602 -3656 9900 13900 5939 -1583 -2049 -4975 -12014 -9156 4204 11705
1404 11705 7859 3028 1558 -2435 -9828 -10625 -3096 5344 9224 8608 4516 -1419 -5758 -9157 -9546
1419 -9546 -2449 8134 12566 6984 126 -2258 -6026 -12187 -8807 4293 12863 8249 2222 1148
1433 1148 -2774 -10927 -11910 -976 8280 8566 5542 3786 36 -6627 -10501 -6981 886 7047 8790
1448 8790 5828 1509 -2146 -6457 -10447 -7270 3746 10621 8023 2992 1936 -2022 -11332 -12371 -1005
1463 -1005 9401 8601 4976 4138 819 -8318 -12460 -5909 3675 7629 6902 5422 2025 -3453 -8792
1478 -8792 -9579 -3769 4401 8912 6942 3303 1362 -3126 -9988 -10364 -901 8244 7417 4011 4360 1635
1494A635r053n484P001J0416K370j262N24k257p929p106J927P902O255K442k94
1509G087k988l906n664m561K510Q339O346m81k832n59k900p947l754O960R164
1524D814J547k481J598n97q231p801K491Q161M835P13J132L98n707q420l153M674
1540f027P093M982N30q83k025n189p332j533P009Q544J226k172R59j253q518p062
1556a1651M499Q649L594j247J294J820o217r338j596O457N796K122J500J148k811
1571D019p016o278R25O162O043J407Q2J93k729q056n716M567Q413K858j203K029
1587E700M98o280r310K5P371M624K24J530K784l033q206n133K373N927L307J356
1603C757K197L92m679p799l478M515N954K162O69K711k14p406q167M37P326M365
$$ plain form
1494 1635 -7418 -12902 -5901 4515 6885 5623 6147 3890 -4039 -11145 -9218 -1316 4939 7381 7087
1509 7087 4099 193 -5471 -10032 -7522 817 7163 6682 3850 3291 391 -7556 -11310 -4350 4814
1524 4814 6361 3880 5478 4881 -3350 -11151 -8660 -499 4336 5049 6181 6579 872 -7548 -10701 -6027
1540 -6027 1066 6048 6578 5695 3670 -1519 -8851 -10384 -3375 5169 6395 4223 5182 3929 -4589 -11651
1556 -11651 -7152 1497 5091 3844 5138 6958 741 -8597 -10193 -3736 2060 4182 5682 6830 4019
1571 4019 -2997 -9275 -8350 -2188 3855 5262 5344 5537 2808 -5248 -10964 -6397 2016 4874 3671 5700
1587 5700 6198 -82 -9392 -9367 -1996 2628 2852 4382 7166 4133 -4073 -9206 -6833 -906 2401 3757
1603 3757 5954 6346 1667 -6132 -9610 -5095 859 3021 3690 6401 6187 -1219 -9386 -8949 -1623 2742
1619B742k29K275K825l784r745m031M502N569J739J183L898j95o782p589n19M805
1635c336M104J765K159K354j915q119n983J831O081K805R13K878K231n244r094
1650f570k346M673M697N10K446M017q54p951o787J013M992K261J415L880K671
1665H067m394q074l801K720M301J570K112M117L15o267p438r44M304L418J27L535
1681C668M086k071q016n219J959L844P64J867N098K087n458p853k010K956K693
1696a605J380L248M584p74p243o072L84L077J935J755M312L234l856p567m063
1711g271K627K632R61K653N412M25o247o672q42L197J243J166M652M142k484p381
1727a787m138R22K317J039K380N140J937m802o947k005K399J236N31M021N429
$$ plain form
1619 2742 2513 4788 7613 3829 -5916 -9947 -5445 124 1863 3046 6944 6749 -33 -7622 -8141 -3336
1635 -3336 768 2533 4692 7046 5131 -2988 -8971 -7140 -1059 1746 2659 5537 7768 2524 -6570
1650 -6570 -8916 -4243 454 964 3410 7427 6573 -1378 -8165 -7152 -2160 101 1516 5396 8067
1665 8067 3673 -4401 -8202 -5482 -1181 389 2501 6618 6933 666 -6772 -7716 -3412 6 133 3668
1681 3668 7754 5683 -2333 -7552 -5593 -1749 -985 882 5980 8067 2609 -5244 -7254 -4298 -1605
1696 -1605 -225 3023 7607 6833 -410 -6482 -6098 -3021 -1086 669 4981 8215 4359 -3208 -7271
1711 -7271 -4644 -2012 -1051 1602 7014 7439 1192 -5480 -6322 -3125 -1882 -716 3936 8078 5594 -1787
1727 -1787 -5925 -5003 -2686 -1647 733 5873 7810 3008 -3939 -5944 -3545 -2309 -1778 2243 7672
1742G672p56o849n541K3K661K86J756N218L794l650p516l113J699J756L62L357
1758A159N130J485o206n710p76J522R47P44M948M264j772o826l715R69J139j01
1774b799L070N149K365m554o199k009J807K20K85M444N574l66o205n037K05P91
1790c259j93J982N852L416l011o424k863J162M05k53L313N944J154n331n196n74
1806c876Q34l45P32N088N125j936o266l441J116kj065L189N688K504m065n281
1822b001j010M17j082K84M593N662m11n179m289m40L74j178J561O427M083l101
1838D710n573k653J382j165j293M012O652Q43n206l856k81l61j920J394N860M018
1854F563j547m735k418n37q61j133L274N770K675l542m925j110K04j602n80N010
$$ plain form
1742 7672 6916 67 -5474 -5451 -2790 -2504 -748 4470 8264 4614 -2902 -6015 -4316 -2560 -2198 1159
1758 1159 6289 7774 1568 -4142 -4918 -3396 -2449 -1705 3243 7507 5735 -1091 -4806 -3837 -2698 -2799
1774 -2799 271 5420 7785 3231 -2968 -4977 -3170 -2950 -2665 1779 7353 6987 782 -4255 -4050 -3259
1790 -3259 -3452 -1470 4382 7798 4787 -1637 -4500 -3338 -2933 -3186 127 6071 7225 1894 -3302 -3876
1806 -3876 -3042 -3387 -2655 2433 7558 5622 -644 -4085 -2969 -2971 -4036 -847 4841 7345 3280 -2001
1822 -2001 -3011 -2594 -3676 -3392 1201 6863 6452 1273 -3016 -3456 -3082 -4260 -2699 3728 7811 4710
1838 4710 -863 -3516 -2134 -3299 -4592 -580 6072 6915 1709 -2147 -2428 -2789 -4709 -3315 2545 6563
1854 6563 5016 281 -2137 -2674 -3535 -4668 -1394 4376 7051 3509 -1416 -2526 -2322 -3924 -4504 506
1870E06N893l55n033l504J106j357k544K276O555L083l218l859o89o93k403m84
1886d720M121N624J291m127k808r99j009k005Q54M831N110q45m331k749M40j916
1902c238k284K851P172K351m274l381N6j095l286L47N863M761r31l425k148o74
1918a335j668k097K067N670K965j125l464j859m87k427j516L470O143J969l812
1933B494l070M28j582l648N53O230M977k163l445n28n67l861j688M210N159J517
1949E016j952j969j301j900k459L97L555M639Q00l155j634l78j934l017J357N870
1965A935L524k295k730L51o35m649j635M847N461J20k206n46q21l161k916J524
1981c832M858L004lj543j702j477k299k005K267M942K922k237k623L51r61m003
$$ plain form
1870 506 6399 6044 1011 -2493 -1387 -2744 -5288 -3012 3543 6626 3408 -451 -1140 -1833 -4236 -4720
1886 -4720 -599 5025 6316 2189 -619 -1618 -2627 -4632 -3778 1053 6163 5318 987 -1762 -1322 -3238
1902 -3238 -5522 -2671 4501 6852 2578 -803 -747 -1842 -5128 -4781 1082 5843 4912 1487 -661 -1335
1918 -1335 -3003 -5100 -3033 2637 5602 4477 1013 -846 -1333 -3760 -5276 -1806 4337 6306 2494
1933 2494 -576 -148 -1730 -5378 -4825 1405 6382 4219 774 246 -321 -4182 -5870 -1660 3499 5016
1949 5016 3064 1095 -206 -2106 -4565 -4168 -613 4026 4826 1671 37 -341 -2275 -5292 -3935 1935
1965 1935 5459 3164 434 785 150 -4499 -6134 -1287 4174 4294 2088 1542 721 -2440 -5356 -3832
1981 -3832 1026 4030 4027 2484 782 -695 -2994 -4999 -2732 2210 5132 2895 272 623 -338 -4341
1997d341j355N234N075r93k502Q87m53m196l090K281N178J814p01m92o47k772
2013a073l246o70L138M221J950j062j656j241k164k644j96M753M397j039k691
2028G77M50j28l784l382L368N610Q61k440N57R07l473m373O57M048K701M84l0
2045B810k10j793l317k278R94M072L244k26j424l66r39m115k087L240N251Q12
2061C668j857j06N55l364m651J381N125K121j095M16R18k298m056j472K871K425
2077E81J768K24k54k06k378l426r40K540M230J077j542P07r1l849m605J961N071
2094H68J648p01l7J777k969n088j48L382K967r1L54J216j316l322k385L33K824
2111f88J882J032J38J02q02l575l035J371M501J208q40P30J385k904n006n64M216
$$ plain form
1997 -4341 -5696 -462 4613 3620 1118 2005 1552 -2644 -5734 -3453 1725 3539 2838 2346 1699 -1073
2013 -1073 -4319 -4989 -1851 2370 4320 3258 1602 361 -1803 -4447 -4643 110 4507 3468 777
2028 777 1227 1099 -2685 -6067 -2699 2911 3772 1332 1889 2796 -677 -5050 -4393 -345 2356 2840 2810
2045 2810 2600 807 -2510 -4788 -3794 278 3522 3296 1872 1506 567 -3548 -5635 -2395 2856 3668
2061 3668 1811 1705 2260 -1104 -5755 -4374 751 2872 1777 2193 3111 813 -3243 -4715 -1844 581
2077 581 2349 2573 2319 2113 -265 -3691 -4631 -2091 2139 3216 1674 2381 2290 -1559 -6164 -4203 868
2094 868 2516 1815 1778 3555 586 -4502 -4650 -1268 1699 1608 1962 3178 1862 -1460 -3845 -3512 -688
2111 -688 1194 2226 2364 2466 1664 -1911 -4946 -3575 926 2134 1294 2024 3409 505 -4501 -5065 -849
2128h49K445p04J136K002j860m677k100J935K674R83Q93Q78K47k612l129j298
2144d036J691K858J383k40N46O51k816m063q2L387J970m58P84K261j609m787k208
2161d768K761K429k33J120K448L8m205l184k12K490J345J622O90P62j014l260
2177a171k589L57K940J637M3O25J358j398m587j530K575K134K69M79K111K60l924
2194d11l624J235K109K64R37J927J461k253l419j860J107J935J205R85J172K43
2210C013k199l693o20J796J662L35R13K242o62l774k753J369J908K20P8K943J205
2227C983k798l502p30J276R53N29J964J597m10k762l118k3J543J159P21J395J693
2244C470r38l746k269Q87K250L82N28K378R01k997m021M90J357M35J50K254K107
$$ plain form
2128 -849 1596 892 2028 4030 2170 -2507 -4607 -2672 2 985 1878 2756 3003 391 -2738 -4036
2144 -4036 -2345 513 1896 1656 2202 2853 37 -4026 -4108 -721 1249 791 1575 3836 2227 -2560 -4768
2161 -4768 -2007 422 189 1309 3757 3795 -410 -3594 -3806 -1316 29 1651 2341 3103 2089 -1171
2177 -1171 -3760 -3403 -463 1174 1217 1842 3200 1802 -2785 -4315 -1740 394 663 1142 3253 3513 -411
2194 -411 -4035 -2800 -691 -427 510 2437 3898 1645 -1774 -3634 -2527 -592 613 1598 2770 3013
2210 3013 814 -2879 -3499 -1703 -41 294 1207 3449 2787 -987 -3740 -2371 -463 -243 -165 2778 3983
2227 3983 1185 -2317 -3047 -1771 -818 -289 1675 3272 2862 100 -3018 -3041 -1498 -339 382 1777 3470
2244 3470 2532 -1214 -3483 -2596 -346 36 564 2942 3843 846 -3175 -2685 -1328 -893 -743 1511 3618
2261C618j189l364j664L10O53L95J693J873R44j718l236j481R91J254O93J334
2277A106K172K63k970l314K1J532N15K52K389J847j876l288j133P22N29K53J526
2294E46K495J44k794k205m48M10R14L74J894J723l29k821k070k50J087L25R00
2311a05K430J427j807l453o03P96k77M16J904K604j42k784j897l88K14M7R38K843
2329B163J373j394k494j469j91r5N29J449K755O34j991k640r65P09N3L65K211
2346A002K297n57k962j729L63J70o00J442L275M82j495k420o73l96m9L28K333
2363H11J974K41k173k123o03K32m12J167K388J678q27k811q49k19j22j02K080
2380C30K117Q64k229j836o33j73l61M21K543J904l36k152j303n55l94m26J648
$$ plain form
2261 3618 2429 -935 -2599 -2289 -1636 -1241 452 2325 3269 1551 -1685 -3166 -2175 -921 -228 1106
2277 1106 3278 3541 571 -2743 -2722 -1190 -675 -423 1966 3813 1937 -1351 -2484 -1762 -1233 -980 546
2294 546 3041 3185 391 -1814 -2262 -1852 -938 -564 1330 3053 2724 -97 -2167 -2417 -1330 -1005 -105
2311 -105 2325 3752 1945 -1508 -2111 -1315 -1592 -1176 728 3332 3190 406 -1491 -1879 -1665 -1618 -680 2163
2329 2163 3536 2142 -352 -1821 -2012 -2107 -1578 -129 2626 3260 1269 -1371 -2336 -1627 -1574 -1209 1002
2346 1002 3299 2742 -220 -1949 -1586 -1416 -2016 -574 2701 3183 1688 -732 -1405 -1801 -1850 -1522 811
2363 811 2785 3026 853 -1270 -1873 -1641 -2053 -886 1502 3180 2353 -458 -1307 -1526 -1648 -1750 330
2380 330 2447 3311 1082 -754 -1387 -1560 -1921 -1500 1043 2947 2611 459 -844 -1399 -1793 -2219 -571
2397e71K403J067j235j807r83l50l44qK465J754O3j521j512j83p49r40J126K208
2415H83K069q20j975j089j64p95j72K220K100P16j764j113r26j073k56N00K191
2432E32K112n63j279j337m59r11l11J261K546J195j162j583o18r00p69O1K245
2449F0K223m7j352q98n40r80p86J139K326J444n04j634m55q60j421n5K104J906
2467A670J097j367j039o31j222r12M09K619J886m90j423n46p25j391m28J742K107
2484A356P33l87j001p53j143j232J15J830K301M94j411q79m80j201p13N06K713
2501H48J646k73j313p18q51j427j31J381K296N53n32o31p41j158j401P06J945
2518A99J877k94m64r04q85j184n54J125J851J115J25j017o79q89j687O7J761K112
$$ plain form
2397 -571 1832 2899 1664 -143 -1126 -1476 -1820 -1828 637 2391 2454 933 -579 -762 -1511 -2451 -1325 883
2415 883 2952 2132 157 -932 -1096 -1891 -2063 157 2257 2973 1209 96 -830 -1903 -2159 -1659 532
2432 532 2644 2081 802 -535 -994 -1905 -2216 -955 1591 2786 1624 41 -577 -1477 -2246 -2185 60
2449 60 2283 2236 884 -14 -554 -1534 -2320 -1181 1145 2589 2085 451 -4 -864 -2285 -2340 -236 1670
2467 1670 2767 1400 361 -270 -1492 -2404 -1995 624 2510 2020 597 51 -674 -2065 -2493 -751 1356
2484 1356 2089 1702 701 -52 -1195 -2427 -2312 -482 1819 2313 902 23 -457 -1658 -2371 -1865 848
2501 848 2494 2221 908 190 -661 -2088 -2219 -838 1458 2011 1479 848 107 -1051 -2452 -1746 199
2518 199 2076 1782 1318 414 -471 -1655 -2209 -1084 767 1882 2007 990 311 -578 -2265 -2198 -437 1675
2536A675K69p78l35m32k145m55O45J969J290p8p35l56j050j451j33R78K409L42
2554A629m01m1j128r70j260K32J785J725J14o48l34n76j601j124J729J385J198
2571A714n35M7k77j485j774M26J439J501L44J51n05j052j323j045J104J109J163
2588A002M57k77j30j500j249n18R52J940R44l21j46n03j099j934N01J623J409
2605A151J68J46r4j072k180l76R13J795P45K54J04o46j449j183l24J307J401O17
2623A277Pl7j93j844j260J78J913R31K29J2L39j270k190l59J360J133M74L86P65
2642A851q39j871r41K03J021Q60J060J36j54j070j480o20M64J280J302j74R3J52
2660A273j237j538p26J713R59K61M22R98j247j791q91O78P07M99R82P20l16j583
$$ plain form
2536 1675 1944 1166 831 399 -1746 -2201 -1556 413 1703 1625 890 534 -516 -1967 -2100 -1122 1287 1629
2554 1629 1228 1187 59 -911 -2171 -1939 -154 1571 1685 1037 703 127 -1474 -2598 -869 516 1714
2571 1714 1179 1226 949 -536 -2310 -1884 -445 1056 1400 1551 1046 -6 -1329 -2374 -1270 -161 1002
2588 1002 1459 1182 1052 -448 -1697 -2215 -1263 677 1621 1300 1154 651 -448 -2382 -1881 -258 1151
2605 1151 1319 1465 1371 299 -1881 -2257 -1344 451 1196 1450 1554 908 -541 -1724 -2048 -741 660 1277
2623 1277 1284 1247 1054 -790 -2050 -1872 41 972 1201 1213 1552 282 -1908 -2267 -907 226 700 1086 1851
2642 1851 1012 -859 -1800 -1597 -576 284 1344 1480 1326 256 -1224 -1844 -1380 -100 1202 1028 1121 1273
2660 1273 36 -1502 -2228 -515 444 705 1127 2125 878 -913 -1804 -1126 -419 80 1062 1782 1466 -117
2678a17j320k6K72O95J167P20j08n10r67j454k85J371Q51N36K60M60r40j758j003
2697b156J012J231r2Q17R79n30j316j622O17K13L15J135P19J92r15r73j006l48
2715a728Q30J131N70P10j23q26j615p58Q47R12L87N68L99L71k100j343N51O71
2733e46M06M09J450K32j775q23o70K21K42J084Q06L74n09o06j114p73J50J069
2751c73O47R16J93L09k372j016L53R13K19P13J409j09j723j225J10l0L87O02J467
2770A390K36p68j171o04l15L2Q06J026M28M50k91j523j142p0R28L30Q52P45K80
2789A619j300j431j65N63j58O32J679N64j469j118j86m31L12j2J676O44k89p02
2807D28p04o58o28J125N31Q23Q0M20j117j418q2L40J06P50J126Q43j141j296n03
$$ plain form
2678 -117 -1437 -1463 -1191 -496 671 1391 1283 773 -194 -1648 -1933 -562 289 825 1085 1545 605 -1153 -2156
2697 -2156 -1144 87 -5 812 1791 1261 -55 -1677 -1060 -847 -532 603 1322 1514 599 -374 -1380 -1728
2715 -1728 -898 233 803 1513 1390 564 -1051 -1809 -962 -50 337 905 1304 1675 -425 -1768 -1217 -546
2733 -546 -140 269 1719 1951 176 -647 -1317 -1096 -854 230 1036 1410 901 295 -819 -1592 -1442 -373
2751 -373 274 1190 1383 1692 -680 -1696 -1343 -430 -211 502 1911 1802 79 -1146 -1036 -1066 -679 -77 1390
2770 1390 1626 858 -313 -917 -1232 -1200 -394 632 1060 1510 1219 -304 -1446 -1516 -588 -258 594 1339 1619
2789 1619 319 -1112 -1277 -714 -872 -240 1439 2003 534 -584 -770 -1201 -889 -901 775 1419 1130 428
2807 428 -276 -934 -1562 -437 94 917 997 1417 300 -1118 -1200 -860 -754 -4 1122 1965 824 -472 -975
2826i75j30q5M64J465J186o69j036q93j00k95m5J221P56K93j14j092n72m01j65
2845a187O98N82R26R8J51j644p68K08qP6J439P76j23r75q17k22k87k46J294J189
2865A160j9k86q15l79j114K23N45J081O18M18p75j085n55j3L87J79J197O12j10
2884A269j300p11j35k92O25L24J458J99r35n32j06j183j65O88J663P57m71p31
2902D22j82j061o26N83Q93O88L30j67o30n38l68m69L67J135Q65M19j165n28m24
2921d56n11l55O58J554P09n64p60oj040p25O64Q13P55L87j77r06n66q05j92J044
2941d79P49Q87j17n63n91m36l87j57L62J475K09j88n20l73o79o27L64J101R10
2960I40k7l29L4o85j214K03M94R33O22j60R4j120m88k93k16J081R60J80k89k1
$$ plain form
2826 -975 -1105 -1190 -726 739 1925 1256 220 -673 -773 -1068 -1113 108 864 1157 1043 -49 -621 -1022 -1187
2845 -1187 -489 93 1019 1117 1268 -376 -1144 -936 -944 -868 571 1347 1224 249 -568 -790 -1077 -1323 -29 1160
2865 1160 1141 855 40 -339 -1453 -1230 -685 396 1014 1432 657 -428 -983 -996 -609 -430 767 1379 1269
2884 1269 -31 -742 -877 -1169 -544 -220 1238 1437 502 -30 -136 -1319 -1484 -796 867 1624 1153 422
2902 422 240 -821 -1447 -864 29 717 1047 880 250 -288 -656 -1125 -758 377 1242 1661 496 -32 -456
2921 -456 -967 -1322 -664 890 1599 1035 275 269 -771 -1496 -832 -19 736 1123 946 40 -526 -1331 -1523 -479
2941 -479 270 1157 1040 477 -114 -550 -937 -1094 -732 743 952 764 244 -129 -808 -1435 -1071 30 940
2960 940 913 584 618 -67 -1281 -1078 -584 349 971 811 905 -215 -703 -996 -1212 -131 829 1009 720 699
2980F99q29o57k53M35J052O47j71k60n04p26n98o5Q52Q19L21J38o0p68p16p06
3000a350L21R28Q32Q2J82n90l70p15k56M54R93L26r3m7k41p23r14J6J103M77j
3021D14N93l08m75j388kK69R09O54K72l30J32r86n94m30O90R52K83J55j85o06
3041A9n92q77N01J161K06J29M72o29j38j165l53O79N61M48J55N90l08j105r93
3060a239K18P23O37J46M39J25o44j122n05L59Q61L74M01j9O2r81o21m65P85P52
3080B86P1L50L85k76j514o74O29O76M37M32J58Qp86j217j56O28Q23r7P58J22l3
3101A010j611n85R7O38N94J82M12L69o24j055m34K60N78L77K48M34J13q89j233
3120a119J15kJ280K18J97K06l89n73j068M24L55N79M88J31O5n45j052l29O14J76
$$ plain form
2980 699 -130 -787 -1040 -605 447 1094 923 663 159 -567 -1165 -1230 -378 441 762 900 840 72 -644 -1350
3000 -1350 -1029 -101 731 813 995 405 35 -680 -936 -482 511 837 744 697 456 -267 -1181 -1165 -62 415 414
3021 414 1007 699 224 -1164 -1166 -897 12 666 938 608 740 -246 -840 -1270 -580 372 655 810 625 19
3041 19 -573 -1450 -949 212 418 547 1019 390 252 -913 -1266 -587 -26 422 577 1167 859 -246 -1239
3060 -1239 -1021 -298 339 485 924 1049 405 -717 -1222 -863 -2 372 773 754 816 -165 -786 -1251 -466 286
3080 286 357 707 1092 816 -698 -1372 -743 -67 370 802 960 968 182 -1035 -1191 -563 260 163 921 1043 1010
3101 1010 -601 -1186 -1089 -451 143 325 737 1106 482 -573 -1007 -747 -169 208 456 890 1003 114 -1119
3120 -1119 -1004 -1006 274 492 689 895 506 -67 -1135 -711 -356 223 711 842 907 362 -690 -1019 -405 -229
3140b29M79M01L30l10q63r75K46M97L98N78J11M50n42j053m80K24P60N2K28M24
3160G26J52r95r05K63J1L81O22M85K05m43q33m93k55O57L53K58P52M34j071o92
3180c88n51L37M91J13L93O02j99q84p83O8j7M44J92J012J73k12j243l49k12M13
3200f00K89P53N34R0j074o63n0K89o9L06R51M47n52j092m33J22L17j11N34R53
3220I41K57r68n18l28n8K42L89M03N37K54q77j100R0J29K37M6R12P53p93q94k52
3241e98K3K85j33N20J463n84r15n24J1L1r7M99O92L94l39r49n68M3J49R3L76R32
3263H04K93o16p12k10k34OL98L79J039j58o25p50P4k5o08R81M01N74n48o67J56
3284d8o39k14L07P20M57K74q60m66j08N9j0j12R34N47N7j072m63N05n51k20N59
$$ plain form
3140 -229 250 651 981 671 -192 -1167 -921 -424 -26 552 663 1113 571 -482 -962 -738 22 74 302 726
3160 726 878 -117 -1022 -759 -748 -367 255 740 945 502 -331 -824 -1079 -422 -69 189 941 1375 304 -388
3180 -388 -939 -602 -111 2 395 997 798 -86 -869 -801 -818 -374 -182 830 1003 791 -452 -801 -1013 -600
3200 -600 -311 442 976 1066 -8 -671 -721 -432 -501 -195 756 1203 651 -441 -874 -752 -435 -546 -12 941
3220 941 1198 230 -288 -616 -674 -432 -43 360 897 1151 274 -826 -736 -607 -370 -324 588 1341 548 -346 -598
3241 -598 -575 -290 -423 97 1560 976 61 -463 -452 -421 -518 -19 673 1067 728 -221 -789 -746 -597 -504 -128 804
3263 804 1097 481 -231 -441 -675 -669 -271 108 1147 989 364 -386 -312 -337 -945 36 437 1011 463 -204 -48
3284 -48 -687 -901 -594 126 583 857 -3 -469 -577 -518 -528 -640 294 841 898 -174 -637 -132 -683 -903 -344
3305c44Q09M92o98o54K0l8m71K48R56O72n12j51m60k89J2j40K70Q62N25n12m89
3326A08m84O7l77k2M43J045L94p67q99J44J14l36p6P66Q23j90n35k64n27l32L18
3347e87N54Q94O7m20j54p71j97p8M4O40Q84K24o74q13J77Oo60J73J152M75P8r82
3369C2ML5n87n21R86R67j38m69k37j45m05m94M49Q00M51j54n39k68r2k02p8n1
3391f56J361K79k78n78l44J32n10k70O92J217k92p65P5R6q07m43Q11Q68J76m08
3411C56k90K04o12j01Q9M13N50p4K0p30M21m83p13N4Q71Q02j07n32J15m5n45j022
3433a359N81J577k10n05L21m09l72n22mQ25P55l24P3l8l67m92j83J48M75O12n6
3454E26m66q7J9m40l61M08J144J38p21P0K97o93j162N20R64N98l30k2m8j83q68
$$ plain form
3305 -344 465 957 259 -395 -375 -413 -884 -636 320 992 480 329 -131 -420 -408 -548 -278 584 1109 597 108
3326 108 -376 -309 -686 -708 -265 780 1174 407 -492 -348 -234 -570 -646 120 943 753 218 -46 -573 -905 -587
3347 -587 -33 861 928 508 354 -417 -614 -692 -648 -8 876 1100 426 -387 -210 -204 -864 -691 461 936 1014 32
3369 32 36 71 -516 -1037 -51 916 778 309 72 -73 -478 -972 -523 277 728 574 35 -233 -325 -527 -605 -656
3391 -656 705 984 706 128 -216 -84 -594 -864 -172 1045 753 -12 63 159 -648 -1091 -280 588 764 356
3411 356 66 270 -342 -443 -354 59 609 535 555 -175 246 -237 -950 -896 -25 777 670 138 253 208 -337 -1359
3433 -1359 -778 799 589 84 405 -4 -376 -898 -902 -77 678 354 427 389 22 -470 -653 -505 -30 582 526
3454 526 60 -27 -8 -448 -809 -401 743 881 160 230 527 -166 -1328 -808 156 754 424 402 354 171 -697
3475f97j24M69M65M09k25L11l17o83m22M6O35P71J62m99l89M85o22p20L72J076
3495E03p7j04J2L45o37o97l20P36P00j33j72J36o9n38o68M16L53L23j7K90J64
3516E46m62l00n19L24M97L52n9J91k05l28r05j82J056M75r7J52Q2n54o56j21j3
3537g26J074J29l03J62K6n66m38k4K59Q63J58r2l56R6r0q34k20R89M72J5l36K89
3559E47r3r70m84O76R10n33K54K06o7j073j37J84M69N75k79K98l9l4m65o03K89
3580c69L86M43Q9k49J81l87p26l1J07Q76m1J02L07R3j249m16M68J38N05j00O77
3601H04j88o65k77n12n3J019J05K51P7J4n29q16K0O21K07j42L05L07%j321J11
3622f62j5R72j83o6M54k0m36n32j23M05M89k05K41K83J18j021m7l99L39L28J99
$$ plain form
3475 -697 -821 -352 113 522 297 608 291 -392 -814 -768 -133 638 800 301 -88 397 -225 -945 -573 503
3495 503 426 322 334 679 42 -655 -975 -239 461 328 156 292 223 -315 -983 -567 -214 109 92 382 546
3516 546 84 -216 -735 -411 86 438 379 570 365 37 -868 -1050 6 481 384 536 618 64 -592 -713 -726
3537 -726 348 477 174 336 362 -204 -642 -666 -407 456 614 522 166 262 172 -662 -882 107 579 594 258 547
3559 547 454 -516 -1000 -324 586 53 307 513 446 -627 -764 -580 -111 464 185 483 444 410 -55 -658 -369
3580 -369 17 460 549 300 481 94 -632 -663 -556 320 279 381 688 781 -468 -884 -416 -278 227 127 804
3601 804 616 -49 -326 -838 -891 128 233 484 561 575 46 -770 -750 -129 78 -64 241 548 548 -773 -662
3622 -662 -677 295 112 46 500 480 44 -488 -611 -206 283 78 319 602 720 -301 -348 -747 -408 -80 119
3643A19K02K95m76m26l47L30J34N15m16P72o5n90m05m34Q28l6j52N98k18K28j174
3664g18J63J44M11j64M59K30K05l99q69k45N72J73L7l7R22k22p16q79L43N79J03
3685I2K20j12O06m66r31K7L09J76K58L5J15J78n71q25O40j1m6L62L37P52o10j221
3707f86J3N17L98l01j7N94L01m10r52j42K93M67k80L96K60K83p11l24n1K43N2
3728e7K88K07L30n11o24o79N85K24J54K52P11j22n07p98M5K38K44n25R79K00j3
3749F21p62n42K83L80k81K16L83L94n69p23k00K37N60l10N77L73j59o43m49O5
3769e49K38L71k61J099k85j42o34m98K14L34k80N18N47j24m45o92K79J77k41K95
3789g9J67N69k21o46l08N5p3J20N93J77N56q61o14N7J54O8L65N9O84j26p18j53
$$ plain form
3643 119 321 616 140 -286 -633 -303 -169 346 -70 702 637 47 -358 -792 36 0 -152 446 228 456 -718
3664 -718 -555 -411 0 -164 295 525 730 331 -538 -783 -211 -38 -1 -38 884 662 -54 -933 -590 -11 92
3685 92 312 200 806 340 -591 -564 -255 -79 179 214 329 507 -64 -889 -249 -260 -306 56 393 1145 535 -686
3707 -686 -673 -156 242 -59 -76 518 819 409 -543 -685 -392 75 -205 191 451 734 23 -301 -352 -109 -57
3728 -57 231 438 768 257 -367 -1046 -461 -237 -83 169 880 758 251 -547 -502 -264 -20 -545 434 634 621
3749 621 -141 -683 -400 -20 -301 -85 298 692 123 -600 -800 -563 -3 -313 264 637 478 -165 -614 -549
3769 -549 -311 60 -201 898 613 471 -163 -661 -447 -113 -393 125 672 548 103 -589 -310 -133 -374 -79
3789 -79 88 657 436 -210 -518 -463 -536 -416 177 354 910 49 -565 -508 -354 -286 79 138 822 696 -22 -175
3811a75j02j46j54K02Q55K58m49n76j86J94k1N3L06O02N9n04p55K08J68k79O3
3832c79O26N60l1q53m54L08o7k26M06M60M77l88n51L6K9qm20O01L67M7o73j70
3854c03pL6k96N96M94J92n29j82k54J99m85J3K89J001k92m09k24P8M2m30r7P30
3876A62O86m61m97K1K2j85j89L84M70P5k85l56M0j37K2k99N44M42Q6n18j73J27
3898a9j76k45K13N16N43l44m65k13Q4n21O9N56N98L10p97k8l15l02J83L1L96L17
3920C91k5l10j75k5p4k72L56L94M73j42m94k32j55J43m82Q20L99n95k76L69o0
3941B8n73m3K29J021j75k54m6n1k82k75K14J8K52N23l81K1j62j39l72K68L04N06
3963F31m02j90k87O3k6l48J88R49Q2q06J45L50o55l16J51O56J92o6oj29j92l85
$$ plain form
3811 -175 -277 -423 -577 -375 480 738 289 -287 -473 -279 -300 -247 59 661 720 216 -539 -331 -163 -442 -379
3832 -379 247 807 776 -77 -531 -223 -290 -516 -110 350 827 439 -112 -76 -47 -55 -475 126 493 540 -133 -303
3854 -303 -310 -274 -570 26 520 712 183 1 -253 -54 -539 -526 -237 764 472 63 -161 -83 -41 -471 -568 162
3876 162 848 387 -110 -89 -67 -252 -441 -57 413 488 203 -153 -113 -250 -228 -527 17 459 545 27 -146 -19
3898 -19 -195 -440 -227 289 832 488 23 -190 -106 -627 -558 -2 596 906 109 81 -234 -536 -353 -322 74 391
3920 391 366 56 -119 -144 -218 -490 -134 260 733 591 97 -135 -290 -147 -629 191 590 -5 -281 88 28
3941 28 -545 -588 -359 662 487 233 187 136 -146 -421 -207 -189 63 586 205 226 64 -75 -447 -179 125 631
3963 631 229 39 -248 -185 -211 -559 -371 578 660 -146 -1 349 -306 -622 -471 185 377 311 305 176 -16 -401
3985d01j06K27L65P08l27l19k6l53j10l08N66N42q5m49J47J2j84l02j70R09J29
4006D65l40J86k43k79n0k86N69J99J08j83M3L2l98k66K19K88K45N53j081M58J10
4027C49n89m81L56P80ql13K54K5J5j293M39N77J36rJ1m8k27j45k69L93KJ87L33
4050D75n2J6l31n28J38lM38N14r6n19O4j90n14K80N50K72l46j1L11l38n34j51
4072e55P09k74L83k54K75O3n82J2j68j13R32j72k68qJ68N3m41l23O20Q8j58L23
4094C10j3M4j122M92K90J86J90l04J17M30j035j53L69j43O81P7j05L2j62n69P
4115c81J59N98k21J09q9J31q1m76m17N04N64l32J31l2L07n20l98J53N15k72K32
4136A84L24r9k23m45k7K66j79M40L54o47M06l51o13K22K95O83k03k36M65M9q89
$$ plain form
3985 -401 -507 -280 85 793 466 147 121 -232 -342 -650 -84 458 373 -76 71 83 -101 -403 -573 336 465
4006 465 125 311 68 -211 -261 -547 22 221 329 146 189 221 -177 -443 -224 64 309 862 -219 239 349
4027 349 -240 -721 -365 415 407 94 348 373 388 -905 -466 111 247 238 249 201 -26 -171 -440 -47 -45 142 475
4050 475 423 439 108 -420 -282 -285 153 667 571 52 116 -74 -588 -308 242 514 168 157 468 130 -404 -555
4072 -555 154 -120 263 9 284 347 -235 -223 -391 -504 428 256 -12 -20 148 201 -240 -563 57 145 -13 310
4094 310 297 341 -781 -289 1 187 377 73 190 620 -415 -568 -199 -342 339 416 311 343 181 -388 -381
4115 -381 -222 376 155 264 175 306 225 -251 -668 -164 400 68 199 167 474 -46 -444 -291 224 -48 184
4136 184 508 409 186 -259 -286 -20 -199 241 595 -52 354 3 -610 -388 -93 590 387 151 616 665 -224
4157b24j02o7K57J12k07N90L73o07o43K39L26j64K84J19J36j53j47k86l64N04
4177b4l69O38k12M19n88n0j3P5J03J46j23N32j84n22J43k18L16j57P5J63l7K49
4199C62q72L26j02L8K34J55M55l03j51k94k7j95q1N06J17k1O7m72j39k96N86K1
4221h6o0M82O8r5o23L4n2K65k76N73J09q4l88q6k1J5R9L28K67l60j0j97j91o5
4245c54K56k8j81O76M8j24p25N69j87k50n1L51K76L87q34k00J37O0J43J85J56
4266C10mj15n71J49o0J21L27p2M64n62K52k77k46K5j15J43M68j58j88L75m55P5
4288a14P7k97N13K59k04M3o75N5O2M4P3M94K26j59o33J6J90l44l3N01L52m3k82
4311A21l42o4J16k5j04J66J68M93m55k37K43j96l82P59p1J89k91l13K4n1mK81
$$ plain form
4157 -224 -326 -393 -136 -24 -231 359 732 125 -518 -279 47 -117 167 286 422 269 122 -164 -528 -24
4177 -24 -393 245 33 452 -136 -186 -199 -124 -21 125 2 534 350 -172 -29 -247 69 -88 -13 150 113 362
4199 362 -510 -184 -286 -248 -14 141 596 293 142 -152 -179 -374 -455 51 168 147 214 -258 -397 -693 -107 -86
4221 -86 -146 336 404 309 -314 -280 -332 -67 -343 230 339 255 -133 -219 -240 -225 -126 202 469 109 99 -98 -289 -354
4245 -354 -98 -126 -307 369 417 293 -432 137 -50 -300 -351 0 276 663 -171 -371 -234 -174 -31 154 310
4266 310 306 191 -380 -231 -291 -170 157 85 549 -13 239 -38 -284 -259 -374 -231 237 79 -109 266 -189 -114
4288 -114 -37 -334 179 438 234 277 -398 -343 -281 -237 -164 330 556 397 -236 -220 -30 -374 -407 94 446 403 121
4311 121 -221 -285 -169 -194 -298 -132 36 529 74 -163 80 -116 -498 261 190 379 88 -225 -201 -252 -256 25
4333B5M86k7m33j07Rn22K25L05J53rL02Ol76O6M2k21j23j25J91M32k53j06j62
4356b22q0K2J5N44k0J07k93j97j29J56j89Q9L52L61m85P4J68n46K13N6k50M05
4378A51j22K56p00M91k11J19k67K44M88m78K8k74k67L74K2j9M90J39o7r7m34j60
4400b94K28k2Q0K10K87o09o0J4P9L6l96N99J56Nl59L08m14k04K23j74N77k0j45
4423A05j29J56k28l57L70K76J09l47K03j37o17O38k76P7K24K36j37j10q3M9l50
4444c28K86r1N91J4m82L1j72K35m03p7N68N4k3l42J62j80L10n43J87M23J71k88
4466A03P2n65J12p5J49K27J08K27l18j2j55k2m01L74J97J50ll93J62p8j16R8J86
4489B7J95J66l59J14o5l04j80M89l8oK10M0k84m6j95J15K94J95k55P4O5m32K23
$$ plain form
4333 25 511 484 51 -56 -47 -569 -344 -39 114 105 407 413 37 103 145 -76 -199 -324 -133 299 46 -60 -222
4356 -222 -302 -280 -265 279 259 366 73 -124 -253 -97 -286 -197 155 516 31 105 273 -273 -60 -4 -254 151
4378 151 29 285 -415 76 -135 -16 -283 -39 449 -29 -1 -275 -542 -168 -146 -165 325 464 397 300 -134 -294
4400 -294 -66 -88 -8 202 489 -120 -180 -166 -87 -51 -447 152 308 313 -46 262 -152 -356 -133 -307 270 250 105
4423 105 -24 132 -96 -453 -83 193 302 -45 158 21 -596 42 -234 -157 67 303 166 56 -27 22 -328
4444 -328 -42 -133 458 472 -10 21 -151 84 -319 -396 172 226 203 -139 23 -157 153 -390 -203 220 391 103
4466 103 175 -390 -278 -353 -204 23 131 358 40 28 -127 -149 -550 -176 21 171 168 -225 -63 -141 -257 -159 27
4489 27 222 388 29 143 78 -226 -406 83 45 39 249 289 5 -41 -236 -121 173 368 113 187 252 -180 43
4512D3ml11J64J05L25l47J46k56k56L36n3J90K44k37P7j04k54j1m5L72KL17n78
4535a35K89l78Q0j28j30M57jJ13j01j01L6m61K47L25r6J10j54J32%l82j08K50
4557a36M19k55O17m11m18j2j21J37K17M8K79j97P0j60J17m76J80L91o74O56L05
4578E76l80k83np07O72K84m0j12K4j25Lk2l16J73M12j84J70J36m04j30M52l75
4600a81J15j18L85J79j16j53m38J46k44L91J70p3l86P01k34l39P8R2o4K9K20n0
4622A10j7l8k21o9L09R8K3Q6j68k22o5n7O1P2p7K89K54j93L5r37L59P64m56j54
4646b14M36j25j32m75J24M08J1k58M73k87K79j26k53m6j6K78J14o0l6J58l47k63
4668c57R3J12K65n5j5J61m43l28L13oK48M4K79Q0m22j3m08K72J93l08N69M0j94
$$ plain form
4512 43 39 -272 -108 -3 322 -25 121 -135 -391 -55 -108 82 326 89 166 62 -192 -203 -248 124 126 443 -135
4535 -135 154 -224 -144 -272 -402 55 54 167 66 -35 1 -460 -213 112 16 126 -28 104 104 -278 -386 -136
4557 -136 283 28 645 234 -184 -196 -317 -180 37 85 364 167 237 77 194 -282 -102 289 -385 271 576
4578 576 196 -87 -92 -799 -127 157 117 5 29 -96 -93 -115 -431 -258 154 -30 140 276 -128 -258 194 -181
4600 -181 -66 -184 201 380 264 111 -327 -181 -425 -34 136 63 -323 378 144 -195 -117 -25 -89 -60 160 110
4622 110 93 55 -166 -235 74 172 195 281 113 -109 -174 -231 -170 -98 -175 114 368 175 210 -727 -368 396 -60 -214
4646 -214 222 97 -35 -510 -386 22 33 -225 248 -39 240 114 -139 -185 -201 77 191 131 95 253 -94 -357
4668 -357 -264 -152 113 58 43 204 -239 -567 -254 -260 -12 32 311 391 -31 -44 -452 -180 13 -295 274 314 120
4691A20o7j88l94O70l71O53l45L8Q2j75l13N9O0N7K25R2J21m11K55j24k75K85
4713E4m08L02P35q19J78l70J76j09L32J10n2kl6j04k88K21l2N4K27L61m71r6j33
4736a70j07K52J66l06N29k21mj17j23m21P35k28K65N2O8n35K09j36k10J39R3K91
4758B21j10QJ65n46K47O2L6j42k9M74j56k80J3k13J33J22K1K37K4K0m21L7j24
4781b01K31n6J58j38P2R9m16K11q8J73j00K83R5k78r8j8j79K56l99N78p7L31p45
4804c06K47M8k99NK13O16m64K71j68p15M72l31L88j70L16L2J11l20K74r5o4J08
4826A69o6K84K6l00l5k80J33n6K41J15J41j89J4j10l39J9J52K17j04j07J50l1
4848D4n44M18R5j1L79j06p1j27k02n3p1J67J11J53o8k5k60O8K53p10L54N78l80
$$ plain form
4691 120 53 -135 -529 141 -230 423 78 116 198 23 -290 -231 -171 -114 111 203 324 -87 168 44 -231 54
4713 54 -354 -52 683 -136 42 -328 -152 -261 71 181 129 127 91 -13 -301 -80 -112 -58 169 530 59 -37 -170
4736 -170 -277 -25 141 -165 364 143 139 22 -101 -522 213 -15 250 302 370 -165 44 -92 -302 -163 -70 221
4758 221 111 119 284 -262 -15 47 83 -59 -88 386 230 -50 -37 -250 -117 5 26 263 287 307 -114 -77 -201
4781 -201 30 -26 132 -6 66 165 -251 -40 -128 45 -55 228 323 45 -53 -71 -250 6 -393 185 108 439 -306
4804 -306 -59 -11 -310 -305 -92 524 60 331 163 -552 -80 -411 -23 -193 123 155 266 -54 220 125 61 169
4826 169 103 387 413 113 78 -202 -69 -125 116 231 372 183 197 87 -252 -233 -81 136 32 -75 75 44
4848 44 -500 -82 13 2 381 275 204 77 -125 -178 -249 -82 29 182 114 89 -171 -103 150 -560 -206 372 -8
4871hL9K1q0j21n74O88L05k96R8k34N3jq5l04P51Jm3p0p1N4j72J28m03K81J88
$$ plain form
4871 -8 31 52 -28 -149 -723 -35 270 -26 72 -162 -109 -110 -195 -499 252 253 210 140 69 123 -49 79 -324 -43 145
$$ [...]
8191i
##END NTUPLES=NMR FID
##END=
