##TITLE=1H_DE-63_ost
 D2O
 8 sc, 
 25.12.2024
##JCAMPDX= 6.0         $$ Bruker NMR JCAMP-DX V2.0
##DATA TYPE= NMR FID
##DATA CLASS= NTUPLES
##ORIGIN= UXNMR, Bruker Analytische Messtechnik GmbH
##OWNER= root
$$ XWIN-NMR		Version 3.5
$$ Wed Dec 25 14:08:12 2024 Russian Standard Time (UT+4h)  she@DPX200
##.OBSERVE FREQUENCY= 200.1315
##.OBSERVE NUCLEUS= ^1H
##.DELAY= (6, 6)
##.ACQUISITION MODE= SIMULTANEOUS
##.ACQUISITION SCHEME= undefined
##.AVERAGES= 8
##.DIGITISER RES= 18
##SPECTROMETER/DATA SYSTEM= spect
##.PULSE SEQUENCE= zg30
##.SOLVENT NAME= D2O
##.SHIFT REFERENCE= (INTERNAL, D2O, 0, 15.7039)
##AUDIT TRAIL= $$ (NUMBER, WHEN, WHO, WHERE, WHAT)
$$ ##TITLE= Audit trail, XWIN-NMR		Version 3.5
$$ ##JCAMPDX= 5.01
$$ ##ORIGIN= Bruker BioSpin GmbH
$$ ##OWNER= she
$$ F:/spectra/data/she/nmr/H-F/1/audita.txt
$$ ##AUDIT TRAIL=  $$ (NUMBER, WHEN, WHO, WHERE, WHAT)
(   1,<2024-12-25 14:07:13.14 +0400>,<she>,<DPX200>,
      <created by zg, POWCHK disabled, PULCHK disabled
       configuration hash MD5:
       00 E9 B6 7A A2 85 ED C7 34 08 36 98 17 FE 4E 26
       data hash MD5: 16K
       CF 6D F6 92 AB 93 D5 CB F3 B4 9A 1F B6 33 73 3C>)
$$ ##END=
$$ 
$$ hash MD5
$$ 02 4A 33 D8 3D 43 6C 50 2B 45 74 C2 1B 78 A0 ED
##$RELAX= 
##$RELAX= 
##$RELAX= 
##$RELAX= 
##$RELAX= 
##$RELAX= 
$$ Bruker specific parameters
$$ --------------------------
##$DU= <F:/spectra>
##$EXPNO= 1
##$NAME= <H-F>
##$PROCNO= 1
##$TYPE= <nmr>
##$USER= <she>
##$AMP= (0..31)
100 100 100 100 100 100 100 100 100 100 100 100 100 100 100 100 100 100 
100 100 100 100 100 100 100 100 100 100 100 100 100 100 
##$AQSEQ= 0
##$AQ_mod= 1
##$AUNM= <au_zg>
##$AUTOPOS= <>
##$BF1= 200.13
##$BF2= 200.13
##$BF3= 200.13
##$BF4= 200.13
##$BF5= 200.13
##$BF6= 200.13
##$BF7= 200.13
##$BF8= 200.13
##$BYTORDA= 1
##$CFDGTYP= 0
##$CFRGTYP= 5
##$CHEMSTR= <none>
##$CNST= (0..31)
1 1 145 1 1 1 1 1 1 1 1 1 1 1 1 1 1 1 1 1 1 1 1 1 1 1 1 1 1 1 1 1 
##$CPDPRG= <>
##$CPDPRG1= <>
##$CPDPRG2= <>
##$CPDPRG3= <>
##$CPDPRG4= <mlev>
##$CPDPRG5= <mlev>
##$CPDPRG6= <mlev>
##$CPDPRG7= <mlev>
##$CPDPRG8= <mlev>
##$CPDPRGB= <>
##$CPDPRGT= <>
##$D= (0..31)
0 1.2 0 0 0 0 0 0 0 0.06 0 0.03 0 0 0 0 0.0002 0 0 0 0 0 0 0 0 0 0 0 0 
0 0 0 
##$DATE= 1735121232
##$DBL= (0..7)
120 120 120 120 120 120 120 120 
##$DBP= (0..7)
150 150 150 150 150 150 150 150 
##$DBP07= 0
##$DBPNAM0= <>
##$DBPNAM1= <>
##$DBPNAM2= <>
##$DBPNAM3= <>
##$DBPNAM4= <>
##$DBPNAM5= <>
##$DBPNAM6= <>
##$DBPNAM7= <>
##$DBPOAL= (0..7)
0.5 0.5 0.5 0.5 0.5 0.5 0.5 0.5 
##$DBPOFFS= (0..7)
0 0 0 0 0 0 0 0 
##$DE= 6
##$DECBNUC= <off>
##$DECIM= 24
##$DECNUC= <off>
##$DECSTAT= 4
##$DIGMOD= 1
##$DIGTYP= 9
##$DL= (0..7)
0 120 120 120 120 120 120 120 
##$DP= (0..7)
150 150 150 150 150 150 150 150 
##$DP07= 0
##$DPNAME0= <>
##$DPNAME1= <>
##$DPNAME2= <>
##$DPNAME3= <>
##$DPNAME4= <>
##$DPNAME5= <>
##$DPNAME6= <>
##$DPNAME7= <>
##$DPOAL= (0..7)
0.5 0.5 0.5 0.5 0.5 0.5 0.5 0.5 
##$DPOFFS= (0..7)
0 0 0 0 0 0 0 0 
##$DQDMODE= 0
##$DR= 18
##$DS= 0
##$DSLIST= <SSSSSSSSSSSSSSS>
##$DSPFIRM= 0
$$ [...]
##$SUBNAM2= <"">
##$SUBNAM3= <"">
##$SUBNAM4= <"">
##$SUBNAM5= <"">
##$SUBNAM6= <"">
##$SUBNAM7= <"">
##$SUBNAM8= <"">
##$SUBNAM9= <"">
##$SW= 24.0689530833862
##$SWIBOX= (0..15)
0 0 2 0 0 0 0 0 0 0 0 0 0 0 0 0 
##$SW_h= 4816.95568400771
##$TD= 16384
##$TD0= 1
##$TE= 0
##$TE2= 300
##$TE3= 300
##$TEG= 300
##$TL= (0..7)
0 120 120 120 120 120 120 120 
##$TP= (0..7)
150 150 150 150 150 150 150 150 
##$TP07= 0
##$TPNAME0= <>
##$TPNAME1= <>
##$TPNAME2= <>
##$TPNAME3= <>
##$TPNAME4= <>
##$TPNAME5= <>
##$TPNAME6= <>
##$TPNAME7= <>
##$TPOAL= (0..7)
0.5 0.5 0.5 0.5 0.5 0.5 0.5 0.5 
##$TPOFFS= (0..7)
0 0 0 0 0 0 0 0 
##$TUNHIN= 0
##$TUNHOUT= 0
##$TUNXOUT= 0
##$USERA1= <user>
##$USERA2= <user>
##$USERA3= <user>
##$USERA4= <user>
##$USERA5= <user>
##$V9= 5
##$VALIST= <valist>
##$VCLIST= <CCCCCCCCCCCCCCC>
##$VD= 0
##$VDLIST= <DDDDDDDDDDDDDDD>
##$VPLIST= <PPPPPPPPPPPPPPP>
##$VTLIST= <TTTTTTTTTTTTTTT>
##$WBST= 1024
##$WBSW= 4
##$XGAIN= (0..3)
0 0 0 0 
##$XL= 0
##$YL= 0
##$YMAX_a= 152619
##$YMIN_a= -194853
##$ZGOPTNS= <>
##$ZL1= 120
##$ZL2= 120
##$ZL3= 120
##$ZL4= 120
##$ABSF1= 10
##$ABSF2= 0
##$ABSG= 5
##$ABSL= 3
##$ALPHA= 0
##$AQORDER= 0
##$ASSFAC= 0
##$ASSFACI= 0
##$ASSFACX= 0
##$ASSWID= 0
##$AUNMP= <proc_1d>
##$AZFE= 0.1
##$AZFW= 0.1
##$BCFW= 1
##$BC_mod= 2
##$BYTORDP= 1
##$COROFFS= 0
##$CY= 11.3945322036743
##$DATMOD= 1
##$DC= 2
##$DFILT= <>
##$DTYPP= 0
##$F1P= 15.6554695791079
##$F2P= 12.8336369535428
##$FCOR= 0.5
##$FTSIZE= 0
##$FT_mod= 4
##$GAMMA= 1
##$GB= 0.15
##$INTBC= 1
##$INTSCL= 1
##$ISEN= 128
##$LB= 0.24
##$LEV0= 0
##$LPBIN= 0
##$MAXI= 10000
##$MC2= 0
##$MEAN= 0
##$ME_mod= 0
##$MI= 1.114404
##$NCOEF= 0
##$NC_proc= 0
##$NLEV= 6
##$NOISF1= 3.799351
##$NOISF2= 2.8
##$NSP= 1
##$NTH_PI= 0
##$NZP= 0
##$OFFSET= 15.70392
##$PC= 1
##$PHC0= -26577.22
##$PHC1= 13.78744
##$PH_mod= 1
##$PKNL= yes
##$PPARMOD= 0
##$PSCAL= 0
##$PSIGN= 0
##$REVERSE= no
##$SF= 200.130013532006
##$SI= 16384
##$SIGF1= 3
##$SIGF2= 2
##$SINO= 400
##$SIOLD= 16384
##$SREGLST= <1H.CDCl3>
##$SSB= 0
##$STSI= 0
##$STSR= 0
##$SW_p= 3612.71676300578
##$SYMM= 0
##$S_DEV= 0
##$TDeff= 0
##$TDoff= 0
##$TI= <>
##$TILT= no
##$TM1= 0
##$TM2= 0
##$TOPLEV= 0
##$USERP1= <user>
##$USERP2= <user>
##$USERP3= <user>
##$USERP4= <user>
##$USERP5= <user>
##$WDW= 1
##$XDIM= 8192
##$YMAX_p= 0
##$YMIN_p= 0
$$ End of Bruker specific parameters
$$ ---------------------------------
##NTUPLES= NMR FID
##VAR_NAME=  TIME,          FID/REAL,        FID/IMAG
##SYMBOL=    X,             R,               I
##VAR_TYPE=  INDEPENDENT,   DEPENDENT,       DEPENDENT
##VAR_FORM=  AFFN,          ASDF,            ASDF
##VAR_DIM=   8192,          8192,            8192
##UNITS=     SECONDS,       ARBITRARY UNITS, ARBITRARY UNITS
##FACTOR=    0.0002076,     1,               1
##FIRST=     0,             0,               0
##LAST=      1.7004516,     0,               0
##MIN=       0,             -194853,         0
##MAX=       1.7004516,     152619,          0
$$ Real data points
##PAGE= N=1
##DATA TABLE= (X++(R..R)), XYDATA
0@%%%%%%%%%%%Qj6J6j6J6j7K5l2L3m0M7n5O3p1Q3r3J05j19J35j53J72j94K18k42
35a27K68k98L31l68M07m50N00n54O13o78P53q37R31j042J170j321J504j729K015
54A088k388K902l661M894p237J3248o0039j43660M1641J10252O8512L1262O6207
67A23021K9598r0236j55000o0511O7477R3164L7393J9275L2221l805r2496j15551
79a15450k4975P6049P6099K6981K3125L9128j8291j06718j01670J116O9750N7857
91C001M2065N3437K2869o3309j11537o1130K1989O0893O1824N3971K7436l3656
103G7853q8218q2946k1962M1695O7379O0889L7773r77n3933q3357n4161P467M4611
116d7887M8474M8745M1444n428o4664o9907k3252J3240K2331M1625O3686L5230
$$ plain form
0 0 0 0 0 0 0 0 0 0 0 0 0 8 -8 8 -8 8 -9 16 -16 17 -23 24 -31 32 -39 44 -49 56 -63 72 -81 91 -103 115 -127
35 -127 141 -157 174 -194 213 -237 263 -291 322 -356 397 -440 491 -551 619 -702 802 -927 1088
54 1088 -1300 1602 -2059 2835 -4402 8846 -51193 -194853 -153212 -42960 25552 56814 123021
67 123021 152619 62383 -92617 -153128 -85651 7513 44906 64181 96402 92597 101 -115450
79 -115450 -140425 -64376 11723 38704 61829 100957 82666 -24052 -125722 -124606 -54856 3001
91 3001 45066 98503 121372 58063 -53474 -114604 -92615 -31722 30102 84073 111509 77853
103 77853 -10365 -93311 -115273 -73578 -6199 54690 92463 91486 37553 -45804 -99965 -92498 -47887
116 -47887 587 49332 90776 85348 20684 -49223 -72475 -59235 -36904 4721 68407 103637
128A03637l6553p6583n4453j4529R617L4705O5510O3422O564o0921q0104m6879
140h6567j745K7791N0046O5679M6503j7581p5041o9389j7135J9029K8714M5948
152A6252N8336K2222m6801p4776m0226L17J4651K9066N5738M8620m114n5826n9262
165c5803k9609k894J6874M1820N7089L4833j8001n6819n1176k0471O339K5687
177c2131M7375N2733J5744m0295o1513l6406o782J0754L2495N5830M1966j1695
189F8075n1988m7867k3693o207J4855M4031N3277K1353k5226m5224l7075j8319
201e4008M88K4415M7900M3419N189l5287m5111k8935j1765N047L2378N2818L4304
214G0852j3510m4035l6991k1603j1356J1040M4804M9764J4625k6686l7248k7795
$$ plain form
128 103637 67084 -9499 -63952 -78481 -68864 -34159 31351 94773 101337 40416 -39688 -86567
140 -86567 -88312 -60521 -10475 55204 101707 84126 9085 -60304 -77439 -58410 -29696 16252
152 16252 74588 96810 50009 -24767 -64993 -64676 -50025 -20959 34779 83399 79285 23459 -35803
165 -35803 -65412 -68306 -51432 -9612 47477 82310 64309 7490 -43686 -64157 -57818 -32131
177 -32131 15244 67977 83721 43426 -18087 -54493 -61275 -50521 -18026 37804 79770 68075
189 68075 16087 -31780 -55473 -61680 -46825 -2794 50483 71836 46610 1386 -35689 -54008
201 -54008 -53520 -29105 18795 62214 67403 32116 -12995 -41930 -53695 -48648 -16270 36548 70852
214 70852 57342 13307 -23684 -45287 -56643 -45603 -799 48965 63590 36904 -344 -28139
226b8139j9664m592K4920M8945L7668k273l1740l4845k5506j5766M424L4719M9461
239C7612K5812j5956l5789l0484k1676j2949J2901M4296M3755Q042k5604l1173
251a213k3745j9556m765K6375M7800K9312p519k7674k7110k2486j7022N189L5793
264f621M3238J7300j5904k7223k4381k2407j3419J4317M1255L6694L556k1261
276B5144k3529k2550k1602m993K8465M3941K3733q659k2525k2675k3752j8776
288d7778Q352L8020L8322J0217j4665k1740k2288k3608j1959J9293L9533K7490
300C9189j209j7053j8670k0964k2329j682K9204L8509J6295r604j6070j7865k4401
313b6650j8490J0057L6641L1950N876j1586j5293k0836k5815j0159K0602L6943
$$ plain form
226 -28139 -47803 -52395 -27475 21470 59138 56865 25125 -9720 -35226 -50992 -46568 -11849 37612
239 37612 63424 47468 11679 -18805 -40481 -53430 -40529 3767 47522 55564 29960 -1213
251 -1213 -24958 -44514 -49279 -22904 24896 54208 46689 19015 -8095 -30581 -47603 -42414 -6621
264 -6621 36617 53917 38013 10790 -13591 -35998 -49417 -35100 6155 42849 46405 25144
276 25144 1615 -20935 -42537 -47530 -19065 24876 48609 39950 17425 -5250 -29002 -47778
288 -47778 -39426 -1406 36916 47133 32468 10728 -11560 -35168 -47127 -27834 11699 39189
300 39189 37980 20927 2257 -18707 -41036 -42718 -13514 24995 41290 31686 15616 -2249 -26650
313 -26650 -45140 -35083 1558 33508 39384 27798 12505 -8331 -34146 -44305 -23703 13240
325A3240K2254k452j3013j6471k2565k1272J609K9298L3196J2080p533j3340j8256
338c225k4215j4259J2575L2968K5884M355q377j3786k1499k3444n460K0926L0124
351A2567J7243k13q848j6734k4045j7598N360K6532K5371J0009k288j1003k0672
364d319k4732r542J5755K7614J9423N484l335j3599k4785k1593K8K2207K3366
377A1972J1966K713m591j7886k6311j4692J1015K4436J7937P550J554q134k2642
390e113k5328n172J8307K3255J3464N807L88j2634k6164k0157M417K1450J8772
403A1292R211M299l139j7956k6047j1496J2318K1384J4317P371L092p842k3311
416f507k2489k345J7168J9058J1472P170J256j4000k5237j6287O129J8586J4997
$$ plain form
325 13240 35494 33042 20029 3558 -19007 -40279 -38670 -9372 23824 35904 28371 15031 -3225
338 -3225 -27440 -41699 -29124 3844 29728 34083 25706 11920 -9579 -33023 -38483 -17557 12567
351 12567 29810 29597 20749 4015 -20030 -37628 -32268 -5736 19635 29644 27356 16353 -4319
364 -4319 -29051 -38593 -22838 4776 24199 29683 26348 12749 -12036 -33629 -33601 -11394 11972
377 11972 23938 26651 22060 4174 -22137 -36829 -25814 -1378 16559 24109 25663 17529 -5113
390 -5113 -30441 -35613 -17306 5949 19413 25220 25608 12974 -13190 -33347 -28930 -7480 11292
403 11292 20503 24802 21663 3707 -22340 -33836 -21518 -134 14183 21554 24646 16804 -6507
416 -6507 -28996 -31341 -14173 4885 16357 23527 24783 10783 -14454 -30741 -24612 -6026 8971
429H971R326O178l403j9888k3856o868J2254J7173J1997Q903L804j0245k3228
442h882j8733J176J5010J4343J0862R242L70j5711k4061j0988P308J4956J1653
455F545J0035P865m874k0888k0642l581J1942J2717J0371J0411M254j1459k2909
468a0213j5521L627J2596J0892J0911J0092m52j6885k1252q036P322J1867J0018
481D966J1086P428o683j9888j7247j587R708J0580J0076J1039L678j3083k0835
494a0762j1606M013R539R022J1414J0664k618j7445j7922m966O300Q530R751J2274
508A6188O187q123j8724j3276l21O907Q021J1199J1601J397j3120j8947p950L258
522a5703O828Q003J2569J0084m521j7547j4167k536M201N468J0683J3346M703
$$ plain form
429 8971 18297 24475 21072 1184 -22672 -29540 -17286 -113 11884 20787 24591 14346 -8882
442 -8882 -27615 -26439 -11429 2914 13776 23018 23388 7677 -16384 -27372 -20064 -5108 6545
455 6545 16580 24445 19571 -1317 -21959 -25540 -13598 -881 9490 19901 24155 12696 -10213
468 -10213 -25734 -22107 -9511 1381 12292 22384 21932 5047 -16205 -24241 -16919 -5052 4966
481 4966 16052 23480 16797 -3091 -20338 -21925 -12217 -1637 8439 19478 23156 10073 -10762
494 -10762 -22368 -18355 -8816 206 11620 22284 19666 2221 -15701 -20667 -14367 -5837 3914 16188
508 16188 22375 14252 -4472 -17748 -18069 -11162 -3141 8058 19659 21056 7936 -11011 -18961 -15703
522 -15703 -8875 -872 11697 21781 17260 -287 -14454 -16990 -12789 -7321 3362 16708 21411
535B1411j0472j6746r599j77M329P518J2391J0704o73j3759j5030n781J726M883
549i275P993J3739Q776o795j6088j1164j546K141M302J1507J3876K229j2098j4474
563f877n618p33J600P644J3753R549l504j3288j1008m241J3L093R046J3657O034
578A9120p579j3684q473j655N45L517J2007J3384J007j2190j1769m716j593n57
592a2636Q022J5242Q745o156j1993q271m151k210L267J1760J2122L198q229j0988
606b278o691j912p02M873J1879J0815j166j1274q548l345k284j420Q036J4620
620A0603O688o844r870m890m211m956K714J3127J1715J005p970q024n693n472
634a2078j254P320J3036Q509k684r693p886l669l078P88Q976J3140M088p388r121
$$ plain form
535 21411 10939 -5807 -15406 -15583 -11254 -3736 8655 19359 18686 4927 -10103 -15884 -14158 -9275
549 -9275 -1282 12457 21233 14438 -1650 -12814 -14360 -12219 -7917 3590 17466 19695 7597 -6877
563 -6877 -12495 -13228 -11628 -3984 9769 19318 15814 2526 -8482 -12723 -12710 -9617 -571 13086 19120
578 19120 11541 -2143 -10616 -12271 -11726 -8209 3798 17182 18189 5999 -5770 -10486 -12079 -12636
592 -12636 -4614 10628 19373 13217 1224 -7047 -11198 -13408 -10141 1619 13741 16939 8710 -2278
606 -2278 -8969 -10881 -11583 -6710 5169 15984 14818 3544 -5004 -8349 -10633 -12053 -4017 10603
620 10603 17291 10447 577 -4313 -8524 -13480 -10766 2361 14076 15081 7111 -913 -6606 -12078
634 -12078 -13332 -6012 7024 15533 12849 3156 -4730 -8399 -11477 -10689 -1713 11427 15515 8127 -994
649i94l409l209m300L077J2088J0032j824p262m124m537o120j506P302J1320N788
664A2322k449n762n873n880m468J513R405J0642M360n393p141n031n456l914N386
679g739J2705Q068k610o104m007n060p440J32J0256J0524K114m149l295l937p143
694g685m372M120R766O861N31k735l742n194o416k972N218J1232N945j964l955
709D638k926n385q293n94J0761J0789J288m145k328l454q570n122N988J0860N578
724I085m86k940l668n207o501n98O753Q744M493k492l873k922m452n771M70Q402
740i63Q559O06l139j563l268p102m439M610R405M364j85q28k582o671o324K41
756i279O370P278K846P18k725m841o624l636K075P406O584J432j379l061m598
$$ plain form
649 -994 -4403 -7612 -11912 -8835 3253 13285 11461 4199 75 -4462 -10582 -12088 -4786 6534 12322
664 12322 9873 4111 -1762 -7642 -12110 -10597 -1192 9450 13810 8417 1276 -3755 -9211 -13125 -7739
679 -7739 4966 13034 10424 4320 313 -4747 -12187 -12055 -1799 8725 10839 6690 3395 -542 -7685
694 -7685 -12057 -7937 1829 8690 9221 6486 2744 -2450 -8866 -11838 -6620 4612 10557 8593 4638
709 4638 1712 -3673 -11966 -12560 -1799 8990 10278 6133 3805 351 -8219 -13341 -7353 3507 9085
724 9085 8599 5659 1991 -3216 -9717 -10315 -3562 5182 9675 7183 3310 388 -4064 -9835 -9365 -963
740 -963 7596 8202 5063 3500 232 -6870 -11309 -6699 2706 7070 6885 6057 3475 -3196 -9520 -9279
756 -9279 -2909 4369 7215 7933 5208 367 -6257 -9893 -7818 -412 6172 7604 6225 3164 -1434
771a434o803j596N655P298K949j44o07j973p682n188K540O016M315J506J420j6
787F256n702p163k079L456N292L993K128O14k237n930o858j210N800O162K583
802E105R39O37l564p635n420K823O867M029J183J078k71o130p345q18M583N343
818A404K045K002P79k837n869n072N27M280M365K374J121O08l290o802l848K523
834e690N084K863J527K204l30n950o777n94M207L909K149K774J287l109o936l940
850g322J476M210L091K250K217k90m829n728j988K254M388K250J812J922q00o205
866a292m966m0L970K250K196K928J373l884n912k995J349L181K182L030K897j280
882D987m770n086j197K344K616K423K711K065k517n384m034Q50K577K065K142
$$ plain form
771 -1434 -8237 -9833 -4178 3120 6069 5925 5318 3345 -4337 -9525 -6985 -969 3346 4852 6272 6256
787 6256 554 -6609 -8688 -5232 60 4053 6181 6795 4558 -1372 -8230 -9440 -3640 2522 5105
802 5105 6044 6681 3117 -4518 -9938 -7115 -248 3781 4964 6042 5771 -359 -7704 -8522 -3939 1404
818 1404 3449 5451 6230 3393 -2476 -7548 -7021 -2741 1624 3998 5119 5727 2437 -4365 -8213 -5690
834 -5690 -606 2257 3784 5988 5658 -292 -7069 -7663 -3456 453 2602 5376 6663 3554 -3382 -7322
850 -7322 -5846 -1636 1455 3705 5922 5632 803 -4925 -6913 -4659 -271 1979 3791 5713 4913 -1292
866 -1292 -6258 -6298 -2328 -78 2118 5046 6419 2535 -3377 -6372 -5023 -1842 340 3370 6267 4987
882 4987 217 -4869 -6066 -3722 -1106 1317 4028 6093 3576 -1808 -5842 -4992 -2415 -350 1792
897A792L602Q25m692n257j724J724J836J671L266L253j580n394l646k78J407J514
913a681K561L626J635l478n105k273O21J584J676K628L395k9m161m398q99J151
929c147J046J944L480K654j589n652l016Q67L68R66L082L774R20l431m635j361
945c730L39P50J585L191L409q56m193l526q50R07O67K468L712J618k406m070k470
962c455L55J6J101L228L709l11l438k961j357J9O3K141L687K274j536l618k294
979b377p45J76N10K589L785R93k613l296j589m01k18J343L527K990q22k891k914
996a953o01l17%K224L271K059j947l143j596n53m93P69K981L251O2k190k683j321
1014b180q18n1J380L399K364r51k560j977r33m00j66K397L360Q59j349k368j397
$$ plain form
897 1792 5394 6219 1527 -3730 -5454 -3730 -1894 -223 3043 6296 4716 -678 -4324 -4602 -3195 -1681
913 -1681 880 4506 6141 2663 -2442 -4715 -4094 -2510 -834 1794 5189 5160 999 -3399 -4298 -3147
929 -3147 -2101 -157 3323 5977 4388 -1264 -4280 -3413 -3045 -2079 1003 4777 5697 2266 -2369 -3730
945 -3730 -3391 -2641 -1056 2135 5544 4688 495 -3031 -3881 -2974 -2307 161 3873 5491 3085 -985 -3455
962 -3455 -3100 -3084 -1983 1245 4954 4643 1205 -1756 -3113 -3094 -3031 -890 2797 5071 3535 -83 -2377
979 -2377 -3122 -2946 -2436 153 3938 4931 2318 -978 -2567 -2968 -3186 -1843 1684 4674 3852 961 -1953
996 -1953 -2554 -2871 -2871 -647 2624 4683 2736 -407 -2003 -2556 -3049 -2280 701 3952 4014 1824 -859 -2180
1014 -2180 -2998 -3049 -1669 1730 4094 3143 583 -1394 -2327 -2727 -2893 -496 2864 3723 2374 6 -1391
1031a391j075p68J140L092K643q17j469j701j223j230m34K215L170J408j241j687
1047F32j229j236j524N69L089K652L09j459j921o32j734q57J557L198K072j073
1063B413j575j112j016j911N5K724K648J021j356j630n95j233j631P53K703K851
1079C109j76j652j156q84j465j166J693L158J411n06j564q44j333j659L49K340
1095c45K437L33r74r48j024j620j083J653K572J567n05p54j121j009j645m34J841
1112a059K599J154p13p47q82j635j301M87K100J953K13o86m97j178j859o71J316
1129a406K454J012K0p10j091j281j658J70J872K086K73j72n12p31k029j143R32
1146a914K283J444j03k51n23j044k216l27J710J787O63K58k76n33j896j937O75
$$ plain form
1031 -1391 -2466 -3234 -2094 998 3641 2824 1355 -346 -1569 -2799 -3233 -1018 2152 3560 2319 632
1047 632 -597 -1833 -3357 -2788 301 2953 3262 1803 -118 -750 -2484 -3341 -1784 1414 3486 2413
1063 2413 838 -274 -1290 -3201 -3146 -422 2226 3247 1891 261 -334 -1567 -3198 -2445 258 3109
1079 3109 2933 1281 125 -759 -2224 -3390 -1697 1461 2872 2366 802 -42 -1375 -3034 -2685 -345
1095 -345 2092 2425 1451 503 -521 -2141 -3224 -1571 1001 2568 2063 1309 188 -821 -2466 -2900 -1059
1112 -1059 1540 2694 1981 1234 352 -1283 -2584 -2097 3 1956 2169 1483 986 -192 -2051 -2722 -1406
1129 -1406 1048 2060 2080 1370 279 -1002 -2660 -2490 -618 1468 1741 1569 1057 326 -1703 -2846 -1914
1146 -1914 369 1813 1710 1459 936 -108 -2324 -2651 -941 846 1509 1767 1491 958 -938 -2875 -2200
1163b200K161J094Q33j04j29j376j852j149J118K161Q39J20O4l27j769k022J61
1180b377J850J313N36j96L96j035j723j148R48J413N29M42R64l67j687j279r08
1197b329J380J240P41J69K7k52j649j598N56J512J208M1K40M00j054j981p10J118
1215i41J362L38K67O47m8j809j363j11R42R40N35M15N86j134j688o34J76R20J288
1234F88L51N84j46j288j519n16R91J114K28N64R14j014j629r20L63P56N53N12
1252E86O75K86j118j469j93j58J219L79R25M37l02j136j535m50J281L14O04Q32
1270A177M56j000j284j037M46P44K19M38R79M82j268j253l03M78K15O85R16L42
1288A432m01j177j050k23Q88K63L30O64O43l69j678n86J08R35J93K29Q94M00j130
$$ plain form
1163 -2200 -39 1055 1888 1784 1655 279 -1573 -2722 -1604 557 1396 1516 1580 1253 -516 -2538 -2377
1180 -2377 -527 786 1322 1126 1522 487 -1236 -2384 -1436 -23 506 948 1912 1545 -142 -1421 -2329
1197 -2329 -949 291 1032 1201 1228 976 -673 -2271 -1715 -203 1005 1046 1286 1686 632 -1349 -2059 -941
1215 -941 421 759 1026 1673 1625 -184 -1547 -1658 -716 224 759 1174 1760 626 -1062 -1696 -1520 -600 688
1234 688 1039 1623 1477 189 -1330 -1846 -855 259 487 1051 1965 951 -678 -1598 -1235 -479 74 586
1252 586 1261 1547 429 -1040 -1233 -1391 -172 207 1132 1569 1267 131 -1404 -1854 -573 -259 345 1177
1270 1177 1633 633 -651 -1688 -1242 -498 -279 159 1138 1620 352 -901 -1204 -726 -511 174 1090 1432
1288 1432 1031 -146 -1196 -1419 -531 -268 62 726 1369 1000 -678 -1264 -1156 -221 -28 201 1095 1495 365
1307C65j510KN49q1M58R41Q62q88j023p16J25L70L36N65P44j73k11j569k63L49
1327g68M3N57R43Q19r9j299j332P6O18k03L94J414M05r51j007m45J20k79K94J009
1347C09J204m90r19m83l23J03r6N54Q49M23n89m04r84M99r2k78P17J053J91q40
1367D04o51o9M4m45k67J325J074m51q58n73mm30J61P13O88P55n20j065l95j49
1387g13J04J45O74J085l21p18p36L94k45j17N0J115P98p30m90n48j6k53l08R68
1407A38P04J73n68j56p14p4m79N54Q11L54J12p16k97m63L0j50K88J156N23m38
1427G88r04r1M5o14j9R36L08L98o30l60K58o12l51M22R67L20k82m07j12l41l56
1448f37r7J54J078L59k78o52k67k18j00J57P99O83k14m96l49j54m50l06R42M99
$$ plain form
1307 365 -1145 -1143 -594 -675 -217 724 1586 698 -325 -1041 -916 -546 -210 355 1099 926 715 -854 -1117 -768
1327 -768 -725 -168 775 1594 1495 196 -1136 -1060 -442 -645 -251 1163 1568 617 -390 -835 -715 -994 -700 309
1347 309 1513 1023 104 -379 -702 -599 -695 -141 708 1131 542 138 -846 -347 -439 -717 0 1053 1244 404
1367 404 -247 -316 -272 -717 -984 341 1415 964 106 -467 -471 -901 -740 -27 661 1416 896 -169 -564 -713
1387 -713 -609 -464 210 1295 974 256 -480 -86 -331 -448 -398 717 1515 785 295 -253 -269 -522 -830 138
1407 138 842 1015 447 291 -423 -497 -976 -422 389 743 855 139 -158 -621 -591 -741 -453 703 1226 788
1427 788 -116 -207 -162 -776 -795 141 449 847 217 -143 115 -497 -848 -426 541 861 579 172 60 -281 -637
1448 -637 -734 -580 498 857 579 -73 -340 -558 -658 -501 298 981 767 271 -78 -232 -682 -988 -46 453
1468D53N96o87k77J22o13n06M70L96N96j79J85m39l13K36o42j38J141M41j62j66
1488E14m50N8n76l97M13R38P3l99J35l75m18r6L95J82N25k93N5J17n74k15l41
1509g29O72j2N69n7q4k67m2l83k97O80K22J10l54N09m66o53l73J92Q57L02p3k0
1531C03m8m08k68l56P65K47j00M22l40n4m05r5QK00L93L12l35j7k76o56L32J01
1553b75M32O4K21j66Nk66m28k05N99J14K42J02K13j74p69m25P6P56r2K78K20j62
1575C60j13n68n38P88K24Pj15O99m63n77l65N5N02K31p2N10k16k91l52k07L33
1596a68K48k34K74J93K42l93n48j77K78J47J21N05k05K36p44k5r3L34N3J04K65
1617D13j52j48n64J65nK48J83K60K74l60p17n5N7L79K03m5P2L7N9p19JL72M4j52
$$ plain form
1468 453 1049 362 85 207 -406 -912 -442 -46 550 371 556 117 -196 40 -602 -740 401 842 680 514
1488 514 64 122 -454 -851 -438 500 573 174 309 -66 -484 -580 -185 -3 522 229 284 401 -173 -388 -729
1509 -729 -57 -69 500 443 359 92 50 -333 -630 50 272 382 28 537 71 -582 -955 -763 94 396 323 303
1531 303 255 -153 -421 -777 -12 235 135 557 217 163 -242 -337 -329 -129 264 576 241 224 -52 -708 -376 -275
1553 -275 157 221 442 276 281 15 -413 -618 -19 95 337 439 652 478 -291 -716 -640 116 24 302 522 360
1575 360 247 -321 -859 -71 153 160 45 744 281 -296 -661 -606 -104 127 55 565 349 58 -294 -501 -168
1596 -168 80 -154 120 313 555 162 -386 -563 -285 -138 -17 488 283 519 -225 -250 -343 -9 44 148 413
1617 413 261 113 -451 -286 -291 -43 140 400 674 314 -403 -458 -401 -22 181 136 208 245 304 -415 -414 -42 2 -150
1641a50M84J85l27k32j52p7O28l06N1L38l43O3n27R0K22j48N51oo1J95l79k11
1663a12k32K17J16K21m35M09M7l61j30J8N21l03M4N43k65q9l08j02j7J3o3P04
1685D36o7l83j23o4k46r2M80m3J71L64q0k42l30lj06K99K00N28k05m20l13J90
1707d9j50l0L58P2M33j46n92j60K65O4l28K68J37J11j67k13m7K3j06k10O23J92
1729C48l95K34k69j32L13m64J20M74KK24l76l4p5j33n6L29J86J48n54m2R7N0J23
1752A18j16J08J4K77m42l8K40l59J40L3j24L80o2j57K05j84r4j82K46K75j54J17
1774B41n26J10K45J61n02J16O03r9m35Q6k98K18j12N12j46q8K58l91J58n26L5
1795c80O9K79K11k55K59n8K08m77j31J58K57Q1n64L25M5j99m5k58O32L02k21j49
$$ plain form
1641 -150 334 519 192 -40 -192 -269 359 53 104 442 99 162 -365 -275 -53 -201 350 344 283 478 99 -112
1663 -112 -344 -127 -11 210 -225 184 231 -130 -260 -242 279 -24 20 563 298 209 -99 -201 -218 -205 -268 436
1685 436 369 -14 -137 -201 -447 -539 -59 -102 69 433 353 111 -219 -222 -328 -29 171 699 494 74 -239 -49
1707 -49 -199 -229 129 201 634 488 -104 -264 1 65 -263 5 142 253 86 -127 -174 -151 -257 -467 156 348
1729 348 -47 187 -82 -214 99 -365 -245 229 231 455 79 45 -30 -163 -219 110 296 444 -110 -152 -55 -5 118
1752 118 2 110 124 401 -41 -79 161 -198 -58 -25 -149 231 169 12 217 33 -61 -243 3 278 124 241
1774 241 -285 -175 70 231 -271 -155 448 349 -86 0 -298 -80 -192 320 174 86 344 -47 111 -415 -380
1795 -380 -311 -32 179 -76 183 125 333 -144 -275 -117 140 221 -343 -18 27 -172 -217 -475 157 459 238 89
1817H9j80J43j08k3l77M84K39l69Q9j58J11j39N5K14J2K03l24O8K01l9m48L91
1839A34k37J88K15m71K07J01m13K99j19k9K74k30O2J45k49j34k29L68J03L99k03
1860A81k12K3Q4l7k29N20k72j4k3j86K26N5n10Q16m09K50j29P7j47j34J26N7k50
1883a37K73K3n9j86P2j57j92LR80q08J91L3l23O89o26m27O37o7q8L11J89j13m90
1906b72n3K78J7N4L6k72L61R8l62o1K09N7R3j88P3o7j2k73J42J00J55%R9j53L4
1931I3k43l9J06L91j24l45J29o4K6j71L52K28m13j0J26N27p88K31j68j55Q9M71
1953B49j49m3k3J8j16l08M95K0K70o26J07K26j45l76N44j58N2j22J91l17J17J30
1975C6J3r1K58j74K17k65p5P5j10r9j0K99K30j26l45K99m41L23p7R5P0p2j01M8
$$ plain form
1817 89 -91 52 -56 -79 -456 28 267 -102 -13 -171 -60 -199 -144 70 82 285 -39 29 230 191 -257 134
1839 134 -103 85 300 -171 36 137 -276 23 -96 -125 149 -81 -19 126 -123 -257 -486 -118 -15 384 181
1860 181 -31 -8 76 39 -190 330 58 44 21 -165 61 116 -394 422 13 263 134 211 64 -70 56 113 -137
1883 -137 136 159 100 -86 -14 -171 -363 -360 620 -188 3 36 -287 402 -224 -651 -14 -81 -169 142 331 218 -272
1906 -272 -325 -47 -30 24 60 -212 149 247 -115 -176 33 90 183 -5 68 1 -11 -284 -142 -42 113 113 212 59 93
1931 93 -150 -189 -83 308 184 -161 -32 -96 -70 -241 111 339 -74 -84 42 569 -219 12 -156 -311 -222 249
1953 249 100 57 34 52 -64 -372 123 143 413 -213 -106 120 -25 -401 143 -15 37 -85 106 -211 -94 36
1975 36 49 -42 216 42 259 -6 -81 -6 -116 -215 -225 74 304 178 -167 132 -309 14 -63 32 102 30 -71 -23
1999b3K44j3l36l4O8K17k5l03K47j30k44L24L8K19m45K11M4k48M3J75J75k8k42
2022f6L85MJ0l81L22l48J35j87J29M79l90m4J4oj19J33k95L84k17N3J21j98L53
2045B71r9k36L23L3k94J61l8k83J69R6k82L42j58p5k5l70K15k6N1N95p36N68M8
2068B50l20p6L79k70J23j30l7O2j92J96j16J65K08l1k54J44j13K09m65K28K19
2089A79m42J72j66j95J73P6K10j36J99K9K36o29M54O2m77K52J76k12q6M76m59
2110a08j52K78K15l22J88q7k54J61P0K09j94J32j54Qn6P2O8j0j58J62l76O15k67
2133D0o8O0L2K33K3p7J09k91j41K28j53M11m58J73l8k41P4p9K90l20j16N8K80
2156B9k41M95l78J11j26K09nK0j62L24m04O1PJ06K29l91j01L79k21N1O6K7k2k96
$$ plain form
1999 -23 221 208 -128 -162 -94 123 98 -205 42 -88 -332 -8 30 249 -196 15 59 -189 -146 29 204 176 -66
2022 -66 319 323 333 -48 274 -74 61 -126 3 482 92 48 62 56 -63 70 -225 159 -58 -5 116 -82 271
2045 271 172 -64 259 292 -2 159 121 -162 7 103 -179 163 5 -70 -95 -465 -250 -276 -225 370 -366 202 250
2068 250 -70 -146 233 -37 86 -44 -81 -19 -211 -15 -131 34 242 211 -43 101 -12 197 -268 -40 179
2089 179 -263 -91 -257 -452 -279 -203 7 -129 70 99 335 -294 160 222 -255 -3 173 -39 -125 351 -108
2110 -108 -260 18 233 -89 99 12 -242 -81 -11 198 4 136 -18 -10 -66 6 74 64 -94 68 -308 307 40
2133 40 -28 32 64 297 320 243 352 61 -80 148 -5 406 -52 121 83 -158 -84 -163 127 -193 -309 -251 29
2156 29 -212 283 -95 16 -110 99 94 114 -48 276 -128 -67 -60 46 275 -116 -217 162 -59 -8 58 85 63 -233
2180b33M10J45P0k64m42J71J61p9j39J18N6p6l4J44J45j92N7K3j55oK36j59O5
2203B2O0j19Q1j37Q8k23L33k86j44K19O0n8L34m89n3K48J91K01k08N2j28q6k7
2226f9J11m6k83N49k55j65L19l98L75m37J46K95j19J92j29J10l19p1J88N5j7j05
2248g3K67k9j87p5n1J32Q1j66j36K15o5l6n8K74Qj55r1K93k69K13o2k2J19J71
2272B98m4o5n9k80K58L9j15j31k36K98%Oj06J86r7o3J83L1O8l15j30N01l62rJ36
2297hM5p2K80m61M63k96L30k53l02K94M4p1J49k68j5L92l87L65j36P6j17J25j17
2320F0j57Qk9L49k36M7j56J36j35N1r2J08j15J68O9R4l49J62n7J57K9j13J94m11
2344b18J05n5K21j90N8j36K31K02k18k57L56J68m80J31O8K2k27J47J21K54k01
$$ plain form
2180 -233 177 322 392 128 -314 -143 18 -61 -200 -82 -26 -102 -136 8 153 -39 18 41 -114 -120 116 -43 22
2203 22 82 -37 44 -93 -5 -228 105 -181 -325 -106 -46 -104 230 -259 -312 -64 127 328 120 172 44 -42 -69
2226 -69 42 -4 -287 262 7 -158 161 -237 138 -299 -153 142 23 215 86 196 -123 -194 -6 49 32 -73
2248 -73 194 165 -22 -97 -148 -16 65 -101 -237 -22 -87 -123 -181 93 101 -54 -145 148 -121 92 30 8 127 298
2272 298 254 189 130 -150 108 147 32 -99 -335 -37 -37 -31 -137 49 -48 -111 72 103 171 -144 -274 227 -135 -144 -8
2297 -8 37 -35 245 -216 247 -49 281 28 -274 20 64 -7 142 -126 -141 251 -136 229 93 169 52 177 60
2320 60 -97 -89 -118 231 -5 42 -114 22 -113 -62 -154 -46 -161 7 76 170 -179 -17 -74 83 112 -1 193 -218
2344 -218 -113 -168 53 -137 -79 -215 16 218 0 -257 99 267 -213 -82 -14 8 -219 -72 49 303 102
2365A02m4K0l40L17l48N86j09l18K83k18j62L12j74m7P0K65k40N9M7j87J59N9
2387I2K65m76K56l23Q2N6M82m29K60m59N16m01Q3N5J1K21l56L94m34j27J11J75
2409E4J04j48l33J34l4J94J88k34p7J75P8r2J47j59J00O8o5K07l90m6l30N04j2
2432C3L82m68J74k06K2L65l20M05m72k15L52jj95J91J08l43k13M41m78O99k04
2453E7J5l03J50J16j30J41k30P3k1KL64k41j75Q8K11O1q4r4j18K3J55j89J79L8
2477H8R0J1j53k31L05k3k69J82j21Ro3K91r3J90j76J36j43j20m0L7O4k28P5K86
2501A04p7K51l84O0r2k07J95K9L59m12J24R9L7l83K37k34O64m64K57j11K90m37
2523i5R3L0K3j53k79M14j35k73L40n2P4N43o13J30K0j70j89J73J08M7J39n2J07
$$ plain form
2365 102 58 78 -262 55 -293 293 184 -134 149 -69 -231 81 -93 -140 -70 195 -45 14 61 -126 33 92
2387 92 357 -119 137 -186 -104 -48 434 5 265 -194 322 -79 4 59 70 291 -65 329 -105 -232 -121 54
2409 54 158 10 -323 -189 -223 -29 159 -75 -152 23 101 9 156 -3 97 165 100 307 -83 -129 -459 45 33
2432 33 415 -53 121 -85 -63 302 -18 387 -85 -300 52 51 -144 47 155 -188 -401 40 -438 261 57
2453 57 72 -231 -81 35 -95 46 -184 -111 -132 -130 234 -7 -182 -94 117 178 94 0 -118 -95 60 -129 50 88
2477 88 178 189 36 -195 110 87 -182 0 -121 -112 -175 116 23 213 37 173 30 -90 -130 -93 -29 -257 -182 104
2501 104 27 278 -106 -46 -138 -345 -150 -121 238 -174 -50 49 86 -297 -60 -294 370 -94 163 52 342 -95
2523 -95 -2 28 51 -102 -381 33 -102 -375 -35 -87 -13 530 -83 47 67 -103 -292 -119 -11 36 175 123 230
2546B30m09J04J00j58J14Q0J14k41K13o9j9J27k41L1J45j53J21l32J97K15q8k5
2568E6O7j40j66M08j59Q2ol4K38o10M59k55K33o3j81J16L1q0K79j93j44L29m86
2591b19J25m7j11L77J62m88M36l7r0l7O9j83k57J91M7J05l25J26k5J25M3k27J37
2614a03j18L23L06m30m8J15o8OL0M1n1j89J3J20j71M2L63R5l28J0P2j98Q1K11
2638A24Pj52J70k74Q2M3J80k54j58N17m53J40J00k35M7K69m18m8K23Q1N84n94
2660a9j17j09J04K51m15J57J31l5q2M19j67k85L47k53R4l5j4j80L41k6m21K68
2682d6j79M34j97K45j34RJ88j2k87K8k2o0j06K93j27j34L93o08O31o23L79N8N7
2705A80k43j24L96l27O1l3J20r5p7L27j84k4l30N7K11M43l62J31p1P9k86k45M11
$$ plain form
2546 230 -179 -75 25 -133 -19 61 175 -66 147 78 59 186 -55 -24 121 -32 89 -243 -46 169 81 56
2568 56 123 -17 -183 225 66 148 142 108 346 -264 195 -60 173 110 -71 45 76 -4 275 82 -62 267 -219
2591 -219 -94 -141 -252 125 287 -201 235 198 108 71 140 -43 -300 -109 -62 43 -282 -156 -181 -56 -13 -240 -103
2614 -103 -221 102 408 -22 -70 45 -23 -17 13 54 3 -186 -173 -53 -224 -182 181 276 -52 -42 30 -168 -87 124
2638 124 131 -21 149 -125 -43 0 180 -74 -232 285 -168 -28 72 -163 -116 153 -265 -313 -90 -9 575 -19
2660 -19 -136 -245 -141 110 -305 -148 -17 -52 -134 285 118 -167 180 -73 21 -14 -28 -208 133 107 -314 -46
2682 -46 -225 209 12 257 123 132 320 308 21 49 27 -33 -139 154 27 -107 286 -322 309 -314 65 123 180
2705 180 -63 -187 209 -118 -57 -90 30 -65 -142 185 1 -23 -353 -296 -85 358 -4 127 56 135 -151 -396 15
2728A5J14k30j26K15J16O9k18K13q7j97K11r7q9J12O1k8L77m96r4n6j62J34L13
2751G0K92m27N08m32j51K71j09J0J92l08L40k66J00k42J5J65K56m53J00kK8L4
2773iK15j89k73L70k30j09J63P4n9k3q1K2K66jk29N49m45k3l5K29k07J16l7Ol05
2798b45K99K56m18K61m75J62o0L64j84J63j47k51Oj70N04L42m25k1j53J94q9J10
2820B3j94J03j10J50j36R8o7M24l58p9o9N39m67k81L48J47k01L26r2l36N00o39
2842c71M59M6k19J09l84L72RJ47m36R7O7J48O0j92J5J17J74n41K44J98J48R9k78
2865H8j89K19l98O47k64K52l65K93k94k64K24L28m11j73N25l73J89N5l74P5K88
2886G8K7j81J55l40K82j78M72m68P6K7l2K66n86L58pK42j72k50J08J35k9k67J58
$$ plain form
2728 15 129 -101 -227 -12 104 173 -45 168 81 -116 95 -2 -91 21 82 54 431 -65 -159 -215 -377 -243 70
2751 70 362 -65 443 11 -140 131 22 32 224 -84 256 -10 90 -152 -137 28 284 -169 -69 -71 -43 -9
2773 -9 206 17 -256 114 -116 -225 -62 12 -47 -70 -151 -129 137 136 -93 456 11 -12 -47 182 -25 91 54 60 -245
2798 -245 54 310 -108 153 -322 -160 -220 144 -40 123 -24 -275 -269 -439 65 407 -18 -39 -192 2 -87 23
2820 23 -171 -68 -178 -28 -164 -66 -133 291 -67 -146 -215 324 -143 -424 -76 71 -130 196 104 -232 268 -371
2842 -371 88 134 -85 24 -360 12 21 168 -268 -171 -104 44 104 -88 -73 44 218 -323 -79 119 267 366 88
2865 88 -101 118 -280 367 103 355 -10 283 -11 -275 -51 277 -134 -307 218 -155 34 89 -285 -210 78
2886 78 105 -76 79 -261 21 -157 315 -153 -77 -50 -82 184 -402 -44 -51 191 19 -231 -123 12 -17 -284 -126
2909a26L07k44K90k15l30P74m35J18k33j90M41l12K49Rl63J86J82k16P7j28L21
2930A62m66L99n4K2L28j07k50nk57J04Q6K45j1l30M0M76o19M6L32q8J85m96J38
2953a20K2K29j38k78L76j36o8j08K6M56k72l4O2PJ25j14k71L51l45J72k17J70
2975a05P3k0n1J04j20P5Q7q5M48j96p3l55K08O9m0l7L4o9J36K54k22j67K14j80
2999a8k9J8r2J46J5mP4j93J52q2j38P9L22l15O9J8k79M46j6q7J10J21n54O12n81
3024b06L76K3k81K26k45rj71N03l15L62k70J81J64p8l4l21J9J09K09k5j16j60
3046e9MQ2J48r8o0N7j16j35L62m33Q7J73K38l58K82m2q0k56QJ30K20k25J39j12
3070d4j21Q4jN6K35j65J07k05K03Ok06J79m26K47M54m87l3J13J4M7K18k94N0j43
$$ plain form
2909 -126 181 -63 227 12 -318 456 21 139 -94 -284 157 -155 94 103 -260 -74 108 -108 -31 -159 162
2930 162 -304 95 41 63 391 284 34 29 -228 -124 -38 207 196 -134 -94 382 -237 -191 141 53 238 -258 -120
2953 -120 -98 131 -7 -285 91 -45 -113 -221 -195 261 -11 -45 17 24 149 35 -236 115 -230 -58 -275 -105
2975 -105 -32 -52 -103 1 -119 -44 43 -42 406 210 137 -218 -10 59 19 -18 16 -53 83 337 115 -52 162 -18
2999 -18 -47 -29 -121 25 40 36 110 -83 69 -13 -151 -72 250 -65 4 22 -257 189 173 86 196 317 -237 375 -206
3024 -206 170 193 -88 138 -107 -116 -287 216 -99 263 -7 174 338 260 226 -95 -76 33 242 217 101 -59
3046 -59 -55 27 175 77 17 74 -42 -177 185 -248 -161 12 250 -108 174 132 52 -204 -196 -66 154 -71 68 -44
3070 -44 -165 -81 -82 -26 209 44 151 -54 149 155 -51 128 -298 -51 403 -84 -117 -4 10 57 275 -19 31 -112
3094a12K84n3p0N2j63p7Q1L3k05O7J70J7O5k31J89j19J18J57k98J11k73J64J17
3117B4j46K72j89N17o23q0M16j69m5J54l1j30P8j77P0J94n2K09p8j18k07K44k25
3140i2J07o5J75j74O1K44n9k61Q6k54L28J46k16J85n91N30n5K4l5j93Q0J31n1
3163E1k11J08M1j2j00J77J39m72M62k69R7j5j45K60l04M73l29l14L34K3R1j29
3185d4j07J37l3k26K21K06l95Q9J93j25K34j52P8l91O67m05P4O4K3p7J55k27K71
3208B30k79Q7m5k3J38j61l1L3pk41N07j7j22n30L57R0J40j5k25J65J57%l6N7m26
3233a97K97p9q9L49l51J33m0k91M3L32l03M76k52m6j06L2L90k83k6p4L86j75j84
3256e8q8J99k3J14J90n08J50L9m05Q29l31Qk97j19J61Q5O6K72l07k21L23j59m8
$$ plain form
3094 -112 172 119 49 101 -62 -139 -58 -25 -230 -163 7 24 89 -142 47 -72 46 203 -95 16 -257 -93 24
3117 24 -122 150 -39 478 -145 -225 191 22 -23 131 100 -30 48 -129 -59 135 83 292 214 96 -111 133 -92
3140 -92 15 -50 125 -49 12 256 197 -64 22 -232 96 242 26 211 -380 150 95 119 84 -109 -29 102 51
3163 51 -160 -52 -11 -23 -123 54 193 -279 183 -86 11 -4 -149 111 -193 280 -49 -363 -29 -6 85 -44
3185 -44 -151 -14 -47 -273 -52 154 -241 -152 41 -84 150 -2 76 -315 352 -53 21 85 108 31 186 -41 230
3208 230 -49 38 -7 -30 108 -53 -84 -51 -58 -299 208 191 69 -461 -104 -14 126 111 -114 51 208 208 172 229 -197
3233 -197 100 21 -68 281 -70 63 23 -268 -225 107 -196 280 28 -18 -124 -92 298 15 -11 -85 301 126 -58
3256 -58 -146 53 30 144 334 -174 -24 15 -390 439 108 116 -181 -300 -139 -54 12 284 -23 -244 79 -80 -128
3279a28p1J23j0l5J69K3P4j26K3J13M8k76O09m83M3l6k77L04P0Nk91K42m7K49
3303C15k09k2q6K36m43K56O2J32R3k00n4j81j70J25l10L03m7J34j1j96L96j1k61
3326a49J34j17kJ05L03k49R0N8n41N90m52N32n27MK70m3j69M22l98q4K02P6k63
3349b08N17k71l69K82n7L40j94j14L6J97j98P8L29l71j97J48J63m76L79P9j71
3370g8K16k57K7J61j46J63l6k05R7r7J98m23M38k45K72k49J77r6Q6J20J9l39k37
3393d34J84K14j99Q9r9L77k9J5q0q0N5P1o6J64o4k1j43J3N9M09m67P2J2m7O9l02
3419b28O4L67oj96j79P2p0J28K1J25q3j75J94J25j47PL08k92m6N7l80K70j50J91
3443b3j39L59K24m05l03L58J76j37j99o4j61K79J90j71jk21M48m8r5m05K57K21
$$ plain form
3279 -128 -199 -76 -86 -121 48 71 145 19 42 155 203 -73 536 53 96 60 -217 87 157 162 -129 113 66 315
3303 315 106 84 -2 234 -209 47 109 241 334 134 80 -101 -271 -146 -456 -153 -200 -66 -77 -273 123 112 -149
3326 -149 -15 -132 -134 -29 274 25 115 173 -368 222 -230 302 -225 -221 49 6 -163 259 -139 -223 -21 55 -208
3349 -208 309 38 -331 -49 -106 234 40 -74 -38 159 -39 39 368 -3 -200 -52 111 -365 14 93 -78
3370 -78 138 -119 -92 69 -77 86 50 -155 -58 -155 43 -380 58 -187 85 -164 13 -83 3 123 142 -197 -434
3393 -434 -250 -36 -235 -146 -245 132 103 118 38 -42 13 84 18 182 118 97 -46 -33 26 435 -32 40 52 5 74 -228
3419 -228 -164 203 197 1 -178 -106 -176 -48 -27 98 15 -160 34 159 12 19 327 35 -11 46 -334 -64 -214 -23
3443 -23 -162 197 421 16 -287 71 247 110 -89 -153 -314 -35 155 -16 -17 -238 210 162 67 -338 -81 140
3465A40r3L18l37R0j27l5j12P3Q1j41J98j31K01j07j50N26l36K97l71j3j60J82
3487glj10j01R3L39l79M43j14Q1J52m20J62O3j55pj49J2n3L7j9J93J07k39R3k95
3512b76L39pKJ28K9j00j06J35n62Q10l91j5j48R9L96o31k7M39o5J65k93K06j12
3535A5q3N3K73p0l15K31r9m52K79J29m6K42j06k43L60k26L4K97l51P1K51l97j52
3558c05K78J64j61l62O39m44M56n12N6J13O7k0Mk23K06l42M15k12L8J7L26l25
3580a27r0N23l66J35j60L67m3k62l0K89l29J61k96J90L3k99L32J22j01k07R8j26
3602a86L92k10k04l4J75k35j8K23J82k95l7K37j58L6J50L55k08K68k35r0m69O80
3624C19k73M0q4k6J69j51J5J10k1N7J09k15n7K88m45K82j09J68j18L2jJ49j89
$$ plain form
3465 140 47 365 28 118 -9 -44 -156 -83 -2 -143 55 -76 125 18 -132 394 58 355 -16 -29 -189 -7
3487 -7 -10 -120 -221 -128 211 -168 275 161 242 394 -26 136 199 44 37 -112 -100 -153 -116 -135 58 165 -74 19 -276
3512 -276 63 56 58 186 215 115 9 144 -418 392 1 -14 -162 -63 333 -298 -325 114 49 214 -79 127 15
3535 15 -68 -15 258 188 -127 104 5 -447 -168 -39 -85 157 51 -192 168 -58 -24 273 -78 -7 244 -153 -305
3558 -305 -27 137 -24 -386 253 -191 265 -247 -191 -78 -11 -31 -27 -250 -44 -386 29 -183 -145 -128 198 -127
3580 -127 -217 306 -60 75 -85 282 239 -23 -53 236 -93 68 -228 -38 -5 -304 28 150 49 -158 -60 -186
3602 -186 206 -4 -208 -242 -67 -302 -320 -97 85 -210 -247 -10 -168 -132 18 373 165 433 198 108 -361 319
3624 319 46 86 2 -24 145 -6 9 119 98 155 264 49 -8 280 -165 117 8 176 58 90 89 238 49
3647D9k94M62k87L35k08lN0j71L0n2K16j65j20M90l81L58k79o1q5J79j42J08p9
3670e0P2m0j43j77L3L44L5R0j54J7l3J38L9k57K56l66P4q0k75N05M0p0j06J34
3694B6J47l44M92l5n40j2L66j30K00k91K11j92L13m73L27j17n2L12j46n8J12j23
3716gL27k68P6l37j94M77m05M13Q6R0o31M15k00J75j0j31N7p2o7K02J30J42j52
3739A16M0Nl21J86o8r8J9P8J06LJ6Q6l18LM59k70l96L48k50J84K56k13l45J19
3763b55N69J00k89k51M03o43K63M42n65L32J52j98O3j69l39J95K35q2j87Q2K73
3784A31k14r7M9J78l05K91q0J94J86l91L4J40r7N1l81N05k63j88K99Q7P5l61L68
3807B11m36K14N1K39n27L36l51M39j00k41N17o60L88j57L4k69K58l4M4K45j85
$$ plain form
3647 49 -245 217 -70 265 57 54 104 -67 -37 -89 127 -38 -158 332 -49 309 30 -31 -116 63 -79 29 -50
3670 -50 22 -18 -161 -338 -305 39 74 164 10 27 -6 132 171 -86 170 -196 -122 -202 -477 28 68 -2 -108 26
3694 26 173 -171 321 286 -254 -266 100 -30 170 -121 90 -102 211 -262 65 -52 -104 208 62 4 116 -7
3716 -7 320 52 128 -209 -403 74 -331 82 168 258 -373 42 -158 17 7 -124 -67 -139 -206 -4 126 268 116
3739 116 156 161 -160 26 -42 -140 -121 -43 63 66 82 168 -150 -147 312 42 -354 -6 -256 -72 184 -29 -374 -255
3763 -255 314 414 125 -126 277 -366 -103 339 -226 106 258 60 123 -46 -385 -190 45 -37 -224 -142 131
3784 131 -83 -180 -131 47 -258 33 -47 147 333 -58 -24 116 19 70 -311 194 -69 -257 42 129 204 -157 211
3807 211 -225 -11 40 279 -248 88 -263 176 76 -165 352 -308 80 -77 -43 -312 -54 -88 -44 201 16
3828A6l49Q55m14p0k19N05m43o1L2J20K22j23J56m00K7%oK59k21J08R5j28J00
3851F1K28j80j60K1l9J21L2j51Q8L9M6k2l80N59j83o3k14M09l29m3K02m8L8j41
3875a09J3k00L75k17kJ40j37L02r4j88KK98j52J04l03M74m96J76J0R2O3k13mM3
3899b3O5pr4R9K20k16p3J64L88l60m30J69J48j01J25M9k0o6Ok73R0J65L9M1j15
3924a0J35l66K99k52MK93j43K49l99L01n0J97k03m3J36K4k63K7L57k58k6J80j66
3947B3q3K0J6L49l09K50l09J48o0J62j95j58R6K19K7l69K4L64M8m61M34m64L67
3970A39r0pN2k52K42l16K98k46L06m35P41o09K56j25j67N6K74l45J03P2P6k34
3992b11J31j32O46k80m74K82J09o9j0j01jJ68o7K7m00Q37l68r7o9K34j75q4K42
$$ plain form
3828 16 -333 522 108 38 -181 324 -119 -180 -148 -28 194 71 227 -173 -146 -146 -152 107 -114 -6 89 -39 61
3851 61 289 109 -51 -30 -69 52 84 -67 21 60 106 84 -296 263 80 17 -197 212 -117 -160 42 -6 32 -109
3875 -109 -96 -296 79 -138 -140 0 -137 165 71 -117 -115 183 31 135 -168 306 -190 -14 -4 88 151 -62 -66 -23
3899 -23 42 35 -59 40 260 44 -29 135 523 163 -267 -98 50 -51 74 123 103 37 43 -230 -140 25 64 105 -10
3924 -10 125 -241 58 -194 -190 103 -40 209 -190 111 61 258 55 12 148 172 -91 -64 293 35 9 189 23
3947 23 -60 -40 -24 325 16 266 -43 105 45 207 12 -146 -50 169 196 -173 -149 215 263 -198 236 -228 139
3970 139 49 42 94 -158 84 -232 66 -180 126 -309 432 -177 79 -46 -213 -157 117 -228 -125 -53 23 -211
3992 -211 -80 -212 434 154 -320 -38 71 2 -8 -109 -110 58 -9 18 -382 455 87 -10 -79 155 -20 -104 138
4015A38Q2j02l18Q8j14K5J71Kj74j21K05lr8K04j5k33L52m23M05o3j95K84k81
4038a84L9K92n0j66k0j82J5L63J18ql09j18L72n0j39l78J66K63m26N66q8p4j56
4061a54K90Oj63j65J1j53N03K7n11N73p8j96j2K60q2k59j4L6N98n71J83j92O7
4084Dj1j5m5j0J82kj81K31j50K5l31K34L1K70n73M09p8m8K63j88N7j23L75n95
4108b69L83p2R5l27l50M45P9J52n8j08j94L71J61l08K09j38k41M09j92M66m63
4129E0Q0q1kJ35j75K23j93m7jo7j2RJ55j01P1J69j20Jk02J86K56m14j19J49J44
4154I4L7J3k17N2j21K15k69L6J58L89k99j06L2k67K49k10p4M80J36l26J72m11
4176b37J56Q9j16p3N2j29j00J11J00J05j16L54k92j0K07n55J42K55K34j68j54
$$ plain form
4015 138 220 118 -200 -112 -226 -201 -30 -28 -202 -323 -118 -121 -219 -15 -30 -263 89 -334 71 8 -187 97 -184
4038 -184 -145 147 97 -69 -89 -271 -256 107 225 217 -92 -210 162 112 -27 -405 -239 24 -402 164 76 2 -154
4061 -154 136 142 -21 -186 -175 -328 175 202 -309 264 186 -10 -22 238 156 -103 -117 -81 517 -54 129 -63 4
4084 4 -7 -22 -67 -77 105 103 -78 153 3 28 -303 -69 -38 232 -341 68 -10 -58 205 17 74 -49 326 -269
4108 -269 114 42 137 -190 -540 -95 -16 136 78 -30 -224 147 308 0 209 71 -170 239 47 513 50
4129 50 130 49 47 182 7 230 37 -10 -11 -78 -90 -81 74 -27 44 213 93 94 -108 78 334 -80 -199 -50 94
4154 94 131 144 -73 -21 -142 73 -196 -160 -2 387 88 -18 14 -253 -4 -214 -288 192 328 2 174 -237
4176 -237 -81 8 -108 -181 -129 -258 -358 -247 -147 -42 -158 196 -96 -106 101 -454 -312 -57 177 9 -145
4197a45J03K69k09k58O1J52Jq7J53k29N27l46J67k99j14L17j8j37K0j75K90j44
4219a01Q6J48j83J61K1l5Q1k43P8j3K74k66j21J27K28l49K18k24J36m8j68K02
4241IOm4K34n57O40j52k65j4L11M9l21J87k4J52k46k56O59l5k19l94J70R1%L84
4265C65r6j08j91J15k99J67J00J59r1j83mj28J22rj06K69J68l96Q0l78K83J03
4287e8k90N91n03K00n6J01P5K01k93Q1k60N09k16j4k79mK34R9J94l64J11k09J81
4310C1m8J97j97P8J9k09k22K80J8m8JK61J59k68j26J77m7K07l58M03k99j50L70
4333B29l25J24j3k63K98K07q2J67n58L00k44j2O0M8k03K51J03J07P0l73J59k59
4355b09L29K31k84l25JM38k19K68j99q7K10l41M87l77J35m5L4J41j82Q0K1N3k76
$$ plain form
4197 -145 -42 227 18 -240 -179 -27 -26 -113 40 -189 338 -8 159 -140 -254 63 45 -92 -72 -247 43 -101
4219 -101 -15 133 -50 111 132 97 178 -65 13 0 274 8 -113 14 242 -107 111 -113 23 -25 -193 9
4241 9 15 -29 205 -352 288 136 -129 -143 168 217 -104 83 59 211 -35 -291 368 333 114 -280 -110 -19 -19 365
4265 365 269 161 -30 85 -214 -47 53 212 121 -62 -66 -194 -72 -81 -187 82 250 -146 -66 -444 -161 -58
4287 -58 -348 243 -260 -60 -116 -15 60 261 -32 49 -211 298 82 68 -211 -215 19 118 312 -52 59 -150 31
4310 31 -17 180 -17 61 80 -129 -351 -71 -53 -101 -100 161 320 52 -74 103 56 263 -95 308 9 -141 229
4333 229 -96 28 15 -248 50 257 175 342 -216 84 -160 -172 -112 -64 -267 -16 87 194 264 -109 50 -209
4355 -209 120 351 67 -258 -257 181 -38 230 31 -56 154 -187 300 -77 58 13 47 188 6 86 107 160 -116
4378a16K52l08P5Q9j13K94j85J50J48l71J2J45r4m37K28J23j17P96o31K4J41J22
4400B27O9k28k71J69K00J37n23M55j33k51J06L63k37j48K00l63L03j4Q4l21K71
4421I5mKj65j92L28m0P4j56j05M67q06M96O0j29j41J56j85P8J45J60m92O46j10
4444A82j07l67L19mk06K07N2J21l69J60l92M28Q0l31J72K51l18n0kJ76k5m6n3
4467a22O4jK3j57K08j11j06J96K3j12k71M63R5N3l7J02m75J62J64j00K9Kl6j0
4491D6j51RK46m60J91J22o3K56n46J67M03j04J38l23J82o8j33Pp3O9J77N0J63
4514C05n39L69r7oj80O5Rq5L38m07K56j3k49L85J24j70j26K35N1k12J93l77oK51
4538A14n6r4K17n9J01j71J57j49j55o5M68m63k29N25o9p7p2Q2N3k10k3Q9J13J00
$$ plain form
4378 -116 136 -172 -97 -8 -121 173 -12 138 286 -85 -73 72 -22 -459 -231 -108 -225 571 -60 -36 105 227
4400 227 296 68 -203 -34 166 303 -220 235 102 -149 -43 320 83 -65 135 -228 75 61 145 -176 95
4421 95 91 93 -72 -264 64 24 98 -58 -163 304 -502 -6 54 -75 -216 -60 -245 -167 -22 138 -354 292 182
4444 182 75 -292 27 23 -183 24 76 197 -172 -12 -404 24 104 -227 -55 196 -122 -172 -174 2 -23 -69 -122
4467 -122 -58 -59 -36 -193 15 -96 -202 -6 17 -95 -366 97 192 245 208 310 -165 -3 161 61 90 92 56 46
4491 46 -105 -96 150 -310 -119 3 -60 196 -350 -183 220 116 254 -69 113 45 -88 -81 -154 -85 92 142 305
4514 305 -234 135 38 32 -148 -83 -74 -159 179 -228 28 15 -234 151 275 105 -21 214 265 53 246 -131 -137 114
4538 114 58 -36 181 122 223 52 209 60 -95 -160 308 -155 -384 141 72 -5 -77 5 58 -152 -175 -86 27 127
4562A27k14K35j59m1j59M19n18J34M51n53K02Q5L98n38J42P7p4j43nN22j74k99
4584h5L22p0r9j55K98j79j10L27K8l4j51j28K23n7q2k3J45k86J66M93k80m20m7
4607b04l2K75J95j92J21m16K91Q2K4o8J5rj14o2K60k01O3J13j28J86k60j3J47
4630G3k17L05L55l47P7l90J98J08l81L32m11M85p0j03J28k31R4Q1m72N03k77N08
4652C48n58K79J07j24j65J18K66l92N51n44o0J12Q1l1M5k41N1K90M54q34J71L4
4674d2jk36N40k34L4j97K34j64l31P65m52K10R4J39j90o6l20M19j54N1J06l39
4696a34QJ76rnj01J82j96p8N4J42J6O5p8k37L97r6k33K48l20P2m4J96J57l18n7
4721a93J94k0n0L75l02N6J44k90n1J45k67J80J80k48o5K29r7L5L50o01OM95L1
$$ plain form
4562 127 -87 148 -11 -52 -211 208 -310 -176 275 -278 -76 9 407 -131 11 88 14 -129 -134 388 214 -85
4584 -85 237 167 68 -87 211 32 -78 249 277 243 92 -36 187 130 48 25 170 -116 50 543 263 -157 -204
4607 -204 -236 39 234 42 163 -253 38 120 144 76 91 82 -32 -94 166 -35 28 141 13 199 -61 -74 73
4630 73 -144 161 516 169 246 -144 54 162 -219 113 -298 187 117 14 142 -89 5 86 -386 117 -160 348
4652 348 -210 69 176 52 -113 5 271 -121 430 -114 -174 -62 19 -12 33 -208 -157 133 587 -247 -76 -42
4674 -42 -43 -279 261 27 61 -136 98 -66 -397 368 -84 126 220 359 169 103 -217 202 48 99 205 -134
4696 -134 -126 50 41 36 -65 117 -79 -157 -103 39 55 120 42 -195 202 106 -127 121 -199 -127 -171 25 182 -136 -193
4721 -193 1 -19 -69 306 4 60 204 -86 -137 8 -259 -79 101 -147 -212 17 -80 -45 305 -296 -290 205 236
4744B36j87J47J31k56N1l93K56J90q2k44K08K12k98J48p0L1j0o6k51K92N4j24
4766b5k52J51K03l56N97n79N01l98p8M70j89O8n72N20j13l24N28l04k49rN99l25
4788a36P0P5Q1j80N6j21J86k59M33k61j26M18j53L2k49k00O02j09q0n6J8O5k4
4811H2l42M06l66K05O2n8k4n2K84l40J09k30M58j80k37J75M2Q0j73O55q27q5L86
4834C0j3K07l86M20q7j90J67l33J26J20n3j73l5L03j33Q0J01N7k5k46J74j4J45
4857B42k70k01P1K95k62L0J80l8m0J38l08R8M01l06j54J29j11K25l66L92j82K73
4879B36j33k4k07l7K36N6j59N4J6p5J32k28j00K52J07k64K17k94M84p3l11M24
4901C09m02n7M29k26j15p2L03N1q2j99K75k64K99l36J31J09j8l00R0K38r1j12
$$ plain form
4744 236 49 196 327 71 122 -271 -15 175 93 -151 57 269 -29 119 49 80 70 4 -247 45 99 -25
4766 -25 -277 -126 77 -279 318 -261 240 -158 -236 234 45 113 -459 61 -52 -376 152 -152 -401 -410 189 -136
4788 -136 -66 9 90 -90 -34 -155 31 -228 205 -56 -182 236 83 115 -134 -334 268 159 79 23 41 106 82
4811 82 -260 146 -220 -15 47 -11 -35 -87 197 -143 -34 -264 194 14 -223 -48 -6 74 -99 556 -271 -356 30
4834 30 17 224 -162 258 171 -19 148 -185 -59 61 8 -165 -200 103 -30 50 151 208 183 -63 111 97 242
4857 242 -28 -229 -158 137 -125 -95 85 47 7 145 -163 -65 336 30 -124 5 -106 119 -247 145 -37 236
4879 236 103 79 -128 -165 71 127 -32 22 38 -37 95 -133 -233 19 126 -138 79 -215 269 196 -115 309
4901 309 -93 -150 279 53 -62 -134 169 220 138 -61 214 -50 249 -87 44 153 135 -165 -75 163 72 -40
4923d0J46l42J09O4P6J53j79J50k82J1K39j88n1J40j67J84l0J45l21P5k42L34
4945a6j36K3K34j82m3J11J87l1m8k52M9J01l1J4Q3j35J18l06j4L97j67k48M02
4968A10l29P0J19J48k6r7R7P9k33K82o3j82k71J59L8j22M53m76Q5mK63J96j30
4991A66m80M62j28J60k66j18K08L26m46j00M47l59p4Q9J0l4J34j25K18L64n27
5012g3J44j7k10L46n76K19O6K40o3o5rl41M02k74J88jL8k86L27Kk75L16m96K70
5036a28O8j46K49j52L2J18Q2j27q7j03L00K44m37K0K74j66j45K91l69K96J62m05
5058a29K81k52L49l37J14Mm7K03k19L35k11P4k07L56Jj06j50k42K50j00J20j90
5080a03M6j67J47K71pl5j94k37J99K13o8M7j55K37n35L09mK5O9k33L43k94O7k0
$$ plain form
4923 -40 106 -236 -127 -63 13 166 -13 137 -145 -134 105 -83 -134 6 -161 23 -7 138 -183 -108 -350 -16
4945 -16 -152 -129 105 -77 -120 -9 178 147 99 -153 -104 -3 -34 -20 63 -72 46 -260 -274 123 -44 -292 110
4968 110 -219 -149 -30 118 92 -5 92 171 -62 220 157 -25 -296 -137 -99 -221 232 -244 -159 -163 100 296 166
4991 166 -314 148 20 180 -86 -204 4 330 -116 -216 231 -128 -202 -113 -103 -137 -3 -128 90 454 -73
5012 -73 71 54 -156 190 -386 -167 -101 139 76 11 2 -339 63 -211 -23 -24 14 -272 55 57 -218 98 -398 -128
5036 -128 -60 -206 43 -109 -77 41 123 -4 -91 -194 106 350 -87 -67 207 41 -104 187 -182 114 276 -129
5058 -129 152 -100 249 -88 26 30 -17 186 -33 302 91 165 -42 314 315 209 59 -183 67 -33 87 -103
5080 -103 -57 -224 -77 194 187 152 -42 -279 -80 133 65 112 -43 194 -341 -32 -36 -11 58 -175 168 -126 -59 -79
5104g9M33k17r1J08J14l2o28N82k76K76k81K93k60J72J31k00J8Q9j52P2j55j6
5126i9J32r6k21M64k23j69L2J29j12K13N9j13j17L52j84k6K01k92O2K2o2n18N60
5149fj29L06k64J67j59M7J50m2m9m8l2R4j7M9k03L81l09J46P2k43Q4j34O33p59
5173b65K22J83j99K17j25J04rk4K25m78K58J62k10q8pon3K64j12N5r3o6j49L63
5197A69P0j95K2j61J94k19n9K6J76o1L63M6k84Q9k44R2j48K97l37J95J65j17j25
5220d6k11J01K52j36R7L0k00J28j59J66j62K37k41L15j0n39L36J00k73J99k57
5241b73M50n26O46l14J70M6L4r2m80L97l0j14k69L37k57L44j86J11O4K8j86J72
5263G2q2k19K38J14r2P7J86m70K93j08l8K88k12o1o3J05k07K2K11J52l28J90j35
$$ plain form
5104 -79 354 137 46 154 268 236 -392 190 -86 190 -91 202 -58 114 245 45 63 152 0 72 -83 -99
5126 -99 33 -63 -284 180 -43 -212 -180 -51 -163 50 109 -4 -121 231 47 21 222 -70 -8 14 -48 -566 -6
5149 -6 -135 171 -93 74 -85 -38 112 70 21 -27 -59 35 18 67 -136 245 -64 82 154 -89 -5 -139 494 -265
5173 -265 -43 140 -59 158 33 137 128 104 329 -149 109 271 61 -27 -34 -40 -93 171 59 114 21 -45 -194 169
5197 169 239 44 66 -95 99 -120 -179 -153 23 -38 325 371 87 176 -68 24 -124 173 -164 31 196 79 -46
5220 -46 -257 -156 96 -40 57 87 -113 15 -144 22 -140 97 -144 171 161 -378 -42 58 -215 -16 -273
5241 -273 177 -349 297 -17 153 199 233 141 -339 58 28 -86 -355 -18 -275 69 -117 -6 58 86 -100 72
5263 72 -10 -229 9 123 31 108 294 -176 117 9 -29 259 47 -14 -77 28 -179 -157 54 206 -122 68 -67
5286f7K46k00M8q0j1M51l63j21K01k42N42l94L4J01l42L70j04l4q3J7M08l22k70
5309b15J13N9K78j95q5l09K20L30k78L13j68j17j38K10J6r7Q6k78L22r1K11Jj78
5332A0P8o3j2J14L2m97P4M57k1j64J26m34J37J30qRK25j3j30J3k92M16j38k77
5356b28O3M8J21%L42m04J00l0N3l2k64O6M40J23o1m38J11J43k0j78j33M77j58
5379A41p0n6q3Q2O0J00J27k30r1J23K14l26Q6k13J06j01o0j9m7O50l15j9j50K15
5403A24q9J26k64RJ25J06r9J3l3J57k4m24M00l87K7J12J66j50J33K02j70k8K01
5426B33l75J34j26k40M87j90Lj75L89p2n1K40j75n5j38J12j9K34o08N38l28K09
5448B7j40J78j13JQ5j09J80O5j40K59l36j8J86r3q4L37k44J27j00r0J64j24j8
$$ plain form
5286 -67 179 -21 27 -53 -64 387 24 -97 104 -138 404 10 44 145 -197 173 69 35 -48 -31 377 55 -215
5309 -215 -102 -43 235 40 -45 -354 -134 196 -82 231 63 -54 -192 18 34 -63 23 -255 67 -24 187 188 10
5332 10 88 25 13 127 159 -338 -264 193 172 8 134 -300 -163 -33 -41 -32 193 180 50 63 -229 187 49 -228
5356 -228 -165 -117 4 4 346 -58 42 12 65 33 -231 -165 275 398 337 -101 10 153 133 -45 -178 299 141
5379 141 71 15 -68 14 74 174 301 71 -20 103 317 -9 77 -136 -30 -131 -191 -210 -257 393 78 59 -91 124
5403 124 35 161 -103 -94 31 137 38 51 18 175 151 -273 127 -260 -233 -121 45 -105 28 230 60 32 233
5426 233 -142 -8 -134 -374 113 -77 -74 -249 140 68 17 257 82 27 -111 1 -18 216 -392 146 -182 27
5448 27 -113 65 -48 -47 38 -71 109 174 34 293 -43 -61 125 32 -52 285 41 168 68 -22 142 18 0
5471@L8j53R2J7l16K00K03K60j05n72N70p4k00J12Q8k67K61k3m40N58j76l1q0
5494c8J88l45N06m90K53k64K31P4l8r0P8m5P8j78O4k04L43L1k09j2J51p7K05j7
5518A95J62k75J9m69M05k14L1O4K78j5j84J26k25K43k61L29m39N28k62K52l60
5539g2O0j29J81J02m02P3L53l72J18J65k68J31N0L2j68L87j13L0k15L56k24O7
5561A42l7k98K65j03K7o9k01O83m43J60k86K06k7N8j2k61M77l87J05J4K22m78
5583b43J77p4j88N09k30J07K77o16N24k87k13K14Q0k91N78m17K43j04m3J03K1
5604A27j21j0J88n61N49k9R4j52M3k02J17j99K08j12j12j46M09J65k35J90J13
5625C24n55J76R9j0j65j84K83j47J68J56J40k15k7J8q7j0j11j13j99P52j70j13
$$ plain form
5471 0 38 -115 -23 -6 -322 -122 81 341 236 -336 234 160 -40 72 160 -107 154 131 -309 249 73 42 -38
5494 -38 150 -195 311 -179 74 -190 41 115 77 -13 65 20 98 -80 -16 -220 123 154 -55 -67 84 7 212 195
5518 195 357 82 101 -368 37 -177 -146 -82 196 181 -3 123 -102 141 -120 209 -230 298 36 288 -72
5539 -72 -12 -141 40 142 -260 -187 166 -206 -88 77 -191 -60 -10 22 -146 241 128 158 -57 299 75 142
5561 142 105 -193 72 -31 -4 -73 -274 409 -34 126 -160 46 19 77 65 -196 281 -106 -1 13 235 -243
5583 -243 -66 -140 -328 181 -49 58 335 -281 243 -44 -257 -43 37 -254 324 -93 150 46 3 106 127
5604 127 6 -4 184 -377 172 143 237 85 128 -74 43 -156 52 -60 -172 -318 91 256 21 211 324
5625 324 -231 -55 44 34 -131 -315 -32 -179 -11 145 285 70 43 61 -26 -36 -147 -260 -459 293 123 10
5647A0K05q4j57P1k44L29q7r7K47l13K61l04L48m58L85j67K51kj87Ml41N51J08
5670C29k02k26K81l67K23P8P9n8k72pJ56J33j05n8k16N20k99J12o06L95P3P4p7
5693d0M8m0J07j11J81l84L00r5l9j40K21K1N2k41J92R2k3m07K94K14k83Ol5O5
5717d5O4j79K23K9k73K34p4o3K69j18k15J89J04j31K07p7m49K82k07Q5Q0K44l23
5740a44J41j12L86j30j62%K03l13N0r7L47k59K20j56p4M59m51M3n9K70n8j74K22
5763A52j67L11k74m12K60j0L05j85p2Q5J01q2K85k37o1kj26J31k4K68l19J83Q2
5786A92k29j39j45M19N1k07j5l15J67J72M2K80m43N5K85k41j2K0J37k8n0M6L20
5809C62n60L00p0n02M74l10K58N1l50Q01m05j96K37J50k44j16K94l70J03J75p3
$$ plain form
5647 10 215 131 -26 45 -199 130 43 -54 193 -120 141 -163 185 -273 112 -55 196 194 7 11 -330 221 329
5670 329 127 -99 182 -185 38 116 195 137 -135 -142 14 147 42 -16 -232 288 -11 101 -505 -110 -37 37 -40
5693 -40 8 -32 75 -36 145 -239 61 -34 -73 -213 8 29 81 -160 32 124 101 -306 -12 202 -81 -75 -110 -45
5717 -45 19 -160 63 92 -181 53 -21 -84 185 67 -148 41 145 14 221 144 -305 -23 -230 -145 -65 179 -144
5740 -144 -3 -115 271 141 -21 -21 182 -131 -81 -178 169 -90 130 -26 -100 359 -92 -49 -108 162 104 -70 152
5763 152 -15 296 22 -390 -130 -140 165 -20 -92 -7 94 12 297 60 -1 -3 -129 2 -22 246 -73 110 192
5786 192 -37 -176 -321 98 149 -58 -73 -388 -221 -49 -7 273 -170 -115 170 -71 -83 -63 74 46 -4 42 362
5809 362 -198 102 32 -470 4 -306 -48 3 -347 454 49 -147 90 240 -4 -120 174 -196 -93 82 9
5830IK41q6m04N15n38L92J70j45j27k8J56kK5R1k70J74o7j43j4NN0j6J27M2j88
5855c1K13J54n43L81j67N1k12J46J34J67k19j09o0K37K6m90L94j69J01q1L88l30
5877a9J80j12J9O5k21K0k65M57j11j24J36L4K00l39k88L68M2k99K29m3j04J18
5899e7K11j52j95L35J12n30OQ3M36m43K46o1M2L03jj35m40L33l30k9M0J60J72
5922A06l06K42L2k13J23L3q1J5L23k70m6J32l1L8k19M98l07k27J96K1j81M86k07
5945A57k23K77j97J37j26j2J17j31j46K66k20k4L70j14n7K4l52K77j60J70M2n1
5967B4M4M6j48J27L13n65j02J80J07J60J3n2l82R4j86M38L0l45L46j51J73l31
5989a67L38m5N2j01m28K82Pm0j09Q1K26J12k83k95M55k19L36m25J06J6L00n84
$$ plain form
5830 9 250 164 -240 275 -263 129 299 154 27 -1 155 153 178 269 -1 173 106 -37 -51 -46 4 -12 115 157 -31
5855 -31 182 336 -207 174 7 58 -154 -8 126 293 74 -35 -95 142 168 -322 72 -97 4 -77 311 -19
5877 -19 161 49 68 133 -88 -68 -333 124 13 -111 25 59 259 -80 -368 0 42 -257 -28 -71 -175 -57
5899 -57 154 2 -193 142 254 -276 -270 -187 249 -194 52 -9 33 336 335 200 -240 93 -237 -266 -226 -66 106
5922 106 -200 42 74 -139 -16 17 -64 -49 274 4 -42 90 59 97 -122 376 69 -158 38 59 -122 364 157
5945 157 -66 211 14 151 25 13 130 -1 -147 119 -101 -125 245 131 74 98 -254 23 -137 33 75 24
5967 24 68 114 -34 93 406 -159 -261 -81 26 186 199 147 -235 -141 -327 111 141 -204 142 -9 164 -167
5989 -167 171 126 178 77 -351 -69 -62 -102 -211 -130 96 208 -75 -370 85 -134 202 -223 -117 -101 199 -385
6011c85J27P63l25o0j04n1K32j4k65O8M04k00j73K6k71J27Q7J66j51K42k94j18
6033a69L12l78J32J1j31M08k34n1J85k28J62R5k97J64L2J96l98K18k25L15Oj55
6055c0J66j00j70J37J93N5k10N3k27K38p4k36M18l33j07J60J22n2L22K53q38n4
6077c14K52J40j00L40l07m0o4Q1k5J00M7l35ML12J75m28N1M35j27k79l4M41p61
6100d36K81j5J33J27n7N7L54j73m36PK5K21N9P9k96J45j24J19O1j34m4lMj24J63
6125gK47n9Pk21K03j0k16l5P2K05o4k58K26j03k05J72L18j41J90j55j05o2J01
6148A00l46M37j28k04M41q9j89K31l50r6N77l53j16J09j05J11n1J66j14k96M98
6169B33k90L7L21j33j51N5r6j30M10m8nj86J07k09l5L35j73L4o9k9K2O8qK62j52
$$ plain form
6011 -385 -258 505 180 120 16 -35 197 183 -82 -14 390 190 17 43 -228 -101 -14 152 1 243 -51 -169
6033 -169 143 -235 -103 -92 -223 185 -49 -100 85 -143 19 114 -183 -19 13 209 -189 29 -196 119 125 -30
6055 -30 136 36 -134 3 196 251 41 94 -133 105 31 -205 213 -120 -227 -67 55 3 325 578 -260 -314
6077 -314 -62 78 -22 318 11 -29 -93 -12 -37 63 110 -225 -221 91 266 -162 -111 324 197 -82 -116 325 -436
6100 -436 -155 -170 -37 90 33 90 444 271 -165 -158 -133 88 147 226 -70 75 -49 70 131 -3 -47 -50 -46 -170 -7
6125 -7 240 181 188 -33 170 160 -56 -91 -19 186 122 -136 90 -13 -218 -46 272 131 321 166 61 -1 100
6148 100 -246 191 63 -141 300 211 22 253 -97 -193 384 31 -85 24 -81 30 -21 145 31 -265 233
6169 233 -57 -20 301 168 17 72 -24 -154 256 208 203 17 124 -85 -120 215 42 76 7 -22 0 68 60 322 170
6194A70o4k10J36m0J67l01K09k36O7R2j30R4K30K9k48j63K59j60Q7j6L4j83j20
6217b97M68l31k88P27R8o01K88l91K94lK3j24K63q1l0L1M1p4L91m27n2K67n3j10
6241B9J22m7l2M2M0j5j7k15O2L4K8j40K4J30k41p2M40P2j41j13J99l78K76oJ97
6266B78k87o0K08r6m58L39j02r1L00k31M23o35M73l13J95L56k90j98K58k27j79
6287c37K37P8K39k69J86j17j29J78k30J96p6m0q1J70M76k95j72q6K94n00K41q2
6309a19m2K50j22P1L1k28M47k23k87J78N49m77Qk75L81j93Oj11J43k3L1j42J68
6332B1k30P7K32l47p8M16K2l97L51k11J1J97Kl13K13K64l08k53J74j3q0M45m8
6355A47l05o6K90k2k0j08K01O7j5n0q8J98q2m6j41J07k08R7rM2k21q3L14J95n01
$$ plain form
6194 170 106 -104 32 -8 159 -142 67 -169 -102 -10 -140 -46 184 213 -35 -198 61 -99 -12 -28 6 -177 -297
6217 -297 171 -160 -448 279 377 -224 64 -327 -33 -36 -13 -137 126 45 15 46 87 13 404 -23 -75 192 139 29
6241 29 151 104 72 114 154 139 122 -93 -31 3 31 -109 -85 45 -196 -268 172 244 103 -10 189 -189 87 81 278
6266 278 -9 -69 139 43 -415 -76 -178 -269 31 -200 223 -412 61 -252 -57 299 9 -189 69 -158 -337
6287 -337 -100 -22 217 -52 134 17 -112 66 -164 32 -44 -84 -165 5 481 186 14 -72 222 -278 -37 -119
6309 -119 -161 89 -33 38 69 -159 288 65 -222 -44 505 28 36 -239 142 -51 -45 -156 -13 -36 -5 -147 21
6332 21 -209 -132 100 -247 -325 91 113 -284 67 -144 -133 64 66 -247 -34 230 -78 -331 -157 -170 -250 195 147
6355 147 -158 -224 66 44 24 -84 117 184 169 119 31 229 147 101 -40 67 -141 -44 -53 -11 -232 -315 -1 194 -307
6380c07RN92m70K83l15L65M6m91N40m8l44j6P3q6Q8K50n76R4L69j85l31M73J46
6403A59k84P6J59J6j04k39K44l95N41N3k32L57l81J75m75J62L85m21LM57j16j65
6425b5Jr9J59l67L84jP8p3j11J74m6p6k81J99K11R5l71K54p5L9J9K94m74r3K0
6450a65K92k16L69j87k30Q1Q4L6J83R9k28J73k70j1j76Q4P8M4N4J73k32O9jk63
6474a60J20o2P8L4r0O7jp4k57N88o15M84K1M8k41n9K30p1l18rJ83P4mM9K15l66
6500a36J23K20mo7k7K12l61K2k89M58l09L42k64j13l3L71m09O0J85K8mr1M45o00
6524b41L22j79J15J29K12k90j13K1q5j42L96q0j81J88j97l5L45m58M60j72p2M2
6546a5P5j89j9K39l31J28L15k78k00l8M14l82K1O95k25m42M96j00l31K94j68K96
$$ plain form
6380 -307 -298 294 -176 107 -208 157 203 -288 252 204 -140 -156 -83 -169 -81 169 -407 -313 56 -129 -460 13 159
6403 159 -125 -49 110 126 22 -217 27 -368 173 226 -6 351 -30 145 -330 -168 217 -204 -201 256 140 -25
6425 -25 -24 -123 36 -331 53 52 130 57 -54 120 74 -2 -283 -84 127 222 -149 105 30 69 88 382 -92 -185 -165
6450 -165 127 -89 280 93 -137 -56 28 64 247 346 118 291 21 10 -166 -82 -4 40 94 267 35 104 103 -160
6474 -160 -40 -102 -24 10 -80 -13 -14 -88 -345 243 -372 112 133 181 -60 -119 111 40 -278 -287 -104 -30 -34 15 230 -136
6500 -136 -13 207 203 136 109 321 -40 -18 -307 151 -158 184 -80 -193 -226 145 -264 -204 -19 9 5 -86 359 -241
6524 -241 81 -98 17 146 358 68 -45 -24 -109 -251 145 65 -116 72 -125 -160 185 -273 187 15 -57 -15
6546 -15 60 -129 -148 91 -240 -112 203 -75 -275 -313 101 -281 -260 435 210 -232 264 164 -167 127 -41 255
6568B55l38J68k19L53j70k64K76j46K18j42R0n4Kl8m3j95L05n5L4K17p18L43L16
6591A95k24J59j27j90L68q2j75J49k3J76m9L2j27k14J38K32m37J76j64J06K39
6612A58m33L18j55J53kJ15lk38O2p9J9L12j29j50K33K9j40k25j4K14j90K66k0
6635A01k03j27N2Q1j89L93p5j88Q0P9l9J98q2j54O9r8p7K18J73m2l49q7L72p7
6659B9l6J45k82j14L20k79L06k17R5K83j81j79K85k09j53r9K04K3J10l7k97K40
6681d3j8J6M3O4K25l02RJ38n3k26K7M4J49Q2n46J32K12K04k12m02K49R4J98j80
6705i6m7O9J25r4K48r6K71o43K35J19l34K48Q6oJ44j45j13P4l93N06r9n1m8m5
6729h5j24L74O6l18p2O44p04J03j38K76P8j83P2K07m91K86j29M45K9l27P5l1R4
$$ plain form
6568 255 -83 85 -134 219 49 -215 61 -85 133 -9 81 27 29 -9 -52 -247 58 3 37 254 -464 -121 195
6591 195 -29 130 3 -187 181 99 -76 73 50 226 177 209 82 -132 6 238 -199 -23 -187 -81 158
6612 158 -275 43 -112 41 39 154 151 -87 -25 -104 -85 227 98 -52 181 210 70 -155 -169 45 -145 121 101
6635 101 -102 -229 -177 -96 -285 108 33 -155 -75 4 -35 163 81 -73 -4 -102 -179 39 212 170 -179 -266 106 29
6659 29 -7 138 -144 -258 62 -217 89 -128 -33 250 69 -110 175 -34 -187 -286 -82 -59 51 14 -283 -43
6681 -43 -61 -45 -2 62 287 -15 -6 132 79 -147 -120 -76 73 155 -391 -259 -47 157 -55 -457 -208 -114 84 -96
6705 -96 -143 -74 51 -43 205 109 380 -263 -28 91 -243 5 91 85 229 84 -29 45 -348 158 59 8 -40 -85
6729 -85 -209 165 231 -87 -159 485 -219 -116 -254 22 100 -83 -11 196 -295 -9 -138 307 336 9 84 53 147
6752A47j53j9j00L51%K0k94q0J47Q7k27J21m8K12m28K75m4o0l2L02m70M68j31
6775D4k02Q7J01k14J38K43j26j44K35L18m08j59r4J76j00O9P8R8j52J14n4r7K07
6798A58j99LJ19pM2q7j72J41J34j52j80P2N4M59k07j4n07N92n9k81O6k04L9L32
6822A42k68J65J52l3j49P8K80m98Q9j30K52l35J71q8J50J17J09m93Q6M40j14m1
6844H2j02k15Q4P4j33K15N9j75J49j33j21M80n60K91j55L89k16N9k57q0L88m13
6866b90K58L45j28j38k9K51m10K02o6j8j34L52k50J10J43j15J09j70Q8n6j41K78
6888A91l10q7Q6L95%j16n6q8O9o7J19K15l97J36j43k84L24J74j67L3J03j50K27
6911B07j47J48l27J02l4o1L17l90L69k11J23j48J22n1k00J07L93m43J22J02j85
$$ plain form
6752 147 -6 -25 -125 226 226 246 -48 -128 19 106 -121 0 -48 164 -264 11 -33 -93 -125 177 -293 175 44
6775 44 -158 -71 30 -184 -46 197 71 -73 162 480 72 -87 -181 -5 -105 -36 42 140 -12 102 48 -49 158
6798 158 -41 -38 81 74 116 29 -143 -2 132 -20 -200 -128 -74 385 178 164 -343 249 190 -91 -25 -229 -190 142
6822 142 -126 39 191 158 9 87 367 -131 -42 -172 80 -255 -84 -172 -22 95 204 -289 -203 237 123 82
6844 82 -20 -235 -151 -77 -210 5 64 -111 38 -95 -216 264 -296 -5 -160 229 13 72 -185 -265 123 -290
6866 -290 -32 313 185 47 18 269 -141 61 -5 -23 -157 195 -55 55 198 83 192 22 110 54 -87 191
6888 191 -119 -206 -120 275 275 159 103 15 84 17 136 351 -46 90 -53 -337 -13 161 -6 27 130 -20 207
6911 207 60 208 -119 -17 -51 -112 205 -185 184 -27 96 -52 70 19 -181 -74 319 -124 -2 100 -85
6932h5K45k24L7p6j61N86l62J47l6j0j83J79J18j65j00N9K57m06J68J46r2J8J2
6955G2j30J47j54j03L34j84j52L20j6j71J03J0K00k96k7J38l06j11J96K6K29l83
6977b58J76N6K00j04JJ74J0l70K43J18j47r9J25l19N19l95L8j95N7K49qm7j32
7000a08K39j21l4qJ17j89K59k54K09j54m9K37n6j49n9J38L30m10J96m7l16N48
7022C19n47l7L36k63J72Jj13L23k46k94L07k77J61J58k0j16L24k36J62j34J35
7043A15R2m08M37k80J2j12L23l55L49l33m0K00K22n2m2k29K26J66m40Q0j14M12
7065B29k10k19Q2k20N69k74m6nl2K50k38J36l74K79J17j97L3N5J20R8j60J65k86
7088a28M76o83L80j80K94J50l42j14J89k95J40j66M30l65J56L36k02j16J50J2
$$ plain form
6932 -85 160 -64 -27 -103 -264 322 -40 107 71 61 -122 57 175 10 -90 -31 226 -180 -12 134 42 60 72
6955 72 -58 89 -65 -168 166 -18 -170 150 134 -37 66 76 276 -20 -47 91 -215 -326 -130 -104 125 -258
6977 -258 -82 -26 174 70 71 245 255 -115 128 246 99 0 125 -194 325 -70 -32 -227 -170 79 71 24 -108
7000 -108 131 10 -24 -32 85 -104 155 -99 110 -44 -93 144 88 -61 -120 18 348 -62 134 87 -229 319
7022 319 -228 -265 71 -192 -20 -19 -132 191 -55 -349 -42 -319 -158 0 -20 -136 188 -48 114 -20 115
7043 115 207 -201 236 -44 -32 -144 179 -176 173 -160 -200 0 222 170 128 -101 125 291 -149 -69 -183 229
7065 229 19 -200 -118 -338 231 -43 -89 -94 -126 124 -114 22 -352 -73 44 -153 -120 -65 55 153 -7 158 -128
7088 -128 348 -335 45 -135 159 309 -33 -147 42 -253 -113 -279 151 -214 -58 278 76 -40 110 122
7108A22k05m6J54j13J96l79L60j58Q7o9j76L15J67m85M38l48J17K78j1n5r9l0
7130F0l48K36L9K80j79j15R6n2p5K34j62q4J48k66L25o0j51P3N6o9M6j95k0J28
7154e5J47m9j60j94M76Q9j37m37K05J19K16j47j00l61N08j93m9K9m6J14r4o2J85
7177DK53k57L07k22j49nm9L00j36rq6J28k27N3P4K02k34J77K3R1n50M12j23j30
7201a53L17l3k62L2J18J49j70J09j93L9J40j00%J44j26J19k18q8J98j8K42J11
7223C57m68M1L62j74R6m16J10l4L32k31L30p00N85k5k62j05m5L51j14Q2l55j93
7245d76L73l9K19J52k39q0l36M77j13n4K55j47LN3k2K3j15J13OJ14n90L37K95
7268B09j95N0j46P0K0J6KL91k94j12R1K1j96j31L98l33K50m9o9K97o9k82J36m8
$$ plain form
7108 122 -83 -129 25 -88 108 -271 89 -69 18 -51 -227 88 255 -230 208 -140 -23 255 244 189 90 60
7130 60 -288 -52 -13 267 88 -27 69 17 -58 176 14 -70 78 -188 137 77 -74 -1 55 -14 32 -163 -183 -55
7154 -55 92 43 -117 -311 165 254 117 -320 -115 4 220 73 -27 -388 120 -73 -122 -93 -139 -25 -119 -181 4
7177 4 257 0 307 85 -64 -69 -118 182 46 37 -49 79 -148 -95 -21 181 -53 124 147 238 -312 100 -23 -153
7201 -153 164 131 -131 -99 19 168 -2 107 -86 -47 93 -7 -7 137 11 130 -88 -176 22 4 246 357
7223 357 -111 -70 292 118 214 -202 -92 -126 206 -25 305 -395 190 165 -97 -202 -247 104 -10 72 -283 -476
7245 -476 -103 -142 77 229 -10 -90 -426 51 -62 -116 139 -8 -5 48 26 49 -66 47 53 167 -423 -86 209
7268 209 14 64 -82 -12 8 24 26 417 123 11 102 123 -73 -204 194 -139 111 62 -7 290 221 -61 75 27
7292B7j29j3L14j02p2k7j29j94K35p3J55M03l74j94L8L01N4j61k1K85l8k28j63
7315a06N9P1j37R0j64L55n9k38N9K4K45n20M24j05K14l2J95m84M84l4L1o05M98
7338B65l17r4P1L80j10O0l12j84K79j37L0q3J65J93k04J81l19J94J28k68K64k07
7360b5k35J24L71j90J85o15L21P8j2l98L34l02L53k89J14L28l50J16K04K51k14
7381A49j18J02M7j62J63o9j88J1J89k01K32j96k21L42j54J60J20l18K24Q5k41
7402d4l21N99j21l28M38l38J4J27M4k15P3j63oK70q9K6J44k75m1Q0j21J81K39
7425A73j18j23K00j48K50m34J85j95K88j91N8j4RM3J73m14K89Q9m22L73j5j40
7447h4L62l79n5O3p5K92j17K59m28L18n9j6j93j12J32K4j40m2J25P8j37J16J02
$$ plain form
7292 27 -102 -115 199 97 25 -2 -131 -325 -90 -163 -8 395 21 -173 -135 166 220 59 38 323 285 57 -106
7315 -106 -47 24 -113 -23 -187 168 109 -129 -70 -46 199 -321 103 -2 212 180 375 -109 375 341 372 -233 265
7338 265 -52 -146 -75 305 195 255 -57 -241 38 -99 -69 -152 13 206 2 183 -136 58 186 -82 182 -25
7360 -25 -260 -136 235 45 230 -385 -64 14 2 -396 -62 -364 -11 -300 -186 142 -208 -92 112 363 149
7381 149 31 133 180 18 181 112 -76 -65 124 -77 155 -41 -262 80 -74 86 206 -112 112 197 -44
7402 -44 -365 234 113 -215 223 -115 -101 26 70 -145 -72 -235 -241 29 -60 -34 110 -165 -206 -126 -247 -66 173
7425 173 55 -68 132 -16 234 -200 -15 -210 78 -113 -55 -69 -60 -17 156 -258 31 120 -302 71 56 -84
7447 -84 278 -101 -156 -93 -168 124 7 266 -162 156 97 81 -112 -224 -92 -68 -208 -250 -125 -47 -184 -68 34
7470C4P2J88p3j91J0k06J35j43l7K53Q4r8p4rJ06r8o2J76p2K62k79M55l32k7m38
7495c64K05M01m41J61J27r1k7%j45j97N38Q9l13M1J34J37J16p00L9K99j83J42
7517c2J95j31K13l34j5K5NJ66l17L02k17M9K30J5k43m7k4J41J95J04j84n9r3j28
7541a84M01j9n20L46m7L07r3l75K76l13P3L12r8l03O7K26J26n10M06J3L82k68
7563B05k86J81J9j42N5r2J86k28M91m49j38J47n0J8K93k31J84j69J14K86l09j49
7585f4K05k54N3K49l72J77m64N19l43M19P6k35Q9j11l8P2K8J24P1k31p4J81j8
7608E9j25K91k51j58JJ79m4L00o7o9ll07M73l79Q6J51q6J99l79J77rk9m3l6J76
7633A07n8M5l4J75l29J78j38j35K26j47K82L23p39J81J53k86M01k30j78J56j5
$$ plain form
7470 34 106 294 221 30 40 -166 -31 -174 -211 42 126 28 -46 -55 51 -47 -109 67 -5 257 -22 433 101 74 -364
7495 -364 -159 242 -199 -38 89 -2 -29 -29 -174 -371 167 256 -57 -16 118 255 371 -329 -290 9 -174 -32
7517 -32 163 32 245 -89 -104 -79 -74 92 -225 77 -140 -91 139 154 -89 -136 -160 -19 176 280 96 37 -56 -184
7541 -184 217 198 -322 24 -23 284 191 -184 92 -221 -148 164 66 -237 -170 56 182 -328 78 91 473 205
7563 205 -81 100 119 -23 32 -60 126 -102 389 -60 -198 -51 -101 -83 210 -21 163 -6 108 394 85 -64
7585 -64 141 -113 -60 189 -183 -6 -470 49 -294 125 201 -34 55 -56 -94 -22 6 130 201 -30 -104 77 59
7608 59 -66 225 -26 -184 -183 -4 -48 252 185 116 113 -194 279 -100 -14 137 51 250 -129 48 39 10 -33 -69 107
7633 107 49 94 60 235 -94 84 -54 -189 37 -110 172 495 -244 -63 90 -196 205 -25 -203 -47 -62
7654f2J5O4m8Q9l61M38j08J84j69j18J87j60j08M92n37Q3L92O6o08J53J3j03O22
7677D16k71M3n41L04K17O5k18p7K36k31L8l9J85k05J13m9J06j05k17J96J62M1
7699A69l66J26J85J24j94k42M13k61O9q6l9M69n39K20p1K33m08K52J41P2l18K0
7721c1J49R6m09L18j53k09K60o8J66mj4j11r1j6K20q6q3N4p2j26j9K02K75m89
7745b41J28L4L21l58J71k63q2M32Jo1K03k24q3K82j43j60M8L6j06K01k34J26J86
7768B14m07K67k26l1M71l25L39l76j1K68j83l95M29r0P9J39k97J09Q4k75N37k66
7790E4L84k56J27l54l5j4K47J30k24k00P7J03K13q1K19l20J74k57N5k35M96n14
7812b11K5M96k9l15J0J03m6k17N2n4Q8J09j01J74k45J68N4L3k64J78k74N60q2
$$ plain form
7654 -62 -47 17 -31 58 -303 135 27 211 42 -76 111 -49 -157 335 -202 -119 273 339 -269 -116 -103 -206 416
7677 416 145 188 -353 -49 168 233 15 -62 174 -57 -19 -58 127 -78 35 -14 92 -13 -230 -34 128 169
7699 169 -197 -71 114 238 44 -198 215 -46 23 -63 -102 367 -172 48 -23 210 -198 54 195 267 -51 -31
7721 -31 118 214 -195 123 -30 -239 21 -47 119 115 101 -10 -101 -117 103 17 -66 -12 -84 -210 -229 -27 248 -241
7745 -241 -113 -79 242 -116 55 -208 -290 142 143 82 285 61 -22 260 117 -43 5 41 -65 136 -98 28 214
7768 214 -193 74 -152 -183 288 -37 302 -74 -85 183 0 -395 34 -56 23 162 -135 -26 58 -217 320 54
7790 54 438 182 309 -45 -80 -94 153 283 59 -141 -64 39 252 171 390 70 244 -13 42 -193 303 -211
7812 -211 -186 310 281 -34 -24 79 33 -184 -132 -186 -98 11 -90 84 -161 7 61 94 -170 8 -266 294 212
7835B12k90p2J27k59M50k59N8L9j5m2J03L50n4j27j73j9k38M09j61k08J77L05
7857C13n19L23K97k72l1j46j22j46L87J57q3k29P2J59Lk86O9M1j23L25J3Q7l52
7880f3N3K67l22K43k07m2L6J30j41k35J76J41N8l92K39n7J33L0j01j30J79K49
7902B44n51K70K56jj23n3j04J46k05N4R5J55l31J77K02m48J47J14K9K21j99L22
7924D17l61k31J26m0L70M7l84j47o5L05k00J51l71M46r9L56k15j8L8n32K09M59
7946B61k58k41L17N8j23l9O4N8j58J23j65l3J5K63k88j18N45q5J90j89n8j77L2
7969fK7k04K50nM6J16l92Q1r8J49K92l32J23Lj92Q9k8J34J97k82K42m51K68J68
7993A95l39K23O6j37q2j52K73k02K6j88K97M3k32K34J87j96K77k9j40J12rp5l37
$$ plain form
7835 212 -78 -150 -23 -282 168 -91 -33 6 -9 -51 52 402 348 221 48 29 -209 200 39 -169 8 313
7857 313 -206 117 414 142 111 -35 -157 -303 84 241 158 -71 1 160 163 -123 -54 -13 -136 189 202 289 -63
7880 -63 -10 257 -65 178 -29 -71 -35 95 -46 -281 -105 36 94 -298 -59 -116 17 47 -54 -184 -5 244
7902 244 -307 -37 219 218 95 42 -62 84 -121 -67 28 183 -148 29 231 -217 -70 44 73 294 95 417
7924 417 56 -175 -49 -89 281 328 -56 -203 -268 37 -163 -12 -383 63 -36 320 105 87 125 -407 -198 261
7946 261 3 -238 79 137 14 -25 39 97 -61 62 -103 -136 -121 142 -146 -264 281 196 386 197 139 -38 -6
7969 -6 21 -183 67 62 108 224 -168 -87 -185 -36 256 -76 47 50 -142 -53 -81 53 250 -32 210 -241 27 195
7993 195 -144 79 145 8 -74 -226 47 -155 -129 -317 -20 23 -209 25 212 16 293 264 124 236 227 152 -185
8016a85J88r8pL03k8j76j66K92M8k46J67k3j19j18M5q2L5J24j98J54N4j99J62
8039g3m3l5j2K77k1n2Mp7j4K79l52L53j33J90o97M37qL25k90J03o0j62J63l6J90
8064B56m35J79j41J27k32j31M74j29r4J31l2J08j7j56K97l76L58j26J9lj56J93
8086A14k20P7j54J2k04L19j0J51j42J08J28Q0m99K75k66K87k47Q8j27K8NL00K39
8109C42l39k0oJ81j47j60J72Q5k29L26n26Q2J71j05r3J17K17k46M2J07L6JJ11
8132A19o6j59J96J2l0k6l7j88K40j24J29K28j06l23M58k42n5n8l7j1j94K70q0
8155h4J71l74K54J77k56J87J48l15J47k2k09J50k9K8k49K98l5j64K0M0K22l65
8177b60j6K8M01r7k01J09J14K11k21J84k75L16l59k31
$$ plain form
8016 -185 3 -95 -102 201 173 -3 -169 123 171 -75 92 69 -50 -168 -123 -205 -170 -46 -244 -90 -36 -235 -73
8039 -73 -116 -151 -163 114 93 41 45 -32 -46 233 -119 234 101 291 -406 31 23 348 58 161 101 -61 102 66 256
8064 256 -179 0 -141 -14 -246 -377 97 -32 -126 5 -27 81 64 -92 205 -171 187 61 80 77 -79 114
8086 114 -106 -29 -183 -171 -375 -56 -66 85 -57 51 179 259 -240 35 -231 56 -191 -103 -230 -202 -197 103 342
8109 342 3 -17 -23 158 11 -149 23 108 -121 205 -321 -239 -68 -173 -266 -149 68 -178 -136 -29 7 8 119
8132 119 53 -106 90 102 72 46 9 -179 61 -63 66 294 188 -135 323 81 26 -32 -69 -80 -274 -4 -84
8155 -84 87 -287 -33 144 -112 75 223 -92 55 33 -176 -26 -55 -27 -276 22 -13 -177 -157 -117 105 -260
8177 -260 -276 -248 153 56 -145 -36 78 289 68 252 -23 293 -66 -297
8191b97
$$ Imaginary data points
##PAGE= N=2
##DATA TABLE= (X++(I..I)), XYDATA
0@%%%%%%%Qj6J6j6K4l2L2m0N6o6P4q8J09j33J52j76K06k36K70l08L51l99M50n08
31b70N72o42P20q03Q95r96J108j233J365j511J676j855K054k275K521k801L116
48A641l475L889m376M958n661O538p663R171j1317J4623k0457L3833j23343j4958
62a16597K00850K5956j2442k3771k0113j15859j01079J7363J41945J03308Q915
73A08476m0103j6697l9932q1827o4031M7548J17483P5688j5347l2829j7374m7627
85f572r5446m6112O7070J12140N3342k372r873l0481q4642q3277L696Q7412Q8712
98E3597M1241M12l1407o8938p8882l0619M4373Q6104O8169K0440k2851n3517p1434
111d3312n8868j521O0366P1605L8842Q895j2122m6605p3186m3565K3304N7797
$$ plain form
0 0 0 0 0 0 0 0 0 8 -8 8 -8 16 -16 16 -24 32 -34 40 -48 61 -72 80 -96 110 -126 144 -164 187 -212 238 -270
31 -270 302 -340 380 -423 472 -524 584 -649 716 -795 881 -974 1080 -1195 1326 -1475 1641
48 1641 -1834 2055 -2321 2637 -3024 3514 -4149 5022 -6295 8328 -12129 21704 -101639 -116597
62 -116597 84253 110209 97767 73996 53883 -61976 -163055 -145692 -3747 99561 108476
73 108476 68373 51676 11744 -70083 -134114 -86566 30917 106605 91258 58429 41055 -6572
85 -6572 -102018 -148130 -81060 31080 84422 82050 72177 41696 -42946 -126223 -122527 -35115 53597
98 53597 94838 95250 63843 -5095 -83977 -114596 -70223 15881 84050 104490 81639 28122 -43312
111 -43312 -102180 -103701 -43335 28270 67112 76007 63885 17280 -55906 -99471 -76167 -18370
123a8370M3497L0537K4398j2698o8599p3725j6535L9083N1441M5535M0710J1213
135I6487m7470q6091o1841L786N1706N9029M5286K6122j0899o1583q1915l7041
147a04424L2918O0822M3952K7753J5834k3949p1008o3484o17M6920M6285L2378
159D3380K8854N330m5522p1579m1409J2152L8966M0643L7992K5181j0380n4415
171I193o3785k6419K1374M2743M0573L2756J5255k6200o3594n2856j830L6163
183c6627M0351L6007L1133O37m8097o4209k9587J3105L1880L4835L8262K3255
195G0945j8397n4309m8825j3335J7033L0213L6025L4233J0296l0657n4219l7378
207e8375J25K4592L1308L6159L1239k266m5440n3677k1586J0115K1678L0850L9538
$$ plain form
123 -18370 25127 55664 80062 67364 -1235 -74960 -91495 -52412 -971 44564 85274 96487
135 96487 49017 -37074 -98915 -95129 -43423 15606 60892 87014 76115 14532 -67383 -104424
147 -104424 -71506 -10684 33268 61021 76855 52906 -18102 -81586 -82203 -35283 11002 43380
159 43380 72234 77564 32042 -39537 -80946 -68794 -29828 10815 48807 73988 63608 9193
171 9193 -54592 -81011 -59637 -16894 23679 56435 71690 45490 -18104 -70960 -72790 -36627
183 -36627 3724 39731 70864 71501 23404 -40805 -70392 -57287 -25407 9428 47690 70945
195 70945 52548 -1761 -50586 -63921 -46888 -16675 19350 53583 63879 33222 -20997 -58375
207 -58375 -58250 -33658 -2350 33809 65048 62782 17342 -36335 -57921 -47806 -26128 4722 44260
220D4260K3136k1514n1516l9302p936J1684K2700L6169L5770O110l4488m7855
232b2782k6969N5J6590K8096L8301K9120q080m3571m3959j6175O800J7532K9887
245D845L9155J8473k4329m7263l1117m334Q552J9128L4986L3808Q98l5997m0662
258b3857j8965P62J1465K5582L7424K4761j2497l9156l3848j1865K854J2643K9675
271D978L6505J3834k4572l9481k4138n871M228J7347L5506L1650k977l4254l4181
284b1426j5368k692P995K7237L8112J9601j6640l5306k6471j0090j110J2979L1937
297H758L3577O217k5879l2333j7455o250R69J8120L4942K5650p554l1013k5718
310a7969j2272n870N616K6698L6793J4849j7683l0029k0531j0182m226J2037L2644
$$ plain form
220 44260 67396 45882 -5634 -44936 -52872 -41188 -18488 17681 53451 59561 25073 -22782
232 -22782 -49751 -49696 -33106 -5010 33291 62411 54331 10760 -33199 -49374 -42574 -25042 4845
245 4845 44000 62473 38144 -9119 -40236 -44570 -36018 -16890 18096 51904 52802 16805 -23857
258 -23857 -42822 -42060 -30595 -5013 32411 57172 44675 5519 -28329 -40194 -37340 -24697 4978
271 4978 41483 55317 30745 -8736 -32874 -38745 -34517 -17170 18336 49986 47009 12755 -21426
284 -21426 -36794 -39486 -31491 -4254 33858 53459 36819 1513 -24958 -35048 -36158 -23179 8758
297 8758 42335 48552 22673 -9660 -27115 -33365 -32396 -14276 20666 46316 38762 7749 -17969
310 -17969 -30241 -36111 -30495 -3797 32996 47845 30162 133 -20398 -30580 -34806 -22769 9875
323I875L1019K402k4696k6390j5342q502K21J9796L3707K1096r826k7319k1994
336a5953j1886o105O092K7611L1785J0281j7214k4988j7111j1883l655J4291L0540
349A1805K4254l00j9761k1328j5303j0530J951K2219K9807J4289r479k0265j8830
362a1471j5067q112J0409K8116K5923M643j3969j8093j7124j5396l364J8789K9541
375A4825J7524l820j4725j5424j6781j3601M594K5097K6588P367r517j4047j5782
388g702j7742r172J3083K9149K0614j36j1141j3526j6108j6865k504K0381K8222
401A6553J2241n453j0897j2223j7502j4067O516K5319K2791M297q417j1055j4330
414f227j8338p715J4240K6718J6316l88q791j1532j6885j6617K60K0634K3650
$$ plain form
323 9875 40894 43296 18600 -7790 -23132 -31634 -31413 -11617 22090 43186 33360 6041 -15953
336 -15953 -27839 -33944 -27852 -241 31544 41825 24611 -377 -17488 -29371 -33026 -18735 11805
349 11805 36059 35759 15998 -5330 -20633 -31163 -29212 -6993 22814 37103 27624 7359 -11471
362 -11471 -26538 -34650 -24241 3875 29798 34441 20472 2379 -14745 -30141 -33505 -14716 14825
375 14825 32349 28529 13804 -1620 -18401 -32002 -27408 -2311 24277 31644 22127 8080 -7702
388 -7702 -25444 -34616 -21533 7616 28230 28094 16953 3427 -12681 -29546 -32050 -11669 16553
401 16553 28794 23341 12444 221 -17281 -31348 -24832 487 23278 27575 19158 8103 -6227
414 -6227 -24565 -32280 -18040 8678 24994 24606 15815 4283 -12602 -29219 -28959 -8325 15325
427A5325R608m091q066j2716j8328j2196R032K3850J8441K430m942r350j5227
440f230j8749m641J6386K2852J2027o34n123j0789j8355j5232L144K0215J9605
453A4476O070k066n586j3083j8630r746J1286K1424J3574K168k448p193j7115
466f869j7764j798J7097J8688R302J93l391j0598j8626j3151N561J8966J4727
479A2337N099j52m635j3455j8325p028J2056J8387J0816K484o51p420j7098j6093
493b3678O06J6054J5285P149K294j730j1930j8907j0043P658J6077J1104N502
506A5441J775m697j5327j6204l449J1445J4440Q634M436J51q215j7182j3028K221
520a9559J4174J1992O313M150j248j3077j7953p157Q141J3302Q491O383L567o179
$$ plain form
427 15325 24933 20842 12776 60 -18268 -30464 -21432 2418 20859 23289 18347 8997 -6230
440 -6230 -24979 -29620 -13234 9618 21645 21011 15888 5099 -13256 -28488 -25344 -5129 14476
453 14476 20546 18480 12894 -189 -18819 -28565 -17279 4145 17719 19887 17439 10246 -6869
466 -6869 -24633 -26431 -9334 9354 18656 18849 15458 4860 -13766 -26917 -21356 -2390 12337
479 12337 17436 17284 12649 -806 -19131 -26159 -14103 4284 15100 17584 16933 9513 -7585 -23678
493 -23678 -23072 -7018 8267 15416 17710 15980 4050 -14857 -24900 -17242 -1165 9939 15441
506 15441 17216 12519 -2808 -19012 -22461 -11016 3424 12058 16494 16645 8430 -8752 -21780 -19559
520 -19559 -5385 6607 12920 17070 15822 2745 -15208 -22365 -14224 -922 7569 13952 17519 11340
534A1340j6212j4007o49J0651J0901Q129O311L66j0197j6718r932L955J1410R452
548D800O576N791k189j3851j6524m031Q324R964P003P264N011p800j7210j1187
562a8059K357Q750P802P607P562j7j1887j4945o566M598Q318P869P451N622l338
577A3124j3999j3218k466P180P797N877Q169N023q205j6720r339L583O767N366
591a061Q137R783p47j3626j4507l114M438N574P337R736M772o399j3346j0192
605a3215n64N435O464O776Q259K482r563j3262o482L146M855M046P952R270j463
620A4136j3404j1349j038K544K536P183J0924N902q073j3099p638k41K316N598
634c703R542Q938q5j0278j2604m639K753M062N557Q157P720l736j3145r376P36
$$ plain form
534 11340 -4872 -18879 -19528 -8877 2024 10153 16464 16830 6633 -10085 -20017 -16062 -4652 4800
548 4800 11376 17167 14978 1127 -15397 -19428 -11104 -1140 5863 13127 18138 10338 -6872 -18059
562 -18059 -15702 -6952 850 8457 16019 16002 4115 -10830 -17396 -12798 -4480 3389 10840 16462 13124
577 13124 -875 -14093 -16559 -9379 -1582 4295 12464 17487 9282 -7438 -16777 -13194 -6427 -1061
591 -1061 7076 16859 16112 2486 -12021 -15135 -10697 -5123 2214 11950 16722 10323 -3023 -13215
605 -13215 -13779 -8344 -1880 4896 13155 15637 6074 -7188 -13670 -10524 -5669 -1623 6329 15599 14136
620 14136 732 -10617 -11655 -9111 -6575 608 11532 17434 9361 -3738 -11376 -11617 -9301 -3703
634 -3703 5839 14777 14692 4414 -8190 -12829 -10076 -6014 -457 7700 15420 11684 -1461 -10837 -10101
649a0101L185J670N771J0851L713q648j1261l622Q3L80L139J0107Q202j007r291
664C171q760l851p03K322O705R742N620m083j0481q060j724J072K738Q155J0734
679A2597J516r142j0183k960j87k82N026J0876O568m770q828n250k255j768J281
694g761Q133R377K246n733p418m096k074j326K567Q442Q847P47q187p321k307
709e864j645j973M777J2155O695n570q951l899j738l438R69R619J0097P04o974
724D964o976l104k940q43M790Q499O827j671p331o495j588p24n50M354R170N236
740A1618m652p240l353j400l241Q67Q217Q466J57n001m345l762m243j395N309
755c998Q620M636r98m375n543m351k757K030N958P689K908l320o015l838l041
$$ plain form
649 -10101 -6916 -5246 525 11376 15089 6441 -4820 -8442 -8359 -7979 -4840 5267 13469 12462 3171
664 3171 -5589 -9440 -10143 -7821 -1116 8626 14246 10163 -318 -8378 -10102 -9030 -6292 1863 12597
679 12597 14113 4971 -5212 -8172 -8359 -8641 -3615 7261 13829 9059 231 -5019 -7274 -9042 -7761
694 -7761 372 9749 11995 6262 -1156 -5252 -7326 -8652 -6085 2357 11204 11951 3764 -3557 -5864
709 -5864 -7509 -9482 -4705 7450 14145 8575 -376 -4275 -6013 -9451 -8482 1137 11234 11938 4964
724 4964 -2012 -5116 -8056 -8899 -4109 4390 11217 9546 2215 -4280 -5868 -6592 -7142 -2788 6382 11618
740 11618 6966 -274 -3627 -5027 -8268 -7401 816 9282 9439 4438 93 -3669 -7912 -9307 -3998
755 -3998 4622 9258 8260 3885 -1658 -6009 -8766 -6736 -778 6911 9819 6499 484 -3354 -6395
770f395k053K935Q072O541j479m622l236l035m245r95O104P738K237k278k709
785B580k398n158l898K462O736N519J389j962l064m103m859k154L739P705N459
800G993o93l964k749l966m881m59P001P951J178k962j715k984n228l339L441P589
816B213L994l56k111k156l427m549r65M082O697L235j573j997k111l840m078j45
832g087N983O092R86j445j523k707n362l404L430O869L670m60p10j822m703n147
848g340j80N442N690K047q92j412k421m759l394J487N697M706L18j079j100l038
864b28m917k185L746N472K593r6j67j603m688m737O89M495M633J316M32o22l102
881A031n207l018K416M849L417J049k7j473m037m449j063L853M330J891P71j58
$$ plain form
770 -6395 -8448 -5513 2559 9100 7621 2999 -237 -3272 -7517 -8512 -2408 5330 7567 5289 2580
785 2580 182 -4976 -8874 -6412 324 5843 7232 5270 2206 -1897 -6756 -8910 -5171 2534 7993
800 7993 7300 3336 587 -3379 -8260 -8719 -1718 6233 7411 4449 2734 -250 -5478 -8817 -5376 2213
816 2213 6207 5851 3740 1584 -1843 -6392 -7357 -3275 3422 6657 5084 3087 976 -2864 -6942 -7087
832 -7087 -1104 4988 5974 4529 3006 299 -5063 -8467 -5037 1832 5502 5042 4332 2510 -2193 -7340
848 -7340 -7520 -2078 3612 5659 4767 3355 934 -3825 -7219 -5732 -35 4671 4989 3910 2810 -228
864 -228 -5145 -7330 -3584 1888 4481 4385 4218 2615 -2073 -6810 -6121 -1626 3007 4323 4755 4133 1031
881 1031 -4176 -7194 -4778 71 3488 4537 4510 3037 -1000 -5449 -6512 -2659 1671 3562 4333 4175
897D175k191m709l749J425M464K887J278R05m70l774n071j352K771L896K142J029
913C656P78j349m436m012l3L450L349J181J534J82k195n340k667J869L443K345
929A755J208J100O4l931m936o09K435L299J517J351J133j272m990l390O97K968
945a601K653J469J557J53k810m750j739J702K792J699J479J910j019l872m378
960d755j26L129J714J760J704J176k437m334k465J254K126J620J609J945M2l275
976F87l825j371J648K154J401J697K101j046m271l234J73K097J393J639K338R53
992D534k854m098j739J242J410J479K191J986k84l949l317k68J240J575J512K134
1008B794J591j778l812k177J66J377J187J743K901j15k955l420r29J176Q49J433
$$ plain form
897 4175 1984 -2725 -6474 -5049 -585 2302 3580 4485 4015 241 -4830 -6182 -3411 485 2627 3656
913 3656 4434 3085 -1351 -5363 -5396 -1946 1403 2584 4118 4300 2105 -3235 -5902 -4033 -590 1755
929 1755 2963 4063 4127 196 -4740 -5349 -2914 385 1902 3253 4386 3114 -1876 -5266 -4569 -1601
945 -1601 1052 2521 4078 4231 1421 -3329 -5068 -3366 -574 1125 2604 4514 3495 -377 -4755
960 -4755 -4881 -1752 -38 1722 3426 4602 2165 -2169 -4634 -3380 -1254 366 1975 3920 3962 687
976 687 -3138 -4509 -2861 -707 694 2391 4492 3446 -825 -4059 -3886 -1789 -396 1243 3581 4534
992 4534 1680 -2418 -4157 -2915 -1505 -26 2165 4151 3867 -82 -3399 -3667 -2427 -852 660 2794
1008 2794 4385 2607 -1205 -3382 -3216 -1839 -652 1091 3992 3877 922 -2498 -3427 -2251 -1402 31
1024C1K109J967j156l367k214o0P44N04J978K502P82j917l436j247M56N92Q67
1041h65K203K794p41k748k369q28K58L26J487K918J662j715k858j768k81L32P86
1058a407J896K681K37k370k308j031K60n1J182K632J959p86k692k113J32j71L8
1075a912J955K696Q23j838k688j160K36l23Q72K455J872J58k406j632o00n46k54
1092b292J406K898J073j122k156j618n0j01J47K194K503M12k108j797q89j13n43
1109b156R26K383K048o35k034j178p31q18O0J684K424J147j567j723p09o83q32
1126b394Q07J789K561k97j516j234r34m03m18P38K562J916j673j157p58o44q50
1143a905m3J504K701o9p91j294o76p36o48K96K606J100Nj038j188q26q11n06J513
$$ plain form
1024 31 2140 4107 2951 -416 -2630 -2690 -1946 -1442 536 3038 3820 1903 -1533 -2780 -2324 -1732 -865
1041 -865 1338 4132 3391 643 -1726 -2554 -2296 -1970 -483 2435 4097 2382 -476 -2244 -2525 -2193 -1407
1058 -1407 489 3170 3407 1037 -1271 -2302 -2042 -2093 -911 1721 3680 2894 202 -1911 -1779 -1950 -1912
1075 -1912 43 2739 3562 1724 -964 -2124 -1888 -2211 -1339 1116 2988 3146 740 -892 -1492 -2038 -2292
1092 -2292 -886 2012 3085 1963 -193 -1811 -1861 -1962 -1815 379 2882 3294 1186 -611 -1500 -1613 -2156
1109 -2156 -1230 1153 3201 2566 532 -646 -1377 -2195 -2135 -451 1973 3120 1553 -170 -879 -1562 -2394
1126 -2394 -1587 202 2763 2466 950 -284 -1218 -1621 -2039 -1301 1261 3177 1504 347 -411 -1055 -1905
1143 -1905 -1948 -444 2257 2188 1397 103 -573 -1309 -1957 -1661 945 2045 2050 1012 -176 -1002 -1813 -2319 -806
1162h06K444O15p28r67q01n93j524M75K063J870j92p93j027n78j301m63J176K117
1180I87J235p34q66m55q97j499N30J531J937K0q44n77n76j232q53Q62J823J053
1198A445L69p96p14q75q89q90J553J850N33m42o09k87j092p58j38J798J682l95
1216A345l15k53q67j573n66R98K022N66L5n91l39j015j381K25J091J715L67k82
1234A182n69k36j232j436O15K203Q81j62l72J41p49j478o08R81J353O93j18K77
1252A366n31j326j044J35J022Q69N87l07J67q45r55j046P34J302R44p6k45k6j205
1271d80j234QJ143J160M09j09L32l23k118l28N11R98L88O12M12k52r24j330m29
1290a554P54J146N57J35N8j68j213j175rJ078Q37N05j64O34q63j459o73O78R71
$$ plain form
1162 -806 1638 2253 1525 558 -243 -836 -2360 -1885 178 2048 1856 1063 36 -542 -1843 -2306 -1130 987
1180 987 2222 1488 622 167 -730 -2229 -1699 -168 1769 1789 945 368 -208 -1440 -2293 -1431 392 1445
1198 1445 1814 1018 304 -571 -1460 -2350 -797 1053 1586 1144 535 248 -844 -1602 -1740 58 1740 1345
1216 1345 1030 777 -90 -1663 -2229 -1231 791 1357 1392 801 462 -553 -1934 -1709 -618 1097 1464 1182
1234 1182 613 377 -855 -2291 -1676 527 1408 1246 874 1015 266 -1212 -1820 -839 514 1207 1089 1366
1252 1366 835 -491 -1535 -1400 -378 491 1078 771 938 93 -862 -1908 -1174 128 1072 996 751 725 -480
1271 -480 -1714 -1706 -563 597 1006 897 1229 906 -1212 -1540 -1029 -31 357 969 1381 1129 205 -1125 -1554
1290 -1554 -800 346 903 1038 1096 928 -285 -1460 -1469 -391 446 951 787 1421 558 -901 -1574 -896 75
1309G5M18m7N97K28j440r98l01O90P43P09K38P4m53q86j036J94P28Q14O76k86
1329G37J53m62j140o12O92R24oL05N85k5j430r91M44L89J88N65O63O0l84j329
1349f74n19L27N88N94N62K05l56q54o75q2N86J86L86J82M91n1q63j224J63O00
1369d28m8P39N63L84j132r17J81J55K19K27P85L78l36q92q35O7K04N66L66M44
1389F90J91k58j161m09L74N36J45P2O13L90j439j47L04o92O03J87N50N64l98r57
1409b42k01m55J50L40M27N36L68l95o93l50j79J45M87M35L70J34r45l29L5j64
1429e26O6K33Q47M66p86q05J81p7O6j26N14P87o3m32o41l43M5k29J63Q32N25j61
1451E36m19q04j44L79j80M59R96j95r7m87k11l11k38L53O88M63J8o99o40M55n28
$$ plain form
1309 75 493 446 1043 1271 -169 -1167 -1468 -778 -35 674 912 986 533 -353 -1389 -1195 -467 347 1023 737
1329 737 890 428 -712 -1324 -632 292 286 591 1176 1151 -279 -1270 -826 -437 -249 316 979 1039 655 -674
1349 -674 -1193 -866 -278 316 878 1083 727 -127 -802 -884 -298 -112 274 456 947 896 33 -1191 -1028 -428
1369 -428 -476 263 826 1210 78 -839 -658 -503 -284 -57 728 1106 770 -122 -957 -890 -686 -120 246 690
1389 690 881 623 -538 -947 -573 -37 108 180 793 1183 -256 -403 -99 -791 -188 -1 549 1113 715 -242
1409 -242 -443 -898 -748 -408 19 555 923 528 -165 -515 -694 -549 -62 373 743 877 -68 -397 -362 -526
1429 -526 -460 -227 620 1086 300 -505 -324 -401 -335 -461 53 840 777 345 -296 -639 -594 -823 -660 172 697 536
1451 536 117 -687 -831 -452 -632 -173 823 628 531 44 -167 -478 -716 -363 325 788 806 107 -533 -78 -606
1472f06j82P05P87j41p7k88l92j49J3k21M43P80r1J00q44n39K99j98L81P03M22
1493I05n82l33p4k67j16q6P77M29J15m92m10M0l73k1K04M14M27l00l04m97K54
1514b90K41p60M64Q01L57k05n94j1j10n19r9Q55M98j73k40k83j18k72J92L27K18
1535B79M12j19m23j00m61J65k23O63L8K41R0p33J43oo76K23L22M10K77k84Q8k49
1557G7m70k39O10K58P9j02j83k3q9n49J15M09O01K66n39Ml34j08j38r0O41L73
1579E69k13k94K86l00m39j05J13M98J00j99J85k31p8n34J52P62K32J03l06q2l44
1600a25Ro3j53M61K88k81r8j8j82m59J43O21P6k1p9J37k85j89m33M03N51j18k18
1623c3L25m1j53l07j93M71k2K13M3q3j7m6p09L4L11K05J40K31J4l95m64J22K81
$$ plain form
1472 -606 -788 -83 704 563 486 198 -194 -343 -330 -551 -108 672 581 681 -163 -702 -403 -601 -220 483 905
1493 905 323 -10 -84 -351 -467 -553 224 653 768 276 -134 -94 -467 -488 -284 130 557 257 -47 -544 -290
1514 -290 -49 -809 -345 456 813 608 14 3 -107 -626 -725 130 628 455 215 -68 -186 -458 -266 61 279
1535 279 691 572 149 49 -412 -247 -470 193 231 472 562 -171 -28 -34 -710 -487 -165 245 522 238 326 77
1557 77 -393 -632 -22 236 315 213 30 7 -82 -631 -516 -107 494 760 221 225 -109 -217 -355 -445 196 569
1579 569 356 62 348 48 -391 -496 -383 115 215 16 201 -30 -108 -642 -490 272 504 607 301 219 -125
1600 -125 -116 -179 -332 129 417 136 38 20 -162 -621 -478 143 219 198 119 256 -29 -218 -651 -248 303 185 -33
1623 -33 292 251 98 -209 -402 69 47 260 303 220 203 157 -552 -518 -207 -2 138 369 383 -12 -476 -354 -73
1646g3M0J28K2j46j85M47p94N5N06l6J84K92J9k98n97J9K66mL09K68j04k78j57
1669a17m21j02O53J13j77K19M5j68j82m37L20M2N01n16M70Rj28J57p55K71L45
1690A42o8k17N83J34n04l68R6K00k8j14L15m7j78j62j02L14p5K59n6N1k1p2n14
1713d32M01m8j56J81r9P09m24k19l78K46N2K24j29K28j06L20o22L8k2L27m6R1
1735A36m5L03k40l57K50L1j87J37J81K8p8l08j21Q3j32L74m0qK75j42m23J42J01
1758d0Q4j24J68K50N8m33j07j52J11J30k48M18L96m01k37o1L94m53K57l7J71J29
1780B73M1m06k24J66j00O1L87l77L74l67P7N9K41M8m2J15Q5k51l72R9j97J42J50
1803a8J79m8l3j37oj21M4J15J58M1p5r2l1j92J56j76L49N2K09m86K93k92j81N89
$$ plain form
1646 -73 -33 95 117 -29 -214 233 -561 -506 0 -36 148 440 459 161 -436 -417 -151 -155 154 422 318 40 -117
1669 -117 -538 -640 13 126 -51 168 213 45 -137 -574 -254 -212 289 -227 243 252 124 281 -474 -203 142
1690 142 74 -143 440 574 70 -298 -202 -2 -30 -144 171 124 -54 -216 -318 -4 -79 180 124 175 154 82 -432
1713 -432 -31 -79 -235 -54 -153 556 132 -87 -465 -219 -167 57 -72 156 50 370 -252 -214 -236 91 45 136
1735 136 91 394 154 -203 47 78 -109 28 209 237 159 -149 -270 -187 -319 55 15 7 282 140 -283 -141 -40
1758 -40 44 -80 88 338 396 -37 -144 -296 -185 -55 -303 115 511 110 -127 -188 206 -247 10 -27 144 273
1780 273 314 -92 -316 -150 -250 -189 198 -179 195 -172 -95 -36 205 253 211 326 411 160 -212 -113 -310 -168 -18
1803 -18 161 113 80 -57 -63 -184 -140 -25 133 174 99 7 -24 -216 -60 -236 113 165 374 -112 181 -111 -292 297
1827B97k40m17M99k30M35l21j64N7l35J98J00M62j04j01l29L15m29J79J90K60
1847C22Mj40l14K07L25o78M58o5j5J8k45N26k70J85n86K43j50L22m34L21N9j11
1869a8J06j65n4O8O15n69l8k07L67j76j49K49j8J11j99J00K08j79k72L78j91J09
1891G6j94J41J05j21L27m87J31l4J74Jj00N9J53m30L47l34J65K3k2J60K36o4n32
1914b20L43j04J07O4q7p5P5l03J97J40j88n2k99K24k5M37n69J4M85J31m28L74
1936B41k84K17j29k92K25P8l66O98m53m1K78m64J51J2L50k26K54j11l47K32j62
1957a39k45O30L7k47l25L71k55J8M7N2J00MJ45P2o2j39k74K76l03K52n1j12L08
1980A60m6m47L07o5j7J90j24J98n0R5l41R1q0j4Q8PK81k79K3l02J1N00m11K73
$$ plain form
1827 297 57 -360 139 -91 344 23 -141 -84 -419 -221 -121 341 237 136 -193 122 -307 -128 62 322
1847 322 326 186 -128 79 404 -274 184 119 104 122 -123 403 133 318 -268 -25 -175 147 -287 34 93 -18
1869 -18 88 -77 -131 -63 552 -17 -55 -262 105 -71 -220 29 11 122 -77 23 231 52 -220 158 -33 76
1891 76 -118 23 128 7 334 -153 -22 -56 118 119 19 78 231 -199 148 -186 -21 2 -20 140 376 312 -220
1914 -220 123 19 126 190 103 28 103 -200 -3 137 -51 -103 -402 -178 -203 234 -335 -321 164 295 -133 241
1936 241 -43 174 45 -247 -22 56 -310 388 -65 -106 172 -292 -141 -129 221 -5 249 138 -209 23 -139
1957 -139 -384 246 283 36 -289 82 -173 -155 -108 -56 44 48 193 265 203 64 -210 66 -237 15 -36 -148 160
1980 160 114 -333 -26 -91 -108 82 -42 156 106 201 -140 -49 -129 -143 -55 -48 233 -46 -23 -325 -314 186 -225 48
2004D8J15k77p5K27m6k06M21k64R8o4mJ10j87j69K83j95J31Q1m00L98j67j81M48
2027A25mj41o7J51J64k18l05J31M05k2m34J09k5J06J48o9Qj71M17l90O6R9j94
2050a11j00M34k25Q5R6l68M86o9k24J85n42M08j0l7O8J26j69l28K01M4K64k45
2072c1K32j25ln9nj31L38ok64K07l1k40J04j15K34J02o2m01M06p9p5k29k56P48
2096B59k71j29n8L06k48K39N5o8pJ76l30j22J90jK9j20M7k56M71j46K36l22q0
2119a50L23q9k42k8K08k22J95Q8k76L5M12l36P9J65J5k07k38J91o3K29rjJ23k9
2143A73j22j33L8N4j07O2n8K06j64J78p8J32m93n8M05n9J22k27J49j75J34J55
2165A34Rj28kq1J09j8j81J39M74o33K77j63J37r1q1M41l11K10l08j57oK3L59j87
$$ plain form
2004 48 163 -114 -189 38 -8 -214 207 -57 41 -23 -27 83 -104 -273 10 -185 -54 27 -373 25 -142 -323 125
2027 125 121 -20 -87 64 228 10 -295 -164 241 219 -215 -106 -131 -25 123 54 62 -109 308 -82 -16 83 -111
2050 -111 -211 223 -2 83 179 -189 297 228 4 189 -353 55 45 8 76 202 33 -295 -94 -50 214 -31
2072 -31 201 76 73 14 9 -122 216 210 -54 153 122 -118 -14 -129 105 207 145 -256 150 71 -4 -233 -489 259
2096 259 -12 -141 -199 107 -141 98 153 85 78 254 -76 -198 -8 -9 20 -100 -53 -309 162 16 252 -70 -150
2119 -150 173 84 -158 -186 22 -200 -5 83 -193 -158 254 -82 -3 162 177 -30 -268 -77 -140 89 80 79 202 173
2143 173 51 -82 -44 10 -97 -35 -93 113 -51 127 49 181 -312 -370 35 -24 98 -129 20 -155 -21 134
2165 134 143 15 13 -68 41 23 -158 -19 455 -178 99 -64 73 -18 -99 342 31 241 -67 -224 -230 -207 152 -35
2189c5J77l95M89L8Q8j77n82M11J08j65J85r8J2j60K23J04l12J08j95j89J95j57
2211c27K81j2l2J68l37L59k23J81L34j98N6k12J89j62p9j68J75j26J19O6L7K09
2233B98l22M6nm2j90L79J08J2k0j00j69R1j37o9K48o4j23M1L57n10J1O9j57K82
2257C4rq1j05K49K9m1K38m42J87j43OK02m63O10m40O5q8J76O8J90j29N4n2k40
2281a25M03n70J71L08k8K3n41J37M43k76J64p9J13j29k41K10K80n59M78l0j97
2302d5K98m49kJ04J86n1l1J53j69j25J8J43M11m04k2l66L60k66L89l77L9K35j64
2325a35J30n2J38p6j45k15M17J42k94J94k4l73K55j53j67L91M8r6l87M54l45J20
2347a73K14K1J32m8K08m07R4j89K75J73j77m9J87m24N06k93j65M33k12R2m0M1
$$ plain form
2189 -35 142 -253 236 274 362 185 -397 14 122 -43 142 44 56 -104 119 223 -89 19 -176 -365 -170 -327
2211 -327 -46 -58 -90 78 -259 100 -123 58 392 194 250 38 227 65 -14 -182 -7 -133 -14 52 89 298
2233 298 -24 22 17 -25 -215 164 272 284 264 164 -5 86 -51 -120 128 64 -59 -18 339 -171 -160 -91 -248 34
2257 34 25 -56 -161 88 117 76 314 -128 59 -84 -78 124 -339 271 -169 -104 -192 -16 52 242 113 167 115 -125
2281 -125 278 -292 -121 187 159 182 -359 -222 221 -55 109 30 143 14 -227 -17 263 -296 182 152 -45
2302 -45 253 -196 -198 -94 92 41 10 163 -6 -131 -113 30 441 37 15 -351 9 -257 132 -245 -206 29 -135
2325 -135 -5 -57 81 5 -140 -355 62 204 -90 104 80 -293 -38 -191 -358 33 81 -15 -402 52 -293 -173
2347 -173 41 62 194 146 354 -53 41 -148 127 300 123 74 261 -163 343 50 -115 318 106 198 158 199
2369A99l16M70k04l73M43k66j55L31k54j76K30r3L61k21J99k43o6J44j49J38J75
2390A74l35J8K50J45r2l26O9Q8m3J56k2O2k0mj26j65P8K54k9o4j1r6k73L25l34
2415c21N60k19L5K02l04K08m8J48k8j33k6J37j7N5j56k40J49k7j96N7L05l05Q2
2438h2r5L27l5k78q5O4J50Q4p6K58k32J36k81J66R2lj79K59j46Q1k01k05M60j61
2462A8K2L9J69l75o5K76m7k60M9R9p7L16M9j81L28l40K61k28K8J80l34k0O3k03
2486b33j6L77l62m1J01K00l31N44m76L03k1j7j03k7P5L7K20l76J06K38l67M73
2508C04k61k95M40j1l33J4K45k56L8K07p1l0N7l0k40J44M3N8J19K3m02Q2R8j04
2532a61J15L7K4r4K48k45j0l8j52M93J47l03j52j33L49j31M4R6k66K31l00L07
$$ plain form
2369 199 -117 353 149 -224 219 -47 -202 129 -125 -301 -71 -164 197 -24 175 -68 -134 10 -139 -1 174
2390 174 -161 -143 107 252 160 -166 -97 -9 -52 104 82 144 124 120 -6 -171 -93 161 132 68 57 -39 -312 13 -321
2415 -321 239 20 55 257 -47 161 113 261 233 100 74 211 194 249 93 -147 2 -25 -221 -164 141 -164 -82
2438 -82 -177 150 115 -163 -248 -184 -34 50 -26 232 0 136 -145 21 113 110 -69 190 44 125 -76 -281 179 18
2462 18 40 79 248 -127 -192 84 37 -223 -174 -75 -152 164 213 32 360 20 281 53 81 261 -73 -93 -30 -233
2486 -233 -249 128 -234 -275 -174 26 -305 239 -237 66 45 28 -75 -102 -27 10 230 -146 -40 198 -169 304
2508 304 43 -252 188 177 -156 -142 103 -153 -115 92 21 -9 48 18 -222 -78 -35 23 142 165 -237 -155 -57 -161
2532 -161 -46 -9 15 -79 169 -76 -86 -124 -276 217 364 61 -91 -224 125 -6 38 134 -132 99 -201 106
2554A06k32LP2J77M5j69j9Qj33J38L02l51j46oL3L58m96J97J38J72j75j87L39
2577A74j67k3l80L90k08K20j01K13j26J54j12J67k50k03N6J21jK12j42r8mK62
2599A54o07L77K88m03K0J97M5Q2J41k29L7k93j9M33j49R4k45j32K58K0mj09j12
2622a56M00l26J71k9l28N21l60R0K61l12J00j46K00l45J61K42l30M45L8k05m1
2643E1j17L07k22k14j94N06J19l06K31j41j12K35m37K71J12j55k7J87K4l1r6L5
2665B6J0k07J85j98J74j42J6L40n22M49k07J65j09P7p6l9J2J82j65L50l21r6j4
2688a10L09k29r2K91l92L2n8K0kK59k34j51N32l23j73M13P5j67l3K68m10j89N06
2711A42l49K25J04j14p8K57j08k25j03M60j65p1k06K87j7Q4l8q1r1N3Q5j37l9
$$ plain form
2554 106 -126 -123 -51 126 171 2 -17 -9 -142 -4 298 -53 -199 -205 -172 186 -310 -113 25 197 22 -165 174
2577 174 7 -16 -396 -6 -214 6 -95 118 -8 146 34 201 -49 -252 -196 -75 -76 136 -6 -104 -108 154
2599 154 -453 -76 212 -191 -171 26 71 153 294 65 102 -191 -210 223 74 168 -77 -209 49 69 65 -44 -156
2622 -156 244 -82 89 60 -268 253 -107 -17 244 -68 32 -114 86 -259 -98 144 -186 259 297 92 51
2643 51 -66 241 19 -195 -389 117 236 -70 161 20 -92 143 -294 -23 89 -66 -93 94 118 87 -9 26
2665 26 36 -171 14 -184 -10 -152 -136 204 -318 131 -76 89 -20 57 -19 -58 -46 136 -29 321 0 -96 -110
2688 -110 199 -30 -122 169 -223 -191 -249 -229 -231 28 -206 -357 175 -148 -321 92 167 0 -33 235 -175 -364 142
2711 142 -207 18 122 8 -70 187 79 -146 -249 211 46 -25 -231 56 39 123 85 4 -87 -34 51 -86 -125
2734a25J97P0K3lk11l4L07m58K34J08k33K75j59q1l0J47l2%J67k16qk06K60Kk1
2759b7M1k01J96k55P11m61k63L82K26k88k51J50r9m2M97l14J67j30J8M9r8j52
2781a44L4K44j88L0k45N6J01J70r9K16l5j16k75n6L34O7P1jq2k44J20L6k55L50
2805H9JJ54n2j46k15q4J90k08L48k04L12j43M31p95J37L61n07N35j38K2O0l64
2827b16K30J66J31m20J21l15K56j11J21j12K55j82k4K78r5J01j2m36J04K35J46
2848B21k89R8J83l16P2K50l62J62J9j53J34K67m98J23K64k67j6L66o1m38M44j51
2870E2n7P9K13j67j04J23J80j87O1j60N8K71n32K53l16N74l85L14k58j9ML9L8
2893G4k86K8K20j99Q3J50j42n1k40L36j62M82k59J75m13L43P9j98J15k14J61l65
$$ plain form
2734 -125 72 142 165 162 -49 -83 224 -234 0 108 -125 150 -9 -90 -120 27 -5 -5 162 -54 -62 -268 -8 -6 -27
2759 -27 14 -187 9 -246 465 4 -259 123 349 61 -190 -40 -139 -181 316 2 169 39 57 106 8 -144
2781 -144 -110 134 -54 -24 -269 -213 -112 58 -41 175 140 24 -251 -307 27 94 165 164 82 -162 -42 -6 -261 89
2805 89 90 244 192 46 -169 -253 -63 -271 77 -127 185 42 473 -322 -185 176 -331 204 66 88 148 -216
2827 -216 14 180 311 -109 12 -303 -47 -158 -37 -149 106 -76 -100 178 83 184 172 -264 -160 75 221
2848 221 -68 30 213 -103 -31 219 -143 19 38 -115 19 286 -212 -89 175 -92 -108 258 197 -241 203 52
2870 52 -5 74 287 120 16 139 319 132 193 33 91 362 -170 83 -233 341 -44 270 12 -7 -3 36 74
2893 74 -212 -184 36 -163 -80 70 -72 -123 -363 -27 -189 293 34 209 -204 139 218 20 135 -79 82 -283
2915b83M0m4M00M8j7j88o3K0J93K37o30M34l72K62J68r0j09l6oj34k73M73L9J32
2939B01r3k10J98k13K58j77k28M08k15%N76l33l89K56j30L6m2J24Ol7n8K39m05
2962b28L22k07K44k73k3J33K03o8j17K25k58Lj71L93k03Q4K0M8k0J10m36K17J36
2985A34k71j86L84j09J98r1P3P6j88j06p7J31Q6j53j52n2K30M19n19K6K95O1L3
3008B42j12ll78K24L36l40K02k02J48k38j52L57N0k40M99n13j04M09l31L45j88
3029A1j70L86j08k79K23j38J3n1L68l59L43j24r2R3L45n78l96P14m99M22j96K65
3051A93k75K49j9m6J99l33k21J90nP1JJ27j27L7K1j49ro9M88l24j05L49j72j0
3075F1l69L80k08J79q8j06J07j07K16j97l75L52J84r3l3QM9L79p86N17k19L15
$$ plain form
2915 -283 -243 -287 113 161 144 -44 -107 -87 106 343 -287 147 -225 37 205 115 6 -30 -36 -170 -443 30 69 201
2939 201 108 -102 96 -117 141 -36 -264 144 -71 -71 505 172 -217 39 -91 -55 -97 27 33 -4 -62 177 -228
2962 -228 94 -113 131 -142 -165 -32 171 103 -14 211 -47 -44 -215 178 -25 59 79 127 107 217 -219 -2 134
2985 134 -137 -323 61 -48 150 59 132 208 20 -86 -163 -32 54 -99 -251 -303 -73 346 -173 -147 148 209 242
3008 242 130 127 -251 -27 309 -31 171 -31 117 -121 -273 84 134 -106 393 -120 -224 185 -146 199 11
3029 11 -159 227 119 -160 63 -75 -62 -113 255 -104 239 115 23 116 461 -117 -513 201 -298 124 -72 193
3051 193 -82 167 148 102 301 -32 -253 -63 -68 3 4 131 4 41 62 -87 -96 -165 323 -1 -106 243 71 61
3075 61 -308 72 -136 43 -45 -151 -44 -151 65 -132 -507 -155 29 -64 -97 -89 -40 339 -447 70 -149 166
3097A66k04J05m9l09J18K17K6k40J91j85L50k29K29j78o7J45j5J11K5l86qJ52
3119c5j43J58J5q0K2J56k14j29K53o5p1J97K79l22j26K3m6Mj36J37M09l12J19
3142I3p5m6J48j4l22L66q1j14k57L99k59L69l23k22K75M08q4j11J30m22m8K98
3164A08j11l8j39J28J6n66O23N1j33k91J27J79L20n0N2k2q8j9O0k10J95k95K68
$$ plain form
3097 166 -38 67 18 -291 -173 44 70 -170 21 -164 186 -43 186 8 -59 86 71 182 207 -179 -187 -35
3119 -35 -178 -20 -5 -85 -63 93 -121 -250 3 -62 -133 64 343 21 -105 -82 -128 -124 -260 -123 286 -26 93
3142 93 18 -28 120 106 -216 150 69 -45 -302 97 -162 207 -116 -338 -63 345 261 150 280 -142 -190 108
3164 108 -3 -41 -180 -52 -36 -602 21 72 -61 -352 -225 -46 274 224 276 254 166 147 207 -3 192 -103 165
$$ [...]
8191h7
##END NTUPLES=NMR FID
##END=
