##TITLE=1H_DE-63_P4_PH6
 D2O
 8 sc, 
 24.12.2024
##JCAMPDX= 6.0         $$ Bruker NMR JCAMP-DX V2.0
##DATA TYPE= NMR FID
##DATA CLASS= NTUPLES
##ORIGIN= UXNMR, Bruker Analytische Messtechnik GmbH
##OWNER= root
$$ XWIN-NMR		Version 3.5
$$ Wed Dec 25 12:29:33 2024 Russian Standard Time (UT+4h)  she@DPX200
##.OBSERVE FREQUENCY= 200.1315
##.OBSERVE NUCLEUS= ^1H
##.DELAY= (6, 6)
##.ACQUISITION MODE= SIMULTANEOUS
##.ACQUISITION SCHEME= undefined
##.AVERAGES= 8
##.DIGITISER RES= 18
##SPECTROMETER/DATA SYSTEM= spect
##.PULSE SEQUENCE= zg30
##.SOLVENT NAME= CDCl3
##.SHIFT REFERENCE= (INTERNAL, CDCl3, 0, 15.7039)
##AUDIT TRAIL= $$ (NUMBER, WHEN, WHO, WHERE, WHAT)
$$ ##TITLE= Audit trail, XWIN-NMR		Version 3.5
$$ ##JCAMPDX= 5.01
$$ ##ORIGIN= Bruker BioSpin GmbH
$$ ##OWNER= she
$$ F:/spectra/data/she/nmr/H-F/1/audita.txt
$$ ##AUDIT TRAIL=  $$ (NUMBER, WHEN, WHO, WHERE, WHAT)
(   1,<2024-12-25 12:28:19.21 +0400>,<she>,<DPX200>,
      <created by zg, POWCHK disabled, PULCHK disabled
       configuration hash MD5:
       00 E9 B6 7A A2 85 ED C7 34 08 36 98 17 FE 4E 26
       data hash MD5: 16K
       07 75 A3 85 00 72 CA 69 7C 48 50 D7 13 77 2C 69>)
$$ ##END=
$$ 
$$ hash MD5
$$ 8B 73 2E 59 7A 31 9F 9B 14 03 DC 8D 87 1C C4 20
##$RELAX= 
##$RELAX= 
##$RELAX= 
##$RELAX= 
##$RELAX= 
##$RELAX= 
$$ Bruker specific parameters
$$ --------------------------
##$DU= <F:/spectra>
##$EXPNO= 1
##$NAME= <H-F>
##$PROCNO= 1
##$TYPE= <nmr>
##$USER= <she>
##$AMP= (0..31)
100 100 100 100 100 100 100 100 100 100 100 100 100 100 100 100 100 100 
100 100 100 100 100 100 100 100 100 100 100 100 100 100 
##$AQSEQ= 0
##$AQ_mod= 1
##$AUNM= <au_zg>
##$AUTOPOS= <>
##$BF1= 200.13
##$BF2= 200.13
##$BF3= 200.13
##$BF4= 200.13
##$BF5= 200.13
##$BF6= 200.13
##$BF7= 200.13
##$BF8= 200.13
##$BYTORDA= 1
##$CFDGTYP= 0
##$CFRGTYP= 5
##$CHEMSTR= <none>
##$CNST= (0..31)
1 1 145 1 1 1 1 1 1 1 1 1 1 1 1 1 1 1 1 1 1 1 1 1 1 1 1 1 1 1 1 1 
##$CPDPRG= <>
##$CPDPRG1= <>
##$CPDPRG2= <>
##$CPDPRG3= <>
##$CPDPRG4= <mlev>
##$CPDPRG5= <mlev>
##$CPDPRG6= <mlev>
##$CPDPRG7= <mlev>
##$CPDPRG8= <mlev>
##$CPDPRGB= <>
##$CPDPRGT= <>
##$D= (0..31)
0 1.2 0 0 0 0 0 0 0 0.06 0 0.03 0 0 0 0 0.0002 0 0 0 0 0 0 0 0 0 0 0 0 
0 0 0 
##$DATE= 1735115298
##$DBL= (0..7)
120 120 120 120 120 120 120 120 
##$DBP= (0..7)
150 150 150 150 150 150 150 150 
##$DBP07= 0
##$DBPNAM0= <>
##$DBPNAM1= <>
##$DBPNAM2= <>
##$DBPNAM3= <>
##$DBPNAM4= <>
##$DBPNAM5= <>
##$DBPNAM6= <>
##$DBPNAM7= <>
##$DBPOAL= (0..7)
0.5 0.5 0.5 0.5 0.5 0.5 0.5 0.5 
##$DBPOFFS= (0..7)
0 0 0 0 0 0 0 0 
##$DE= 6
##$DECBNUC= <off>
##$DECIM= 24
##$DECNUC= <off>
##$DECSTAT= 4
##$DIGMOD= 1
##$DIGTYP= 9
##$DL= (0..7)
0 120 120 120 120 120 120 120 
##$DP= (0..7)
150 150 150 150 150 150 150 150 
##$DP07= 0
##$DPNAME0= <>
##$DPNAME1= <>
##$DPNAME2= <>
##$DPNAME3= <>
##$DPNAME4= <>
##$DPNAME5= <>
##$DPNAME6= <>
##$DPNAME7= <>
##$DPOAL= (0..7)
0.5 0.5 0.5 0.5 0.5 0.5 0.5 0.5 
##$DPOFFS= (0..7)
0 0 0 0 0 0 0 0 
##$DQDMODE= 0
##$DR= 18
##$DS= 0
##$DSLIST= <SSSSSSSSSSSSSSS>
$$ [...]
##$SUBNAM2= <"">
##$SUBNAM3= <"">
##$SUBNAM4= <"">
##$SUBNAM5= <"">
##$SUBNAM6= <"">
##$SUBNAM7= <"">
##$SUBNAM8= <"">
##$SUBNAM9= <"">
##$SW= 24.0689530833862
##$SWIBOX= (0..15)
0 0 2 0 0 0 0 0 0 0 0 0 0 0 0 0 
##$SW_h= 4816.95568400771
##$TD= 16384
##$TD0= 1
##$TE= 0
##$TE2= 300
##$TE3= 300
##$TEG= 300
##$TL= (0..7)
0 120 120 120 120 120 120 120 
##$TP= (0..7)
150 150 150 150 150 150 150 150 
##$TP07= 0
##$TPNAME0= <>
##$TPNAME1= <>
##$TPNAME2= <>
##$TPNAME3= <>
##$TPNAME4= <>
##$TPNAME5= <>
##$TPNAME6= <>
##$TPNAME7= <>
##$TPOAL= (0..7)
0.5 0.5 0.5 0.5 0.5 0.5 0.5 0.5 
##$TPOFFS= (0..7)
0 0 0 0 0 0 0 0 
##$TUNHIN= 0
##$TUNHOUT= 0
##$TUNXOUT= 0
##$USERA1= <user>
##$USERA2= <user>
##$USERA3= <user>
##$USERA4= <user>
##$USERA5= <user>
##$V9= 5
##$VALIST= <valist>
##$VCLIST= <CCCCCCCCCCCCCCC>
##$VD= 0
##$VDLIST= <DDDDDDDDDDDDDDD>
##$VPLIST= <PPPPPPPPPPPPPPP>
##$VTLIST= <TTTTTTTTTTTTTTT>
##$WBST= 1024
##$WBSW= 4
##$XGAIN= (0..3)
0 0 0 0 
##$XL= 0
##$YL= 0
##$YMAX_a= 90926
##$YMIN_a= -115613
##$ZGOPTNS= <>
##$ZL1= 120
##$ZL2= 120
##$ZL3= 120
##$ZL4= 120
##$ABSF1= 10
##$ABSF2= 0
##$ABSG= 5
##$ABSL= 3
##$ALPHA= 0
##$AQORDER= 0
##$ASSFAC= 0
##$ASSFACI= 0
##$ASSFACX= 0
##$ASSWID= 0
##$AUNMP= <proc_1d>
##$AZFE= 0.1
##$AZFW= 0.1
##$BCFW= 1
##$BC_mod= 2
##$BYTORDP= 1
##$COROFFS= 0
##$CY= 11.3945322036743
##$DATMOD= 1
##$DC= 2
##$DFILT= <>
##$DTYPP= 0
##$F1P= 15.6554695791079
##$F2P= 12.8336369535428
##$FCOR= 0.5
##$FTSIZE= 0
##$FT_mod= 4
##$GAMMA= 1
##$GB= 0.15
##$INTBC= 1
##$INTSCL= 1
##$ISEN= 128
##$LB= 0.24
##$LEV0= 0
##$LPBIN= 0
##$MAXI= 10000
##$MC2= 0
##$MEAN= 0
##$ME_mod= 0
##$MI= 1.114404
##$NCOEF= 0
##$NC_proc= 0
##$NLEV= 6
##$NOISF1= 3.799351
##$NOISF2= 2.8
##$NSP= 1
##$NTH_PI= 0
##$NZP= 0
##$OFFSET= 15.70392
##$PC= 1
##$PHC0= -26580.62
##$PHC1= 13.78744
##$PH_mod= 1
##$PKNL= yes
##$PPARMOD= 0
##$PSCAL= 0
##$PSIGN= 0
##$REVERSE= no
##$SF= 200.130013532006
##$SI= 16384
##$SIGF1= 3
##$SIGF2= 2
##$SINO= 400
##$SIOLD= 16384
##$SREGLST= <1H.CDCl3>
##$SSB= 0
##$STSI= 0
##$STSR= 0
##$SW_p= 3612.71676300578
##$SYMM= 0
##$S_DEV= 0
##$TDeff= 0
##$TDoff= 0
##$TI= <>
##$TILT= no
##$TM1= 0
##$TM2= 0
##$TOPLEV= 0
##$USERP1= <user>
##$USERP2= <user>
##$USERP3= <user>
##$USERP4= <user>
##$USERP5= <user>
##$WDW= 1
##$XDIM= 8192
##$YMAX_p= 0
##$YMIN_p= 0
$$ End of Bruker specific parameters
$$ ---------------------------------
##NTUPLES= NMR FID
##VAR_NAME=  TIME,          FID/REAL,        FID/IMAG
##SYMBOL=    X,             R,               I
##VAR_TYPE=  INDEPENDENT,   DEPENDENT,       DEPENDENT
##VAR_FORM=  AFFN,          ASDF,            ASDF
##VAR_DIM=   8192,          8192,            8192
##UNITS=     SECONDS,       ARBITRARY UNITS, ARBITRARY UNITS
##FACTOR=    0.0002076,     1,               1
##FIRST=     0,             0,               0
##LAST=      1.7004516,     0,               0
##MIN=       0,             -115613,         0
##MAX=       1.7004516,     90926,           0
$$ Real data points
##PAGE= N=1
##DATA TABLE= (X++(R..R)), XYDATA
$$ [...]
2046I14L78l8j258j364J9Q56N50N13K97J50k12j335j118J36J224O47M48K88j6
2065A079n33j727p01Q95P83R16L6K42J0j221j051j30N78J232L14J3O94j140o44
2084c55q44J39N52O86N42L1J76n13j139q87L01J451N21J29k09J40n53j244p20
2103a796J166R86Q38l25K3l95q53r66Q8N57J246M68m85J46n00q44q16N77Q82P49
2123G46K64l05m13j2j383m05N81J226P61l90j62K23j054p94k20J205Q75p3P8J5
2143G63k26j099r34N84J027M78n0j77l3m90p35n43O28J095N54j14rm93k49j140
2163a163q0R89R88J72k61q3k48r33n31K55Q97P41l2k04Rm76r61k20M26J063O69
2184A017l63k94k57l83o67J78M55Q76M55o16J30o01m10o16L52Q11Q80J58p68r1
$$ plain form
2046 914 1292 1254 -4 -1368 -1349 -493 57 570 867 1017 805 -530 -1648 -1512 -288 359 807 1095 1079
2065 1079 546 -1181 -1882 -987 -204 712 748 990 1000 -221 -1272 -1402 -824 408 722 735 1429 289 -355
2084 -355 -1199 -1060 -508 178 720 751 927 414 -725 -1612 -1311 140 661 790 581 721 168 -1076 -1796
2103 -1796 -630 356 1194 869 892 497 -356 -1322 -1234 -677 569 1037 552 698 198 -646 -1462 -885 -3 746
2123 746 1010 705 292 280 -1103 -1508 -927 299 1060 670 508 731 -323 -1117 -1337 -132 743 670 748 763
2143 763 537 -562 -1496 -912 115 593 543 366 333 -157 -892 -1435 -807 288 842 728 719 226 -23 -1163
2163 -1163 -1243 -254 734 906 645 562 314 -619 -1150 -895 2 743 711 507 516 40 -921 -1141 -715 348 1017
2184 1017 654 360 103 -280 -947 -769 -314 562 1017 401 531 -70 -480 -1096 -744 67 947 1105 337 246
2204B46k70o92n18O43J026O16n49j06k78k88l75k71M70J102L61n44r2n14o59m48
2224a140M21P91Q65j31k44m46r0o61q04O28J263M72K3p52k2k05q99lR96N15N3
2245F30k94m87p5j13m50pR44P19j02l31n70P4o64p4J99J059N71l52o89K3m88l99
2267h76J3L65P22P83l97l86m00N9j25m10O16J149J49r64o57K6J75n91J09J279
2287F39J28J84o88n60m9j99k13L98J165K31n75n15j85j97j0l23N83J073j3n02
2307C72l43l55j29k47K02R31Q16k61r48m65j8k38j17M90O70Q31q70l48j06n13
2327f46J23J50J77R31J80n33p30r7l0m4oR02O14N7r95k78o4k45K45j47J153K56
2349I73l26p62o8j71j11j47P55O22kl68n35k07q1r8L36L51J050l12p82j88Q3l50
$$ plain form
2204 246 -24 -716 -1234 -591 435 1051 502 396 118 -170 -545 -816 -346 756 1117 573 481 -33 -692 -1140
2224 -1140 -719 72 937 806 562 116 26 -635 -1439 -811 452 924 947 195 173 -32 -931 -934 62 577 630
2245 630 336 -151 -226 -339 -789 -796 148 867 765 434 -136 -62 -726 -800 -601 458 1029 677 -12 11 -477 -876
2267 -876 -863 -498 224 1007 610 224 -176 -117 -242 -652 -36 1113 1262 298 -359 -333 -158 -749 -640 639
2287 639 767 951 263 -297 -346 -545 -758 -360 805 1036 461 -54 -239 -436 -446 -769 -186 887 874 372
2307 372 29 -326 -455 -702 -500 431 1247 986 38 -427 -445 -683 -800 -310 360 1191 321 -27 -133 -646
2327 -646 -523 -373 -196 735 915 382 -348 -445 -475 -519 -525 377 991 1048 53 -225 -289 -534 -289 -436 717 973
2349 973 647 -115 -183 -354 -465 -612 143 765 763 395 -140 -347 -428 -526 -190 161 1211 899 117 -71 12 -338
2371c38m68N53P59J61k62m15l89R9l45L51K53O89M91o88r43J07L04k40l36Q12
2391A55M34K35p36n78O7r6P8J08N96N54l38k48p30J98k03r9L46P92L23k28r11
2412b81k73N75j95l8N7J003p8o57n00O2lJJ3L77O13j24o46l70r1M43k6L6Q16j76
2436E38r9p10j22J26LK8L03P84k57m95p14j81O71K76j65M58K40k42n20n33Q12
2457B01m46o4M63J25N4J97j010O9J45O6N1l8O35J82m86o33J27J78L27j20l8M68
2479D53J1p31j62m3L11K76n59R06O2j89o29m14J47M84J4j39O41J66k09r37pM66
2501h2L69j49p9N78m0n35q12K9N84J28J02K21K97k40o78l03Q6O27R9n3k6O69n48
2524B44m83j44J04O30l35J40j07O89n31n69l09M10N01r6J29M35k36p78n17J87
$$ plain form
2371 -338 -806 -253 506 667 405 -10 -399 -300 -645 -294 -41 648 1139 451 -492 -385 -81 -321 -657 155
2391 155 589 824 88 -490 -423 -519 -441 -333 263 817 479 231 -499 -301 -504 -603 -257 535 858 630 -281
2412 -281 -554 21 -174 -212 -155 848 770 113 -387 -325 -328 -327 -314 63 676 552 -94 -464 -555 -112 -138 -102 714 538
2436 538 439 -271 -393 -267 -264 -236 67 851 594 99 -615 -796 -125 151 -14 444 684 442 -78 -611 201
2457 201 -245 -309 154 279 333 530 -480 -411 -266 -200 -149 -187 448 630 144 -489 -362 -184 143 23 -15 453
2479 453 464 -267 -429 -472 -161 115 -444 462 524 335 -294 -708 -561 -77 -63 -202 439 605 396 -541 -548 -82
2501 -82 287 138 59 637 597 62 -750 -721 -137 -9 93 314 611 371 -307 -610 -524 103 202 149 123 792 244
2524 244 -239 -383 -279 351 16 156 49 738 207 -362 -671 -261 240 144 273 708 472 -306 -823 -636
2544f36O92J35r3J64L13m1o04n90J10R83l73K47M14k37l63l42k38K56L11K89k84
2565A13K59j66l31m06K03M80L6J04l1K02l39n97j56J7J227o01p8L25L2l58l20
2586c85k63M21P96k89r0k07K24k23n46J53N28J30j71M5L04r0n45o02M85L49M69
2607D93o51J01K75l19l15j22M66L22pj99M23j64k80n90N3L82M97o1l83M65Q4o42
2629a72m14O3P28K64l03j8K48l28m54q2J91N41P2l18k2K29k30n53K65L31L72j09
2651C01NJ92m98k30l72L40M55k6o6n6K61k69l68J56L2J08L43k78L1L4l36p9k03
2674e23M01N30p5j51l07N03l39m54N7M88N2l04J51Rj24O2m79L83R9N08n85K79
2696A81j99L4k11l11L12N23l34m4J71j70K60o60J93O10O4k41q0J44j27k14o3j4
$$ plain form
2544 -636 56 191 98 262 575 534 -70 -660 -550 433 60 307 721 484 121 -221 -459 -203 108 397 113
2565 113 372 206 -125 -531 -328 152 188 292 261 463 124 -473 -629 -612 615 14 -64 261 293 -65 -385
2586 -385 -648 -227 569 280 190 -17 207 -16 -562 -409 119 249 78 123 427 337 -208 -810 -325 24 493
2607 493 -158 -57 218 -101 -416 -538 -72 250 243 44 467 303 23 -567 -514 -132 365 304 -79 386 470 -172
2629 -172 -586 -523 205 469 166 148 396 68 -386 -468 -277 264 336 18 -4 225 -5 -558 -293 38 410 301
2651 301 306 498 0 -230 -602 -262 193 167 101 45 306 37 -331 -175 -143 -35 308 30 61 95 -241 -320 -523
2674 -523 -122 408 333 182 -125 378 39 -415 -358 130 182 -122 29 38 -86 -24 -503 -120 -21 487 -98 181
2696 181 -18 16 -195 -506 -194 329 -5 -49 122 -48 212 -448 -255 355 419 178 98 242 115 -99 -162 -176
2718a76Q91m69k13J73k68L14k79L7l95L91K36j73J56m16M72p86K6O66K40k83M9
2739A93o8j09k55j30J86N41j39j2m15L75J79o28J37N4N36Rn38J42q7J61k05l62
2761d35O96rJ03l22k70M12j51l23K78M80l29J16n93N53j78k10l14M09K67J29k68
2782D1J92l13l62N3M5J36N19j00l23j71M40j00j20k34L16L31k85l15K24k33L90
2803A31j24j77L74N5j73n8o4P5J60k44R1P64k88n20k11K84O5l72j13O07L34m14
2825A82kj45l7j23J21r3J98O7J7k84r8J8M03k89k50O49p6l84j80K17j30J20L68
2848B69j80K93R3m09j95K81j16o3k44O54o0k41l78K2M67l19l28N91J5M23n80k61
2870b66L15R4k69l2P2J67l9j94j08Q0L54m08L34K10J64l10o08O8L72j58k5mM33
$$ plain form
2718 -176 715 246 33 206 -62 252 -27 10 -385 6 242 69 225 -191 281 -505 -479 187 427 144 193
2739 193 125 16 -239 -369 -183 358 219 207 -208 167 346 -282 -145 -91 445 454 -84 58 -29 132 -73 -435
2761 -435 261 252 355 33 -237 175 24 -299 -21 459 130 246 -347 206 28 -182 -496 -87 180 309 41
2782 41 233 -80 -442 -389 -344 -208 311 211 -112 -283 157 57 -63 -297 19 350 65 -250 -26 -259 131
2803 131 7 -170 204 259 86 28 -36 39 199 -45 46 810 522 2 -209 75 140 -232 -345 262 596 182
2825 182 180 35 -2 -125 -4 -97 101 168 185 -99 -197 -179 224 -65 -315 334 258 -126 -306 -89 -219 -99 269
2848 269 89 382 475 66 -129 152 36 -27 -271 383 323 82 -296 -274 193 -126 -454 137 152 575 -5 -266
2870 -266 49 143 -126 -158 -86 81 42 -152 -260 -180 174 -234 100 310 474 164 -444 -376 -4 -162 -187 -191 242
2893B42j60J49n31O4L65k99K13J95j98N42n12m78K82K89J4j68Q1O7M3k33m24r
2915d66K51r9L03L63k31O3j03m04O29k05k12J51J10Q7k68j30N2L24k09n4M6J34
2937A32M8l65K2O4J61kk88M24p3j24k42k00j51N73l77N19j55J80k25j14j40M02
2959F9R9j85k32K31J1n2k50K33K9L12k19L5L8R8m85R0J78p1M40l40K11J26k68
2982I8l59K43J14m1N2J57p4k4j77k07J64J81l5p7j66K29L18p28J4L07M01l78j57
3005a45j15M61m03Q4j05K33k45K48kN7K4j9k63J15J30M87o81J79J08p5q8l89K85
3028a19J26J35j65o6N12l56j85k26L89L50k04k77K89J9k42k22K2N30l80m3M02
3049B89j88J84n39L89p2K83l08j69K21j65k20k1J45k39L52o5R8r5Q1j71j14P0
$$ plain form
2893 242 82 231 -300 -236 129 -170 43 238 40 582 70 -408 -126 163 177 9 90 157 200 -33 -457 -466
2915 -466 -215 -314 -11 352 121 184 81 -323 306 101 -111 40 150 237 -31 -161 -109 215 6 -48 -2 132
2937 132 180 -185 -163 -99 62 60 -228 196 123 -1 -243 -443 -594 -21 -398 121 -34 146 -79 -193 -333 69
2959 69 168 -17 -249 -18 -7 -59 -309 -76 -47 265 46 81 119 217 -268 -178 0 -71 369 29 240 366 98
2982 98 -261 -18 96 55 107 264 190 166 -11 -218 -54 127 92 15 -151 78 396 -332 -318 -11 390 12 -145
3005 -145 -260 201 -202 -118 -223 10 -235 13 11 68 92 73 -190 -75 55 542 -139 40 148 73 -15 -404 -119
3028 -119 7 142 -23 -89 423 67 -118 -344 45 395 191 -86 203 222 -20 -242 -220 310 -70 -113 289
3049 289 101 285 -254 135 63 346 38 -131 90 -75 -295 -316 -171 -410 -58 -123 -25 -120 -39 -210 -324 -254
3071b54O25j84j16n5j3j53p2N5nK24p5M0k68L07K06k68M8j39m1K78o56N07K13
3094B04o4k50J46q0j66O7M2M30j44l57J68jR5M8m87M85L2j57K18k29k80N48j45
3117A23q2K24p8r6j07J60l55P8J90m4J73q9j58j51M4J93k02J27j31P6M78n53K33
3140E3m1k9j29K56k71J70J72k49k20L84K50l26Q3m07L15j07j44l3J70K63q7M7
3162A20p1j61K01j69R7J36Jl26r0j22O89l15P4J6K24m56KJ02j27K84j67Q7O2J64
3186B55N0o26j08K69K23j05QL31n77L92l9N9K7k06k08L53No5l05N40j85k71M17
3209B34k90K62j50M7k03J41J3m2o5j13K69m6k0n78M42J19j17n5q0M93o1k67k08
3232b75j2M15k98L57j97Q1L3j94m0L46J38o45qK16K29j59P2K00l70j81J82M8J91
$$ plain form
3071 -254 371 187 71 16 3 -150 -222 -167 -172 52 -23 17 -251 56 262 -6 42 -97 -138 140 -516 -9 204
3094 204 140 -110 36 -44 -210 -143 -101 329 185 -172 -4 -5 90 138 -349 136 168 11 229 0 -280 268 123
3117 123 41 265 187 91 -16 144 -211 -133 57 13 186 97 -61 -212 -168 25 -177 -50 -181 -105 373 -180 53
3140 53 12 -17 -146 110 -161 9 181 -68 -288 96 346 20 103 -304 11 -96 -240 -273 -103 160 73 120
3162 120 49 -112 89 -80 17 153 154 -172 -262 -384 305 -10 64 80 304 -152 -150 -48 -175 109 -58 29 91 255
3186 255 305 -321 -429 -160 63 -42 -34 297 -280 112 73 132 159 -47 -255 98 103 38 -267 273 88 -183 234
3209 234 -56 206 56 103 -100 41 54 12 -53 -166 103 57 37 -541 -99 20 -97 -152 -232 261 200 -67 -275
3232 -275 -287 128 -170 187 -10 71 104 -90 -130 216 354 -291 -299 -83 146 -13 59 259 -111 -292 -110 -62 129
3255A29P7J24m35NL15N8m40J17P4j83j93J73L42k17K38n07P20n7k51o5k43K45
3277B6j21J1j6K36L35l69k26J45l32M20qk76M45l02K66n35K36K90l91K79k64L39
3299A88O8p44M37J36J78m32J56L00k85k17L23l55O23j97j74K71j97N8J84j75j63
3320a7j13L73j62k02M81k72j67j67M55j8N2o76M33j49j7lK35J61r2j55j1M51j8
3343D02p03K65p0J7K66k03O4N7L5O6l06L2L59j88j10R9J60l38p6J22K01j95K57
3366B13j76J70J18l19L9J89R3o10L53j20O2K38k61n65N08L80n75L36n0%j30J21
3388A4j06L15l88L93l54R7j77L55o2m02N83r2j35r3KK20m71j03L73K81l8k39K73
3411B46l75J57l55K18J26N5o4k28M50k63r7j32J42RL60j34j69L0L71j89k30j98
$$ plain form
3255 129 206 330 -105 -100 215 273 -167 -50 24 -159 -352 -179 163 -54 184 -323 397 340 89 24 -219 26
3277 26 -95 -84 -100 136 471 102 -124 21 -311 109 101 -175 270 -32 234 -301 -65 225 -166 113 -151 188
3299 188 256 -488 -51 85 263 -169 -13 287 2 -215 108 -247 376 179 5 276 79 137 321 146 -17
3320 -17 -130 243 81 -121 360 88 -79 -246 209 191 243 -433 0 -149 -166 -169 66 227 135 -20 -31 420 402
3343 402 -301 -36 -106 -89 177 -26 38 95 130 196 -110 -78 281 93 -17 82 242 -96 -172 -50 151 -44 213
3366 213 37 207 325 6 45 234 327 -283 70 -50 12 250 -11 -576 -68 312 -263 73 23 23 -107 14
3388 14 -92 223 -165 228 -126 -29 -206 149 87 -315 268 176 41 -52 -50 170 -301 -404 -31 250 212 -27 246
3411 246 -129 28 -327 -109 17 72 8 -220 230 -33 -130 -262 -120 -111 249 115 -54 -24 347 158 -72 -270
3433b70L31L5m85M11M7o2K6j32O4M4j05J95j49J29o2Nn6Q6mk6P8L44k79p0n44
3458d49M47J71j28k69J23j42N75k73l47J73J44K42j05r1J20k28j19K66k26J67
3478E1pj64O34m44r9K24l66r0M36p2j81J36m53M19K21n46L01L27j86k65L1p1J20
3501d4O5p9J59j16N2r6K27m84M50p2J3J03k87J49l78L88K6k64Rj1K65q1k44L79
3525A29O2k83J80m14O7R7K19k94L38l8o2k33K11L82l11l17nJ37q9k74L30J65K49
3548B46m16K2J19O0K13o15L55J97qj51l59L73j93N6K16j2n3L1m5n0k29J88j73
3571b28M14Q1j40M4m06%J54j2k44L54K75k40lN3j86R8j7k55L43J82l00N1j12k07
3595c01L82r5j18J27L22q8k85K13j33J30j81N7K42K20l12k85J36q0K06j62l0P6
$$ plain form
3433 -270 61 96 -389 22 69 7 33 -99 -35 9 -96 99 -50 79 17 22 -34 52 48 22 100 444 165 95 -449
3458 -449 -2 169 41 -228 -105 -247 328 55 -292 -119 25 267 162 71 191 -37 -156 110 -116 51
3478 51 44 -120 514 70 -29 195 -171 -261 175 103 -78 58 -395 24 245 -301 0 327 141 -124 -93 -164 -44
3501 -44 21 -58 101 -15 37 -59 168 -316 134 62 75 178 -109 40 -338 50 76 -188 -179 -190 75 -6 -250 129
3525 129 191 -92 88 -326 -259 -162 57 -237 101 63 1 -232 -21 361 50 -267 -272 -135 -224 -498 -168 -3 246
3548 246 -170 -148 -29 31 244 -371 -16 181 173 22 -337 36 -157 -101 115 103 50 81 36 -14 -243 -55 -228
3571 -228 186 267 127 171 -235 -235 -81 -93 -337 17 292 52 49 102 -84 14 -3 -258 85 267 -33 18 -94 -301
3595 -301 81 -14 -132 -5 317 229 -56 157 24 154 -27 30 272 492 180 -105 31 -49 157 -5 -35 41
3617D1J70k55j07r2N29m42j05M81k70k08J25k37Q1P4K42N5J20K08n6l19l80J75
3639a70K75m06J18K77L7K6J14k84j52J30J1J09p9l1j31j66K10j01r6K86M7K81
3661C05l34o26P45k60N55k28k31L48l24L3j52J58Q9j01L2k42N03r8q0r1k28N01
3683B74k63L4J96j44j7n60L95j2J64k03J47k9m3q2Q3M6O6q6K99j87K8o6k02j82
3707c44N70l48L83k18J92O6m20j06O4P1M0K71m94Q3K43M89l48l64K24j12M8o1
3729g1Q6L05p61K03K51k50kL88p4k15L62m72k07K86K5L52L0J48m41K78k64l59
3751d02K84K73J30k03m2Q5j29k18L49J23j58l03J84J13l97K12J02K95j68n6%j38
3773f4K19l77J30K61m75L01K16K3k11Q1l9n33K72j14O08k29q0p1j26J77r9o1K21
$$ plain form
3617 41 211 -44 -151 -243 286 -156 -261 220 -50 -258 -133 -370 -289 -215 27 82 202 410 354 35 -345 -170
3639 -170 105 -301 -183 94 131 157 271 -13 -165 -35 -24 85 6 -25 -156 -322 -112 -213 -309 -23 24 305
3661 305 -29 -655 90 -170 385 157 -74 274 -50 -17 -169 -11 78 -23 9 -233 270 172 92 1 -227 274
3683 274 11 45 241 97 80 -480 -85 -97 67 -136 11 -18 -61 -143 -60 -14 52 -34 265 78 106 40 -162 -344
3707 -344 226 -122 261 43 235 301 -119 -225 -161 -90 -50 221 -273 -190 53 542 194 -170 54 -58 -10 -71
3729 -71 15 320 -441 -238 13 -237 -239 149 75 -140 222 -250 -457 -171 -146 206 236 384 -57 221 -43 -402
3751 -402 -118 155 285 82 40 125 -4 -222 127 250 92 -211 -27 86 -311 -99 3 298 130 74 74 -64
3773 -64 155 -222 -92 169 -306 -5 211 234 23 104 65 -468 -196 -310 298 69 -11 -82 -208 -31 -130 -191 30
3796C0r3J02Q7nn05K17N7j98J12M71j02l85J63l81K72J93j23k37K82j9J50q8l7
3819c7oj91M7N38l56k1J06k24K83m57L89J33k33j29M38k86j42n1k24M5N29j53
3841bP2o2Ol56L48J35l04K70j13j85L54pj57j54J50P5j13O0j21J1Q0j41q4J09
3865a29J66J52p6P2l13L26J2l54L75o6j0p7N9k4M3k44j02J92k0J10j27J25q8k03
3889b01J36J6j72K40r1j20K44l41K85n8N1K81n24M09J47m13J03k75J61J78j58
3910a02J12J90K45j91p6k13k88N32m34K93o5L28j71m56j2Q9K03rK39k75K00k92
3932a53j69N02n2m3k84K76j51j48J50o9l02O07j24J41P5l28J10K09j51k18M22
3953C00n70K03J63j23J59k80K49R0P9l1m89Q8Kk9J08j00M16J65k54m15L89j59
$$ plain form
3796 30 -63 39 126 121 -384 -167 -110 -308 -196 275 173 -212 -49 -430 -158 35 -88 -325 -43 -62 88 0 -37
3819 -37 -43 -234 -187 351 -5 -26 80 -144 139 -318 71 204 -29 -158 280 -6 -148 -199 -423 -378 151 -2
3841 -2 70 8 14 -342 6 141 -163 107 -6 -191 163 156 -1 -155 -5 70 -43 17 -104 -93 -13 -154 -238 -129
3865 -129 37 189 113 185 -128 198 210 -144 231 165 155 78 137 113 156 -88 -190 2 -18 92 -35 90 2 -201
3889 -201 -65 -49 -221 19 -72 -192 52 -289 -4 -62 -11 270 -254 155 302 -111 -8 -283 -122 56 -102
3910 -102 10 200 445 254 178 -35 -323 209 -225 68 3 331 160 -296 -308 -219 -16 -25 214 -61 139 -153
3932 -153 -322 180 128 85 -199 77 -74 -222 -72 -141 -443 164 40 181 256 -72 38 247 96 -122 300
3953 300 -270 -67 96 -27 132 -148 101 191 270 239 -250 -162 -160 -189 -81 -181 235 400 146 -269 120 -39
3975c9j69J99j52K32O4p3rj98J09O6J41J58j16N1k32Q8J13m58J91m2J77K10j52
3998A59l34J05k6n6j53K41J80K46l70o0L44l45J38k18l6K94r8L45l29j13N0J4
4020b2K7M23l77m0j07j78J07j73K02J54j59L53q1o6K5j45p8K5J89l9j1J52Mj32
4044E3j69P2l82N16k80J81q2LO5l2R5jj7J93l05J49j86Q0j79J48P7qk4R1j36K61
4070A83Np8K11k9Jl02P5p4N6K1n6n5K09m35N48k70n6M11m01L48q4l12J04o5K4
4095b1m07N51l56N02j7q9j27J73n09K3N95l5l20N2J33K07k80k61R2j12P4L65P8
4118C11K4m63N6k28l6K57m3K95j47o2M1j95K99r7k58L43k3J04j01k50J57J22l01
4141a95M8J71k49J08K31M3n35J82o9K06K36n9J6j16l86J43M0K27j45M71k21L7
$$ plain form
3975 -39 -208 -9 -161 71 135 62 53 -145 -36 30 171 329 213 264 32 120 233 -225 -34 -76 101 311 159
3998 159 -175 -70 -96 -152 -305 -64 116 362 -8 -68 276 -69 69 -149 -185 109 11 356 27 -86 -36 -22
4020 -22 5 428 51 11 -96 -274 -167 -340 -138 16 -143 210 129 63 88 -57 -135 -110 79 40 29 181 185 53
4044 53 -116 -44 -426 90 -190 -9 -91 -88 -23 -55 40 39 22 215 -90 59 -127 -47 -226 -78 -1 -9 -33 58 -78 183
4070 183 188 110 321 292 293 -9 66 -8 48 69 13 -42 167 -268 280 10 -46 365 -36 312 228 -84 20 -45 -21
4095 -21 -428 123 -233 269 252 163 36 209 -300 -277 318 283 -37 15 148 355 75 -186 -94 -206 -132 233 311
4118 311 335 -128 -72 -300 -336 -79 -122 173 26 -36 5 -190 109 12 -246 97 74 178 77 -173 -16 106 -195
4141 -195 -147 24 -225 -117 114 157 -378 -196 -265 -59 177 118 134 18 -368 -225 -185 42 -103 368 147 184
4163A84m29K38K4l20J32J3NJ02n5J2j39K96Nn4m3P3L7k76M10m65K48L3r1k66L71
4188D5j67kJ17l16L53K0k6q7K5K16k50R8nK0k8p8j37M45k93j34o8J31k73O91j45
4213A52k90M6L34k15j80k19M26J28j12J60k13j39j3MK12J23Nmk09j06m1k61K03
4236b09K83r4O0M6k34q9L24k27K62J03m06L98j25J95l71l59L71j48K13j05J91
4257G9L03m01j58K58j42L06r7p8j18nLRj89L73r5K09l52k89O90n72m0K77k15J60
4281h4Q5M5j3%k34rr3M36p8J20N0p0m8o5k80K07r6K66J6j61N9l2K3k77J46J74
4307H7j01o2Q6J77L5m46K09J95l0k32K01o8J20k23J70l60L14J99k20P0j69j85
4329b33K12j55J84K5q3j18O6L67k89J94j98k03L84J11k71M0J41Rk80J43k36L67
$$ plain form
4163 184 -245 -7 17 -303 -171 -158 -153 -51 -106 -94 -233 63 68 14 -29 44 81 -195 215 -250 -2 31 -60 -326 45
4188 45 -122 -124 -7 -323 30 50 24 -63 -38 178 -72 26 21 41 13 -65 -202 243 -50 -184 -252 -121 -394 297 152
4213 152 -138 -92 242 27 -153 -372 54 182 70 230 17 -122 -135 -131 81 204 209 205 -4 -110 -151 -412 -209
4236 -209 74 -20 40 86 -148 -237 87 -140 122 225 -181 217 92 287 -84 -443 -72 -220 -7 -112 79
4257 79 382 -19 -177 81 -61 245 148 70 -48 -53 -50 -41 -230 143 48 257 -95 -384 306 -266 -306 -29 -244 -84
4281 -84 1 46 33 33 -201 -210 -303 133 55 175 225 155 107 42 -238 -31 -127 139 155 -6 53 21 44 -233 -87 87
4307 87 -14 -76 10 187 222 -224 -15 180 150 -82 119 51 171 -52 118 -242 72 271 51 121 -48 -233
4329 -233 -21 -176 8 33 -50 -168 -102 265 -24 170 -28 -231 153 264 -7 33 174 183 -97 46 -190 177
4351A77j1j57J30p0l7n3J41j21j9K54k29Mj15J42k47K62o0O7J09o4l32K05j58
4374a82N4N13l94N2kK61k63L8O0k42K34k53N21j27j6l70J2K21l30K80p6k6J38
4397A03k42j11j69L54j17M23l28J95J77m93J79J39j98K96J03j07k5j18j52O9K58
4418B36l56K33K01j76k37q5J86l03L00j33Q4p0M26m68J28j05K31n7N12n54P2j71
4440a06q7K10k89K10K82J6l01l75N92R3k92j56N9J48k21K90j6k09N31o79n4M28
4462G4K05j09r4K31m35k41K54K29j10P5p8K71m55Q7p8M7J36J20o0j60oM47l70
4485b0j67L66l89J82l6J53k95N8j49K66P1j79k0P11o40L40m10j37J30k9L93k96
4507i7K07m3l24J92K3Mj07P0j71K54j04J47K2J20k93J9j35K38L5K0J07p1k16L14
$$ plain form
4351 177 166 9 139 69 32 -21 120 -1 -20 234 5 9 -106 36 -211 51 -9 58 167 103 -229 -24 -182
4374 -182 -128 385 -9 43 41 302 39 77 137 -105 129 -124 397 270 254 -116 -104 117 -213 67 -9 -35 103
4397 103 -139 -250 -419 -65 -182 241 -87 108 285 -208 -29 110 -88 208 311 204 179 61 -91 -22 236
4418 236 -120 113 314 138 -99 -184 2 -301 -1 -134 -50 -120 306 -162 -34 -139 92 35 547 -7 65 -106
4440 -106 -193 17 -272 -62 220 236 -65 -440 152 245 -47 -203 -144 4 -217 73 57 -152 379 -300 -354 74
4462 74 279 170 76 307 -128 -369 -115 114 4 79 1 272 -183 -96 -174 -127 9 129 69 -91 -97 350 -20
4485 -20 -187 179 -210 -28 -64 89 -206 -148 -297 -31 40 -139 -159 552 -88 252 -158 -295 -165 -194 199 -97
4507 -97 110 67 -257 -65 -42 -38 -145 -75 -246 8 -96 51 73 193 -100 -81 -216 22 57 77 184 113 -103 211
4531B11j78M78k40m6k55nJ84l01j41M18K9r0pk21J11k33K33L7K46j14O2l56J99
4554B1l25K27L27j84o4J48p3k39L20l13r0J62M08l86J02p6k8J19J09l07K47k52
4576a47K89j72k21R9k2L93j17l95L34K00j61j68l46K13O5K18K19k05o3j16J38
4597C5m16K66o8J59p0k7N11m23n9P5k40L3J13J26K21j48o0j24jJ28N9j53J56N4
4621A47j02K57n13J66M9L38l04K69k40k62k72K99J44M8p2J55q7Q2m04J43J68L3
4643D2J78j78J64j12l17J8L20l86R6K94j62j08M54k48n2j12O3J48op4Rk14J77
4666fo8l4M1q5L1L34j15R3O9l16k82O85k34j45k7K94o03P9L07J51k74n1K41J6
4690A01k3l5k53j71N23l0kl4J43Lj53l08K61L0J77k46M0j74J30k46Q4J68K82k64
$$ plain form
4531 211 33 511 271 225 -30 -35 149 -152 -293 125 154 64 57 -164 -53 -286 -53 -16 230 116 178 -178 21
4554 21 -304 -77 250 66 2 150 77 -162 158 -155 -245 -83 325 -61 41 -35 -63 56 165 -142 105 -147
4576 -147 142 -30 -251 -152 -174 219 102 -293 41 241 80 -88 -434 -221 -156 62 281 76 13 -103 35
4597 35 -381 -115 -183 -24 -94 -121 390 -33 -92 -17 -257 -224 -111 15 236 88 28 -96 -97 31 90 -63 93 147
4621 147 45 302 -211 -45 4 342 38 307 67 -195 -467 -168 -24 24 -48 107 20 102 -302 -159 9 42
4643 42 220 42 206 94 -223 -205 115 -271 -175 119 -43 -151 303 55 3 -109 -46 102 96 22 31 -183 -6
4666 -6 -74 -108 -67 -152 -121 213 98 191 260 -56 -338 347 113 -32 -59 235 -368 -289 18 169 -105 -156 85 101
4690 101 78 43 -210 -381 142 112 110 76 219 222 69 -239 22 52 229 -17 23 -151 -21 -267 -183 -15 267 3
4714CN70n24M8l73K48j78Q8M4j00L49J70k45n3N1l85J95k17M31O5O8l33R5o6k02
4738b51M44k19M3j84j16J00K89l02J25m8L65j93j88K7m0Q2J40J56k06j06j7j37
4760b36L25j18r2j91M74J69k83N7P5n5m05K48j48L33j51J53J4K16k71Oo8j84J57
4783B5J43nl97N02m89Q3J40J38O3j3j47lj89J12K49j71K9m2J27j58J20l64J7K28
4807bJ49k01J2r9M7L46n42PR4L75K1l89L12l19jK07M37m63J71J74k03k0L6m26
4831b77K03Q0P7K30k79q0J20j6k08J54J25J22j32m92M86r2j50o1K12J84o2k08
4853f4k5M97l62J33J03j85nm6k6P5l5kj88J79r9K2p0M07j90j19j17K88l25K51
4877I7j20nK25k44O3j23L20m52L10j34oQ4k49M09l93j10K62n1L01j14p2P2j67
$$ plain form
4714 3 573 49 97 -276 -28 -206 -118 -74 -174 175 345 100 47 98 -287 -92 -309 122 187 255 -78 17 -49 -251
4738 -251 193 -26 17 -167 -283 -183 106 -196 -71 -119 246 53 -135 -108 -148 -66 74 230 24 -82 -99 -236
4760 -236 89 -29 -121 -312 162 331 48 105 180 125 -280 -32 -180 153 2 155 169 385 114 120 52 -132 25
4783 25 168 163 -234 268 -221 -138 2 140 203 190 43 40 -149 -37 212 41 70 28 155 -3 117 -247 -230 -2
4807 -2 147 -54 -42 -141 -94 252 -290 -283 -189 186 207 -182 130 -189 -190 17 454 -9 162 336 133 113 149 -277
4831 -277 -74 6 83 313 34 -46 74 58 -150 4 129 251 119 -373 113 21 -129 -190 22 206 144 -64
4853 -64 -89 408 46 179 282 97 92 46 20 95 60 58 -130 49 -50 -28 -98 309 119 0 -117 171 -154 97
4877 97 -23 -28 197 -47 16 -107 213 -239 71 -63 -69 15 -234 175 -218 -328 -66 -117 184 70 -2 70 -97
4900i7j37j1K00K3K54l10K00p1k36Q7jP1oo3P8J23n7l25J84L53R0k67N8o1L6n41
4926d26K73K59J63j53O1k1l13J05J1n4k06K19J71k85o7P4M28k76m6k2j97M56k10
4949e6q9K0K0J97l30L81l6j22K20m52L7L15j91m0j14K60J22p6q8K8j01K7J22n9
4973eL61j14k34O5J74m57K16l6K06n6r8m2K10j41p7J83l27L29j4R2j21n42M10
4996a8M3l98M02L92k73k91L3O6Jn2K28j63K60l19K20l65J50j78L53J26J59n5p15
5019c94N34j77nQ0n3N9O5k66M45n03L32k81M7M22k78K53l43J82j59J25M3k23J38
5042D3j0K19k67J20k52J06j38K53l9k47L28J62k86n1J22k86N24l35K11j89k57
5063b69K52O5l0l56L58J73kNl66J88j15j87J78K28K34k85o0j74J23o1J44k2L08
$$ plain form
4900 -97 -234 -245 -45 -22 232 -78 122 51 -185 -98 -99 -28 -34 -97 -19 104 47 -278 -94 259 349 82 140 79 115 -426
4926 -426 -153 106 269 116 177 156 -157 -52 -41 -95 -301 -82 89 -196 -263 -189 239 -37 -83 -105 -302 154 -56
4949 -56 -145 -125 -105 92 -238 143 107 -15 205 -247 -210 105 -86 -126 -240 20 142 66 -22 6 -95 -68 54 -5
4973 -5 356 242 8 73 247 -210 6 -30 176 120 22 -20 190 49 -28 155 -172 157 143 235 114 -428 -18
4996 -18 25 -373 29 421 148 -143 -110 -44 -43 -95 133 -30 230 -89 131 -234 -84 -262 91 217 376 321 -394
5019 -394 140 -37 -42 38 -15 44 109 -157 288 -215 117 -164 -117 305 27 280 -63 119 -40 85 128 -95 43
5042 43 33 252 -15 105 -147 -41 -179 74 35 -212 116 278 -8 -59 63 -223 301 -34 177 -12 -269
5063 -269 -17 48 18 -338 20 193 191 196 -170 18 -97 -284 -106 122 356 71 11 -163 -40 -101 43 21 329
5086C29k03n7J5j54J77P7l01j7L38k21J20k52qj12J39O5k4J95J82m17m9L73p6
5109A19pl33L63R1l60L8q9OrJ8J24n8J41P2j36q1J66l16J27Q0R4K00k28K62m11
5134a27M70k37k70J60j00L09l81K21j79K41j66j30L8K02o0k30L31j28P5j76L78
5155B41l54qJ1J02j69L44j30j56M39j89j74q0P8J07m82J31J93K77r8j81J71l74
5177c01kM53J78o31N17j6k15nJ64j27m3j74lL14J4k29J58j51k52K45K31p7j69
5200a21Ml65K60K76m2J59l21J68N1k40J47k58J7L41j33r7L66l57K04o8j13N7R7
5223C2P3j79P2j59K39k54K00J43k94j26K15J18P2l40j42L74k03J09K19k62q5L62
5245A84l85l35O73k37k1M56j59m81L39l29K94L9n7j76N10l46K95j30P1n12M70
$$ plain form
5086 329 126 69 84 -70 107 184 -117 -134 204 -17 103 -149 -157 -269 -130 -65 -89 106 288 -129 -178 195 119
5109 119 112 -221 142 233 -127 -89 -178 -172 -181 -163 -39 -97 44 116 -20 -101 65 -251 -124 -44 50 250 22 284 -127
5134 -127 343 106 -164 -4 -104 205 -176 45 -134 107 -59 -189 -151 51 -9 -239 92 -36 39 -137 241
5155 241 -113 -121 -110 -8 -177 167 37 -119 320 131 -43 -123 -45 62 -420 -289 -96 181 83 -98 73 -301
5177 -301 -303 150 328 -303 214 198 -17 -22 142 15 -28 -202 -205 109 123 -106 52 -99 -351 -106 125 48 -121
5200 -121 -117 -482 -222 54 12 171 -150 18 69 -171 -24 -282 -265 76 -57 -154 212 -145 59 -9 -122 -65 32
5223 32 105 -74 -2 -161 78 -176 24 167 -127 -253 -38 80 152 -188 -330 44 -159 -50 169 -93 -178 184
5245 184 -201 -536 137 -100 -121 335 176 -305 34 -295 -1 38 -19 -195 315 -31 264 134 205 -307 163
5266A63rk58K75R3r9k31k29L64P0l33J1O11m81K88l75j5L86k27L48l92j37N41
5288C64k57K1m64M6J58J43o0J72k16J88l20J95L6m7L41k58j25k5lm1M09k57J34
5311A34k23J76J69j83l61K92K38k44q7J86k73K55j14l07M40j49L55l87J10J0Q
5332D5k77Q5K55J16K82l26l47K57q6m4J97m50M68k37J46M2o8N6j83J32j58L54
5354B59l58L94j17k17N7l43K86J79j67m7L97k41k95K02J25n17M75K7L3j63O1j96
5376a66P1q8K0O1K83k44j64K73k51L18n8o2J90k20J49K05n35j4K77O6M3J41m31
5399a36L77j59j85MJ46j19K12K3J1J22l41j16K39k04J97j33J61j55J36l58M2L17
5421H1l27L75L3mk55m1K5j19J14MK03K8j66m5R3J46k01J26K2j9J46m11J43J19
$$ plain form
5266 163 154 -104 171 264 165 -66 -295 69 139 -194 -183 428 -53 235 -140 -155 231 4 352 -40 -177 364
5288 364 107 128 -336 -290 -132 11 -49 123 -93 95 -225 -30 6 -41 300 42 -83 -108 -111 -152 257 0 134
5311 134 -89 87 256 73 -288 4 242 -2 -89 97 -176 79 -35 -342 98 -51 304 -83 27 37 45
5332 45 -232 -147 108 224 506 180 -167 90 4 -40 157 -293 175 -62 84 126 58 114 -69 63 -95 259
5354 259 -99 295 178 -39 18 -325 -39 140 -27 -74 323 82 -213 -11 114 -403 72 99 132 -31 30 -166
5376 -166 -95 -183 -163 -102 181 -63 -227 46 -205 113 55 -7 183 -37 112 317 -218 -232 45 111 154 295 -136
5399 -136 241 82 -103 -99 47 -72 140 163 174 296 -45 -161 78 -126 71 -62 99 -56 80 -278 -236 81
5421 81 -246 129 162 158 -97 -138 -113 -232 -118 -114 89 117 -49 -94 -1 145 -56 70 92 73 219 -192 -49 70
5445G0l14L19pl6J7Q5l89O12l93K82l04j9q2K49Nj78n0L82l44L55m21M78l04j85
5469a72K30j53J00j20P1jQJ45km13K35J5J87M3k76K4N2J82r8mk71L45k78L42p0
5494A21n0p5q0K77k83j48M14n5J99l10m01L82K6r3P6K40m2j88J27m40K36J62k86
5517a91J98o7N7j8m2j2j29N9K53j00m9j39L6J97o0p5J85l65K36QK14m14m1Q0K88
5542A09j87M11k88K77j13m02L90j21OK7J71j09L0l4l1m33J39M8J90J83l58J29
5564C4L3m3l73M21K1JP2k67P5L4K57l43k54M40K67l41Q8k64J66m0K75k60K00l91
5588a92M37K6j14k03N3Q6q9K90rj63j22M7l46L78M5L6j55j18J27J68j83n2J50
5611I7l90L87K04m01J16j93N1Q8L49l91J45J43m77M11j2k23o4M08m73L11n28M41
$$ plain form
5445 70 -244 75 68 32 49 134 -255 357 -36 246 -58 -77 -159 90 95 -83 -133 249 -95 260 -161 317 13 -172
5469 -172 58 -95 5 -115 -44 -45 -37 108 106 -307 -72 -57 130 173 -103 -79 -27 155 57 53 -218 127 -151 191 121
5494 121 71 -4 -84 193 -90 -238 176 121 320 10 -391 -9 17 -76 0 240 198 10 137 -303 -67 95 -191
5517 -191 7 -60 -3 -21 -63 -75 -204 -145 108 8 -41 -180 -144 53 -7 -82 103 -262 -26 -18 196 -218 -259 -179 109
5542 109 -78 333 45 322 209 -193 197 76 82 109 280 171 201 167 136 -297 -158 -110 80 263 -95 34
5564 34 67 24 -349 72 93 94 166 -101 -26 8 265 -78 -332 108 375 34 122 -142 24 -16 259 -1 199 -192
5588 -192 245 271 157 -46 7 93 4 294 285 122 0 47 -299 79 124 160 5 -113 14 182 -1 -53 97
5611 97 -293 94 298 -103 13 -180 -129 -41 308 -83 62 205 -272 139 127 -96 -160 248 -225 86 -442 -1
5633ao1J06J15j77l91N98j07k66K44j16j21o3M92k97K11J04m87M17k27L5k22J
5655b13K37r5K38j83L81p40M71J13k36j06m2K57J91k81k6j49L4M84m07n6M5Q5
5677BoN2j99K4J08J27M5p1j44p6K71J67n81L53r3j4L70m65J01R3K9J36j18o5m9
5702cJ20L4r5N1j39J05P0o4r1p7J18j30J72J30l6l04J87o9q3nl37K18J45R8Q0
5727I5N1j97k05J68j25L19k02K89j78K24ll20K60j37N7j61M46n01M0K29n8m63
5749c72N50k2j53L24o0k67J36Q3k96l47L54P1J94j63J40q3J15j00k47Q7K76n5
5771A65k02J65n7j68K07j33J0K62q4j02r6n8j68M75k59K94j18l4Q5k07n8k46J37
5794a90M22J16k59l01M24r9l70M11k09K98q7k0k55M70j69j66k5k9P8rk07m8K66
$$ plain form
5633 -1 -62 44 159 -18 -409 189 82 -184 60 -56 -177 -240 252 -45 166 270 -217 200 -27 8 -214 -213
5655 -213 24 -71 167 -16 365 -375 96 209 -27 -133 -175 82 273 -8 -34 -183 -149 335 -72 -128 -83 2
5677 2 -4 48 -151 -127 -19 108 153 82 -62 -138 133 300 -281 72 -21 -35 335 -130 -29 64 93 229 111 46 -3
5702 -3 117 151 56 107 -32 73 143 79 -12 -89 29 -101 71 201 165 -139 48 -21 -104 -109 -446 -228 -83 15 95
5727 95 146 -51 -256 -88 -213 106 -96 193 15 239 236 -84 176 39 96 -65 381 -120 -80 149 91 -372
5749 -372 178 156 3 327 267 0 136 219 -77 -424 -70 1 195 32 172 89 204 104 -143 -56 220 165
5771 165 -37 128 71 -97 110 -23 -13 249 165 63 -33 -91 -259 216 -43 251 133 99 184 -23 -81 -327 -190
5794 -190 232 348 89 -212 212 113 -257 154 -55 243 156 136 -119 351 182 16 -9 -38 40 31 -176 -224 42
5817D2mj23J63Q5M3k61J99l10J23j99L19M6m20M75jJ72j39J5l26k61L28j91K47
5840B2k19K76PN1j32O0jP4p1l16L93j8rJ21n03J80n2K32o4K1j54r0M21j90j43
5865a04J52J85j79J14j78nJ7N8j69L20k35N8j67Rk38M92j10K2l05L08k51J83P0
5888D7j44j1j7M33l88j6P8p0o9J51J02k61K66k02K6K08j24j99N6J32o5M2J62j42
5912ek10M21j04j14K36k94p2J65J47l1n6J08Lk05m02M92j09j10L84n5j34K3p7
5935AP9q6m3J12O8j77M2L99l79M3k96M28q6j44K55k64N92p49J41K96K66n00N1
5958D9L1m8K17o54L18K70m7q6j2N1K1r2j9J78o5l07J41J24r6Q4l0j58J90p0j04
5983a14M97k59J51k67k09M95k99J94k63J00J4J50m7k49N32o09K08j0O3q2r6J64
$$ plain form
5817 42 38 -85 78 163 206 -55 144 -166 -43 -242 77 123 -297 178 177 349 210 225 -101 -362 -34 -225 22
5840 22 -197 79 86 137 5 65 64 138 67 -249 144 126 117 238 -265 -85 -137 95 31 52 -102 -192 229 39 -104
5865 -104 48 233 54 168 -10 -15 2 60 -109 211 -24 34 -133 -124 -362 130 20 42 -263 45 -206 -23 47
5888 47 -97 -108 -125 308 -80 -96 -18 -88 -157 -6 96 -165 101 -101 -75 133 9 -190 -134 -2 -67 -25 137 -5
5912 -5 -215 206 102 -12 224 -70 -142 23 170 139 83 191 194 -11 -413 79 -30 -140 244 189 55 78 1
5935 1 80 -6 -49 63 131 -46 -4 395 16 59 -237 191 105 -39 216 -48 544 -205 -64 232 498 -2 49
5958 49 80 32 249 -405 -87 183 136 50 38 89 110 18 -1 177 112 -195 -54 70 -26 58 28 -130 60 -10 -114
5983 -114 383 124 275 8 -201 294 -5 189 -74 26 40 190 143 -106 426 -183 25 15 78 -4 -100 64
6005F4j30J27p9M4L6j24L25j79j59M04m80k14K55M98m47j94K57mJ72m39M41j03
6027G1k35n1L24n9K06j98P5j94j53J35m3K63k1k90M2K29k40K30o6K12k22n1j56
6050a92J24N3O2J74k86j33O9K79J27l85K75J28n86L78J36J3Q8n25L62j57%pj65
6073a68J8K47Rj96m2J62K20l76K78j55Or4N36n67J38k56L83Kk05L1r1J73J27J05
6097B85j76j20k56K20N2p0K1K34m34K49R1l70M62k89J02l9K00k1J1j84k42M14
6119A40l1k00J65l16K70N8J7k37K37j74j32K12R1K04l27k44MM19k22m0O8j92R5
6142a35J30m74L56m58P82j51J3K16k94Q4j4j19%K33p4l20M94p9j38J26k30L1k14
6165b35N31k39oP7n5p8m8J14k3j25RL27j13l1l67J83K73j97Mr3j6l9K9k27K74
$$ plain form
6005 64 -66 61 -18 26 62 -62 263 84 -75 329 -151 -365 -110 388 -59 -253 4 0 172 -267 174 71
6027 71 -164 -215 109 50 256 58 133 -61 -214 -79 -122 141 120 -170 -128 101 -139 91 25 237 15 -36 -192
6050 -192 -68 -15 47 221 -65 -198 -129 150 277 -108 167 295 -291 87 223 236 324 -201 161 4 4 -3 -168
6073 -168 -150 97 106 -90 -132 30 250 -126 152 -3 3 -91 445 -122 16 -240 143 145 -60 -29 -120 53 180 285
6097 285 109 -11 -267 -47 5 -65 -44 190 -244 5 96 -274 188 -101 1 -38 162 141 152 -32 -274 140
6119 140 109 -91 74 -242 28 86 103 -134 103 -71 -203 9 100 304 -23 -267 -263 156 -66 -106 -38 -230 -135
6142 -135 -5 -479 -123 -581 201 50 63 279 -15 69 55 -64 -64 169 95 -225 269 190 52 178 -52 -21 -235
6165 -235 296 57 51 128 73 -5 -53 61 38 -87 -78 249 136 105 -262 -79 194 -3 1 -92 -108 -147 -118 -345 -71
6190g1K69j23j98J76j06J90m47K60l8j95J34J7KL24l0n68N16K18j36r9k8l52J09
6213a76L54p2Q9j76o7R9p7L9J15j24L07n05J22j42M26j44j5N3%P7J85j89l55N89
6237D13k69P9R4m83k63N59k71K69J03k29j6j0L01n17M87n04K08M6l40O57l62M00
6259C52m53J97rk07N6k8J64l11L70m9k45l5K04j34K87k5j05m5J15m33O34l8k82
6282b0q7k49O69m94L52j48N4o6j21P5K83l00K20k93K48j8J67l57J48j10K4L45
6304C22k69J69p7j84J6K0O2k71J3J28m1r1J58l7j39m4K09M2R6k53J41Q7J81k33
6328EJ45k92k52M51k14J64m9j58O8K20j34j02k13L73j39K24MJ31n27J16j14L03
6350A0RK65m41J22Q6p8l01J30M8m9K84Ll32K4J98mJ15j54O9J43r5n6K87k39k10
$$ plain form
6190 -71 198 75 -123 53 -53 137 -310 -50 -88 -283 -149 -132 -130 194 164 -404 112 330 194 95 67 -285 -176
6213 -176 178 106 195 19 -48 51 -26 13 128 4 311 -194 -72 -214 212 68 53 106 106 183 368 179 -176 413
6237 413 144 223 317 -166 -429 130 -141 128 231 2 -14 -24 277 -240 247 -257 -49 -3 -343 314 -48 352
6259 352 -101 96 87 -120 -64 -92 72 -239 131 82 -163 -198 6 -128 159 134 29 -16 99 -334 300 262 -20
6282 -20 -107 -356 313 -181 171 23 77 11 -110 -35 248 -52 168 -125 123 105 272 -85 63 -47 -23 322
6304 322 53 222 145 -39 -23 -3 59 -212 -199 -71 -112 -203 -45 -82 -221 -265 -56 -14 82 -171 -30 57 238 5
6328 5 150 -142 -394 57 -157 7 -42 -200 -132 88 -46 -148 -361 12 -127 97 101 232 -295 -179 -293 10
6350 10 19 284 -157 -35 51 -27 -328 -198 -150 -199 85 88 -244 -220 -22 -26 89 -65 4 147 52 -4 283 44 -166
6375a66K53j4j54L26j34l55N14j88k96M24n5j59l08J91N3J27q6j60K40k4k67M02
6397A64k19K32l06N3K37k59L21o14J93J15J06P9r2k16J59j20M0K17k01M8L9r8
6419a22Q2J59P3l52P2k5j31M01l18J98l9L4O4P6m49M4P85n44k10J87n0K26K1j81
6443Aj66K19k78L64j09J20K0k17k01L16J21k52j46k85M91L7n1N4K96m52K67m71
6465c22M78jJ47o6n1k77r1L16k19Oj2K42k10J30k28j7L56m1k38L7j5K7j6O4Q2
6490H1m0K25k05j01j2K05k66M15l86j24K30Qj84K20k43M05m81K83k0j41j18J68
6512h1N4j36K69j16p9R5Q4J28l51K08R1l00M84j77j75J29j69j40K08J01k75M73
6534C25l23J83j98L8J41o9L7M6l55j23M04N3j06J65k90J75J08k32Q3Q7L7k30K01
$$ plain form
6375 -166 87 73 -81 245 111 -244 270 82 -214 210 155 -4 -312 -121 -68 59 -27 -187 53 29 -238 164
6397 164 -55 177 -129 -76 161 -98 223 -391 -198 -83 23 102 10 -206 -47 -167 -127 90 -111 -63 -24 -122
6419 -122 -40 119 192 -160 -88 -113 -244 157 -161 37 -2 32 96 172 -277 -233 552 8 -202 -15 -65 161 182 1
6443 1 -165 54 -224 140 31 151 171 -46 -247 69 190 -62 -208 -493 -2 35 -16 38 334 -118 149 -322
6465 -322 156 155 302 236 185 -92 -183 133 -86 -80 -92 150 -60 70 -158 -175 181 140 -98 -61 -76 -49 -65 -1 81
6490 81 41 266 61 -40 -52 153 -113 302 -84 -208 22 30 -154 66 -177 228 -253 30 10 -131 -249 -81
6512 -81 -27 -163 106 -10 -89 6 90 218 -133 75 166 -134 350 173 -2 127 -42 -182 26 127 -148 325
6534 325 2 185 -13 25 166 97 134 180 -175 -298 106 159 53 218 -72 103 211 -21 62 149 186 -44 157
6557A57j90J50k15P0J22R8k61k06J69PJ29nK0q2l02M96j90j48K23o1k52P04n63
6580a30K17R3J03l44K65m26k40O99m26K98LM9m87M11M3k14q5M1J24J03P5O4j49
6603H7J3%l77J32M23j64J05p5r9K67j79j10j50K34P0k00K24j60kj31J72J07j10
6626G7m08L6L35l04n7L17k3J08k9K45k82J90m21J46J76k41J54N0N8k43J03M6j25
6649i2R2l61M0J74K41j30o9K49k57J43J20k09k2L64l35J82J1o8L11k63j6J10k67
6672e2n0n6L15k23J84l84N69n36N23j28j05j48J04k9j5M85m40R7m44K79p0kO8
6695e8J1O4J12j55O7p0J73j19J91j7j52M9k62K35P3k50J54N0j85K69j05j43R1
6718B3O1j41J48o1J53j35nJ61j60J2k18O9K19J82o65J98P3J81k81j08L94j21j69
$$ plain form
6557 157 -33 117 -98 -28 94 192 -69 -275 -106 -99 30 25 45 -37 -339 157 -33 -181 42 -19 -271 433 -130
6580 -130 87 180 283 -61 204 -222 -462 237 -189 109 112 161 -326 85 128 -86 -171 -130 -6 97 172 236 87
6603 87 100 100 -277 -145 278 114 219 144 45 312 133 23 -127 107 177 -23 201 41 39 -92 80 187 77
6626 77 -331 -295 40 -264 -321 -4 -27 81 52 297 15 205 -216 -70 106 -135 19 69 127 -116 -13 33 -92
6649 -92 0 -361 -321 -147 94 -36 -105 144 -113 30 150 -59 -81 283 -52 130 141 73 384 121 105 215 -52
6672 -52 -102 -158 157 -66 118 -266 303 -233 290 162 57 -91 13 -16 -31 454 14 111 -333 -54 -124 -126 -58
6695 -58 -47 17 129 -26 41 -29 144 25 216 199 47 96 -166 69 142 -108 46 96 -89 180 75 -68 23
6718 23 84 -57 91 30 183 48 43 204 44 56 -162 -93 126 308 -357 -159 -86 95 -186 -294 100 -21 -190
6741a90K27K53j54k65J36l22L85j65M29o87K93M7J42n7J59l10J64MJ77j65K6n0
6763G7j59J87j06o1k08L79L3m02L70k76OL92k54L1K40l88r8L52n4k5q6P2j73J71
6787B0K9j60J54j64J54M3k78L58p0m6k05J41Q3j97J16P3l42L36L32j03l76J78
6809G6Op1J14j64J4j61P1R4L39l14K5m6j23K06j17Q6m3r3J30k09J10J75j12j46
6833a53M29k32q7L9r4l15N48Rn7O5J15l04J31j33R6j90J40J47l8j42n0k11k5J19
6857a93m1J94j7K09k19J24pjK7QP6k01J67k28j00J61r6K46j02k80P4J87r9K34
6881A23l23J75R3j03N62n33J44k97L90l79nO6K2k6N1L61m00j81J50J08P2k28M70
6904C12n79K18j96K86J14o18L99L9q7L01l00J94k6j0k12K20M2j72L80m63L38J0
$$ plain form
6741 -190 37 290 136 -129 7 -315 70 -95 334 -353 -60 -13 129 72 231 -79 85 89 266 101 127 77
6763 77 -82 105 -1 -62 -270 109 142 -260 110 -166 -160 232 -22 9 249 -139 -237 115 61 36 -50 22 -151 20
6787 20 49 -111 43 -121 33 76 -202 156 86 40 -165 -24 59 -138 -22 51 -291 45 377 274 -102 76
6809 76 82 11 125 -39 -25 -186 -115 -21 318 4 29 -17 -140 66 -51 35 -8 -101 29 -180 -70 105 -7 -153
6833 -153 276 44 -43 -4 -98 -413 135 144 87 152 267 -37 94 -39 57 -133 7 154 116 -26 -76 -287 -312 -193
6857 -193 -234 -40 -57 152 -67 57 50 49 76 84 160 -41 126 -102 -202 -41 -137 109 7 -273 -199 -12 -111 123
6881 123 -200 -25 68 -35 527 -6 138 -159 231 -148 -153 -87 -65 -91 -40 321 -79 -260 -110 -2 70 -158 312
6904 312 -267 -49 -245 41 155 -463 -64 -25 -112 189 -111 83 57 47 -165 55 97 -75 305 -158 180 190
6926A90k16J4l80M74j02k6NK4J54k15K39l82N72n6m01j12K09n4J9Q6R6k83k3O9
6950i9L1Q5O7p1l33M54J88q4k95K06n6j16J24n9R0j9l44J62l39K61Q5J61o3k15
6974a79Q5j30J85N2j17J67k9Kj3K11n1k56k60K37O3m7K6L3L25l42j26J2J93M22
6998D63m11J7l09qK04lQ7mL37k66nk69Q3j3M5r8K02l27N34l82R3j64M09l69J06
7023d8k25N77n30K05K68l16K10l31J05L47l0j99l72p4O50n85N52j3m4Pj54J2p4
7046f2N84n62j29J75m7L5J24j71L1nj71M41l0j66n2j37j7k3J18K03J05m01N52
7069C95k14j43k38M56m90J62J26K9J61l81J81l7J13j95K10r2R8k59m5lL75j80
7091B9k7k23L21J8J38n0J00m03K71k73J89q6j88L46j10Q5j16l23L76j17J85J02
$$ plain form
6926 190 -26 -12 -392 82 -20 -46 -41 -17 137 -78 161 -221 351 295 -106 -218 -9 -63 -44 42 138 -145 -168 -99
6950 -99 -68 17 84 13 -320 134 322 238 -57 149 93 -23 101 42 132 113 -231 -69 -408 -147 -62 99 36 -179
6974 -179 -94 -224 -39 13 -104 63 34 36 23 234 183 -73 -333 -96 -33 -80 -54 -21 304 -38 -164 -152 41 463
6998 463 52 69 -240 -248 -44 -47 40 36 373 107 102 -167 -84 -97 -52 -150 52 -275 259 -123 -30 -194 215 -154 -48
7023 -48 -273 304 -226 -21 247 -69 141 -190 -85 262 232 33 -339 -413 237 -348 204 191 147 154 0 12 -62
7046 -62 522 -40 -169 6 -41 -6 118 -53 -22 -27 -198 243 213 47 -5 -142 -159 -182 -64 139 244 -157 395
7069 395 181 38 -200 256 -234 -72 54 83 244 -137 44 7 120 -75 135 43 141 -118 -163 -166 209 29
7091 29 2 -221 100 118 256 206 306 -97 174 -99 90 4 -184 162 52 137 21 -302 74 -43 142 244
7113B44j36j75o6L05l64k02R2J19j58J29L98m96K38l1L5m9K7J27Q5Q9p5L4j34
7136C6n4m0J74j28k00n0J60K64k40J85o5k50o4M46j43j28K97P2j34o4k68k35M80
7159E1n7J33k26m5L03k22P8j59J1r9J22M4m03M28r4Q9K01nk05P8M1k93m8L04l71
7184c44K81k70J78M46m72M2K94K73m73j21K02L1J0k71M54j1m04L38m64N27k59
7205a3J05j5J21j64P8p4l3k94L34M5q4q0k9J38R2K54n21k2K50K9J56l65K2L82
7229C12n50K71m4j18L93m32M48M5l35j1J05k34K08K6k27L56k88O1J31j28r6L96
7251B89j33J03j95q1J9k23J91J96N1j30J7Q5n44J29L69R4k07k09Q6J28o3j84J70
7274d2q9K33n7k47Q2pK5K45m75Q2K17j95L54r6Nk62N41p2k49q5K83l73M34l79
$$ plain form
7113 244 108 -67 -133 172 -192 -394 -302 -183 -341 -212 186 -310 -72 -103 -68 -117 -90 37 122 211 136 170 36
7136 36 -18 -58 116 -12 -212 -262 -102 162 -78 107 42 -208 -272 174 31 -97 200 272 138 74 -194 -429 51
7159 51 -6 127 -99 -144 159 -63 15 -144 -133 -232 -110 -66 -469 -41 -135 -46 155 150 -55 23 64 -229 -277 27 -344
7184 -344 -63 -333 -155 291 -181 -139 155 428 -45 -166 36 67 77 -194 260 249 -155 183 -281 246 -13
7205 -13 92 77 198 34 112 38 5 -289 45 90 6 -74 -103 35 127 381 -140 -162 88 117 273 -92 -70 312
7229 312 -238 33 -11 -129 264 -168 280 325 -10 -21 84 -150 58 84 -143 213 -75 -14 117 -11 -107 289
7251 289 156 259 64 -17 2 -221 -30 166 217 87 104 189 -355 -226 143 237 30 -179 -93 35 -28 -212 -42
7274 -42 -131 102 45 -202 -120 -127 -102 143 -332 -250 -33 -228 126 30 35 -227 314 242 -7 -92 191 -182 252 -127
7298a27j45J30j10M71j51j56j82RL56l68K93k76K83r4l5m02M85l47L68q4J9K34
7320A71oK97m73O8k80L92j64j41M40k94J85q8r5R3k12M85m13k37K6K08M5L50m87
7343a30J45M1J39o7k75P9j99J14p2J04K47k73n3N6m8K67k2j77L69j69j94M60o79
7366c37K39J0J73j8k89N91O4j84j33J23l21Kp4L44l91L87k62j2J46j15J95q5p3
7389b0O3l03L36J84j52j33p7J38n11M62m7J54j11Q0j27J53j17K90m27M67k10j43
7411e1K82m05K70P6k43J53l45L26Q4j58K05j48l61J83L19j96k42K07Q5j71M58
7432C28j46j56J8k45L00J07l18L9J53Ll8pn5K5R6J48L0l08P3J14k78M9j12pJ57
7457c0r0k69K67L84k30J98m6lj29Kj93m8pJ63J43Q8m37M62k2K6k01k53K68R3k21
$$ plain form
7298 -127 -272 -142 -252 219 68 -88 -270 -261 95 -273 20 -256 27 -67 -102 -504 -19 -366 2 -82 -63 171
7320 171 165 462 -11 57 -223 169 5 -136 304 10 195 107 12 105 -107 378 -35 -272 -246 -38 7 357 -130
7343 -130 15 56 195 128 -147 -68 -267 -153 -225 -121 126 -147 -200 -144 -192 75 53 -124 245 76 -118 342 -337
7366 -337 -98 -88 85 67 -222 369 433 249 116 239 -82 -80 -154 190 -201 186 -76 -88 58 -57 138 53 -20
7389 -20 43 -260 76 260 108 -25 -102 36 -475 -13 -60 94 -17 63 -64 89 -28 262 -165 302 92 -51
7411 -51 231 -174 96 172 -71 82 -263 63 147 -11 194 46 -315 -132 187 -9 -251 -44 41 -130 328
7432 328 182 26 44 -201 99 206 -112 -73 80 83 45 38 -17 8 104 252 282 -26 47 161 -117 -68 -180 -187 -30
7457 -30 -120 -389 -122 262 32 230 184 181 52 54 -139 -187 -194 -31 112 200 -237 225 203 229 28 -225 43 136 -85
7482h5M3o8J01M2j36Q0k15K56l23pM97j89k20K45J09k88k84M17J47J3P4k50K09
7505A68m52M17j07j75K63k27K58k59L06l52m2K90m00K79o5L9J05Ml18Q5P3R2J58
7528A40k06p8P1R2K71l62j01M96k72j44M0%R5k16O7K47j40j00Q9J65m9Pj42kR4
7553F2m2k80L56j05N8K6Lj01p1J12j84R4r3M98n24K67l29J6K71L6L20l69M12l99
7577C4j04J29K1j55J80j41J24j40Ql8K26m82N56n3o4m93J06M04l14K86q5J35r1
7600D9J90m62j0L21P2q7o7q6M05k75N9J75n55L55J71l60K74J48m31Q3Q6nk04k3
7624a77J40r0J55k2k0j29N6J84P4m9p1R1k99K62j45k52L63J0m40J49M56k00J88
7647B34k87K62l16J45K43n34J60j8J23p0j70J55q4N14o72K66j7M1J23j48j14k49
$$ plain form
7482 -85 -42 -110 -9 33 -103 -23 -238 18 -305 -312 185 -4 -224 21 130 -158 -442 -25 122 135 209 -41 168
7505 168 -284 133 26 -149 114 -113 145 -114 192 -160 -202 88 -312 -33 -98 -59 46 50 -268 -183 -110 -18 140
7528 140 -66 -144 -73 19 290 -72 -173 323 51 -93 -53 -53 42 -174 -107 140 0 -100 -11 154 105 112 -30 -32 62
7553 62 20 -260 96 -9 49 75 78 -23 -94 18 -166 -72 -165 333 -191 76 -253 -237 34 70 390 21 433 34
7577 34 -70 59 80 -75 105 -36 88 -52 -44 -82 144 -338 218 165 101 -392 -286 118 -196 90 5 140 49
7600 49 239 -223 -233 88 160 73 6 -80 325 50 109 284 -271 84 255 -105 169 317 -114 -31 55 50 -154 -177
7624 -177 -37 -127 28 6 -14 -143 -87 97 171 122 51 142 -157 105 -40 -292 71 81 -359 -210 246 46 234
7647 234 -53 209 -107 38 281 -253 -93 -111 12 -58 -228 -73 -157 357 -315 -49 -66 -25 98 -50 -164 -413
7669d13N48k51O3j0K74q4k17o7J80J4p3J07j49ro9J97K71n65J86R4k0k25q2J89
7693a11k4pK55j20K3J71j59K08ml02K4K4j27N3J61n6j88j18L13K84k71k98L60
7716I1J10q1j86L9L18k66O3l10o3L67M5j48j30L67j16k16J26j40K16l8j47K96
7738A97k84J19R2k52k51M01j42J92k34J48K44k40j11K19j05m27M65k94L51J3K13
7759C14K2j31J9l17K42l34j75L98r9K95k19K19j12j99P4J08j35r7j04J56K31Q2
7781B38j42k86L77j64J34j92J26j73R7K20j96J11n1l7L5l54J51j47M15J31m24
7802a31M89m51K09m52M71j42J57m44k8Q98m38j05p6K0J78m7j15M9J30O5l95L43
7824A85k17J95j57j3n9P6J21k72J15q7j42K34P1n9O8j5J29K08o45L23l74M55k76
$$ plain form
7669 -413 135 -116 -53 -63 211 127 -90 -157 23 37 -36 71 -78 -87 -156 41 312 -253 -67 27 7 -218 -300 -111
7693 -111 -135 -142 113 -7 16 187 28 236 232 -70 -46 -22 -149 -96 65 9 -179 -297 16 300 29 -269 91
7716 91 201 120 -66 -27 291 25 88 -222 -285 82 127 -21 -151 216 100 -116 10 -130 86 48 -99 197
7738 197 -87 32 124 -128 -379 22 -120 72 -162 -14 230 -10 -121 98 -7 -434 31 -263 88 101 314
7759 314 336 205 224 -93 149 -185 -360 38 -61 234 15 234 122 -77 -3 105 -30 -127 -231 -75 156 238
7781 238 96 -190 187 23 157 -35 91 -82 15 235 39 150 99 62 97 -257 -106 -253 162 293 -131
7802 -131 358 -93 116 -336 135 -7 150 -294 -322 576 138 33 -43 -23 155 108 -7 42 172 237 -158 185
7824 185 -32 163 6 -7 -66 10 131 -141 -26 -113 -255 -21 50 -9 59 44 173 381 -264 59 -315 140 -136
7847a36Kj87J91q1K93p2J34m6O2J77m02J23n1O1r1J93k41p4M0K86k78K5j63N87
7871C52l60K14N9l05J90Oj08o5K44n31L82j59J67j54J37km66L92j18Q9J54l94
7893b76M47J81m35k63M83K0n62J24L76J62j70J93k71P4M9m9j38j93K93P0j73L8
7915b0K1j6Q7k35O6L6r2K27m4Q7l60J19N8j19J11r9K84q7n7j70N8k26k7P22l35
7940a1J28Q0r0j85j29%k44O63oK5l34J71k29K80J12l06o2N4Q9O7k6k17%J97k22
7965a95K74K29m81j25J67L14j82l50L57j6j34M02j23k24P0m6J73p4l6m53M48N8
7987E3k33J17o7K35K2m59N09o2l1J21j34J63k11q8J83j36j15J81R2J1l5m57J80
8010a61J89j34k57K12J88j2O0j15j2K31j69k86O4K99n06L61Q5J86l76K38j13K25
$$ plain form
7847 -136 -134 -321 -130 -211 82 10 144 98 160 337 -65 58 7 68 -23 170 -71 -145 -105 181 -97 -72 -235 352
7871 352 -8 206 265 -40 150 156 48 -17 227 -304 78 -81 86 -68 69 67 -399 -7 -125 -36 118 -276
7893 -276 171 352 -83 -346 137 157 -405 -281 95 257 87 280 9 83 132 83 -55 -248 45 115 -58 -20
7915 -20 1 -15 72 -163 -97 -61 -153 74 30 117 -243 -124 -66 -185 -74 -173 111 24 -33 -203 -145 -371 -398 324 -11
7940 -11 117 197 107 -78 -207 -207 -451 212 206 231 -103 68 -161 119 231 -75 -137 -83 6 73 47 -170 -170 27 -195
7965 -195 79 308 -173 -298 -131 183 1 -349 8 -8 -142 260 137 -87 -17 -63 110 36 0 -453 -5 53
7987 53 -180 -63 -130 105 127 -332 177 115 84 205 71 234 23 -65 118 -18 -133 48 140 151 116 -341 -161
8010 -161 28 -106 -363 -151 37 25 85 -30 -42 189 20 -266 -202 97 -409 -48 37 223 -153 85 -28 197
8032A97o1j12j09L48m66N8L10j00L09k80o5Ll5J65j69J24mm43M44k7l2J31p3l72
8056b59M44l01J25J56j71O6m1r5%N6J93j29k3p2j81N34l36J41k09pj82M16j88
8079f3J06l28L05r1K07o5j41R2LkK24k17o2L12r5j17L0P2l87L40p0R3k91K55k09
8104i9m3KL21l9J00j26l86J34J75J00j70J79j83r8o3L72j5M1l16J40K05n36L95
8127I0k57R3J50n9j02J42j03r8K10J60jn8k61L41j87l18N95l34L06n13N3P7r6
8150a70M08k58L21k23K99k01P1J5o1l21K14n8j10K75k83N5J53j50Q0L8j85M3J38
8173I0q9m1K4j30K51k80M06k41o9K57k17j5k44J84J99o9k58K86
$$ plain form
8032 197 136 24 -85 263 -203 -145 165 65 374 94 29 32 -3 162 -7 117 113 -330 114 87 55 186 113 -259
8056 -259 185 -116 9 165 -6 60 19 -76 -76 -20 173 44 21 -51 -232 302 -34 107 -102 -109 -291 125 -63
8079 -63 43 -285 20 -71 136 71 -70 22 25 23 247 30 -32 280 185 68 98 170 -217 123 53 146 -145 110 -99
8104 -99 -142 -140 181 142 242 116 -270 -136 39 139 -31 148 -35 -133 -196 176 161 202 -114 26 231 -305 90
8127 90 -167 -74 76 17 -85 57 -46 -144 66 226 225 167 -94 247 60 -258 337 3 309 -204 -151 -74 -170
8150 -170 238 -20 301 78 377 176 247 262 201 -120 94 36 -74 201 -82 -27 126 -24 56 94 -91 -48 90
8173 90 1 -40 -16 -146 105 -175 231 -10 -79 178 -39 -54 -298 -114 85 16 -242 44
8191D4
$$ Imaginary data points
##PAGE= N=2
##DATA TABLE= (X++(I..I)), XYDATA
0@%%%%%%%%%Qj6J6j6J7k5L2m0M8n6O7p5Q8j04J20j38J60j84K10k38K69l04L42
32A81l82M28m79N34n95O62p36Q14r02J000j107J225j356J505j671J857k071K318
50A225k608K953l371L893m561N458o732Q691j2144K0056p4207k065J17648J6497
64G0733o741j7734j5913p1276o3507R700R0547O7901P011k2873q715l1382o5617
77e7866m5538M1444Q4951M8370j1061j8078j2858l9511o5866k0202N7704P8213
89C9702K6442j5880j4396j5811m9138n5591L750O9152O3712J0035j7597j2209
101C2171k5038n4622m0661K6956P3463M8957m15j7393j6393l7034n6703k1166
113h7878M7154P2929L4089j0210j9429k3923m5489m6573M159O2932O4208J5269
$$ plain form
0 0 0 0 0 0 0 0 0 0 0 8 -8 8 -8 9 -16 16 -24 24 -32 35 -40 48 -56 64 -74 86 -98 112 -126 143 -161 181
32 181 -201 227 -252 282 -313 349 -387 427 -475 525 -582 643 -713 792 -879 978 -1093 1225
50 1225 -1383 1570 -1801 2092 -2469 2989 -3743 4948 -7196 12860 -61347 -63412 54236 70733
64 70733 63992 46258 30345 -40931 -104438 -94738 -4191 63710 70721 47848 39133 7751 -57866
77 -57866 -103404 -61960 22991 71361 60300 42222 29364 -10147 -76013 -96215 -38511 39702
89 39702 66144 50264 35868 20057 -29081 -84672 -80922 -11770 51942 61977 44380 32171
101 32171 7133 -47489 -88150 -61194 12269 61226 60811 43418 27025 -10009 -66712 -87878
113 -87878 -40724 32205 66294 56084 36655 12732 -32757 -79330 -75171 -12239 51969 67238
125F7238k0701k3216k9398m4266k9627K7512O7798M7259j888k4655k3584l1675
137a9203m0000j2582M1612O3478L0149j2742k5191k3725l3434l2793M314N1019
149i098N5080J4424j9703k4932k5220l3201k2815J9860N5546M4165K332k3608
161C2830k4735k7071l1468j1393L2302N5320L2190p945k6002k5815k7916k6245
173e5948J778M2907N2134J9234j7968k9237k6378k7090j7363J6179M8966M4735
185E1949M968k5976k9433k4952k3162p446K8141N0137L2555p828l0241k7483k2402
198c1173j7273K924L6513M7054J9624j8567l1828k4689j8981j1606J2992M1465
210F455M0798O846k6054l1175k1623j5732m864K1958M3856L2234n800l0894k8640
$$ plain form
125 67238 46537 23321 -6077 -50343 -79970 -52458 15340 62599 60711 36056 12472 -19203
137 -19203 -59203 -71785 -30173 33305 63454 50712 25521 1796 -31638 -64431 -60117 -9098
149 -9098 45982 60406 40703 15771 -9449 -42650 -65465 -45605 9941 54106 56438 32830
161 32830 8095 -18976 -50444 -61837 -29535 25785 57975 50030 24028 -1787 -29703 -55948
173 -55948 -54170 -11263 40871 60105 42137 12900 -13478 -40568 -57931 -41752 7214 51949
185 51949 56917 30941 1508 -23444 -46606 -54052 -25911 24226 56781 48953 18712 -8771 -31173
198 -31173 -48446 -45522 -9009 38045 57669 39102 7274 -17415 -36396 -48002 -35010 6455
210 6455 47253 54099 28045 -3130 -24753 -40485 -45349 -23391 20465 52699 46899 16005 -12635
223a2635j7671j1559K926K9673M2914K0951j7160l2887k4600j4006o976J0644
235c0386L5648L8451Q101k5259l2915k0000r770k267J8247L8610L0583l838l1282
248A3923k9364j5063o423M019K4949L8347K1084j5107l4513k4469r871k971R676
261b5783L0710L5396R312k5020l3040j8799o105Q63J5592L3456K9525k814l1036
274A2257l0102j3065k165N508K1143L4221K0677j4170l4329k5038p058O83R893
287b1545K6647L2083R724k3476l3687j8161l219L932J4430K9453K6598j784k9669
300A1326l0273j2011J207P085J8517L0140J8868j2457l2848k5118o182M155J0442
313a7149K2879K8519R084k1572l2471j8571j274O739J4136K5209K3768j026k7894
$$ plain form
223 -12635 -30306 -41865 -38939 -9266 33648 54599 37439 4552 -20048 -34054 -41030 -30386
235 -30386 5262 43713 51814 26555 -6360 -26360 -36130 -38397 -20150 18460 49043 45205 13923
248 13923 -15441 -30504 -36927 -32908 -7959 30388 51472 36365 1852 -22617 -32488 -35459 -25783
261 -25783 4927 40323 49635 24615 -8425 -27224 -33329 -32466 -16874 16582 46107 43293 12257
274 12257 -17845 -30910 -33075 -27567 -6424 27797 48474 34304 -25 -25063 -32121 -31438 -21545
287 -21545 5102 37185 46909 23433 -10254 -28415 -31634 -27702 -13272 16181 42779 40995 11326
300 11326 -18947 -30958 -29751 -22666 -4149 25991 44859 32402 -446 -25564 -31746 -27591 -17149
313 -17149 5730 34249 43333 21761 -10710 -29281 -30555 -23816 -9680 15529 39297 38271 10377
326A0377l0031j1492L040R270J7322K5831J7403j1414l1470k5103n111O240J1589
339a3549K0354K4422Q956j9611l1792j8812N88Q808J3442K2290K1002l24k6156
352I618k9700j1134N176J0739J5752K2405J5474r766k9620k5133m858Q580J2644
365i823J7418K1243Q567j7845l0561j8956J436J0680J3879J8911J7952K27k3673
378I455k9140j1965O163J3069J4836J9366J2829p653k7836k5352m674J0051J4321
391f530J5614J7495O970j5367k9085j9512K240J3108J4342J5627J4775N62k1870
404H369k7755j2128P276J4639J4753J5286J0916o685k5691k4378n639J1868J5262
417c907J4269J4207O369j3862k7501j9245K033J4207J4864J4052J2019j19j9739
$$ plain form
326 10377 -19654 -31146 -28106 -18836 -1514 24317 41720 30306 -1164 -26267 -31378 -25138 -13549
339 -13549 6805 31227 40183 20572 -11220 -30032 -29444 -20636 -7194 15096 36098 35774 9618
352 9618 -20082 -31216 -26040 -15301 451 22856 38330 28564 -1056 -26189 -31047 -22467 -9823
365 -9823 7595 28838 37405 19560 -11001 -29957 -28521 -17841 -3962 14949 32901 33128 9455
378 9455 -19685 -31650 -25487 -12418 2418 21784 34613 26960 -876 -26228 -30902 -20851 -6530
391 -6530 9084 26579 33549 18182 -10903 -30415 -28175 -15067 -725 14902 29677 30239 8369
404 8369 -19386 -31514 -24238 -9599 5154 20440 31356 24671 -1020 -25398 -31037 -19169 -3907
417 -3907 10362 24569 30938 17076 -10425 -29670 -27637 -13430 1434 15486 27505 27386 7647
430G647k6421j2499P877J6002J4496J2799Q647o362k3525k4154n131J2788J6778
443a058J2824J1252N002j2457k5707j8903J694J6008J5412J1972R397q62j7697
456F877k4777j2675P833J7333J4612J0157O453o077k1146k2758n264J2921J7012
469E01J2528Q638K782j1051k3132j8259J433J6287J6359J0307O906j627j5392
482F280k3661j2120P661J8003J4296Q764M077o033j9156k1050n557J2748J7847
495B099J1885O857J015j0271k1181j6988J023J6351J6653R428M544k204j4416
508D795k1136j1944P602J7940J4395P222K321o630j6984j9323n316J2305J7768
521C015J2338M457j094r231j9377j5390R45J5933J7046R068K641m414j2661j9310
$$ plain form
430 7647 -18774 -31273 -23396 -7394 7102 19901 28548 22186 -1339 -25493 -30624 -17836 -1058
443 -1058 11766 23018 28020 15563 -10144 -29047 -27353 -11345 4067 16039 25436 24574 6877
456 6877 -17900 -30575 -22742 -5409 9203 19360 25813 19736 -1410 -24168 -29432 -16511 501
469 501 13029 21667 24449 13398 -9734 -27993 -26560 -10273 6086 16393 23299 21672 6280
482 6280 -17381 -29501 -21840 -3837 10459 19223 23300 17267 -1889 -22939 -28496 -15748 2099
495 2099 13984 20841 21856 11585 -9596 -26584 -25561 -9210 7443 16871 21415 19211 4795
508 4795 -16341 -28285 -20683 -2743 11652 18874 21195 14565 -2419 -21742 -27058 -14753 3015
521 3015 15353 19810 18716 9485 -9892 -25282 -24337 -8404 8642 17710 20351 15937 3276 -16034
535a6034j0751P080J7877J4606O267N2p026j5526j7105n511J2141J8052J1894
548A6016L384k536r620j6869j4350R36J5534J7126Q897M04m968j2301j7138r645
562b5130O653J7257J5255N099j900p426j3828j5353m727J1153J7754J1859K358
575A9024m124r767j5077j2226N19J4634J7273Q346n13o780j1138j4566q962N789
589a7568J6615J5326M750l127p879j2956j3800m200J0438J7404J2201J218n350
602A3072r492j2965j1716Q01J3802J6500R013j634p540j1038j3181p310N100J5844
616g44J5443M533m661q517j2048j1345l679R771J6810J1773J158o818j0155j2267
630a0746q663N26J3185J6672Q169k865q306j0749j0773o055M279J5292J4616M426
$$ plain form
535 -16034 -26785 -19705 -1828 12778 19045 19097 12071 -3455 -20560 -26071 -13930 4122 16016
548 16016 19400 16864 7244 -9625 -23975 -23039 -7505 9621 18518 18922 13954 1653 -15485 -25130
562 -25130 -18477 -1220 14035 19134 17234 9808 -4020 -19373 -24100 -12947 4807 16666 19024
575 19024 14900 5133 -9944 -22170 -21651 -7017 10256 18602 18089 11309 171 -14395 -23357 -17568
589 -17568 -953 14373 19123 15996 8117 -4839 -18639 -22839 -12401 5003 17204 18422 13072
602 13072 3580 -9385 -21101 -20300 -6498 10002 19015 17381 9841 -1197 -14378 -21688 -16588 -744
616 -744 14699 19232 14571 6054 -5994 -17339 -21018 -11247 5563 17336 18494 11676 1521 -10746
630 -10746 -19409 -18883 -5698 10974 19143 16278 7972 -2777 -13550 -19605 -15326 -34 14582 19008
644A9008n600r579j0620r105l296Q867J5854J1981M80q206r665j0398p644Q92
658a7031J1929J5517Q234l160r238j0294q947n453M711J4037J4131M493o550r652
672B727j0425p885k340Q422J5629J1076K30q309j0414r379o266J025J1401J5311
686A0803Q070l928j0305r853q133l959N042J3368J3329L843o659j0963r197o122
700a4664j191P481J4741J0819o65q740j0465q289m558J644J0218J4340P435l920
714A4186j0588r738o563k802M606J2061J3100L702p260j0858q898m993n41P467
728g119J3122J0166J79r505j0388p240l736J969R824J2736P625l957j0320j0130
742f774n865j658M666J1483J1620L841o930j1158r001l984Q60O810J2190R958
$$ plain form
644 19008 13408 3829 -6791 -15896 -19192 -10325 5529 17510 17990 9784 119 -10279 -17923 -17031
658 -17031 -5102 10415 18649 15489 6251 -4043 -12990 -18443 -13732 305 14436 18929 12379 2727
672 2727 -7698 -15583 -17923 -9501 6128 17204 17434 9125 -1289 -10668 -16934 -15909 -4508 10803
686 10803 18873 14945 4640 -5213 -13346 -17305 -12263 1105 14434 18277 11618 655 -8542 -14664
700 -14664 -15855 -8374 6367 17186 16521 7781 -2684 -10973 -15531 -13887 -3669 10671 18106 14186
714 14186 3598 -6140 -12703 -15505 -10899 1162 14262 17964 10704 -154 -9052 -14045 -14586 -7119
728 -7119 6003 16169 16348 6843 -3545 -10785 -14521 -12552 -2728 10008 17633 13676 3356 -6774
742 -6774 -12639 -14297 -9631 1852 13472 17313 10383 -775 -9776 -13760 -12900 -6090 6100 16058
756A6058n90r079j0811p259j849K334R320J1680O875l677j0779r989m853o58N451
771g826R793J0858L211o679j0911q239l463J766O877J1008Q757l94q988j1223
785e453n979j633L432Q422J0804O055l373j0534r666m769P54N299R320R829L018
800A5526o485j1444q144k408K621P134R888P608k00q891j1060n919o23M436P633
815c28R765N452l388j0540r536l860J703N372Q545Q851K631o756j0561q000j967
830a2617L438O785Q926O961o32q810j0315n763M52M511Q105Q176M494l159r871
845F81r416l914K420O144P879P477K030n949j0035p910j268L865O535P803O319
860A2661p51p939j0078n577O39M929P557P523M052l518r299q962l143K149O727
$$ plain form
756 16058 15468 6389 -4422 -11681 -13530 -11196 -1876 9804 16679 13002 2223 -7766 -12619 -13277 -7826
771 -7826 1967 12825 16036 9357 -1554 -9793 -13256 -11490 -4613 6395 15152 14758 5770 -5453
785 -5453 -11432 -13065 -9633 -1211 9593 15648 12275 1741 -7925 -12694 -11940 -6641 2679 12508 15526
800 15526 9041 -2403 -10547 -12955 -10334 -3200 6688 14296 14096 5205 -5855 -11774 -12397 -7961 -328
815 -328 9437 14889 11501 961 -8575 -12435 -10732 -5360 3185 12036 14667 7911 -2650 -10650 -12617
830 -12617 -9179 -2394 6532 13493 12861 4051 -6264 -12027 -11575 -7064 1041 9217 13711 10552 681
845 681 -8735 -12649 -10229 -4085 3794 11271 13301 7352 -2683 -10593 -11861 -7996 -1461 6342 12661
860 12661 11910 3971 -6107 -11684 -11045 -6116 1441 8964 13016 9498 199 -8763 -11906 -9757 -3030
875c030P336O489J447n551j0177p265q61M204O891P449M841p28p350j0051n697
890a2053J383N950P112O420L181l287q603r027k937L206O406P082N556P47n189
905E947r361p346m95M960O842O294M302j064p115r345n094J407O334O877N541
920H684K513l042q462q477l052L741O609O776M532K80m592r196o453r48N465O793
936A171N756L105j561n937r129m864J925O167P379M546J771l148p989q080k557
951a1445L802O919O541L260N5m710p598p146j76N563O689N758K506k125o104q250
967f461m621J871O991O439M381P64l563o847p209k612L775P266O158K801l50n091
983C692p592n840m45N600O693N616J571k258n536p612m373K053O184P014L549
$$ plain form
875 -3030 4306 10795 12242 6691 -3486 -10751 -11612 -7408 -517 6932 11773 11045 3695 -6356 -12053
890 -12053 -10670 -4720 2392 8812 11993 8706 103 -8924 -11861 -8655 -2249 4833 10389 11136 5947
905 5947 -3414 -10760 -11255 -6295 547 6841 11143 10079 2964 -6381 -11475 -10068 -3734 3143 8684
920 8684 11197 8155 -307 -8784 -11836 -8095 -1486 5290 9822 10102 5510 -3686 -10139 -11087 -5622 1171
936 1171 6927 10032 8471 2534 -6595 -11459 -9534 -3367 4012 8558 10329 7181 -808 -8888 -11445
951 -11445 -7643 -724 5817 9077 9132 4422 -3176 -10322 -10498 -4935 1754 7512 10018 7893 1789 -6461
967 -6461 -11082 -9211 -2220 4219 8600 9364 5801 -1046 -8255 -10867 -7092 174 6332 9133 8783 3692
983 3692 -3900 -9740 -10185 -4585 2108 7724 9295 7037 1501 -6111 -10484 -8431 -2247 4767 8316
998H316M37l671o783o426k434M252P032N917K223r66m737p246n250l82N933O827
1014C042M611J028k367n615p068l901J785P125O489L092l7l759o223n893k289
1029i980L876O975N795J917j706m678o434m843Q7N731O980M205K51k779n046o525
1045f174l384J658O853O327L114p75m110n488n559j971L782O967N652J626k373
1060F145m370n586m854l6N327O974M590n74l124m731n497l122J681O347O413K870
1076H453j913l495n217m939j693L577P218M895J419k906m227n481l825L4N076
1091c024P075L373k2l715m357n027k695J590O342O047K309j648m052m886m441
1106g131j395L513O870N154P79k840m367m770l545K76M716P059L398l20m072m706
$$ plain form
998 8316 8753 5082 -1701 -8127 -10561 -6309 723 6640 8863 7897 3160 -4086 -9336 -9718 -3785 3042
1014 3042 7653 8681 6314 699 -6369 -10270 -8485 -1360 5129 8221 8184 4425 -1798 -7691 -9980
1029 -9980 -6104 871 6666 8583 6877 2199 -4235 -9078 -8991 -3260 3720 7925 8176 5397 351 -6174
1045 -6174 -9558 -7900 -1047 5280 8394 7619 3509 -1979 -7538 -9509 -5727 1240 6892 8518 6145
1060 6145 1775 -3811 -8665 -8701 -3374 3600 8190 7616 4492 -239 -5736 -8858 -7177 -830 5583 8453
1076 8453 6540 3045 -2172 -7111 -8804 -5227 1991 6886 8305 5399 1172 -4309 -8134 -8100 -3024
1091 -3024 4051 7424 7402 3687 -670 -5697 -8392 -6802 -460 5587 7896 6248 2196 -2690 -7131
1106 -7131 -8526 -5013 1857 7011 7790 4950 583 -4187 -7732 -7456 -2740 4319 7717 7397 3325 -1381
1122a381m190k432J920O060N805K117j924m402m745l578q02L244O398M985N39
1137G614l335m592m470k210R6M625O345L885j218m136m307l651j938J970N277
1152d5N790K150k577m191m498l263j60L032N799N111M67l683m696l785k315N42
1168f322M478N752L343q16m141m622l244j237J869M927N551K131k526m456m226
1183c539k210o77L162N144M738P96l695m627l933j497N67M470M995L564j005m373
1199A880m620k732m57J449M582N400J477k372m506m161j691K88K660N208L983
1214F388O17l648m721l537j352J375L486N411K794j150m325m435k455l86K301
1229c637L923M877K025k958m486m204j137O5L175M608L842N12l696m530l220q16
$$ plain form
1122 -1381 -5571 -8003 -6083 -23 5782 7899 5975 1573 -3172 -6750 -7552 -4308 2090 7075 7614
1137 7614 4279 -313 -4783 -6993 -6897 -2272 4073 7958 6740 2604 -1703 -5354 -7292 -5322 -45
1152 -45 5745 7895 5318 1127 -3371 -6634 -6794 -3762 2037 7148 7615 3932 -764 -4549 -6864 -6322
1168 -6322 -1844 3908 7251 6435 2294 -2328 -5572 -6809 -4940 -13 5538 7669 5143 687 -3539
1183 -3539 -5749 -6426 -3264 1880 6618 7414 3719 -908 -4841 -6338 -5771 -1301 3694 7258 6253 1880
1199 1880 -2740 -5472 -5929 -4480 102 5502 6979 4607 101 -4060 -5751 -5463 -2803 2405 6388
1214 6388 7005 3357 -1364 -4901 -6253 -4878 -1392 4019 6813 5663 1338 -3097 -5552 -5938 -3637
1229 -3637 286 5163 7188 4230 -256 -4460 -5597 -5532 -2357 2251 6093 6605 2909 -1621 -4841 -5657
1245e657J425L176M681K908q14m305m702k051J51J979L867M415J851k665m784
1260e25l729j525J132K947M109L289M48l230m644l172n03J821K972M385K474o61
1276E588m555m373j965N40K140L434L983J366k212m532l943o98J156K706L955
1291B590K799N79l830l986l139j19J990L100L602K681j146m102m499k127J097
1306d510K390L308L463J425j968n081l355j076J449K883L346L231M45l559n017
1321b626k265K87J687L137L386J890p65m142m131j715J160K579K954K999R64j742
1337C657m846l275o95K058K477L291K323K49l130m440k846M76K261K937K893J879
1353E269q51l648m191j962J407K712L020K626N76j463m476l592n39K023L292K303
$$ plain form
1245 -5657 -4232 -1056 3625 6533 5719 1414 -3288 -5339 -5188 -3209 658 5073 6924 4259 -525
1260 -525 -4254 -5779 -4647 -1700 2409 5698 6146 2916 -1728 -4900 -5403 -3582 -610 3775 6249 5588
1276 5588 1033 -3340 -5305 -4765 -2625 809 4792 6158 3946 -586 -4529 -5227 -4071 -1365 2590
1291 2590 5389 5968 2138 -1848 -4987 -5106 -3116 -16 3586 6267 5121 1019 -3480 -5607 -4510
1306 -4510 -2120 1188 4651 6076 4108 -973 -4328 -5404 -3955 -1072 2274 5505 5950 2391 -2626
1321 -2626 -4891 -4604 -2917 220 3606 5496 4731 589 -3542 -5257 -4097 -1518 1436 4435 5399 3657
1337 3657 -1189 -4464 -5159 -3101 -624 2667 4990 5239 2109 -2331 -5177 -4701 -2440 497 3390 5269
1353 5269 4418 770 -3421 -5383 -3976 -1264 1756 4382 4958 3495 -981 -4573 -5112 -3089 203 2506
1369B506K069k66k527l982k948O21K511L133K683J092r09l623l909j729J637K780
1385h61K944J993P89j718m193l738j38K106L356J981J705K17k979m042k307L63
1401d522K929L050J563J233r07k973l953j516J348L423K359J917L20j876l211
1416h16l297n80K396L132K169J160m76k276l707k551P52K854K627J769R61q52
1432C265l163l608j326J281L773K117J164L47j698l177l001n84K649K924J954
1447B917P35l75k195l269k351O88K895K763J538Q2m97l071l020j552J574L338
1463B00K079J005J50j362l227k479j151K512L728J604N23p74j884l045k265O09
1479c777L196K655J163K10r53k552l237j300J448L424K410P63o27j053k797l108
$$ plain form
1369 2506 4575 4309 1782 -2200 -5148 -4527 -2016 1117 3800 4892 3983 360 -3549 -5278 -3641 -861
1385 -861 2083 4076 4865 3147 -1046 -4784 -4922 -2816 540 2521 4226 4443 1464 -2578 -4885 -4522
1401 -4522 -1593 1457 3020 4253 3346 373 -3580 -5096 -3748 -325 2034 3951 4271 2395 -816
1416 -816 -4113 -4693 -2297 835 3004 4164 3688 1412 -2295 -4846 -4094 -1240 1387 3156 4117 3265
1432 3265 102 -3506 -4832 -3551 222 2339 3503 3850 2152 -1025 -4026 -4610 -1961 963 2917
1447 2917 3652 3277 1082 -2187 -4538 -3850 -955 1808 3346 3428 2931 -140 -3160 -4712 -3138 200
1463 200 2279 3284 3434 2072 -1155 -3634 -4785 -2273 1455 3059 3582 2808 924 -2121 -4386 -3777
1479 -3777 -581 2074 3237 3447 2494 -58 -3295 -4595 -3147 277 2687 3450 2823 1770 -1027 -4135
1495d135l6K436K880J885K7o04j695k978k345Q36K937K995J282j80j344k342k746
1512c127r22J019L553K274K79n48j801j797k455o62K389L122J985l89n29j803
1528E88k797j769N72L023K466J234p47j105j967k263j313J773K826K352M89j019
1544B343j603j736k515j54K180L177J515l63r87j761j905k022M49K954K638P58
1560B968l54j448k008j832j137J267L072K644Pj100j449j611k238l88K298K552
1576A243K026o41j414j280j484k028M22K790K861P76o46j737j889j155j403J084
1592b475L159K192L10j208j477j587k147r7J869L060J603k26j622j693j447j492
1608c278L23K592K710Q27j157j670j164j449n97N86L192J996J50j169j720k020
$$ plain form
1495 -4135 -4171 -1735 1145 3030 3057 2453 758 -2220 -4565 -3729 -792 2203 3485 3305 1961 -381 -3127
1512 -3127 -4049 -3030 523 2797 3076 2528 727 -1070 -3525 -4187 -1798 1324 3309 2920 2391 588
1528 588 -2209 -3978 -3406 -383 2083 3317 2570 1465 -502 -2765 -4078 -2305 521 2873 3362 2343
1544 2343 740 -996 -3511 -3665 -1485 1692 3207 2844 1857 96 -1809 -3831 -3382 -428 2210 2968
1560 2968 2614 1166 -842 -2674 -3811 -2544 528 3172 3179 2079 630 -981 -3219 -3607 -1309 1243
1576 1243 3269 2628 1214 -66 -1550 -3578 -3156 -366 2495 3271 2625 888 -1001 -2156 -3559 -2475
1592 -2475 684 2876 3186 1978 501 -1086 -3233 -3330 -1461 1599 3202 2976 1354 -339 -1786 -3278
1608 -3278 -2955 -363 2347 3174 2017 347 -817 -2266 -2863 -2277 915 2911 3061 1892 172 -1848
1624a848j028l34J995K591J957n41j702j773j089j186O52J834K881P10q15k013
1640B91j632r61o78J006K535K303K16j749j429j426r10j65J432K852J350m71j674
1657H90j422j093r29J08K006K989Q55j614j510j264j188m36O46K344K513j86j246
1674A463j839j275q68r1J529K529J622p01j790j618r63n33O95J473K256J231j172
1691A948k154j036o18k84L63K111K407nj332k274r72k70j01J243K235K090j192
1708B159j686j615r44j75J44K028J946J215r03k522r42p66R7N16K159J851J39
1725B701j518k298p04l44K96J172J844J578n99j982j536m54K97K74J191K201P54
1742B873j212j710j598k03M03K86J177K286M07j302k382p32r1K96R27J394J785
$$ plain form
1624 -1848 -2876 -3210 -1215 1376 3333 2792 1090 -683 -1772 -2958 -2306 -472 2409 3119 2304 291
1640 291 -1341 -2302 -2980 -1974 561 2864 3080 1331 -98 -1524 -2434 -2599 -1167 1685 3035 2564 890
1657 890 -532 -1625 -2554 -2446 -440 2549 3404 1790 280 -984 -2172 -2608 -1962 382 2895 2709 1463
1674 1463 -376 -1651 -2519 -2610 -1081 1448 3070 2369 579 -1039 -2002 -2535 -1840 -367 1889 3120 1948
1691 1948 -206 -1242 -1860 -2144 -1781 330 2737 2732 1400 -874 -1846 -2116 -2217 -974 1261 3351 2159
1708 2159 473 -1142 -2086 -2261 -2117 -89 1857 3072 2169 -353 -1295 -2061 -1964 -1448 711 2562 2701
1725 2701 1183 -1115 -1819 -2163 -1867 -695 1149 2727 2128 146 -1390 -1844 -1547 -1273 -82 2119 2873
1742 2873 1661 -49 -1647 -1850 -1447 -1161 16 2302 2709 1407 -975 -1707 -1798 -1502 -575 819 2604
1759B604l37j742j617j052O00L21J206J787P80p27k101j511k33N10O05J568J444
1776B105P42j594k160j387M29O67N96J571J619k21k080j801o07P99M25O58J726
1793A487Q90o12k084j765M16M62Q73P48J236Q77j387k437p95K84Q22O36J546J168
1811B365j99k129j842m59O37J017P20J246Q36k37k189j364k23M54J058P55J834
1828B280j52j097k160j048P55N45P11J194J112k44j568j751o86R16N88O89J153
1845A237P43l62j900k001R5J461O94N21J055O05r96j869j379K57J123Q65R88Q83
1863B020o1j323k130n14P72P52J050N77M64j55j607j688l45J298J151L38Q23O05
1881B027j193j815j106O42O59J587P1N10K00j378j873n08Q35J303M83Q13O07l79
$$ plain form
1759 2604 2267 525 -1092 -2144 -1544 -1223 -17 1770 2550 1823 -278 -1789 -2022 -1512 -907 661 2105
1776 2105 2847 1253 -907 -2294 -1865 -1198 -602 969 2588 2367 287 -1514 -2121 -1322 -897 -239 1487
1793 1487 2377 1765 -319 -2084 -1668 -1206 -333 415 1651 2528 1141 -1296 -2091 -1807 -985 -349 1197 2365
1811 2365 2166 37 -1805 -2264 -1627 -610 110 1356 2192 1955 -234 -1598 -1821 -1367 -309 446 2280
1828 2280 2128 1031 -1129 -2177 -1422 -877 -166 1028 2140 1896 328 -1423 -2109 -1193 -605 84 1237
1845 1237 1980 1618 -282 -2283 -2188 -727 -33 488 1543 2148 1152 -717 -2096 -1839 -716 149 1137 2020
1863 2020 1959 636 -1494 -2008 -1236 -484 566 1143 1607 1452 -155 -1843 -2188 -890 261 599 1422 2027
1881 2027 834 -981 -2087 -1445 -786 801 872 1382 1582 204 -1669 -2177 -1342 -39 444 1257 1864 1485
1899A485k108j058k01J172J118N07N32K63p18j928j026J94J335Q51N40O95J1j580
1917H4j233j005P88J316P41M17L68k35j484j410m6P42J251O96L52j1l80j826j077
1936a952K17J597Q39L33N27n22n54k060m09O88J264J243Q6J17k22j531j675j07
1954b121J388J233N91K82P6p01j585j119N01J149J080L86k1j11n91j720o49R37
1972i95J275O21K94r8k72j314o14l96O86J686K53J39l34l89j356p96J69J083J337
1991I79K61J40m54p78j318p85P71J298J017K2l80j53q96j209j67J144J033O10
2009A135O6l35q66q14j118O82R19J259K15j33n07l21j177n83N98R85R81p1l5l40
2029E40r06q30j31P71J040O43q9l31k86p63r87J22J144J269q8j61n61n47o46q19
$$ plain form
1899 1485 -623 -1681 -1882 -710 408 915 1447 1710 992 -936 -1962 -1768 -433 418 958 1653 1664 84
1917 84 -1149 -2154 -1366 -50 691 1108 1476 1241 -243 -1653 -1699 -957 294 990 1342 1331 951 -875 -1952
1936 -1952 -1735 -138 701 1034 1561 1039 485 -1575 -1984 -1296 -32 1211 1297 1414 1192 -339 -2014 -2121
1954 -2121 -733 500 1091 1373 1449 748 -837 -1956 -1455 -306 774 1160 1139 1028 437 -1283 -1932 -995
1972 -995 280 901 1195 1097 825 -489 -1103 -1499 -813 873 1126 1265 931 542 -814 -1610 -1441 -358 979
1991 979 1240 1380 926 148 -1170 -1955 -1184 114 1131 1153 773 620 -276 -1485 -1652 -508 525 1135
2009 1135 1201 866 0 -814 -1932 -1250 -331 928 1143 1010 503 182 -995 -1578 -980 5 986 915 880 540
2029 540 -366 -1196 -1327 -556 484 1127 1038 707 421 -342 -1329 -1207 -63 1206 1118 957 396 -151 -797 -1616
2049a616M35J352Q89L6p53K88j214q66J1N84J415O12j17o36j5j251o83J66J032
2068c31J303J00k86m87l97o18q68O29J071R29J33o04m79l69m53j001J220J015
2086E07Q46k03m98n76m22j069M28J049R16L80q02l20m22q64j12K53R46R75M23
2105A435j194o9o80l37j69O64J216N01p2p72m88o89k76q7Q24J456k11l81m82k86
2125i7p20m39M75R42J014M4n48o46l30k99q06Q03J072P61l31p08k87n21j78m71
2145a270R45J246N27r69o43J21m72o04J80J344R75m70n80m11l67k95j60K61J136
2164D94Q97n57q42m72R0n94P1O36J128%q1q25j0o35l36L67R04N58J62p24n15r7
2186c81k27k25N08J141O91p84p27k35m31K07j31J55R32O59n29p90o60J71K5j65
$$ plain form
2049 -1616 -1181 171 1060 1096 343 631 -583 -1449 -1438 -854 561 1173 1056 420 405 -846 -1529 -1363 -331
2068 -331 972 1072 786 299 -98 -716 -1584 -955 116 1045 1178 574 95 -274 -727 -1728 -508 507
2086 507 1353 1150 652 76 -346 -1415 -987 62 978 1358 556 236 -186 -1050 -1162 -909 37 1012 1435
2105 1435 241 172 -508 -845 -1014 -350 866 1367 1295 523 35 -654 -930 -1017 -193 1263 1052 671 189 -97
2125 -97 -817 -1256 -781 161 1175 1219 671 25 -305 -604 -1410 -607 465 1226 895 187 -100 -621 -799 -1270
2145 -1270 -325 921 1448 479 -164 -43 -515 -1119 -939 405 1380 910 330 -81 -448 -743 -903 -642 494
2164 494 1391 834 -8 -480 -390 -984 -913 -277 851 851 770 -55 -65 -700 -1036 -669 235 793 955 231 -284 -381
2186 -381 -608 -833 -325 816 1507 723 -4 -239 -670 -463 -594 -439 493 1152 623 -167 -827 -656 -631 -796
2206g96R82Q27p3j021j55m24o2J44N00N04R65k59j138m42k50K62l35O53J326j24
2226A084m05o95m05k35J43q2P49R19Rr01m57k84l21L15J44P29R35j30r13o22j44
2247e67j03J27L96R53K11l22q44l57L07k12J45J61J081K19q97p60Or1r2J93P58
2268C12N67j14n72p22j55J72J00J76P07M56m02p42l56M9L19j43M10O05L64p42
2288B89o53o47M77K12J67K35J153l75r61l73j18K17jK41P46K72k05r81l14q9M54
2309b54k29M64Q91m4l02j109j60K90N80k20K00M19K91q26n61j30L27J92J32M64
2329D15L97o7j193k48Q2K96Q9K73M21M72m45n91o56N34m6L64Q3M38K14p99q55
2350h22j55N42J63R6N54N58k39q13p52K26M07L47J55J29L45k98q68o37M87Q57
$$ plain form
2206 -796 186 1013 940 -81 -236 -660 -722 -578 -78 426 1391 1132 -6 -448 -698 -436 -771 -118 1208 1084
2226 1084 679 -16 -421 -656 -513 -595 154 1073 1082 181 -276 -560 -881 -566 -422 307 1242 1112 199 -423 -567
2247 -567 -670 -543 -147 806 1017 695 -149 -506 -199 -411 -266 -105 976 1195 298 -462 -456 -547 -639 -446 312
2268 312 879 765 193 -529 -684 -512 -412 -236 471 927 525 -217 -573 -524 -205 -348 62 667 1031 289
2288 289 -364 -1011 -534 -322 -155 80 1233 858 -103 -476 -594 -377 -378 -137 609 881 676 -305 -619 -708 -254
2309 -254 -483 -19 872 828 526 -583 -743 -453 127 -93 107 526 817 -9 -570 -700 -373 -181 -49 415
2329 415 812 745 -448 -696 -614 -318 -229 44 465 937 492 -99 -755 -221 -267 97 180 618 832 33 -822
2350 -822 -977 -435 -272 -176 378 936 697 -116 -868 -642 -235 112 267 396 741 443 -425 -1062 -575 282
2370B82l44L49L24j8m48m60l67L52M76Q6L93K8k0n05j097M78M59K24l54N75L04
2391G17n21o47m04m2O62M36j12N05Q7n12p06q5R1P62j7k95N70p6o50m95J29M29
2413a74M56k18K06M21k78o70o25K06N46K83J71J28J50O1j119k97M67K75K93k38
2433D4L54J5n93k62o40N57R62l00J31L55j30o47p16M11N32R5l26K81K64m83n00
2454e96L7j6M33P81n30Q9J40m52o75K38N87M33n6j4j89Mk86p81K79N63L51l43
2476cL14N0n14n20K52J19M89j85M14JR4m31o06pL49P02k1l96L79l58k49o78K19
2499e86R18o2j55Q4J71k16l07o33M54O00p7k39j81L29j37l05l55P12M57k01k13
2520E8K89R3j95j053L19M50L22k4j69J37j67k63m41M92K49K47j02l46L31l81k35
$$ plain form
2370 282 -62 287 611 593 145 -315 -682 -330 146 232 625 653 633 128 -969 -491 -32 192 -162 413 717
2391 717 196 -451 -855 -897 -235 201 89 594 681 169 -537 -622 -531 231 214 -81 489 413 -237 -732 -603 -174
2413 -174 282 64 270 691 413 -257 -882 -676 -130 153 324 452 602 663 -456 -753 -286 -11 282 44
2433 44 398 413 -180 -442 -1082 -525 437 137 268 623 493 -154 -870 -459 73 168 -158 123 387 -96 -596
2454 -596 -559 -575 -142 639 109 198 338 -114 -789 -551 36 469 413 399 210 214 -72 -853 -574 -11 340 -3
2476 -3 311 361 -153 -673 -421 -302 187 2 416 417 511 80 -526 -533 -184 518 497 101 480 122 -127 -805 -586
2499 -586 332 270 115 199 370 154 -153 -786 -332 268 191 -48 -229 100 -37 -342 -697 15 472 271 58
2520 58 347 440 245 -808 -489 -39 283 259 90 227 60 -203 -644 -152 97 344 242 -104 227 -154 -389
2541c89k34K86P59l2m67jJ73j30l87j95O08M48k14J07k00J05l98k77jQ68M5l30
2563A44r4k6Q7o19j80M94L07K46j30k42J32k58J9l44P82L33l84m52K12j54k32
2584c59o2Q7O02J04J54o11N9k9l38l11M41N73L93m19l68L56k22n91k0O51K89k86
2606I3n8N6k27K8m67jO60M74j14n46j24L06m51R8K07K38N37l85l11j48k2q7l74
2629f18N77N81j63k85k04K42k59r0O4J70O97l79m15Q2j29K21l49P8N07k1J78q51
2651c66M11l0q1j20K10N42k05l03j08J64q2P4l10N9N60j08j92l76J20L08m44J
2673b76L37L96J07q04Q7k07K49m11N94K99J34l73l65j9J92k77J94k3N82j86k64
2694c4O0P3J68o66L50L25L29k83k13j99J32j57l54L26N39K9k94m17J72J93k94
$$ plain form
2541 -389 -623 -337 422 390 -77 -78 95 -35 -422 -617 -9 439 225 332 132 237 -161 -438 -439 429 474 144
2563 144 50 24 111 -508 -688 -194 113 359 229 -13 119 -139 -120 -464 318 651 267 -185 27 -127 -359
2584 -359 -421 -334 268 372 526 -85 -26 -55 -393 -704 -263 310 703 284 -84 272 50 -541 -561 90 379 93
2606 93 35 91 -136 -108 -575 -576 84 558 444 -102 -226 80 -371 -273 -66 172 709 324 13 -135 -157 -244 -618
2629 -618 -41 540 377 92 -112 130 -129 -219 -155 15 712 333 -82 0 -129 92 -257 -179 328 307 485 -366
2651 -366 45 15 -66 -186 24 566 361 58 -50 114 32 106 -204 -145 415 307 115 -261 -141 167 -277 -276
2673 -276 61 457 564 -240 -153 -360 -111 -522 72 371 505 132 -233 -252 -60 -337 -143 -166 416 230 -34
2694 -34 26 99 267 -399 -49 276 605 322 109 -90 42 -115 -469 -143 396 425 131 -286 -114 79 -215
2715b15j56P47N9k51l72N2M04m93L28n65O73N50m66m99o4j15P9R9P8K17P3J63
2737C26n67L35l45KJ27J76N99k38n91K09k41L17m83M01J22K28J3o95K6L62o9j27
2759a13j91M51J89j05k52j43J88J58l33P0M41J85m68n72K36L16j67j64O74m72
2779g2J73l22l42K40Q1K46k17M39K23M0o19J11L3j18k57L63J86L6l11j65j37M40
2801E1J55j49M5K04L30p93m16J95M82J18k84J31K56m11k42J53K23J27p2n5J75
2822B23J07m52R3l41L81J87l35J12K01N8k64o14M03K97j31j9n8M92j30m46O1L82
2844B07k80J79l05J47M2K03n40J46K74Q5l8l27J87K16k71Q9l14L99K32k77r4M40
2866D00n7n30L17k39R1J2K4lK14j74l31j60M89K42l55l8K6L57j27o28K73K07J04
$$ plain form
2715 -215 -371 376 435 184 -188 -136 268 -225 103 -462 211 761 295 -204 -268 -383 -304 -205 -127 90 163 326
2737 326 -241 94 -251 -249 -122 54 653 415 -176 33 -208 109 -374 27 149 377 390 -305 -279 83 14 -113
2759 -113 -304 147 336 231 -21 -164 24 182 -151 -81 360 545 77 -495 -259 57 -110 -274 400 -72
2779 -72 101 -221 -563 -323 -242 4 -213 226 449 489 -130 -19 14 -104 -361 2 188 224 -87 -252 -389 51
2801 51 206 57 102 306 636 -157 -573 -378 104 222 -62 69 325 -86 -328 -175 48 175 103 48 223
2822 223 330 -122 -29 -370 11 198 -137 -25 176 234 -30 -644 -241 56 -75 -94 -152 340 210 -236 -175 207
2844 207 -73 106 -199 -52 -10 193 -347 -201 73 158 120 -207 -20 196 -75 14 -300 99 331 54 -40 400
2866 400 343 -187 130 -109 -18 -6 18 15 229 55 -276 -436 53 295 -60 -98 -72 285 158 -470 -197 10 114
2889A14o1O0L28rl21l69L08L09l45Nk00O33k48l69k92L32K18K30m25K98r7L1m06
2912b76o5K99L97n17Q2K28K41l47k49J08J27L71j03j35L5O0n27P0K68j35j01J36
2934c3J97j02R0l52j32K46OK78m26L60J63M0o36O1K64P7o0j62K74j8j26j32l4
2957a57N33J19m24p6J25o8o66N18K52p0l0O7l83K17K06l94j69K98K48k56q3J87
2979fK46k12k97L1L90m6k66K5J68k50K56k12J42O3j4Mm7R2j54l4m6N01j07O9k26
3004G0k42J92o1l32K95LL40j64k64J86q1J64k73J95J91n5j96J43L1M5n92J03L02
3027@L39o0n01L72K8n5k48oJ82l67J30K26L4j0J29p13N26L08j89m58R1J54j17
3050b05J45l32L58j25K30J0l09J02J21k61rK80O3K4m75J66N19l84j08K26P6J2
$$ plain form
2889 114 53 113 441 432 111 -258 50 359 14 19 -181 452 204 -165 -457 -125 93 323 -102 196 99 130 -276
2912 -276 -341 -42 355 -162 -80 148 389 42 -207 -99 28 399 296 161 196 256 -271 -201 67 -68 -169 -33
2934 -33 164 62 152 -200 -332 -86 -80 198 -228 132 295 335 -301 -240 24 101 41 -121 153 135 9 -123 -157
2957 -157 376 495 71 -5 120 52 -614 -96 156 86 56 123 -260 -43 163 -231 -400 -102 146 -110 -193 -6
2979 -6 240 28 -269 -238 152 106 -160 -135 33 -217 39 -173 -31 32 18 22 -25 67 -87 -121 -167 334 227 296 70
3004 70 -172 20 -41 -373 -78 -75 265 101 -163 23 -58 106 -167 28 219 164 -32 111 142 187 -405 -302 0
3027 0 339 279 -222 150 178 123 -125 -131 51 -316 -186 40 74 64 193 -520 6 314 125 -333 -242 -88 -205
3050 -205 -60 -392 -34 -159 71 81 -228 -126 -5 -266 -275 5 68 92 -383 -217 302 -82 -190 36 112 124
3072A24j76m2P3O8J02m00K69K13k18j68k4J89L69m52M5J7K95k39m5m3M1R9k56
3095a59M9J34K26j42L1j80K02l05M7K80N1p1m69K07k4n0pm2L00J0Q0K2n2l29M45
3120B54n16K19L17J32j27o39O00k6m24J07J6O6N7K19l69l1J24j0MK46J83l48Q3
3143A37l60Q4R4j85K39j46K65k86J12j16K16J0j14J49J41o2O6l84Q7J02O2m79
3165c68J64M04p0r0j00K20J40k57k27J80j07pO2J20p2q1K38j31j35P66p44J98
3187A03J99j64l21J64l3L93Om16J44l79K31K05J32l94J66J69k21m9K76l05Q3k84
3209b95K24J39J10l20k35M87j97L5o8L50L2m42K49K08j88q9r5k43N33k93N1l10
3231c57K97J89j53j13K02N9o8m37M27L7q1l55K97P2L89n19L5K95m22J14k23L65
$$ plain form
3072 124 -52 -94 -21 47 149 -251 18 231 13 -155 -179 10 379 -73 -28 -11 284 45 0 -43 -2 97 -159
3095 -159 -110 24 250 108 139 -41 161 -144 -97 183 234 163 -306 -99 -123 -173 -180 -222 78 88 168 190 138 -191 254
3120 254 -262 -43 274 406 279 -360 240 214 -210 -103 -87 -21 36 255 -114 -145 -21 -31 -27 219 402 54 137
3143 137 -223 -139 -45 -230 9 -137 128 -158 -46 -162 54 64 -50 99 240 178 244 -140 -53 49 111 -368
3165 -368 -204 200 130 40 -60 160 300 43 -184 -4 -111 -118 -56 64 -8 -89 149 18 -117 649 -95 103
3187 103 302 138 -183 -19 -52 341 347 -69 75 -304 -73 132 264 -130 36 205 -16 -65 211 -94 -11 -295
3209 -295 -71 68 178 -142 -377 110 -87 -52 -120 230 262 -180 69 277 89 0 -95 -338 195 -98 -47 -357
3231 -357 -60 129 -24 -137 65 124 56 -381 46 83 2 -353 -56 16 405 -114 -79 216 -206 -92 -315 50
3253E0J05J17m44k55L67J73r7L89j49k78O5k73p3N16m8l17m6K76l30N48n16J48
3275g2P9j42o5J42L37j09k16k34M16k2L5k66L09l30p5n1M3J32K64n02k8L66k9
3298a8j10k10L32k02M58o59L44K4J13k16M8j54K28k90K41P0J7M9j40l03M81Q9
3320A92K15n51K10K14j80j6l25R2l9M47j32l9Qj89j06Q2K0K29l35K99J84j80j62
3343f2j74J05J00p5j67L28J08m03j62L37J53j25J80Pj93J64m73M71k78J49K5K22
3365B37k19K09k19J23p8j16P2L56n8j68j61Nn1k72J78J1j82j96L80L05O4o45L08
3388a17Q2O17k68l60J54k98R6j47l5L18P8j26j00N5J32p1k76R7M07J23l78K2L13
3411C18j36j2k82Q4L58m79o9J4M4K9o0J25J37J56j61o2J49k06r7j19K37L46l25
$$ plain form
3253 50 155 272 -172 -427 -60 113 16 405 256 -22 43 -230 -303 213 165 -152 -198 78 -252 296 -220 -72
3275 -72 7 -135 -200 -58 279 170 -46 -280 136 114 149 -117 192 -138 -213 -264 -221 -89 175 -327 -355 11 -18
3298 -18 -128 -338 -6 -208 250 -409 -65 -41 72 -144 -96 -250 -22 -312 -71 -1 16 65 -75 -378 103 192
3320 192 407 -144 66 280 100 84 -241 -149 -188 259 127 88 96 -93 -199 -117 -97 132 -203 96 280 100 -62
3343 -62 -236 -131 -31 -106 -273 55 163 -240 -402 -65 88 -37 143 150 -43 121 -352 119 -159 -10 15 237
3365 237 18 227 8 131 53 -63 9 365 307 139 -22 -17 -68 -340 -162 -151 -333 -529 -149 156 220 -425 -117
3388 -117 -35 582 314 -46 108 -190 -94 -241 -276 42 120 -6 -106 -51 81 10 -266 -169 238 361 -17 5 318
3411 318 182 170 -112 -28 330 -149 -218 -204 -160 -131 -191 -66 71 227 66 4 153 -53 -150 -269 -32 314 -11
3434a1j80J24m2M64k41o1j32K37m11J72J34p4k04O4J61l7J97j52p3p6J81l37L11
3457A4N8L2l12L42l21R8J53o6k46KM42j86k81J97R1j56j59M51j07q0m0K5L00j25
3481A26j52n1j22L05q1n7q4l02N81k13l16M54q4j01j71M30j19J99k87lJ6L71k
3504C37n88J99K78l81K48k83L60j22j24j52P0O2J41J04J18k37k21J83k86L4J47
3525a13J25m7l0M22n2m11J51PJ70j90M9K1k78K69j41j43J79QJ10j80K66n79N84
3548A97l10P3R6M66o57J94M3m5j70Q5j4M2K12m16J36J14k07n0n8P3L69l76j18
3571c21K94P3K4l26L14K14J6m41L53k94K51l09o7j43M34l8l98K04l1K66M7k73
3593a51J52K16l67M16J90l8r09O23k81J02J52k55J41k59O58m55J50j54K86l80
$$ plain form
3434 -11 -191 -67 -109 355 114 53 -79 158 -253 -81 53 -21 -225 -161 0 -37 160 8 -65 -141 40 -297 14
3457 14 72 104 -208 134 -187 -89 64 -2 -248 -246 196 10 -271 -74 17 -139 -298 153 46 -34 -74 -49 251 126
3481 126 -26 -77 -199 106 25 -32 -116 -418 163 -50 -366 88 4 -97 -268 162 43 242 -45 -48 -32 339 337
3504 337 -251 -52 226 -155 93 -190 170 48 -76 -228 -158 -96 45 149 267 30 -191 -8 -294 -260 -113
3525 -113 12 -35 -65 357 305 -106 45 52 222 32 81 102 -176 93 -48 -191 -12 -4 106 -74 192 -387 197
3548 197 -113 -40 56 522 -135 59 102 57 -113 -28 -42 0 212 -204 -68 46 -161 -211 -269 -196 173 -203 -321
3571 -321 -27 46 70 -256 58 272 288 -153 200 -94 157 -152 -219 -362 72 34 -364 -160 -191 75 122 -151
3593 -151 1 217 -150 266 456 418 -491 132 -149 -47 105 -150 -9 -268 390 -65 85 -69 217 -163
3613a63J01J90J01Jm79J81K06K08j13j11L6j41j99K5R5J95k28J75R2j29n8l63
3635c78J32L55K9j85K08Q8j46L8l26J24K66k68j26L34r9j18j03j13j62K83K88
3656A21k01K07J6p9j91J63J90l46J94k41J61o1L72k83j3J65P5m04O3j1R8L8k88
3679b55L51Q7k12krJ66k98K73p0Q1k23N98o98nM54l31L25l79o2K67J91j14k73
3702a38K91j62K14j08j68K65p7j5N2r0Q6n06q6M32k89L45L1l27N29J31l04k62
3724a56L74k25N7J46K0j58j83J69p1m9J77k83j57J14M98l06j1M8J84J00j76J51
3746B63l52l8J44j20Q0L38m14R4m9N4m2k90K83K6j69L15r3J02k90N16p42M62M02
3769D80l30k52J29j1J1q7j16K60K32m80K28n1k31O2J25j33L37j14qq4k7Q9K42
$$ plain form
3613 -163 -62 128 229 230 -249 -68 138 346 233 122 158 17 -182 -157 -62 133 -95 80 172 43 -15 -378
3635 -378 -246 109 138 -47 161 249 103 141 -185 -61 205 -63 -189 145 46 -72 -175 -288 -450 -167 121
3656 121 -80 127 143 64 -127 36 226 -120 74 -167 -6 -67 305 22 9 174 249 -155 -92 -103 -5 33 -255
3679 -255 96 183 -29 -31 -40 126 -172 101 31 112 -111 487 -211 -216 238 -93 232 -147 -209 58 249 135 -138
3702 -138 153 -9 205 97 -71 194 117 102 154 64 150 -356 -442 -10 -299 46 77 -250 279 410 106 -156
3724 -156 218 -7 50 196 216 58 -125 44 -27 -76 101 -182 -339 -225 273 -33 -44 4 188 288 112 263
3746 263 -89 -127 17 -103 -23 315 -99 -5 -54 0 -42 -332 -49 -23 -192 123 30 132 -158 358 -384 78 480
3769 480 150 -102 27 16 27 -60 -176 84 316 -164 64 13 -218 -156 -31 -164 173 59 51 -33 -60 29 271
3792B71k66j40J09M28j91q1j42J17k32J53o7K1K67k51l4N0N6J39r7J56k43J27
3814A50Qj74l9o9K19q0p7K63m60L15k62P4L34k38j47K60j33L15j70l9Lk21J93
3837B5M14o54J66J94r9Mj99O3J53L23l77r6j29P2K77l17r0J18L81r5n0l06N76
3860C54n07K16mo5j8M28n75J17R8j29n5K51R4L2m09K25j49M8P3k55K45j11L31
3883B35j47k01R8p9j93K78L3k6J14J77l12L02k66J19k45L02l25M66n11p4N24m04
3905a35J75k58L54m8j01k40K12j98J24O5j32M20o8l56j1K22j34K0J27J94k01q6
3927e5r5K3K59j16q3P9J93k00r5J34l63M28M1p7o2k4Jj2m03M36J10j23l08O06
3951B94k29n4J4j11K21k7l27K87M70r5n14k8J25o9K8J17L07k38k6J65l00m8J10
$$ plain form
3792 271 5 -135 -26 402 211 130 -12 105 -127 26 -41 -20 247 -4 -38 12 68 207 110 266 23 150
3814 150 158 -16 -55 -124 95 15 -62 201 -259 56 -206 -132 202 -36 -183 77 -56 259 89 50 53 -168 25
3837 25 439 -215 -49 145 46 50 -149 -86 67 390 13 -83 -212 -140 137 -180 -270 -152 229 134 84 -222 354
3860 354 -153 63 59 -6 -24 404 -171 -54 44 -85 -140 111 205 237 -172 53 -96 -48 25 -230 15 -96 235
3883 235 88 -113 -15 -94 -287 -9 24 -2 112 289 -23 279 13 132 -113 189 -136 330 -181 -255 269 -135
3905 -135 40 -218 136 88 -13 -253 -41 -239 -115 -50 -182 238 170 -186 -197 25 -109 -89 38 232 31 -55
3927 -55 -150 -127 132 16 -67 12 205 5 -90 44 -319 109 150 73 11 -13 -12 -24 -427 9 119 -4 -312 294
3951 294 65 11 25 -86 135 108 -219 68 538 443 -71 -99 26 -43 -15 102 409 171 145 310 10 -38 72
3974G2o7K28k7n3l5p8j7j1RJ0L4J45j45L4p0k07O5J37k4j31M84n99J06K76k6k04
4000i4L85k40k0J1j05L21Jk75M4K6J98m50L22j87Q6j44Q0J4J85N3N7l67j30J91
4024c8j06J75j2J02k06K93j14j39r0L04k0KLp0J45j65Q2m34M2K32q7J09Nl8J12
4049H7Jl6j99N42l99J61J5k22J34J3m2N8J85j89J03r1K52m22l3k06K01L42Km78
4073b21K64M8J7Pj56j76L45k89J71l11L95m1l70K97R3q6J75j78k74K77N6j39j51
4096b47J56R2J90P9l35O4K05m24Q1R7qJ37K57k04j89k0L14j60J92m33N38J27m04
4119A05k88L1J82k28L67k88J45P6O0Nl70M36k24K19k68J29k40M1k54L34Q0j2L9
4142G7j05M37m80k39L95l46K49J89j57L4l4r5k2J47p5J78q8r9J23o8n2L4J4J45
$$ plain form
3974 72 5 233 206 153 118 40 23 12 21 31 65 210 65 99 29 -178 -113 24 0 -131 353 -246 -140 136 110 -94
4000 -94 291 51 31 42 -63 258 259 -16 28 54 252 -198 124 -63 23 -121 -41 -27 158 211 268 -99 -229 -38
4024 -38 -144 31 19 121 -85 208 94 -45 -135 169 149 151 154 84 229 64 146 -288 -246 -14 -101 8 13 -25 87
4049 87 88 52 -147 395 -4 157 172 -50 84 97 55 113 298 109 212 121 373 -49 -82 -288 -87 255 257 -221
4073 -221 43 91 108 115 -41 -217 128 -161 10 -301 94 53 -317 -20 73 -13 162 -16 -290 -13 43 -96 -247
4096 -247 -91 1 191 270 -65 -1 204 -220 -139 -42 -50 87 344 140 -49 -69 245 85 277 -156 382 509 105
4119 105 -183 -152 30 -198 169 -119 26 102 162 167 -203 233 9 228 -40 89 -151 -110 -364 -30 50 38 77
4142 77 -28 409 -71 -310 85 -261 -12 177 20 54 20 -75 -97 50 -25 153 65 -34 89 21 -31 3 17 162
4166A62j53K3N3l9p0j2J6P7l1lk36J40O95o56n9J95j28J96j17k13J49j96K63l50
4190b94J05LJ19K14l3m60M28l77R5K62j1j02J41l43M3L06k74j04L65K30k52N6
4212A17j64j4pq9J5L91J0o9j26mj1l32K89P9m1K7kj7K5k50J04j0L59k02j81K85
4238A82j47J6J9k24q3M69r6k6j88O3O2k21P6K22J4N6n3Q2l83M5P6r9k02K17N59
4263D36k80k82M63o37K17J4K55k85L42m28K4m6O6p6J39K85j5J36q4r6j53k30p7
4286c12J42J44r8j25l4K38J07k34J96k64j24M95l35M11J5k42n64M90O7K55k3l36
4308a31J78r4J20k26J93o4N06m07K4k96K37J37k44r3K22j29P9N1L2j39j63L7L04
4331A34j02j56M53k92k30J8KJ21k7L01k09J82j01l16J23M58m37K17J36l45p9j90
$$ plain form
4166 162 9 32 85 46 -24 -36 -20 57 26 23 -213 -73 622 -34 -93 102 -26 170 53 -160 -11 -207 56 -294
4190 -294 -189 -186 -67 147 114 -346 82 -295 -200 62 51 -51 90 -253 -210 96 -178 -282 83 313 61 117
4212 117 -47 -61 -68 -157 -142 249 259 190 64 60 49 -283 6 85 44 71 69 52 77 -173 -69 -79 280 78 -103 182
4238 182 35 51 70 -154 -237 232 136 110 -78 -15 47 -174 -98 124 138 194 141 223 -160 -115 -39 -138 -340 -123 436
4263 436 156 -126 337 -300 -83 -69 186 -99 243 -185 -161 -207 -141 -217 -78 207 192 328 244 148 -5 -235 -312
4286 -312 -170 -26 -124 -249 -283 -45 62 -172 24 -240 -364 131 -204 207 222 -20 -584 -94 -27 228 205 -131
4308 -131 47 -47 73 -153 40 -24 482 75 99 -197 40 177 -67 -160 62 -67 12 63 95 -44 -207 -170 134
4331 134 32 -124 329 37 -193 -175 -173 -52 -79 222 13 195 94 -222 -99 359 -78 139 275 -70 -149 -339
4353c39J00M08k46K72L1K54m18j18l1L2L5n9K47k66M45m10Q8j4j29Q4l08K53o0
4376a49L10p4p5O4l17K58j03K52J9k38K15j64Rm19J92J90p8K03n5r2O5J4J5O4
4400A06K9j0J48m30J12J67j66m3K42k01M6R9K13m56k79N19m1j06K62k37K3Q8J08
4423A93k25K45l48LQ8p6K00l37j06M03k64R1nJ05p2O4k16oL81l7K39Q4m37K30
4447A97o8n78K92J52p3L25l72L02k54o6o3k13N81k93m0J97r8J44j91L40k52P2
4469D1m2o9K13k97L39l37J3K16P3P3J51k06k25k78J79K24p1O6M3J65l39k03L59
4492H8m38M49k06q2M73l95m6K61k39Oj78M15m52K66J97o8j07J1j27L43l63K76
4514H4j62k67N28l61O3L29R8j51k26K61l2l49L19k58R1O3J1J3o2j44N2L51l39
$$ plain form
4353 -339 -239 169 -77 195 226 480 62 -56 -87 -55 -20 -79 168 -98 347 -63 25 11 -118 -34 -342 -89 -149
4376 -149 161 87 12 76 -241 17 -86 166 185 -53 162 -2 7 -412 -220 -30 -108 95 40 -52 13 27 42 106
4400 106 135 125 273 -157 -45 122 -44 -87 155 -46 0 99 312 -144 -423 96 55 -51 211 -26 -3 85 193
4423 193 -32 213 -135 -132 -44 -120 80 -257 -363 40 -224 -133 -138 -33 -105 -41 -257 -263 118 81 320 404 -33 197
4447 197 129 -449 -157 -5 -78 247 -125 177 -77 -143 -206 -419 162 -131 -171 26 -72 72 -119 221 -31 41
4469 41 -1 -70 143 -154 185 -152 -139 77 150 223 374 168 -57 -335 -156 68 -3 63 106 271 -68 -271 88
4492 88 -350 99 -107 -189 284 -111 -157 104 -135 -129 -307 108 -344 -78 119 51 -56 -45 -172 171 -192 84
4514 84 -78 -345 183 -178 -115 214 312 161 -65 196 164 -185 134 -124 -33 30 41 54 -8 -152 -100 251 -88
4537h8J70j53M06j70k53k56M67q2K03l33J7P9k5J8j41N2K12J46p0o5K97o72%n8
4561b99k02M43K35k04o2J76j22l36L66j21R9K73k33J56j55j88j19k1L34k54J36
4582i8k45M72k56L93m46n8N63m33jJ69K05l05k52R9K05j06K40j26J18P0l41l48
4604d81M69p8k2J38JK4j8k42K2j00K24r8K97j58J63l74o6K25l2q6j10Q0J94J70
4628A42l40j7L46k65L74j24n6J29j42r4M9R9k01J80J4J12k22l5J06m03L79L8n3
4651A6J71O0j03q5mk34M05j19j48R9L43k22k77o0L69k83j29pN69j00m58P2N8r4
4675a61J88K33l64J51n8J59k15l83L91M1J34k62J91R1M4m36j69M13L3k6K75j48
4697A22j82m8J0o9K08N2j87J94O2j11l77KL41J13j20M5l7j09j76J39j14K37K1
$$ plain form
4537 -88 82 -71 335 165 -88 -344 123 41 244 -89 -72 7 -18 0 -141 -89 123 269 199 134 431 -241 -241 -299
4561 -299 -501 -58 177 -27 -89 87 -35 -371 -5 -126 -27 246 13 169 14 -174 -293 -314 20 -234 -98
4582 -98 -343 129 -127 266 -180 -238 325 -108 -109 60 265 -40 -292 -193 12 -94 146 20 138 208 -133 -481
4604 -481 -12 -90 -112 26 27 51 33 -209 -187 -287 -63 -161 136 -22 141 -233 -299 -74 -106 -192 -302 -222 -28 142
4628 142 -198 -215 131 -134 240 116 60 189 47 -47 2 101 -100 80 94 206 -16 -51 55 -348 31 69 16
4651 16 187 247 144 59 55 -179 226 107 -41 58 401 179 -98 -158 211 -72 -201 -208 361 261 -197 -125 -67 -161
4675 -161 27 260 -104 47 -11 148 -67 -450 -59 -18 116 -146 45 136 180 -256 -425 -12 21 -5 270 122
4697 122 -60 -108 -98 -167 41 93 -94 100 162 51 -326 -324 17 130 10 55 18 -91 -267 -128 -242 -5 16
4720A6J08K83l05J16k96K1L30k9l86J94K23m31j27L94j33k31K28M31l02k76K54
4741H2k31J75j40K16l23K43j86J68N31o50k2jL19j78R1M3J63k56k1q8qJ61J12
4764B00Q3n38L9K14k37J26J76j1k45J82k2p4q4J44l0J25O6N1k25J18J42j7o73
4787d90N76p3j66M4m6K21k52n6J78J06L04m21J90M3m6j47q7L7l15O26j23j05K47
4810B45l39J14N6k43O05j93k07p3j60NR9J15J25j40J47p1Kk38o3L44j72k91N89
4833B56M0m68L62k04K50k29k73K57L41j19l41L11k26J15k52j0M05k10k61J59q9
4854a86RJ77j32K26k72K24o0k67O47k24l38k3J91p9Q3k21O3L8L54k67R8rl1Q1
4878H2L17o04L85p8k38j0J43j31M57k49k79N41l88JM1k3K56k07lr9J71n1j69K16
$$ plain form
4720 16 124 407 102 218 -78 -57 273 244 -142 52 275 -156 -283 111 -22 -253 -25 406 104 -172 82
4741 82 -149 26 -114 102 -221 22 -164 4 535 -115 -137 -138 181 3 94 137 300 44 23 -65 -73 88 200
4764 200 283 -255 -216 -2 -239 -113 63 52 -193 -11 -33 -107 -191 -47 -77 48 114 165 -60 58 200 183 -490
4787 -490 86 13 -153 -109 -155 66 -186 -242 -64 42 346 -75 115 158 112 -35 -122 -85 -400 226 103 -2 245
4810 245 -94 20 76 -167 438 245 38 -35 -195 -190 -91 24 149 9 156 85 87 -151 -214 130 -42 -333 256
4833 256 296 -172 190 -14 236 7 -266 -9 332 213 -128 183 -43 72 -180 -190 215 5 -256 -97 -186
4854 -186 -177 0 -132 94 -178 46 -14 -281 366 142 -196 -219 -28 -107 -24 -245 -182 -144 210 -57 41 32 1 82
4878 82 399 -205 180 102 -136 -146 -3 -134 323 74 -205 336 -52 -51 -10 -33 223 16 13 -86 85 34 -135 81
4902H1j47J74n5k01K54J3J05k97q2N47j88m94J81n8R6R8J25j88Q9k47m9K16L18
4925B91k56k95N95l50j7jJ01k7j28J29O3l32L17j92M91l6p79L72K68l83J51P8
4947F0l5J24l72K43j88M39l72M54m35L18m02k83L58J61P1k76K64j25J58q39O50
4968b7j99k8L72n8o8p1J54J99k33J86l93M2M83m42L02j27j78n1L26l84M66j0k40
4991B1R1k60J80N6j44P8R6J24l27k73K15l9JpM08j48m4l17L12n7K74l47N3M33
5015C79m41o2K10m73K5M03j37R8j64rp4N05l84K47k40l4K31m2p9K8L1j06k23K35
5039g6K45l41Q7J87M7l56M2K66m5l61L32J74p9j53k02J70K88l03j01N17j38q3
5061A17l32K95l2o1j32N10k24K46k59l94J32m3K60J18l50k66L83j81J30K71l97
$$ plain form
4902 81 -66 108 53 -148 106 119 224 -73 -155 392 204 -290 -109 -167 -71 27 152 -36 53 -194 -243 -27 291
4925 291 35 -260 335 -15 -32 -33 68 41 -87 42 105 -227 90 -102 389 353 -426 -54 214 -169 -18 60
4947 60 25 149 -223 20 -168 271 -101 353 -82 236 -166 -449 -91 70 141 -135 129 4 162 -677 -27
4968 -27 -226 -254 118 60 -8 -79 75 274 41 227 -166 -124 359 -83 219 92 -86 -137 189 -195 271 261 21
4991 21 112 -148 32 88 -56 22 118 242 -85 -358 -143 -182 -181 -188 220 72 28 -289 23 -34 240 -107 -54 379
5015 379 -62 -124 86 -387 -362 41 -96 2 -162 -171 -245 260 -124 123 -117 -151 80 38 -41 -13 18 -88 -311 -76
5039 -76 169 -172 -85 102 149 -207 -165 101 56 -305 27 201 122 -31 -233 -63 225 -78 -179 338 200 117
5061 117 -215 80 48 -13 -145 365 141 387 128 -266 -134 -177 83 201 -149 -415 -32 -213 -83 188 -209
5082b09O0L02r0K0m0k3N3l5q0J28k2j21K98k14J37k63J55k35L02j73K65l11J87
5105I1O0m18M28m32O7K29N8m57M49l03J92l5J72m8J69J5J2k76k8K45Lj05Q1J85
5129C54l51M2r8n0N7Lk2J36j13J68l64J4o6J93J90j92K15j64j25J30k56M09j7
5152I3J33j67j74N13n04p0O7K54k56M4K53m3m25M14q6o8N18l25o3o2K24k21j14
5175f5O2k1j5N5J54l04j43K44r3k9p0L93p8J56k36K25j36n28N49m6L72n88q0O2
5199a60M58l98L30m26Q0J03L23j00l02p4l7J57J95k94l1r1N65j25k13k24J59m0
5221a45J82K03k29N1k91j43K46K78m29N32j79J46m11nK05Q4nj05J21j81J22m25
5243c78K47j64J92k19M19J20k67j95K48j79M7K3J76l11M05j44j35o3K55l06N23
$$ plain form
5082 -209 -149 153 63 83 43 20 73 38 -42 86 64 -57 241 27 164 -99 56 -179 123 -50 215 -96 91
5105 91 151 -267 161 -271 -204 25 83 -374 75 -228 -36 -71 101 53 222 237 249 -27 -55 190 193 88 169 354
5129 354 3 45 -53 -103 -46 -43 -65 71 -42 126 -238 -224 -290 -97 93 -99 116 -48 -173 -43 -299 110 93
5152 93 226 59 -115 398 -106 -176 -109 145 -111 -67 186 143 -282 132 46 -22 496 171 108 46 270 49 -65
5175 -65 -3 -24 -39 16 170 -134 -277 -33 -126 -155 -225 168 90 246 10 235 99 -429 120 74 446 -142 -222 -160
5199 -160 298 -100 230 -196 -116 -13 310 210 -92 -166 -203 -46 149 -145 -176 -267 298 173 -40 -264 -105 -145
5221 -145 37 240 11 62 -229 -372 -126 152 -277 255 76 222 -189 -194 11 95 90 -15 106 -75 47 -378
5243 -378 -131 -295 -103 -322 97 217 -50 -245 3 -176 -129 -106 70 -241 164 20 -115 -178 77 -229 294
5264B94l82M91r8l85L83l44j85o4M08M3j8N5j74j32J65j09K8J1P5k29J10k35J3
5287b79o1L02q7K87M8k31N9j66L9J90j37l03L44q2K25k64j50N5p2L50j29L20l35
5310g7j97K15R1j35K41l5j53J87K37k83p3m9j32K70%k13R3j12P4j2N0J64j35J28
5334A44k10P9p1K58j56k60j8K81q9L31l49L6J15j12K89l06K9l17M98P9k65L05
5356B91k15Oj20J55k00J87j67q1M64l20l07J36Q2L9P8K13l17n7J17R6k0J9j83
5379a04N18m20Q7j32J66k08J44o7J97l17M10k33j7J41j04J36k20K58k52o5Q6l15
5401c11K86l0L83m59l3K09o3o0J42l66J50J73k57L65J90m17k12K36L2j86L85j97
5423d0N6k7K1j57J09K45j22p4J25k91L96k38l2N3j75R8j82K64k3r9%L08m2j6j0
$$ plain form
5264 294 -88 403 305 -80 303 -41 -226 -290 118 161 143 198 24 -108 57 -52 -24 -13 62 -167 -57 -292 -279
5287 -279 -340 -38 -125 162 210 -21 38 -128 -89 101 -36 -339 5 -77 148 -116 -266 -211 -283 67 -62 258 -77
5310 -77 -274 -59 32 -103 138 103 -50 137 374 91 18 -31 -163 107 107 -106 -13 -125 -51 -63 -13 151 16 144
5334 144 -66 13 -58 200 44 -216 -234 47 -42 289 -60 -24 91 -21 268 -38 -9 -326 172 251 -14 291
5356 291 76 82 -38 117 -83 104 -63 -144 320 0 -307 -171 -89 -50 28 241 -76 -133 -16 80 60 79 -104
5379 -104 414 -6 81 -51 115 -93 51 -16 181 -136 274 41 24 165 61 197 -23 235 -17 -82 4 -311
5401 -311 -25 -55 328 -131 -164 45 -18 -78 64 -302 -152 21 -236 129 319 -98 -310 -74 -42 -228 157 -40
5423 -40 16 -11 10 -147 -38 207 85 11 136 -155 241 3 -29 24 -151 -53 -235 29 6 -93 -93 215 173 157 147
5448A47k56L88m8l38N6j27M58l34J57k66l0J71k69L08m4o8l5N17l97J57M8j77
5470A8k1J26P2o9J15k06J36j56l71K22K56J44k21j39J65l18R5J34L3j62Q3O6j43
$$ plain form
5448 147 -109 279 231 -107 -51 -178 280 -54 103 -163 -193 -22 -291 17 -27 -95 -130 387 -10 147 195 18
5470 18 -3 123 195 126 241 35 171 15 -356 -134 122 266 45 -94 71 -247 -152 -18 15 -147 -64 2 -141
$$ [...]
8191d59
##END NTUPLES=NMR FID
##END=
