##TITLE=1H_DE-63_P4
 D2O
 8 sc, 
 23.12.2024
##JCAMPDX= 6.0         $$ Bruker NMR JCAMP-DX V2.0
##DATA TYPE= NMR FID
##DATA CLASS= NTUPLES
##ORIGIN= UXNMR, Bruker Analytische Messtechnik GmbH
##OWNER= root
$$ XWIN-NMR		Version 3.5
$$ Mon Dec 23 16:22:57 2024 Russian Standard Time (UT+4h)  she@DPX200
##.OBSERVE FREQUENCY= 200.1315
##.OBSERVE NUCLEUS= ^1H
##.DELAY= (6, 6)
##.ACQUISITION MODE= SIMULTANEOUS
##.ACQUISITION SCHEME= undefined
##.AVERAGES= 8
##.DIGITISER RES= 18
##SPECTROMETER/DATA SYSTEM= spect
##.PULSE SEQUENCE= zg30
##.SOLVENT NAME= D2O
##.SHIFT REFERENCE= (INTERNAL, D2O, 0, 15.7039)
##AUDIT TRAIL= $$ (NUMBER, WHEN, WHO, WHERE, WHAT)
$$ ##TITLE= Audit trail, XWIN-NMR		Version 3.5
$$ ##JCAMPDX= 5.01
$$ ##ORIGIN= Bruker BioSpin GmbH
$$ ##OWNER= she
$$ F:/spectra/data/she/nmr/H-F/1/audita.txt
$$ ##AUDIT TRAIL=  $$ (NUMBER, WHEN, WHO, WHERE, WHAT)
(   1,<2024-12-23 16:21:41.04 +0400>,<she>,<DPX200>,
      <created by zg, POWCHK disabled, PULCHK disabled
       configuration hash MD5:
       00 E9 B6 7A A2 85 ED C7 34 08 36 98 17 FE 4E 26
       data hash MD5: 16K
       A6 5F 0F F4 83 F9 97 3B CE 5D FC 9E A7 89 C1 42>)
$$ ##END=
$$ 
$$ hash MD5
$$ 4C 83 AE 6D AC 90 FE B6 C7 9F E9 7E EB A8 70 C9
##$RELAX= 
##$RELAX= 
##$RELAX= 
##$RELAX= 
##$RELAX= 
##$RELAX= 
$$ Bruker specific parameters
$$ --------------------------
##$DU= <F:/spectra>
##$EXPNO= 1
##$NAME= <H-F>
##$PROCNO= 1
##$TYPE= <nmr>
##$USER= <she>
##$AMP= (0..31)
100 100 100 100 100 100 100 100 100 100 100 100 100 100 100 100 100 100 
100 100 100 100 100 100 100 100 100 100 100 100 100 100 
##$AQSEQ= 0
##$AQ_mod= 1
##$AUNM= <au_zg>
##$AUTOPOS= <>
##$BF1= 200.13
##$BF2= 200.13
##$BF3= 200.13
##$BF4= 200.13
##$BF5= 200.13
##$BF6= 200.13
##$BF7= 200.13
##$BF8= 200.13
##$BYTORDA= 1
##$CFDGTYP= 0
##$CFRGTYP= 5
##$CHEMSTR= <none>
##$CNST= (0..31)
1 1 145 1 1 1 1 1 1 1 1 1 1 1 1 1 1 1 1 1 1 1 1 1 1 1 1 1 1 1 1 1 
##$CPDPRG= <>
##$CPDPRG1= <>
##$CPDPRG2= <>
##$CPDPRG3= <>
##$CPDPRG4= <mlev>
##$CPDPRG5= <mlev>
##$CPDPRG6= <mlev>
##$CPDPRG7= <mlev>
##$CPDPRG8= <mlev>
##$CPDPRGB= <>
##$CPDPRGT= <>
##$D= (0..31)
0 1.2 0 0 0 0 0 0 0 0.06 0 0.03 0 0 0 0 0.0002 0 0 0 0 0 0 0 0 0 0 0 0 
0 0 0 
##$DATE= 1734956500
##$DBL= (0..7)
120 120 120 120 120 120 120 120 
##$DBP= (0..7)
150 150 150 150 150 150 150 150 
##$DBP07= 0
##$DBPNAM0= <>
##$DBPNAM1= <>
##$DBPNAM2= <>
##$DBPNAM3= <>
##$DBPNAM4= <>
##$DBPNAM5= <>
##$DBPNAM6= <>
##$DBPNAM7= <>
##$DBPOAL= (0..7)
0.5 0.5 0.5 0.5 0.5 0.5 0.5 0.5 
##$DBPOFFS= (0..7)
0 0 0 0 0 0 0 0 
##$DE= 6
##$DECBNUC= <off>
##$DECIM= 24
##$DECNUC= <off>
##$DECSTAT= 4
##$DIGMOD= 1
##$DIGTYP= 9
##$DL= (0..7)
0 120 120 120 120 120 120 120 
##$DP= (0..7)
150 150 150 150 150 150 150 150 
##$DP07= 0
##$DPNAME0= <>
##$DPNAME1= <>
##$DPNAME2= <>
##$DPNAME3= <>
##$DPNAME4= <>
##$DPNAME5= <>
##$DPNAME6= <>
##$DPNAME7= <>
##$DPOAL= (0..7)
0.5 0.5 0.5 0.5 0.5 0.5 0.5 0.5 
##$DPOFFS= (0..7)
0 0 0 0 0 0 0 0 
##$DQDMODE= 0
##$DR= 18
##$DS= 0
##$DSLIST= <SSSSSSSSSSSSSSS>
##$DSPFIRM= 0
$$ [...]
##$SUBNAM2= <"">
##$SUBNAM3= <"">
##$SUBNAM4= <"">
##$SUBNAM5= <"">
##$SUBNAM6= <"">
##$SUBNAM7= <"">
##$SUBNAM8= <"">
##$SUBNAM9= <"">
##$SW= 24.0689530833862
##$SWIBOX= (0..15)
0 0 2 0 0 0 0 0 0 0 0 0 0 0 0 0 
##$SW_h= 4816.95568400771
##$TD= 16384
##$TD0= 1
##$TE= 0
##$TE2= 300
##$TE3= 300
##$TEG= 300
##$TL= (0..7)
0 120 120 120 120 120 120 120 
##$TP= (0..7)
150 150 150 150 150 150 150 150 
##$TP07= 0
##$TPNAME0= <>
##$TPNAME1= <>
##$TPNAME2= <>
##$TPNAME3= <>
##$TPNAME4= <>
##$TPNAME5= <>
##$TPNAME6= <>
##$TPNAME7= <>
##$TPOAL= (0..7)
0.5 0.5 0.5 0.5 0.5 0.5 0.5 0.5 
##$TPOFFS= (0..7)
0 0 0 0 0 0 0 0 
##$TUNHIN= 0
##$TUNHOUT= 0
##$TUNXOUT= 0
##$USERA1= <user>
##$USERA2= <user>
##$USERA3= <user>
##$USERA4= <user>
##$USERA5= <user>
##$V9= 5
##$VALIST= <valist>
##$VCLIST= <CCCCCCCCCCCCCCC>
##$VD= 0
##$VDLIST= <DDDDDDDDDDDDDDD>
##$VPLIST= <PPPPPPPPPPPPPPP>
##$VTLIST= <TTTTTTTTTTTTTTT>
##$WBST= 1024
##$WBSW= 4
##$XGAIN= (0..3)
0 0 0 0 
##$XL= 0
##$YL= 0
##$YMAX_a= 143871
##$YMIN_a= -195531
##$ZGOPTNS= <>
##$ZL1= 120
##$ZL2= 120
##$ZL3= 120
##$ZL4= 120
##$ABSF1= 10
##$ABSF2= 0
##$ABSG= 5
##$ABSL= 3
##$ALPHA= 0
##$AQORDER= 0
##$ASSFAC= 0
##$ASSFACI= 0
##$ASSFACX= 0
##$ASSWID= 0
##$AUNMP= <proc_1d>
##$AZFE= 0.1
##$AZFW= 0.1
##$BCFW= 1
##$BC_mod= 2
##$BYTORDP= 1
##$COROFFS= 0
##$CY= 11.3945322036743
##$DATMOD= 1
##$DC= 2
##$DFILT= <>
##$DTYPP= 0
##$F1P= 15.6554695791079
##$F2P= 12.8336369535428
##$FCOR= 0.5
##$FTSIZE= 0
##$FT_mod= 4
##$GAMMA= 1
##$GB= 0.15
##$INTBC= 1
##$INTSCL= 1
##$ISEN= 128
##$LB= 0.24
##$LEV0= 0
##$LPBIN= 0
##$MAXI= 10000
##$MC2= 0
##$MEAN= 0
##$ME_mod= 0
##$MI= 1.114404
##$NCOEF= 0
##$NC_proc= 0
##$NLEV= 6
##$NOISF1= 3.799351
##$NOISF2= 2.8
##$NSP= 1
##$NTH_PI= 0
##$NZP= 0
##$OFFSET= 15.70392
##$PC= 1
##$PHC0= -26577.64
##$PHC1= 15.38744
##$PH_mod= 1
##$PKNL= yes
##$PPARMOD= 0
##$PSCAL= 0
##$PSIGN= 0
##$REVERSE= no
##$SF= 200.130013532006
##$SI= 16384
##$SIGF1= 3
##$SIGF2= 2
##$SINO= 400
##$SIOLD= 16384
##$SREGLST= <1H.CDCl3>
##$SSB= 0
##$STSI= 0
##$STSR= 0
##$SW_p= 3612.71676300578
##$SYMM= 0
##$S_DEV= 0
##$TDeff= 0
##$TDoff= 0
##$TI= <>
##$TILT= no
##$TM1= 0
##$TM2= 0
##$TOPLEV= 0
##$USERP1= <user>
##$USERP2= <user>
##$USERP3= <user>
##$USERP4= <user>
##$USERP5= <user>
##$WDW= 1
##$XDIM= 8192
##$YMAX_p= 0
##$YMIN_p= 0
$$ End of Bruker specific parameters
$$ ---------------------------------
##NTUPLES= NMR FID
##VAR_NAME=  TIME,          FID/REAL,        FID/IMAG
##SYMBOL=    X,             R,               I
##VAR_TYPE=  INDEPENDENT,   DEPENDENT,       DEPENDENT
##VAR_FORM=  AFFN,          ASDF,            ASDF
##VAR_DIM=   8192,          8192,            8192
##UNITS=     SECONDS,       ARBITRARY UNITS, ARBITRARY UNITS
##FACTOR=    0.0002076,     1,               1
##FIRST=     0,             0,               0
##LAST=      1.7004516,     0,               0
##MIN=       0,             -195531,         0
##MAX=       1.7004516,     143871,          0
$$ Real data points
##PAGE= N=1
##DATA TABLE= (X++(R..R)), XYDATA
$$ plain form
0 0 0 0 0 0 0 0 0 0 0 0 0 8 -8 8 -8 8 -8 16 -16 16 -20 24 -28 32 -36 41 -48 52 -60 68 -76 84 -96 107 -119
35 -119 133 -149 165 -181 199 -223 246 -271 301 -333 371 -412 459 -516 582 -659 754 -875 1029
54 1029 -1235 1528 -1978 2746 -4314 8797 -50007 -195531 -112558 12444 22047 7249 91421
67 91421 143871 46103 -97535 -117687 -40752 19906 28193 35544 61676 70306 9015 -89385 -115624
80 -115624 -35499 35641 21202 10055 71642 88816 -21495 -124818 -88194 -5794 929 561
92 561 73557 119862 42296 -64427 -80188 -41414 -21124 5066 60581 87954 48303 -17440
104 -17440 -59370 -66387 -40956 363 29642 44824 54350 33091 -30189 -74485 -53396 -19680
116 -19680 -19918 205 68216 92674 22216 -45232 -37017 -23312 -51318 -39122 50174 106661 58682
$$ packed form
0@%%%%%%%%%%%Qj6J6j6J6j6K4l2L2l6M4n2O0o8P7q9J00j12J28j44J60j80K03k26
35a19K52k82L14l46L80m22M69n17N72o34P04p83Q71r75J098j241J413j629J904
54A029k264K763l506M724p060J3111n8804j45524Q2973J25002R603j4798Q4172
67I1421N2450r7768j43638k0152P6935O0658Q287P351K6132Q630o1291r8400k6239
80a15624Q0125P1140j4439j1147O1587J7174j10311j03323L6624Q2400O723l68
92E61P2996M6305p7566j06723j5761L8774K0290K6190N5515K7373l9651o5743
104a7440m1930p017K5431M1319K9279J5182R526k1259o3280m4296K1089L3716
116a9680k38K0123O8011K4458p0458o7448Q215J3705k8006J2196Q9296N6487m7979
$$ plain form
129 58682 -13413 -31897 -35829 -58908 -51063 16683 81016 79929 24690 -33653 -62732 -60878 -46942
142 -46942 -22990 28572 85534 79117 3310 -52520 -41543 -29372 -49012 -27713 58190 103304
154 103304 45520 -23183 -26554 -20688 -52781 -54884 19294 87239 70423 9271 -25474 -38358
166 -38358 -56925 -61593 -21241 45705 82956 57456 -2622 -41990 -45676 -45888 -46216 -5754 65630
179 65630 86144 28760 -25263 -22416 -18088 -47116 -43854 26317 80191 50381 -3686 -13904 -14349
192 -14349 -46877 -64834 -17926 50040 66822 33777 1100 -16498 -38001 -60234 -51798 2925
204 2925 61306 68237 26368 -7613 -14602 -30305 -57227 -38615 33024 75408 43312 -994 -4053
217 -4053 -9359 -48685 -62254 -7467 54698 53629 18060 4311 -1586 -35257 -67925 -47250 12681
$$ packed form
129E8682p2095j8484l932k3079P845O7746O4333j087n5239n8343k9079J854J3936
142d6942K3952N1562N6962o417p5807n5830J0977J2171j9640K1299Q5903M5114
154A03304n7784o8703l371N866l2093k103P4178O7945j6816o1152l4745j2884
166c8358j8567m668M0352O6946L7251k5500o0078l9368l686k12l28M0462P1384
179F5630K0514n7384n4023K847M328k9028L262P0171N3874k9810n4067j0218m45
192a4349l2528j7957M6908O7966J6782l3045l2677j7598k1503k2233Q436N4723
204B925N8381O931m1869l3981o989j5703k6922J8612P1639M2384l2096m4306l059
217d053n306l9326j3569N4787O2165j069l5569j3749n897l3671l2668K0675N9931
$$ plain form
230 12681 53179 48041 24421 8551 -10707 -43839 -62156 -29345 33656 61809 38472 11694
242 11694 5786 -14403 -55202 -56771 2297 54128 45636 16299 10508 758 -41516 -68946 -35192
255 -35192 24185 45963 31697 22218 15769 -13025 -53282 -58319 -15847 31080 43007 31865 24517
268 24517 14132 -21088 -58145 -46519 8035 43427 34750 21896 22855 2270 -47563 -67161 -24272
281 -24272 27415 35955 24551 28088 22159 -20650 -63773 -53822 -4068 28353 29596 29037 34159 15144
295 15144 -31606 -59357 -34049 12567 31547 25718 28067 31376 -414 -50898 -58670 -14419 24863
308 24863 26782 22966 33720 23174 -26567 -65300 -46286 494 22157 22036 31083 38931 10583
321 10583 -39772 -56631 -25425 11079 21326 23515 35601 32593 -7291 -49595 -46296 -7832 17707
$$ packed form
230A2681M0498n138k3620j5870j9258l3132j8317L2811O3001K8153k3337k6778
242A1694n908k0189m0799j569N9068N1831q492k9337n791r750m2274k7430L3754
255c5192N9377K1778j4266r479o449k8794m0257n037M2472M6927J1927j1142p348
268B4517j0385l5220l7057J1626N4554L5392q677j2854R59k0585m9833j9598M2889
281b4272N1687Q540j1404L537n929m2809m3123R951M9754L2421J243n59N122j9015
295A5144m6750k7751K5308M6616J8980n829K349L309l1790n0484p772M4251L9282
308B4863J919l816J0754j0546m9741l8733J9014M6780K1663j21R047P848k8348
321A0583n0355j6859L1206L6504J0247K189J2086l008l9884m2304L299L8464K5539
$$ plain form
334 17707 19649 27425 39125 18654 -31982 -59080 -35997 -11 12683 19455 37569 40589 2326
347 2326 -44553 -49682 -19519 3893 10852 25991 44205 30920 -15512 -47319 -34701 -5607 7079
360 7079 14911 35113 43737 11727 -36525 -50074 -25190 -3117 4505 20883 45333 38073 -7684
373 -7684 -45789 -41054 -16235 -4410 4816 30724 48559 24327 -22675 -41691 -25112 -7471 -1851
386 -1851 13967 41891 43980 3999 -36555 -38726 -18809 -7994 -364 25731 49041 32188 -14459
399 -14459 -41641 -32861 -17636 -12538 3465 36227 48649 16914 -24521 -34590 -20879 -13760 -8769
412 -8769 16987 46048 39558 -1435 -31745 -28827 -17793 -14985 -1414 31700 50031 25253 -16894
425 -16894 -33675 -26727 -22390 -19007 6605 42141 44941 9601 -22822 -26571 -21428 -23489 -12465
$$ packed form
334A7707J942P776J1700k0471n0636k7098K3083L5986J2694O772J8114L020l8263
347B326m6879n129L0163K3412O959J5139J8214j3285m6432l1807J2618K9094J2686
360G079P832K0202Q624l2010m8252j3549K4884K2073P622J6378K4450p260m5757
373g684l8105M735K4819J1825R226K5908J7835k4232m7002j9016J6579J7641N620
386a851J5818K7924K089l9981m0554k171J9917J0815P630K6095K3310j6853m6647
399a4459k7182Q780J5225N098J6003L2762J2422l1735m1435j0069J3711P119M991
412h769K5756K9061o490m0993l0310K918J1034K808J3571L3114J8331k4778m2147
425a6894j6781O948M337L383K5612L5536K800l5340l2423l749N143k061J1024
$$ plain form
438 -12465 22911 48326 31912 -5550 -23702 -21027 -21318 -21627 1965 38662 46848 16863 -15798
451 -15798 -24512 -23305 -28160 -20980 13802 45544 38066 2898 -18690 -19815 -23895 -30980 -12236 28634
465 28634 47341 23643 -7264 -15399 -16185 -27566 -26528 6582 42470 41488 10351 -11471 -16042
478 -16042 -23230 -32996 -18879 20515 45350 31298 629 -13395 -16490 -27976 -34783 -9450 32006
491 32006 43060 17780 -5843 -8597 -15510 -32851 -28121 10778 42578 34112 7007 -4331 -9316
504 -9316 -26855 -37165 -14508 25525 41595 24558 3729 -6244 -17845 -34618 -33907 -2612 32432
517 32432 37024 14891 -1606 -5936 -19123 -36407 -24775 15048 39287 25418 5627 2143 -6007
530 -6007 -30288 -37336 -6354 28175 32702 17638 9463 1737 -20266 -39563 -29671 2677 28138
$$ packed form
438a2465L5376K5415j6414l7462j8152K675k91l09K3592L6697Q186k9985l2661
451a5798q714J207m855P180L4782L1742p478l5168k1588j125m080p085J8744M0870
465B8634J8707k3698l0907q135p86j1381J038L3110L5888r82l1137k1822m571
478a6042p188r766J4117L9394K4835j4052l0669j4024l095j1486o807K5333M1456
491C2006J1054k5280k3623k754o913j7341M730L8899L1800q466k7105j1338m985
504i316j7539j0310K2657M0033J6070j7037k0829r973j1601j6773P11L1295L5044
517C2432M592k2133j6497m330j3187j7284J1632L9823K4239j3869j9791l484q150
530f007k4281p048L0982L4529M527j5064q175p726k2003j9297R892L2348K5461
$$ plain form
543 28138 28885 16827 6867 -5703 -25773 -38977 -21030 16669 34818 22027 8678 6532 -7615
556 -7615 -34735 -36141 -115 29906 25464 12981 13928 5895 -23703 -41311 -22271 9409 22135
569 22135 19791 19499 14271 -6153 -30898 -36769 -16259 12609 25784 21565 15849 10374 -10460 -37671
583 -37671 -35230 1227 27301 22617 14956 19095 6119 -29877 -43814 -15243 16003 19042 15168
596 15168 21999 16802 -11948 -35542 -29726 -7015 9117 16053 20577 20219 9014 -13808 -33482
609 -33482 -28402 -1238 18443 18328 18327 22685 6630 -29244 -41757 -14339 13585 14805 15634 28393
623 28393 21129 -16461 -41599 -26500 -1744 7024 12712 24910 25116 2422 -22931 -29474 -18092
636 -18092 -1893 10548 16615 21292 20202 2463 -25675 -33365 -12485 7556 9716 16301 31451
$$ packed form
543B8138P47j2058r960j2570k0070j3204J7947L7699J8149j2791j3349k146j4147
556g615k7120j406L6026L0021m442j2483R47q033k9598j7608J9040L1680J2726
569B2135k344k92n228k0424k4745n871K0510K8868J3175m219n716n475k0834k7211
583c7671K441L6457K6074m684p661M139j2976l5996j3937K8571L1246L039l874
596A5168O831n197k8750k3594N816K2711J6132O936M524l58j1205k2822j9674
609c3482N080K7164J9681j15jM358j6055l5874j2513K7418K7924J220Q29J2759
623B8393p264l7590k5138J5099K4756Q768N688J2198K06k2694k5353o543J1382
636a8092J6199J2441O067M677j090j7739k8138p690K0880K0041K160O585J5150
$$ plain form
649 31451 22612 -16865 -40758 -23948 -1841 1444 9516 31290 32090 -944 -30485 -28299 -13427
662 -13427 -4989 5940 22248 28669 14771 -9148 -25344 -24203 -9043 4580 10390 17634 26039
675 26039 15109 -15934 -31870 -17222 -1856 -2946 5400 30672 33751 -420 -28952 -23877 -11268
688 -11268 -11250 -1857 24837 36607 14245 -14273 -23324 -18991 -13627 -3326 13319 26546 24834 6950
702 6950 -16830 -26309 -16053 -4104 -702 9309 28236 26898 -2830 -25043 -17183 -7857 -14133
715 -14133 -7983 22378 37493 14696 -13132 -16906 -14133 -20306 -14470 13698 34662 26749 3222
728 3222 -14167 -21673 -21558 -13050 1771 19159 30443 21828 -4583 -23973 -19567 -10828 -10807 -1211
742 -1211 24843 33865 8266 -16599 -14463 -9432 -18376 -15732 13333 33321 20372 -907 -8006
$$ packed form
649C1451q839l9477k3893J6810K2107L285Q072K1774Q00l3034k9541K186J4872
662a3427Q438J0929J6308O421j3898k3919j6196J141J5160J3623N810P244Q405
675B6039j0930l1043j5936J4648J5366j090Q346K5272L079l4171k8532N075J2609
688a1268J8R393K6694J1770k2362k8518r051M333N364J0301J6645J3227j712j7884
702F950k3780r479J0256J1949L402J0011J8927j338k9728k2213P860R326o276
715a4133O150L0361J5115k2797k7828l774K773o173N836K8168K0964p913k3527
728C222j7389p506J15Q508J4821J7388J1284q615k6411j9390M406Q739K1R596
742a211K6054R022k5599k4865K136N031q944K644K9065J9988j2949k1279p099
$$ plain form
755 -8006 -12437 -22434 -20676 840 23584 29315 17962 -1301 -17134 -22326 -18742 -10545 6117 27184
769 27184 30037 6315 -15472 -15006 -11529 -18224 -11573 16924 32346 14377 -6194 -6383 -6735 -20135
783 -20135 -21712 2782 24431 21614 9154 2670 -5411 -18836 -23854 -12850 7334 23703 25236
796 25236 10410 -5707 -13495 -18906 -23407 -10718 18552 32554 15375 -4206 -5838 -9131 -24062
809 -24062 -21710 6895 28211 18824 4084 2534 -2391 -19411 -26373 -8836 12699 20328 16401
822 16401 10084 932 -11298 -21392 -22151 -7305 15869 25925 15789 2831 -2321 -12231 -27638
835 -27638 -22296 6964 27542 19559 6213 4316 -4262 -24259 -27895 -5228 18152 19564 12047
848 12047 9301 2981 -13138 -24485 -17816 14 14870 18039 13414 6913 -1025 -14406 -25124
$$ packed form
755h006m431r997J758K1516K2744N731j1353j9263j5833n192L584Q197J6662K1067
769B7184K853k3722k1787M66L477o695O651K8497J5422j7969k0571j89l52j3400
783b0135j577K4494K1649k817j2460o484q081j3425n018J1004K0184J6369J533
796B5236j4826j6117p788n411m501J2689K9270J4002j7179j9581j632l293j4931
809b4062K352K8605K1316r387j4740j550m925j7020o962J7537K1535P629l927
822A6401o317r152j2230j0094p59J4846K3174J0056j0136j2958n152r910j5407
835b7638N342K9260K0578p983j3346j897q578j9997l636K2667K3380J412p517
848A2047k746o320j6119j1347O669J7830J4856L169m625o501p938j3381j0718
$$ plain form
861 -25124 -17517 6364 20896 16120 9469 8341 -2803 -24275 -28122 -5366 16378 16892 12816 14033
875 14033 5931 -16807 -28896 -16574 3981 14092 14942 14820 10103 -3544 -19701 -23712 -11033
888 -11033 6572 15263 13871 12075 8978 -5605 -23830 -23726 -3478 12506 12963 12841 16597 6860
902 6860 -16948 -28383 -14495 4190 10315 12409 18107 14442 -4862 -23271 -23059 -7670 5605
915 5605 11239 15240 16362 7516 -10324 -24186 -18844 -1573 8895 10734 14177 16792 4303 -17861
929 -17861 -25409 -11277 3232 6939 11293 19422 15529 -5615 -23199 -19753 -5914 2478 8266 16497
943 16497 19633 7163 -13362 -22698 -14883 -2716 4681 10842 18131 17069 708 -18487 -21960 -9635
957 -9635 852 5374 13208 20970 13508 -8288 -21577 -16127 -5451 -264 6271 18514 21014 5232
$$ packed form
861b5124P607K3881J4532m776o651j128j1144k1472l847K2756K1744N14m076J217
875A4033q102k2738j2089J2322K0555J0111Q50j22m717j3647j6157m011J2679
888a1033J7605Q691j392j796l097j4583j8225J04K0248J5984M57j22L756r737
902F860k3808j1435J3888J8685O125K094N698l665j9304j8409K12J5389J3275
915E605N634M001J122q846j7840j3862N342J7271J0468J839L443K615j2489k2164
929a7861p548J4132J4509L707M354Q129l893k1144j7584L446J3839Q392N788Q231
943A6497L136j2470k0525r336P815J2167P397O161P289j062j6361j9195l473J2325
957i635J0487M522P834P762p462k1796j3289N450J0676N187O535J2243K500j5782
$$ plain form
971 5232 -14795 -19579 -12057 -5080 1182 11755 21189 15754 -2975 -17778 -17351 -9320 -2797 4261
985 4261 15365 21702 10338 -9685 -18785 -13925 -6945 -2679 7369 20274 19819 2488 -14256 -15970
999 -15970 -10766 -7324 -684 13118 22331 13924 -4402 -14903 -13678 -10013 -6967 3726 18098 21162
1013 21162 7307 -9324 -14753 -12198 -9760 -5164 8731 21862 18232 613 -12082 -12831 -11188
1026 -11188 -10379 -1457 15433 23365 11445 -5583 -12395 -12027 -12081 -9215 4788 20517 20096 4920
1040 4920 -8842 -11986 -11938 -12782 -5413 11629 22395 14890 -1158 -10066 -11318 -12686 -12212 14 17682
1055 17682 21445 8488 -5235 -10046 -11420 -13669 -8750 7041 20616 17367 2591 -6543 -9435
1068 -9435 -12919 -13519 -3779 13266 20892 11781 -1194 -7002 -9970 -14475 -12426 1905 17464 17829
$$ packed form
971E232k0027m784P522O977O262J0573R434n435j8729j4803M27Q031O523P058
985D261J1104O337j1364k0023r100M860O980M266J0048J2905m55j7331j6744j714
999a5970N204L442O640J3802R213q407j8326j0501J225L665L046J0693J4372L064
1013B1162j3855j6631n429K555K438M596J3895J3131l630j7619j2695p49J643
1026a1188Q09Q922J6890P932j1920j7028o812L68n4K866J4003J5729m21j5176
1040D920j3762l144M8q44P369J7042J0766p505j6048q908j252j368M74J2226J7668
1055A7682L763j2957j3723m811j374k249M919J5791J3575l249j4776r134k892
1068i435l484o00R740J7045P626r111j2975n808k968m505K049J4331J5559L65
$$ plain form
1082 17829 6534 -3006 -6778 -11563 -15245 -8454 8467 18904 13532 2961 -3344 -7274 -14027 -15121
1096 -15121 -2692 13753 17922 9691 1074 -3682 -10548 -16484 -12539 3529 16736 15226 6764 465
1110 465 -4964 -13493 -17367 -7203 9726 17542 12238 4298 -596 -7886 -16923 -15359 -504 14084
1124 14084 15349 9084 3789 -2441 -12471 -18569 -10697 5756 15100 13297 7911 2541 -5727 -15910
1138 -15910 -17406 -5029 10511 15292 11216 5841 636 -9428 -18660 -14291 1966 13491 13469 8231
1152 8231 5486 -2032 -14319 -18652 -7730 7181 12742 10969 8881 4027 -6952 -17078 -15388 -2608
1166 -2608 9173 12130 9924 7781 1363 -10467 -18069 -12068 2565 11332 10563 8821 7503 -1542
1180 -1542 -15616 -18066 -5680 7086 9971 9658 10881 5611 -8592 -17559 -12975 -768 6771 9390
$$ packed form
1082A7829j1295r540l772m785l682O791J6921J0437n372j0571o305l930o753j094
1096a5121J2429J6445M169q231q617m756o866n936L945J6068J3207j510q462o299
1110D65n429q529l874J0164J6929P816n304p940m894p290r037J564J4855J4588
1124A4084J265o265n295o230j0030o098P872J6453R344j803n386n370q268j0183
1138a5910j496J2377J5540M781m076n375n205j0064r232M369J6257J1525k2n238
1152H231k745p518j2287m333J0922J4911N561j773k088m854j0979j0126J690J2780
1166b608J1781K957k206k143o418j1830p602O001J4633Q767p69j742j318r045
1180a542j4074k450J2386J2766K885l13J223n270j4203q967M584J2207P539K619
$$ plain form
1194 9390 11005 9736 810 -11742 -16894 -9911 1579 8196 9812 10552 8472 -2403 -15667 -16852
1208 -16852 -5266 5282 7655 10057 12946 6350 -9889 -18802 -11398 -409 4719 7936 13476 11440
1222 11440 -1080 -13648 -15242 -7345 613 6245 10804 12811 7018 -4607 -14871 -14175 -4681 3698
1236 3698 6618 10504 13128 5739 -10126 -17454 -10053 -283 2433 7178 15178 13065 -2482 -15361
1250 -15361 -13312 -5905 -1325 4334 12829 14888 5607 -7334 -13302 -11570 -5353 1441 7450 11716
1264 11716 11803 2988 -9610 -14972 -8869 -1189 1514 6899 15097 12423 -2957 -14289 -11043 -5320
1278 -5320 -4139 1533 14176 16975 4677 -8130 -11207 -9873 -7983 -1577 9387 15112 11108 684
1292 684 -9123 -13585 -9616 -2522 2989 8646 13814 9928 -3641 -12660 -9638 -4220 -4183 928 13161
$$ packed form
1194I390J615j269q926j2552n152O983J1490O617J616P40k080j0875j3264j185
1208a6852J1586J0548K373K402K889o596j6239q913P404J0989N128L217N540k036
1222A1440j2520j2568j594P897P958N632M559K007n793j1625j0264O96R494Q379
1236C698K920L886K624p389j5865p328P401R770K716M745Q000k113j5547j2879
1250a5361K049P407M580N659Q495K059r281j2941n968J732O217O794O009M266
1264A1716Q7q815j2598n362O103P680K703N385Q198k674j5380j1332L246N723
1278e320J181N672J2643K799j2298j2807l077J334J890O406J0964N725m004j0424
1292F84r807m462L969P094N511N657N168l886j3569r019L022N418L7N111J2233
$$ plain form
1307 13161 15952 3553 -8322 -8755 -7675 -9130 -4218 9444 16471 9719 -297 -6171 -10184 -11832
1321 -11832 -6737 3176 11461 14429 8910 -2916 -11414 -10942 -6355 -3237 3956 14347 14825 1443
1335 1443 -9160 -8079 -6130 -8700 -3742 9889 15733 7187 -2405 -3679 -6517 -11812 -8765 3210
1349 3210 11874 11954 6748 -272 -7467 -11351 -10080 -3989 4781 14117 14255 3747 -6992 -8779 -8495
1364 -8495 -9610 -2944 11430 16697 6430 -3651 -4512 -6560 -11846 -8461 5020 12996 9005 3018
1378 3018 462 -4365 -10915 -10571 -2915 5427 11075 10421 4753 -2994 -8077 -10397 -10289 -2630 10048
1393 10048 15375 7687 -1296 -3651 -7166 -13424 -9479 5791 14429 9509 2567 659 -4262 -12524
1407 -12524 -11613 -845 8889 9832 7142 4145 -1323 -7940 -10434 -7945 -600 8090 11374 7470 1387
$$ packed form
1307A3161K791j2399j1875m33J080j455M912J3662P027o752j0016n874m013j648
1321a1832N095R913Q285K968n519j1826q498M72M587L118P193J0391M78j3382
1335A443j0603J081J949k570M958J3631N844q546r592j274k838n295L047J1975
1349C210Q664Q0n206p020p195l884J271O091Q770R336J38j0508j0739j787K84
1364h495j115O666J4374N267j0267j0081q61k048n286L385J3481P976l991n987
1378C018k556m827o550L44P656Q342N648o54n668p747n083k320J08P659J2678
1393A0048N327p688q983k355l515o258L945J5270Q638m920o942j908m921q262
1407a2524R11J0768R734R43k690k997n468o617k494K489P345Q690L284l904o083
$$ plain form
1422 1387 -2554 -7486 -12787 -9148 4630 13009 9233 3670 1932 -3846 -13150 -13045 -486 9055 9438
1437 9438 6358 5458 -102 -9175 -12820 -6445 2248 7546 9662 7415 2276 -3584 -9256 -10767 -6203
1452 -6203 3578 9721 8088 4637 2728 -3413 -12239 -12644 -1773 7664 8336 6971 6976 1142 -10425 -14472
1468 -14472 -6177 3530 6958 7948 8859 4292 -5017 -11146 -10104 -3561 3268 8136 8699 5811 1757
1483 1757 -5332 -11316 -9836 -1104 6399 7334 6227 6910 1579 -9302 -13408 -5497 2628 4870 6714
1498 6714 9959 6428 -4781 -12660 -9677 -2680 2181 6534 9919 7792 219 -7400 -10845 -7785 -455
1513 -455 5404 7133 7512 6333 300 -9316 -11754 -4607 2496 4438 5861 9841 6649 -5120 -11910
1528 -11910 -8215 -1981 691 4443 10001 9728 938 -7706 -10302 -7635 -2213 3313 8372 9185 6176
$$ packed form
1422A387l941m932n301L639J3778Q379l776n563j738n778r304J05J2559R541L83
1437I438l080r00n560r073l645O375Q693N298K116k247n139n860n672j511M564
1452f203R781O143j633l451j909o141q826m05J0871R437O72j365Nn834j1567m047
1468a4472Q295R707L428R90R11m567r309o129J042O543O829M868N63k888m054
1483A757p089n984J480Q732P503R35j107O83n331j0881m106P911Q125K242J844
1498F714L245l531j1209p879K983O997M861M353L385k127p573p619l445L060P330
1513d55N859J729L79j179o033r616k438P147P103J942J423L980l192j1769o790
1528a1910L695O234K672L752N558k73q790q644k596K667N422N526N059Q13l009
$$ plain form
1543 6176 -1566 -9240 -10642 -5244 1634 4612 7267 9488 5083 -5113 -11017 -7438 -2005 251 4306
1558 4306 10011 9302 -49 -7548 -8249 -5878 -3615 1771 8402 10629 5517 -2260 -7602 -9116 -6421
1573 -6421 -1034 4618 9239 9900 3707 -5557 -9763 -7144 -3094 -207 5379 10854 8602 -1129 -7915
1588 -7915 -7219 -4974 -3797 828 8857 10772 4317 -3804 -6708 -6736 -6348 -2518 4534 9814 8928 2344
1604 2344 -4098 -7998 -7014 -4257 -821 5915 11031 7819 -1007 -7210 -6854 -5663 -4595 974 8993
1619 8993 10935 3343 -3533 -5846 -6244 -6299 -2789 4850 10104 7894 1894 -3635 -6702 -7309 -5430 -503
1635 -503 6470 10476 6759 -302 -5206 -6944 -6841 -4482 2020 8886 10124 3715 -2417 -5058 -6760
1650 -6760 -7397 -2932 5405 9665 7157 1229 -2837 -5775 -7844 -6149 280 7038 9305 5290 200
$$ packed form
1543F176p742p674j402N398O878K978K655K221m405j0196n904L579N433K256M055
1558D306N705p09r351p499p01K371K263N386O631K227n112p777n342j514K695
1573f421N387N652M621O61o193r264m206K619M050K887N586N475k252r731o786
1588g915O96K245J177M625Q029J915o455q121k904k8L88L830P052N280q86o584
1604B344o442l900R84K757L436O736N116l212q826o203L56J191J068N569Q019
1619H993J942p592o876k313l98n5L510P639N254k210o000n529l067o07J879M927
1635e03O973M006l717p061m904j738J03K359O502O866J238o409o132k641j702
1650f760o37M465Q337M260k508n928m066k938k069J695O429O758K267m015n090
$$ plain form
1665 200 -4066 -6566 -8027 -4296 2832 8899 8441 2895 -1535 -4626 -7448 -7741 -2410 5456 9279 6248
1681 6248 1781 -2026 -5163 -8276 -6640 593 7668 7772 4585 961 -3175 -6784 -7985 -3979 3376
1696 3376 7943 7047 3412 -424 -4177 -8144 -7952 -1578 5596 7885 5724 2449 -768 -5415 -8784
1711 -8784 -6071 1350 6857 7107 4913 1686 -2511 -7410 -8472 -3692 3763 7704 6415 3968 811
1726 811 -4106 -8700 -7588 -1103 5299 7068 5768 2808 -674 -6141 -9080 -5748 1687 6217 6355
1741 6355 4740 2347 -2390 -8020 -8360 -2717 4003 6385 5957 4395 984 -4826 -8788 -6936 -65
1756 -65 4957 6269 5463 3435 -814 -6361 -8453 -4624 1732 5812 5703 5102 2688 -2547 -7858 -7839 -2095
1773 -2095 3633 5591 5519 5028 1159 -5018 -8831 -5880 -294 3651 5680 5956 4368 -1012 -6587 -7926
$$ packed form
1665B00m266k500j461L731P128O067m58n546m430l091k822k93N331P866L823l031
1681F248m467l807l137l113J636P233P075J04l187l624m136l609j201M006P355
1696C376M567q96l635l836l753l967J92O374P174K289k161l275l217m647l369
1711h784K713P421N507K50k194l227m197m899j062M780P455L941j289k447l157
1726H11m917m594J112O485O402J769j300k960l482n467k939L332P435M530J38
1741F355j615k393m737n630l40N643O720K382m28j562l411n810l962J852O871
1756f5N022J312q06k028m249n547k092L829O356M080j09o01k414n235n311J9N744
1773b095N728J958p2m91l869o177l813K951N586L945K029K76j588n380n575j339
$$ plain form
1789 -7926 -4130 1321 4592 6024 5386 2760 -3176 -7474 -7331 -2029 2501 4833 6032 5472 1315 -5541
1805 -5541 -7762 -5090 -374 2436 5159 6796 4684 -1534 -6674 -7104 -3597 183 3911 6384 6142
1820 6142 2138 -3541 -7135 -6176 -2305 1676 4803 6685 5496 216 -5443 -7375 -4655 -719 2120
1835 2120 5428 7271 4714 -2478 -7116 -5845 -3346 -875 3144 6977 6632 1722 -4283 -6662 -5275
1850 -5275 -2618 1004 4714 6896 5375 -213 -5297 -6995 -4194 -832 2064 5012 7104 4196 -2538
1865 -2538 -6537 -5430 -2847 -1401 2567 6860 6925 1392 -3895 -5673 -4706 -3132 -138 4971 7415 4571
1881 4571 -130 -4643 -6161 -4705 -1383 2091 5518 7072 3954 -2241 -6053 -5558 -3279 -476 2731
1896 2731 6756 6193 944 -4328 -4966 -4251 -3643 -30 5315 7144 3842 -599 -3658 -5019 -5288 -2543
$$ packed form
1789g926L796N451L271J432o38k626n936m298J43N302M530K332J199n60m157o856
1805e541k221K672M716K810K723J637k112o218n140m30L507L780L728K473k42
1820F142m004n679l594R59L871L981L127J882j189n280n659j932K720L936K839
1835B120L308J843k557p192m638J271K499K471M019L833l45m910o005k379J387
1850e275K657L622L710K182j521n588n084j698K801L362K896K948K092k908o734
1865b538l999J107K583J446L968M293O5n533n287j778R67J574K994N109K444k844
1881D571m701m513j518J456L322L474L427J554l118o195l812M95K279K803L207
1896B731M025n63n249n272o38P15O08L613N345J829l302m441l059j361k69K745
$$ plain form
1912 -2543 2522 5958 6124 3028 -1888 -5112 -5806 -4004 -901 3406 7118 5810 772 -3668 -4870
1927 -4870 -4345 -3796 -46 5647 7333 3584 -1324 -3231 -4318 -5496 -2981 2848 6527 5208 2374
1942 2374 -950 -4037 -5603 -4700 -722 3435 6313 5364 1570 -3031 -4348 -4638 -4016 -66 5523 7188
1958 7188 3345 -1151 -3036 -4587 -5567 -3250 3285 6615 5027 1588 -658 -3136 -5643 -4785 -68
1973 -68 3784 5140 4098 1670 -1850 -4900 -5493 -3471 446 4680 6409 3736 -277 -2963 -4296 -5818
1989 -5818 -3205 2525 6564 4824 1487 -536 -3439 -6749 -5259 278 4818 4941 3273 1700 -1332
2004 -1332 -4859 -5606 -2749 817 4126 5325 3764 339 -2470 -4359 -5165 -2992 2219 5515 4741 1877
2020 1877 137 -2681 -6302 -5975 77 4440 4661 3555 2483 -700 -6043 -6545 -2275 2112 3627 4656
$$ packed form
1912b543N065L436J66l096m916l224o94J802L103M307L712j308n038m440j202
1927d870N25N49L750N693J686l749m908j907j087j178K515N829L679j319k834
1942B374l324l087j566R03L978M157K878r49l794m601j317k90O22L950N589J665
1958G188l843m496j885j551r80K317O535L330j588l439k246k478k507Q58M717
1973f8L852J356j042k428l520l050n93K022L917M234J729k673m013k686j333j522
1989e818K613N730M039j740l337k023k903l310J490N537M540J23j668j573l032
2004a332l527p47K857L566L309J199j561l425k809j889q06K173N211L296p74k864
2020A877j740k818l621L27O052M363K21j106j072l183n343n02M270M387J515J029
$$ plain form
2036 4656 4109 788 -3474 -4876 -4326 -1793 2100 4854 4607 2109 -19 -2758 -5370 -5280 -175 3984
2052 3984 4184 3360 2783 -204 -5315 -6680 -2444 1969 3464 4257 5086 1849 -3765 -5737 -4283 -1149
2068 -1149 1710 4773 5721 2406 -1001 -3422 -5199 -4147 101 3509 4173 3010 2207 -496 -4549 -6110
2084 -6110 -2143 1489 2489 3350 4797 2241 -3575 -6059 -3704 -1268 919 3944 5616 3903 -303
2099 -303 -3578 -4911 -4369 -831 3085 4767 3630 1567 -626 -4583 -5841 -2231 1816 2891 3394 4502
2115 4502 2022 -3615 -5815 -3270 -661 394 2753 5363 3898 -468 -3760 -4012 -3496 -1748 2086
2130 2086 4918 4679 1865 -920 -4311 -5102 -2898 959 3048 3836 4241 1791 -3039 -5563 -3521 -768
2146 -768 780 3141 5705 3830 -1579 -3920 -3901 -2595 -1445 1796 4983 4553 1614 -1404 -3080 -4497
$$ packed form
2036D656n47l321m262j402N50K533L893K754k47k498k128k739k612R0N105M159
2052C984K00q24n77k987n111j365M236M413J495P93Q29l237n614j972J454L134
2068a149K859L063R48l315l407k421j777J052M248L408O64j163q03k703m053j561
2084f110L967L632J000Q61J447k556n816k484K355K436K187L025J672j713m206
2099c03l275j333N42L538L916J682j137k063k193l957j258L610M047J075N03J108
2115D502k480n637k200K545K609J055K359K610j465m366l292k52N16J748L834
2130B086K832k39k814k785l391p91K204L857K089P88M05k450m830k524K042K753
2146g68J548K361K564j875n409k341J9J306J150L241L187m30k939l018j676j417
$$ plain form
2162 -4497 -3291 461 3155 4480 3845 1201 -2699 -5083 -3730 -1436 862 3069 5314 3945 -1121
2177 -1121 -3943 -3549 -2654 -1778 1082 4716 4959 1599 -1864 -2958 -3523 -3084 -487 2946 4389 3217
2193 3217 837 -1984 -4403 -4040 -1702 262 2948 4912 3631 -373 -3629 -3928 -2920 -1514 1619
2208 1619 4688 5095 1463 -2080 -3223 -3610 -3281 -327 3350 4420 2912 536 -1720 -3659 -4349 -2180
2224 -2180 885 3233 4240 3049 -347 -2968 -4301 -3397 -1502 1416 4571 4484 1533 -1603 -3377 -3698
2240 -3698 -3507 -800 3535 5058 2943 150 -1948 -3282 -4255 -2339 1025 3546 3789 2051 384 -2534
2256 -2534 -4034 -3312 -1281 1653 3901 4003 1733 -1272 -2817 -3630 -3369 -738 2906 4866 2911 468
2272 468 -1444 -3349 -4466 -3066 1137 3865 3735 2092 -20 -2007 -4004 -3788 -1494 1853 3482 3740
$$ packed form
2162d497J206L752K694J325o35k644l900k384J353K294K298K207K245j369n066
2177a121k822L94Q95Q76K860L634K43l360l463j094n65M39K597L433J443j172
2193C217k380k821k419L63K338J964K686J964j281m004l256k99J008J406L133
2208A619L069M07l632l543j143l87L29K954L677J070j508k376k256j939o90K169
2224b180L065K348J007j191l396k621j333R04J895K918L155q7k951l136j774l21
2240c698J91K707M335J523k115k793k098j334r73J916L364K521K43j738j667k918
2256b534j500P22K031K934K248J02k270l005j545q13K61K631L644J960j955k443
2272D68j912j905j117J400M203K728j30j643k112j987j997K16K294L347J629K58
$$ plain form
2288 3740 1840 -680 -2990 -3467 -2770 -317 2897 4428 3333 1012 -1334 -2809 -3800 -2468 993 3573
2304 3573 3505 2394 678 -1828 -4013 -3800 -1275 2115 3308 2860 1812 -597 -3202 -4140 -2921 -27
2320 -27 2943 3402 3140 1112 -1114 -3258 -3566 -2182 914 3355 3502 2289 772 -1662 -3951 -3882 -1058
2337 -1058 1953 3191 3251 2512 103 -2860 -4036 -2860 19 2122 3207 3092 1443 -1008 -3153 -3715
2353 -3715 -2294 855 2642 3145 2517 796 -1932 -3858 -3194 -782 1590 3124 2896 2149 22 -2685
2369 -2685 -3972 -2516 -248 2000 3170 3186 1350 -1022 -3137 -3407 -1440 606 2468 3230 2749 887
2385 887 -2049 -3684 -3267 -750 1438 2795 3253 2427 -19 -2810 -3658 -2375 -98 1771 3006 3015 1847
2402 1847 -990 -3349 -3350 -1588 297 2380 3517 3342 936 -2104 -3235 -2965 -1277 1467 2505 3317
$$ packed form
2288C740j900k520k310m77O97K453L214J531j095k321k346j475r91J332L461K580
2304C573o8j111j716k506k185K13K525L390J193m48j048k409k605r38J219K894
2320b7K970M59k62k028k226k144l08J384L096K441J47j213j517k434k289O9K824
2337a058L011J238O0p39k409k963j176J176K879K103J085j15j649k451k145n62
2353c715J421L149J787N03o28j721k728j926O64K412K372J534k28p47k127k707
2369b685j287J456K268K248J170J6j836k372k115k70J967K046J862P62m81j862
2385H87k936j635M17K517K188J357M58q26k446k791q48J283K277J869J235Rj168
2402A847k837k359jJ762J885K083J137j75k406l040j131K70J688K744J038Q12
$$ plain form
2418 3317 2521 -165 -2923 -3178 -2467 -389 1411 2771 2985 1269 -1433 -3346 -3193 -1927 128 1867
2434 1867 3407 3032 653 -2213 -2898 -2630 -994 1046 2741 3467 2203 -466 -2606 -3352 -2268 -356
2450 -356 1167 2919 3283 1477 -1393 -2868 -2986 -1741 22 1701 3682 3097 642 -2017 -3003 -2482
2466 -2482 -1280 808 2624 3370 2027 -483 -2236 -2946 -2502 -757 1466 2793 2845 1376 -1128 -3001
2482 -3001 -3387 -2040 115 2036 3167 2559 287 -1991 -2943 -2545 -1000 530 2368 3365 2138 -438
2498 -438 -1855 -2930 -2378 -409 1439 3305 2843 980 -1450 -2511 -3124 -1857 -76 1986 3012 2435
2514 2435 542 -1554 -2826 -2440 -1387 650 2953 3399 1977 -650 -1756 -2548 -2656 -987 1602 3222
2530 3222 2490 761 -1050 -2065 -2746 -2197 84 2176 3048 2076 567 -1668 -2482 -2617 -1635 361 2771
$$ packed form
2418C317p96k686k758k55P11K078J800J360K14j716k702j913J53J266K055J739
2434A867J540l75k379k866o85K68J636K040J695P26j264k669k140p46J084J912
2450c56J523J752L64j806k870j475j18J245J763J679J981n85k455k659r86N21
2466b482J202K088J816P46j343k510j753p10M44J745K223J327N2j469k504j873
2482c001l86J347K155J921J131o08k272k278r52L98J545J530J838R97j227k576
2498d38j417j075N52J969J848J866m62j863k430j061o13J267J781K062J026n77
2514B435j893k096j272L86J053K037K303M46j422k627j106p92j08J669K589J620
2530C222p32j729j811j015o81N49K281K092Q72r72j509k235q14j35R82J996K410
$$ plain form
2547 2771 3358 1844 -468 -1846 -2416 -2427 -931 1266 3119 2610 1109 -538 -2199 -2895 -1871 111
2563 111 2026 2789 2202 765 -1073 -2805 -2462 -1355 618 2367 3104 1870 -343 -2229 -2802 -2486 -1261
2580 -1261 1359 3210 2980 870 -189 -1996 -2990 -2014 183 2370 2761 2116 1061 -1277 -2947 -2903 -1257
2597 -1257 667 2079 2663 1825 -79 -1965 -2369 -2198 -982 1346 2739 2059 884 -378 -1787 -2918
2613 -2918 -2348 -44 2008 2697 1940 969 -1126 -2491 -3023 -1044 707 1884 2586 2202 280 -1994 -2786
2630 -2786 -2080 -773 874 2855 2614 1049 -716 -2083 -2226 -2367 133 2399 2113 2141 968 -284 -2396
2647 -2396 -2728 -1121 706 1717 2353 2301 385 -1862 -2686 -2135 -844 823 2314 2747 1181 -602 -1598
2664 -1598 -2741 -2175 -112 1954 2284 1944 997 -598 -2177 -2724 -1169 829 1427 2091 2069 806 -1825
$$ packed form
2547B771N87j514k312j378n70j1J496K197J853n09j501j647j661o96J024J982
2563A11J915P63n87j437j838j732L43J107J973J749P37j234k213j886n73L16J225
2580a261K620J851k30k110j059j807r94R76K197K187L91o45j055k338j670M4J646
2597a257J924J412N84q38j904j886m04J71J216K328J393o80j175j262j409j131
2613b918N70K304K052O89p57r71k095j365n32J979J751J177P02l84j922k274p92
2630b786P06J307J647J981k41j565j765j367j43j41K500K266k86K8j173j252k112
2647b396l32J607J827J011O36n2j916k247q24N51J291J667J491M33j566j783r96
2664a598j143N66K063K066L30l40r47j595j579n47J555J998N98O64k2j263k631
$$ plain form
2681 -1825 -2527 -1374 -602 735 2113 2683 1568 -788 -1939 -2218 -2159 -473 1708 2701 2187 929 -413
2698 -413 -2219 -2702 -1247 949 1634 1917 1904 502 -1707 -2869 -1622 -417 511 1673 2658 1722 -636
2715 -636 -1813 -1943 -1729 -555 1291 2599 2260 547 -749 -1848 -2568 -1244 673 2112 2359 1841 819
2732 819 -1468 -3072 -1786 -121 526 1637 2634 1536 -460 -2309 -2028 -1337 -556 1065 2112 2009 632
2749 632 -726 -1851 -2129 -1282 311 1723 2096 1798 852 -1158 -2604 -2234 -360 775 1927 2252 1810
2766 1810 -239 -2094 -2385 -1422 -425 869 2447 2410 322 -1045 -1801 -1854 -1348 171 2237 2088 1218 396
2784 396 -860 -2176 -2183 -808 865 1683 1937 2001 272 -1956 -2172 -1569 -191 652 2246 2348 690 -1329
2802 -1329 -1796 -1876 -1475 -194 2019 2548 1246 555 -699 -2226 -2413 -733 1204 2130 1828 1423 130
$$ packed form
2681a825p02J153P72J337J378N70j115k356j151k79N9J686K181R93n14j258j342
2698d13j806m83J455K196O85K83j3j402k209j162J247J205R28J162R85r36k358
2715f36j177j30K14J174J846J308l39j713j296j099p20J324J917J439K47n18j022
2732H19k287j604J286J665O47J111R97j098j996j849K81O91P81J621J047j03j377
2749F32j358j125k78Q47J593J412L73k98r46k010j446L70J874J135J152L25m42
2766A810k049j855k91R63R97J294J578l7k088j367p56n3N06J519K066j49q70q22
2784C96j256j316pJ375J673Q18K54O4j729k228k16O03J378Q43J594J02j658k019
2802a329m67q0M01J281K213N29j302o91j254j527j87J680J937R26l02m05j293
$$ plain form
2819 130 -1754 -2457 -1509 -157 662 2100 2088 954 -865 -1954 -1639 -1750 -290 1392 2559 1573 165
2836 165 -846 -1636 -1989 -790 1160 1806 1498 1145 139 -1432 -2484 -1584 16 1112 1795 2231 1036
2853 1036 -1192 -1857 -1687 -1118 -347 1496 2264 1727 -243 -798 -1161 -2225 -1596 576 2018 2025 1240 473
2871 473 -1296 -2298 -1715 -104 1149 1717 2114 1066 -479 -2118 -1930 -1155 -173 1111 2311 1693 243
2888 243 -858 -1761 -1626 -1413 526 1813 1715 683 -11 -1119 -2129 -1614 -435 1116 1168 1737 1289 -636
2906 -636 -1974 -1625 -1291 -171 1382 2124 1844 13 -798 -1874 -1986 -1236 460 1853 2080 927 180
2923 180 -1267 -1847 -2023 -391 1103 1494 1560 1177 -225 -1869 -2172 -1244 13 758 1762 1458 407 -1242
2941 -1242 -1682 -1683 -845 381 1722 1948 1013 -87 -999 -1763 -1574 -486 1315 1573 1308 679 -162 -1689
$$ packed form
2819A30j884p03R48J352Q19J438j2j134j819j089L15j11J460J682J167r86j408
2836A65j011p90l53J199J950O46l08l53j006j571j052R00J600J096O83M36j195
2853A036k228o65J70N69P71J843P68n37j970n55l63j064O29K172J442Pp85p67
2871D73j769j002N83J611J253N68L97j048j545j639J88P75R82J284J200o18j450
2888B43j101r03J35K13J939J287r8j032o94j108j010N15J179J551N2N69m48j925
2906f36j338L49L34J120J553P42k80j831q11j076j12P50J696J393K27j153p47
2923A80j447n80j76J632J494L91O6l83j402j644l03R28J257P45J004l04j051j649
2941a242m40jQ38J226J341K26r35j100r12p64J89J088J801K58k65o29q41j527
$$ plain form
2959 -1689 -2037 -1154 -237 1181 1890 1576 249 -958 -1615 -1781 -928 372 1610 1934 1314 -216 -1103 -1516
2977 -1516 -1897 -326 1223 1997 1839 812 -371 -1333 -2058 -1146 116 1422 1930 1497 318 -1095 -1653
2994 -1653 -1461 -776 435 1419 1833 1347 -88 -1025 -1905 -1501 -554 951 1662 1395 910 -446 -1567 -1758
3012 -1758 -1440 22 1355 1715 1426 672 -723 -1777 -1650 -780 247 1239 1518 1120 16 -1078 -1831
3029 -1831 -1754 -628 866 1637 1736 1012 -268 -1070 -1608 -1071 79 1385 1738 1593 539 -707 -1896 -1741
3047 -1741 -858 424 1427 1500 1295 382 -1208 -2020 -1362 -829 770 1349 1847 829 -352 -957 -1892 -1036
3065 -1036 68 870 1475 1511 817 -893 -1479 -1941 -630 294 1549 1768 1197 314 -1052 -1840 -1149 -550
3083 -550 597 1622 1413 780 -468 -1215 -1570 -1275 -38 1028 1873 1306 530 -644 -1663 -1453 -870 339
$$ packed form
2959a689l48Q83R17J418P09l14j327j207o57j66Q53J300J238L24o20j530q87m13
2977a516l81J571J549P74j58j027j183r62p25R12J262J306N08m33j179j413n58
2994a653J92O85J211R84M14m86j435r37q80M04R47J505P11k67m85j356j121j91
3012a758L18J462J333L60k89p54j395j054J27Q70J027R92K79l98j104j094p53
3029a831P7J126J494P71R9p24j280q02n38N37J150J306L53j45j054j246j189J55
3047a741Q83J282J003P3k05r13j590q12O58N33J599N79M98j018j181o05r35Q56
3065a036J104Q02O05L6o94j710n86m62J311R24J255K19n71q83j366p88O91N99
3083e50J147J025k09o33j248p47l55K95J237J066Q45n67p76j174j019K10N83J209
$$ plain form
3101 339 1149 1883 1424 408 -1320 -2033 -1453 -236 482 1132 1883 880 -125 -1442 -1910 -1132 -125 898
3119 898 1694 1517 603 -514 -1334 -1530 -692 -48 1002 1799 1513 280 -1027 -1570 -1211 -529 743 1493
3137 1493 1452 1081 -232 -1107 -1569 -1014 -250 968 1482 1440 193 -634 -1303 -1544 -871 126 1311 1583 936
3156 936 43 -812 -1431 -1566 -544 505 1450 1876 1139 -292 -1379 -1417 -1335 -519 723 1375 1226 177 -375
3175 -375 -1037 -1315 -787 -37 1207 1428 1231 202 -831 -1552 -1132 -587 337 1652 1784 888 -179 -1132
3193 -1132 -1570 -755 -221 972 1546 1498 271 -766 -1003 -1379 -1126 134 1354 1666 1075 366 -990 -1520
3211 -1520 -1193 -749 455 558 1794 890 -179 -1305 -1379 -1070 -355 736 1555 1323 437 -356 -1181 -1538
3229 -1538 -1026 173 1401 1499 989 335 -620 -1296 -1368 -356 416 1232 1198 782 -48 -1303 -1752 -943 -89
$$ packed form
3101C39Q10P34m59j016j728p13N80J217P18O50P51j003j005j317m68P78J007J023
3119H98P96j77r14j117q20j96Q38O44J050P97k86j233j307n43L59O82J272P50
3137A493m1l71j313q75m62N55P64J218N14m2j247q27o69k41O73R97J185K72o47
3156I36q93q55o19j35J022J049R45M26p37j431j087l8Q2Q16J242O52j49j049n52
3175c75o62k78N28P50J244K21j97j029j033p21M20N45R24J315J32q96j067r53
3193a132m38Q15N34J193N74m8j227j037k37l76K53J260J220L12n91p09j356n30
3211a520L27M44J204J03J236r04j069j126p4L09P15J091Q19k32q86p93q25l57
3229a538N12J199J228R8n10o54r55o76p2J012P72Q16l4m16q30j255m49Q09Q54
$$ plain form
3248 -89 861 1452 1293 667 -467 -837 -1335 -1115 54 1305 1688 1067 402 -260 -1247 -1540 -667 582 1056
3267 1056 1563 908 158 -1180 -1841 -943 -23 1013 1315 1004 669 -509 -1030 -1433 -754 202 708 1690 1196
3286 1196 221 -497 -1244 -1389 -632 641 1417 1148 730 245 -963 -1462 -800 -156 780 1111 1083 586 -402
3305 -402 -1113 -1158 -608 6 978 1351 991 -152 -449 -1285 -1207 -400 408 1699 1255 924 203 -959 -1329 -908
3325 -908 -40 808 1020 1461 876 -308 -1300 -1005 -740 328 996 1598 1281 -41 -695 -1010 -971 -692 555
3344 555 1463 1082 801 266 -565 -1435 -1283 -106 604 475 1104 619 -340 -1333 -1291 -767 192 647 1512 1397
3364 1397 6 -934 -1194 -875 -528 116 1255 1220 636 -1 -613 -1359 -1696 -141 503 1201 968 780 -386
3383 -386 -1379 -1418 -351 -50 323 1135 1279 87 -715 -1193 -970 -429 19 1254 1570 871 284 -899 -1319
$$ packed form
3248h9R50N91j59o26j134l70m98K20J169J251L83o21o65o62r87k93Q73J249M74
3267A056N07o55p50j338o61Q98R20J036L02l11l35j178n21m03O79R56N06R82m94
3286A196r75p18p47j45P57J273P76k69m18m85j208m99O62O44R36L31k8m97r88
3305d02p11m5N50O14R72L73l60j143k97q36P8Q07Q08J291m44l31p21j162l70M21
3325i08Q68Q48K12M41n85j184r92K95K65J068O68O02l17j322o54l15L9K79J247
3344E55R08l81k81n35q31q70J52J177P10j29O29m85r59r93M2N24R59M55Q65j15
3364A397j391r40k60L19L47O44J139l5n84o37o12p46l37J555O44O98k33j88j166
3383c86r93l9J067L01L73Q12J44j192q02m78K23N41M48J235L16o99n87j183m20
$$ plain form
3402 -1319 -1025 130 777 944 989 981 -144 -1415 -1543 -443 217 717 1031 1360 151 -1143 -1381 -1105 -595
3421 -595 -304 1261 1413 1045 -572 -598 -976 -912 -242 673 988 1268 887 -209 -1157 -1694 -790 277 553
3440 553 1130 1402 416 -924 -1449 -551 -338 -16 780 1662 891 -79 -652 -999 -1066 -664 949 1195 1305 592
3460 592 -628 -930 -1170 -1048 235 655 1120 1300 432 -416 -1280 -1086 -528 281 1270 1380 1276 -291 -875
3479 -875 -843 -967 -393 292 1342 1036 421 -464 -692 -1160 -936 -38 1069 1057 1190 442 -678 -1033 -931 -519
3499 -519 130 906 1040 696 103 -849 -1053 -980 -368 171 1332 1426 239 -495 -713 -1095 -1080 -222 806 1144
3519 1144 908 296 -326 -1130 -1117 -602 221 990 1208 1074 -113 -603 -947 -807 -783 473 1355 1439 424 -598
3539 -598 -559 -909 -1130 -204 1049 1137 485 194 -195 -981 -1272 -599 161 1241 1220 1135 203 -719 -1489 -851 0
$$ packed form
3402a319K94J155O47J67M5qj125j271j28J100O60N00L14L29j209j294k38K76N10
3421e95K91J565J52l68j617k6l78O4O70R15L15K80l81j096r48n37R04J067K76
3440E53N77K72r86j340n25Q98K13L22P96Q82p71r70n73l47o7M02J613K46J10p13
3460E92j220l02k40J22J283M20M65J80q68q48q64J94N58Q09R89J10j04j567n84
3479h75L2j24N74O85J050l06o15q85k28m68K24Q98J107j2J33p48j120l55J02M12
3499e19O49P76J34l44n93r52k04P3O12N39J161R4j187p34k18l82J5Q58J028L38
3519A144k36o12o22q04J3N15Q23P69K18j34j187m90l44J40K4J256Q82Q4j015j022
3539e98L9l50k21R26J253Q8o52k91l89p86k91O73P60J080k1q5r32r22p70O38Q51
$$ plain form
3560 0 637 915 1195 511 -507 -1070 -1189 -1156 -458 743 1359 735 5 126 -716 -1345 -593 334 967 813
3580 813 589 159 -497 -1157 -892 -385 813 1002 1060 447 -554 -953 -932 -1109 38 595 877 685 18 -766
3600 -766 -826 -1507 -634 350 970 778 636 242 -849 -1213 -686 7 208 845 1117 700 -114 -401 -974 -805
3620 -805 52 718 961 860 290 -398 -724 -993 -809 146 716 778 597 228 -422 -1281 -1166 227 810 638
3640 638 776 612 88 -916 -1196 -824 235 334 1274 932 588 -145 -1350 -1146 -210 307 869 993 502
3659 502 6 -425 -972 -1196 -379 711 1384 653 804 -206 -954 -958 -754 288 604 872 813 521 -651 -932
3679 -932 -1052 -685 451 844 612 798 196 -575 -1148 -860 -70 692 779 652 780 -201 -812 -1156 -747 -337
3699 -337 133 972 714 498 -403 -1058 -1066 -520 -113 931 1054 1040 182 -595 -827 -712 -184 329 847 730 522
$$ packed form
3560@O37K78K80o84j018n63j19L3O98J201O16o24p30J21q42o29P52R27O33j54
3580H13k24m30o56o60K65N07J198J89N8o13j001l99K1j77J147N57K82j92o67p84
3600g66o0o81Q73R84O20j92j42l94j091l64N27O93K01O37K72m17q14k87n73J69
3620h05Q57O66K43j01n70o88l26k69J84R55N70O2j81l69o50q59J15J393N83j72
3640F38J38j64n24j004k80L72J059R9R40l42l44p33j205K04R36N17N62J24m91
3659E02m96m31n47k24Q17J090O73p31J51j010p48mK04J042L16K68n9k92j172k81
3679i32j20L67J136L93k32J86o02p71n73K88P90P62Q7j27J28r81o11l44M09M10
3699c37M70Q39k58k16r01o55qN46M07J044J23j4q58p77k32J15N28N13N18j17k08
$$ plain form
3720 522 -228 -1001 -1251 -614 -316 780 568 982 575 -467 -796 -866 -373 73 779 1439 622 234 -807
3739 -807 -772 -824 -370 -74 394 1072 576 -95 -905 -778 -359 -253 516 876 649 471 -781 -1006 -963 -418 -77
3760 -77 799 984 559 63 -517 -863 -599 -125 667 834 1015 587 -161 -596 -1112 -480 -402 -101 744 834 102
3781 102 -335 -742 -632 -603 -325 761 909 892 -162 -478 -651 -636 -352 273 1017 836 816 -78 -751 -940 -826
3802 -826 -285 528 998 909 256 -213 -664 -628 -340 -18 795 1094 903 -109 -432 -955 -1121 -452 114 1058
3822 1058 1199 271 -441 -536 -892 -538 -139 580 1038 599 348 -398 -502 -853 -397 13 730 1169 664 -56
3842 -56 -508 -904 -499 -437 124 1000 1065 360 -216 -527 -960 -1185 -145 888 756 563 51 -139 -753 -1012
3862 -1012 -533 282 707 869 535 45 -509 -791 -1025 -362 168 815 774 443 -84 -476 -695 -643 -25 786
$$ packed form
3720E22p50p73k50O37K98J096k12M14m07j042l29p0M93M46P06O60q17l88j041
3739h07L5n2M54K96M68O78m96o71q10J27M19J06P69L60k27j78j252k25M3N45L41
3760g7Q76J85m25m96n80l46K64M74P92J67J81m28p48m35n16O32P8L01Q45R0p32
3781A02m37m07J10K9K78J086J48j7j054l16j73J5K84O25P44j81k0q94o73j89J14
3802h26N41Q13M70q9o53m69m51L6K88L22Q13K99j91j012l23n23j66O69N66R44
3822A058J41r28p12r5l56L54L99P19M58m39k51p46j04l51M56M10P17M39n05p20
3842e6m52l96M05O2N61Q76O5p05n76l11m33k25J040J033j32j93n12j90o14k59
3862a012M79Q15M25J62l34m90n54k82k34O63N30O47m1l31n27l92k19N2O18Q11
$$ plain form
3882 786 846 636 323 94 -379 -999 -568 693 765 1080 347 92 -141 -925 -675 -253 488 657 684 287 88
3903 88 -300 -827 -830 -369 416 1044 816 396 114 -856 -1090 -750 380 574 513 954 220 -908 -954 -900 -251
3924 -251 178 772 1066 676 -308 -751 -871 -790 -111 552 682 539 505 116 -705 -1100 -434 149 1027 345 819
3945 819 256 -478 -1228 -836 -60 463 425 844 318 -110 -569 -1010 -610 45 591 533 323 762 -139 -569 -980
3966 -980 -523 297 410 723 318 455 -184 -1016 -1004 26 334 622 873 678 -384 -606 -804 -621 175 361
3986 361 356 621 157 -359 -583 -692 -630 178 521 725 710 99 -532 -1119 -687 -39 -44 807 641 562 -356 -715
4008 -715 -625 -361 -8 191 471 997 250 -702 -415 -535 -330 32 499 1032 805 35 -152 -686 -720 -70 402
4029 402 649 725 222 -198 -984 -1011 -542 127 163 283 1223 660 -453 -788 -515 -422 51 375 1021 883 -63
$$ packed form
3882G86O0k10l13k29m73o20M31J261P2L15p33k55k33p84K50M22P41J69K7l97j99
3903H8l88n27lM61P85O28k28m20k82r70k34L40J130J94o1M41p34j128m6N4O49
3924b51M29N94K94l90r84m43j20Q1O79O63J30j43l4l89q21l95O66N83Q78o82M74
3945H19n63p34p50L92P76N23l8M19n26m28m59m41M00O55N46n8k10M39r01m30m11
3966i80M57Q20J13L13m05J37o39q32J2J030L08K88K51j95j062k22j98J83P96J86
3986C61nK65m64n16k24j09O2Q08L43K04j5o11o31n87M32O48nQ51j66p9r18l59
4008g15R0K64L53J99K80N26p47r52K87j20K05L62M67N33k27p70j87n34l4O50M72
4029D02K47P6n03m20p86k7M69O69L6J20R40n63j113l35K73R3M73L24O46j38r46
$$ plain form
4050 -63 -539 -598 -834 -104 24 706 823 699 79 -721 -823 -506 -27 31 533 1155 532 -546 -857 -559 -546
4071 -546 -448 465 1054 524 -187 -386 -654 -918 -140 -150 896 813 528 -207 -486 -755 -562 225 116 730 742
4092 742 442 -330 -845 -700 -415 -241 368 804 937 10 -366 -474 -227 -569 172 868 872 341 13 -234 -741
4113 -741 -179 -243 449 740 676 119 -453 -681 -559 -401 9 266 760 544 108 -431 -61 -602 -640 127 1021
4134 1021 568 87 -46 -317 -724 -607 -308 521 750 271 337 -171 -686 -434 -485 -318 335 876 251 249 -244
4155 -244 -307 -749 -441 270 801 686 315 -73 286 -436 -891 -95 794 691 421 118 -152 -431 -773 -564
4175 -564 292 551 192 316 -154 -500 -497 -667 -185 170 837 659 234 -64 -347 -335 -790 -351 465 478 622
4196 622 315 -343 -390 -593 -181 -11 494 404 306 208 -122 -785 -689 -206 330 545 754 507 -44 -283 -504 -594
$$ packed form
4050f3m76n9k36P30J28O82J17j24o20q00j02L17M79N8N02O22o23j078l11K98J3
4071e46R8R13N89n30p11j99k68k64P78j0J046q3k85p35k79k69J93P87j09O14J2
4092G42l00p72n15J45K85J74O09M36J33r27l76j08K47l42P41O96Mn31l28k47n07
4113g41N62o4O92K91o4n57n72k28J22J58M10K57M94k16m36n39L70n41l8P67Q94
4134A021m53m81j33k71m07J17K99Q29K29m79O6n08n15K52n1J67O53N41o25km93
4155b44o3m42L08P11N31j15l71l88L59p22m55P96Q89j03k70l03k70k79l42K09
4175e64Q56K59l59J24m70l46Lj70M82L55O67j78m25k98k83J2m55M39Q16J3J44
4196F22l07o58m7k03M12J70N05r0r8r8l30o63R6M83N36K15K09k47n51k39k21r0
$$ plain form
4218 -594 -324 757 614 347 177 -22 -363 -703 -454 496 488 456 431 494 26 -496 -789 -114 260 505 611
4239 611 190 -63 -151 -826 -469 73 391 626 446 217 269 -748 -661 -272 198 320 463 151 396 -213 -699
4260 -699 -1106 -426 255 621 727 590 89 -556 -688 -475 43 315 579 709 270 -214 -732 -541 -619 -27
4280 -27 478 599 442 348 -133 -566 -664 253 -57 518 671 666 110 -523 -510 -147 -117 -2 291 443 55 -11 -368
4303 -368 -612 -366 33 593 542 455 -28 -132 -710 -592 -254 434 448 523 541 354 -520 -682 -267 -153 93 379
4325 379 696 382 -58 -928 -629 -247 -260 411 486 267 93 -414 -355 -676 -64 446 555 743 362 109 -523
4346 -523 -921 -380 -429 -93 279 554 294 -170 -424 -428 -328 -211 452 560 771 193 -605 -615 -251 -393 166
4367 166 455 758 142 158 -289 -512 -653 -282 237 600 578 278 262 -575 -579 -256 -18 643 771 554 -36 -167
$$ packed form
4218e94K70J081j43k67j70j99l41l40K49R50ql2k5O3m68n22k93O75L74K45J06
4239F11m21k53q8o75L57N42L18K35j80k29N2j017Q7L89M70J22J43l12K45o09m86
4260f99m07O80O81L66J06j37n01o45j32K13N18K72K64J30m39m84n18J91p8N92
4280b7N05J21j57r4m81m33r8R17l10N75J53nn56o33J3L63L0J15K93J52l88o6l57
4303c68k44K46L99N60n1q7m83j04n78J18L38O88J4P5J8j87q74j62M15J14K46K86
4325C79L17l14m40q70K99L82j3O71P5k19j74n07N9l21O12N10J09J88l81k53o32
4346e23l98N41m9L36L72K75k60m64k54mJ00J17O63J08K11n78p98j0L64j42N59
4367A66K89L03o16J6m47k23j41L71N19L63k2l00j6q37mL23K38O61J28k17n90j31
$$ plain form
4389 -167 -647 -625 -242 -270 443 530 -22 15 -264 -355 -303 -101 56 537 743 71 -141 -424 -329 -607 -253 681
4411 681 575 577 185 -380 -543 -487 -147 88 745 750 161 20 -414 -529 -223 -400 61 756 510 151 -212 -203
4433 -203 -290 -547 135 355 515 622 -174 -278 -398 -427 -431 172 441 494 197 -29 -31 -428 -820 -60 329 602
4455 602 333 262 -55 -348 -641 -617 -188 122 666 615 -75 -134 -225 -426 -519 124 630 554 244 -79 -289 -183
4477 -183 -712 -372 408 496 269 117 262 -152 -479 -394 -47 614 444 318 70 -161 -384 -423 -755 156 578
4498 578 494 314 333 -118 -445 -497 161 423 795 242 351 67 -323 -412 -198 -176 441 691 165 -47 -119 -368
4520 -368 -581 -62 231 619 333 90 256 -70 -259 -567 -234 349 634 361 122 -72 -445 -626 -211 337
4540 337 179 540 422 56 -10 -466 -236 -402 174 557 520 266 176 35 -373 -469 125 149 287 273 16 163
$$ packed form
4389a67m80K2L83k8P13Q7n52L7k79r1N2K02J57M81K06o72k12k83R5k78L54R34
4411F81j06Kl92n65j63N6L40K35O57Nn89j41m34j15L06j77M61O95k46l59l63R
4433b03q7k57O82K20J60J07p96j04j20k9mO03K69N3k97k26kl97l92P60L89K73
4455F02k69p1l17k93k93K4M29L10N44n1o90n9r1k01r3O43N06p6l10l23k10J06
4477a83n29L40P80Q8k27j52J45m14l27Q5L47O61j70j26k48k31k23l9l32R11M22
4498E78q4j80J9m51l27n2O58K62L72n53J09k84l90q9K14K2O17K50n26k12p2k49
4520c68k13N19K93L88k86k43J66l26j89l08L33N83K85k73k39j94l73j81M15N48
4540C37j58L61j18l66o6m56K30j66N76L83l7k54r0j41m08r6N94K4J38j4k57J47
$$ plain form
4562 163 -453 -532 -347 -49 378 239 417 361 -301 -689 -729 -148 -151 31 526 420 159 -371 -438 -512 -153 54
4584 54 572 316 322 245 -385 -431 -378 -13 429 126 517 -64 254 -395 -521 228 -58 181 111 426 148 -386
4606 -386 -326 -325 -50 56 456 496 201 -238 -208 -478 -375 -60 41 278 315 -84 64 -321 -616 -151 196 137
4628 137 191 226 -99 -384 -593 -486 64 -38 398 524 579 -218 -739 -352 -137 -313 325 276 582 239 -130
4649 -130 -76 -594 -45 427 136 179 900 -96 -413 -403 -137 136 44 482 630 -129 -21 -333 -213 -341 -70
4670 -70 317 382 550 -38 -244 -230 -194 -389 -18 113 396 292 149 -151 -320 -233 -311 -179 58 228 -181 -152
4692 -152 -148 -445 -639 -177 -37 467 486 289 -274 -33 -310 -287 92 -42 369 346 158 -225 -445 -275 190 117
4714 117 240 335 189 -370 -132 -413 -332 -3 168 407 184 -35 -10 -260 -218 -278 -189 263 400 333 -41 -109 -410
$$ packed form
4562A63o16p9J85K98M27j39J78n6o62l88m0N81lJ82M95j06k61n30o7p4L59K07
4584E4N18k56Op7o30m6N3L65M42l03L91n81L18o49j26P49k86K39p0L15k78n34
4606c86O0JK75J06M00M0k95m39L0k70J03L15J01K37L7l99J48l85k95M65L47n9
4628A37N4L5l25k85k09J07N50j02M36J26N5p97n21L87K15j76O38m9L06l43l69
4649a30N4n18N49M72k91M3P21r96l17J0K66K73r2M38J48p59J08l12J20j28K71
4670g0L87O5J68n88k06J4L6j95L71J31K83j04j43l00j69Q7p8J32K37J70m09K9
4692a52Mk97j94M62J40N04J9j97n63K41k77K3L79j34M11k3j88l83k20J70M65p3
4714A17J23R5j46n59K38k81Q1L29J71K39k23k19K5k50M2o0Q9M52J37o7l74o8l01
$$ plain form
4737 -410 -440 -362 386 220 427 31 -95 -544 -327 -168 -40 237 582 94 -39 -488 -58 -341 -569 187 190
4758 190 859 243 323 -289 4 -257 -223 111 285 -106 179 4 66 -108 -458 -104 442 438 90 -127 -337 -142
4780 -142 -96 -211 -117 569 196 -147 341 18 -335 -160 -101 392 -30 260 183 184 165 -264 -92 61 166 111 397
4803 397 189 -245 -272 -399 -52 -22 208 331 33 30 -189 -294 -581 -105 156 -104 324 134 232 -268 -221 -326
4825 -326 40 379 127 -104 -56 -117 -466 -464 -88 -180 21 411 10 194 -264 -178 -428 -150 509 211 120 226
4847 226 171 -52 -811 17 182 58 38 231 282 83 -398 -315 59 -163 125 540 292 55 -246 -486 -261
4868 -261 -49 20 507 279 259 127 -47 -233 -139 -160 305 194 53 125 -200 -540 -171 28 -208 116 331 11
4890 11 81 -132 -414 -174 0 165 239 337 315 -10 -60 -451 -417 -115 128 -199 -63 -31 -144 -465 -98 17 68
$$ packed form
4737d10l0P8P48j66K07l96j26m49K17J59J28K77L45m88j33m49M30k83k28P56L
4758A90O69o16Q0o12K93k61L4L34J74l91K85j75O2j74l50L54N46ml48k17k10J95
4780a42M6j15R4O86l73l43M88l23l53J75N9M93m22K90p7Jj9m29J72J53J05n5K86
4803C97k08m34k7j27L47L0K30J23k98lk19j05k87M76K61k60M28j90R8n00M7j05
4825c26L66L39k52k31M8o1l49KL76r2K01L90m01J84m58Q6k50K78O59k98r1J06
4847B26n5k23p59Q28J65j24k0J93N1j99m81Q3L74k22K88M15k48k37l01k40K25
4868b61K12O9M87k28k0j32j74j86R4k1M65j11j41P2l25l40L69J99k36L24K15l20
4890A1P0k13k82K40J74J65P4R8k2l25n0l91L4L02K43l27J36L2j13l21L67J15N1
$$ plain form
4913 68 105 337 348 -35 -12 -158 -38 -185 -72 363 205 186 -374 -337 -246 -293 -70 -140 18 255 148 32 -251
4936 -251 -162 -24 -178 -71 360 132 16 -158 -625 77 189 178 156 464 449 -121 144 -447 -149 140 103 273
4958 273 390 427 -281 -591 249 -206 -53 -64 440 244 -230 42 -210 -306 -22 14 98 451 -72 -170 -463 424
4980 424 -365 -205 63 113 160 178 -304 -300 -175 -196 -147 199 -26 324 -50 -64 -127 -261 -356 49 31 5 101 -63
5004 -63 -222 -11 -75 -92 148 161 277 -19 -106 -167 -79 -289 -28 71 386 252 87 248 -345 -233 -265 76 49
5027 49 451 95 34 -178 60 -20 -48 528 126 -55 -80 -296 -108 -324 -125 153 88 453 338 15 48 -129
5049 -129 -25 -300 -164 290 143 -106 209 26 -9 -465 144 85 482 -64 -318 -107 -309 -351 23 -12 437
5070 437 415 6 -21 130 65 -420 -295 147 146 60 117 -6 -28 -209 -691 40 500 264 132 216 -99 135 -94
$$ packed form
4913F8L7K32J1l83K3j46J20j47J13M35j58j9n60L7R1m7K23p0J58K37j07j16k83
4936b51Q9J38j54J07M31k28j16j74m67P02J12j1k2L08j5n70K65n91K98K89l7J70
4958B73J17L7p08l10Q40m55J53j1N04j96m74K72k52r6K84L6Q4L53n23r8k93Q87
4980D24p89J60K68N0M7J8m82MJ25k1M9L46k25L50l74j4o3j34r5M05j8k6R6j64
5004f3j59K11o4j7K40J3J16k96q7o1Q8k10K61R9L15j34j65J61n93J12l2L41k7
5027D9M02l56o1k12K38q0k8N76m02j81k5k16J88k16J99K78o5L65j15l23L3j77
5049a29J04k75J36M54j47k49L15j83l5m56O09n9L97n46k54K11k02m2L74l5M49
5070D37k2m09k7J51o5m85J25M42jq6N7j23k2j81m82P31M60k36j32Q4l15K34k29
$$ plain form
5093 -94 -150 235 287 -24 189 90 -55 -339 23 -41 -31 400 53 313 -42 -245 -447 -182 -130 -185 367 96 372
5116 372 -185 -386 -339 -194 398 505 2 218 105 -48 22 -283 16 115 222 153 30 133 -238 -315 -44 22
5138 22 -40 -132 47 70 -45 132 -214 -22 -54 -96 96 154 -33 -15 126 -276 -64 268 233 191 -428 -94 -9 -5
5162 -5 -154 -130 222 -63 -123 -50 -236 -386 -92 -195 -323 475 88 449 -168 -107 -219 212 117 -16 451 430 76
5185 76 42 195 -129 -466 -137 -75 203 246 -1 -177 -150 43 -114 -117 19 382 376 384 -236 62 -18 105 -53 225
5209 225 255 50 -30 -149 -168 -53 126 -217 437 227 80 -41 -20 -293 -151 -92 232 136 431 151 -243 -161
5231 -161 -187 -341 -134 -39 426 46 -233 -400 -73 -168 22 253 252 246 -17 33 16 -102 -319 -78 78 142 237 -65
5255 -65 -345 -228 -182 -224 -114 90 118 34 -56 -321 24 -82 62 -98 243 317 31 -250 -282 -96 -156 -118 -118 331
$$ packed form
5093i4n6L85N2l11K13r9j45k84L62o4J0M31l47K60l55k03k02K65N2n5N52k71K76
5116C72n57k01M7J45N92J07n03K16j13j53P0l05K99R9J07o9j23J03l71p7K71O6
5138B2o2r2J79K3j15J77l46J92l2m2J92N8j87J8J41m02K12L32l5m2o19L34Q5M
5162ej49K4L52k85o0P3j86j50K94j03j28P98l87L61o17O1j12M31r5j33M67k1l54
5185G6l4J53l24l37L29O2K78M3k47j76K7J93j57lJ36L63oQo20K98q0J23j58K78
5209B25L0k05q0j19j9J15J79l43O54k10j47j21K1k73J42N9L24r6K95k80l94Q2
5231a61k6j54K07R5M65l80k79j67L27r5J90K31jok63N0j7j18k17K41J56O4R5l02
5255f5k80J17M6m2J10K04K8q4r0k65L45j06J44j60L41P4k86k81l2J86o0L8%M49
$$ plain form
5279 331 306 222 32 -272 -51 90 -183 -142 32 187 176 -7 -41 -326 -98 -23 161 141 -148 -29 -64 -50 -123
5302 -123 44 49 153 473 -71 -38 -247 -99 -134 125 -176 124 -22 158 -82 -508 -115 -435 381 132 167 204
5324 204 -199 -142 -83 -67 -375 68 194 -92 314 -294 -250 124 30 110 415 -70 125 208 -63 -209 -175 -214 -191
5347 -191 278 60 -96 -43 -173 121 -258 64 30 275 106 85 -51 52 -131 -12 58 85 -117 139 110 35
5369 35 -15 36 -15 -246 263 232 11 -53 -482 -53 -325 209 237 -6 -65 -72 -31 -26 -157 -97 101 25 -16 98 -70
5394 -70 -187 -42 412 142 4 551 54 -94 118 102 70 -131 156 182 -137 -40 58 -152 -91 -148 -106 210 28
5417 28 -164 111 61 265 -248 46 195 8 256 138 49 -95 -53 -200 -181 -7 21 55 218 -21 29 -180 -238
5440 -238 -139 -60 194 -99 95 148 -57 95 183 32 48 -34 236 -11 292 -147 -281 -125 -268 -173 221 212 319
$$ packed form
5279C31k5q4j90l04K21J41k73M1J74J55j1j83l4k85K28P5J84k0k89J19l5J4p3
5302a23J67NJ04L20n44L3k09J48l5K59l01L00j46J80k40m26L93l20Q16k49L5L7
5324B04m03N7N9J6l08M43J26k86M06o08M4L74r4Q0L05m85J95Q3k71j46L4l9K3
5347a91M69k18j56N3j30K94l79L22l4K45j69k1j36J03j83J19P0K7k02K56k9p5
5369C5n0N1n1k31N09l1k21o4m29M29k72N34K8k43n9pM1Nj31O0J98p6m1J14j68
5394g0j17J45M54k70j38N47m97j48K12j6l2k01K87K6l19R7R8k10O1n7M2L16j82
5417B8j92K75n0K04n13K94J49j87K48j18q9j44M2j47J9J74K8L4J63k39N0k09n8
5440b38R9P9K54k93J94N3k05J52Q8j51J6q2K70k47L03m39j34J56j43R5L94rJ07
$$ plain form
5463 319 42 51 -13 -128 -164 -44 -12 347 74 -334 -124 101 85 -24 -63 28 -9 91 -447 -61 116 -124 -75
5486 -75 241 97 152 -310 -251 -199 49 49 278 -531 62 22 -360 -236 76 -42 -77 -230 191 188 -5 -116 -61 -4
5510 -4 79 45 299 83 121 -55 -138 93 -122 -126 186 34 2 -48 -114 115 24 -149 62 -1 186 462 -131 -174 -121
5535 -121 42 67 -214 197 221 223 -62 -2 328 -90 111 233 72 -51 12 380 -132 97 53 -110 293 28
5557 28 -364 83 -252 -7 -57 160 -241 -14 71 -97 -488 -102 73 -72 -183 112 39 143 -142 -5 -120
5578 -120 225 112 157 206 35 117 34 17 46 483 -223 119 229 93 31 -171 73 -420 129 107 234 -100 -59
5601 -59 -19 173 -82 -186 -142 298 173 6 128 -150 -117 157 61 147 198 85 246 -175 31 -193 -86 59
5623 59 85 29 261 116 -76 -24 -160 -239 -53 208 -342 38 103 5 176 89 49 359 12 -40 154 -106 -124 248
$$ packed form
5463C19k77Ro4j15l6J20L2L59k73m08K10K25j6j09l9R1l7J00n38L86J77k40M9
5486g5L16j44N5m62N9N2K48%K29q09N93m0l82J24L12j18l5j53M21lj93j11N5N7
5510dQ3l4K54k16L8j76q3K31k15mL12j52l2n0o6K29r1j73K11o3J87K76n93m3N3
5535a21J63K5k81M11K4Kk85O0L30m18K01J22j61j23O3L68n12K29m4j63M03k65
5557B8l92M47l35K45n0K17m01K27Q5j68l91L86J75j45j11K95p3J04k85J37j15
5578a20L45j13M5M9j71Q2q3j7K9M37p06L42J10j36o2k02K44m93N49k2J27l34M1
5601e9M0J92k55j04M4M40j25j67J22k78L3K74r6Q6N1j13J61m21K06k24J07J45
5623E9K6n6K32j45j92N2j36p9J86K61n50L80O5r8J71q7m0L10l47n2J94k60j8L72
$$ plain form
5647 248 66 150 197 -107 235 58 151 -49 -15 140 -5 -107 13 -168 -113 62 92 -1 -165 -234 -484 -56 -395
5670 -395 190 209 -152 134 244 144 44 -148 158 -292 93 203 195 -89 -218 272 152 149 112 -3 166 52
5692 52 -57 221 -136 180 199 21 66 190 233 -94 135 -76 38 332 -53 94 -513 -25 91 -61 -21 -263
5714 -263 176 263 65 -147 -209 -67 146 -44 -21 -164 6 -37 -58 262 199 82 160 -197 110 -167 -22 150
5736 150 53 57 -207 -46 -275 -17 -76 33 75 -122 180 29 95 -178 124 -35 325 113 -232 41 150 131
5758 131 -179 -27 -406 87 50 94 -12 -95 97 348 -13 -12 -130 -199 202 -252 -245 254 115 -121 115 186 231
5781 231 -143 63 46 -135 -6 38 41 252 -152 -243 293 12 110 42 3 64 -34 -98 -340 -98 -117 -162 -43 -55 -125
5806 -125 48 -148 -201 220 175 38 -61 -1 203 -390 -37 -163 198 13 -194 161 62 -112 91 -117 126 30
$$ packed form
5647B48j82Q4M7l04L42j77R3k00L4J55j45j02J20j81N5J75L0r3j64o9k50M28l39
5670c95N85J9l61K86J10j00j00j92L06m50L85J10qk84j29M90j20ll7j15J69j14
5692E2j09K78l57L16J9j78M5J24M3l27K29k11J14K94l85J47o07M88J16j52M0k42
5714b63M39Q7j98k12o2J42K13j90K3j43J70m3k1L20o3j17P8l57L07k77J45J72
5736A50r7Mk64J61k29K58n9J09M2j97L02j51O6k73L02j59L60k12l45K73J09j9
5758A31l10J52l79M93l7M4j06q3J92K51l61Jj18o9M01m54PM99j39k36K36P1M5
5781B31l74K06j7j81J29M4LK11m04r1N36k81R8o8l9O1r8o4k42K42j9m5J19j2p0
5806a25J73j96n3M21m5j37r9O0K04n93L53j26L61j85k07L55r9j74K03k08K43r6
$$ plain form
5828 30 122 -331 138 -99 -185 -157 51 87 112 10 73 36 -126 -91 -189 257 78 -9 37 -79 125 118 122 57 -38 213
5854 213 -49 53 -132 175 135 -145 -221 95 130 -50 -360 -18 87 -162 -28 -73 107 -211 -119 158 -375 -153
5876 -153 -37 -110 30 298 9 195 236 -45 8 -86 554 145 263 61 -9 -469 102 -140 -208 -106 244 -37
5898 -37 -165 234 -64 -272 39 229 -105 88 175 -35 168 133 -155 -12 -118 69 -354 -339 149 13 36 56
5920 56 88 41 -69 -285 198 -124 32 79 97 -227 114 85 -40 311 -201 -28 -174 -88 312 -101 69 -65
5942 -65 24 -82 -24 9 137 99 163 189 -121 149 -131 192 -201 86 -208 -242 128 -22 93 -167 -16 -342 -159
5965 -159 143 211 135 -255 4 0 91 -162 -65 -160 -175 -259 74 2 -88 -95 32 -323 271 51 221 249 174 -1 -123
5990 -123 125 191 275 325 -58 26 44 60 21 -151 84 197 0 -345 -227 337 -124 -286 -112 237 4 66 -14
$$ packed form
5828C0R2m53M69k37q6K8K08L6K5j02O3l7j62L5r8M46j79q7M6j16K04pMo5r5K51
5854B13k62J02j85L07m0k80p6L16L5j80l10L42J05k49J34m5J80l18R2K77n33K22
5876a53J16p3J40K68k89J86M1k81N3r4O40m09J18k02p0m60N71k42o8J02L50k81
5898c7j28L99k98k08L11J90l34J93Q7k10K03l5k88J43j06J87m23J5M88j36K3K0
5920E6L2m7j10k16M83l22J56M7J8l24L41k9j25L51n12J73j46Q6M00m13J70j34
5942f5Q9j06N8L3J28l8O4K6l10K70k80L23l93K87k94l4L70j50J15k60J51l26J83
5965a59L02O8p6l90K59mR1k53R7r5j5q4L33p2r0pJ27l55N94k20J70K8p5j75j22
5990a23K48O6Q4N0l83Q4J8J6l9j72K35J13j97l45J18N64m61j62J74L49k33O2q0
$$ plain form
6013 -14 380 -128 -72 238 7 -34 262 105 169 -18 265 49 113 183 24 285 114 -127 -178 -20 36 -86 168
6036 168 222 365 -58 -4 17 -358 260 -262 169 -24 -7 -191 96 0 -27 78 -140 -17 -196 253 -151 -312
6058 -312 -140 -179 -199 102 -13 191 258 47 -160 -244 32 -91 -409 -39 29 -295 -4 197 -140 -76 104 20
6080 20 -120 462 7 7 -42 -95 -341 222 170 170 -41 -41 -95 -138 -166 13 -131 -9 319 -93 -108 68 -102 466 156
6105 156 64 -25 -121 260 -31 -196 -316 -310 247 231 359 -167 104 -144 215 226 132 22 -29 201 30 83 -125
6128 -125 -3 -33 331 -56 195 70 -67 -19 114 190 162 141 -92 -31 -71 270 83 -309 161 -44 52 5 -188
6151 -188 51 -172 -20 82 -56 148 237 -21 23 238 114 171 266 133 -76 238 443 -110 -81 -303 -258 78
6173 78 104 308 93 54 -176 -56 -169 -147 -83 -166 102 -67 -81 -199 -172 -305 -199 149 100 -123 152 65 -95
$$ packed form
6013a4L94n08N6L10k31m1K96j57O4j87K83k16O4P0j59K61j71k41n1J58N6j22K54
6036A68N4J43m23N4K1l75O18n22M31j93J7j84K87r6k7J05k18J23j79M49m04j61
6058c12J72l9k0L01j15K04O7k11k07q4K76j23l18L70O8l24K91K01l37O4J80q4
6080B0j40N82m55%m9n3k46N63n2%k11%n4m3k8J79j44J22L28m12j5J76j70N68l10
6105A56r2q9r6L81k91j65j20ON57j6J28n26K71k48L59J1r4j10n1K30j71N3k08
6128a25J22l0L64l87K51j25j37M8J33P6k8k1k33O1m0L41j87l92M70k05R6m7j93
6151a88K39k23J52J02j38K04Q9k58M4K15j24N7R5j33k09L14K05n53K9k22M5L36
6173G8K6K04k15l9k30J20j13K2O4q3K68j69j4j18K7j33J06L48m9k23K75q7j60
$$ plain form
6196 -95 27 -39 175 11 -42 33 76 12 43 167 -225 -124 -126 153 -161 256 -91 -158 121 15 68 48 9 -188
6220 -188 -176 -112 -6 -38 -92 19 166 233 46 38 155 -48 -90 163 -112 212 235 -17 342 -261 -217 -65 -157 -264
6244 -264 16 94 156 -155 48 93 -247 -171 -69 169 56 -175 -109 31 -17 89 -87 88 106 160 149 -160 -36
6267 -36 -147 -75 73 119 107 -105 159 -200 -110 -99 168 -217 175 283 129 40 180 -144 91 16 231 -223 -112
6290 -112 -358 -133 -21 -91 272 302 363 -147 18 -43 -309 -176 -292 181 167 -47 95 -40 -47 -365 32 -217
6312 -217 233 -57 -139 -201 -87 -215 -300 -30 65 -81 55 93 -283 -113 -65 180 -208 -65 -111 7 169 99 104
6335 104 -19 -131 -72 159 -30 -115 -314 70 7 -52 -97 274 -57 205 384 41 -44 -73 -16 -70 -174 94 275
6358 275 -39 100 139 212 -170 87 121 151 93 54 -228 70 -61 -351 115 139 218 175 -111 -213 -23 -171 -404
$$ packed form
6196i5J22o6K14j64n3P5M3o4L1J24l92J01kK79l14M17l47o7K79j06N3k0l9j97
6220a88J2O4J06l2n4J11J47O7j87qJ17k03m2K53k75L24K3k52L59o03M4J52r2j07
6244b64K80P8O2l11K03M5l40P6J02K38j13k31O6J40m8J06j76J75J8N4j1l09J24
6267c6j11P2J48M6j2k12K64l59R0J1K67l85L92J08j54q9J40l24K35p5K15m54J11
6290a12k46K25J12p0L63L0O1n10J65o1k66J33j16M73j4k14J42j35pl18L97k49
6312b17M50k90q2o2J14j28q5K70R5j46J36L8l76J70M8K45l88J43m6J18J62p0N
6335A04j23j12N9K31j89q5j99L84o3n9m5L71l31K62J79l43q5k9N7n4j04K68J81
6358B75l14J39L9P3l82K57L4L0n8l9k82K98j31k90M66K4P9m3k86j02J90j48k33
$$ plain form
6381 -404 -71 -230 -103 136 -13 46 -5 -241 -211 48 292 24 215 -150 5 -110 -54 -63 287 -15 72 -26 -146
6404 -146 -122 -135 152 99 438 -291 269 116 270 37 37 -22 -313 -34 47 55 -29 -60 -334 73 -256 -30 286 165
6428 165 -9 -529 -123 -167 109 -350 -234 175 -149 31 -349 -200 -14 -323 179 -15 109 68 58 -397 -8
6449 -8 -238 0 -41 7 4 8 65 -102 -45 -185 -73 203 -17 -108 -336 -61 -3 -181 161 354 108 275 411 42
6473 42 -94 -42 86 -161 524 -144 16 210 -314 -206 -2 -97 60 -38 -91 -279 56 7 94 -94 75 145 88
6496 88 23 -194 106 -38 -182 -334 113 183 345 -122 91 -84 -94 -202 -62 111 -94 19 -73 -152 -96 18
6518 18 -47 61 -87 32 -179 -191 201 -13 -352 -74 -132 162 75 24 21 66 -201 -178 177 244 -165 -102 245 7
6542 7 -158 -296 -6 -134 182 -199 181 121 -42 -66 12 51 170 127 -73 272 79 300 145 -360 -328 188 157
$$ packed form
6381d04L33j59J27K39j49N9n1k36L0K59K44k68J91l65J55j15N6rL50l02Q7r8j20
6404a46K4j3K87n3L39p29N60j53J54k33%n9k91K79Q1Qq4l1k74M07l29K26L16j21
6428A65j74n20M06m4K76m59J16M09l24J80l80J49J86l09N02j94J24m1j0m55L89
6449hk30K38m1M8lMN7j67N7j40J12K76k20r1k28K75N8j78L42J93k46J67J36l69
6473D2j36N2J28k47O85o68J60J94n24J08K04r5J57r8n3j88L35m9Q7j88J69P0n7
6496H8o5k17L00j44j44j52M47P0J62m67K13j75j0j08J40J73k05J13r2p9N6J14
6518A8o5J08j48J19k11j2L92k14l39K78n8K94q7n1lM5k67K3L55O7m09O3L47k38
6542Gj65j38K90j28L16l81L80o0j63k4P8L9J19m3k00L45j93K21j55n05L2N16l1
$$ plain form
6565 157 -161 321 -90 -207 -60 -67 -175 12 31 118 77 -144 -86 0 -88 -53 -107 37 156 35 -163 -54 -50 56
6589 56 17 -67 61 207 321 -249 8 -386 73 -115 133 392 201 121 -166 -14 -18 154 316 68 -66 -102
6611 -102 23 -128 202 -104 277 85 -107 126 130 101 -181 198 1 66 48 403 419 61 -240 179 229 -259
6633 -259 20 16 17 -1 -206 203 210 -56 -39 66 -161 311 -1 -104 -153 130 -356 -338 62 286 28 -121 -502
6656 -502 127 124 -40 130 198 -5 130 34 -248 -369 -94 -111 57 -61 135 55 -140 272 14 -56 126 189 332
6679 332 266 15 -23 133 0 -52 24 -56 75 -217 62 316 -380 -145 -132 -194 53 43 -222 -125 45 -361 -321
6702 -321 -86 64 478 -144 -59 -37 -189 77 -258 -111 325 -21 -99 6 261 -126 -108 51 -54 96 -46
6723 -46 -66 -146 -50 -58 50 -220 213 -28 -6 71 71 -263 -58 -68 92 322 24 20 -173 -119 164 -296 57 123 -99
$$ packed form
6565A57l18M82m11j17J47pj08J87J9Q7m1k21N8Q6q8L5n4J44J19j21j98J09MJ06
6589E6l9q4J28J46J14n70K57l94M59j88K48K59j91q0k87J52mJ72J62k48j34l6
6611a02J25j51L30l06L81j92j92K33Mk9k82L79j97O5j8L55J6l58l01M19N0m88
6633b59K79mJj8k05M09Pk66J7J05k27M72l12j03m9K83m86J8M00K24k58j49l81
6656e02O29lj64J70O8k03J35r6k82j21K75j7J68j18J96q0j95M12k58p0J82O3J43
6679C32o6k51l8J56j33n2P6q0J31k92K79K54o96K35J3o2K47j0k65R7J70m06M0
6702c21K35J50M14o22Q5K2j52K66l35J47M36l46p8J05K55l87J8J59j05J50j42
6723d6k0q0R6qJ08k70M33k41K2P7%l34K05j0J60K30k98mj93N4K83m60L53O6k22
$$ plain form
6748 -99 -156 -95 -22 -193 -395 -63 169 44 130 220 217 -119 -28 225 114 112 112 278 -26 -168 59 -98 51 137 102
6773 102 -41 -24 -358 -178 -341 -126 -228 254 241 12 150 -49 112 -188 -257 -129 109 124 256 91 -71
6794 -71 117 -231 -122 3 180 206 -54 45 232 -110 -210 -72 -191 77 93 321 32 -106 -99 -161 -166 -8 30
6817 30 488 452 197 8 -141 -42 -22 242 274 -348 4 114 -212 5 86 -295 -197 -62 89 131 -460 287 -57
6840 -57 270 342 106 14 123 2 -149 -43 -100 -164 128 137 302 -105 -89 127 191 208 -81 38 243 -114 27
6863 27 -246 253 -227 -127 -145 114 203 37 -119 118 -184 47 -86 126 219 154 287 89 -229 27 -210 125
6885 125 -249 338 -2 76 105 -227 7 128 -4 165 34 -119 -114 -293 -302 -93 -176 142 124 271 88 -55 -226
6908 -226 200 20 -135 130 -131 138 -92 -23 -75 81 -3 26 -10 52 -143 -64 -220 -345 -368 -81 -73 252 284 289
$$ packed form
6748i9n7O1P3j71k02L32K32j25Q6R0ll36R1K53j11k%J66l04j42K27j57J49Q6l5
6773A02j43J7l34J80j63K15j02M82j3k29J38j99J61l00o9J28K38J5J32j65j62
6794g1J88l48J09J25J77K6k60R9J87l42j00J38j19K68J6K28k89j38Po2nJ58L8
6817C0M58l6k55j89j49R9K0K64L2o22L52J10l26K17Q1l81R8J35J51M2n91P47l44
6840e7L27P2k36r2J09j21j51J06n7o4K92RJ65m07J6K16O4J7k89J19K05l57J41
6863B7k73M99m80J00j8K59Q9j66j56K37l02K31j33K12R3o5J33j98l18K56k37L35
6885A25l74N87l40P8K9l32K34J21j32J69j31j53Nj79rK09q3L18j8J47j83j43j71
6908b26M26j80j55K65k61K69k30O9n2J56q4K9l6O2j95P9j56j25k3K87QL25L2N
$$ plain form
6932 289 -192 -101 -145 -34 -231 302 206 52 -224 -325 -59 67 16 100 186 261 -18 142 -137 -127 -195 172 256
6955 256 205 211 150 7 -204 -220 -86 -128 -205 46 472 -41 -394 -318 66 -45 248 563 112 243 -111 76 -12
6978 -12 -19 262 30 83 262 24 71 -53 -249 6 345 -64 -22 -198 -44 125 59 -123 -146 115 146 151 105 -91
7002 -91 -131 -343 -136 -57 -89 473 363 106 93 -206 -80 -268 75 -49 62 199 247 -234 -112 -48 -145 2 261
7025 261 -12 115 -423 -204 57 -247 217 38 253 144 -28 38 1 99 -308 -311 -160 108 172 223 -24 -124
7047 -124 0 -453 -32 50 270 240 109 -42 -201 -175 254 282 226 58 255 25 -9 -184 -107 -11 -51 70 69 -34
7071 -34 64 -50 -87 -37 -250 209 -67 411 215 45 -206 -168 27 132 -18 58 299 -52 -10 106 -314 -87
7093 -87 269 -25 -106 32 63 -95 -113 -71 60 201 106 106 258 -201 24 224 82 32 142 -285 -53 -329 49
$$ packed form
6932B89m81R1m4J11j97N33r6j54k76j01K66J26n1Q4Q6P5k79J60k79J0o8L67Q4
6955B56n1Oo1j43k11j6J34m2p7K51M26n13l53P6L84j11K93L15m51J31l54J87q8
6978a2pK81k32N3J79k38M7j24j96K55L39m09M2j76J54J69o6j82k3K61L1Nm6j96
7002i1m0k12K07P9l2N62j10k57j3k99J26j88L43j24J11J37M8m81J22O4r7J47K59
7025B61k73J27n38K19K61l04M64j79K15j09j72O6l7R8m07lJ51K68O4N1k47j00
7047a24J24m53M21Q2K20l0j31j51j59K6M29K8n6j68J97k30l4j75P7R6m0J21jj03
7071c4R8j14l7N0k13M59k76M78j96j70k51L8J95J05j50P6K41l51M2J16m20K27
7093h7L56k94q1J38L1j58j8M2J31J41r5%J52m59K25K00j42n0J10m27K32k76L78
$$ plain form
7116 49 136 335 211 88 156 -25 -38 -155 16 -273 209 4 146 141 113 -68 -29 104 43 -139 276 120 101
7139 101 106 -51 -225 -21 -126 44 203 259 493 302 -68 -135 -135 -99 -89 22 180 -90 -295 44 77 101 113 -128
7163 -128 -12 242 -125 -25 -268 -139 -137 311 113 -28 262 -341 120 -127 32 -37 70 83 89 58 40 -178 -219
7186 -219 33 63 375 198 110 243 -320 -136 -200 84 -41 112 278 55 -29 -237 2 63 -111 270 178 149
7208 149 25 71 95 -167 16 385 288 119 -79 1 -179 -112 -62 -57 90 -132 162 376 157 -307 176 -96 -171
7231 -171 -260 84 -188 196 -111 -215 159 56 105 -25 57 35 69 -202 -163 -220 -269 -93 75 354 113 69 -173
7254 -173 -26 -44 -159 -90 -54 -23 -95 10 -303 -129 -133 -76 19 130 -84 -159 -66 -65 -199 96 192 315 267 -84 299
7279 299 -13 -190 -5 39 69 257 -35 229 -123 -295 -299 89 113 112 85 209 -82 43 -29 -34 130 192 165 88 55
$$ packed form
7116D9Q7J99j24j23O8j81j3j17J71k89M82k05J42nk8j81L9J33o1j82M15j56j9
7139A01Nj57j74K04j05J70J59N6K34j91l70o7%L6J0J11J58k70k05L39L3K4J2k41
7163a28J16K54l67J00k43J29KM48j98j41K90o03M61k47J59o9J07J3Ol1j8k18m1
7186b19K52L0L12j77q8J33n63J84o4K84j25J53J66k23q4k08K39O1j74L81r2k9
7208A49j24M6K4k62J83L69r7j69j98Q0j80O7N0NJ47k22K94K14k19m64M83k72p5
7231a71q9L44k72L84l07j04L74j03M9j30Q2k2L4k71L9n7m9J76J68K79k41m4k42
7254a73J47j8j15O9L6L1p2J05l13J74mN7R5J11k14p5R3Jj34K95R6J23m8l51L83
7279B99l12j77J85M4L0J88k92K64l52j72mL88K4jk7J24k91J25p2nJ64O2k7p7l3
$$ plain form
7304 55 261 -104 -57 119 -45 6 24 317 -80 72 -185 -450 -6 -44 -24 -65 -170 112 -136 -262 -77 199
7326 199 187 183 16 -121 313 -353 -36 -56 197 -224 88 195 143 75 -3 -38 56 27 217 215 -347 -21 -48 -127 -84
7351 -84 93 -6 147 -250 152 -45 -283 -349 147 34 46 177 -138 10 -26 -264 -192 -30 -125 331 -45 -80 116
7374 116 70 -327 -517 267 198 -50 97 357 116 -150 -277 -47 -150 -2 -211 -1 311 46 -260 147 55
7395 55 108 151 -195 162 40 174 -278 364 199 97 190 155 162 -1 -206 -318 -23 90 247 301 -50 -54 -356
7418 -356 74 95 -82 15 254 252 522 -261 -104 -349 178 253 133 34 164 -319 -23 270 -312 -54 -112 -138 72
7441 72 409 45 -282 70 -112 -39 -17 354 -60 -391 36 118 157 -238 -66 -172 18 451 -205 -210 88 -252
7463 -252 -551 72 -128 -124 81 -204 -18 17 -569 148 -56 132 328 159 -113 -128 149 -40 -8 -159 -322 23
$$ packed form
7304E5K06l65M7J76j64N1J8K93l97J52k57k65M44l8K0m1j05K82k48j26J85K76
7326A99j2mj67j37M34o66L17k0K53m21L12J07n2o8p8l5R4k9J90kn62L26k7p9M3
7351h4J77r9J53l97M02j97k38o6M96j13J2J31l15J48l6k38P2J62r5M56l76l5J96
7374A16m6l97j90P84o9k48J47K60k41k66j27K30j03J48k09K10L12k65l06M07r2
7395E5N3M3l46L57j22J34m52O42j65j02R3l5Pj63k05j12K95J13J57N4l51ml02
7418c56M30K1j77R7K39kK70p83J57k45N27P5j20r9J30m83K96K93n82K58n8k6K10
7441G2L37l64l27L52j82P3K2L71m14l31M27Q2L9l95J72j06J90M33o56nK98l40
7463b52k99O23k00MK05k85J86L5n86P17k04J88J96j69k72j5K77j89L2j51j63L45
$$ plain form
7485 23 355 -196 -375 -255 -290 -2 483 230 -109 396 -19 147 -303 -286 -112 169 400 -158 -37 157 66
7506 66 -174 -182 -54 119 156 277 -46 -108 -251 -147 53 72 -105 121 274 40 61 -288 82 41 337 310 4
7529 4 -180 55 97 -202 18 -119 128 39 6 169 16 73 137 1 -8 31 100 -192 15 -212 68 5 -109 109
7553 109 -116 -12 179 -582 -133 -226 156 -101 260 17 -83 -244 -45 -336 -47 -393 47 217 -41 91
7573 91 -271 66 -109 266 60 -164 -119 -35 -58 -181 -408 -198 139 -148 72 -116 -116 176 -289 -71 -53 199
7595 199 199 186 188 188 -368 -410 282 -208 -69 225 -92 121 74 77 -242 -157 140 135 443 316 -35 -76 160 -154 69
7620 69 70 125 31 -130 85 206 61 148 -177 -255 10 201 46 65 -129 -227 79 -117 -351 130 114 121 274 175
7644 175 -392 -256 -69 127 10 39 97 -230 168 -97 100 -124 132 79 66 37 -215 87 -35 -54 349 -279
$$ packed form
7485B3L32n51j79J20l5K88M85k53l39N05m15J66m50J7J74K81K31n58J21J94r1
7506F6k40qJ28J73L7J21l23o2j43J04K00J9j77K26J53k34K1l49L70m1K96k7l06
7529Dj84K35M2k99K20j37K47q9l3J63j53N7O4j36rL9O9k92K07k27K80o3j14K18
7553A09k25J04J91p61M49r3L82k57L61k43j00j61J99k91K89l46M40J70k58J32
7573I1l62L37j75L75k06k24M5Q4k3j23k27K10L37k87K20j88%K92m65K18J8K52
7595A99%j3K%n56m2O92m90J39K94l17K13m7Ll19Q5K97nL08j27l51m1K36l14K23
7620F9JN5r4j61K15J21j45Q7l25p8K65J91j55J9j94r8L06j96k34M81j6PJ53r9
7644A75n67J36J87J96j17K9N8l27L98k65J97k24K56n3j3k9k52L02j22j9M03o28
$$ plain form
7666 -279 80 -103 -139 -161 -436 232 -151 101 -20 -39 -70 31 83 -177 44 112 248 -61 -552 138 -254 -275
7688 -275 24 218 257 286 147 73 61 149 -142 -215 56 -209 -7 272 -213 119 -429 -126 -10 -13 159 -95 157
7711 157 -46 -17 -121 -44 147 -62 -335 28 10 -86 165 -208 37 63 319 -158 -86 -9 55 -204 137 -21 85
7734 85 -46 76 158 -305 276 -185 -42 -352 -132 72 38 259 61 -458 12 -210 -142 37 -97 278 360 83
7756 83 204 -136 -170 190 525 -38 -134 -13 39 72 -246 72 193 279 124 270 315 -39 -33 -263 142 79 129 136
7780 136 2 -192 -88 52 -121 207 97 113 -156 -76 43 228 -265 139 -261 34 -69 189 -161 48 -178
7801 -178 -98 -210 214 -32 -116 -10 295 213 -120 194 -107 206 165 -45 -260 -103 182 87 -194 -45 -131 302
7823 302 236 -182 -218 -353 -151 66 7 -70 -98 95 28 -278 61 176 6 -20 132 242 -21 130 -335 -205
$$ packed form
7666b79L59j83l6k2k75O68l83K52j21j9l1J01N2k60K21O8J36l09m91O90l92k1
7688b75K99J94L9K9j39p4j2Q8k91p3K71k65K02K79m85L32n48L03J16lJ72k54K52
7711A57k03K9j04P7J91k09k73L63j8r6K51l73K45K6K56m77P2P7O4k59L41j58J06
7734H5j31J22Q2m63N81m61J43l10K20K04l4K21j98n19M70k22O8J79j34L75Q2k77
7756H3J21l40l4L60L35n63r6J21N2L3l18L18J21Q6j55J46M5l54Ok30M05o3N0P
7780A36j34j94J04J40j73L28j10J6k69Q0J19J85m93M04m00K95j03K58l50K09k26
7801a78Q0j12M24k46q4J06L05q2l33L14l01L13m1k10k15J57K85r5k81J49q6M33
7823C02o6m18l6j35K02K17n9p7k8J93o7l06L39J15j70k6J52J10k63J51m65J30
$$ plain form
7845 -205 -169 -436 -151 251 -307 -420 18 -223 20 -71 -83 159 14 -143 -107 -378 -54 67 46 72 213 91
7867 91 -277 223 -292 15 -97 174 -72 183 -102 38 -81 128 -207 164 0 10 -30 -39 -185 60 13 -69
7889 -69 -88 -54 322 304 200 -29 -112 140 138 -18 125 347 29 173 85 20 79 -66 422 140 11 105 -171 74
7913 74 -350 11 129 45 67 66 82 276 32 -226 -103 -69 174 121 -316 89 101 -126 4 8 168 -16 -213 -77
7937 -77 50 -212 -229 -73 -196 92 -229 241 155 18 -158 3 -129 256 -73 -20 -234 -73 21 -349 63 211
7959 211 -123 168 276 3 -36 75 -93 -153 89 289 150 125 22 46 -333 -136 25 -208 52 -32 79 -71
7981 -71 164 -173 -40 82 -194 -194 -140 19 -216 -125 -185 -83 -377 -87 147 415 -115 -99 -169 -144 -218 106 28 384
8005 384 131 72 22 -176 151 44 87 315 -93 -134 240 -63 119 -88 98 -49 -43 200 60 -91 -23 -196
$$ packed form
7845b05L6k67K85M02n58j13M38k41K43r1j2K42j45j57L6k71L24J21k1K6J41j22
7867I1l68N00n15L07j12K71k46K55k85J40j19K09l35L71j64J0m0rj46K45m7q2
7889f9j9L4L76j8j04k29q3K52kj56J43K22l18J44q8o5N9j45M88k82j29R4k76K45
7913G4m24L61J18q4K2jJ6J94k44k58J23L4K43n3m37M05J2k27J30MJ60j84j97J36
7937g7J27k62j7J56j23K88l21M70q6j37j76J61j32L85l29N3k14J61R4l70M12J48
7959B11l34K91J08k73l9J11j68o0K42K00j39k5j03K4l79J97J61k33K60q4J11j50
7981g1K35l37J33J22k76%N4J59k35R1o0J02k94K90K34K68n30J6p0K5p4L24p8L56
8005C84k53n9n0j98L27j07M3K28m08m1L74l03J82k07J86j47OK43j40j51O8j73
$$ plain form
8027 -196 -74 121 234 97 480 68 -134 -154 -256 -114 154 408 102 -284 -22 177 -97 -58 -6 45 -135
8048 -135 -149 -427 -262 -244 -162 -20 4 173 68 -5 81 -45 15 -77 203 320 -29 -1 274 -245 223 151 243 76
8072 76 226 -51 -271 338 -165 164 -62 75 -232 -27 56 -105 277 -207 72 43 145 -60 -79 1 74 46
8094 46 -107 148 54 -315 -22 140 -55 -44 196 374 47 -109 63 281 -153 172 -138 -303 -109 310 23
8115 23 360 201 77 178 212 -273 -169 46 214 -181 308 2 -35 -45 -212 -86 -190 122 167 182 138 -340
8137 -340 -196 2 -1 153 -109 288 51 73 -328 -221 195 -91 121 -56 21 181 64 -33 -201 -121 57 12
8159 12 -104 205 -90 -431 -212 -248 -81 122 109 19 -51 28 12 24 -463 -140 94 -166 137 -15 -81 -311 47
8182 47 -52 -35 -19 398 -95 253 14 119 -129
$$ packed form
8027a96J22J95J13j37L83m12k02k0j02J42K68K54l06l86K62J99k74L9N2N1j80
8048a35j4k78J65J8Q2J42K4J69j05p3Q6j26O0r2K80J17l49K8K75n19M68p2R2j67
8072G6J50k77k20O09n03L29k26J37l07K05Q3j61L82m84K79k9J02k05j9Q0P3k8
8094D6j53K55r4l69K93J62j95J1K40J78l27j56J72K18m34L25l10j65J94M19k87
8115B3L37j59j24J01L4m85J04K15J68l95M89l06l7j0j67J26j04L12M5J5m4m78
8137c40J44J98lJ54k62L97k37K2m01J07M16k86K12j77P7J60j17r7j68Q0J78m5
8159A2j16L09k95l41K19l6J67K03j3r0p0P9j6J2m87L23K34k60L03j52o6k30L58
8182D7r9J7J6M17m93L48k39J05k48
8191a29
$$ Imaginary data points
##PAGE= N=2
##DATA TABLE= (X++(I..I)), XYDATA
$$ plain form
0 0 0 0 0 0 0 0 0 8 -8 8 -8 16 -16 21 -24 32 -38 43 -51 62 -72 82 -97 112 -128 147 -167 191 -217 244 -277
31 -277 311 -347 389 -434 484 -537 598 -664 736 -814 902 -998 1107 -1225 1358 -1511 1681
48 1681 -1880 2108 -2378 2702 -3097 3596 -4246 5131 -6419 8473 -12283 21774 -98896 -89396
62 -89396 113230 80571 34199 51270 72968 -47897 -149546 -110372 25153 83729 66761
73 66761 36157 35788 16025 -39476 -99136 -71194 32587 98555 56181 10161 30993 27029 -75204
86 -75204 -138580 -55910 56624 58453 25330 52706 60743 -33415 -121411 -88773 -1116 36701
98 36701 46454 66804 57683 -5460 -65158 -69791 -32422 16201 54131 61560 42964 19428 -14089
111 -14089 -62227 -76068 -25463 26681 28228 27191 57751 47802 -37038 -93748 -55946 -5887 -8808
$$ packed form
0@%%%%%%%Qj6J6j6K4l2L7m5N6p0Q1r4J13j34J54j79K09k40K75l14L58m08M61n21
31b77N88o58P36q23R18j021J135j262J400j550J716j900K105k332K583k869L192
48A681l561L988m486N080n799O693p842R377j1550J4892k0756L4057j20670R500
62h9396K02626l2659m6372J7071K1698j20865j01649L9174J35525N8576j6968
73F6761l0604l69j9763n5501n9660K7942J03781O5968m2374m6020K0832l964j02233
86g5204o3376Q2670J12534J829l3123K7376Q037r4158q7996L2638Q7657L7817
98C6701R753K0350r121o3143n9698m633L7369M8623L7930P429j8596k3536l3517
111a4089m8138j3841N0605N2144J547j037L0560r949q4840n6710L7802N0059k921
$$ plain form
124 -8808 5569 72322 91121 9667 -69608 -62723 -25970 -15431 7465 64100 92227 45626
136 45626 -31813 -75323 -65989 -27178 10091 35363 60232 70792 26745 -57005 -93126 -48797
148 -48797 -4098 -3191 14507 72885 79026 -5426 -76283 -55552 -14388 -16151 -4428 59319 94536
161 94536 38856 -41431 -63337 -41588 -26088 -7811 35791 77616 69173 7385 -57830 -74756
173 -74756 -45471 -14710 2435 34809 73146 55901 -22360 -71410 -45944 -11264 -15496 -2992
185 -2992 55404 80562 21939 -44043 -43708 -18860 -23747 -20437 30662 78821 58489 -4266 -43267
198 -43267 -44984 -39094 -33039 -4302 45345 72821 42777 -20173 -53727 -41576 -28783 -27396 3238
211 3238 61329 73551 13747 -41013 -34977 -17710 -29520 -22366 35611 78206 45951 -13419 -32015
$$ packed form
124h808J4377O6753J8799q1454p9275O885L6753J0539K2896N6635K8127m6601
136D5626p7439m3510R334L8811L7269K5272K4869J0560m4047q3750l6121M4329
148d8797M4699R07J7698N8378O141q4452p0857K0731M1164j763J1723O3747L5217
161I4536n5680q0287k1906K1749J5500J8277M3602M1825q443o1788o5215j6926
173g4756K9285L0761J7145L2374L8337j7245p8261m9050K5466L4680m232J2504
185b992N8396K5158n8623o5982L35K4848m887L310N1099M8159k0332o2755l9001
198d3267j717N890O055K8737M9647K7476l0044o2950l3554J2151J2793J387L0634
211C238N8091J2222n9804n4760O036J7267j1810P154N7977M2595l2255n9370j8596
$$ plain form
224 -32015 -25443 -35617 -41273 -3009 53775 66427 27756 -16145 -33862 -38219 -44488 -33934 12007
237 12007 62341 60967 10059 -28095 -28582 -28084 -39706 -18510 42457 74197 36583 -13893 -24219
250 -24219 -21163 -39207 -40185 8850 61197 56395 13307 -13550 -20765 -36218 -50992 -29542 23317
263 23317 57244 43106 7119 -13121 -21730 -38265 -46790 -12935 43732 61221 27478 -5391
275 -5391 -10886 -21778 -47100 -39013 18342 62791 47057 9669 -4623 -12901 -41377 -57624 -22329
288 -22329 35318 53883 29428 6319 -2117 -20936 -49400 -48780 -2874 44501 46687 18420 2692
301 2692 -2245 -25802 -52176 -33575 24139 56236 36892 10218 4455 -9410 -45356 -56675 -13415
314 -13415 39680 47732 23978 10499 3707 -24089 -56574 -45779 4738 41009 35583 16848 10410
$$ packed form
224c2015O572j0174n656L8264N6784J2652l8671m3901j7717m357o269J0554M5941
237A2007N0334j374n0908l8154m87M98j1622K1196O0967L1740l7614n0476j0326
250b4219L056j8044r78M9035N2347m802m3088k6857p215j5453j4774K1450N2859
263B3317L3927j4138l5987k0240q609j6535q525L3855N6667J7489l3743l2869
275e391n495j0892k5322Q087N7355M4449j5734l7388j4292q278k8476j6247L5295
288b2329N7647J8565k4455k3109q436j8819k8464O20M5906M7375K186k8267j5728
301B692m937k3557k6374J8601N7714L2097j9344k6674n763j3865l5946j1319M3260
314a3415N3095Q052k3754j3479o792k7796l2485J0795N0517L6271n426j8735o438
$$ plain form
327 10410 -964 -33296 -52661 -24266 25769 44910 28722 14815 10548 -12418 -48524 -49614
339 -49614 -4487 37193 38513 23403 19151 6955 -30187 -58220 -37587 9521 33195 26835 21300
352 21300 19616 -3906 -42420 -51449 -16017 24132 32086 23873 23635 15428 -19618 -51778 -39770
365 -39770 4274 31280 29229 26303 27547 5767 -38044 -56616 -27393 12684 24809 22274 27695
378 27695 24761 -9494 -48341 -46284 -8604 19290 21030 23055 30158 15456 -26597 -51467 -30373
391 -30373 8097 23464 22894 30560 32282 1896 -41808 -49909 -18145 11029 17494 22352 34964
404 34964 25849 -15726 -49209 -39034 -5939 11022 13899 25774 34998 11778 -31312 -47071 -23062
417 -23062 4915 13297 20878 36273 33092 -4640 -42346 -41458 -13092 5115 11957 27291 41639
$$ packed form
327A0410j1374l2332j9365K8395N0035J9141j6188j3907m267k2966l6106j090
339d9614M5127M1680J320j5110m252j2196l7142k8033K0633M7108K3674o360n535
352B1300j684k3522l8514r029L5432M0149P954q213k38q207l5046l2160J2008
365c9770M4044K7006k051k926J244k1780m3811j8572K9223M0077J2125k535N421
378B7695k934l4255l8847K057L7680K7894J740K025P103j4702m2053k4870K1094
391c0373L8470J5367n70P666J722l0386m3704q101L1764K9174O465M858J2612
404C4964r115m1575l3483J0175L3095J6961K877J1875R224k3220m3090j5759K4009
417b3062K7977Q382P581J5395l181l7732l7706Q88K8366J8207O842J5334J4348
$$ plain form
430 41639 23094 -21443 -45541 -30864 -7330 1401 11913 33351 37805 4752 -34614 -39451 -17498
443 -17498 -1965 4993 22824 41950 29224 -12138 -39812 -31525 -10988 -1578 10088 33722 44845
456 44845 16434 -25953 -39591 -23303 -9861 -5310 13399 40148 36870 -2870 -34766 -31383 -14733
469 -14733 -9861 -882 27241 45543 23145 -18171 -34856 -23953 -12922 -8111 10637 39802 43419
482 43419 10083 -26433 -32135 -19713 -14293 -8415 16984 43685 33533 -6780 -31489 -24394 -15023
495 -15023 -16692 -3428 30795 45186 16753 -19300 -27086 -18533 -18075 -14047 14267 43623 38842
508 38842 4646 -22062 -24704 -21484 -19936 -6539 24253 43923 27543 -7970 -26033 -21693 -19041
521 -19041 -19744 271 34318 40707 9691 -18658 -19319 -15904 -23602 -15880 18460 44013 29630 -984
$$ packed form
430D1639j8545m4537k4098J4677K3534Q731J0512K1438M454l3053l9366m837K1953
443a7498J5533O958J7831J9126j2726m1362k7674Q287K0537R410J1666K3634J1123
456D4845k8411m2387j3638J6288J3442M551J8709K6749l278l9740l1896L383J6650
469a4733M872Q979K8123J8302k2398m1316j6685J0903J1031M811J8748K9165L617
482D3419l3336l6516n702J2422N420N878K5399K6701j0152m0313k4709P095R371
495a5023j669J3264L4223J4391k8433l6053p786Q553M58M028K8314K9356m781
508C8842l4196k6708k642L220J548J3397L0792J9670j6380l5513j8063M340K652
521a9041p03K0015L4047O389l1016k8349o61L415p698P722L4340K5553j4383l0614
$$ plain form
535 -984 -14630 -16671 -24569 -25618 -2922 29778 40261 21114 -4440 -17264 -21530 -26228 -21770 5161
549 5161 35939 37223 7569 -15210 -16203 -18590 -28226 -15462 23352 42912 21799 -4798 -8774
562 -8774 -11578 -27596 -28271 2733 33969 33067 13829 845 -7784 -21904 -31996 -20374 9425
575 9425 32693 30207 9753 -6271 -13360 -23477 -32513 -14440 24455 40821 19387 -3122 -5319
588 -5319 -13254 -33373 -29524 9887 38688 27948 7424 2779 -4157 -25850 -34698 -12462 17301
601 17301 27116 20604 11170 1429 -12585 -27167 -29563 -9542 20052 31594 18168 3320 -1165
614 -1165 -14091 -35408 -29462 9428 35775 25382 9251 8701 -2541 -31870 -39750 -7916 23702
627 23702 25523 16529 14388 5138 -18319 -33380 -23223 425 17722 22109 16467 8315 -970 -17124
$$ packed form
535i84j3646k041p898j049K2696L2700J0483j9147k5554j2824m266m698M458K6931
549E161L0778J284k9654k2779r93k387r636J2764L8814J9560k1113k6597l976
562h774k804j6018o75L1004L1236r02j9238j2984q629j4120j0092J1622K9799
575I425K3268k486k0454j6024p089j0117r036J8073L8895J6366k1434k2509k197
588e319p935k0119L849L9411K8801j0740k0524m645o936k1693q848K2236K9763
601A7301R815o512r434r741j4014j4582k396K0021K9594J1542j3426j4848m485
614a165j2926k1317N946L8890K6347j0393j6131n50j1242k9329p880L1834L1618
627B3702J821q994k141r250k3457j5061J0157K3648J7297M387n642q152r285j6154
$$ plain form
641 -17124 -31847 -23535 7298 26893 20517 11869 13123 -1329 -32812 -40033 -6997 23023 21351
654 21351 15438 21126 10872 -22988 -41069 -21604 7092 16539 17935 20971 13891 -7225 -26982
667 -26982 -28593 -12641 9146 20281 17716 12443 8815 -5123 -28444 -30817 -3746 18053 14544
680 14544 12814 23191 14454 -21158 -40020 -19077 6623 10115 12798 26434 22782 -8332 -33191
693 -33191 -27802 -7925 5426 14154 21516 20756 6487 -14594 -28917 -23574 -2191 14351 14960 14969
707 14969 19671 8665 -20530 -33722 -13844 6495 5143 7288 26200 26831 -5787 -32169 -24336
720 -24336 -6776 -2749 4915 25184 31461 8206 -20274 -29068 -20876 -6825 7452 19600 24916
733 24916 20193 1038 -23763 -31401 -13541 5705 8648 12665 25607 21429 -10936 -32287 -18691
$$ packed form
641a7124j4723Q312L0833J9595o376q648J254j4452l1483p221L3036L0020j672
654B1351n913N688j0254l3860j8081J9465K8696R447J396L036p080k1116j9757
667b6982j611J5952K1787J1135k565n273l628j3938k3321k373K7071K1799l509
680A4544j730J0377q737l5612j8862K0943K5700L492K683J3636l652l1114k4859
693c3191N389J9877J3351Q728P362p60j4269k1081j4323N343K1383J6542O09R
707A4969M702j1006k9195j3192J9878K0339j352K145J8912O31l2618k6382P833
720b4336J7560M027P664K0269O277k3255k8480q794Q192J4051J4277J2148N316
733B4916m723j9155k4801p638J7860J9246K943M017J2942m178l2365k1351J3596
$$ plain form
746 -18691 -1241 -2185 1536 23217 30689 5115 -21197 -21741 -13118 -11313 -2751 18719 30864 19909
760 19909 -2895 -21075 -26131 -17204 -1837 10801 20642 26611 15475 -13076 -29859 -18498 -2744
773 -2744 -1001 5326 24246 27693 -339 -23028 -17360 -7009 -10297 -5801 17311 30130 14562
786 14562 -7577 -14189 -14690 -17072 -11027 6191 23068 25911 13331 -8128 -21538 -19393 -12009 -5144
800 -5144 9072 28991 27694 -243 -22274 -18009 -9431 -12396 -4712 21616 31816 10122 -12298
813 -12298 -13066 -10298 -17141 -13475 8439 25871 21375 5436 -6107 -13488 -17813 -16076 -6098 11883
827 11883 26507 22878 2460 -14565 -16319 -15221 -16756 -3407 23602 32770 11117 -11011 -13026
840 -13026 -12872 -20228 -13556 13469 30419 18979 136 -7035 -10336 -18028 -17913 -2227 16862 23464
$$ packed form
746a8691J7450r44L721K1681P472k5574k6312n44Q623J805Q562K1470J2145j0955
760A9909k2804j8180n056Q927J5367J2638R841N969j1136k8551j6783J1361J5754
773b744J743O327J8920L447k8032k2689N668J0351l288M496K3112J2819j5568
786A4562k2139o612n01k382O045J7218J6877K843j2580k1459j3410K145P384O865
800e144J4216J9919j297k7937k2031M265Q578k965P684K6328J0200k1694k2420
813a2298p68K768o843L666K1914J7432m496j5939j1543p381m325J737R978J7981
827A1883J4624l629k0418j7025j754J098j535J3349K7009R168k1653k2128k015
840a3026J54p356O672K7025J6950j1440j8843p171l301p692J15J5686J9089O602
$$ plain form
854 23464 14774 1274 -8355 -13616 -17089 -15680 -564 21269 26036 9462 -5557 -8500 -13374 -22680
868 -22680 -14878 12416 28933 17855 1447 -2756 -8877 -22436 -21703 -65 21450 22323 11262
881 11262 2125 -5487 -15421 -21275 -13223 5655 20585 19874 7967 -1077 -6617 -15491 -22198 -10876
895 -10876 12992 23859 14035 3575 699 -8727 -23539 -22383 896 20809 19648 10025 5706
908 5706 -1773 -17585 -25470 -12396 9186 19634 16148 9359 2832 -7773 -19895 -21553 -5798
921 -5798 13813 19874 12055 5644 1566 -10259 -23914 -19255 2777 17887 15289 9680 8208 -99
935 -99 -18312 -26014 -10354 10228 16401 13318 11645 6605 -8649 -23163 -20604 -3002 12395 15610
949 15610 12781 9900 1890 -13787 -23894 -15510 4210 14979 13388 11246 9584 -1794 -20047
$$ packed form
854B3464q690j3500r629n261l473J409J5116K1833M767j6574j5019k943m874r306
868b2680P802K7294J6517j1078j6408m203o121j3559P33K1638K1515Q73j1061
881A1262r137p612r934n854Q052J8878J4930p11j1907r044n540q874o707J1322
895a0876K3868J0867r824j0460k876r426j4812J156K3279J9913j161r623m319
908E706p479j5812p885J3074K1582J0448l486o789o527j0605j2122j658J5755
921e798J9611O061p819o411m078j1825j3655M659K2032J5110k598n609j472q307
935i9j8213p702J5660K0582O173l083j673n040j5254j4514K559J7602J5397L215
949A5610k829k881q010j5677j0107Q384J9720J0769j591k142j662j1378j8253
$$ plain form
962 -20047 -23469 -7137 9014 12732 12187 14390 7674 -10507 -23878 -17501 -844 9677 12105 14039
976 14039 13360 1121 -16710 -23015 -11996 3931 11013 12751 14449 10483 -4997 -20931 -20738 -5149
990 -5149 6806 10152 12996 15786 7075 -12436 -22576 -14614 -600 6216 10033 16267 15005 -338
1004 -338 -17855 -20522 -8788 1889 6996 12614 17629 10929 -7222 -20574 -16945 -4505 3188 7979
1018 7979 15155 17854 5532 -13752 -20797 -11582 -1632 3239 10079 18608 15486 -2782 -18789 -17654
1032 -17654 -7505 -656 4351 14234 20167 9394 -9865 -19732 -13993 -5003 266 7567 17693 18018
1046 18018 2753 -14856 -18564 -9964 -3375 1818 11668 20050 14039 -5062 -17472 -14848 -6952 -2571
1060 -2571 4327 15856 19760 6919 -11198 -16760 -11730 -5861 -1483 8654 19069 16784 190
$$ packed form
962b0047l422J6332J6151L718n45K203o716j8181j3371O377J6657J0521K428J934
976A4039o79j2239j7831o305J1019J5927P082J738J698l966j5480j5934J93J5589
990e149J1955L346K844K790q711j9511j0140P962J4014O816L817O234j262j5343
1004c38j7517k667J1734J0677N107N618N015o700j8151j3352L629J2440P693M791
1018G979P176K699j2322j9284p045R215R950M871O840Q529l122j8268j6007J135
1032a7654J0149O849N007R883N933j0773j9259r867N739Q990N269P301J0126L25
1046A8018j5265j7609l708Q600O589N193R850Q382o011j9101j2410K624P896M381
1060b571O898J1529L904j2841j8117n562N030N869M378J0137J0415k285j6594
$$ plain form
1073 190 -13748 -14549 -9398 -5512 830 13003 20233 11316 -6150 -14600 -12158 -8274 -5080 4076 17330
1088 17330 18286 4826 -10175 -13406 -10178 -8829 -3590 9835 19635 14281 -1074 -10973 -11594 -10361
1102 -10361 -8808 638 14561 19495 9247 -5407 -11256 -11031 -10731 -6987 5575 18413 17160 3394
1116 3394 -8159 -10600 -10882 -11705 -3785 11935 20043 11959 -1465 -8376 -10666 -13128 -10397 2457
1130 2457 16365 17777 7291 -4018 -9245 -12009 -13405 -6786 7976 18785 14773 2752 -6106
1143 -6106 -9547 -12724 -13012 -1934 14192 19435 9365 -1961 -6257 -9908 -14513 -10397 5090 17317
1157 17317 15076 5011 -2391 -7029 -13316 -14615 -4942 9784 17019 11922 2507 -3786 -8130 -13703
1171 -13703 -12993 -608 13872 17001 7458 -47 -4386 -10242 -16275 -10271 6352 16595 12575 4288
$$ packed form
1073A90j3938q01N151L886O342J2173P230q917j7466q450K442L884L194R156J3254
1088A7330R56j3460j5001l231L228J349N239J3425R800n354j5355r899o21J233
1102a0361J553R446J3923M934j0248j4654n849K25L00L744J2562J2838j253j3766
1116C394j1553k441k82q23P920J5720Q108q084j3424o911k290k462K731J2854
1130B457J3908J412j0486j1309n227k764j396O619J4762J0809m012j2021q858
1143f106l441l177k88J1078J6126N243j0070j1326m296l651m605M116J5487J2227
1157A7317k241j0065p402m638o287j299R673J4726P235n097r415o293m344n573
1171a3703P10J2385J4480L129r543p505m339n856o033O004J6623J0243m020q287
$$ plain form
1185 4288 228 -5295 -14474 -15319 -3474 10906 14316 9453 4258 -1021 -9089 -15770 -11632 1089
1199 1089 12436 13791 7864 2448 -3062 -10919 -16503 -9573 6458 15150 11409 5308 2366 -5046
1213 -5046 -16235 -16435 -2368 11231 12890 8609 6498 510 -11599 -17351 -10269 3630 11243 11171
1227 11171 9008 4498 -4006 -13148 -15261 -6647 5949 12540 10541 6272 3237 -5655 -16158 -15266
1241 -15266 -1181 10304 10206 7848 8676 1648 -12646 -18941 -8527 4934 8793 9802 11003 6381
1255 6381 -6162 -15820 -13410 -3793 5497 10412 10973 8043 1991 -7398 -15170 -12502 -557 8820 9170
1270 9170 8105 8648 2177 -12397 -17432 -6954 4389 6230 7439 12317 9159 -6370 -16627 -12077
1284 -12077 -3339 2795 7927 13090 11326 863 -10244 -14610 -10558 -1200 7109 10291 9712 7269
$$ packed form
1185D288m060n523r179q45J1845J4380L410m863n195n279q068o681M138J2721
1199A089J1347J355n927n416n510p857n584O930J6031Q692l741o101k942p412
1213e046j1189k00J4067J3599J659m281k111n988j2109n752P082J3899P613p2
1227A1171k163m510q504r142k113Q614J2596O591j999m269l035q892j0503Q92
1241a5266J4085J1485r8k358Q28p028j4294o295J0414J3461L859J009J201m622
1255F381j2543r658K410R617R290M915N61k930o052r389p772K668J1945R377L50
1270I170j065N43o471j4574n035J0478J1343J841J209M878l158j5529j0257M550
1284a2077Q738O134N132N163j764j0463j1107m366M052R358Q309L182n79k443
$$ plain form
1298 7269 -638 -12035 -15612 -5758 4196 5148 6299 11780 8963 -6159 -16062 -9807 -1760 -137 4517
1313 4517 13440 13454 558 -11076 -12556 -8711 -4077 3225 11081 13055 7634 -2297 -12412 -14773 -7249
1328 -7249 2687 6874 9310 11618 6596 -8381 -15830 -8428 127 699 3959 12999 12210 -1090 -11252
1343 -11252 -8995 -5680 -5234 264 10965 14435 6758 -3005 -9185 -11644 -9159 -1576 6290 11175 12873
1358 12873 5788 -6774 -14358 -10173 -3068 669 6412 14637 13083 -2428 -12816 -9884 -4726 -4585
1372 -4585 764 11972 14215 3803 -5955 -7335 -7533 -8447 -3527 5951 11918 10179 3897 -4158 -10279
1387 -10279 -10278 -5983 -656 6780 14161 11799 -933 -10673 -9638 -6666 -5994 569 13257 15633 3907
1402 3907 -6847 -7506 -7355 -9345 -3968 8450 13951 8310 358 -4739 -7854 -9403 -6542 943 7775
$$ packed form
1298G269p907j1397l577R854R954R52J151N481k817j5122r903O255Q047J623M654
1313D517Q923J4j2896j1634j480L845M634P302P856J974n421r931j0115k361P524
1328g249R936M187K436K308n022j4977p449P402Q555N72L260R040p89j3300j0162
1343a1252K257L315M46N498J0701L470p677r763o180k459K485P583P866M885J698
1358A2873p085j2562p584M185P105L737N743Q225j554j5511j0388K932N158J41
1372d585N349J1208K243j0412r758j380j98r14M920R478N967j739o282q055o121
1387a0279JM295N327P436P381k362j2732r740J035K972O72O563J2688K376j1726
1402C907j0754o59J51j990N377J2418N501n641p952n097l115j549K861P485O832
$$ plain form
1417 7775 11369 8819 310 -7109 -8483 -7803 -6433 303 12201 14413 4983 -4733 -6736 -7644 -10594
1432 -10594 -5152 8232 15008 8140 -245 -3364 -6594 -11197 -8266 2116 10666 10734 6166 471 -5225
1447 -5225 -8986 -8355 -4487 2862 10250 10968 4223 -2933 -5193 -7747 -9968 -5280 7268 13610 8181
1462 8181 943 -2027 -6108 -12258 -9966 2507 11623 10527 5368 1373 -3960 -10174 -10870 -3587 4994
1477 4994 9761 9358 4464 -1370 -6209 -8885 -9159 -2907 7046 11491 6981 1396 -761 -5309 -11777
1492 -11777 -9844 2222 10356 8798 5004 3159 -2010 -11113 -12903 -3627 5844 9075 8232 5760 425
1507 425 -7440 -11078 -8326 -479 6764 10046 6920 2180 -1694 -6355 -10700 -8081 2425 9713 7559
1522 7559 4322 3354 -1762 -10078 -11990 -3015 5896 7171 7047 6788 2160 -6632 -12184 -8261 -369 5386
$$ packed form
1417G775L594k550q509p419j374O80J370O736J1898K212r430r716k003r08k950
1432a0594N442J3384O776o868q385l119l230m603K931J0382Q550O8m568n695n696
1447e225l761O31L868P349P388P18o745p156k260k554k221M688J2548O342n429
1462H181p238k970m081o150K292J2473R116j096n159l995n333o214o96P283Q581
1477D994M767m03m894n834m839k676k74O252R953M445m510n585k157m548o468
1492a1777J933J2066Q134j558l794j845n169r103j790R276R471L231q43k472n335
1507D25p865l638K752P847P243L282l126m740l874m661m345K619J0506P288k154
1522G559l237r68n116q316j912Q975Q911J275j24k59m628q792n552L923P892N755
$$ plain form
1538 5386 8460 8443 4300 -1781 -8516 -10814 -6884 2219 8424 7927 5208 3018 -2688 -10099 -10912 -1950
1554 -1950 5193 6411 6334 7075 2550 -7321 -11743 -6681 324 3848 6733 8838 5700 -2179 -8989 -9741
1570 -9741 -5322 974 6160 8487 7773 3014 -4585 -10332 -9707 -2400 4109 6267 7764 7333 1410 -8016
1586 -8016 -11184 -5274 1072 3312 6013 9075 6184 -3067 -9744 -8640 -3814 446 3876 7752 8344
1601 8344 2870 -5028 -9680 -8214 -2344 2490 5495 7920 7733 1128 -8088 -10450 -5343 234 2864
1616 2864 6133 9402 6180 -3366 -9927 -7880 -3123 -216 3525 8417 8807 2469 -5625 -8779 -6820
1631 -6820 -3008 1199 5950 8921 7226 369 -7082 -8941 -5761 -1426 2562 6892 9234 5390 -3238
1646 -3238 -8422 -7685 -4082 -1349 3975 9064 8881 1704 -5719 -7629 -6280 -4053 258 6072 9408
$$ packed form
1538E386L074j7m143o081o735k298L930R103O205m97k719k190n706p411q13Q962
1554a950P143J218p7P41m525r871m422N062P005L524K885K105l138p879o810p52
1570i741M419O296N186K327p14m759p599n747O25P307O509K158J497m31n923r426
1586h016l168N910O346K240K701L062k891r251o677J104M826M260L430L876N92
1601H344n474p898m652J466N870M834L005K425j87o605r216k362N107N577K630
1616B864L269L269l222r546o561K047M757K907L741M892L90o338q094l154J959
1631f820L812M207M751K971j695o857p451j859L180M335L988M330K342l844q628
1646c238n184P37L603K733N324N089j83p177p423j910J349K227M311N814L336
$$ plain form
1661 9408 6180 -1198 -6606 -7215 -5528 -2854 1974 7633 9046 4279 -3567 -6993 -6650 -4583 -1935
1676 -1935 4034 9279 8098 973 -5315 -6728 -6125 -4356 -122 6582 9789 5719 -1097 -5386 -6184
1691 -6184 -6131 -3299 2636 8436 8637 3178 -2947 -5699 -6354 -5537 -1971 4745 9448 7311 785 -3889
1707 -3889 -6034 -6730 -5288 -197 7155 9210 4779 -1378 -4614 -5934 -6703 -4101 2953 8751 8069 2512
1723 2512 -2269 -4906 -6848 -6637 -1719 5560 8805 6213 1004 -2913 -5282 -7122 -5750 653 7575
1738 7575 8632 4067 -594 -3672 -6305 -7693 -4147 3773 8501 6817 1933 -1786 -4289 -7216 -6923
1753 -6923 -1223 5878 8503 5448 1151 -2435 -5191 -7551 -5402 1489 7243 7736 3655 197 -3089
1768 -3089 -6373 -7496 -3565 3833 7773 6042 2461 -1068 -4068 -7601 -6582 -493 5445 7596 4942
$$ packed form
1661I408l228p378n408o09J687K674M828N659J413m767p846l426L43K067K648
1676a935N969N245j181p125o288j413O03J769M234O704L207m070o816m289p98
1691f184N3K832N935N800K01n459o125k752o55Q17L566O716M703k137o526m674
1707c889k145o96J442N091P352K055m431o157l236j320p69K602P054N798o82n557
1723B512m781k637j942K11M918P279L245k592n209l917k369j840J372O403O922
1738G575J057m565m661l078k633j388L546P920M728j684m884l719k503k927K93
1753f923N700P101K625l055m297l586k756k360K149O891N754M93m081l458l286
1768c089l284j123L931P398L940j731l581l529l000l533J019O089N938K151k654
$$ [...]
8191A65
##END NTUPLES=NMR FID
##END=
