##TITLE=1H_DE-63_EXTEtOH
 D2O
 8 sc, 
 1.8.2024
##JCAMPDX= 6.0         $$ Bruker NMR JCAMP-DX V2.0
##DATA TYPE= NMR FID
##DATA CLASS= NTUPLES
##ORIGIN= UXNMR, Bruker Analytische Messtechnik GmbH
##OWNER= root
$$ XWIN-NMR		Version 3.5
$$ Thu Aug  1 15:39:14 2024 Russian Standard Time (UT+4h)  she@DPX200
##.OBSERVE FREQUENCY= 200.1315
##.OBSERVE NUCLEUS= ^1H
##.DELAY= (6, 6)
##.ACQUISITION MODE= SIMULTANEOUS
##.ACQUISITION SCHEME= undefined
##.AVERAGES= 8
##.DIGITISER RES= 18
##SPECTROMETER/DATA SYSTEM= spect
##.PULSE SEQUENCE= zg30
##.SOLVENT NAME= Acetone
##.SHIFT REFERENCE= (INTERNAL, Acetone, 0, 15.7039)
##AUDIT TRAIL= $$ (NUMBER, WHEN, WHO, WHERE, WHAT)
$$ ##TITLE= Audit trail, XWIN-NMR		Version 3.5
$$ ##JCAMPDX= 5.01
$$ ##ORIGIN= Bruker BioSpin GmbH
$$ ##OWNER= she
$$ F:/spectra/data/she/nmr/H-F/1/audita.txt
$$ ##AUDIT TRAIL=  $$ (NUMBER, WHEN, WHO, WHERE, WHAT)
(   1,<2024-08-01 15:37:22.18 +0400>,<she>,<DPX200>,
      <created by zg, POWCHK disabled, PULCHK disabled
       configuration hash MD5:
       00 E9 B6 7A A2 85 ED C7 34 08 36 98 17 FE 4E 26
       data hash MD5: 16K
       FF 1A 7C F1 0C 7C CC A7 FC 6F DF 82 1B 6F EA 3D>)
$$ ##END=
$$ 
$$ hash MD5
$$ 32 70 E5 4C EF 70 77 D7 45 C8 2F A9 83 9D C5 1E
##$RELAX= 
##$RELAX= 
##$RELAX= 
##$RELAX= 
##$RELAX= 
##$RELAX= 
$$ Bruker specific parameters
$$ --------------------------
##$DU= <F:/spectra>
##$EXPNO= 1
##$NAME= <H-F>
##$PROCNO= 1
##$TYPE= <nmr>
##$USER= <she>
##$AMP= (0..31)
100 100 100 100 100 100 100 100 100 100 100 100 100 100 100 100 100 100 
100 100 100 100 100 100 100 100 100 100 100 100 100 100 
##$AQSEQ= 0
##$AQ_mod= 1
##$AUNM= <au_zg>
##$AUTOPOS= <>
##$BF1= 200.13
##$BF2= 200.13
##$BF3= 200.13
##$BF4= 200.13
##$BF5= 200.13
##$BF6= 200.13
##$BF7= 200.13
##$BF8= 200.13
##$BYTORDA= 1
##$CFDGTYP= 0
##$CFRGTYP= 5
##$CHEMSTR= <none>
##$CNST= (0..31)
1 1 145 1 1 1 1 1 1 1 1 1 1 1 1 1 1 1 1 1 1 1 1 1 1 1 1 1 1 1 1 1 
##$CPDPRG= <>
##$CPDPRG1= <>
##$CPDPRG2= <>
##$CPDPRG3= <>
##$CPDPRG4= <mlev>
##$CPDPRG5= <mlev>
##$CPDPRG6= <mlev>
##$CPDPRG7= <mlev>
##$CPDPRG8= <mlev>
##$CPDPRGB= <>
##$CPDPRGT= <>
##$D= (0..31)
0 1.2 0 0 0 0 0 0 0 0.06 0 0.03 0 0 0 0 0.0002 0 0 0 0 0 0 0 0 0 0 0 0 
0 0 0 
##$DATE= 1722512241
##$DBL= (0..7)
120 120 120 120 120 120 120 120 
##$DBP= (0..7)
150 150 150 150 150 150 150 150 
##$DBP07= 0
##$DBPNAM0= <>
##$DBPNAM1= <>
##$DBPNAM2= <>
##$DBPNAM3= <>
##$DBPNAM4= <>
##$DBPNAM5= <>
##$DBPNAM6= <>
##$DBPNAM7= <>
##$DBPOAL= (0..7)
0.5 0.5 0.5 0.5 0.5 0.5 0.5 0.5 
##$DBPOFFS= (0..7)
0 0 0 0 0 0 0 0 
##$DE= 6
##$DECBNUC= <off>
##$DECIM= 24
##$DECNUC= <off>
##$DECSTAT= 4
##$DIGMOD= 1
##$DIGTYP= 9
##$DL= (0..7)
0 120 120 120 120 120 120 120 
##$DP= (0..7)
150 150 150 150 150 150 150 150 
##$DP07= 0
##$DPNAME0= <>
##$DPNAME1= <>
##$DPNAME2= <>
##$DPNAME3= <>
##$DPNAME4= <>
##$DPNAME5= <>
##$DPNAME6= <>
##$DPNAME7= <>
##$DPOAL= (0..7)
0.5 0.5 0.5 0.5 0.5 0.5 0.5 0.5 
##$DPOFFS= (0..7)
0 0 0 0 0 0 0 0 
##$DQDMODE= 0
##$DR= 18
##$DS= 0
##$DSLIST= <SSSSSSSSSSSSSSS>
$$ [...]
##$SUBNAM2= <"">
##$SUBNAM3= <"">
##$SUBNAM4= <"">
##$SUBNAM5= <"">
##$SUBNAM6= <"">
##$SUBNAM7= <"">
##$SUBNAM8= <"">
##$SUBNAM9= <"">
##$SW= 24.0689530833862
##$SWIBOX= (0..15)
0 0 2 0 0 0 0 0 0 0 0 0 0 0 0 0 
##$SW_h= 4816.95568400771
##$TD= 16384
##$TD0= 1
##$TE= 0
##$TE2= 300
##$TE3= 300
##$TEG= 300
##$TL= (0..7)
0 120 120 120 120 120 120 120 
##$TP= (0..7)
150 150 150 150 150 150 150 150 
##$TP07= 0
##$TPNAME0= <>
##$TPNAME1= <>
##$TPNAME2= <>
##$TPNAME3= <>
##$TPNAME4= <>
##$TPNAME5= <>
##$TPNAME6= <>
##$TPNAME7= <>
##$TPOAL= (0..7)
0.5 0.5 0.5 0.5 0.5 0.5 0.5 0.5 
##$TPOFFS= (0..7)
0 0 0 0 0 0 0 0 
##$TUNHIN= 0
##$TUNHOUT= 0
##$TUNXOUT= 0
##$USERA1= <user>
##$USERA2= <user>
##$USERA3= <user>
##$USERA4= <user>
##$USERA5= <user>
##$V9= 5
##$VALIST= <valist>
##$VCLIST= <CCCCCCCCCCCCCCC>
##$VD= 0
##$VDLIST= <DDDDDDDDDDDDDDD>
##$VPLIST= <PPPPPPPPPPPPPPP>
##$VTLIST= <TTTTTTTTTTTTTTT>
##$WBST= 1024
##$WBSW= 4
##$XGAIN= (0..3)
0 0 0 0 
##$XL= 0
##$YL= 0
##$YMAX_a= 279431
##$YMIN_a= -278778
##$ZGOPTNS= <>
##$ZL1= 120
##$ZL2= 120
##$ZL3= 120
##$ZL4= 120
##$ABSF1= 10
##$ABSF2= 0
##$ABSG= 5
##$ABSL= 3
##$ALPHA= 0
##$AQORDER= 0
##$ASSFAC= 0
##$ASSFACI= 0
##$ASSFACX= 0
##$ASSWID= 0
##$AUNMP= <proc_1d>
##$AZFE= 0.1
##$AZFW= 0.1
##$BCFW= 1
##$BC_mod= 2
##$BYTORDP= 1
##$COROFFS= 0
##$CY= 11.3945322036743
##$DATMOD= 1
##$DC= 2
##$DFILT= <>
##$DTYPP= 0
##$F1P= 15.6554695791079
##$F2P= 12.8336369535428
##$FCOR= 0.5
##$FTSIZE= 0
##$FT_mod= 4
##$GAMMA= 1
##$GB= 0.15
##$INTBC= 1
##$INTSCL= 1
##$ISEN= 128
##$LB= 0.24
##$LEV0= 0
##$LPBIN= 0
##$MAXI= 10000
##$MC2= 0
##$MEAN= 0
##$ME_mod= 0
##$MI= 1.114404
##$NCOEF= 0
##$NC_proc= 0
##$NLEV= 6
##$NOISF1= 3.799351
##$NOISF2= 2.8
##$NSP= 1
##$NTH_PI= 0
##$NZP= 0
##$OFFSET= 15.70392
##$PC= 1
##$PHC0= -25635.81
##$PHC1= 5.787489
##$PH_mod= 1
##$PKNL= yes
##$PPARMOD= 0
##$PSCAL= 0
##$PSIGN= 0
##$REVERSE= no
##$SF= 200.130013532006
##$SI= 16384
##$SIGF1= 3
##$SIGF2= 2
##$SINO= 400
##$SIOLD= 16384
##$SREGLST= <1H.CDCl3>
##$SSB= 0
##$STSI= 0
##$STSR= 0
##$SW_p= 3612.71676300578
##$SYMM= 0
##$S_DEV= 0
##$TDeff= 0
##$TDoff= 0
##$TI= <>
##$TILT= no
##$TM1= 0
##$TM2= 0
##$TOPLEV= 0
##$USERP1= <user>
##$USERP2= <user>
##$USERP3= <user>
##$USERP4= <user>
##$USERP5= <user>
##$WDW= 1
##$XDIM= 8192
##$YMAX_p= 0
##$YMIN_p= 0
$$ End of Bruker specific parameters
$$ ---------------------------------
##NTUPLES= NMR FID
##VAR_NAME=  TIME,          FID/REAL,        FID/IMAG
##SYMBOL=    X,             R,               I
##VAR_TYPE=  INDEPENDENT,   DEPENDENT,       DEPENDENT
##VAR_FORM=  AFFN,          ASDF,            ASDF
##VAR_DIM=   8192,          8192,            8192
##UNITS=     SECONDS,       ARBITRARY UNITS, ARBITRARY UNITS
##FACTOR=    0.0002076,     1,               1
##FIRST=     0,             0,               0
##LAST=      1.7004516,     0,               0
##MIN=       0,             -278778,         0
##MAX=       1.7004516,     279431,          0
$$ Real data points
##PAGE= N=1
##DATA TABLE= (X++(R..R)), XYDATA
$$ [...]
2715A797J662m425k457L662L316k839l860J774M392r38m835N60L937R11l787k088
2731c218L809K818l445l084K069L867j065m464L32N026r8m235j353M208K184l649
2747b98l333L000L796k285l828J329M253l63m153j039M431J432l999k041L027
2762g1L124k402l812J633M543j127m147k60M208J134m013j616L186K973l062l291
2778c000K234L654j495l999K44M588L66m114j218L733K104l566k726K682L433
2793B920j934l839J333L885l4m185r24M291J444m013k037L216K635j831l891J522
2809a442M006o10l796p81M015J282l598k025L584K273k618l224K206L527j359
2824A440l764K25M560o3l988j042L205K270l017l006K605L376j766l742J204L804
$$ y = [1797, 3459, -966, -3423, 239, 3555, 716, -3144, -1370, 3022, 2084, -2751, -2191, 1746, 2657, -1130, -3218, 591, 3409, -36, -3120, -1051, 2816, 1751, -2713, -2381, 2645, 2547, -1688, -3041, 1167, 3351, -298, -3631, -631, 3165, 880, -2948, -1619, 2634, 2271, -1882, -2921, 1510, 2942, -1057, -3098, -71, 3053, 651, -3161, -1528, 3015, 1888, -2259, -2519, 1689, 2823, -1190, -2806, 380, 3353, 291, -3000, -766, 2888, 1393, -2606, -2362, 2226, 2592, -1522, -2740, 993, 3097, -469, -3195, -513, 2920, 986, -2853, -1520, 2365, 2331, -1854, -2778, 1513, 2957, -1056, -3093, 123, 2758, 927, -2964, -1442, 2564, 1954, -1842, -2623, 1392, 2674, -924, -2949, 635, 2908, 290, -2934, -728, 2799, 1440, -2324, -2099, 2461, 2398, -1590, -2632, 573, 2843, -174, -3180, -575, 2801, 1035, -2707, -1503, 2301]
2840B301k07l780q37L986J239l395j965K440K993j994l598J672L790j177l596
2855b128K8L439J326l419k227L376K831l128k778J815L470j255l557K30M054J84
2871B261l600j161L508J927k785l083K366L585k160l461J302L254J32l994n46
2886b455L698J388l246j820K484K586j729l242J236L463p25l388j44L537J120
2901B763l610k205L104K873k672k741J875K794n93l880K82M237j9l332j196L079
2917G59K546l209k978K827K685j779l027Q62L525J6l587r74L287J334k967k040
2933b720K685K338j794k763Q94L447l51l371j65K851J624l395k135L118K492k413
2949C42k933J681L219j022l277J59L717O0l056j269K805J881k455k538K300L061
$$ y = [2301, 2094, -1686, -2523, 1463, 2702, -693, -2658, -218, 2775, 781, -2817, -1145, 2645, 1468, -2128, -2100, 1339, 2665, -754, -2981, 395, 3226, 98, -2680, -865, 2605, 1350, -2207, -1977, 2077, 2261, -1339, -2500, 1008, 2935, 150, -2933, -567, 3018, 858, -2603, -1301, 1953, 2085, -1909, -2455, 1243, 2631, -615, -2435, 49, 2635, 906, -2336, -1100, 2363, 1638, -1750, -1894, 1643, 2763, -847, -3052, 52, 2925, 253, -2488, -613, 2181, 1588, -2292, -2010, 2227, 2208, -1124, -2320, 759, 3305, 96, -2882, -55, 2630, 851, -2176, -1314, 2211, 2227, -1360, -2334, 953, 2287, -680, -2720, -35, 2303, 509, -2254, -1360, 2087, 1736, -1635, -1800, 1051, 2675, -720, -2855, 263, 2755, 342, -2591, -910, 2309, 1287, -1990, -1831, 1886, 1946, -1110, -2379, 426, 2307, -148, -2686, -386, 2675]
2965B675j779l049Q47L086j31l080q73L687R34k751k003J971L102j899l482J627
2981a118L165l94l345l65L445J050l229j765L008J894k008k717J459L339r99l680
2997b260M48L554M57l410j248K780K315k718k593K256K743j502k999O90K965K62
3013A740k963q82L149J046k321j986K392K285j971k889J184L384o19l068p12L769
3029A538J000l363j681K717K381k175k508R27K976n44l390M85L445K97l287j167
3045b349K937J883k318k872K611K502j588k936O95L103J35l289q44L509J028k714
3061e07j765K072K354j762k516J115L054n79l050l76L061J300l435j674K981J844
3077B117k372j993J493K990q16l294J42L143N68l014r28K532J775k463k057J751
$$ y = [2675, 896, -2153, -1306, 1780, 1649, -1431, -2304, 1383, 2317, -434, -2437, -466, 2636, 737, -2745, -1118, 2047, 1653, -1692, -2057, 1388, 2438, -791, -2556, 452, 2346, 338, -2379, -920, 2419, 1420, -2260, -1812, 1742, 2199, -1211, -2459, 321, 2636, -82, -2675, -419, 2324, 822, -2177, -1487, 1478, 1740, -1223, -2105, 1044, 2090, -231, -2217, 175, 2460, 489, -2400, -1216, 2168, 1549, -1519, -2231, 1538, 2538, -825, -2506, 211, 2592, 417, -2091, -1164, 1812, 1268, -2122, -1637, 1808, 2105, -1182, -2349, 588, 2471, 153, -2719, -108, 2394, 806, -2130, -1435, 1668, 1803, -1486, -2330, 1179, 2207, -507, -2272, -200, 2154, 392, -2124, -1009, 2045, 1466, -1584, -1960, 1101, 2401, -1034, -2708, 273, 2117, -255, -2248, -755, 2235, 1419, -1875, -1733, 1410, 1978, -1036, -1964, 568, 2343, -120, -2177, -426]
3093d26K510j229k975J91L754j6l179o98K903R83k114j717J956K323j699k743
3109b176J449K350J77l287l61L031Q20k297k181K609K210k040k443J351K687n48
3125A351l110J37L247L41l274r27K408K161k552j914K246J987j196k698M84K801
3141A492N85l354o41K870J034k218j826J837K396j528k685R36L243o47k772m97
3157a775K615J538l436j085K471J933j900k501J292K701o33l024p3L304O05k681
3173f49j320K710J663k432k439J922K462j440k164L44K909J80k870o62K684J090
3189A988j938k246J749K791j587k816R68K679P8k917l80K464J094k545j735K890
3205E37J513j681k433J224K773o63k709m2L019n3k058j689K872J651k337k247
$$ y = [-426, 2084, 855, -2120, -1929, 1825, 1809, -1370, -2068, 835, 1818, -296, -2013, -57, 2266, 567, -2176, -727, 1623, 1800, -1487, -1848, 1183, 2003, -294, -2475, 134, 2344, 304, -2139, -788, 1899, 1351, -1759, -1622, 1625, 1966, -1308, -2235, 173, 2334, -218, -2132, 114, 2101, 905, -1793, -1309, 1492, 2077, -1277, -1918, 952, 1986, -232, -2058, -221, 2175, 647, -2038, -1102, 2141, 1494, -1278, -1775, 840, 2378, -1058, -2143, 328, 2261, 361, -2140, -848, 1853, 1220, -1804, -1877, 1427, 2032, -649, -1969, 741, 2404, -28, -2467, -545, 1917, 477, -1687, -1343, 1566, 1746, -1124, -1786, 898, 1988, 50, -2196, -447, 2344, 757, -2059, -1091, 1588, 1666, -1251, -1631, 833, 1927, -618, -2353, 537, 2050, 369, -2064, -840, 1933, 1270, -1439, -1481, 1538, 1485, -573, -2262, 610, 2261, -76, -2323]
3221b323J710K551j016k788L55L053k8k292q60K088J329k267j807K195J855j201
3237E54k541Q01K762k38k463n20K903P56k628j223J821J902j711k236J270K600
3253A809n36k797qK690O34k535r81K362J532k044j909J663J613n33k365L13K545
3270A453L14k781q01K620J144k394j758J949K254j543k474J092K453j87k799o72
3286b130K967J194k646r65J411J954j193k460J175K636r19k624N1K746O64k334
3302d73j461K568J364j897j926J321K397q74k653N35K633J64k681n49K254J033
3318A755k078j317J689K276j850k286M95K953k09k655o80K742R27k355j087J670
3334a0K461k035k339J364K728j152k344n9K429K53j893r54J859J543k105j627
$$ y = [-2323, -613, 1938, 922, -1866, -1511, 1542, 1514, -778, -1638, 450, 1779, -488, -2295, -100, 1755, 554, -1987, -1186, 1576, 1338, -1125, -1645, 1258, 2014, -614, -1837, -16, 1886, 175, -2061, -791, 1809, 1273, -1524, -1532, 1158, 1792, -743, -1724, 638, 2170, 126, -1783, -120, 1493, 960, -1405, -1092, 1453, 1767, -1014, -1815, 805, 1949, -445, -2203, -254, 2000, 457, -2017, -925, 1528, 1341, -1458, -2130, 837, 2031, -615, -1580, -169, 1785, 592, -1868, -693, 1943, 1024, -1600, -1549, 1197, 1861, -473, -1934, 634, 1998, 101, -1825, -504, 1893, 1019, -1634, -1099, 1534, 1698, -983, -1532, 722, 1755, -323, -1640, 49, 2325, 475, -1811, -1316, 1637, 1428, -1227, -1907, 835, 1762, -593, -1680, -10, 2451, 416, -1923, -559, 2169, 1017, -1327, -1386, 1043, 1296, -597, -1551, 308, 1851, -254, -1881]
3350a881J703J721o87k618M35K715m5k184r12K612R46k094j604J670K300j586
3366D91k152O89K711p04k267k49K456R67k355j509K482J352j629k184R72K704
3382A775o03k457n9K252P92k298j237K165J558j639j872J090J907n43k691Q09
3398a051K523j14k357m89K122J000j644j866J350K071j055k137Q33K155n3k403
3414a115o62K427J164k353j143K025J091r89k209R29K362j84k634j26K345O50
3430A578k256j014J925J507j889j637J440J889m45k730N39K308M1k112q03K321
3446F62P46j526j773J230K756j560j967R13J610J78k261n85K424Q60k139j359
3462a791J900J465j596j612P79K467m50k681N73K008N83k496j099K163J443k073
$$ y = [-1881, -178, 1543, 856, -1762, -1327, 1388, 1343, -841, -1753, 859, 1805, -289, -1893, -223, 2077, 491, -1661, -972, 1739, 1035, -1232, -1481, 975, 1942, -413, -1922, 560, 1912, 283, -1901, -929, 1775, 1172, -1285, -1344, 908, 1700, -598, -1835, 330, 1888, 249, -1623, -533, 1374, 831, -1860, -1051, 1472, 1358, -999, -1488, 634, 1634, -10, -1876, -526, 1545, 490, -1647, -814, 1341, 1288, -1115, -1777, 650, 1814, -539, -1682, 343, 1434, 445, -1764, -835, 1527, 1343, -1291, -1417, 928, 1578, -678, -1692, 233, 1740, -149, -1786, -346, 1543, 1098, -1632, -1093, 1215, 1256, -856, -1659, 662, 1408, -118, -1891, -661, 2095, 535, -1432, -519, 1091, 1269, -992, -1577, 847, 1707, -432, -1791, 109, 1574, -22, -1634, -855, 1612, 1162, -1519, -946, 1062, 1645, -851, -1950, 213, 1656, -417]
3478d17j211J343J887p90j956J38K047J89k025q17K153J347j844j871J286K246
3494A705j401j892Q52K057j89j904p29K052R45j790j225J622J594j520j864J019
3510f68K196m47k385L34J686M30j740j163K216J287j661j690J110K105n82k466
3526a438L51K255K3j575j216K147J155k052j175J197J886j134j498J55J878L77
3542A336k340l90K054O94j770j007J463J799j503k220J447K219j038j947j25J920
3558E92N26j703j120J968J509j858j489J028J801k78k659O98K085k20j830n25
3574a475J854J247j613j707J565J780j233j924Q32J776Rj929o48K032Q96j934
3590d72p88J159J613j209j939R67K057l22k035k35J951P41k163p80J923R86j453
$$ y = [-417, -1628, -285, 1602, 812, -1144, -1006, 1041, 1230, -795, -1612, 541, 1888, 44, -1827, -541, 1705, 304, -1588, -736, 1321, 1132, -772, -1501, 551, 1496, -294, -1519, 103, 1697, 177, -1687, -668, 1528, 1081, -1304, -970, 716, 1146, -594, -1757, 459, 1746, 85, -1605, -495, 1610, 1028, -1438, -1087, 1168, 1191, -384, -1600, 547, 1702, -350, -1525, -328, 1558, 424, -1074, -919, 959, 1336, -1004, -1394, 660, 1354, -416, -1423, 40, 1839, 336, -1884, -437, 1782, 744, -1203, -1328, 592, 1118, -585, -1705, 263, 1772, -86, -1575, -547, 1254, 976, -1683, -985, 1100, 880, -950, -1475, 379, 1626, 13, -1694, -129, 1651, 418, -1506, -674, 1102, 1111, -818, -1466, 566, 1462, -472, -1260, -101, 1512, 303, -1636, -669, 1388, 1066, -969, -1204, 747, 1488, -675, -1455, 468, 1454, 1]
3607Aj431J109J792n94k383R5K385J86k044n73J638J303j426j525J039J961j313
3624B20j608L37K199J46k473J58J696N78j556j099J391J500r98j906O52K119n19
3641H37k056J50J582Q82k166o79J820J092j575j380J160J875n54j968l90K497
3657A127j48j588l52J294J009j577j411J446J312k40k250M15J965J90k122m79
3673a409K689N3j705j452K097J147r97j925L30K428m82j922L8J716P30j280j729
3690a673J959J308j366j559R21J498n2k062J37J798J99j846r32J933R92j317j440
3707a502J137J677q13j656M83J675J28j869n06J856L76j561o03R31J422r46j392
3724a163M09K103o82j753J36J390J027j826q88J330J032r80j445J194J261m44
$$ y = [1, -1430, -321, 1471, 877, -1506, -1411, 974, 1160, -884, -1457, 181, 1484, 58, -1467, -428, 1533, 220, -1388, -1051, 1148, 1294, -1179, -1021, 675, 1253, -303, -1402, -11, 1489, 491, -1415, -763, 1356, 837, -1219, -1069, 513, 1395, -771, -1450, 370, 1462, -113, -1493, -333, 1542, 988, -980, -1370, 1127, 979, -609, -961, 333, 1342, -235, -1646, -200, 1112, 872, -1378, -963, 1002, 1192, -930, -1409, 1280, 1333, -372, -1824, 273, 1420, 423, -1502, -1172, 1256, 774, -1148, -1110, 606, 1336, 56, -1673, 286, 1594, 228, -1331, -410, 1088, 1036, -1026, -889, 909, 1108, -738, -1670, 263, 1255, -62, -1502, -365, 1312, 499, -1157, -674, 1001, 1129, -740, -1246, 610, 986, -575, -1178, -247, 1175, 229, -1163, -754, 1349, 667, -1086, -950, 440, 1467, -359, -1247, 83, 1115, 135, -1310, -116, 1145, 701]
3740G01j956k39K318K48j773n26J469R77j482q64R00J500p38j706K64J780K78
3757A151j904o21J960M83j197j114Q71J688j039j578P41J726o04j572P9J560R10
3774A540k182p33J577J408j433j579Q37K069p57j796J32J909J51j739j004J705
3790A05J343j431j578J005J484p12j236J47J788Q0j557o82J819Q49j771p46Q98
3807a95J383p19j729Q28J606n14j585K5J434P09j472r77J604J066j259j149L73
3824e71J848n22j812j49K134L29j609o95J452J131j714j213J552R55o20j541K23
3841h22J469K41j630n82J733P53j193j210R55J514p77j774Q18J382j16j196m02
3858h37J522N19j559p87J272J203j201j135O48J628m52k037J62J958nj222n69
$$ y = [701, -1255, -1494, 824, 1072, -701, -1227, 242, 1219, -263, -1127, -227, 1273, 535, -1171, -907, 873, 1151, -753, -1374, 586, 1069, -128, -1242, -371, 1317, 278, -1300, -559, 1167, 563, -1009, -930, 630, 1540, -642, -1375, 202, 1610, 177, -1402, -565, 1504, 747, -1049, -917, 992, 1143, -596, -1600, 105, 1448, 17, -1561, -556, 928, 216, -1020, -873, 915, 995, -562, -1244, 575, 1424, -347, -1093, -195, 1188, 469, -1260, -432, 1174, 660, -925, -900, 534, 1243, -229, -1206, 398, 1464, 205, -944, -571, 1277, 755, -1057, -1206, 928, 1257, -352, -1047, 405, 1536, -178, -1391, 161, 1116, 496, -1045, -822, 647, 888, -742, -1324, 409, 1162, -31, -1241, -286, 1228, 451, -1323, -505, 877, 761, -435, -837, 685, 1204, -355, -1142, 130, 1333, 132, -1003, -355, 1273, 821, -1216, -1054, 904, 899, -323, -892]
3875h92J027J343j413j165R03J474p89j402K06J610L49k075n06J632J123j867
3891d42m37Q34J217o48j854Q30J662n12j560j85J379P44j318j005J624Q66r45
3908B50j457O53J354j9j781K09J751j9j262p06J092J264j175j742J684J056n98
3925E54j445J00J493K64j791j48J504M25j153j106R39J564p60j432K94J289L1
3942F22j161l73J260J078j871q20J465R49r29j369O20J284k04j675j14J815J38
3959G15j359n37J455Q75j049j330J184Q94k23j424n0J568M60j733n01J995L08
3976A248j438r96P77J722r99j308O96J256j99j322k21J403N74j195r54J101O53
3993G98o34q55K95J255l98j434J77J830k78j039o26J065R36j133r33O49J308k93
$$ y = [-892, 135, 1478, 65, -1100, -197, 1277, 488, -914, -708, 902, 1251, -824, -1330, 302, 1425, -442, -879, -45, 1172, 524, -1330, -500, 1162, 650, -910, -1095, 284, 1028, -290, -1295, 329, 1195, 250, -1207, -554, 800, 781, -1000, -791, 960, 941, -321, -1027, 65, 1329, 154, -1588, 96, 1152, 554, -891, -791, 702, 966, -825, -973, 531, 956, -197, -1303, -364, 1200, 440, -992, -698, 591, 622, -539, -912, 348, 1426, -445, -1265, 200, 1149, 220, -1149, -529, 755, 551, -1124, -1238, 577, 715, -644, -1181, 274, 1149, 100, -1230, -46, 848, 625, -799, -849, 719, 1179, -554, -1055, 940, 1248, -190, -1186, -409, 1313, 314, -994, -298, 958, 759, -563, -784, 619, 1193, -2, -956, 145, 798, 164, -691, -396, 859, 461, -973, -796, 1034, 756, -283, -909, 156, 1092, -41, -974, -325, 983, 690]
4011F90j837K24J742Q0j690l10J164R62j067q71J068J005p21j734Q50J333j97
4028F91j158n43J484R30j697o99J495M33q36r75J92J781m71j725J44J374N71j253
4046b62p04J181R68j276r81J459M40l10j497J58J508L72j807O9J134L90j136q13
4064a107Q35J479o12j811Q70J221J2j321m94J509N91j509r35J022J312o71j491
4081a100M77J412K59j827j3J769j61j329j99R07P22r48r59R47P15l60j122K69
4099e41J113K25j494j83J127N69q45j007P30J499j027r09K41J389q7j578R5J356
4117F73L48j410n90J036O28k26j683P44J535n24j314o5J365L56j234m74P65J042
4135I72j063j066Q93J263p07j291J98J862J21j846m74J664N01j203n11O87Q26
$$ y = [690, -1147, -923, 819, 899, -791, -1101, 63, 1025, -42, -913, 155, 1160, 439, -1295, -445, 888, 691, -467, -1010, 474, 1404, -293, -992, 503, 936, 100, -875, -683, 1098, 627, -1098, -954, 420, 991, -262, -966, 215, 1183, -93, -1074, 385, 825, 515, -982, -824, 684, 1056, -751, -682, 452, 842, -294, -1107, -272, 1207, 595, -1216, -346, 875, 887, -434, -928, 581, 1172, -337, -1272, -250, 1062, 391, -1100, -623, 789, 1048, -779, -792, 977, 816, -513, -712, 195, 917, -31, -990, -43, 672, 312, -810, -541, 572, 797, -697, -880, 247, 816, -29, -1036, -306, 1193, 166, -743, -502, 887, 800, -778, -683, 673, 1021, -389, -979, 57, 685, 459, -1224, -480, 1055, 531, -783, -848, 517, 873, -361, -835, -70, 972, -91, -1157, -264, 999, 292, -999, -801, 1061, 1182, -664, -1138, 526, 1027, -176, -687, 0, 826]
4152H26l70j487P74J014k35j122k03J351M08j611n15R40J055p87r53L96J433k96
4170F18j280M3J293J78q74q19J011P38q38j016P86J439q91j303K77J586k63j184
4188d99n80J640N6o51j178J002J455j225j217R30J058j33j271l39J250N01r27
4205a28p26J129L20k88j366O56J234m81j150K14J043M49j558n86J264J289j136
4222A79j505J417R79p82j008r5J456K55j402n7O99P70j036r79Q83J140o04j317
4240a007P02J036j27j153l42J366N15j378p24J303O54p11j247R52R54m09j180
4257g96L40J255l70o52q88J533O57j125q99N82J324n16j378N82R46l1j399n3J326
4276D38L97q47o06L29Q90j42j215J88J422k08j282l66J327L08j189r9N84J230
$$ y = [826, 456, -1031, -257, 757, 522, -600, -803, 548, 956, -655, -1170, -230, 825, 38, -915, -519, 914, 618, -662, -619, 674, 852, -22, -841, 170, 908, 70, -946, -160, 1279, 388, -915, -638, 948, 685, -499, -1079, 561, 617, -34, -1212, -210, 1245, 20, -1197, -267, 791, 658, -613, -952, 298, 799, -128, -854, 275, 595, 307, -1059, -403, 831, 350, -800, -586, 457, 906, -652, -1238, 26, 1315, 179, -1326, 91, 1070, 288, -720, -815, 641, 896, -506, -563, 136, 906, -130, -1109, -226, 914, 310, -1007, -305, 731, 604, -549, -891, 475, 990, -388, -1112, 191, 845, 134, -1113, -161, 793, 384, -796, -456, 799, 429, -223, -1111, 422, 1079, -46, -945, -363, 961, 445, -933, -351, 595, 564, -835, -888, 438, 835, -12, -618, -289, 601, 459, -756, -568, 854, 646, -636, -1002, 325, 633, -556, -655, -71, 1159]
4294A159q76j327P65J698j184q02j0J253K38j171m97J150L54n78j065O47J243
4311I97m78j436J02J841l13j528J80R77N05r06q94P76J077p26r45L74Q57o9j087
4330f96j82J261O77j365m93P39P91p07j215O53J576n53j191O0J121O52j428q50
4348a150J508M67q54r57P91J134m19j417O4J674j08j549K30Q36K49p34p27R82
4366B0J058r59j001N79J123j59j355J64R05M07j156l36P48J095p35j267K44J701
4384A076n16j128LJ136N55j475q05J261J116j314j023J099J020m93j343j34J316
4401C51K79j233l72R36P86o09j244R77J175j046q99M58J206j96j438J64J104P27
4419A126j085p93M26J205o19j156N94J340p04j023J55Q77O81j491m45J101N95
$$ y = [1159, 283, -1044, -279, 1419, 235, -567, -577, 676, 914, -257, -754, 396, 750, 172, -893, -246, 997, 519, -917, -815, 1026, 713, -815, -635, 342, 847, -59, -953, -177, 900, 174, -771, -397, 460, 391, -696, -878, 383, 1060, -305, -798, -59, 732, 25, -1190, -537, 1039, 486, -705, -645, 476, 1128, -300, -1150, 358, 825, -29, -986, -195, 939, 520, -897, -833, 841, 733, -816, -586, 250, 499, -235, -962, 20, 1078, 119, -882, -303, 820, 661, -694, -530, 375, 782, -374, -710, 38, 1133, 398, -869, -625, 1076, 560, -568, -565, 571, 1126, -349, -1154, 107, 1223, -91, -1114, -15, 1005, 512, -831, -965, 351, 630, -603, -975, -39, 747, 138, -1106, -129, 1046, 0, -899, -441, 765, 569, -869, -705, 399, 1126, 41, -752, -326, 879, 260, -896, -302, 1038, 334, -689, -534, 343, 1024, -467, -912, 189, 784]
4436G84q74n47L32J321l06j593N16J122j59j094m17J024R28j028q17P48R62j048
4454a46q21O37J094j70j389q2J403N16j494k87N27R82n62j080L85J300k54j498
4472i39N92J071J33j214p42J610M48j007r73Q20J090m10j142L4J553j97j255l75
4490i03J190J081j149j199P30J398r36r80J85J282K4j441j87J111N72p95r92J242
4508B33R07q44j251P51J096l50j087q6J058O35j456l13J000Q65j476q01R23J197
4526A001m82j548N64J313j90j133k95P65R00j037r62J237Q69j010q37Q21O61R1
4544G28j624K00J308J88r71m59N30Q88l36j316K66J262j53j331M0J421L44j326
4562c41o02J433J01p21p27O62Q48j53j321K02J408q8j147n21Q38Q36q35p33Q08
$$ y = [784, -90, -637, -305, 1016, 710, -883, -367, 755, 596, -498, -915, 109, 1037, 9, -808, -60, 902, -146, -967, -330, 764, 594, -795, -877, 526, 1042, -452, -739, -212, 770, 208, -872, -487, 813, 559, -939, -347, 724, 857, -357, -1099, 511, 959, -48, -1021, -201, 889, 479, -663, -629, 924, 727, -528, -903, 287, 1368, 219, -980, -250, 1148, 212, -768, -583, 699, 723, -718, -905, 206, 778, -17, -1009, 233, 1140, 296, -955, -204, 892, 542, -545, -631, 427, 1062, -394, -707, 293, 1158, -318, -1119, -196, 1001, 519, -1029, -465, 848, 658, -475, -770, -5, 895, -142, -1104, 133, 1002, -8, -845, -24, 637, 728, -896, -696, 612, 800, -171, -630, -100, 788, 452, -864, -598, 664, 511, -820, -780, 641, 985, -341, -943, 490, 591, -130, -857, -195, 653, 500, -821, -619, 789, 701, -446, -967, -129, 707, -128, -861, -53]
4581e3J024p26j171M15J333k20j020o57J256P08j064n31P02O44m58j169O32J040
4599F85m1j053k98J239M90j388n76J194O56j041r32P26J018Pj378LJ703k12j587
4618g85K53P74Q80j097j238J390O65m44j179K50J339j84r73n86J281M66r73q73
4636a034P90J110p06q26L26Q42J01j330L37P97O7m40r69J149N95o51j049O68R11
4655F88k44j306N76R30j1j096n02J294N60q54j178R46Q61j37j450K08J245L34
4673H64j360o95J493J98n29p84P66O98l42j022J01J346j18j356j02J078L97j001
4691c68m90J043O48j034o83P88Q20k97j110P8Q56K99q47n34Q32O45l66j322Q84
4710a58J051k71j055n3J006J28r25l46R21N70j058m00L36J356q40q78J12J168
$$ y = [-53, 971, 245, -926, -511, 822, 602, -418, -1075, 181, 889, -175, -706, -4, 640, 182, -987, -355, 685, 644, -409, -707, 532, 1022, -366, -942, 252, 908, -133, -1065, -339, 679, 686, -692, -689, 1014, 802, -785, -532, 242, 1122, 25, -1213, 177, 842, 398, -781, -531, 808, 624, -349, -935, 346, 812, -161, -1034, -244, 866, 160, -666, -340, 502, 603, -727, -390, 407, 474, 34, -935, 214, 809, 158, -891, -223, 688, 444, -862, -286, 644, 633, -463, -965, 329, 889, 35, -1143, -197, 664, 527, -923, -715, 530, 864, -496, -1191, 302, 500, -29, -813, -47, 651, 309, -713, -612, 734, 616, -740, -842, 236, 633, -368, -858, 185, 833, -201, -884, -96, 724, 427, -683, -605, 251, 550, -297, -831, 1, 646, 280, -1042, -158, 893, 622, -433, -486, 520, 648, -277, -623, 298, 868, -190, -590, -254, 1102, 262, -616, -504, 664]
4728F64l71n43n81J075N45j326p06J279P03r75n98P10O80K9j453M85J163k03j065
4747d88q9N82Q99q33j049P71O30m5r54j93J404L42j468k16J100N73j146p86Q05
4766a61J165p87j057M14J272m74q69k01Q67R44j275q32J072L76l44j041M18J063
4784E50l0j412k8J504L8j120j83R51L72p71o47O25J010m65j014l7R80L56j157
4803d78l26J001P13j029n52N87O54k75j126M03J410k76j297j00R22O75j026n04
4821f24Q89M21m22r34K26J281q5j268J24Q51J23o78p72R40R98p72j320Q14J052
4840H44o81o70OP26K66q12l30R02N74p79p98M89J031n00o89K02J105n41m96o20
4860g71P26P32r67m15N88J003p76r07L84J057j68j131M19P46K01p02o95J078M59
$$ y = [664, 293, -250, -831, 244, 789, -537, -1243, 36, 739, -236, -834, -124, 556, 585, -868, -383, 780, 577, -488, -577, 5, 904, 71, -978, -207, 423, 378, -576, -769, 635, 977, -491, -707, 393, 966, -180, -966, -161, 1004, 217, -840, -426, 846, 372, -497, -698, 169, 1113, -162, -994, 78, 454, 110, -931, -513, 550, 520, -892, -920, 584, 622, -498, -681, 270, 642, -129, -776, -151, 859, 394, -620, -657, 323, 679, -478, -804, 197, 910, -119, -671, -84, 570, 295, -831, -428, 982, 706, -591, -691, 231, 906, -120, -624, 265, 686, 264, -670, -444, 837, 752, -516, -392, 459, 582, -96, -868, 72, 1070, 298, -1022, -208, 844, 163, -507, -501, 225, 491, -321, -651, 251, 825, 46, -752, -263, 768, 268, -421, -219, 886, 345, -151, -771, -45, 687, -280, -695, -107, 896, 120, -787, -403, 654, 486, -645, -226, 520, 721, 19, -676, 402, 861]
4879H61o60q76N00R30l14p76oP77L15j155l03R83O34j261q26R20R77k57j285J92
4899f30J410l23p89l16J011M49q56o71Q31J027o27j300L02J085j01j126K66P60
4917D02N30j093l71M68Q93p30p61L97R43j00j443M60J286Lj524l87R49R61p11
4936A72j045O58J235p27r93M63P20J02r14k41P85Q82j396k35N39P56p12p68L73
4955c46J003j19j287M2Q35N52j021l94P39O51n77p81Q60O22l71p56j26J154J69
4974H49j163l55O50N09r8j240R19P01n51r53M86J275p54n93o90J277O30q61q07
4993g69Q41P90l39j234J11J407m7j578J49R98K18q16m13N98P75n14q80M86R27
5012G10k54j024JJ008L65j313k52Q73O10l69j001N43J003n74q93K60N66M25q16
$$ y = [861, 201, -675, -175, 755, 441, -335, -341, 436, 751, -404, -707, 276, 910, -351, -1177, -257, 720, 463, -822, -630, 780, 457, -332, -648, 363, 812, -44, -715, 116, 1143, 516, -784, -482, 603, 502, -624, -358, 402, 932, -161, -532, -64, 829, 99, -662, -265, 678, 578, -865, -405, 881, 884, -640, -1027, -78, 883, 172, -873, -215, 1020, 293, -700, -237, 483, 585, -329, -570, 215, 1097, -299, -534, 5, 761, 49, -719, -346, 657, 538, -749, -707, 128, 680, -341, -735, 4, 655, 78, -703, 157, 779, 408, -348, -474, 680, 849, -314, -669, -19, 490, 392, -848, 71, 772, 221, -732, -246, 1029, 275, -318, -1008, 269, 899, 38, -769, 72, 862, 523, -711, -600, 807, 760, -818, -669, 329, 547, -269, -682, -84, 691, 177, -703, -217, 710, 456, -568, -567, 441, 806, -507, -759, 114, 724, 355, -646, -103, 900, 326, -567, -307, 259, 684, -132]
5031a32l95M91O15o31p17O72Q29k89r61K78Q69L3j334K88N43L31n07o19O10P39
5051G13p27r14Q21N46m6j176L55Q39L87j282k23O68Q19n73p87M89J085q59p45
5070f10L42Q63J23j054o06J242P81j297n36R49K17p7q55P2J022J40j034j69O67
5089A80N77q52m41L21O84m82p43N38O15J0p19j01N82L75j022k90O35N96j93p91
5109e21J27J154n34j114M96Q19J41r11m37J118K82m49q41M39P70r3r78J45R96
5128F09m9j101k62J181L77r43n72M20J163m39j025N65N62J49j299N3P22L16q61
5147d34j48N07N25l33q64L61J092j14r82j7O58N12j235m40J290L68r10n62O76
5166e0M06j85q17L04Q80j50p08r9P76J77l87r23Q34O95m44q52M0Q89j11o88j56
$$ y = [-132, -527, -36, 579, -52, -769, -97, 732, 443, -518, -240, 629, 662, -672, -384, 159, 490, -17, -636, -26, 713, -14, -928, -107, 439, 393, -783, -428, 411, 798, -484, -707, -39, 780, 207, -580, -91, 994, 135, -610, -268, 595, 718, -336, -942, 300, 1081, -216, -752, 197, 414, 337, -518, -446, 576, 716, -318, -487, 180, 757, -95, -536, -215, 469, -13, -756, -218, 397, 407, -312, -413, 169, 544, -478, -768, -133, 463, 270, -521, -394, 760, 226, -888, -392, 427, 568, -343, -780, 338, 620, 171, -670, -231, 539, 446, -532, -387, 609, 560, -541, -803, 378, 755, -188, -760, -340, 823, 384, -641, -76, 486, 635, -664, -611, 111, 427, -434, -582, -75, 450, 117, -747, -386, 706, 592, -390, -407, 251, 763, -472, -912, 378, 746, -164, -726, -50, 356, 171, -646, -342, 538, 388, -320, -419, 357, 534, 147, -776, 58, 753, 309, -543, -503, 386, 275, -413, -569]
5187e69J190Pp78q64R94O94p27m80L23J010n02o86j03R37J82p55m17O94O15n95
5207A70r96P14O90j85p79k89J408k01j095q1Q13O39p81p28M13R69n91q10L35R56
5227E71P7p74l15O37M14q42k85O39M31m54o33r4J174r6q67k28R65K95p79m49N44
5248f9O43n78n10K47O20n0p92O3O79O41j143o15O47Q53j36r11K20R01o07n72J37
5269c32Q21j7l76o48N19Q03p61m84M52P06o27n64j34J141m2r05M25L74K35q69
5289b83o64R82O24o68o60M80R27n3j168P4J051K3o92m96O57M22l12q95O03O11
5309E63l06r11M01P58l6o75j93O56N76o79o74L05O83k33r52N04Q05k89m09k82
5329c88Q42J36o51o04O12O56l82j021N86O02l55l86k25J056Op20j16O85K69o43
$$ y = [-569, 621, 628, -150, -1014, -20, 674, -53, -533, -210, 800, 298, -388, -491, 446, 628, -127, -544, 150, 765, 170, -826, -112, 578, 393, -386, -675, 733, 532, -563, -644, 169, 808, 27, -701, -288, 681, 90, -720, -385, 571, 648, -126, -441, 196, 610, -232, -517, 122, 553, 99, -534, -628, 546, 450, -417, -645, 320, 615, -164, -613, -69, 574, -4, -514, -267, 353, 303, -489, -426, 253, 894, -249, -864, -217, 636, 500, -411, -191, 710, 103, -469, -332, 489, 472, 96, -552, -33, 770, 9, -475, -23, 683, 56, -508, -642, 499, 457, -448, -23, 351, 586, -283, -947, 35, 659, -9, -669, -189, 738, 685, -483, -409, 642, 665, -27, -523, 134, 556, 244, -651, -48, 563, 257, -654, -253, 505, 469, -206, -399, 257, 833, 154, -520, -215, 468, 235, -717, -213, 592, 303, -106, -388, 454, 590, -61, -665, -53, 603, 221, -800, -214, 388, 33, -353, -578, 478, 484, -236, -352, 333, 602, -41]
5349d1n66J97J068j94p61j5O00J23o86n15J012M97p46o58M69Q40p05m28L93N34
5369D18K32j061l66R38N16q17o38Q52M36o87j92K71N17J67j318J94J083L2j058
5388d81j07O26K62m41q7J64P08n02p07J27M70J95p20j01R43J21o26l47O59M2q9
5409A09n94L24N66P4q43n01J205M8m71o15O94O26n38p02NR51K71j317J11J208
5429F11k29q76N1N54L73l99l92K52Q46m07p37L58N43k13p85q9O74M43q75l92J036
5450C47K09k38o11J55N39n02m94J97Q16k14k13o31P38L35l79o38K92O62k15n08
5470c53JN27M20p80l03M06M04n5r08J83J266n63n38l77R12K95o56k65N53O61r55
5491a25m10N86L75l18n31k52J002R8r32q4P84J10o16m41O86N99n01n51M82P43
$$ y = [-41, -607, -410, 658, 464, -297, -312, 288, 411, -275, -790, 222, 719, -27, -685, -216, 624, -81, -509, -116, 418, 650, -411, -777, 161, 677, -140, -778, 74, 510, -177, -369, -98, 419, 586, -732, -538, 545, 577, -481, -588, 38, 300, -141, -228, -64, 644, 142, -565, -438, 32, 227, -493, -594, 349, 470, -156, -503, 156, 198, 109, -485, -161, 405, 479, -364, -865, 340, 388, -83, -698, -4, 622, 84, -618, -613, 338, 609, -708, -597, 611, 382, -494, -443, 111, 484, 85, -307, -55, 791, 384, -353, 5, 548, 335, -450, -539, 135, 578, -297, -689, 347, 556, 318, -293, -138, 401, -101, -595, -398, 418, 204, -9, -640, 98, 433, 54, -584, -292, 370, 155, -353, -352, 175, 595, -185, -488, -82, 322, 267, -641, -458, 808, 245, -293, -670, 242, 537, -119, -384, 169, 830, -125, -535, 51, 426, 108, -423, -675, 327, 425, -507, -591, 193, 303, -313, -754, -68, 531, 30, -521, -39, 704]
5511G04m43n91l32R88K06p77k87Q36L31n84m85K79O48m28m07J01M81M28r57n59
5531h48Q45O24o61m22L88O01j7j163L75P28k25p12j09O44O00o00m57M52J25j87
5551a9l15p1M72K56n78j55P94q2l41l46K93N00k51p52K48Q89m64n34J40L94O43
5572G21o65o28P75L22n29p44O81N14m97k21J50N92r4p33n2N27M05o73j87M96N14
5593F74q11k56J45N83k11k95o19J323l72k65l73M85L95n93n13O30P79m49m64k52
5613d59P12J37o63k00O84K25l97o80Q22O5K55j117L78P51j53q28L41K82O33p61
5633B7n21L97N25k65n94N0J057k13q47K18L66L88r83J87P6O53l66r15O70M80l40
5654E0m58J32L85J70n08l33N40N41p50k00L85O07o23l93K77O72r2l24o21M89N84
$$ y = [704, 261, -330, -662, 326, 532, -245, -532, 304, 635, 51, -434, -155, 493, 65, -342, -241, 240, 668, -289, -848, -3, 621, -40, -462, -74, 527, 510, -653, -278, 450, 225, -487, -596, 48, 648, 48, -409, 43, 168, -19, -334, -405, 67, 323, -255, -410, 384, 302, -39, -385, -92, 408, 157, -595, -347, 542, 78, -456, -316, 78, 721, 56, -572, 203, 525, -4, -748, -67, 447, -50, -271, -121, 471, 377, -356, -408, 119, 524, -149, -336, 160, 674, -137, -393, -248, 335, 124, -171, -790, 533, 161, -104, -477, 8, 403, -190, -703, -73, 706, 257, -207, -459, 253, 390, -273, -473, 211, 436, 39, -641, 181, 246, 501, -616, -238, 513, 360, -468, -127, 155, 788, 27, -494, -97, 428, 163, -431, -381, 676, 463, -384, -166, 200, 588, -395, -208, -132, 521, 155, -760, -90, 390, 50, -408, -276, 109, 279, -229, -562, -22, 519, -231, -431, -46, 561, -62, -455, -178, 494, 402, 78, -543, -54, 530]
5675E30p10j09L29L63j66m39Q1Q10l27o72l30R86j19o82k6K10R52n29o96Q34L13
5696F03m14l52j02N40M17p00l78O42K88l12m97M13Q2k56l56K26O04j28l30n70
5716e80Q25L15o63l02M96K64pr57N83M14p3l65k13M46j76n48M3J74O96l8r77L31
5738c12Q58k28p33J34K76K13o27Q2P20K8n04m63N96K60l51l30J30P48l26n66k38
5759f33J134k75k44l07M78L14l45j70q7N63j6o61NN04L99q65j85M69M73m09o76
5780e34N34%K77m56J25O27j05p11j49K69O07n36j00j13Q43j47r41N29L85j2n49
5801a57m72P56J41o98j66N16N21m73m69N05L76j74o53J77Q59j65p78k4M33M91
5821E46n24q73P67N10k11l35k70P50j63n54k3L48K61j51m15M79J75q5o87K40M33
$$ y = [530, -180, -289, 40, 403, 237, -202, -121, 689, 362, -310, -640, 346, 227, -455, -481, -271, 681, 152, -544, 290, 603, 189, -163, -265, 275, 692, -8, -386, 256, 544, 232, -265, 148, 230, -26, -382, -156, 448, 320, -10, -580, 245, 560, -103, -405, 91, 355, 348, -609, -26, 388, 315, -50, -263, 183, 7, -541, -498, -324, 372, 334, -643, -312, 546, 318, -415, -281, -5, 208, -419, -337, 383, 411, -93, -556, 40, 300, -51, -381, -251, 497, 171, -395, -633, 501, 226, -18, -325, 153, 467, 122, -48, -135, 428, 412, -249, -244, 260, 659, -206, -391, 78, 551, 142, -534, 0, 0, 277, -179, -54, 573, 468, -243, -392, -123, 484, -52, -152, -265, 578, 431, -510, 19, 404, 392, -157, -629, 127, 268, -430, -596, -80, 441, -32, -501, 4, 380, 206, -447, -270, 589, 424, -354, -378, 55, 546, 22, -851, -84, 426, 215, -120, -390, 360, 197, -357, -380, -32, 229, 78, -337, 142, 317, 232, -455, -215, 218]
5842B18L62q13m15P59M20m25k84J3O39m20n33M21N87M0j192O64J06L79p39m29
5862f42R50J76l13k10j98P38l11o87jQ81p9m62q0L68j81J48l16K41M54l79k88
5883a91J41M47l30j87k77M48M51n48m17N58L76m09m06P5M87K95n99k45L90L03
5903C62m94j18M19J14l16l63J59N69j18l34J8L68J26p44k59P63N29p98k97L29
5923h5J37j37m05J71O92J54j103L31M29L83l61p93Q45K31j90p82J24N78P4o50
5943c57K00L06K32o00j58L01O02o10m28L31O47j79n62J34M42O4m19j72K53M40
5963D67m36m09K24O21j82n25n7N45k55m6l73N77J15k52j75J35L96l46m73J01Q35
5984D87k35n71Q0M91L68m28n60N45K80l25l45M0K43l4k43l63P37J81p21M4J90
$$ y = [218, 580, -233, -648, 111, 531, 106, -178, -165, 474, 54, -479, -58, 529, 569, -623, 41, 147, 526, -213, -642, 308, 484, 171, -39, -237, 501, 190, -497, -498, 383, 304, -158, -238, 130, -51, 97, -219, 22, 476, 97, -191, -50, 397, 67, -120, -397, 51, 502, -46, -463, 95, 471, 62, -344, -269, 218, 513, -86, -331, 59, 362, -132, -250, 169, 283, -33, -396, -237, 332, 214, -120, -102, 266, 392, -352, -611, 152, 681, -117, -414, -85, 52, -85, -490, -319, 373, 527, -576, -245, 184, 567, 206, -587, 258, 489, 299, -483, -359, 219, 293, -357, -157, 149, 381, -219, -377, -76, 526, -84, -512, -181, 466, 287, -275, -141, 301, 365, -54, -226, 27, 467, 31, -378, -154, 467, 285, -240, -297, 248, -7, -53, -426, 151, 266, 14, -161, -26, 370, 24, -449, -348, 487, 252, -319, -239, 252, 620, 192, -368, 177, 457, 132, -213, -173, 70, 36, -207, -570, 167, 348, -373, -329, -139]
6005a39N84m78l81N45K08n2o49L27K91K4p84k38J019j28k02m45L85K33r8l34j32
6026d44R52k20o41J91M10R0m76r9N86K9j54n99K16N38j07o22L0N26J74m18k70
6047c08L61L61m25n85M30M93l9n89J41M11q8m27k49P30j45R1n17K84N17l49p82
6068f84M74L67J57n60lM58m0j36n43M62L03J4q81L87M31L8m38J0M09l7n21p2N87
6091A82Q5l68j42J05M27Pp73J85O55L8l80l48Q64l75K23r24M12L62lm80J28K75
6113A55O9l66m58P07L17o97J60p7M94k91l36K76M26r1n86J41L50M06p31k91R30
6134E07n3o30r9J81L37M6p26L34M53j50m36kM45K36m23k84L81O02n17n17R5M76
6156B56j07n20N9L42L11m86l39O82J91l84l67K82O2K68o56k47Q40J28m67k87M14
$$ y = [-139, 445, -33, -414, 131, 339, 287, -362, -35, 256, 280, -504, -742, 277, 149, -53, -498, -113, 120, 22, -312, -444, 508, 288, -353, -162, 248, 338, -138, -237, 349, 378, 224, -375, -159, 379, 272, -350, -320, 206, 380, -38, -308, 53, 414, -11, -596, -166, 327, 288, -301, -160, 251, 163, -264, -513, 217, 72, 163, -354, -70, 447, 98, -684, -210, 157, 314, -246, -249, 209, 169, 33, -510, -48, 255, 269, -612, -225, 206, 244, -194, -184, 225, 188, -333, -405, 182, 267, -101, -243, -138, 289, 296, -477, -292, 363, 401, 21, -327, 537, 162, 385, -539, -127, 235, 232, -248, -120, 155, 224, -142, -600, 107, 424, -273, -113, -190, 304, 13, -323, -47, 379, 288, -298, -157, 193, 599, -132, -423, 507, 454, -176, -275, -94, 243, 289, -437, -103, 350, 200, -236, -238, 207, 443, 20, -264, 117, 719, 202, -315, -220, 256, 149, -371, -312, 30, 341, -145, -484, 198, 389, 5, -362, -80, -18, 250, -406, -653, 187, 315, -152, -439, -25]
6177b5N27m92n30L53M06J09m83K1K83j7o53K27M08L55m67k59J49P63o99k71K63
6198c2L26M6q58J10O15K12n02l87M88K65m39j07K63L0J28o49N47N5K66l67n15
6219e05M27N14l34o36K68N52j5o35K03M77J78o89J3J40N11p02l2L13J66j28p42
6240f56P48J87L3o53J11K19K94m85l87R21K8j50n69J52N66k36n1k33O01j06n54
6261b20m7M31K04m88k36J94N39n70j57J90M19K85n78l47M72M56n75m23L35O13
6281D97k30o34N3O38q4m87j9M99J07n05l74L74N40k94m75L13L33j46l31J77N01
6302D53J40q54k63Q67k4n3o36K80N72l25n43j17M19N67p24j49P16q4n63j53M93
6323A9K41o46j04L77L90J9o22R9M94K36l10n61J64K80k50Mj93N79j12n79K65M37
$$ y = [-25, 502, 10, -520, -167, 239, 348, -135, -114, 169, 152, -501, -274, 134, 489, 22, -237, -88, 675, -24, -295, -32, 294, 340, -518, -408, 207, 419, -83, -470, 18, 283, -156, -263, 0, 30, 158, -491, 56, 111, 377, 10, -505, -78, 436, 102, -534, -266, 286, 271, -364, -161, 316, 494, -195, -182, -42, 469, -233, -265, 48, 214, 86, -656, 92, 279, 312, -341, -230, -11, 283, -202, -589, 332, 360, 210, -359, -207, 359, 123, 72, -161, 440, 334, -220, -267, 164, 368, -120, -356, -162, 377, -193, -350, -160, 259, 544, -34, -381, 91, 547, -28, -451, -116, 497, 267, -367, -314, 324, 240, -247, -266, 233, 340, -165, -539, -165, 375, 81, -394, -81, 252, 106, -225, -48, 453, 593, -261, -524, 343, 319, 266, -370, -90, 482, 157, -386, -503, -84, 483, -241, -390, 326, 242, -321, -474, 19, 260, -386, -490, -113, 277, 296, -326, -227, 267, 503, 193, -368, -204, 76, -174, -170, -363, 216, 104, -475, -210, 227]
6345B27J90n11k84M08J60k15m73M31N96k16m03k01M87n1n09PL71L34l07l30M41
6366A52L48K6o55%M79m6n14L9K04L31l69l58L45J74j46o66N52P30m52m16P9M76
6388C13J31o91k97P13J32p8o77R7M48q7l90L00L26J38l05n71O83K4l3o18K64O17
6410D39l37l07J5N25J3q74M86lJ60J0m91N63J75k54k97J64K61J33p46j65R30J64
6432E64n22p4p3M13j40n27L41L40l40j90j20P39j6o63j69N24J30l25l33K95O14
6453D68j96n89p1L55K63l06k28M88K03k37m28Q8L04m9l70L30J09J44o65j9M83
6474G7J78k28n15J73Q76m97k40J33N05R0q52q6L40K63k55l04K92M12k40n95K34
6495b39O35j51n30J0L92O7k95j29O72j54k73m32K84O13m28o22N05M13j79m16k49
$$ y = [227, 417, -94, -378, 30, 190, -25, -498, -67, 529, 313, -90, -291, 196, 145, -364, -357, 14, 348, 41, -289, 152, 500, 526, -129, -129, 350, 304, -210, -171, 33, 364, -5, -363, -18, 156, 10, -656, -104, 626, 174, -242, -163, 313, 444, -247, -544, 169, 301, 223, -454, -357, 91, 4, -386, -86, 240, 378, 73, -498, 185, 209, 176, -442, -178, 439, 102, -205, -190, 335, 348, -526, -40, -43, 117, 127, -364, 199, 374, 120, -177, -13, 248, 381, -365, -530, 400, 564, 42, -32, -105, 308, 168, -359, -18, 322, -18, -208, -328, 411, 395, -268, -437, 87, 217, -108, -441, -146, 468, 272, -317, -388, -33, 230, -76, -304, 184, 387, 150, -278, -190, 114, 65, -305, 25, 134, 278, -387, -406, 77, 255, 27, -488, -315, 561, 64, -176, -43, 462, 552, -300, -386, -46, 217, -38, -342, -50, 362, 122, -473, -239, 396, 245, -285, -275, 117, 184, -111, -240, 432, 278, 5, -427, -143, 470, 42, -580, -75, 338, 159, -257, -506]
6516e06Q59O9l78m01L25L29n82j21K45N03j81l54N3M68j72l03l20K82O67o50k66
6537d34L74N43k60m39j01O08o9l82k28O36L18m98k38k04Q47l66n83L33K94n9j96
6558a04k86L66O09o51m13M98K04m09j84M05J48K73n28n6Q8K20o10M60j7J07L63
6579D83o69J22K36J29p77L56J83M77p28j19L42L62n49k29J40P58m77l32J76K95
6599A79O5n22R6L48J84l41l07M63L4m3m49N0J76L75n10k57P67m4m74M51m7q7o5
6622D2l74J41N31O5n10q2L47L27p21k13M26M19l50j11J44K44l47m07j1O98k18
6643D0k60n3L73L08n98j82J63N49k04j23l03L92K34r88N45Q8L74m96k20N67J97
6664D03l36l81J86L01K2l65o5L79j09k69J03j23M61l96J06J7K42j00l26J37K42
$$ y = [-506, 353, 422, 44, -357, -32, 297, -285, -406, -161, 342, 161, -193, -140, 328, 156, -147, -467, -185, 482, -168, -434, -60, 483, 223, -216, -317, 291, 222, -160, -388, 248, 566, 68, -170, -374, 473, 107, -476, -143, 151, 92, -104, -390, -24, 585, -66, -479, 19, 223, -186, -370, 35, 183, 456, -72, -128, -40, 180, -430, 30, 13, 120, 483, -186, -64, 172, 301, -476, -120, 63, 540, -188, -307, 35, 397, -152, -381, -241, 517, 40, -292, -116, 179, 244, -278, -182, 166, 350, 9, -298, 165, 199, 156, -293, -243, -67, 308, -202, -459, 308, 264, -210, 241, 194, 107, 42, -332, -191, 340, 405, -105, -187, 160, 487, -234, -447, -21, 398, 48, -63, 81, 325, -22, -429, -440, 258, 40, -220, -273, 100, 408, -190, -372, -209, 340, 136, 13, -290, 102, 336, -652, -107, -19, 355, -141, -361, 206, 403, 67, -314, -128, 173, 195, -170, -235, 144, 35, -234, -131, -254, 207, -189, -83, -66, 176, 76, -250, -113, 129]
6685A29L12n88J13J99K8n4o97N17J32k5l93K44L09k4m02K7L19rj86m53M71K29
6707A98l3j96J6O5K09l34p6R9L51l22k57M38J0k04N2R6L69n01j52j00N07J45o70
6730b90k09N90Q3k17m22K62M78j43o52N22K38m6l64j33N48l10K8n40O12L68n08
6751a05K23J43J79k50l41J12K30K69n74k81Q68k02m03j78L63R3j72k5M6K32l06
6772g9j63O6L87R9m78j16K27M60j96o50Q3N18K55o59j49P46o7m55l69K22P79m31
6794C0m01J77J99L68n27j97N81M7j19n63O11J64m88nK17J66j45m27p8N78K16m32
6816b8m29N84k6j11k77K13L55k30j36n5M18O6o48J11M65j05m76K9K03L55l05l41
6838c68M12K72k21r1m16N55M26p09J03k11M82k20m67L68N33k91k91r5N7N73o99
$$ y = [129, 441, -147, -34, 165, 193, 139, -558, -41, 91, 66, -327, -83, 226, 202, -200, -173, 146, 137, -49, -502, -31, 198, 165, -31, -15, 50, 259, -75, -151, -52, 299, -23, -280, 158, 168, -36, 16, 112, 481, -20, -172, -272, 235, 380, -290, -499, 91, 174, -43, -465, -203, 275, 132, -520, 2, 240, 194, -170, -303, 245, -65, -37, -577, 35, 403, -105, 118, 261, 440, 190, -151, -39, 191, 460, -114, -395, 473, 271, -132, -310, 53, 146, -26, -51, -5, 227, -79, -242, -176, 211, 310, -168, -284, -57, 403, 207, -443, -360, 158, 413, -246, -395, 351, 284, -171, -540, -318, 461, 30, -371, -194, 5, 373, -154, -351, 230, 277, 158, -405, 206, 370, -118, -123, 94, 260, 115, -312, -390, 188, 404, -28, -457, 127, 101, -10, -287, -74, 281, 51, -85, -140, 278, 344, -304, -193, 272, 167, -309, -280, -77, 278, -27, -368, 44, 316, 95, 4, -412, 143, 569, -140, -37, -248, 234, 14, -453, -85, 448, 157, -134, -229, -172, 401, -298]
6859b98J92L22K9l76l86K23P58l65m73J64M43J2m87R6L19q0j16p4K04K54K19q60
6881b80l4L14J98j88k57M27q1k64j65K13M43m59j02L57O6k10j89K12K00k9k11
6902c9J54N2N5Qj08j28K85n8l98k06M40n0j84J19kL32p47K71K4P49o09p6Q8O31
6926F03o09k73nL28M2m51j0L69K39k22m22L35O02o49k18J75K05L17n65J34M13
6947C38J36l31k82J18j1L24o24L21J93l7o34J66P38k07j08l11M02j14j02j75M31
6968B31J1m01l91N60Q5j37j45j70M45L75p29l2K39L85k95l78J94L23J93m48l68
6989d53N33K12k77k72N63j55j99j67k02M92M6k71j37K85J28J15q00Q61j94j52
7009d4m3j06N87j85m12j9M31n4j59l73J67M91l08j91J68L52K1n99K40J65j44l23
$$ y = [-298, -106, 216, 245, -131, -517, -294, 464, 99, -374, -210, 233, 245, -242, -146, 173, 93, -23, -97, 107, 361, 580, -280, -314, 0, 198, 10, -247, 180, 99, -165, -330, -117, 326, -133, -235, 122, 188, -22, -211, 1, 201, 172, -39, 115, 167, 222, 230, 122, -6, 279, 221, -177, -383, 57, 7, -177, -58, -60, 272, -475, -204, -180, 569, -40, -116, -28, 603, -6, -279, -284, 44, 86, -365, -375, -6, 233, 11, -411, -76, 526, -123, -341, -166, 39, 356, -209, -75, 338, 474, 143, -139, -21, -32, 292, -332, -11, 182, 145, -489, -323, 415, 208, 100, -211, 191, 77, -25, -200, 231, 242, -159, -550, 10, 95, -42, -187, -357, 88, 463, -266, -298, -59, 326, 31, -347, -153, 170, 363, -85, -453, 80, 292, 15, -257, 306, 151, -48, -215, -417, 75, 121, -150, -287, -2, 126, 241, -559, 302, 108, -44, -87, -193, 394, 209, -203, -222, 209, 155, -4, -377, -210, 281, -27, -218, -50, 302, 323, -276, -36, 129, -15, -338]
7031c38L66J68K70q37LM54j86Q2q9j25L23M75p59J89J97J46m44j26P5L83j35j89
7053i7P6N5Q7j22J74Jl6j55k96O78j41j35o45M35K52J9m74m4P62m15k7k94M63
7076A21j54j0j69O5N74l23o59K26M64k61r6qN37k08n00K57K4K21Qk98K87m7N2
7099A03n07M82ML86n53k11L11L19n64L59P9K7m5n26j6P99m70j06Q6O8L91k57k77
7122a18K07L93l48j35j72M88l5l92l01O13K33m62n0K6M87o05j65Q1M61j27l97
7143c18m0M26L64n25J56P0K17m21j50J84K09j74j6l6J82j5l58M9M99j16j6l74
7165b03N10J20l56k93j46L00J22k15l63P07ok07j80L73L32k72q23O09K89mm39
7186a45J28K44j15k27l66N83J39k84m2M7M78q23J72MJ02M54k36m42L16N51p52
$$ y = [-338, 28, 196, 466, -371, -368, 86, -100, -18, -107, -232, 91, 566, -193, -4, 193, 339, -105, -231, -156, 227, 92, -97, -21, 34, 121, -1, 173, 174, 138, -17, -313, 365, 224, 89, -556, -121, 131, 150, -324, -368, 394, -21, -48, -342, 121, -33, -43, -212, -147, 427, 104, -555, -329, 135, -126, -222, -230, 307, 99, -401, -144, -120, 101, 109, -189, 98, 51, 103, -404, 78, 82, 468, -85, -296, 15, 334, -230, 129, 208, 235, 190, -336, -352, 447, -23, -129, -43, 25, 416, 159, -118, 89, 482, 134, -1, -173, 315, 280, -112, -413, 200, 433, -29, -79, -53, 434, -171, -336, -255, 206, 79, -318, -358, 68, 432, -93, 63, 133, 350, -71, -221, -37, 172, -2, -18, -54, 128, 113, -245, -196, 303, 187, 171, -203, 307, 427, 71, -222, -368, -68, 54, -161, -524, 183, 177, -30, -210, 163, 495, 223, -600, 9, 298, 294, -145, -17, 227, 112, -115, -481, 102, 241, -43, -85, -38, 440, -383, -211, -207, -105, 349, 113, -329, -13, 538, -214]
7207b14P5L0N76k54m42J63K84j90j59j1j0M49k16m70L70M25m65n65L44J028m75
7228B73n27o0P23k86j85R7L59J05k92o08L24K93k32m51N25J49N9o97M27j05K25
7249A16j6n25K25J96J31p87O74L02j04k63j98K85O5n45K87P0J98l6o86O45K94
7270C28o0l54m46O54J38m13l45P42J49m61j65J38M86k96k33m1M86J51k85j41K65
7291B97o6jo71N97j62K38l42N0L04j71j97q2M17k46J84m99K69L13m07j90M04J37
7313A76q6n38M62JP4l81j62N33J38k43k53O57j95o3j38R5M12l80k94j03L71L96
7335D79m08l53J69K94n1k95Q5K93o1j00l46N70j98q8l00R4M65l86o6J70N90n94
7357c7j68k6K86K08o80J26N24o5o5j92l6L31j35j04j74J81j5j32j36O10nm60l4
$$ y = [-214, -139, -109, 467, 213, -229, -66, 218, 28, -131, -142, -152, 297, 81, -389, -19, 406, -59, -624, -280, 748, 273, -254, -314, 409, 123, -62, 35, 394, 499, 207, -401, -77, 216, -16, -467, 58, 207, 266, -431, -4, -109, 116, 100, -425, -200, -4, 127, -660, 14, 316, 212, -51, -249, 36, 101, -444, -157, -87, 111, 75, -611, 34, 328, 268, -86, -532, 122, 260, -153, -498, 244, 393, -68, -233, -95, 391, 95, -138, -179, 307, 458, 173, 32, 297, 231, 230, -441, 156, -6, 232, -110, -60, 244, 73, -124, -206, 211, -35, 149, -350, -81, 232, -175, -365, 39, 176, 90, -448, 14, 15, 89, -292, -454, 79, 217, -26, -279, 378, 183, 120, -18, 77, 489, 109, -185, -288, 83, 479, 71, -282, -113, 181, 130, -165, -80, 213, 152, 52, -294, 276, 78, -10, -310, -216, 249, -137, -203, -33, 557, -37, -205, -231, 55, 263, -417, -291, 233, 168, 103, -89, -125, 206, 71, -33, -207, -26, -41, -173, -309, 301, 296, -164, -198]
7380a98J90L08l41j53j18N67j5m54L18n4l8j15p7J50M33n20q1M2K22J84n93Q1
7402b62J42L83m71k10K24N18l66n6q7O58n31l13K15M67j9m12J64M2K05l92j3O
7424a08N50l89l57m1L55M62n85JL95q3m27K68j6M7p0p6l66R12l46m64J84K00J35
7447A81j03m21K06O41l90j46o7M85l78m45J71L18o7m09Q7L25L1o4j2J7M55l58
7469E7j81J9M52M0o42j12L58O2J73m97K31L27k30j30K8K45j41l50J86K16J67o91
7491d13N6J40l6L48l67K40K93j59j63R3K97k42P0n42M34J95k21j05l3L74n95K37
7513i9p9N23k36m60q1O08K17m13j5j68K24k16r0k06Q33l16k42j00M30Rj74j11
7535a62L55J22m52O1m4K71p5j82L5M61m5o48P1K65O7J13p24M62N26m05m96J79
$$ y = [-198, -8, 300, -41, -194, -312, 255, 240, -214, 104, 50, 12, -103, -180, -30, 403, -117, -198, -156, 66, 250, -343, -262, -120, 263, -208, -418, -194, 324, -42, -98, -185, 473, -58, -371, -156, 311, 292, -120, 44, 86, 291, -101, -114, -108, 442, 53, -304, -345, 10, 472, -113, -112, 283, 200, -227, 41, 25, 72, 2, -74, -440, 472, 126, -338, -154, 46, 181, 78, -343, -137, 504, 114, -32, -99, 386, 8, -437, -266, 52, -15, -424, -337, -12, 19, -45, -57, -40, 415, 57, -124, -105, 347, 387, -255, -367, -9, 53, 226, -271, -40, 287, 57, -73, -45, 200, 59, -291, -105, 111, 278, -413, -357, -217, -253, 95, -272, -32, 261, 102, -61, 32, 329, 87, 157, -385, 49, 244, 23, -82, -115, 259, -336, -99, -178, 345, 109, -351, -432, 176, 393, -20, -35, -203, 21, -195, -285, -491, 342, 26, -216, -316, 114, 123, -51, -162, 193, 315, -137, -76, -120, 151, 76, -106, -71, 390, 345, -303, -232, 33, 100, 213, -511, -49, 477, 72, -424, -245]
7557b45O15j6n78j11M63k14kPK84p9j15j50R2M29k91j73j83M10l7m7k39N28k03
7580A45m02M2j3M38l74l3k01M40l8j63n0M45n1mn42N35L3k82rj4j31J60j86J31
7604a24J14J93k33j61K33K22j76k88J07M38m28q3m8L17K71o38K05k60N00n1l68
7625b58N7M55o0l11j83K22Nj52j19J05O42m05k88j2N31m16lN3J90k1k3O5R6k08
7649c8j07n1K35K78m48l53K94L86j60n15J46N28nm01j62N6O12j05m81J7L06K78
7671C10n66L94r3J00m28n1K21N14k17l25J17L12l37p8N06r9R7l31k49L13K84p49
7693c55K93K64R8m52j62K86oJ76k73k66N68j38m18L40J53J67j37j58j24N44k67
7714A33k42k25M97k63P8r0J31L32o00M6m6J49J68k40j56K51K08l04J66R9rJ32
$$ y = [-245, 370, 354, -224, -335, 128, -86, -88, -81, 203, 124, 9, -141, -49, 380, 89, -84, -267, 143, 106, 59, -180, 348, 145, -257, -215, -228, 210, -164, -197, -398, 42, 4, -159, -209, 236, 185, 181, -361, 174, 207, -75, -84, -98, -229, -69, -255, -124, -10, 183, -50, -211, 22, 244, 68, -220, -113, 325, -103, -186, -234, 83, 354, -284, -79, -339, 161, 110, -258, -201, 254, 194, -117, -300, -78, -73, -225, -344, -239, 403, -2, -290, -302, 229, -187, -190, -137, 53, 32, 9, 74, 170, -38, -145, -196, 39, 317, -131, -484, -190, 196, 36, -479, -333, 195, 190, -211, -373, -317, 295, 190, -291, -274, 32, 310, -256, 138, 45, 145, -283, -334, -113, 401, 184, -141, -24, 288, -49, -127, 379, 280, 377, 46, -203, 110, 394, -355, -62, 202, 300, -152, -314, -28, -34, 142, -131, -397, 171, 33, -385, -45, 108, 275, 138, -20, -144, 400, 133, -109, -334, 163, -100, -22, -112, 19, 351, -249, -203, -249, -100, 68, -172, -328, -77, 131, -173, -7, 92, 83, 215]
7736B15o10P06J55k70n01l2L99K62o28n0M72j57j1j96M97l15M06q21O41O3j33
7757I2r1j01K85J98p09J29N73k70p3l65K37J41j8k61L14L15J1m74j22J34L19k78
7779a4j62l26Q63k25k64n3L88J45l32j47R8M3k33J82J06L44m48l11K91J51J2m19
7801c11K12K58j53j17r3L50J25l56j41L50J43l28j98K00J64K81l49k76M52K9j16
7822A26l35k7M57n92J77o1N64j28n22J56M12j79O4j95O7L09j97j8o7L89j51k99
7844e0q6K40m9k58j55L60K29l08l26K93J13l0o6q3L60q5m12J68J17L92j12o06
7866c54K52L63k43J92l81J43K53m68j21O54K36p50r8lQ54m86m38M23j18J8j4J98
7888A12K07k21J00n16O03J1k48m93J94N92k32l68L57q7j70K3r3M82j18l03K07
$$ y = [215, -395, 311, 466, 196, -305, -337, 62, 324, -304, -354, 118, -39, -50, -246, 251, -64, 342, -479, 162, 225, 92, 1, -100, 185, 383, -326, -197, 376, 106, 33, -332, -95, 46, 28, -233, 81, 396, 407, -67, -189, -55, 264, -14, -176, -502, 361, 136, -128, -181, 207, 352, 20, -127, -29, 14, -219, -37, 69, 413, -35, -346, -55, 96, 108, -311, -99, 159, 6, -111, -204, 146, 271, -85, -226, 124, 267, -61, -259, -59, 105, 386, 37, -239, 213, 242, 126, -209, -236, 221, -371, -194, -255, 309, 181, -341, -185, 227, 48, 112, -83, -16, 293, 96, 78, 11, 400, 249, -50, -136, 104, 55, -203, -358, 2, 231, -77, -403, -110, 3, -27, -93, -176, 184, 99, -313, -145, -28, 364, 252, -354, -102, 261, 18, 210, -171, -28, 225, -243, -364, 290, 526, -224, -322, -325, 529, 43, -395, 28, -90, -72, -86, 112, 319, 98, 198, -318, 285, 296, 48, -445, -251, 341, 109, -259, 98, 11, -159, -136, -229, 253, 135, -168, 39]
7909C9r2L73k77l31K4L86j43j66j74L07jm6k19J06O67k79l05P0M30k26j66j61
7931a84L24p9k29k86L4N98q4j12l27O19o6k26j76M60j73J23n3m8j2K45l22J6L57
7954C99n91j57j5O12N6m35L01j4j12l12J32L09N9O9n93J36K32Q5l04K33J08q3
7976A15l27j9J43K81l21j60K31K60K2m48K94J41k12j55l0L49J41l69k56O71r9
7997B52k50l40L04n2L00n37O9R6K75j16k5o0K15n0k37R4K73r7j45k46M77K70l42
8020A28k8mJ07m60j08J46M64K0n33K08K12r4j18k96N41K68m89l3r8L73l05k45
8042c44L86L13l93j02J13Q7K11l79O6M9K86m17J56k41L87m3j78j22K15j15L2j63
8064a96N11J7l64k10O9L53M4l43j41M00j20j99K99j3q9o8l74M03N4K74o29K54
$$ y = [39, -53, 320, 43, -288, -264, 122, -21, -187, -361, -54, -55, -101, -320, -214, 453, 174, -131, -61, 369, 143, -23, -184, 140, 61, -168, -454, -420, 178, 94, -18, -345, 274, 208, -18, -194, 266, 93, 216, 163, 115, 103, 348, 26, 42, 399, -192, -349, -364, 248, 304, -131, 170, 156, 44, -268, -136, 173, 232, 301, -292, -156, 76, 161, -143, 90, 198, 115, -212, -231, -88, 193, -128, -288, -57, 203, 225, -223, 71, 212, 0, -155, -185, 164, 305, -64, -320, 351, 252, 2, -338, -34, -86, 214, -323, -254, -158, 117, 1, -24, -84, 131, 81, -156, -62, 211, 114, -31, -277, 200, 470, 128, 100, 96, 203, -257, -365, -219, 245, 265, -268, -60, 152, 58, -60, -356, 185, 453, -36, -69, -167, 206, -99, -344, 42, 355, -38, -140, -27, 60, 271, -108, -42, 7, 293, -124, 32, -209, 178, 135, -43, -165, 50, -65, -33, -196, 315, 332, -32, -242, -173, 180, 224, -119, -260, 140, 20, -179, 120, 107, 18, -50, -424, -21, 33, 307, -322, -68]
8086f8L83j83l75k23K33K00l1l90M55K40j24m69J40O18l33J47j91O6Mj32j84L12
8108I5J60l46k65K80K2n1M45p34O79k34k47R4O8J54j18j09J00L36m1l02Q2OK17
8131B91n90J67L03J0l75J27KK16j91k82O7M36k6k67j11K55M67m25m04M47J2n78
8153d49M06n1L69l32m2r0J55K23k11l24M69J03l14mK8J05l3O1j0J41j23l19J59
8176h3O0L94m80k49M38J17L5j70l24L28N7l02P1L33p9
$$ y = [-68, 315, 132, -243, -466, -233, -33, -64, -454, 1, 241, 117, -352, -212, 406, 73, 220, 29, 95, 99, -33, -217, 95, 255, -91, -356, -76, -54, -105, 340, -394, 285, 51, -196, -102, -34, 120, 2, -107, -7, 329, 288, -14, 68, 74, 291, -299, -132, 171, 181, -194, -67, -65, 151, -40, -322, -255, 181, 155, -112, -223, 32, 499, 74, -330, 117, 129, -449, -43, -94, 275, -57, -99, -189, -34, 189, -22, -346, 123, 226, -88, -92, -64, 41, 8, 69, 59, 200, 77, -242, -83, -23, 371, -109, -358, 80, 197, 232, 62, -262, 66, 123, -179, -108, 225, 146]
8191A46
$$ Imaginary data points
##PAGE= N=2
##DATA TABLE= (X++(I..I)), XYDATA
0@%%%%Qj6J6j6J9k7L2m0N6o5P4r7J20j37J62j94K27k66L12l61M15m76N43o17O98
29C70p90Q94j004J123j258J409j569J743j941K156k387K643k929L241l585L973
45B089m407M894n444O075o808P665q686R933j1487J3484j6170J9991k5877L6209
59B1461n9473J98712k0654l97997K06837J47236M2160j69012k16924K68737K58348
70B79431l52381j24798K33843R8429n3903j96414n5203L40207o330l53702O0907
81a29914K36707R637j07337j82651J27890K87670k07291k46610J79661J46105
91A13867k5237j59833j06905K57996J18753k81379o1354J87575P6306q1012j78872
102a40095M6732K53295p9203k33146P7368J70941J6488j40317j30531J76220J67428
$$ y = [0, 0, 0, 0, 0, 8, -8, 8, -8, 11, -16, 16, -24, 32, -33, 41, -56, 64, -73, 89, -105, 122, -144, 168, -193, 222, -254, 289, -328, 370, -420, 474, -530, 593, -665, 744, -825, 918, -1023, 1133, -1254, 1389, -1540, 1701, -1884, 2089, -2318, 2576, -2868, 3207, -3601, 4064, -4622, 5311, -6176, 7308, -8862, 11129, -14748, 21461, -38012, 160700, 140046, -257951, -51114, 96122, 138282, -30730, -247654, 21083, 279431, -72950, -197748, 36095, 134524, 80621, -115793, -170996, 169211, 162881, -190821, -129914, 106793, 116430, 9093, -173558, -45668, 242002, 34711, -211899, -32238, 113867, 88630, -71203, -178108, 79888, 198641, -82738, -144092, 43483, 119789, 38777, -140095, -93363, 159932, 80729, -152417, -75049, 95892, 112380, -27937, -158468, 17752, 185180]
113A85180k09461j36852J43979J21402j9784j78816m1607K53166K3384k33978
123i3387j3457J34530Q1825p9540j86579J04465K19631j27819j68360P9018J33737
134H4064K7101j68258j03250K20631R7968k17778p5253J38406J13166m7566j95511
145a26280K6942K45427n3576k08793L0151J32834O2892j17155j48979J63622J56428
156A63513j70135j12146R6464J11462o679j79131k6842K28691R501k00073j5077
167a00452J30886Q6862r0631j69968J02156J91439j15065j54354O3443J21242
177F5558L2467j42761q8562J90422P5374j79821n2073J00192Q6464l6521j63832
188a13093L8567J99616o0782j57968K9977J07935N6003j10976j24955J43314J24960
$$ y = [185180, -24281, -161133, -17154, 104248, 84464, -94352, -135959, 117207, 140591, -93387, -106844, 27686, 109511, 29971, -156608, -52143, 167488, 39669, -128691, -49673, 84064, 111165, -57093, -160343, 60288, 158256, -59522, -134775, 3631, 116797, 69231, -126280, -99338, 146089, 92513, -116280, -86129, 46705, 109597, -7558, -156537, 7085, 163513, -6622, -118768, -22304, 89158, 82479, -96652, -123494, 105197, 114698, -85375, -100452, 30434, 117296, 26665, -143303, -41147, 150292, 35227, -119127, -55684, 65558, 98025, -44736, -133298, 57124, 132498, -47323, -99396, 796, 87260, 50739, -113093, -74526, 125090, 64308, -93660, -63683, 44252, 100255, -10721, -135676, 7638, 132598]
199A32598j39195r4980P3585J00419O122j48223l2826J84545J1636j58513j2036
210g6868R1729O9504n9957j40019Q5040J55298j00682j15070N1285R3674L0870
221H4804j28766p4084J66507O0874j45669m9744P9312Q8125k8046j46810K7234
232f6263J64930m1768j31130J5381Q9118N3123r0037j05000J21847J01918j20622
243h503p4936O1757Q6292J566j38170j8282J67562K836j35285j3944Q0653P3565
255H5111o2220j29185P8655J31144q0697r7372L3295Q4017L2897j11752o0358
266i6465J41316M5834j23246l8035O5158P4204k7082j29883L3594J48162m5879
277D7678j12210J3333P8083N4309q8733r7852J14142Q7291j02032o4542M5579
$$ y = [132598, -6597, -101577, -27992, 72427, 78549, -69674, -102500, 82045, 93681, -64832, -76868, 14861, 84365, 24408, -115611, -30571, 124727, 24045, -91025, -39740, 53934, 84804, -43962, -118046, 48461, 109335, -36334, -86078, -6766, 81359, 53313, -93497, -66263, 98667, 56899, -74231, -58850, 30268, 83391, -6646, -111646, 10201, 112119, -8503, -83439, -21682, 64610, 66176, -71994, -90276, 77286, 80122, -55163, -69107, 11546, 85111, 22891, -106294, -27639, 103505, 22808, -74564, -41269, 42748, 75645, -36107, -96465, 44851, 90685, -32561, -70596, -5438, 68766, 41684, -88199, -54605, 93557, 47678, -64532, -51199, 26884, 81193, -7540, -105392, 8750, 96041, -5991, -70533, -24954]
288b4954Q0463O868j22623j4002J42004k474j13847j1450O8213O5153n6994j12496
300i6139P8690J14116p7852q5761K9111P8511L1683j10045n5694J33092M1419
311H1131j06349l7187N2201P6031k1629j22857L0741J27263m1820r2948Q002O8111
323B0690N2134q0388q4304J06924P3451r5814n6398L9686P3501Q045j17518j1829
335g1820J35393j878j01725j2011N6546O3706m8322j07824O6752J03013o7824
346A4006p1574K5987O6746L0307r6076m9886J18930L4068r9757l2251N0278O7323
358E8101k0213j10349K8666J19200l4451q9750L719O3318M7217p2661p8114R2144
370F827O9674p8062n2929L3757O7982M377j03445r495J13619j105q7681j4617
$$ y = [-24954, 55509, 62377, -60246, -74248, 67756, 65282, -48565, -60015, 8198, 73351, 16357, -96139, -17449, 96667, 18815, -66946, -37835, 40676, 72359, -37686, -93380, 39712, 81131, -25218, -62405, -10204, 65827, 44198, -78659, -47918, 79345, 37525, -55423, -47421, 20690, 72824, -7564, -91868, 15056, 88507, -7307, -63705, -24019, 49482, 57527, -59991, -71820, 63573, 61695, -40030, -52041, 4505, 68211, 19889, -87935, -21183, 81830, 14006, -57568, -31581, 35165, 65472, -30604, -80490, 38440, 72508, -27249, -59500, -9222, 58101, 37888, -72461, -43795, 75405, 40954, -48796, -45077, 18241, 65458, -7203, -85317, 6827, 76501, -1561, -54490, -20733, 47249, 51626, -51819, -61314, 52305, 51200, -36481, -51098]
382e1098N5777O0255m8801r3441O2920Q9265n7473o8454J3980O6841L0242r0046
394c0033m2157J04614L1503p9903l2847L7923O3895j9847r9832K8228J01126l1535
406C1135p2172K210N7226M5691p1336o8768Q6063N7508p1152m7806K6968O6201
418D1768P556r6327p275J04216j734p7290j5980M5229N5461m2808q3708N7383
430a3509P9216n0500n8640J4058N9189K4757q3365l7283R4438K6978p2122l0349
442d7132L7290O1674j9670r0284K5464Q7887k5603o5922l045N3043M1408o2869
454g759n6740P4730M8669n8443m3618K2019O0399L70q5949k63Q9134j645o4655
467b3751j7524M4286N2840m6202p3220N3200O4869m1128n1561O603N9034K2952
$$ y = [-51098, 4679, 64934, 16133, -77308, -14388, 74877, 17404, -51050, -37070, 29771, 60013, -30033, -72190, 32424, 63927, -15976, -48823, -10900, 52995, 33148, -66684, -38456, 62670, 31135, -41037, -38827, 18399, 64090, -7246, -76014, 10049, 67557, -3595, -51401, -24433, 41768, 49324, -47003, -54278, 49938, 48204, -29086, -45066, 163, 55624, 12816, -70892, -13509, 65707, 15207, -43433, -29375, 29814, 54571, -28794, -66077, 28361, 55339, -16783, -47132, -9842, 51832, 32162, -58122, -32658, 55229, 29626, -36296, -39341, 13702, 55110, -7759, -64499, 10231, 58900, 457, -43161, -21142, 39257, 39627, -46322, -46585, 42549, 40904, -23751, -41275, 3011, 55851, 9649, -63571, -10371, 54498, 13370, -38191, -31588, 27446, 50398]
479E0398p7433k6795Q1499J9434n9400k9855K9674N9282k1800q1319L0852P5833
491E0370k4457n5203o679M9418M0811o5204n0765P1860M0164m9779l8312J5310
503b2466O0691K076q3734L190P9331n719n4788j6503L7419N1600m3023o6699N3055
516e570N6932m1363m3559M988N3045K1877p4804k2682P8977J4401n3439k5671
528c6868K5873N5878k1313p6325L0131O7774k4191m7806o031M6161L6271o0203
540a0649m3857O6328L3845m7192l4728J6231N5267m94p5595M874P3886o157n1241
553a9482j5574L5399M7428m2196o0149M9762M9942l4371m0814L331N1237J8459
565D2972o9767j7871O8902J3187m6867k6184K5624N2421k2188o8783K9298O0942
$$ y = [50398, -27035, -53830, 27669, 47103, -12297, -42152, -12478, 46804, 25004, -56315, -25463, 50370, 25913, -29290, -35969, 13449, 54260, -10944, -61709, 10151, 50315, 536, -37776, -22466, 38225, 40301, -43433, -40243, 39088, 33369, -21419, -37922, -503, 51097, 8074, -58625, -5570, 51362, 9999, -33560, -28572, 24473, 46350, -28454, -51136, 27841, 42242, -11197, -36868, -10995, 44883, 23570, -52755, -22624, 45150, 20959, -26847, -32878, 13283, 49554, -10649, -54506, 11822, 45667, -1525, -36253, -20022, 35245, 34751, -40844, -35970, 37916, 31759, -19482, -35056, 343, 47771, 5575, -54574, -4812, 45130, 10759, -30055, -26724, 24513, 42972, -26795, -44666, 24236, 37423, -9444, -35628, -10004, 42417, 20229, -48554, -19256, 41686]
577D1686k1378m5172p163M4477L4189n8486l8385O1826K9424m1152l2157J2781
589a9510N4094l086p1231Q999O4455o501m3576j7951L5539M4719m3046n2799M7356
602b538M3455l0592l8922K030N1060J5452o6606j4279O3826J1487m2223k5634
614c3484K3299N1511k3275o4144L0276N3038j8827l9864r912M4072L1560n7406
626a3156l1805N6631K4772l4671l2492J1430N2891n246o5539R399N8414n048l9795
639a4215j7793L2972M2756m1172m9737M5715L8274k8057l4047n18M9275J5071
651C8524o5666r159N9344O993l6741k5357K1954N0569k5886n8143L1123M7121
663C4676j7726l6694r626M2162K7732n4316k8485N4199K1638l3337k7507R921
$$ y = [41686, 20308, -24864, -32027, 12450, 46639, -11847, -50232, 11594, 41018, -134, -32291, -19510, 34584, 31498, -39733, -30734, 33721, 27220, -16356, -34307, 1232, 45951, 2905, -49894, -2538, 40917, 10325, -28597, -26567, 24493, 39945, -26661, -40940, 22886, 34373, -7850, -33484, -10185, 41326, 18051, -46093, -15817, 37221, 18394, -21470, -31382, 12690, 44250, -13156, -44961, 11670, 36442, 1771, -30721, -19291, 33600, 28354, -37185, -27786, 30628, 25580, -14215, -32008, 964, 43720, 2548, -47189, -1474, 36800, 8743, -25304, -25822, 23453, 38524, -27142, -36301, 23043, 30036, -6705, -32062, -10108, 40461, 14575, -43568, -12445, 34676, 16950, -19744, -29370, 12792, 40524, -13792, -42277, 11922, 33560, 223, -27284, -17363]
675a7363M8934m488o3301J1863N2919p154l4088j7172L0071M1464m0728m3769
687d2812M3693L2115k4719l2059l48M6034J1653n8775p376N3444P018l3728k2085
700b7945J9479M4069k2019n3534K7704M3604j7376l1109r367L6857K8318n0975
712a2294k5762M8856J8620k8369k6943Q512M6970n429n6690J0269M8437l658l4571
725a2052j7569L1196L6602l7554m1096L8981L3745k2876l2132M91M3887J0584
737C2207n6335p234N0177P272l1296k3155K0911M3507k4957m8399K7094L8549
749B8341j3078l3410r129M0372K2497m9004k1001M4165K0063k7552k9168J1562
761a5342M4913q475n3121J1796M4798l827l2017j6266L1124L3468l9386l4905
$$ y = [-17363, 31571, 27083, -36218, -24355, 28564, 21410, -12678, -29850, 221, 41685, 957, -42812, 881, 32996, 8277, -23782, -24130, 21904, 33557, -25218, -32594, 20850, 27868, -5860, -27945, -8466, 35603, 13584, -39950, -12246, 31358, 13982, -17127, -26494, 10363, 38681, -12294, -38056, 10800, 29420, 1051, -25892, -17380, 29590, 24161, -32529, -22260, 26177, 22519, -12052, -29621, 1575, 38177, 623, -40473, -1492, 32253, 9377, -22755, -22264, 21623, 32207, -24128, -31362, 18815, 26087, -5209, -28364, -7453, 36054, 11097, -37302, -10208, 28341, 15263, -18147, -27276, 13096, 35593, -13411, -34412, 9753, 29816, 2264, -26904, -15342, 29571, 21096, -32025, -20229, 24569, 20742, -11275, -27541, 3583, 37051, -2335, -37240]
773c7240L8761K6925k1124k9482J130M4236N457n2963k059M4614N499k8865k2991
786b8102K1733M0322k4919m3368K5429L5535j2165l0701q513L6840K0565m5596
798a2940j9193M1438J6672k3595k6235R194M4016r773n0286J2509L9992k622k9625
811a0448j7256L1143L1353l6893l1011L3331K5821j6856l0352M19M1706N430m8084
824b1697l193M0776P216k6755k2351K0127L8262k4204m0857K4183L2882r911k9938
837a5460r779L8688J8823m5464j6414L7620J6414k0903k8743J1319M2383j1182
849A7302m5068J1422L6715j324k9148j6430L0367K8654l5628k8198L2247K3824
861B4735j5656k8853l18M1402L498m6808o61L6857P394k3543k4108K0449L7187
$$ y = [-37240, 1521, 28446, 7322, -22160, -21030, 23206, 28663, -24300, -26359, 18255, 23754, -5111, -28102, -6369, 33953, 9034, -34334, -8905, 26630, 14465, -16236, -24749, 12091, 32656, -12940, -32133, 9305, 25977, 2382, -23853, -14659, 29357, 19584, -30702, -18193, 21799, 19177, -10448, -27704, 3439, 34792, -2101, -33112, 219, 26040, 9184, -21168, -20749, 20957, 26387, -21697, -24890, 15886, 23102, -3653, -26004, -5877, 32385, 8181, -32676, -8493, 24389, 14478, -15460, -25239, 13449, 32272, -13192, -29606, 8014, 24428, 3525, -25218, -13899, 28484, 17302, -27766, -16344, 20371, 19047, -10101, -26531, 3836, 32490, -3138, -31336, 911, 24735, 9079, -19774, -20092, 21310, 24808, -22000, -22661, 14196, 21590, -1953, -26061, -5612, 31575]
874C1575k4930l6294K1944K9183p598k8534r383L7008J6186m2002j3911L5064
886H308J4623k0035k6596J0665M0240j1318m2652J1982L3554q54k6168j7290K9387
899C846K7133l4679k5270K9199K1524j2313k8541M70L9488J652m2693m39L3977
912A3354P159k3528k2212K0672L4635k4233l4325K1811K7485p054k7900q839L5015
925A2040J5294m0043j2061L1647J4521j7743k5666R959L8184j2483l8637J1736
937a3252K9659M35k5081j5982K8649K4855l3545k2406K7116K0535j2216k7397
949a8630J16L8664J175m0622M41L0850P279k0579k3290K0511L2609k4075l0681
962b6232K0022K4712n128k6660q827L5624J2410l8606j0660K9748J3911j6442
$$ y = [31575, 6645, -29649, -7705, 21478, 13880, -14654, -24037, 12971, 29157, -12845, -26756, 8308, 22931, 2896, -23700, -13035, 27205, 15887, -26765, -14783, 18771, 17917, -8251, -25541, 3846, 30979, -3700, -28970, 229, 21753, 9440, -19101, -18631, 20857, 22509, -20184, -20623, 13354, 20513, -3015, -25227, -4555, 30080, 5847, -28478, -6667, 20818, 13764, -14136, -22975, 12040, 27334, -12709, -24770, 6877, 21398, 3655, -22011, -12052, 26132, 13649, -24988, -13252, 16407, 16842, -8239, -24221, 4428, 29283, -4262, -26668, 448, 20983, 8767, -18630, -18514, 20150, 21325, -19297, -18856, 11994, 19273, -1306, -24596, -4085, 28524, 4449, -26232, -6210, 18502, 13374, -13286, -22113, 13511, 25921, -12685, -23345, 6403, 20314, 3872]
974C872k5875J0389L7404j2324l6850J0706K8150Q59k3471j7078K8151K4185l2298
987d180k0723K5601J9045j1076k6447N74L6627n6l8476J100K9862O635k0103k1691
1001b3308J9938L0505k2806k9097J8598K4044m885k6179p813L3536J1617l5600
1013a1450r943K7035J3507j5641k4914J0908L4376j2399l3370J0237K6464J721
1025A6531k3712j6153K8417K1271l0701j9052K2782J9576r480k7115J091L6194
1037A9649j213l5973J067K6212Q105j9141k1944K0283K9300k2956k6310J7064
1049e857K2086k849k5918q115L2701J1128l4788q885K5790J3506j4620k4817J0390
1062a0248L3521j2181l1840Q848K5214K291k2399j4769K6143K0187k8708j8148
$$ y = [3872, -22003, -11614, 25790, 13466, -23384, -12678, 15472, 16331, -7140, -24218, 3933, 28118, -4180, -24903, 698, 19743, 8667, -17780, -17206, 19421, 19365, -19111, -18011, 11851, 18486, -1617, -23308, -3370, 27135, 4329, -24768, -6170, 17874, 12989, -13190, -21003, 12533, 24150, -11450, -21393, 5642, 19149, 3508, -21406, -10498, 23878, 11479, -21891, -11654, 14810, 16531, -7181, -23334, 5083, 26354, -4347, -23399, -617, 18959, 9479, -17636, -16545, 19649, 18436, -17537, -16470, 9742, 17847, -1294, -23238, -2955, 26345, 3389, -22921, -5857, 16229, 13380, -12538, -20653, 12048, 23176, -11612, -20497, 5293, 18799, 4179, -20638, -10248, 23273, 11092, -20748, -11900, 13314, 15605, -6794, -21563, 4580, 24767, -3941, -22089]
1074b2089K1655J8266r421k5224J972L3147j219l3028n61K5603Q829j9465k0723
1087b2258J9582K6603k0084k5078J4614K2200k236k5544o854L0892R088l0828
1099i903q931K2703J4113j3660k4355J1082L0834j1794k8616O797K3679M413k3324
1112f962j5003K7039J8294k6572j6810J8095J8661p026k6526J528L2778j755k9990
1125a4249n91K2533R926j8328k1063J9805K5338k0719k2594J3933K0453j274k5147
1138a1977o948L1081P955l0122q014K1357J3889j2751k4441J1158L0055j1884
1150I358k6878O916K2051L658k1345j4475K5693J6998k5756j5032J7650J7860
1162A6698p836k4901J987L1265k481k9039k42K1804R458j7617j9513J8723K3468
$$ y = [-22089, -434, 17832, 8411, -16813, -14841, 18306, 17087, -15941, -16502, 9101, 17930, -1535, -22258, -2676, 23927, 3843, -21235, -6621, 15579, 13343, -12201, -19055, 11837, 20925, -9903, -18834, 3869, 17982, 4322, -20033, -8951, 21883, 10089, -18527, -11730, 11949, 16362, -6962, -21965, 5074, 23368, -3204, -20014, -1919, 16742, 9716, -16810, -15282, 17496, 15741, -14249, -14840, 7693, 17619, -709, -21772, -1967, 23371, 2652, -19942, -6009, 14444, 13170, -11977, -18925, 12156, 20111, -10011, -18025, 3332, 17221, 4470, -19971, -8813, 21242, 9358, -17520, -10604, 11447, 15105, -6240, -20715, 4978, 21976, -3780, -18812, -1162, 16698, 8862, -16039, -14052, 17213, 14732, -14307, -14549, 7255, 16713, -904, -20417, -1694, 21774]
1175B1774j9143k0879J2096J9152m62k3950o211K8953O916k6999p236J8503J3811
1188A6325j2089k3431J1343K7632j1486k4463O061K0575M836k1263j3883K4837
1200D994J5211k3574j3884J4797J7202n299k4784K135K9616l218k5630j027J9310
1213E849J0324j7140j9715J9380K2422j8386j9468J0119J9450K42k4251o522K8543
1226A0847O329k5509p489J7558J4416j1145k3393J0761K7172j1445k3734N938
1238i694J8881N755k0962j3784K5182J4604k3653j2344J3837J6754n533k4758
1250a5715K909K8505k504k5138r00J8980R662j6084j9336J7880K1395j7627j8208
1263a6181J0289J7948M18k2946n890K7466N601k4890o967J6486J4180j1242k2629
$$ y = [21774, 2631, -18248, -6152, 13000, 12538, -11412, -17623, 11330, 18246, -8753, -15989, 2514, 16325, 4236, -19195, -7852, 19780, 8294, -16169, -10108, 10467, 15303, -5960, -19843, 4994, 20205, -3369, -17253, -2456, 14746, 9447, -15337, -13202, 16414, 13196, -12434, -13461, 5849, 16173, -967, -20682, -1302, 21120, 2734, -16734, -6615, 12835, 13077, -11174, -17696, 10847, 17176, -8333, -15822, 1736, 16152, 5007, -18386, -7625, 19547, 8102, -15632, -9694, 9187, 14942, -6020, -19804, 5378, 19982, -3671, -16015, -2178, 14576, 9043, -15715, -12806, 15699, 13195, -11943, -12843, 6137, 15799, -285, -19621, -1741, 19654, 2027, -16181, -5892, 12056, 12474, -10472, -16362, 11104, 16705, -8185, -15152, 1334, 15514, 4272, -18357]
1276a8357J1462K5651j0377k2786M592J8921N609k0725j2791K3036J4132k0757
1288b390j3486J3874J6376n822k2969K343K6361k143k3711j230J8079J0509j6172
1301c81j8257J7772J9400j5957j7824Q279J8219J333k3246m786K5748N226k2059
1314f533p970J5340J4493j1078k1345J0243K3645r247k0627L198J8115O255j9873
1327e384j2499K2709J2677k0418j2235J1968J6617m286k3736K946K6140l158k1375
1340a0034k428J6696J0935j5733j7280J6572J8492j4562j6574P643J7049J195
1352A1971k1547n608K4516N394k1375o871J4123J3997r498k1592R685K3149r159
1365G185j9384K495J7045O737j9280j1513K1005J1510j7210j2547J0111J6869
$$ y = [-18357, -6895, 18756, 8379, -14407, -9815, 9106, 14715, -6010, -18801, 4235, 18367, -2390, -15876, -2002, 14374, 8552, -14417, -12074, 14287, 12144, -11567, -12797, 5282, 15791, -381, -18638, -866, 18534, 2577, -15247, -6968, 11251, 12584, -10662, -15448, 10300, 15526, -6533, -14503, 837, 15330, 4252, -17093, -6850, 16795, 7548, -13079, -9881, 8234, 14489, -5384, -17883, 4826, 17503, -2915, -15150, -3182, 13435, 9149, -14587, -11641, 14499, 11341, -10034, -12462, 4234, 15169, -564, -17844, -1272, 17220, 2658, -13916, -6273, 10776, 11971, -9576, -15184, 9332, 14726, -6649, -13520, 603, 14600, 5102, -16490, -6805, 16344, 7185, -12199, -9704, 7341, 14078, -5202, -16715, 4290, 15800, -1410, -13957, -3846, 13023]
1377A3023m907k1436K759K3292j584k0501k636J6124J0485j5094j6651J6081J7305
1390A6260j3626j5751O166J7442J609k1772m740K3414M942j9401p481J2857J4329
1403A4248j0261j9988J0180K0406p677j8149J926J6443O487j8574j0890K0108
1415D259J1195j6944j1409R627J5189l814k1017K501K2644j903j8731k743J4319
1428C173J0960j4245j6079J5553J5561j2248j4758N018J6871J521k0421l870K1461
1441H497M430j7631p675J2381J3603r758j8602R439J9296p596j6813J260J5719
1454F550O225j7757j0285J9288R678j4690j1196Q464J5751m160k0349L115K0676
1467A1310j792j6879m099J4640J0522j4108j4885J4348J5422j1698j4375M869
$$ y = [13023, 8116, -13320, -10561, 12731, 11147, -9354, -11990, 4134, 14619, -475, -17126, -1045, 16260, 2634, -13117, -6951, 10491, 12100, -9672, -14412, 9002, 13944, -5457, -12938, -81, 14248, 3987, -16001, -5821, 14585, 6908, -11241, -9315, 7128, 13615, -4959, -15849, 4259, 15454, -1490, -12899, -3272, 11917, 8103, -12914, -10413, 12231, 10328, -8403, -11146, 3173, 14133, -112, -16191, -638, 14923, 2675, -12083, -7065, 9806, 11327, -9094, -12964, 8497, 12927, -4704, -12379, 2, 13605, 3847, -14755, -5316, 13980, 6384, -10429, -9169, 6550, 12775, -4982, -15267, 4021, 13699, -991, -12187, -3723, 12028, 7868, -12481, -9366, 11310, 9518, -7361, -11460, 3180, 13702, -406, -15291, -943, 14479, 2781, -11594, -6725]
1479f725J5905J409j9559l535K0878L476j6191o721J0853J3077r272j8083R600
1492d888J7681p009j5596O67J5880O249j8068q936J7808R395j4207j1044Q327
1505c741J5022m024j8837K880J9799j697j6482l266J3497J0054j4011j3845J4302
1518c49J3695j0566j3448M425J6034L56j9399j939J8638L481j4993p359J1291
1531a33J3358r995j6803Q940J6952o275j4873R0J4977N418j6816p905J7019Q200
1545A2154j2695j0314O941J5257m548j8760M026J7930j547j4743m182J3447J0453
1558A3419j4357j2840J3318J2682r175j3119L316J5670J419j8474k959J8163L415
1571A0478j4260p067R688J3709r552j6213Q994J6263o552j3659o70J4596O789
$$ y = [-6725, 9180, 10589, -8970, -12505, 8373, 11849, -4342, -11063, -210, 12867, 3595, -14488, -4888, 12793, 5784, -9812, -9145, 6735, 12984, -5084, -14020, 3788, 13183, -1024, -12068, -3741, 11281, 7257, -11580, -8700, 11099, 9402, -7080, -10346, 3151, 13205, -806, -14651, -349, 13346, 2780, -10668, -6243, 9791, 10147, -9252, -11191, 7447, 10928, -4065, -11424, -133, 13225, 3230, -13573, -4633, 12319, 6044, -8829, -8739, 6238, 11656, -5160, -13065, 3954, 12154, -541, -10855, -3914, 11343, 6795, -11965, -7939, 9991, 8444, -6299, -10481, 2966, 13419, -938, -13778, -460, 12222, 3047, -10072, -6756, 8914, 10333, -8141, -11100, 7063, 10478, -3782, -10849, -1161, 12548, 2996, -13217, -4223, 12040, 5488, -8171, -8841, 5755, 12544]
1584A2544j7219q631J6881Q245j2317j0223O813J4801l724j8332L250J7708j707
1597H089j4391l953J2673R842j2796j3362J3594J2623r723j2103L106J4468J660
1610I727j8118k316J7603L340j3272p421R563J2610q239j6104Q295J4792m983
1623E477j2928j020J4031N647j5894p507J5269Q337j1746j0056O657J3886l555
1636F598j6878L011J6129o80j3545m471J2138R367j2183j2159J2013J1866q262
1649B944j1666K333J4612Q20j6857k319J5741M169j2409q010R553J2743q678j4825
1663a1849P804J4039m139j3108j295J3554N929j5002p060J3859P840r798j0456
1676i682N677J4139l997j6059L041J5080m12j2193m726J1315R160j2277j0870
$$ y = [12544, -4675, -13306, 3575, 11820, -497, -10720, -3907, 10894, 7170, -11162, -7912, 9796, 8089, -6302, -10255, 2418, 12260, -536, -13898, -304, 12319, 2596, -9507, -6401, 8067, 9727, -8391, -10707, 6896, 10236, -3036, -10457, -894, 11716, 3477, -12627, -4332, 10460, 5477, -7451, -8471, 5560, 11207, -4687, -12194, 3075, 11412, -334, -10390, -3733, 10153, 6598, -10280, -7269, 8860, 8180, -5365, -9836, 2302, 11669, -514, -12673, -660, 11206, 2944, -8722, -6389, 8223, 9043, -7814, -10133, 5608, 9777, -2632, -10642, -1089, 11654, 2976, -11849, -4045, 9994, 5855, -7253, -8548, 5006, 10935, -4067, -11127, 2732, 10572, 774, -9682, -4005, 10134, 6137, -9922, -6881, 8199, 7787, -4406, -9132, 2183, 11343, -934, -11804]
1689a1804J0956J1058p441j1102K100J3838J271j6326j781J4966L246j1006p759
1702i784Q674J1938q196j3654P393J2780m105j1676j316J2882N410j4437o728
1715a0819J3632O847r269r557N523J3435l691j5446K694J4168Lj1935m730J1006
1729A861Q977j1417j0227R920J0308o741j0781J950J3507J111j5148k038J4036
1742E318L433j1119p073Q934J0634p593j2712O505J2445l356j1902j362J2958
1755E110M543j3714n891J2550O726q764r592N555J2459l839j4011K841J3378l02
1769G049j1375m811J1568P899j1190r406R809R374n508j0915J610J3037N64j4353
1783f648j480J2552L634r727p405Q515J0407p806j1823O530J1212l167j1000j127
$$ y = [-11804, -848, 10210, 2769, -8333, -6233, 7605, 8876, -7450, -9231, 5735, 8981, -2025, -9784, -1110, 10828, 2632, -11022, -3629, 9151, 5046, -6630, -7946, 4936, 10346, -4091, -10819, 2813, 9660, 391, -9166, -3643, 9792, 6101, -9345, -6651, 7517, 7520, -4415, -9145, 1861, 10838, -579, -10806, -886, 9422, 2681, -8100, -6150, 7357, 8468, -6680, -8718, 5318, 8751, -2368, -9441, -507, 10127, 2534, -10178, -3673, 8772, 5416, -6486, -7848, 5110, 9653, -4061, -9952, 2598, 9324, 560, -9032, -3477, 8982, 5143, -8868, -6027, 7351, 7049, -4326, -9137, 2431, 10330, -860, -10266, -457, 8917, 3409, -7506, -5896, 7141, 7705, -6648, -8128, 4424, 8058, -1669, -9074, -559, 9848, 2042, -9781, -3251, 7961, 4794, -6206, -7333]
1797g333J2123M255j2835n544J1447O539p827r444N131J2357l833j3491K884J1902
1811F331O30j0774n070J0905P833j0746q988R269R117n441j0692J953J3103k4
1825G406j3958j462J2345L666r884o812P930J0692p791j1674O570J0768k635j1171
1839f010j699J2260M219j2689m998J0956O302p350r526M981J2119l754j3134K921
1853e402J1927M9r942m847J0434P451j0658q411Q654Q767n098j0007J191J2510
1867F618L72j3235j155J1759L181q932p196P578J0283p145j1191N997J0538k515
1881D957j0411j438J1282M192j2086n148J0260O246o722q968M292J1770l302j2453
1895g529K149J0916J192j0173m672R782P327r711q173Q053Q742m818r823J365
$$ y = [-7333, 4790, 9045, -3790, -9334, 2113, 8652, 825, -8619, -3488, 8869, 5036, -8455, -5571, 6331, 6961, -3813, -8883, 2022, 9855, -891, -9879, -610, 8507, 3066, -7626, -5673, 7430, 7406, -6552, -8014, 4331, 7997, -1887, -8699, -769, 9923, 2132, -9542, -2972, 7796, 5161, -6010, -7709, 4551, 8770, -3919, -8917, 2039, 8341, 991, -8535, -3554, 8565, 4811, -8323, -5402, 6525, 6574, -3368, -8215, 2219, 9670, -988, -9399, -745, 8022, 2924, -7083, -5892, 6618, 6990, -6245, -7400, 4359, 7540, -1392, -8588, -1010, 9273, 2128, -9063, -3066, 7472, 4957, -5454, -6892, 4390, 8582, -3504, -8652, 1608, 7854, 1132, -7836, -3544, 8226, 4924, -7529, -5380, 5536, 6728, -3445, -8117, 1665, 8992, -719, -8892, -839, 7903, 3085, -6738, -5373]
1909e373J1859M29j2472j821J0806M134r017o806P225J0156o881j0568N006J0029
1923F706j510j0212j966J1389L604j1262m649R144O528o553r027M541J0906l332
1937D307j1421J761J0608J054r643m391R196P467r508p973P549Q207l901r709
1951f397J063J1411N23j2017j265R769L642p613p004P084R272o383r742M463R277
1966F083j175r606j796J0218L811j0341m832Q947N790o057q352L691J0746k443
1980D684j1168J366R719J562q913m649Q816O681q813p105O673Q152l994r127J127
1995d989J0567P1j0489j574R375M074q297o237O824Q589n873r287M034R158j120
2010D826r424j757R777L553r803m228P951N856n429q212M065R752l016r807J282
$$ y = [-5373, 6486, 6915, -5557, -7378, 3428, 7562, -1455, -8261, -1036, 9120, 2239, -8329, -3323, 6706, 5196, -5016, -6982, 4407, 8011, -3251, -7900, 1244, 7772, 1219, -7808, -3267, 7639, 4307, -7114, -5353, 5255, 6309, -3334, -7725, 1471, 8938, -570, -8543, -994, 7213, 3312, -6397, -5334, 6077, 6600, -5417, -6682, 3087, 6729, -884, -7888, -804, 8468, 2085, -7657, -3194, 6083, 4908, -4698, -6494, 3724, 7535, -2806, -7638, 1309, 7099, 1042, -7310, -3619, 7127, 4684, -6484, -5118, 4601, 6163, -2750, -7399, 1417, 8098, -715, -7820, -1147, 7005, 3011, -6116, -4989, 5578, 5649, -4840, -6414, 2961, 7035, -1262, -7499, -675, 7914, 2041, -7246, -3212, 5946, 4826, -4598, -6355, 3422, 6975, -2828, -7056, 895, 6751, 1322, -6890, -2825, 6927, 3911, -5896, -4614]
2025d614R026J393q467m406Q557O242p807p003N884P326k833r119J311R732M97
2040E719j0173j664Q617L894p103o636O768Q393o423p946L680Q099n05r112j688
2055f080R672K833q731m206P099O019n364p793L582R685k949r387R97Q735J197
2070E309p948l980Q256N708p780o214N521O995k995q523J375R608j7r291j357
2085e333P737L964o881o031O260P077n193p782L517P666r28p870j570Q805L004
2100F442q719l641O647N096m495p462L669Q668k845q496P25P966K030q096l855
2115f366Q022M934p075n644M625O954k531q253J530Q566K67q653j539P659L195
2130E691o556n317N540P347n129p302L204P078k25q265j566Q714K705q176l427
$$ y = [-4614, 4412, 5805, -2662, -7068, 1489, 7731, -76, -7079, -1195, 6131, 3298, -5821, -4510, 5222, 5719, -4454, -6118, 2499, 6393, -710, -7346, -578, 7815, 1392, -6554, -2874, 5225, 4720, -4392, -6080, 3592, 6425, -2306, -6512, 587, 6606, 1242, -6551, -2969, 6716, 3767, -5620, -4623, 4112, 5309, -2639, -6619, 1637, 7345, -435, -6649, -1128, 5867, 2872, -5651, -4276, 5332, 5315, -3976, -5333, 2404, 6368, -513, -6544, -284, 6793, 1600, -6182, -2665, 5001, 4073, -3797, -5367, 3438, 6442, -2277, -5918, 729, 5825, 1330, -6132, -2463, 6205, 3360, -5136, -4411, 3555, 5585, -2511, -6366, 1656, 6590, -485, -6129, -1504, 5450, 2919, -5334, -3804, 4762, 5029, -3624, -5163, 2496, 5691, -865, -6182, -642, 6705, 1576, -5726, -2522, 4556, 4331, -3934, -5500, 3214, 5919, -2257, -5684]
2145e684O092N450m541p291L417Q434k689q269J161P380J655p773l396P503N295
2160F744p092n781M928O720k627q383J630Q609m48q231j042P027L963o362o002
2175f347N822O667m897o768K688P509k29p949j311Q446J636p515l314O036N085
2190E559m529p088L783Q001k542p750Q42P054J708p172l830P320M389n967n130
2205e352M215O233k303p719J156Q214k13p678j151O265L792o010n530N671O804
2220F394n369o059K326O571q6p509j531Q053K631p456k762N231N099m340o661
2235e468L381P274k731o832Q30O746J778o948l384O567M403o111m713M130N903
2250D825k485o852Q80P874lp680j200O093L669n477n247N219O170m427o256K220
$$ y = [-5684, 408, 5858, 1317, -5974, -2557, 5877, 3188, -5081, -3920, 3460, 5115, -2658, -6054, 1449, 6744, -348, -6129, -1201, 5519, 2892, -5491, -3861, 4748, 4300, -3931, -4973, 2054, 6017, -345, -6347, -525, 6142, 1245, -5523, -2835, 4674, 4445, -3504, -4815, 3631, 5267, -2248, -5562, 474, 5559, 1030, -6058, -2275, 5726, 3184, -4566, -3724, 3330, 5038, -2134, -5964, 1356, 5745, -222, -5352, -1137, 5096, 2793, -4926, -3770, 4444, 4231, -3447, -4598, 1667, 5459, -551, -6081, -410, 6394, 1025, -5034, -2708, 3863, 3777, -3732, -5263, 2790, 5421, -2035, -4797, 434, 5533, 1193, -5468, -2087, 5187, 2456, -4376, -3546, 3200, 4978, -1970, -5354, 1213, 5616, -495, -5208, -1078, 4825, 2340, -4512, -3632, 4242, 4239, -3441, -4641, 1452, 5121, -356, -5603, -384, 5786, 1359, -4897, -2677]
2266b677O799l17p443j057P497K334p016l153N462M951m277o568L516O940k113
2281B878o876l9P109J330o346l484O627M346n496m906L584N933k392o950J593
2296c089P020K41o854j956O266L627n885m573M661N757m076n754K166O109o8o768
2312c176j031O796K169o531k639M552M725l720o196L456O342k150o137P7O220
2327B757J668o511l191O488L704n052m356L157N815k029o532O39P158j17o516
2342b918j208N812K930n168m572M650N106l428n531K064N922j98o892o23O588
2357B534K156o292k998M882M460l690n960L048O279k229n914M26N703J617o146
2372b124k249N597L031m002m925L616N289k203o276J059O825m35n697j599N164
$$ y = [-2677, 4122, 3805, -3638, -4695, 2802, 5136, -1880, -5033, 429, 5380, 1103, -5465, -1949, 4991, 2878, -3998, -4037, 3072, 4402, -1944, -5428, 1199, 5545, 49, -4857, -1273, 4660, 2268, -4682, -3089, 3931, 4172, -2682, -4638, 1628, 5255, -630, -5203, -542, 5215, 1139, -4615, -2449, 3660, 3592, -3176, -4207, 2589, 4758, -1773, -4412, 140, 4865, 1145, -5051, -1595, 4747, 2597, -3540, -3463, 2757, 4425, -2086, -5277, 1211, 4915, -137, -4493, -1336, 4479, 2450, -4082, -3443, 3715, 3598, -2918, -4126, 1686, 4616, -552, -5124, -474, 4632, 1204, -4327, -2263, 3659, 3461, -3431, -4054, 2534, 4690, -1602, -4600, 282, 4742, 1052, -4908, -1860, 4419, 2190, -3724, -3298, 2405, 4022, -2124, -4373, 1224, 4255, 253, -4672, -1056, 4233, 2030, -4246, -3187, 3638, 3203, -2494, -4093, 1071]
2387A071L540m962m642M615M955l407n389J959N549k2o362o66O013J671n184k791
2403d052M441M597m090n336L076N640j685n907KO051J345n629k841N492L175m384
2419a05m205L275N219j874o298J118O196j5n688j514N138L122m623m486M512M539
2435D311l237n106J732N568j77o127n93N983J550n152k884M073M455l533n273
2450d410K903N569j974n254J67N375J516n725k602N184L462l999m327L054N079
2465D018k125n760J276N693k1n164j480M914K872m877l590M131L944k843m646
2480c658J282N543l07n603o58N403J524m550k948M089L991l211n286K668N546
2495C825j964m803m1N241J537n338k279M753L044l990l932K453N432k121n280
$$ y = [1071, 4611, -351, -4993, -378, 4577, 1170, -4219, -2260, 3289, 3267, -3095, -3761, 2252, 3923, -1261, -4052, 389, 4986, 896, -4440, -1364, 4276, 2591, -3316, -3314, 2737, 4082, -1547, -4388, 1104, 4279, -105, -4310, -1035, 4184, 2310, -3988, -2870, 3326, 3311, -2377, -3891, 1247, 4369, -254, -4740, -228, 4311, 1074, -4032, -2300, 3268, 3091, -3036, -3629, 2354, 3904, -1248, -4132, -59, 4396, 863, -4410, -1507, 4062, 2088, -3166, -2999, 2376, 3892, -1833, -4435, 749, 4211, 212, -4115, -1061, 4018, 1893, -3867, -2591, 3102, 3081, -2083, -3563, 1351, 4223, -654, -4244, -113, 3831, 988, -3658, -2376, 3167, 2860, -2743, -3401, 2002, 3526, -1024, -3972, 117, 4108, 897, -4389, -1721, 3825, 1861, -2942, -2983, 2258, 3795, -1543, -3822, 931, 3975, -15, -3947, -1494, 3938, 1817, -3463]
2510c463J096N410n4m974j497M626L041m903l222M045L616k698m201J143M998
2525B963j02n756n96N492J412m425k387L081M392l317m287J992N113j470m933
2540b828j61N383J078n262j760M422L005l888l442K360M503j492n259O20N482
2555B761j45m298j562M315L039m509l374L268M176k345m637J230M704M32n707
2570b652o89M978J733m389k423L247M120l126m614K489M494j325m510k9M684J411
2586C399m809k143M319K780l368l813K292M922k086m813J065M951J66m838j444
2601c420M545K457m003l465L498L898k278m341P98N201k21n404k54M640J588m006
2617g67k555L525L800l305m236K304M376j299m366j85M958R72m638k076M205K751
$$ y = [-3463, -2367, 3043, 2989, -1985, -3482, 1144, 4185, -718, -3940, 105, 3721, 1023, -3178, -2035, 2963, 2861, -2895, -3491, 2001, 3413, -1012, -3399, -318, 4074, 757, -3530, -1538, 3575, 2105, -2828, -2989, 2394, 3472, -1790, -3550, 872, 3877, -11, -3453, -1093, 3410, 1918, -3341, -2721, 2761, 2616, -1682, -3244, 1071, 4110, -399, -3773, -505, 3671, 1326, -3311, -2081, 2623, 3055, -2652, -3341, 1637, 3370, -1019, -3442, -195, 3925, 799, -3815, -1326, 3168, 1843, -2667, -2696, 1988, 3399, -1410, -3553, 766, 3546, 178, -3635, -1343, 3579, 1493, -3320, -2255, 2696, 2862, -1976, -3420, 1125, 3582, -421, -3886, -388, 3510, 1232, -3109, -2311, 2890, 2669, -2735, -2989, 1651, 3239, -767, -3322, 203, 4003, 698, -3538, -1234, 3142, 1843, -2523, -2708, 2250, 3222, -1416, -3492, 713, 3464]
2633C464l233l657K392M203j450m686R06M421L07m202j960M579K170l889k860
2648c495K987L749j823m435J148M585K3n153n43M681R90l195k856L149L663k913
2664E62l697J821M204o70m444k51M286J531m591k241M146K822l055l990K361M490
2680C284j492m776J096M143M94m592j420M299K522l970l256L434L393k073l927
2695b841Q20M438J00m557p40L938J835l245l268L573L642k966l954J970M125p53
2711B117m546j64M154J277m077j835L529K545k639l575K173M332j539m572P04
2726b116M646r4l909j672L984K617l704k970K957L500k003m228J183M457j14m457
2742a923n69L864J741l735k914L101L782k648l854J788M014p16m145l65M478Q52
$$ y = [3464, 231, -3426, -1034, 3169, 1719, -2967, -2061, 2360, 2667, -1535, -3495, 1084, 3254, -635, -3495, -508, 3241, 1418, -3017, -1869, 2716, 2739, -2414, -2957, 1724, 2714, -481, -3337, -188, 3475, 562, -3135, -1314, 2890, 2220, -2224, -2475, 1811, 3342, -1249, -3490, 656, 3478, 423, -3567, -1206, 3284, 1792, -2984, -1888, 2255, 2749, -1843, -3263, 1036, 3558, -412, -3668, -234, 3159, 1086, -2841, -2021, 2417, 2517, -2040, -2780, 1158, 2993, -252, -3520, 53, 3695, 729, -3225, -1255, 2870, 2117, -2429, -2593, 1561, 2838, -1239, -3074, 455, 3000, 361, -3214, -1041, 3291, 1752, -2820, -2116, 2530, 2436, -1473, -3145, 839, 3456, -248, -3218, -261, 3239, 1236, -2992, -1809, 2648, 2534, -1923, -2492, 1372, 3113, -622, -3536, -435, 3347, 699, -3155, -1367, 2647, 1931, -2214, -2579, 1899, 2751]
2758B751m164j530L068K924k500l598K211L880j593m038O21L902P15l726k024
2773c101L917K447l269l385K490M116j829m155R02M154o0m090p20L947J192k819
2789b63k699K928L200k640l462J892L673p17m050k15M413M47l345k400L669K465
2805B896k338l749J876M276j367m001O60L549M39l235j646L464K174l198k815
2820c015K703K804j145m022Q95M020R0m241n47L495J734l122l128L026L324k202
2836F69l381R95M101k41l726q49L848J209l804j579K962K717k412l350J965L573
2852B697j369l703O66L496N94l541j619L420K136k984k831K681K990j165l950
2867b482P09L756J44l842q21L897J157k872k671K849L106k375l176J370L083J53
$$ y = [2751, -1413, -2943, 125, 3049, 549, -3049, -838, 3042, 1449, -2589, -1968, 1934, 2649, -1077, -3101, 816, 3263, -6, -3391, -901, 3215, 1386, -2769, -1867, 2287, 2227, -1863, -2583, 1364, 2556, -263, -2962, -34, 3166, 526, -2936, -1044, 2629, 1912, -2138, -2353, 2060, 2507, -838, -3238, 431, 2896, 558, -3191, -1315, 2961, 1594, -2407, -1747, 1802, 2241, -994, -2640, 824, 2998, -200, -3015, -312, 2492, 1347, -2675, -1780, 2240, 2330, -1911, -2458, 1037, 2771, -351, -3479, -453, 2871, 669, -2712, -1717, 2384, 2143, -1583, -2432, 1416, 2625, -1179, -2758, 204, 2921, 509, -2841, -876, 2697, 1328, -2375, -1709, 1787, 2381, -1160, -2779, 641, 2777, -207, -3038, -357, 2633, 1468, -2482, -1773, 1983, 2127, -1715, -2536, 1361, 2518, -354, -3025, -176, 2930, 555, -2621, -1251, 1832, 1985]
2883A985l857n35L939J408l795j913L200K234k293k866J619L394j292l463L62
2898a873L406R87l831j466L407K368l289k312J966L049j220l591M19L723L46l454
2914a365q67L165J903l227k487K604K950j960l195J078L394J49m113l42L699P97
2930B183l305j425K670K711k493k748J482L311q63l702M60L344N01l118j461L122
2946F69K019l020k189K030L078j453l406N15L925j43l526j040L381J737k990k172
2962b585K487K617k127k819J094L427n34l265m97L632R52l314j180K668J890j914
2978E32k926J287L583j019l203M94K599Q99l311j396L189J754k569k542K225K726
2994B322j178l247L87L682k21l020p89L257J295k711k328K337K622j827k824R32
$$ y = [1985, -1872, -2407, 1532, 2940, -855, -2768, 432, 2666, 373, -2493, -874, 2520, 1228, -2235, -1873, 1533, 2520, -1311, -2777, 630, 2998, -291, -2603, -637, 2412, 1192, -2399, -1980, 1743, 2089, -1365, -2232, 933, 2836, -391, -2878, -274, 2676, 716, -2479, -1401, 1993, 2142, -1971, -2313, 1386, 2183, -1122, -2547, 123, 2834, 341, -2407, -925, 2386, 1523, -2179, -1719, 1625, 2126, -992, -2453, 669, 2688, -332, -2521, -491, 2587, 1134, -2272, -1757, 2168, 2025, -1501, -2541, 840, 2577, -413, -2585, -98, 2519, 392, -2427, -1333, 2094, 1560, -1705, -2202, 1430, 2382, -932, -2112, 556, 2446, 532, -2394, -1107, 2476, 1457, -1746, -1252, 1347, 2246, -1065, -2461, 728, 2482, -87, -2629, -404, 2322, 1144, -2103, -1716, 1966, 1745, -1275, -2064, 1193, 2488, -223, -2551, -214, 2408, 581, -2243, -1311]
3010a311L409m41l601J35L109Q61l087j172K251K164j953k790J540L213q70l094
3026a637kL147N54l109j365K863K125k404k625K115K612j433l021N80L300J09
3042A809l260o39K794J916k895k297K661K209j605k403N62L006P5l601k51K958
3058A039J126k925j655K540J970j692k983J696L075j198k862L97L121M37l023
3073i37j322K604K124k615k324J772K908j189k787M67L019j9l028o30K802J398
3089B243k634j752J642K943j843k607P99K970l94k856m19L046J055l184j086K222
3105A45K275j773l017J468L251j137k891j33K968Q56l303j243L325J323k241j772
3121a899J431K785j022l269M37L200M5k839j246K980J618k484k185K159K603j415
$$ y = [-1311, 2098, 1657, -1944, -1809, 1300, 2161, -926, -2098, 153, 2317, 364, -2426, -886, 2327, 1457, -1637, -1639, 1508, 2062, -1047, -2412, 451, 2576, 172, -2453, -338, 2274, 841, -2180, -1600, 1700, 1809, -1451, -2090, 704, 2620, -275, -2572, 89, 2298, 693, -1710, -1148, 1858, 1933, -1668, -1919, 1039, 2165, -760, -2415, 125, 2095, 403, -2580, -884, 2191, 993, -1869, -1472, 1649, 2086, -937, -2259, 345, 2469, -146, -2470, -698, 2210, 1021, -1766, -1299, 1720, 1701, -1327, -1957, 845, 2243, -391, -2143, -501, 2442, 599, -2008, -1209, 1761, 1367, -1489, -1908, 1138, 2193, -991, -2077, 145, 2420, 647, -2370, -902, 2349, 1212, -1679, -1812, 1156, 2012, -1291, -2534, 791, 2114, -127, -1899, -468, 2317, 1295, -1974, -1537, 1663, 1708, -1131, -2377, 603, 2221, -263, -2448, -289, 2314, 899]
3137H99k959R67K741j4l142n19L247P42k669j484K570J966j856k780J362K788
3153A859n52l080K56K786N79k628j512K937J769k276k227J458K668j217k595K75
3169a500L144J14k887r02K640J619k848j463K032K254j526k689Q50K585M38l235
3185a374n04K901R60k476j556J911K376j957k611J535K749o78k738j04K902M47
3201A783k744j178K510J891k359j753J040K963j141k860N36K709O2k713o59K567
3217F54J338k213j933K125J904j201k481O38K690j36k919n8K281J144k336j409
3233a912J829K202j786k288J086K780n30l055K01K626P03k867q03K394J673k137
3249A16j891J261K556j117k717N90K871j94k516p82K275J799k840j353J764K174
$$ y = [899, -2060, -1093, 1648, 1634, -1508, -2027, 1220, 1962, -707, -2191, 379, 2345, 489, -2291, -929, 1859, 1307, -1773, -1517, 1269, 1848, -780, -2292, 645, 2414, 138, -2089, -631, 2037, 820, -1775, -1500, 1644, 1758, -1129, -2031, 609, 2228, -620, -2083, -51, 2203, 677, -2012, -1162, 1423, 1861, -1374, -1878, 1023, 1983, -493, -2049, -138, 2238, 281, -2330, -795, 1954, 1276, -1462, -1566, 1336, 1783, -961, -2139, 371, 2262, -97, -1850, -810, 2153, 1012, -1848, -1312, 1397, 1459, -1254, -1913, 654, 1992, -221, -2154, -29, 1875, 674, -1807, -1169, 1521, 1385, -1534, -1592, 689, 1833, -503, -1912, -83, 2119, 333, -1955, -869, 1911, 1381, -1674, -1473, 1153, 1856, -1011, -1814, 580, 2253, 116, -1775, -514, 2042, 925, -1792, -1202, 1669, 1475, -1041, -1823, 452, 2251, -589, -1942, -178, 1996]
3265A996j448k286O24K608o2k904j12K617P79k360j288J610K153j487k345J028
3281h77K552o23k417N4K397R60k989p83K136J470j873k027J526K676j355k824
3297a997P61K785r5k352r14K392J584k473j419J567J587q43j767j61K973j7l004
3314a393k17K625N65k064j186J867J528j533k200J272K317p55k194l87K839O46
3330A730k217j480K471J340j698k103J377K246q46k424O69K406Q0k675n52K400
3346G24J294k292j607J913J977j502k432P57K632k2l003l04K859O93k156j385
3362a854J906K086j889k124J221K010l06k114o33K908N89k353j484K237J843j781
3378B62k012J029K434o14k762N98K551l39j870q95K103J051j786j525J551J841
$$ y = [1996, 548, -1738, -1114, 1494, 1432, -1472, -1584, 1033, 1812, -548, -1836, -226, 1927, 440, -1905, -877, 1675, 1052, -1365, -1311, 1086, 2046, -943, -1726, 410, 1880, 7, -2020, -494, 2182, 827, -1997, -1236, 1549, 1454, -898, -1812, 580, 2164, -309, -1728, -161, 1426, 583, -1184, -1345, 1628, 1611, -1393, -1610, 1015, 1580, -484, -1670, 197, 1725, 192, -2008, -736, 1581, 826, -1368, -1755, 1084, 1730, -487, -1967, 504, 1844, 146, -1957, -580, 1666, 820, -1604, -935, 1471, 1551, -1124, -1676, 724, 2018, -274, -1881, 32, 2009, 507, -1925, -1168, 1464, 1442, -1561, -1865, 994, 1687, -469, -1854, 52, 2138, 249, -1875, -654, 1356, 1050, -1064, -1697, 1211, 1800, -553, -2037, 200, 2043, 262, -1750, -721, 1713, 1099, -1663, -1065, 1486, 1147, -723, -1618, 485, 1536, -250, -1775, -224, 1617]
3394A617j140k106N77K369q6k525j69K520O93k044j594J896K017j821k200J348
3410f48J950k11k446l77K827M24j964j500K174J637j704j845R38K290o00k489
3426a544K87K559J12k076r66J730J790k091j666J744J865r31k064J67K490p9k583
3443a256l13K244J200k170j683J845J717q34k245P92K282o81j963n67K500Q30
3459A698k177q85J372J602j447j480P13K236o08k524K87K329J30j923j154K326
3475D95J246j644j822J578J707r04j786j40K772O0k838j43K228Q57k021j256J688
3492G7J776j469k221J239K205m60k360k38K368Q13k339q78J619J319j154j725
3508a428P98K185n84k271K83K260j6j996j119K342J455k250j451J345K103j163
$$ y = [1617, 477, -1629, -1052, 1317, 1231, -1294, -1463, 1057, 1750, -294, -1888, 8, 2025, 204, -1996, -648, 1302, 1091, -1355, -1732, 1095, 1519, -445, -1945, 229, 1866, 162, -1683, -745, 1545, 945, -1544, -1257, 1302, 1414, -662, -1628, 102, 1892, -199, -1865, -121, 1744, 813, -1251, -1084, 1406, 1327, -1256, -1569, 675, 1875, -295, -1978, -133, 1584, 750, -1495, -703, 1579, 898, -1065, -1632, 868, 1698, -479, -1364, 8, 1610, 163, -1317, -604, 1632, 1024, -1500, -1213, 1116, 1246, -677, -1831, 495, 1741, 97, -1725, -147, 1560, 656, -1130, -1270, 1502, 1562, -1276, -1419, 809, 1666, -355, -1611, 77, 1853, 384, -1837, -598, 1607, 1147, -1213, -1451, 917, 1730, -609, -1487, 132, 1451, 297, -1428, -630, 1555, 971, -1300, -1017, 1243, 1227, -769, -1888, 454, 1909, -341, -1792, -447, 1656, 493]
3524D93j683M6K507l05j788q29K160P75j598j401J472K037j573j987R79K069p55
3541F19j664m75K386P05k005p15J285J175r85k050J044K376q27k188M10J860N62
3558A513k062q13J789J580k052j343J096J873j018j991M34K110J81k405Q1J521
3574D94J029j831j255J618J714j212j896J019J620k68k011n00K417J32j853l30
3590a113J312J138j069j701Q87J923p19j646j8J985L12j784j264K378R25j697
3606a51j214J191J577r21j979N63K102j29j990l05K056N57j316j657J537J852
3622A773j496j802J367J604p47j546l90K158O37k342p65J617J275j127j957J344
3638c97J807o35k107K90K303j31k092m87J770J275j940j212J784J121q26j778
$$ y = [493, -1190, -1144, 1363, 1058, -730, -1559, 601, 1376, -222, -1623, -151, 1886, 313, -1674, -695, 1374, 619, -1045, -1520, 866, 1571, -434, -1149, 136, 1311, 326, -1724, -680, 1696, 869, -1319, -909, 951, 1513, -549, -1362, 427, 2007, -45, -1388, -292, 1581, 563, -1428, -994, 1116, 1297, -1108, -1027, 494, 1523, -308, -1563, 55, 1769, 557, -1339, -320, 1300, 1032, -979, -1479, 938, 1070, -783, -1113, 199, 1337, 268, -1433, -546, 1377, 658, -988, -1006, 979, 1291, -493, -1757, 621, 1546, -151, -1365, -174, 1403, 482, -1497, -934, 1168, 1039, -951, -1256, 800, 1357, 41, -1616, -79, 1773, 277, -1525, -158, 1446, 699, -847, -1237, 921, 1558, -784, -1549, 68, 1343, 216, -1741, -397, 1410, 775, -1332, -1042, 1261, 1130, -962, -1449, 321, 1596, -344, -1556, 228, 1349, 523, -1255]
3654a255N00K035j04k084l82J885R46j926j334J738J718j420j415M76J827j07
3670A098k242j49K024N35j659p82J539J115j197j554P02K099o45j731N8J581K49
3687A041j656q53K011P84j370j320J099J683o51k149M07K151j33j890QJ107R85
3704A254j593j178J193J731j039j655N68J887m90j547m51K366R8j345j241J584
3720A42R35q62j516N05K444j036j691K38J691L47j610j248K045J458j514j548
3736a220J016J557o26j993N80K008k01j880m53J585Q11j409j126J234J484q42
3752E25j517L26J654m7j685p40K487L75j908q61J908P21j025j570O65J916n21
3769G03j726K19J706J65k008n56J863R55j626j043Q12J991r18j706M94J624J7
$$ y = [-1255, -755, 1280, 1176, -908, -1290, 595, 1541, -385, -1719, 19, 1737, 317, -1098, -622, 1205, 1098, -1144, -1293, 731, 1266, -393, -1175, 364, 1479, 282, -1272, -570, 1529, 884, -847, -789, 792, 1041, -615, -1468, 543, 1327, -43, -1363, -264, 1419, 768, -1381, -974, 1177, 1044, -846, -838, 269, 1254, -339, -1517, -324, 1407, 368, -1287, -719, 1168, 678, -869, -1320, 1046, 1144, -201, -1442, 142, 1077, 215, -1301, -796, 1648, 612, -1079, -841, 850, 1197, -413, -1661, 384, 1842, 328, -1220, -204, 1353, 727, -1266, -686, 1322, 1121, -759, -1212, 373, 1184, -225, -1351, -117, 1367, 525, -992, -666, 988, 941, -744, -1484, 1003, 1378, -530, -1391, 517, 1238, 213, -1357, -692, 1224, 703, -1023, -804, 902, 1067, -941, -1497, 366, 1321, -305, -1348, -536, 1455, 537, -1169, -675, 949, 966]
3786I66j676k69J481Q89j314q90R74J247j049j542M80J697j04j554l34J907M04
3803A313j809o26J061J305r87j678P39J684l19j659J5J779N60j951m51J423R45
3820A344j264j622J311J249p63j152j6J740J43j731l15J335R06j830r20J382J525
3837A322j219j014L24J671l10j700m44K148M08j640q42J244J057q43j494Q82J954
3854A504j030j122m00J714O65j797r56J686J180j550j236R91J548p39j637R7K173
3871A091n5j586l34J158R24j638q39J070J318o83j388O70J303K1j733k18J435
3888E16N48j366o08J324R37j317j471Q38J685l82j571M3J578P3j198o40J363P88
3906A140j216j135J063R35j01j697M4K159k58j481m27J148R94j243r68R21J259
$$ y = [966, -710, -979, 502, 1391, 77, -813, 161, 1408, 359, -1183, -703, 994, 890, -664, -998, 909, 1313, -496, -1122, -61, 1244, 257, -1421, -682, 1002, 683, -976, -961, 818, 1378, -573, -1024, 399, 1344, 80, -1542, -231, 1018, 255, -897, -913, 827, 970, -761, -1076, 259, 1165, -665, -1585, -203, 1322, 103, -911, -587, 1084, 774, -926, -1370, 778, 1186, -454, -1296, -52, 1005, 162, -1332, -450, 1504, 474, -648, -1048, 666, 1331, -466, -1422, 264, 1444, -106, -1342, -351, 1197, 458, -1179, -1082, 1091, 1036, -550, -884, 274, 1198, -440, -1279, -209, 1109, 426, -962, -292, 1011, 1032, -701, -919, 516, 1064, -302, -910, 414, 1351, 34, -1437, -599, 1086, 704, -867, -824, 754, 827, -371, -1011, 352, 1140, -76, -1211, -148, 787, 686, -1011, -967, 1192, 934, -547, -974, 174, 1168, -75, -1043, -122, 1137]
3923A137n97j709M51J688j04j814M06J007N49j378j064J465J288j034j714J106
3939c17J645n61j473k66J478P33j726p21J628M88o59j477P97J521l14j931k5J878
3957F98l0j134o61J405O84j136j353J386J087o21j400Q03R15K31j498n55J706
3974E27L80j476m70J069J088p82j393L73J798k38j346m87J465N50j612m93J721
3991F74N94j565n59Q79J001n27j463M94J284L11j567n73J378P35j145q49J033
4008A35R23m53j399Q1J624K6j758j0J361P24j616p62J020J075p85j409J058J166
4026A001l59j416R8J206J63r01r97J581N80r22r33N69J329o08j526L65J566j02
4044F94j342j97J077N62r52j010J136J162r20j094L26J404J74j641L3J366L06
$$ y = [1137, 540, -1169, -718, 970, 866, -948, -542, 465, 1014, -364, -1428, 37, 1325, 291, -1423, -317, 1328, 767, -706, -972, 506, 1239, -487, -1208, 420, 908, 249, -1228, -431, 1090, 776, -1155, -1180, 698, 668, -466, -1127, 278, 962, -174, -1527, -141, 946, 325, -1075, -272, 643, 874, -624, -1179, 527, 907, -569, -1039, 30, 1118, 336, -1057, -684, 1114, 876, -470, -957, 508, 1058, -554, -1047, 674, 1268, -297, -856, 23, 1024, 497, -966, -472, 812, 1123, -444, -1017, 361, 1096, -49, -898, 135, 1058, 605, -794, -713, 911, 937, -821, -831, 530, 1254, -362, -1124, -104, 971, 186, -1223, -165, 1001, 642, -774, -676, 530, 693, -208, -1205, 376, 956, 34, -899, -330, 999, 391, -1135, -770, 796, 694, -648, -845, 232, 794, -158, -1168, -32, 1130, 210, -884, -558, 846, 1020, -621, -588, 778, 1084]
4061A084j397o92R95J067p71j022K09J338n84r17m92J840J44j273o04J524K72
4078G21p14j154P94J157q3j441J12J276r4j064k74J081Q90j091j202J125J027
4095A066l87j826O14J425r4j609m41K057K51j289n66Q53J049q84j284P55J422
4112A112o84j062q2J123N51j361j58N48J139j136j272J269P59k14j456M05J598
4129A079k47j243p53J159Q94j203q17J153R98p65j068L48J428k38j453j78J648
4146G42j4j152l90O70J383r93j310O31J287m79p93l84J370K57j493j67Q90P74
4164H29q73o47N07J582n77j715L61J266M3j043m35J006Q77r60j250J012P71o85
4182F9q41J22J382j17j241m94J628K25q54r95R99J038q72r90M29J202k18j293
$$ y = [1084, -313, -1005, -10, 1057, 286, -736, -527, 811, 227, -690, -1182, 658, 802, -471, -1075, 449, 721, 7, -1147, -353, 804, 721, -720, -608, 668, 574, -490, -764, 317, 1207, 116, -1086, 39, 1066, 679, -1147, -533, 892, 798, -811, -1252, 805, 1056, -233, -799, 54, 1103, 219, -1065, -310, 1112, 428, -634, -716, 407, 958, -403, -561, -13, 1126, -10, -1282, -13, 746, 532, -924, -519, 1079, 832, -411, -1164, -5, 889, -314, -1131, 22, 1020, 255, -813, -465, 963, 725, -728, -906, 742, 728, -424, -814, -144, 1239, 246, -1064, -433, 854, 375, -418, -802, 568, 825, -668, -835, 55, 829, -44, -691, -184, 1398, 821, -894, -533, 733, 776, -267, -702, 304, 1181, 221, -1029, -17, 754, 69, -772, -650, 732, 615, -626, -1120, 508, 733, -121, -1116, -117, 921, 49, -941, -512, 690, 472, -821]
4200h21K4J366K72j074p74J193P06p76j143Q39J069m00j356K79J134J74r90r36
4218a214J574R84j486q76R33J182p31j058M63J062O4j559m70J699L11j291n30
$$ y = [-821, -797, 569, 841, -233, -1007, 186, 892, 116, -1027, -188, 881, 481, -875, -596, 538, 712, -278, -1214, 360, 1344, -142, -1018, -85, 1097, 366, -692, -229, 833, 897, -662, -1132, 567, 878, -413, -943]
$$ [...]
8191A97
##END NTUPLES=NMR FID
##END=
