##TITLE=1H_DE-63_3_oil
 D2O
 8 sc, 
 6.8.2024
##JCAMPDX= 6.0         $$ Bruker NMR JCAMP-DX V2.0
##DATA TYPE= NMR FID
##DATA CLASS= NTUPLES
##ORIGIN= UXNMR, Bruker Analytische Messtechnik GmbH
##OWNER= root
$$ XWIN-NMR		Version 3.5
$$ Tue Aug  6 13:57:22 2024 Russian Standard Time (UT+4h)  she@DPX200
##.OBSERVE FREQUENCY= 200.1313
##.OBSERVE NUCLEUS= ^1H
##.DELAY= (6, 6)
##.ACQUISITION MODE= SIMULTANEOUS
##.ACQUISITION SCHEME= undefined
##.AVERAGES= 8
##.DIGITISER RES= 18
##SPECTROMETER/DATA SYSTEM= spect
##.PULSE SEQUENCE= zg30
##.SOLVENT NAME= Acetone
##.SHIFT REFERENCE= (INTERNAL, Acetone, 0, 15.7039)
##AUDIT TRAIL= $$ (NUMBER, WHEN, WHO, WHERE, WHAT)
$$ ##TITLE= Audit trail, XWIN-NMR		Version 3.5
$$ ##JCAMPDX= 5.01
$$ ##ORIGIN= Bruker BioSpin GmbH
$$ ##OWNER= she
$$ F:/spectra/data/she/nmr/H-F/1/audita.txt
$$ ##AUDIT TRAIL=  $$ (NUMBER, WHEN, WHO, WHERE, WHAT)
(   1,<2024-08-06 13:56:26.71 +0400>,<she>,<DPX200>,
      <created by zg, POWCHK disabled, PULCHK disabled
       configuration hash MD5:
       00 E9 B6 7A A2 85 ED C7 34 08 36 98 17 FE 4E 26
       data hash MD5: 16K
       13 D3 70 D4 0D 2F 3B 51 6F 0A C6 5C 4E 05 98 51>)
$$ ##END=
$$ 
$$ hash MD5
$$ C0 A0 7C 31 89 B0 28 14 A7 24 82 88 53 0E B4 FE
##$RELAX= 
##$RELAX= 
##$RELAX= 
##$RELAX= 
##$RELAX= 
##$RELAX= 
$$ Bruker specific parameters
$$ --------------------------
##$DU= <F:/spectra>
##$EXPNO= 1
##$NAME= <H-F>
##$PROCNO= 1
##$TYPE= <nmr>
##$USER= <she>
##$AMP= (0..31)
100 100 100 100 100 100 100 100 100 100 100 100 100 100 100 100 100 100 
100 100 100 100 100 100 100 100 100 100 100 100 100 100 
##$AQSEQ= 0
##$AQ_mod= 1
##$AUNM= <au_zg>
##$AUTOPOS= <>
##$BF1= 200.13
##$BF2= 200.13
##$BF3= 200.13
##$BF4= 200.13
##$BF5= 200.13
##$BF6= 200.13
##$BF7= 200.13
##$BF8= 200.13
##$BYTORDA= 1
##$CFDGTYP= 0
##$CFRGTYP= 5
##$CHEMSTR= <none>
##$CNST= (0..31)
1 1 145 1 1 1 1 1 1 1 1 1 1 1 1 1 1 1 1 1 1 1 1 1 1 1 1 1 1 1 1 1 
##$CPDPRG= <>
##$CPDPRG1= <>
##$CPDPRG2= <>
##$CPDPRG3= <>
##$CPDPRG4= <mlev>
##$CPDPRG5= <mlev>
##$CPDPRG6= <mlev>
##$CPDPRG7= <mlev>
##$CPDPRG8= <mlev>
##$CPDPRGB= <>
##$CPDPRGT= <>
##$D= (0..31)
0 1.2 0 0 0 0 0 0 0 0.06 0 0.03 0 0 0 0 0.0002 0 0 0 0 0 0 0 0 0 0 0 0 
0 0 0 
##$DATE= 1722938186
##$DBL= (0..7)
120 120 120 120 120 120 120 120 
##$DBP= (0..7)
150 150 150 150 150 150 150 150 
##$DBP07= 0
##$DBPNAM0= <>
##$DBPNAM1= <>
##$DBPNAM2= <>
##$DBPNAM3= <>
##$DBPNAM4= <>
##$DBPNAM5= <>
##$DBPNAM6= <>
##$DBPNAM7= <>
##$DBPOAL= (0..7)
0.5 0.5 0.5 0.5 0.5 0.5 0.5 0.5 
##$DBPOFFS= (0..7)
0 0 0 0 0 0 0 0 
##$DE= 6
##$DECBNUC= <off>
##$DECIM= 24
##$DECNUC= <off>
##$DECSTAT= 4
##$DIGMOD= 1
##$DIGTYP= 9
##$DL= (0..7)
0 120 120 120 120 120 120 120 
##$DP= (0..7)
150 150 150 150 150 150 150 150 
##$DP07= 0
##$DPNAME0= <>
##$DPNAME1= <>
##$DPNAME2= <>
##$DPNAME3= <>
##$DPNAME4= <>
##$DPNAME5= <>
##$DPNAME6= <>
##$DPNAME7= <>
##$DPOAL= (0..7)
0.5 0.5 0.5 0.5 0.5 0.5 0.5 0.5 
##$DPOFFS= (0..7)
0 0 0 0 0 0 0 0 
##$DQDMODE= 0
##$DR= 18
##$DS= 0
##$DSLIST= <SSSSSSSSSSSSSSS>
$$ [...]
##$SUBNAM2= <"">
##$SUBNAM3= <"">
##$SUBNAM4= <"">
##$SUBNAM5= <"">
##$SUBNAM6= <"">
##$SUBNAM7= <"">
##$SUBNAM8= <"">
##$SUBNAM9= <"">
##$SW= 24.0689771365484
##$SWIBOX= (0..15)
0 0 2 0 0 0 0 0 0 0 0 0 0 0 0 0 
##$SW_h= 4816.95568400771
##$TD= 16384
##$TD0= 1
##$TE= 0
##$TE2= 300
##$TE3= 300
##$TEG= 300
##$TL= (0..7)
0 120 120 120 120 120 120 120 
##$TP= (0..7)
150 150 150 150 150 150 150 150 
##$TP07= 0
##$TPNAME0= <>
##$TPNAME1= <>
##$TPNAME2= <>
##$TPNAME3= <>
##$TPNAME4= <>
##$TPNAME5= <>
##$TPNAME6= <>
##$TPNAME7= <>
##$TPOAL= (0..7)
0.5 0.5 0.5 0.5 0.5 0.5 0.5 0.5 
##$TPOFFS= (0..7)
0 0 0 0 0 0 0 0 
##$TUNHIN= 0
##$TUNHOUT= 0
##$TUNXOUT= 0
##$USERA1= <user>
##$USERA2= <user>
##$USERA3= <user>
##$USERA4= <user>
##$USERA5= <user>
##$V9= 5
##$VALIST= <valist>
##$VCLIST= <CCCCCCCCCCCCCCC>
##$VD= 0
##$VDLIST= <DDDDDDDDDDDDDDD>
##$VPLIST= <PPPPPPPPPPPPPPP>
##$VTLIST= <TTTTTTTTTTTTTTT>
##$WBST= 1024
##$WBSW= 4
##$XGAIN= (0..3)
0 0 0 0 
##$XL= 0
##$YL= 0
##$YMAX_a= 238552
##$YMIN_a= -242655
##$ZGOPTNS= <>
##$ZL1= 120
##$ZL2= 120
##$ZL3= 120
##$ZL4= 120
##$ABSF1= 10
##$ABSF2= 0
##$ABSG= 5
##$ABSL= 3
##$ALPHA= 0
##$AQORDER= 0
##$ASSFAC= 0
##$ASSFACI= 0
##$ASSFACX= 0
##$ASSWID= 0
##$AUNMP= <proc_1d>
##$AZFE= 0.1
##$AZFW= 0.1
##$BCFW= 1
##$BC_mod= 2
##$BYTORDP= 1
##$COROFFS= 0
##$CY= 11.3945322036743
##$DATMOD= 1
##$DC= 2
##$DFILT= <>
##$DTYPP= 0
##$F1P= 15.6554695791079
##$F2P= 12.8336369535428
##$FCOR= 0.5
##$FTSIZE= 0
##$FT_mod= 4
##$GAMMA= 1
##$GB= 0.15
##$INTBC= 1
##$INTSCL= 1
##$ISEN= 128
##$LB= 0.24
##$LEV0= 0
##$LPBIN= 0
##$MAXI= 10000
##$MC2= 0
##$MEAN= 0
##$ME_mod= 0
##$MI= 1.114404
##$NCOEF= 0
##$NC_proc= 0
##$NLEV= 6
##$NOISF1= 3.799351
##$NOISF2= 2.8
##$NSP= 1
##$NTH_PI= 0
##$NZP= 0
##$OFFSET= 15.70392
##$PC= 1
##$PHC0= -25641.44
##$PHC1= 12.18749
##$PH_mod= 1
##$PKNL= yes
##$PPARMOD= 0
##$PSCAL= 0
##$PSIGN= 0
##$REVERSE= no
##$SF= 200.130013532006
##$SI= 16384
##$SIGF1= 3
##$SIGF2= 2
##$SINO= 400
##$SIOLD= 16384
##$SREGLST= <1H.CDCl3>
##$SSB= 0
##$STSI= 0
##$STSR= 0
##$SW_p= 3612.71676300578
##$SYMM= 0
##$S_DEV= 0
##$TDeff= 0
##$TDoff= 0
##$TI= <>
##$TILT= no
##$TM1= 0
##$TM2= 0
##$TOPLEV= 0
##$USERP1= <user>
##$USERP2= <user>
##$USERP3= <user>
##$USERP4= <user>
##$USERP5= <user>
##$WDW= 1
##$XDIM= 8192
##$YMAX_p= 0
##$YMIN_p= 0
$$ End of Bruker specific parameters
$$ ---------------------------------
##NTUPLES= NMR FID
##VAR_NAME=  TIME,          FID/REAL,        FID/IMAG
##SYMBOL=    X,             R,               I
##VAR_TYPE=  INDEPENDENT,   DEPENDENT,       DEPENDENT
##VAR_FORM=  AFFN,          ASDF,            ASDF
##VAR_DIM=   8192,          8192,            8192
##UNITS=     SECONDS,       ARBITRARY UNITS, ARBITRARY UNITS
##FACTOR=    0.0002076,     1,               1
##FIRST=     0,             0,               0
##LAST=      1.7004516,     0,               0
##MIN=       0,             -242655,         0
##MAX=       1.7004516,     238552,          0
$$ Real data points
##PAGE= N=1
##DATA TABLE= (X++(R..R)), XYDATA
0 0 0 0 0 0 0 0 0 0 0 0 -8 8 -8 8 -16 16 -16 24 -24 32 -39 44 -48 58 -68 78 -87 102 -113 129 -148 166 -184
33 -184 209 -233 259 -290 323 -355 396 -440 487 -539 598 -660 731 -813 900 -1003 1121 -1256
51 -1256 1416 -1607 1839 -2127 2498 -2997 3688 -4702 6151 -10132 238552 209428 -80334 -145464
65 -145464 -126179 24393 236134 132985 -206072 -199530 76056 174890 81490 -43975 -173719
76 -173719 -102656 158519 196228 -60308 -186120 -73969 68002 144977 76134 -135823 -180081
87 -180081 34706 171655 79326 -69607 -146057 -64312 126413 157051 -30404 -148824 -74008
98 -74008 66511 141301 56590 -122192 -136186 41646 140691 59509 -64423 -124320 -51437
109 -51437 112333 132725 -43261 -143517 -50784 63452 102428 48002 -95203 -133829 30728
120 30728 140489 46909 -65130 -87906 -40897 78998 126390 -17749 -134574 -47690 73169
131 73169 87182 30013 -72196 -113878 12372 132271 53620 -79261 -90831 -20289 68351
142 68351 101815 -9232 -128539 -58763 79654 88853 10429 -66993 -90113 8055 118891
153 118891 57334 -77843 -85581 -455 68387 78347 -9165 -107958 -53009 77661 85023 -5956
165 -5956 -68696 -67548 10111 97345 51281 -74030 -86025 8173 67780 56529 -11699 -87482
177 -87482 -50725 67899 83987 -11090 -67136 -46970 15116 78202 47658 -61631 -80236 12784
189 12784 68933 42309 -18678 -70041 -42487 56417 77354 -12428 -70056 -38365 21157 62086
201 62086 36854 -49990 -74449 9090 68575 34213 -24125 -55022 -32355 44257 70525 -6662
213 -6662 -66766 -30657 27200 50205 28006 -38684 -65239 5367 65314 30425 -29351 -47475
225 -47475 -23327 34871 59817 -2977 -63521 -31597 30327 45408 17283 -32556 -53737 531
237 531 59809 31204 -31465 -43482 -12093 30761 48463 875 -55680 -30045 32205 42635
249 42635 8395 -29820 -43035 -572 51997 29945 -32079 -42341 -5921 28819 37643 944
261 944 -47459 -30251 30485 41986 3197 -28995 -32515 -177 42653 29575 -27966 -41224 -893
274 -893 29955 28267 -1737 -38390 -27677 26056 40698 309 -30701 -25879 2787 34590 26044
287 26044 -23286 -39450 -1274 30699 23736 -3913 -31317 -24053 21027 38225 1269 -30053
299 -30053 -21471 5787 28538 21665 -19237 -36723 -1064 30801 19594 -7726 -26824 -19603 17262
312 17262 35257 1877 -31123 -19031 9424 24389 16874 -14876 -33026 -2957 30347 18664
324 18664 -10849 -22712 -13115 13687 29640 3746 -29144 -18814 12238 22595 10504 -13143
336 -13143 -27052 -4550 27663 19132 -13270 -23174 -8719 13132 24405 4490 -25432 -19009 12249
349 12249 22373 7220 -12796 -21812 -3738 23674 18242 -12241 -22240 -5686 13301 19539 3158
362 3158 -21978 -18041 11931 22062 4785 -13440 -18195 -3278 20446 17643 -10861 -21975 -3907
375 -3907 13785 15972 2415 -17981 -16959 10379 22164 3617 -14543 -14449 -670 16226 16178 -8839
389 -8839 -21977 -3568 15197 13863 -527 -15775 -14617 7855 21029 3934 -15732 -13322 1456
402 1456 14488 12640 -6995 -19772 -4394 15052 13016 -2493 -13608 -11221 6941 18751 3983
415 3983 -15696 -12533 3279 13208 10187 -6154 -17996 -4255 15124 12251 -4365 -12578 -9070
428 -9070 5374 16598 4731 -14439 -12046 4676 12246 7393 -5318 -14866 -4784 14025 12107
441 12107 -4758 -12559 -6275 5504 13619 4530 -12994 -12454 4671 12691 5424 -5650 -12465 -4604
455 -4604 11807 12763 -4818 -12895 -4689 5845 11069 4134 -10525 -11994 4560 12732 4422 -6509
469 -6509 -10068 -3487 9714 11455 -4058 -12935 -4240 6775 9142 2657 -9304 -11100 2992 12994
483 12994 4396 -7590 -8655 -1932 8179 10299 -2519 -12273 -4009 7808 8455 1699 -7428 -9337
497 -9337 2278 12268 4390 -7934 -8329 -418 6958 8931 -2127 -11379 -4489 7566 8044 -368 -6800
512 -6800 -7672 1750 11021 4800 -7576 -8074 896 6932 6539 -1457 -10047 -4609 7815 8102 -1098 -6951
528 -6951 -5870 1578 9137 4715 -7301 -7922 1237 6670 5035 -1848 -8424 -4724 6316 8229 -1109
543 -1109 -7100 -4266 1974 7506 4180 -6293 -7839 1365 7509 4089 -2165 -6881 -3917 5658 8014
558 8014 -1245 -7498 -3319 2509 6228 3305 -5557 -8042 1071 7322 3313 -3241 -5795 -3257 4836
573 4836 7489 -1015 -7438 -3431 3440 5290 2485 -4013 -6869 784 7254 3116 -3892 -4855 -2142
588 -2142 4079 6401 -630 -7061 -3004 3842 5041 1645 -3970 -5710 182 6811 3216 -4237 -4950
603 -4950 -749 3459 5130 -467 -6457 -3350 4361 4774 200 -3655 -4389 440 6472 3302 -4284 -4503
619 -4503 -65 3244 3965 -514 -5822 -3250 3924 4666 -329 -3573 -3449 357 5052 3176 -3418 -4927
635 -4927 374 3957 3034 -512 -4476 -2858 3630 5027 -709 -3921 -2493 927 4315 2758 -3265
650 -3265 -4821 466 3906 2351 -1104 -3821 -2274 2787 4463 -632 -4082 -2113 1217 3423 2207
665 2207 -2826 -4132 494 3746 2118 -1537 -3219 -1738 2742 3787 -305 -3990 -2093 1763 2972
680 2972 1460 -2722 -4114 727 4227 1372 -2068 -2779 -1035 2415 3715 -340 -4120 -1554 2116
695 2116 2805 1032 -2128 -3232 235 3841 1574 -2373 -2683 -356 1775 2978 -273 -3998 -1760 2397
711 2397 2757 -22 -2049 -2563 438 3910 1810 -2575 -2753 60 2146 1977 -222 -3563 -1469 2456
727 2456 2861 -274 -2215 -2046 801 2834 1627 -2326 -2724 548 2156 1665 -600 -3033 -1322 2236
743 2236 2368 -383 -2043 -1441 495 2677 1314 -2431 -2750 607 2291 1155 -837 -2635 -1192 2351
759 2351 2618 -629 -2302 -954 998 2354 1301 -1934 -2718 1098 2777 934 -1374 -1592 -888 1678
775 1678 2359 -695 -2920 -599 1533 1866 537 -1970 -2168 871 2345 1217 -1461 -1794 -776 1693
791 1693 1675 -796 -2914 -817 1444 1846 489 -1825 -1955 731 2655 821 -1782 -1715 -241 1774 2013
808 2013 -599 -2756 -766 1944 1601 -239 -1715 -1780 585 2598 516 -1612 -1814 354 1360 1586
824 1586 -308 -1972 -945 1995 1643 -403 -1569 -1273 720 2166 853 -1870 -1658 430 1552 946
840 946 -512 -1659 -675 1747 1395 -352 -1878 -840 794 2143 664 -1774 -1863 772 1832 840 -706
857 -706 -1505 -541 1627 1717 -658 -1794 -897 889 1658 436 -1640 -1435 657 2042 548 -881 -1625
874 -1625 -556 1492 1352 -733 -1840 -958 1079 1347 234 -1143 -1021 372 2176 326 -987 -1349
890 -1349 -134 1677 1847 -474 -2102 -508 1300 1048 243 -1339 -1267 666 1857 571 -1244 -1058 -2
907 -2 1300 914 -509 -1798 -439 1348 1214 -109 -1437 -987 590 1603 566 -1365 -1260 134 1352
924 1352 989 -312 -1428 -421 1306 1236 -231 -838 -928 218 1427 337 -1250 -1167 514 1226 583 -403
942 -403 -1359 -506 979 1065 -182 -935 -421 616 1063 541 -995 -914 299 1224 612 -223 -1080 -496 1214
961 1214 1173 -125 -1271 -696 442 1108 452 -724 -1379 399 1245 515 -530 -1172 -220 813 905 -283
979 -283 -1361 -326 571 855 264 -1004 -1041 366 1147 470 -725 -960 -404 847 1064 -317 -859 -515
997 -515 577 818 330 -742 -957 187 1040 671 -656 -869 -107 513 797 -295 -1036 -598 1042 877
1015 877 -76 -827 -943 164 912 483 -731 -1210 45 1037 623 141 -1217 -634 653 822 -283 -474
1033 -474 -478 416 1109 321 -574 -1097 89 1022 432 -127 -750 -532 872 522 -4 -729 -354 94 1018 233
1053 233 -560 -811 133 925 384 -98 -427 -413 1048 766 -265 -922 -346 448 770 452 -586 -853 -31
1072 -31 832 435 -430 -788 -266 -113 877 9 -635 -286 575 412 60 -661 -569 61 1050 545 -532 -515 56
1093 56 286 685 -67 -571 -387 443 523 448 -422 -454 299 880 421 -714 -706 -114 708 492 -15 -740 -409 532
1115 532 635 52 -740 -587 135 649 321 -655 -529 193 561 415 -12 -687 -424 495 784 -201 -603 -467
1135 -467 336 475 325 -529 -539 374 400 646 -157 -668 -186 531 405 -246 -687 -614 409 509 485 -513 -843
1156 -843 140 811 344 -291 -596 -195 629 573 -37 -247 -297 -2 691 143 -460 -605 234 558 446 -327 -565
1177 -565 -194 281 811 -133 -722 -624 47 683 8 -320 -704 259 628 393 -435 -582 -251 285 709 -420
1197 -420 -350 -308 377 438 40 -427 -806 64 442 221 -354 -395 -38 325 552 387 -626 -108 680 309 43
1218 43 -521 -151 -247 337 365 -210 -448 -389 441 235 -46 -492 -562 296 530 -302 -129 -415 126 675 443 -304
1240 -304 -618 -95 649 387 138 -453 -306 399 634 25 -459 -193 -164 483 561 -221 -584 -189 421 379 211
1261 211 -283 -390 263 558 -82 -540 -393 123 181 317 -311 -484 49 541 225 -68 22 -214 350 402 275
1282 275 -496 -354 142 535 306 -143 -575 72 387 322 -170 -236 -119 88 318 279 -195 -485 261 439 133
1303 133 -56 -859 -241 319 295 -222 -396 -38 150 577 273 -26 -422 291 377 245 14 -347 -78 507 410
1324 410 84 -401 -256 121 437 168 -480 -120 153 530 152 35 -419 -199 167 197 -196 -506 214 315
1344 315 338 52 -482 -451 260 596 299 -52 -140 -235 266 102 -232 -388 43 207 122 26 -554 -247 408 250
1366 250 1 -345 -3 -68 107 116 -221 -174 -153 377 296 -48 -318 -118 124 615 190 -244 -200 240 135 156 39
1389 39 -226 -128 -90 300 114 -178 -352 -140 327 293 -483 -494 553 239 213 -74 -433 -358 274 531 -352 -450
1411 -450 -188 -27 300 231 -324 -407 -82 327 134 -199 -208 -154 -7 556 -130 -380 -358 -49 326 241 -345 -362 256
1434 256 150 277 19 -159 -183 113 294 -84 -163 -78 159 319 50 -118 -439 -1 356 -13 213 -303 -226
1455 -226 -39 -51 -5 -360 -43 195 102 44 -436 -148 3 326 -127 121 35 -308 224 127 60 -304 9 -226
1477 -226 92 7 -192 -395 -83 292 -50 -372 -19 -454 9 65 -20 -91 83 220 122 22 -61 50 130 78 220
1500 220 -49 -197 100 -221 26 -95 -119 -417 42 216 80 -193 -100 137 178 65 -375 -125 -70 102 174 -31
1522 -31 29 -336 173 -92 223 -224 72 313 416 38 18 125 17 69 25 19 54 -136 91 276 -39 24 -13
1545 -13 76 136 42 -215 -354 97 205 88 -308 -130 12 -90 305 -274 -129 -265 36 145 -277 -230 -213 -104
1567 -104 83 -247 -28 -393 -133 208 5 64 30 -226 129 92 -140 -230 -258 267 76 367 113 -74 -94 99
1589 99 196 -288 -172 -15 -90 -149 60 82 -18 50 -164 207 -46 -317 -300 226 294 97 62 -64 179 -236 232
1612 232 35 -4 -147 245 394 -6 -50 1 143 31 31 -83 -150 12 -84 -247 -29 -75 240 141 177 -80 116
1635 116 245 34 -27 28 102 -280 -45 23 -49 -12 -171 216 -169 55 -100 23 345 175 300 -33 -60 259
1657 259 -74 403 -14 -130 -11 281 -48 219 -67 80 -132 162 212 -122 -147 -312 7 204 222 -83 -113
1678 -113 -200 -4 179 161 -389 221 55 -89 -88 166 -191 141 130 -111 -93 6 268 182 243 -373 121 -70 -135
1701 -135 -74 17 -288 -10 146 124 362 -76 -236 9 114 12 -69 81 -34 15 175 -2 273 -244 234 88
1723 88 -358 -50 -18 -168 437 179 214 -185 36 -127 82 -75 -388 149 79 401 163 159 -95 2 9 37 -242
1746 -242 64 -110 -224 -245 110 -103 -156 -41 99 -54 -334 -63 -146 114 317 -226 20 -8 71 355 19 67
1768 67 14 -94 220 -171 -157 -291 -134 208 157 -174 221 156 79 -104 -174 -309 -58 140 -204 -49 95 175 42
1791 42 61 95 111 -33 -362 144 53 -12 74 -141 -117 331 96 -57 -97 21 -14 45 287 -358 -99 111 61 -1
1815 -1 -439 -37 94 96 252 -157 -297 520 351 81 -205 -112 53 -167 140 -131 -193 -261 109 46 243 -4 75
1838 75 -209 99 103 62 -244 77 253 -214 206 120 38 109 135 -251 -357 -100 113 266 100 -97 211 -116 22
1861 22 252 20 188 -25 157 123 235 119 168 130 70 177 30 148 197 138 15 -119 -85 -276 -134 209 -359
1884 -359 11 -162 -404 23 3 -213 -16 -72 148 203 103 -185 -61 -386 132 -194 -102 198 -215 58 154 60
1906 60 91 -48 70 110 -228 -34 -160 -14 99 130 -90 104 67 3 97 46 -139 210 -11 161 239 73 134
1929 134 -132 12 185 -98 50 -171 269 451 72 199 -251 -7 -116 75 30 -419 0 30 -169 -90 -102
1950 -102 -59 -20 -54 127 115 -253 196 84 -80 -35 3 -163 -61 -99 150 273 -108 379 245 88 -208 26
1972 26 143 -144 -161 157 236 -11 146 79 -14 57 37 -53 -448 -533 122 -72 -159 126 51 63 -70 244 -122 -198
1996 -198 -176 4 -30 178 65 -76 108 23 -28 -12 -98 73 -403 -110 126 -117 -111 -32 -86 -89 -104 -118 -16 129 22
2021 22 149 19 85 239 48 113 -216 -178 56 212 18 -155 -120 8 -14 163 50 121 -220 59 -237 -113
2043 -113 -44 -231 10 -56 -70 99 -267 210 -152 33 -61 28 254 323 -20 9 48 -250 -148 97 -286 -39 54
2066 54 50 227 164 -233 -255 149 -119 35 -261 -141 -23 252 8 -1 -264 -74 -81 51 45 -66 89 195 515 53
2090 53 -14 -124 -162 -94 59 26 -158 -32 129 160 348 28 -104 -27 -148 238 168 -69 -68 133 -377 -250 165
2113 165 -20 -237 79 119 -113 -138 -39 316 70 -171 248 -25 159 -170 87 15 -38 168 61 28 34 13 -9
2136 -9 -226 -42 -158 326 -214 56 212 68 163 28 34 -147 113 99 -210 84 136 325 -107 -54 -266 146 207
2159 207 4 308 -40 -47 203 131 -212 51 -50 60 76 -114 250 -197 98 -21 -77 -6 191 -55 -54 -221 -143
2182 -143 93 -99 261 -47 -133 -114 141 -80 106 2 -74 131 153 151 -67 20 -171 -79 -155 -49 -26 -33 89 -40
2206 -40 -65 -365 -28 -25 -123 -44 -7 23 -97 27 62 37 -27 -3 -212 -70 -116 168 -230 -288 -12 -215 346 -54 46
2231 46 -65 -5 111 143 -31 181 -84 -187 109 -35 -48 128 47 -99 21 -216 -129 -9 -35 -178 191 76
2253 76 399 295 241 270 84 147 136 133 156 -132 41 -63 60 -204 291 -150 63 250 -151 -71 399 -86 -9
2276 -9 -96 -6 -26 27 101 -223 -6 102 -413 -118 51 55 35 -50 144 -54 -226 -176 -30 240 -67 60 95 60 172
2301 172 108 118 202 193 -61 111 451 66 55 134 111 116 317 29 155 49 -263 61 169 185 26 -77 34 -111
2325 -111 -68 -83 -158 -116 96 163 -176 -169 210 43 339 -70 -3 -84 69 91 176 162 -100 -328 -102 -134 -77 -9 68
2350 68 229 6 -160 330 91 196 -186 53 159 209 -105 -287 -50 35 -221 -260 41 -63 95 28 -157 -200
2372 -200 -72 3 -37 173 -26 110 -76 145 -52 41 -138 -47 90 39 -14 -147 -37 141 166 -292 -58 -134 221
2395 221 290 6 -174 179 36 155 -62 -198 191 -151 -39 -160 163 -88 -285 151 -92 183 -347 79
2415 79 -146 202 31 -191 302 233 59 -170 240 -23 -104 262 -91 -7 143 3 135 117 -110 116 -166 -30
2437 -30 -114 -68 -146 -23 -48 -247 -7 60 -124 -79 148 158 69 -16 31 -47 95 -69 -188 -393 -138 -86 157 258
2461 258 100 -127 185 97 -253 104 -71 -43 137 40 -38 372 9 -121 -307 -34 -81 -337 -80 160 -201 119
2483 119 240 -125 136 -87 -158 17 -240 8 -168 -285 -21 157 460 140 -116 2 -76 261 97 -170 263
2504 263 -40 83 -145 187 -128 214 357 174 -222 -20 105 119 -166 113 228 -2 23 -214 76 161 212
2525 212 -226 166 -22 99 -40 -172 -311 163 -188 -20 -152 -263 -103 203 232 103 -209 -85 -120 -254 -33
2546 -33 76 276 -33 -178 18 81 130 169 102 -85 341 178 -116 1 1 366 124 142 -43 -196 233 -133 -31
2569 -31 355 -14 -5 42 129 340 39 -143 -134 16 -129 -84 232 -42 -2 54 -78 93 -7 23 46 47 225 -77 -10
2594 -10 110 292 45 0 -118 -66 102 237 -253 192 194 159 -101 167 139 -142 50 108 109 10 -162 13 -119 37
2618 37 -126 37 -37 -212 -224 -280 -377 60 255 54 75 146 -174 -204 51 -365 -20 -151 179 -181 150 23 -3
2641 -3 41 -6 -92 183 -126 134 17 225 -93 -115 56 7 247 155 96 142 137 -176 -63 525 -94 185 139 99 -9
2666 -9 169 -257 49 -68 260 -47 -341 -116 -253 -1 -73 3 27 42 290 135 58 62 231 -74 56 -267 434
2689 434 44 209 121 157 -218 87 181 181 -201 -381 376 -19 252 -33 -208 -156 142 -9 163 299 14 -15
2711 -15 117 184 -155 164 105 -19 86 -107 14 195 -27 -202 81 -59 129 121 205 -35 -105 98 -243 3
2733 3 13 -96 222 -60 153 -26 -175 -110 -95 326 -24 -186 116 36 157 -58 -47 10 -383 -31 -39 -76 -36 -63
2757 -63 100 -177 161 -85 20 -38 137 -200 -11 131 95 176 -67 76 202 -123 10 56 191 303 -127 -99
2779 -99 171 -20 -389 108 -52 -164 -19 35 -172 -266 -177 78 63 141 -144 -241 -162 -126 -36 -178 95 39 7 -225
2803 -225 -191 217 -237 190 19 19 259 111 17 -112 -56 -105 30 77 -198 204 -143 -39 128 -126 -188 12 -268
2826 -268 11 41 83 37 81 -26 23 -59 201 126 -241 -161 -349 -183 -94 264 178 301 78 180 -19 127 -96
2849 -96 -199 308 -178 -131 -46 19 -156 -214 69 88 -49 -190 139 -4 300 -20 234 -111 203 98 -32 -31 95
2872 95 -16 15 386 32 30 -113 233 -2 30 -196 -122 -201 346 380 49 -23 -27 140 229 214 88 192 4 26 -62
2897 -62 221 -143 70 151 28 -34 93 -130 151 -151 -202 40 -91 25 146 194 -82 -213 215 84 -132 153
2919 153 169 40 188 -238 -62 -88 99 -287 121 209 -210 2 -155 104 165 56 28 158 77 -226 284 -55
2941 -55 -121 -42 186 -202 -159 166 -112 15 0 290 -55 54 12 19 47 -139 -329 -52 259 80 321 55 223
2964 223 -153 -19 223 147 -168 -260 -17 -12 130 -102 121 -7 -66 185 -22 246 -71 121 75 32 -78 218
2986 218 439 -125 60 -17 -167 -28 -180 54 143 149 -110 -178 -147 -348 -36 99 58 161 -29 -25 -15 -238 -37
3009 -37 262 -36 -59 -23 -172 43 -141 59 29 2 57 139 196 -37 -194 -42 86 -104 163 -26 -358 93 99
3032 99 -114 -147 293 -62 4 -74 21 43 180 -2 45 43 -66 227 -33 118 17 31 1 -192 -81 90 249 -35
3056 -35 32 197 138 -89 -251 153 -44 318 -78 -167 -36 -76 205 -78 -254 -129 -33 55 52 27 101 42 -10 101
3080 101 -109 -248 -523 113 13 -131 -195 66 139 -189 120 -99 -81 15 284 98 -69 123 83 -201 -67 -48
3102 -48 277 -92 180 -90 -1 43 0 172 241 266 259 23 -174 172 -345 7 -131 -70 -177 133 159 280 115
3125 115 423 -65 242 -104 -80 7 81 -198 73 5 267 -139 -191 -32 190 -193 -91 183 -358 -33 52 286
3147 286 -135 -22 -139 -182 106 -12 -53 274 -155 245 -73 -194 108 147 130 181 142 -296 -117 125 8 -103
3169 -103 -255 -259 34 127 228 104 -35 35 -30 31 -194 -209 60 -159 115 222 254 222 48 -107 12 75 -202
3192 -202 57 62 -299 -138 168 -139 173 53 -264 -12 -208 -329 137 -43 -14 282 178 -44 -9 -11 -273 -210
3214 -210 25 -12 1 -86 161 -138 -123 -303 -128 177 -64 -69 -316 -147 241 -6 -109 -159 254 -10 257 294 41
3237 41 -2 -76 -101 -204 92 174 235 64 225 -1 77 -11 -189 114 -101 223 50 97 -179 -115 186 171 363 243
3261 243 -218 -10 1 256 54 -343 -83 30 -112 -28 -78 -272 42 174 -145 26 -235 87 177 -73 -37 143
3283 143 190 69 120 27 -12 -345 -156 -9 -134 147 4 -114 -138 142 64 177 199 124 21 -160 39 -235 0
3306 0 117 -59 215 -103 9 312 28 -90 -45 -178 64 88 31 -46 -362 -18 53 362 127 2 53 -220 297
3329 297 -210 171 -113 146 -151 -56 39 -304 -233 -132 -14 173 234 112 37 -140 31 34 -195 66 -64 -96 37
3352 37 -117 24 231 -16 -23 75 -22 -56 33 65 -101 -45 -45 205 102 84 59 -154 -117 10 81 92 -116 137 -137
3377 -137 -44 54 -386 -105 -245 -155 -131 176 122 -2 -13 140 -262 -262 -27 -50 309 38 -20 -90 26 345 25 -169
3401 -169 152 -133 -14 117 -64 171 -81 -4 -62 189 179 70 253 -166 24 -43 162 -199 -25 93 -59
3422 -59 152 9 139 -92 -64 317 -53 -105 43 -73 -156 189 -82 155 117 61 -468 -69 -269 -59 213 -108
3444 -108 17 127 235 10 153 -67 -221 15 131 12 45 -140 -122 -144 -267 -123 306 -75 -286 72 -124
3465 -124 219 56 114 -19 -286 -277 -133 -98 -17 103 18 37 439 57 -19 -38 -77 -1 -55 355 -162 76 68 -197 243
3490 243 -174 214 245 191 -32 -91 89 34 14 -222 -4 -68 1 -394 25 -95 151 231 57 157 -220 149 254
3513 254 -120 246 87 -295 67 50 -39 239 -117 -155 -280 289 222 -561 42 174 -55 -341 58 217 -179
3534 -179 -303 1 -46 10 -85 187 314 416 215 178 -336 235 48 164 -166 -225 48 106 73 -55 -167 -118 5
3557 5 58 96 196 -130 -245 24 -67 4 95 -107 -403 -9 114 -47 -194 398 361 286 131 141 -98 338 174
3580 174 -76 73 -185 -149 108 -34 -21 145 56 -288 -104 4 -1 -103 117 316 322 -11 53 338 -184 -214 7
3603 7 11 -19 -280 -1 70 270 -289 147 5 111 48 -4 -95 0 198 -41 -66 19 -667 -199 -89 200 135 82 226
3628 226 163 -7 -341 160 62 -16 -17 249 -214 121 35 300 221 52 -100 35 -54 18 137 87 -14 -110 -167 -119
3652 -119 -216 -346 -28 22 177 -98 101 -28 -187 70 165 47 -142 -18 -199 -54 -128 -191 -84 -54 0 266
3674 266 -366 -127 95 85 -165 -410 -235 120 253 -175 145 -19 -121 54 -153 -23 50 -97 -188 -160 -14
3695 -14 316 -194 45 -82 111 46 16 -158 209 16 -56 3 -42 -53 -36 39 -231 131 -208 20 71 44 558 43
3719 43 164 -39 -142 -96 168 -13 225 52 42 -121 224 -34 81 47 -138 -26 238 -217 22 -64 371 269
3741 269 -119 141 86 -72 -284 -378 -63 35 -261 108 81 276 74 175 414 11 101 70 -126 -141 89 93 -169
3764 -169 -123 114 171 -188 108 197 -61 67 65 -59 16 50 89 21 -290 148 267 -126 -326 -2 -46 -53 -61 -130 308
3789 308 121 -115 302 -173 174 211 32 15 217 29 135 67 -185 -241 -95 314 -163 -218 64 203 155 118
3811 118 -175 -396 -316 126 101 -25 19 -30 -86 127 128 87 116 -53 190 2 40 111 -9 63 7 -18 -82 -41 112
3836 112 173 -54 -97 85 -102 -43 -84 -90 -33 -192 154 307 22 -179 -56 76 28 84 161 -334 -93 309 -105
3859 -105 -215 -113 -162 86 -110 17 44 153 201 -17 34 124 185 -37 345 67 -226 60 -200 -166 -9 67 -108
3882 -108 142 -36 -137 -104 -139 -51 -83 -115 208 -110 -341 190 -55 -320 114 60 57 217 -29 -98 50 106 211
3905 211 -9 448 -49 -194 53 -87 -101 295 -5 123 215 -143 -113 -43 -92 -174 4 -183 -202 -205 177 -173 117
3928 117 -309 -134 -165 36 123 40 61 20 -187 19 56 -401 62 65 46 54 11 127 -119 84 351 -282 -152 90
3952 90 96 54 -8 53 180 164 -318 134 123 -236 -101 159 258 -57 14 -102 102 124 -66 -20 -176 42 12 -18 2
3977 2 96 24 97 -313 35 77 192 277 267 181 -120 -111 -144 -97 86 65 -154 -197 -60 448 -24 274 -3 -42 70
4002 70 -35 275 194 -75 -148 -65 -3 14 -97 82 3 16 -82 -53 306 92 -43 45 -223 -288 -80 139 -92 168
4026 168 -162 62 -81 -238 202 -90 35 19 -108 -419 -77 254 293 230 -223 -162 -44 -115 90 137 458 -109
4048 -109 115 -69 -82 48 179 -111 -19 251 -64 -197 5 318 219 -261 95 -219 -39 395 207 -66 -119
4069 -119 -54 53 92 -181 220 -349 204 177 -173 -5 218 12 27 -265 -188 -72 -37 17 -126 224 113 -72
4091 -72 -104 33 -337 -4 -11 -164 57 -108 -25 -228 64 -136 206 -38 71 160 -24 -4 -58 119 -4 92 -88
4114 -88 135 210 72 -191 -7 -226 -140 11 195 142 131 116 -75 -408 73 -48 -330 -21 286 -183 -100 -2 28
4137 28 64 25 202 -23 -30 81 223 202 -70 -2 77 35 107 41 306 119 -7 -128 397 44 170 411 140 108
4161 108 -215 -38 -204 207 98 205 8 -33 340 -12 63 -212 358 -174 7 -175 -8 -297 105 -227 -162
4182 -162 287 219 -375 -245 -96 120 264 -13 -1 91 -171 -89 -44 58 327 -131 25 14 -114 -27 5 19 -76
4205 -76 143 -94 -216 -80 20 372 -202 272 -169 133 -17 35 51 -96 -49 -224 175 38 320 -126 106
4226 106 -73 33 87 48 1 30 196 368 105 128 181 -427 177 128 140 180 155 118 105 -142 123 114 -24 -232 -213
4251 -213 35 -24 -82 -51 226 31 134 -24 -40 -91 171 -70 -307 87 -43 72 79 -54 -129 -137 -43 -79 -135 -36 -42
4276 -42 -278 -50 74 83 263 18 -251 93 3 464 -133 173 140 -70 -128 -164 -298 -140 -40 -131 -29 72 84
4299 84 191 -39 -174 124 -88 -30 174 366 -314 -232 15 -145 -47 74 222 48 117 238 -96 143 -180 101
4321 101 252 117 -230 82 72 -212 8 -164 48 64 172 0 113 99 -17 -140 123 55 13 -161 153 66
4343 66 -259 98 224 -151 -284 71 104 198 -91 229 189 -135 -143 -89 55 1 71 -261 -94 255 -235 -12 -20 21
4367 21 -77 134 -155 2 52 20 -328 -83 204 -157 -125 297 99 122 -73 42 186 -9 76 364 -87 351
4389 351 -409 72 -146 -260 100 59 537 -84 -307 -141 137 -202 23 -104 251 -65 -23 118 82 137 -156
4410 -156 122 -20 144 61 250 56 -181 -110 70 46 76 -40 -59 -102 -173 128 9 -63 -379 -122 80 -11 -92
4433 -92 100 -2 198 92 138 62 -327 147 235 67 79 282 56 25 69 45 27 44 -27 -253 -202 -48 -5 136
4457 136 92 -54 11 48 -106 -103 172 -178 237 -142 -428 -226 181 -94 219 -32 -93 176 361 282 -177 200
4479 200 -105 15 -485 -254 110 53 -278 33 180 -70 -182 233 -147 -116 46 -190 182 125 2 175 35
4500 35 -117 -140 95 -307 -86 77 78 380 -5 136 52 -109 -155 -251 -54 -168 -85 63 90 145 6 -58 112 82
4524 82 -384 390 161 127 24 116 9 110 161 -169 4 -86 75 -54 -53 169 75 181 123 422 89 -271 80
4547 80 79 22 200 -117 -53 82 53 -223 345 -219 -106 -187 296 95 13 -167 -189 -196 282 -2 -42 7 38 95 200
4572 200 32 109 -118 -18 55 57 -101 79 43 -35 265 263 31 225 32 -40 41 -37 166 -218 393 -224 166 75
4596 75 34 -218 255 191 27 204 -118 -36 75 134 136 220 167 -97 184 81 259 -105 15 72 -56 11 -207 -140
4620 -140 133 84 54 -13 31 -124 -478 62 129 -188 -230 -257 -335 40 84 95 242 -110 -2 67 28 -4 -10 -13 -17 -24 132
4647 132 39 -137 0 -159 -33 50 -53 44 -27 -205 -288 348 91 -104 29 -123 87 212 151 105 -281 -271 -63
4670 -63 -100 -79 -35 -31 -224 -140 -128 -81 85 40 46 136 -98 -154 199 -152 -6 93 107 -87 177 68 139 79 52 130 -379
4697 -379 -59 250 -274 -204 -117 83 173 89 -31 131 135 9 -254 179 -9 -37 -41 -344 -132 -4 161 80 -102
4720 -102 97 -338 -68 -119 -200 125 -223 239 87 -47 187 -197 164 0 -40 -175 19 81 172 -176 -187 55
4742 55 -199 30 -69 -127 10 63 80 11 167 -7 294 -71 108 227 -122 -120 40 17 175 -177 33 247 -22
4765 -22 -23 104 242 208 -113 389 13 -118 -115 18 -204 162 158 119 -63 195 147 202 134 -44 -167 -104 -266 81
4789 81 86 -195 -26 41 -20 -3 161 -41 47 -32 -56 -53 175 -17 -156 133 18 -62 294 112 545 -209 55 177
4813 177 -340 -146 64 39 215 32 144 -151 -44 -161 -77 -19 312 -36 144 -16 287 109 -88 -188 132
4834 132 76 24 182 79 134 20 176 -149 146 148 47 -53 266 227 111 163 -129 -85 56 14 -33 222 143 99
4858 99 -205 -166 28 114 -266 74 -97 -120 -210 -26 -100 174 188 75 10 -13 -162 -129 30 -304 -17 43 -128 -12
4882 -12 -45 -296 -218 73 28 -1 91 -243 225 -27 47 214 189 253 -98 -70 -282 46 -53 115 131 -80 -87 -217 -147
4907 -147 -17 -131 -448 54 -145 194 16 -146 -13 45 -125 -63 -141 -117 325 86 110 -143 -248 111 14 1
4929 1 -112 -71 407 11 59 -251 -129 -92 -157 151 -146 205 -145 -28 225 177 127 -21 -65 -121 -46 235 -49 59
4953 59 0 125 -291 -282 -31 -84 37 274 -328 12 -71 180 0 79 165 -87 -98 189 120 -413 -67 346 17
4976 17 34 50 80 243 124 -153 120 39 32 -1 98 -123 -139 -115 -116 -190 -140 -23 -210 213 100 102 -167 207 -137 -125
5002 -125 92 -211 -244 61 18 108 -304 48 -30 84 97 9 -222 286 102 129 142 -143 -50 101 -299 16 -165
5025 -165 -224 -64 -139 85 -6 126 56 -14 217 -7 -48 202 -13 -78 132 201 20 -86 136 -93 -238 46 -249
5048 -249 87 -3 105 330 143 225 -67 14 198 211 108 -171 -152 11 247 66 -126 -124 -132 -125 1 388 -23 -249
5072 -249 124 210 -148 -166 -120 76 -389 99 53 112 -79 -44 25 -317 66 -256 62 -27 -39 -26 97 134 -151 -48
5096 -48 132 -32 -82 -321 -78 -444 281 304 -200 -121 67 129 -233 -123 -95 -172 41 -127 -187 226 -74 194 32
5119 32 -278 -23 221 -96 -141 127 -46 -180 -260 -308 -60 -75 -42 -133 72 85 -65 85 65 46 -121 -275 -4
5142 -4 -26 -49 54 -60 -77 -151 -19 191 -88 232 67 106 -194 198 -78 33 -34 68 546 186 90 284 71
5165 71 -153 131 108 -177 36 534 28 13 -19 100 106 97 -64 91 -212 29 82 64 -127 -25 -230 357 37
5188 37 130 -22 92 -248 100 182 -307 170 -276 302 -274 -284 -5 221 -206 -172 -349 201 32 275 58 -79
5210 -79 -231 148 -159 72 117 -75 -112 -63 -89 -101 -72 -139 46 -309 -91 -198 55 -108 -205 -188 -370 122 -103
5233 -103 -233 -9 -303 -44 76 13 119 4 -31 -329 -230 165 -122 120 -14 -62 -43 128 -372 21 77 -169
5255 -169 56 -61 -65 -206 -189 226 -24 -105 -189 56 -80 -204 50 78 38 315 -139 -54 155 12 165 -336 -24
5278 -24 -180 -142 -238 109 359 2 317 114 61 174 73 81 -172 261 138 5 74 36 30 34 -53 54 97 -64 17
5303 17 -124 147 -52 -136 107 -205 -3 -88 -11 127 -145 -122 -72 -95 -2 -130 -253 12 -206 -6 359 -158 122
5326 122 -126 -60 164 47 -79 119 305 147 -63 -180 -100 31 227 -28 -10 293 -247 -333 44 88 -190 157
5348 157 -113 -123 82 37 110 243 -145 -188 -125 244 -143 186 27 316 -6 -219 -127 -30 26 -237 46 -174 284
5371 284 -126 -70 -79 -257 -71 -100 -80 126 -14 -1 92 5 -3 264 -295 139 -354 -96 100 34 100 179 -193 273
5395 273 173 102 -58 -90 120 -75 54 -106 -284 -108 64 -159 310 -263 -267 33 -242 -133 -253 101 -116
5416 -116 -197 427 176 140 -64 -26 -84 -129 257 26 126 11 -177 230 -118 -125 -80 142 -152 88 62 -276 59
5439 59 -85 97 -12 223 -3 -17 237 121 -91 53 -34 67 98 271 -84 138 -204 -36 128 -140 118
5460 118 428 -78 98 65 -185 127 191 -192 22 228 -74 -220 9 -51 -101 106 -363 -59 9 -267 -248 5
5482 5 -105 66 2 80 -83 17 -84 128 2 -243 -33 -48 -345 -2 80 -147 -6 -205 112 154 58 -370 -20
5505 -20 142 169 -106 86 -193 57 105 -184 41 20 141 -136 -47 -60 26 183 103 22 41 21 138 80 -80 0
5529 0 -11 -154 -50 -295 85 -168 -190 -117 -101 -11 17 92 215 45 -37 -6 125 132 -92 109 127 285 -75 220 -29
5554 -29 -285 -30 -27 -86 211 118 -34 280 156 46 -65 239 -14 -117 216 -1 -106 138 -227 15 219 -178
5576 -178 51 54 14 62 121 -131 130 102 87 -96 157 -61 -61 -13 -46 40 -126 -192 23 115 77 11 201 106 -15 114
5602 114 104 -109 -150 -263 76 -85 -157 -95 134 76 198 -16 -196 -303 253 135 -96 -79 -10 -56 87 193 -226
5625 -226 -173 -106 -228 4 -57 22 135 28 -35 -209 97 -4 129 150 391 -45 -375 155 103 0 67 -13 314
5648 314 216 -41 64 -5 -111 133 86 -79 29 -288 -33 -93 227 -12 -28 -232 -101 57 289 15 -8 -9 -277
5671 -277 -107 -137 -494 297 69 -173 -5 318 44 164 182 -220 123 56 74 -34 -194 127 -32 -190 116
5692 116 68 46 -136 -81 -204 -338 38 -161 -2 -242 7 17 -116 -82 11 52 -227 -52 -100 132 116 285 -132
5715 -132 -74 254 -351 -1 -274 163 -337 -4 -364 -63 -104 266 40 -282 -43 -111 256 -5 -196 284 235
5736 235 147 339 -71 104 24 -32 -62 -42 86 -194 -124 28 -107 -135 -33 366 -41 -100 -182 -4 -36 64 -64
5759 -64 -327 -93 156 46 -52 116 -58 -211 -1 -21 -221 -100 -70 190 113 -122 -48 -161 -33 -204 73 -156
5781 -156 -253 -116 66 -201 33 -166 192 -17 94 275 -167 -179 64 22 -131 -85 360 51 -58 -46 89 -40
5803 -40 -8 198 55 96 -88 288 -36 101 42 -370 -330 -29 -42 -122 -111 -326 -187 -89 96 -47 -162 162 157 -8
5827 -8 118 -74 -163 59 105 183 151 -158 -127 159 176 -150 104 245 -81 73 -55 -230 -269 83 -8 156 -60
5850 -60 294 -23 34 93 -75 143 -141 170 -101 201 -83 -98 68 -68 233 49 122 -183 -304 71 -269 -117
5872 -117 69 78 314 -43 117 -156 -17 -223 -11 -65 227 -208 -29 -121 -11 214 78 64 113 273 -277 146
5894 146 -29 -98 14 192 113 86 50 150 68 -27 140 142 86 -186 165 -262 259 178 -182 26 -38 275 57 88
5918 88 95 -159 -98 197 159 -50 353 112 -36 35 268 -2 125 169 11 78 -12 -118 43 -143 73 59 370
5941 370 149 193 38 -105 -45 251 280 179 59 -173 -45 173 220 -146 -88 266 -52 186 -88 72 130 137 -39
5964 -39 189 -202 -263 95 73 -32 -12 285 44 142 -437 -17 141 119 54 -59 -157 18 120 -93 85 -208 -20
5987 -20 -134 94 73 -165 143 -309 25 -133 -33 -105 -179 -25 227 -143 -59 212 -69 386 -140 25 31 161
6009 161 25 74 -288 -42 166 22 51 -113 53 -378 40 -272 309 182 13 343 -79 -139 59 60 51 -36 -203
6032 -203 -59 -132 17 -76 102 98 27 4 380 27 14 -20 206 -236 125 323 -104 -80 82 149 -117 -126 117 -86
6056 -86 -135 323 28 -117 -49 -311 -94 176 491 -64 75 -58 107 -323 298 -132 55 -27 68 279 203 119
6078 119 -28 -176 -303 211 -83 -20 246 23 -81 -120 184 276 91 186 -314 51 214 -169 -40 43 -34 296
6100 296 -108 -92 31 -71 -169 -140 -9 -163 -123 188 200 170 -203 111 -88 299 8 -322 54 23 -133 260
6122 260 -48 121 13 120 54 127 85 127 133 17 188 -131 -238 -108 122 -85 -150 90 -308 -32 78 -195
6144 -195 316 66 -315 -184 -185 251 89 -23 -131 79 220 45 46 -6 55 -25 73 -219 -9 -101 -78 216 -168
6167 -168 53 -71 -176 37 -175 27 -43 -234 -498 -26 -53 -112 -3 -170 -255 160 50 43 -199 -113 -92 -49 282
6190 282 -48 -51 292 -174 -242 -183 -70 -68 -38 -15 -17 -29 -68 55 158 177 -197 45 -166 -155 143 119 29 -222 -25
6215 -25 23 -80 -129 266 -106 -171 156 110 -155 -16 54 74 -119 -98 123 38 44 65 53 -23 126 -40 -262 -80 -272
6240 -272 -95 64 65 -399 110 -110 -157 -43 330 -116 -7 -316 -79 -92 303 320 53 -57 12 -149 13 -50
6262 -50 150 -66 -45 212 26 -95 101 43 -396 -212 -232 -33 -72 31 177 214 65 72 48 -69 204 -72 16
6285 16 263 55 -129 -158 -77 19 121 37 213 -159 243 23 -42 274 48 -45 144 78 -294 -90 112 92 137
6308 137 -44 60 44 206 105 15 -214 -100 207 -123 -108 307 -1 211 -45 156 -228 55 93 259 253 25
6330 25 153 -67 125 4 -7 -85 309 46 280 114 46 169 99 -75 170 -63 25 -120 106 -31 -24 -33 360
6353 360 125 38 -9 -110 -78 58 81 19 -86 -14 281 156 39 -38 85 210 -68 202 260 146 -163 231 70
6376 70 -182 -133 -2 -145 183 98 46 103 -147 -47 -43 72 -9 62 -10 -372 -50 -37 26 -231 -72 -86 -174 -3 -73
6401 -73 -62 -14 38 -57 -127 -71 -69 76 -4 -110 -136 39 201 61 -92 -120 -118 181 80 -177 116 -127 -144 -33 90
6426 90 -301 287 213 10 38 -73 -489 90 -36 126 -38 124 107 78 130 -181 289 -259 -188 -87 252 214 -25
6449 -25 126 -314 75 74 174 173 -35 35 -23 87 -67 -174 20 20 98 -130 87 214 -301 -66 -23 130 -217 -117
6473 -117 -156 -169 -58 21 -237 177 26 -108 -163 39 156 -33 -62 -72 -115 134 -9 -165 -169 8 -161 -159 -62 247
6497 247 11 73 78 26 297 66 -193 -77 250 -115 -43 -209 -412 15 18 239 -1 -201 -223 -388 -149 -179 -83
6520 -83 -52 -176 136 229 328 -19 154 298 -18 185 33 110 42 -128 223 46 -230 59 -6 71 -96 -53 -10
6543 -10 81 248 -96 -8 -307 121 284 -63 -262 -31 118 112 -202 -40 -80 81 92 47 -9 -24 158 201 56 70
6567 70 331 143 -322 155 37 -100 -187 -41 126 32 267 74 232 -90 -168 90 13 -140 -23 72 -96 -84
6589 -84 45 107 -143 194 263 24 -157 73 -261 -188 -274 67 237 282 -5 139 68 49 -130 37 -203 8 296
6612 296 -34 256 -140 86 1 -199 -24 202 -21 -111 127 -36 115 92 130 320 138 94 85 -215 49 241
6634 241 9 220 -92 -216 172 204 -102 54 -95 212 -123 91 28 -80 153 53 320 -21 348 -296 145
6655 145 -39 -401 -237 258 351 -282 -31 137 12 -251 -74 -180 63 132 -115 -219 -204 96 164 -299 82
6676 82 -19 193 -233 135 -281 218 139 -28 -208 428 202 -75 -63 -207 145 -44 259 -89 -78 -184 36
6697 36 182 -49 -140 -239 119 -208 -123 282 -51 -103 -40 116 -48 -143 -157 -41 46 -52 -101 85 -79 -197 -143 58
6721 58 88 -20 -105 -248 139 -71 -85 -9 -131 -18 55 -174 -284 86 38 -201 360 -125 -140 -149 45 -253 50
6744 50 -31 -144 61 -158 56 305 45 -186 -130 -26 -292 82 52 -366 41 128 -82 -185 103 -36 5 331
6766 331 -189 -17 6 281 128 25 -49 -183 -62 -166 -101 -231 76 312 -122 -78 77 -85 -98 -37 135 193
6788 193 -387 -91 -329 -173 -37 -278 -131 -154 -205 -176 249 92 41 55 16 231 175 52 70 9 -79 77 -160
6811 -160 -8 -26 -18 0 -278 307 -500 -87 -57 337 -13 -91 12 -191 -189 -85 72 -94 371 178 -192 195 50
6834 50 180 224 6 161 -243 -412 35 -5 -80 145 -42 -70 -21 -128 -247 30 92 -187 36 199 -154 -6
6856 -6 34 -56 187 -37 235 -267 -111 42 -199 -17 -141 -93 299 -33 85 222 200 224 112 32 89 -10 137
6879 137 132 106 -239 0 -7 -86 205 -294 87 41 106 -259 118 -117 -49 -8 -93 -59 -69 272 -82 198 100 4 330
6904 330 122 -74 -32 80 -7 48 -232 -45 133 142 69 -556 88 180 -184 39 -128 -134 -193 -164 149 -321 50 38
6928 38 155 89 1 172 85 37 -310 194 142 89 268 128 238 242 106 126 29 -55 -54 -72 70 103 -9 184 -295
6953 -295 -106 2 -347 -354 -104 -110 68 374 31 -230 282 -107 126 29 218 107 1 424 -45 259 84 138
6975 138 -49 -8 -242 -18 -48 -8 126 -310 509 -100 -89 -287 -66 78 268 142 5 -38 -115 30 -80 -148
6997 -148 -101 -80 60 -43 119 -191 -271 232 -197 4 386 -58 -100 26 23 -292 22 86 134 -160 -214 128 207
7020 207 76 81 -177 -99 126 -177 -45 117 -41 -102 117 18 45 -28 145 217 -31 230 -50 60 139 -340 221
7043 221 -56 -6 18 -13 -86 166 355 -135 288 -8 61 -312 -159 167 244 -348 -2 -166 156 -15 -77 -151 -132
7066 -132 270 -99 -17 61 360 156 84 3 -33 -132 -45 79 338 -146 -298 30 -256 130 -34 79 -97 -23 -79
7089 -79 -199 167 76 172 5 -236 184 -268 -62 159 94 167 -323 -150 155 -70 -150 -96 267 -174 134 109 -194
7112 -194 -245 -290 -310 -73 80 -124 424 -319 154 29 -65 47 1 175 -296 -105 -151 214 182 44 -64 119
7134 119 61 -205 306 249 -148 -33 -164 123 10 292 141 98 169 -180 176 -83 -106 -92 -180 -145 -69 453 106
7157 106 96 85 319 -85 106 -393 -392 -201 -59 139 -192 -372 -47 -209 -121 407 -207 109 -273 -75 -346 173
7179 173 23 -161 -227 -145 171 -288 -117 94 56 -237 -242 -116 184 196 -125 -39 274 -103 382 -17 -44 -32 59
7202 59 -114 -221 204 -16 -206 42 39 2 132 261 -65 239 34 -167 -43 -280 43 -2 -41 -52 -195 100
7224 100 -77 45 -415 41 -64 -177 35 -76 -11 5 157 -183 -89 116 -347 -11 -20 -182 124 -9 -148 -90
7246 -90 20 65 -102 164 -166 -44 -111 -31 -146 -76 343 48 -62 -47 -51 -23 130 106 184 191 183 -213 -252 134 37 -216
7272 -216 212 -365 -83 -186 306 91 233 -101 181 139 157 370 46 319 249 0 156 110 -32 -129 -223 449
7294 449 -3 -111 51 -210 -173 192 -340 18 -330 0 157 -260 61 -41 204 -156 -9 245 6 -120
7314 -120 -125 -23 -76 -45 180 151 -69 -128 -150 -30 64 99 -256 -102 -138 -33 5 -108 -126 -107 73 -109 26 -474
7338 -474 136 -164 140 64 -208 -103 -207 -175 -161 33 -195 97 -143 37 160 -220 213 38 358 50 8
7359 8 268 -4 33 -107 20 321 18 236 -3 178 140 -202 -5 122 -170 -227 -61 205 382 9 66 89
7381 89 -52 -95 31 -151 -39 18 -85 160 366 -52 101 -194 -273 112 -156 -6 163 56 -117 116 -250
7402 -250 84 39 -109 216 -180 5 31 -120 239 -64 -15 3 -133 -86 -148 -48 497 241 -14 90 225 280
7424 280 -197 -32 31 299 178 57 82 -51 -69 301 -17 -3 -63 -199 -135 81 -202 61 13 -7 62 -68 219
7447 219 -198 126 51 60 -189 250 -208 -115 -67 -305 -153 138 249 -24 119 51 -106 -80 -81 81 202 -320 -24
7470 -24 143 154 -82 110 -310 324 152 153 20 -324 -157 0 262 -179 -121 253 -123 153 95 178 -53 33 103
7493 103 -4 -180 -105 169 -11 151 -267 43 -331 -346 63 204 60 -56 -199 -115 40 239 -18 -19 200 -118
7515 -118 297 -36 25 101 188 139 -51 131 206 258 23 26 15 283 39 89 -74 173 -22 105 115 227 57 134
7539 134 -171 230 82 -99 29 191 104 -68 -25 16 -2 59 302 35 -48 -290 -100 -39 -54 127 20 71 191
7562 191 135 -99 202 75 -33 -33 135 223 111 -145 380 -206 -94 280 144 -152 -23 133 -42 -123 71 -132
7584 -132 131 -45 131 -402 91 172 0 6 -136 -48 -150 -35 30 267 -108 -435 -32 -237 -124 142 -45 111
7606 111 3 -234 117 360 213 34 53 -246 -135 -189 -142 -308 -185 -152 -150 -25 24 -372 182 -50 178 340
7628 340 224 -137 -121 -35 113 -321 -143 325 -180 -26 -217 387 105 -197 177 -119 229 -151 -26 154 85
7649 85 223 -117 184 -114 77 149 152 143 196 -308 26 -63 -39 35 2 89 48 -21 -93 59 -295 95 -96 177 50
7674 50 18 -36 129 249 -54 312 45 -339 -8 -182 164 86 2 -67 253 -104 -187 -142 -269 -18 -93 -59 -19 -222
7698 -222 17 53 217 21 133 5 41 -76 -37 188 -225 224 -120 -78 53 -6 161 -227 -23 -130 42 -49
7720 -49 373 -219 -72 -108 -174 159 -318 -143 -226 -198 88 -150 -48 5 -20 -33 1 211 115 8 -64 -81 183 91
7744 91 159 -36 -49 -19 -288 -62 65 -103 138 -10 -105 225 -84 208 49 108 136 212 44 -247 77 134 26
7767 26 -98 -203 -122 272 -6 -71 8 287 -58 -68 -142 4 120 -7 43 7 109 -139 46 128 -193 -148 -112 24
7791 24 -120 120 -83 61 -61 -65 119 60 -299 -152 -16 41 11 164 -135 171 -191 -61 18 -59 188 -89 224
7814 224 -27 8 29 -155 296 -349 89 64 -327 145 103 -110 -8 -160 -185 -275 -132 -530 -148 175 -180 204
7836 204 87 119 -16 38 -57 -170 -239 419 -35 76 -4 111 37 -113 41 -28 266 113 -159 -35 -242 -241 -31
7859 -31 93 -143 -87 68 -294 215 -42 155 232 -21 -75 -98 15 50 36 -122 -195 -75 195 62 -53 -175 81
7882 81 -54 -14 -38 -195 -20 -385 18 44 -177 40 -210 -44 85 -402 -72 84 136 -16 -114 -99 -49 12 -317
7905 -317 74 264 151 48 -57 50 -58 -115 47 -104 -189 -341 -24 50 -143 303 -211 299 55 61 193 -129
7927 -129 -23 -42 158 -78 51 131 193 -145 33 -226 -7 -183 -96 100 145 120 -39 196 195 13 -141 -311 223
7950 223 140 -35 110 -77 146 -227 205 -87 -179 -120 273 358 -236 -185 -10 -130 -180 67 -168 -76 67 72 -25
7973 -25 -114 -46 -262 14 9 -19 -80 -122 -80 18 -54 229 -76 -47 -89 -120 108 -100 -31 96 137 -18 147 -184 -6
7998 -6 34 -26 -219 -42 85 36 -99 191 -108 37 -321 48 12 -58 -143 -203 46 -89 200 -68 140 -96 -133
8021 -133 62 -188 -201 -336 -110 207 164 133 27 -155 -244 -211 -29 -255 133 -239 169 -63 3 132 -114 -12
8043 -12 -113 102 -70 -287 106 167 -263 14 -96 176 -179 124 160 171 14 227 -191 217 -253 -247 100 19
8065 19 -20 35 -189 88 147 -221 224 70 156 -28 -82 -48 201 226 180 -189 -93 -95 -47 312 260 -253 -77 -106 121
8090 121 97 291 -63 -90 3 -47 104 51 -31 -138 96 -517 59 226 -153 -122 -155 139 45 60 286 68 -122
8113 -122 -9 150 -452 23 -157 -24 62 -52 -8 135 41 -3 -121 -277 -9 -240 -255 10 147 154 28 34 131
8136 131 -49 -291 -113 2 38 41 -119 -53 43 -17 -423 -51 47 -115 93 -99 -69 71 158 211 -241 255 -281
8159 -281 127 261 97 -101 124 156 371 -85 254 -167 190 127 8 -220 242 57 -142 18 117 107 -268
8180 -268 -110 -431 -2 66 -287 -266 -196 -137 107 -46 320
8191C20
$$ Imaginary data points
##PAGE= N=2
##DATA TABLE= (X++(I..I)), XYDATA
0 0 0 0 0 0 8 0 8 -8 8 -16 16 -24 24 -32 40 -48 56 -72 80 -96 112 -129 152 -176 201 -231 263 -300 339
29 339 -384 432 -486 544 -608 679 -759 842 -934 1036 -1150 1273 -1408 1560 -1727 1912
45 1912 -2124 2360 -2628 2938 -3298 3722 -4237 4864 -5658 6700 -8133 10228 -13602 19939
59 19939 -35950 161675 213633 -190416 -173296 -36608 102623 191635 65150 -242655 -174603
70 -174603 145172 203299 1098 -117076 -144158 -31860 175121 159890 -120953 -206326 -11336
81 -11336 137043 117652 6235 -152663 -137475 93118 192512 26156 -127056 -120924 3761
92 3761 149100 122387 -83237 -164048 -23743 115628 116062 -4776 -143070 -105813 85958
103 85958 147869 8448 -112552 -101329 6090 126528 98777 -84051 -149548 -4526 112238
114 112238 84646 -7391 -105966 -97187 69084 149775 11110 -109488 -72662 13245 90907
125 90907 90829 -52531 -141080 -16706 110781 72044 -23946 -87586 -78965 44831 131860 21490
137 21490 -114935 -79132 31175 86850 66758 -41796 -123969 -26153 112892 81369 -36045
148 -36045 -83265 -53791 41456 113825 27006 -105885 -76996 41138 82634 42616 -42450 -101503
160 -101503 -24590 98981 73904 -45378 -83584 -34364 42431 89031 22154 -92160 -74485
171 -74485 44298 83761 26863 -42517 -77263 -20863 84714 73814 -41849 -81282 -19643
182 -19643 44107 68114 17492 -75768 -69474 39602 80052 15655 -47694 -61590 -13772 68074
194 68074 64253 -36990 -79699 -14691 49110 54471 8878 -60448 -59624 32647 77591 14344 -49168
207 -49168 -48122 -4324 53638 55889 -27435 -73830 -13063 50178 43873 385 -48770 -51129 23317
220 23317 70289 13645 -51013 -42883 2630 44679 44879 -20386 -66375 -15510 50406 42153 -6273
233 -6273 -42205 -38511 18180 61598 17075 -48663 -40520 10102 40137 32984 -16380 -56239 -17122
246 -17122 47244 38830 -12804 -39305 -28150 15134 51160 16765 -45105 -38786 13858 38768
258 38768 24083 -15208 -45856 -16617 41742 39132 -14124 -38152 -19279 15594 40459 16119
270 16119 -38139 -38470 14429 38169 15765 -17308 -36112 -14799 34538 36860 -13517 -38264 -14330
283 -14330 18182 33044 12771 -31045 -35327 11557 38280 13655 -18277 -30012 -10837 28305
295 28305 33273 -10493 -37185 -12629 19082 26861 8358 -25968 -31439 9693 36319 11218 -20885
308 -20885 -25193 -6527 23833 29420 -8620 -35574 -11442 21510 23817 4236 -21126 -26709 6020
321 6020 33770 12083 -22273 -22615 -1306 19808 23214 -5717 -31892 -12218 22173 22283 -1070
334 -1070 -19549 -20399 4680 29434 12923 -21644 -23089 2326 19702 18088 -4608 -26741 -12745
347 -12745 19866 22540 -2297 -19196 -15751 5039 24119 11733 -19560 -21910 2865 19136 13515
360 13515 -5852 -23050 -11720 18250 21440 -3750 -19329 -12121 5785 20587 11535 -16773 -21500
373 -21500 3847 19037 10686 -6170 -18142 -10559 15004 20933 -3724 -19923 -9790 7080 16533
386 16533 8962 -14096 -20223 3105 20241 9398 -8723 -15875 -7551 12647 19241 -1726 -19616
399 -19616 -9190 9668 15175 6092 -11683 -17371 1588 19084 9320 -9670 -14595 -4984 10986
412 10986 16430 -1405 -18417 -9373 9997 13789 3573 -10783 -15239 1149 17685 9137 -9911
425 -9911 -13587 -2708 10167 13702 -543 -16634 -9022 10309 13274 1502 -9599 -12438 302
438 302 15491 9117 -9946 -13539 -884 9815 10671 -510 -14769 -9178 9658 13419 461 -9907
452 -9907 -9377 711 13211 9439 -8703 -13667 -71 10249 8617 -1087 -11671 -8789 8062 13087
466 13087 -137 -10615 -7931 1876 10787 7938 -7244 -13214 -535 10715 7320 -2551 -9612 -7249
480 -7249 6436 12872 526 -11018 -7089 3168 9222 6487 -5819 -12030 -795 10699 6959
493 6959 -3653 -8721 -5747 5174 11617 1054 -10659 -6797 3977 8252 4880 -4840 -10765 -1532
507 -1532 10681 6816 -4048 -8102 -4295 4657 9972 1807 -9795 -6895 4622 8157 3071 -4427
521 -4427 -9098 -1947 9287 6937 -4879 -8413 -2809 4748 8121 1803 -8614 -7244 4388 8200
535 8200 2008 -4791 -7549 -1364 8114 6815 -4152 -7952 -1749 4905 6525 1359 -7405 -6780 4460
550 4460 8123 1561 -5078 -5927 -897 6503 6475 -4024 -8289 -1260 5416 5385 369 -6246 -6030 3392
566 3392 7925 1277 -5371 -5059 -36 5899 5499 -3127 -7903 -1127 5889 4590 -604 -5203 -4821 2775
582 2775 7733 1304 -5791 -4368 849 4653 4404 -2428 -7686 -1416 5890 4573 -1372 -4386 -3576 2317
598 2317 6688 1689 -5714 -4629 1733 4579 3346 -1843 -6451 -1457 5839 4435 -2004 -4310 -2711
613 -2711 2064 5739 1729 -5841 -4341 2412 4347 2195 -2364 -5362 -1441 5145 4087 -2174 -4619
628 -4619 -2054 2341 4457 1462 -4674 -4266 2537 4878 1319 -2291 -4018 -1417 4389 4135 -2068 -4819
644 -4819 -936 2411 3520 628 -3786 -4421 2132 4711 814 -2812 -3060 -867 3576 3506 -2071 -4534
660 -4534 -777 2883 3251 706 -3672 -3486 1775 4464 670 -3106 -3009 -221 3178 3354 -1684 -4467
676 -4467 -673 3185 2960 -100 -2976 -3264 1590 4405 582 -3058 -2431 251 2813 2740 -1718 -3944
692 -3944 -903 3512 2321 -759 -2859 -2387 1393 3910 960 -3414 -2184 1099 2538 2242 -1448 -3576
708 -3576 -812 3276 2429 -1012 -2616 -1641 1540 3324 578 -3488 -2423 1467 2914 1156 -1447 -2868
724 -2868 -907 3323 2047 -1967 -2525 -667 1360 2506 725 -2557 -2070 1478 2827 656 -1508 -2674
740 -2674 -567 2761 2102 -1654 -2491 -504 1552 2036 443 -2720 -2122 1789 2627 190 -1659 -1943 -431
757 -431 2741 1985 -1525 -2555 -415 2234 1735 -82 -2428 -1772 1776 2840 -142 -2145 -1390 110
773 110 2218 1682 -1388 -2552 5 2031 1423 -260 -1614 -1869 1336 2615 136 -1958 -1805 724
789 724 2008 1439 -1375 -2513 -211 2320 1743 -638 -1778 -1151 915 2359 441 -2366 -1300 712
805 712 1882 1130 -1421 -2261 -492 2463 1615 -1144 -1865 -797 1107 2385 420 -2385 -1477 1266 1870
822 1870 814 -924 -1813 -109 2214 1214 -1321 -1892 -695 1237 2008 -81 -2184 -1501 1353 1781
838 1781 256 -1116 -1848 -170 2076 1064 -1255 -1707 -518 927 1088 227 -2051 -1137 1091 1681 220
855 220 -1278 -1379 161 1836 875 -1384 -1999 -31 1111 1204 -269 -1471 -1201 1147 1911 110 -1354
872 -1354 -1033 321 1661 1130 -1489 -1798 48 1415 646 -367 -1537 -1115 909 2273 59 -1275
888 -1275 -1236 400 1350 997 -956 -1997 -11 1733 1247 -611 -1329 -498 835 1514 -89 -1579 -869
905 -869 658 1335 590 -577 -1412 2 1687 576 -697 -991 -762 914 1326 129 -1755 -395 850
922 850 1212 445 -789 -1143 187 1527 887 -941 -1238 -338 808 1390 88 -1587 -1021 1150 1233 174
940 174 -660 -1089 110 1407 915 -772 -1459 -138 624 1267 -96 -1253 -926 734 1364 -23 -608 -1122
958 -1122 -57 948 874 -853 -998 217 881 838 172 -1153 -491 1072 1604 17 -864 -432 19 982
976 982 990 -783 -1121 88 938 705 -354 -1063 -586 752 1086 42 -1105 -792 5 649 559 -631 -827
995 -827 -332 909 706 -232 -933 -471 576 1178 236 -1084 -716 291 676 445 -579 -1184 142 887
1013 887 689 -355 -850 -293 568 717 86 -1023 -576 445 826 497 -361 -1013 16 1181 664 -551
1031 -551 -883 -309 387 875 267 -1265 -587 660 1111 253 -495 -872 191 798 693 -612 -1141 -212 580
1050 580 709 -10 -674 -401 522 806 459 -644 -829 31 608 531 -297 -694 -263 747 679 64 -518 -570
1070 -570 538 652 185 -665 -170 31 616 588 -263 -576 -28 839 655 -108 -365 -632 445 847 4 -855
1090 -855 -433 98 764 324 -435 -841 -137 861 503 -124 -468 -141 145 822 -137 -806 -727 498 570 400
1110 400 -233 -995 -94 825 146 -238 -630 -264 116 606 123 -546 -135 371 1003 283 -373 -407 -226 483
1130 483 557 -264 -576 -368 493 459 329 -672 -413 244 707 364 -219 -596 -197 644 514 -570 -785 -91
1150 -91 634 662 68 -708 -355 479 884 434 -650 -681 -46 413 570 -120 -685 -120 464 410 -118 -616 -264
1171 -264 146 676 156 -327 -391 40 537 304 -441 -622 -49 597 339 -52 -578 -342 304 619 417 -468
1191 -468 -539 -76 371 687 -187 -552 -325 620 600 24 -697 -384 495 700 -27 -629 -647 535 267 249 -80
1212 -80 -563 16 403 625 -101 -684 -313 373 702 443 -685 -799 132 580 511 -306 -515 -328 579 645 -58
1233 -58 -546 -438 115 640 399 -442 -573 210 641 337 -328 -592 -218 704 444 -229 -664 -169 116 679
1253 679 443 -712 -563 238 630 154 -282 -350 198 116 363 -40 -847 -392 -36 431 107 -428 -709 321
1273 321 597 210 -41 -389 -350 136 190 -282 -389 -287 293 143 103 -124 -636 94 785 539 -333 -341 -101 209
1295 209 462 -101 -417 -258 409 486 191 -29 -315 52 627 226 -607 -422 -148 420 618 100 -512 -332
1315 -332 261 286 -104 -423 -352 226 475 320 -364 -685 37 406 269 81 -579 -418 290 553 -39 -142 -106
1336 -106 38 470 329 -282 -584 -4 -154 -7 176 -106 -5 528 370 36 -280 -312 33 257 280 -153 -481
1357 -481 -116 588 354 4 -483 -205 192 642 147 -365 -302 -13 202 321 -73 -631 11 422 357 -152 -246
1378 -246 -138 68 410 243 -508 -114 137 199 164 43 -67 -42 240 180 -110 -129 -132 350 260 169 -84 -327 257
1401 257 425 136 -115 -224 28 296 459 -198 -433 -275 209 75 -66 -392 -363 76 -80 211 -18 -217
1421 -217 -250 48 299 -267 -369 -289 13 59 307 -171 147 30 298 96 -3 171 32 173 138 -98 -99 -47 398
1444 398 580 -56 84 -294 -45 218 103 -157 -183 -99 107 120 -164 -4 133 57 315 75 -473 -167 -44
1465 -44 253 82 -210 -68 111 49 -3 -104 -69 75 40 152 -161 -64 -35 280 -83 46 -181 -74 257 -111
1487 -111 151 160 54 -219 332 -29 -238 -53 -158 -25 14 -8 -308 193 149 437 376 103 -164 -138 -58 -155 -127
1510 -127 194 41 28 218 185 -123 -431 106 47 -73 -315 -246 -82 137 180 -154 -93 -87 40 164 19 105 -362
1533 -362 195 -294 9 312 66 162 341 -19 236 109 -75 8 171 -107 -273 -77 -38 7 -271 -101 51
1554 51 44 121 -49 179 -95 19 232 45 -121 -67 146 47 201 369 93 49 -121 -78 118 -164 246 40 223
1577 223 156 -164 -259 160 150 103 -69 -34 -32 263 260 248 35 -181 -129 -5 431 -201 -39 160 162 392 32 93 -39
1602 -39 -147 272 -20 105 -28 149 152 -42 -209 225 -357 162 381 216 28 70 -217 124 43 -267 -136 -71
1624 -71 -136 -6 58 -296 -86 -11 -74 -169 -140 -89 56 150 195 -173 -166 97 175 153 -83 -129 57 -98 95 -115 -142
1649 -142 -200 -377 396 47 -259 255 -139 -56 217 319 25 -221 137 212 31 -28 88 -421 4 169 36
1670 36 -65 -39 4 -15 -22 -23 -45 6 277 35 -200 -167 -87 -6 246 69 -97 -34 -65 -16 -57 -104 82 147 176 82 -46
1697 -46 -90 101 66 -13 -150 -150 -256 -87 76 18 -297 27 457 4 -117 84 -408 -373 -44 344 -152 -303 160
1720 160 -122 126 14 179 -245 81 411 -241 -257 -353 -252 -132 293 281 -296 -83 141 199 -102 -191 -202 179
1742 179 138 0 -331 6 89 31 303 87 90 -34 -246 261 -87 -280 -47 77 82 134 50 96 -125 -30 285 -90
1766 -90 -33 179 5 248 -297 55 2 -167 209 -60 136 47 24 59 256 9 -314 -122 378 -162 -246 -133
1788 -133 -313 181 -304 82 -20 -11 -73 180 255 154 41 -289 77 172 29 -141 341 -3 434 60 -125 -232
1810 -232 160 247 139 -311 0 -5 -86 141 124 -336 -491 233 62 98 45 -178 -33 249 -18 -2 -66 233 265
1833 265 161 170 -80 62 -83 42 -30 95 -60 155 119 27 0 -5 96 -114 -72 100 116 -187 417 104 -125
1856 -125 -130 -154 -245 87 -49 175 157 -157 -188 201 -143 22 -18 -52 69 160 -33 -12 -55 -43 -83 290 -49 51
1880 51 -64 32 7 -121 -17 13 91 171 -83 31 214 14 -227 -109 -133 165 -189 219 -104 -415 55 17 -73
1903 -73 273 44 -152 44 -144 171 -36 -147 153 225 284 311 -28 -14 14 -55 28 196 11 246 244 42 14 266
1927 266 145 203 256 -31 29 -135 -85 -341 -4 121 -355 -51 321 -47 -272 -154 -352 -84 2 136 56 64 -183
1950 -183 64 25 -231 56 134 -125 22 -104 203 -136 80 150 -7 -173 23 -139 121 141 214 226 -132 -48
1972 -48 16 -143 53 -114 -99 -45 -169 -93 -5 -112 -124 -62 0 -239 -176 -190 150 -153 -99 17 16 -213 -256 -139 -110
1997 -110 168 -38 188 65 224 213 -152 -368 160 -36 479 -220 -56 -390 73 319 38 91 178 -11 -80
2018 -80 24 229 7 -265 -89 129 -149 32 5 -164 79 -297 -88 101 -89 79 241 41 -243 -100 -71
2039 -71 478 200 3 -134 -118 153 -158 -23 72 -248 119 -205 163 183 -153 72 201 -29 -35 69 -231 16
2061 16 120 -216 283 176 -81 147 -53 95 -147 160 283 233 -320 -235 38 203 -35 -144 10 327 -263
2082 -263 -64 172 354 -160 362 -54 99 -77 -50 -216 -137 -98 132 -75 -179 19 51 20 -188 104 -102 382
2104 382 36 21 -332 74 -191 -228 -119 -98 -211 338 -431 -44 176 6 -107 59 110 -72 -185 -249 63 520
2126 520 149 -234 -107 -244 -3 -61 -8 -23 142 -11 314 -16 -236 -137 -169 248 32 -27 140 28 0 98 45
2149 45 1 -41 90 283 35 67 68 335 -64 -30 -168 -8 -169 29 -185 -151 164 -342 97 -121 150 88 -93
2172 -93 -35 6 76 -21 -96 -321 323 -62 -45 3 -223 -108 -252 -3 -217 16 235 70 -194 537 -270 -373 365
2195 365 217 -162 40 -98 182 175 180 171 -197 186 118 100 -276 -74 142 194 167 -170 -6 229 96 -174 249
2218 249 -74 -26 -278 244 20 27 112 -83 205 -23 207 67 -152 -3 142 -38 -390 65 247 -141 -294
2239 -294 141 -156 106 123 407 181 -82 -334 228 -23 -48 -106 -21 -101 100 -213 -236 -85 -53 184 -126 -73 80
2262 80 -88 -308 -217 -378 -136 -95 -112 42 164 -100 265 188 -179 389 -167 -21 3 9 4 -211 167 -175 -93 100
2286 100 -33 -174 260 -105 424 80 -259 -56 190 114 77 -78 -121 79 268 -63 -116 84 77 -86 -184 40
2308 40 -72 -32 -157 -219 -55 -352 -30 75 112 8 -207 25 -67 -60 23 34 -201 -163 106 145 91 -223 -112 96
2332 96 -54 62 -45 -37 -278 115 -30 -262 62 -93 115 -271 -141 459 116 -47 -35 126 15 40 -188 38
2354 38 20 -129 -159 -163 -3 -205 184 -13 105 43 -3 107 -197 -40 -75 -131 209 -205 136 414 -253 -203 152
2377 152 -90 116 202 -115 81 -71 125 19 291 77 -10 -15 42 298 -55 125 170 -18 192 224 134 8 -118
2400 -118 120 231 -135 -84 38 -259 -52 -194 131 -35 -210 52 225 183 170 -111 -275 172 -52 95 -323
2421 -323 56 329 0 -60 -1 36 -59 -180 -41 85 -220 11 47 -80 170 -171 52 -55 108 43 -193 146
2443 146 -33 350 -286 118 -205 -21 57 -52 -50 -21 -108 -23 85 275 -52 38 208 -22 53 -10 6 -77 77 -293
2467 -293 -19 -168 -45 -191 -46 -163 -1 202 -260 -42 -63 46 -358 -282 -43 53 -40 149 178 195 -22 146
2489 146 -37 153 12 -77 -241 -219 116 -324 342 -302 -21 -111 140 -109 99 -294 119 211 -196 327 -379
2510 -379 -301 96 129 165 92 107 11 -155 -225 -67 83 -149 -253 -142 -74 28 118 257 157 7 -8 201 -56
2533 -56 222 -38 -322 -186 202 37 -236 -329 -9 -92 201 223 -94 -22 59 -142 93 -213 12 -114 95 40
2555 40 -88 113 35 136 196 -163 -222 -107 -112 6 -194 -23 138 55 -173 -128 95 158 -82 -77 -112 185 28 72
2579 72 -65 -133 -69 202 75 -121 94 131 170 -171 -154 -29 130 139 40 -104 -35 194 18 -267 349 30 -18 55
2603 55 43 48 -232 -339 -217 -188 162 166 78 -155 108 44 -44 -91 -136 -75 -139 19 -10 151 -109 206 73 171 -51
2628 -51 114 123 74 -187 -45 -159 -130 90 -208 140 -262 312 -76 -11 74 124 81 -347 -19 -105 -2 -180 -225 144
2652 144 182 -322 -48 280 44 -155 -123 33 13 72 187 48 49 -297 107 -9 -23 187 -87 18 49 56 -475
2675 -475 -101 207 21 -133 29 194 -407 -185 52 377 10 48 224 -122 120 -128 -267 -78 297 120
2695 120 219 54 99 72 113 8 22 280 -136 -108 -14 21 254 80 -19 245 -97 -86 -3 -8 -72 87 256 32 -196
2720 -196 -165 -13 120 50 147 -125 56 -46 -125 -216 -436 41 276 -78 64 -152 -28 -29 21 -32 -98 226 80
2743 80 511 -60 134 -187 -148 161 -34 136 54 145 -149 28 -45 412 -134 -144 149 -268 307 38 -139 28
2765 28 -87 -150 -113 152 -31 -215 -161 -285 -293 231 -85 28 16 148 156 -151 109 140 388 -1 -65 -85 -309 -4
2789 -4 80 -24 -316 -67 16 -92 -182 13 72 -67 -90 6 389 59 -2 63 263 -297 -151 42 -116 -294 -167
2812 -167 174 -18 -381 5 312 357 181 -181 46 164 -6 -70 24 53 -110 258 -151 204 -25 -173 -91 -200
2834 -200 -92 239 -9 79 127 148 35 -126 58 275 -238 24 32 197 290 -152 111 -219 -4 47 -104 39
2856 39 -236 77 212 356 66 -124 -25 -81 186 -309 -34 30 140 1 87 -51 -45 -373 -186 174 -87 -75 -256
2879 -256 -35 290 -38 197 -149 164 -118 65 -279 -318 129 -80 -28 36 154 163 53 102 21 -82 292 -39
2901 -39 0 -142 8 99 242 22 127 81 -187 100 -94 -89 30 -347 177 -93 -32 215 -46 -238 -168 297 -215
2924 -215 -35 -150 -106 -252 27 -179 -4 -97 -261 243 33 -71 -147 123 62 -120 101 84 -258 133 -28 174
2946 174 -45 -212 -33 -66 -146 -86 15 165 2 -202 -102 -158 -101 53 -137 -57 -53 -248 2 -181 174 -121 19
2969 19 -231 69 -29 -89 189 -142 -58 34 -278 22 -140 102 -148 169 26 9 -113 129 151 78 111 204 -182
2992 -182 9 88 -329 2 46 32 283 179 -54 140 257 11 65 -17 12 184 -54 -62 153 -59 -233 -172 19
3015 19 -3 -103 158 280 -422 150 91 230 66 0 395 65 251 -39 170 -65 162 36 77 166 156 -251
3037 -251 33 -115 -92 48 -258 220 36 -157 -31 158 -140 -105 -421 19 48 180 192 -37 33 -125 97 -188
3059 -188 55 -209 -167 77 -53 -154 -46 16 -93 187 201 -10 41 -230 108 -108 61 249 -62 197 338
3080 338 196 -265 -32 -121 234 -48 15 87 -36 35 29 -61 111 -67 -309 -117 218 30 -363 163 24 35 67
3103 67 -391 -128 -31 267 -76 -345 6 58 -22 -25 -46 26 118 -67 -47 -28 -6 -255 -18 -138 197 -138 -81 42
3127 42 -136 -7 -101 53 -19 -27 201 53 -84 -182 93 -67 -180 12 52 63 -56 -37 -76 188 -87 -51 50 -97
3151 -97 223 -10 40 -65 -224 5 -71 182 -72 74 165 9 -112 -218 106 -39 47 -60 -108 -81 -7 76 -1
3174 -1 216 147 -25 56 -15 144 159 114 41 -149 -79 54 -21 280 25 123 -209 -190 232 -122 207 76 -184 88
3198 88 326 69 9 213 168 -290 -212 47 350 -151 59 254 -74 -123 103 -70 408 -180 -111 -214 -121 -166 -265
3221 -265 -141 309 -121 -6 63 -127 -80 -321 -160 -21 6 -82 248 -22 86 11 -58 180 -208 -116 130 -85
3243 -85 -216 113 100 23 78 5 -69 -47 -2 47 2 95 111 102 -174 11 32 -37 77 105 274 -90 64 -170 39 17
3269 17 -28 -35 -63 131 282 -1 -145 -95 -115 156 125 6 -50 13 -83 242 109 -10 -393 -338 270 43 -77 77
3293 77 59 30 55 -150 189 -1 -13 142 -86 112 78 -18 -127 -273 -133 -11 572 80 31 -161 286 202 -4
3316 -4 110 -8 -284 -248 -115 39 46 243 -142 31 26 -163 -178 174 75 -233 69 -261 -199 13 205 1 305
3339 305 34 118 -127 -223 142 -77 132 493 90 -33 -220 52 270 89 20 121 -94 269 19 34 -11 -66
3361 -66 -10 54 22 -78 413 -91 -286 -27 73 -311 -45 122 104 13 -252 -133 -127 -36 -88 34 -227 59 -54
3384 -54 -149 115 159 -88 6 -204 -187 -184 68 -70 51 114 -385 1 -20 166 143 -162 74 -193 -126 -387 -140 238
3408 238 -164 -139 -11 231 63 -30 -161 -96 13 -96 259 202 -152 -15 -13 3 -209 -11 -347 -75 -227 115
3430 115 292 -51 -308 12 -293 -122 -2 4 -47 131 -260 35 218 -174 -123 -338 -19 96 126 172 4 42
3452 42 169 -23 -47 150 31 36 -62 106 -91 -263 -273 95 50 276 45 -73 -46 -249 139 -69 -124 472 -84
3475 -84 163 -63 -175 -80 -68 229 -41 -35 -228 15 46 0 44 8 -60 -78 -72 71 97 152 29 173 -67 -184 -23
3500 -23 -54 -94 167 -191 -70 -39 -30 26 -2 70 -171 95 94 -136 26 -6 -13 -231 -198 181 -334 34 -299 278 2
3525 2 51 -106 309 -126 -95 86 -83 61 -113 -122 -173 175 52 23 -187 39 -58 72 -77 -15 -313 38 89 70
3549 70 25 -308 200 -311 -41 203 -324 53 173 96 -222 -87 57 136 19 -319 -245 20 -50 -70 -39 47 94
3572 94 163 61 63 -91 -37 132 -79 -14 161 -140 -145 -195 340 30 355 -232 -367 -54 -138 -6 135 254 9
3595 9 -105 -265 123 -109 114 56 -111 -261 -96 3 383 265 -221 -198 -53 33 13 131 74 323 12 -150 51
3618 51 -67 -51 -4 -173 -305 -28 -69 62 -197 -60 58 -253 -17 281 -96 -63 -26 -250 -219 -117 80 48 126
3641 126 190 216 122 84 -167 -251 19 -73 -118 -77 -107 141 -48 -107 -85 61 -61 220 203 93 -23 47 38 -126 -140
3666 -140 10 147 -109 43 -86 135 -28 -53 159 4 33 -160 -12 -80 21 -226 -393 43 -317 52 -151
3687 -151 -115 54 63 294 186 -5 -51 131 -225 262 104 30 -22 523 -304 -231 112 100 -209 306 -91 -136 12
3710 12 153 -44 25 82 -187 -87 -326 -121 99 -85 -184 7 339 166 -7 229 -103 99 -22 179 39
3731 39 146 -37 7 -42 284 -34 -75 102 15 -240 233 188 273 -128 286 222 362 35 -56 -136 244 108 -170
3754 -170 28 -164 36 -164 -15 187 197 14 -124 -66 -221 13 -181 -6 -267 49 -40 25 -55 -7 2 91 -161
3777 -161 296 99 21 3 11 -323 -123 192 14 223 19 -191 300 193 -4 165 30 -67 -250 -111 87 -168
3799 -168 -43 292 -32 168 -184 -92 44 36 -222 117 18 -205 284 -168 53 123 21 -71 -257 -322 -75 -29 176
3822 176 79 197 -133 -93 -93 -103 -22 -74 -53 -25 86 85 -3 -306 10 -220 227 5 21 -54 -7 -271 25 -101 -45
3847 -45 -205 16 6 -205 -17 -226 -145 -171 12 -283 -292 -314 -98 -188 -106 97 147 218 -97 21 -190 52 297 -106
3871 -106 -181 173 -116 -181 99 -83 -98 -30 -133 -170 147 -6 108 -200 -218 33 76 -123 257 -98 -88 -69 3
3894 3 253 -34 -32 180 359 93 -205 143 -72 -130 379 38 185 117 30 -114 -169 -11 -38 166 115 -42 -218
3917 -218 -73 -95 -93 -218 40 -115 -110 109 68 -56 134 -99 52 -86 -101 244 -37 -238 -139 212 -1 -95 -1
3940 -1 108 98 180 46 -190 -41 28 -173 -137 194 227 108 -68 40 -194 -128 15 72 121 166 -53 -117 -57 -99 134
3965 134 -28 52 32 61 90 101 53 77 -316 42 -75 -207 5 147 -22 182 116 -10 -31 -48 -102 6 -175 92
3989 92 409 -100 -139 -243 29 89 157 46 -59 160 13 310 105 -155 114 344 -207 542 -81 -60 107 227
4011 227 -92 293 -100 36 36 -172 12 -218 -200 80 33 -38 -306 -184 -99 -55 -84 51 66 160 104 -389 -383 -128
4035 -128 -54 179 -164 -1 -25 -211 23 277 68 -428 -47 -95 -224 -117 193 -21 346 31 5 59 -108 149
4057 149 358 57 89 -101 42 -306 -177 10 -30 -241 -250 -35 -169 -109 -43 162 113 -191 -84 85 2 30 -39
4080 -39 5 135 -47 127 117 63 -36 -41 -43 81 142 37 40 -6 -59 -48 70 -12 -93 220 -30 24 -91 -122 -3 -210
4106 -210 -225 59 -393 -249 -269 52 -80 -56 -211 -40 110 -307 -361 169 -44 155 -73 -386 21 -34 -12 -30
4128 -30 56 -146 151 -9 -65 -55 36 155 3 -26 114 56 -22 120 -131 -111 -143 -79 -62 -92 184 -336 -132 42
4152 42 81 -45 -18 -112 -168 -193 -243 -20 -124 -14 57 296 -17 -18 203 5 256 -41 62 275 -20 -147 -53 -82
4176 -82 -56 -203 26 -82 179 -193 78 -170 18 251 -311 -48 134 70 -185 37 -239 -67 -91 -124 -15 78
4198 78 -91 -97 -171 -226 -134 170 -76 28 -73 -241 -211 175 -107 255 -11 199 -70 -132 -64 268 -29 -36 -80 -82 103
4223 103 -286 -16 50 60 -207 -68 -67 -258 -44 -257 -140 284 163 -155 31 -135 195 64 -119 44 -108
4244 -108 13 191 -74 2 -176 -240 -142 -178 -237 -160 93 10 -80 -254 -106 57 64 15 88 -27 2 10 -121 112 183
4269 183 14 89 304 154 124 24 144 229 -192 -264 233 293 -131 19 91 125 221 351 -125 247 -2 -31 -41
4292 -41 -143 -13 -34 -225 -122 125 134 65 -67 -28 -9 -302 -76 192 -160 158 2 113 -132 -45 -248 338 173
4315 173 151 186 28 -127 -15 88 -200 -137 -274 128 -29 135 -81 -188 151 62 -42 1 233 126 -312 102
4337 102 130 -217 46 53 -46 100 -116 78 -12 38 27 -79 -428 -55 308 -301 50 166 -63 381 105 -275
4359 -275 -26 -81 197 -27 -48 -164 -308 -155 -366 41 60 -84 -161 -301 35 93 -214 -186 -13 119 28 -46 118
4382 118 2 -296 -308 56 -8 -25 232 22 159 -3 125 -229 123 388 -433 54 -6 3 15 11 -130 -3 -102
4405 -102 -252 -44 -11 168 29 134 -46 -139 -116 -129 174 -122 -23 50 -182 -2 76 95 -123 40 266 125 106
4428 106 175 62 -22 -4 -47 -65 16 65 98 -59 112 -273 103 5 -268 157 -354 -73 45 99 74 198 -48 -241
4452 -241 -213 -266 247 134 47 -134 117 -72 -68 173 -105 29 -112 -15 68 -172 351 -169 -117 111 -90 65 314
4475 314 216 -108 70 49 -133 141 65 102 228 149 43 -79 91 73 -76 -311 -20 -99 -23 -193 -328 287 -33
4498 -33 14 -97 141 148 -321 204 -127 -8 -88 -43 7 -2 -38 -34 137 31 -79 335 -201 -3 308 43 -62 24
4522 24 334 -308 116 3 -281 -130 147 -34 -82 213 -17 82 125 -83 76 57 -139 -27 -123 -94 -202 235
4544 235 -203 148 158 62 -96 -64 165 31 261 -35 131 169 58 64 -18 206 201 -110 -61 125 -152 100 -274
4567 -274 265 152 -74 -216 138 -81 -135 26 171 118 -261 -205 244 -53 -275 12 24 -87 -114 -91 119 -62
4589 -62 -69 28 -55 -91 108 231 177 190 16 -26 26 431 55 -233 87 -211 -184 -109 69 25 -105 196 125 262 -119
4614 -119 -189 139 119 30 54 -159 -159 92 6 -103 -230 -230 39 3 391 -32 62 -162 -1 54 154 -91 -44 -52 170
4639 170 39 301 281 93 162 -73 67 207 212 108 56 -203 -41 154 -222 -44 -16 -102 -48 -55 32 -167 -234 -265
4663 -265 -65 72 -183 -323 -242 -62 -249 318 -161 -66 215 126 167 169 -190 -117 207 58 -35 195 -196 48 231
4686 231 -162 -124 -21 -327 -45 -133 -242 -601 -280 46 -36 -63 -168 130 33 291 -35 38 107 -24 -24 -31 -19 -110
4710 -110 -15 -168 -329 -7 23 -365 -90 12 2 17 285 -14 32 235 -10 -154 96 342 -47 21 43 168
4732 168 17 26 116 -237 -226 -99 -33 -85 -188 -199 140 54 -138 153 260 7 61 62 36 -165 167 55 -28 -55 324
4757 324 -90 282 -45 47 -9 544 71 310 126 3 -65 -4 -89 24 56 26 -160 57 46 -239 -31 228 138
4780 138 79 47 196 100 69 297 -46 93 -24 148 251 149 -241 -125 1 -100 -14 -110 37 36 41 -184 -26
4803 -26 370 127 316 -139 32 202 -30 74 95 23 -52 13 97 -116 65 161 -96 248 -23 70 28 140 100
4826 100 -35 -159 -22 45 329 -12 133 -59 -127 79 -40 101 109 -278 262 135 -9 56 -81 -135 -199 121
4848 121 -194 148 168 130 -265 -29 35 118 27 0 -8 189 -133 235 -155 -5 167 -85 -116 16 37 -36 -140 -296
4872 -296 -266 68 -196 -95 64 -241 303 154 294 598 -11 -129 127 -64 -105 81 224 -115 110 -70 -240
4893 -240 -172 43 194 134 164 -63 -28 70 -148 -24 84 -296 282 -256 157 -198 108 58 -38 58 81 -83 56
4916 56 -131 -55 136 -47 -72 -67 -83 -54 -111 -350 -169 97 -110 -161 -47 -101 117 177 -133 50 -4 -545 31 -250
4940 -250 -301 -144 -108 -127 -154 258 122 -134 252 137 -24 -171 -64 -57 -119 21 -390 -35 -373 -221 -196 -165 -56
4963 -56 166 -2 118 -44 118 39 -36 -28 201 126 165 -124 116 -2 59 -121 187 104 -359 -42 -62 303 4
4986 4 -62 -238 351 -83 -273 53 -100 -130 -7 100 -302 -156 35 9 -52 71 92 19 -265 87 -43 -101 -92 260
5010 260 107 162 141 -56 21 40 313 -59 -73 -219 -2 114 38 47 28 -38 -123 158 -158 66 149 -71 93 155
5034 155 -66 95 158 -78 -77 43 -13 -73 -66 -6 184 -85 168 -126 -20 -229 128 -246 86 183 -80 15 -30 223
5058 223 -152 129 32 -60 9 -258 -38 79 -53 -194 41 -150 -127 -11 9 363 46 -103 232 46 -189 25
5080 25 6 -10 165 -61 49 -171 89 91 -47 -54 101 114 13 224 -98 -383 266 74 4 -25 -19 -332 111 -45
5104 -45 179 42 181 -93 303 -10 75 -299 86 15 -215 200 -71 274 -106 163 299 270 130 40 -43 43
5126 43 -69 101 98 -40 34 -6 63 -256 -121 128 229 -213 -28 -259 161 187 77 -60 377 -394 101 54 -305
5149 -305 81 -52 -127 -41 49 -24 92 -154 -128 -194 66 308 -275 272 24 150 -52 -152 -91 -28 -60 -26 243
5172 243 141 -82 -182 -44 58 -40 -44 297 82 -33 -158 18 126 172 113 312 229 -184 129 135 20 18 -243
5195 -243 2 -215 40 134 -117 77 51 -34 -49 -183 -13 129 178 -100 -141 -255 110 -1 -2 263 66 46 -205
5218 -205 -46 362 251 -64 -124 86 -76 135 -73 -131 -263 74 266 -45 169 -93 265 80 -101 -206 160
5239 160 103 -57 -42 82 -71 80 184 249 186 26 23 239 -11 -105 85 -86 -139 87 13 76 110 -66 -13 167
5263 167 109 94 149 -196 33 94 -240 303 -21 -81 86 273 10 107 -159 223 -122 -234 -313 -97 -361 194
5285 194 2 -47 -211 213 -72 -83 179 171 66 72 -169 -99 264 -431 35 257 -375 -26 -81 -62 -33 -92 60 262
5309 262 59 -197 78 -357 -319 145 479 69 180 -91 198 106 -178 -66 85 -25 -385 215 208 -148 79
5330 79 -69 -162 5 78 -116 89 -4 -119 -301 -82 -129 -56 274 -168 37 -123 150 -94 -45 -40 30 103 -228 -19
5354 -19 -228 22 37 -211 27 -163 -104 30 240 140 206 -271 137 -83 1 -236 199 -161 -39 -31 -18 404 -111
5377 -111 -96 -33 -48 -62 26 56 -34 290 1 27 -130 127 -144 -31 185 -152 237 -86 -7 -52 -174 274 36
5400 36 -115 142 -61 -57 -10 142 -48 288 -15 86 -188 -52 25 133 393 266 233 -172 134 160 -65 -180
5422 -180 309 31 -118 15 -101 -25 186 -50 381 21 -170 200 -110 115 74 -192 -11 89 -146 -113 -262
5443 -262 119 -26 39 140 131 -68 -137 -270 -169 -231 4 -215 211 113 11 128 -176 95 13 -310 -42 201
5465 201 -47 376 -120 -108 12 83 -229 -37 73 -143 -123 -81 47 109 -300 280 96 -298 -52 98 199 -150
5487 -150 -353 434 9 91 242 192 -106 322 102 -45 14 -61 75 -137 -156 323 182 -213 -27 96 226 177
5509 177 -41 -67 -142 45 -18 55 147 -281 20 120 49 92 7 97 46 -260 29 98 205 138 -60 114 53 -184
5533 -184 31 90 -19 68 268 158 127 -13 -178 -63 -167 -202 -233 82 -63 -272 -118 95 99 125 44 80 -321
5556 -321 -35 -105 -27 247 220 53 -268 125 -173 143 134 -469 32 -19 169 33 304 -195 -149 -256 -52 86
5578 86 -200 97 214 54 26 101 -138 73 86 -206 -354 -49 51 -17 104 -67 261 -74 52 76 193 111
5600 111 -185 -26 27 -55 276 -131 -152 -111 -132 -189 -208 -40 -23 -212 -54 -110 49 283 265 -5 74 230 16 198
5624 198 -348 -41 -117 -27 -92 36 22 -45 112 165 128 -101 209 33 -62 72 56 60 -199 -160 234 111 -141 20
5648 20 -133 245 117 -8 91 -97 153 -14 99 -132 78 -317 313 -138 296 123 -53 -168 141 265 76
5669 76 62 414 42 -34 -105 -189 -56 -117 -67 -76 -175 -31 180 -17 11 -229 209 116 -300 -116 285 112 227 -118
5693 -118 -55 94 70 -53 -122 -325 193 -231 -67 -18 -217 140 332 -2 246 -103 -56 3 73 -102 26 56 -146
5716 -146 -21 -207 -245 -210 -219 36 -87 213 61 -52 37 447 -191 -46 65 -271 91 102 -165 -385 -29 68
5738 68 35 -299 -123 17 -223 133 229 -377 120 -165 182 -327 -121 -240 -112 100 -223 11 -39 -55 338 -305
5760 -305 -17 141 49 245 263 -81 221 -50 -66 -487 226 -244 -38 -78 -9 146 -159 141 17 45 301 154
5782 154 209 128 -49 23 27 -151 -15 -55 199 -96 -167 86 -87 -154 -91 -33 124 -77 4 159 45 -70 53 -199
5806 -199 113 16 101 -285 43 -102 57 252 115 237 -56 124 -159 -49 -29 136 36 -261 164 -5 -232
5827 -232 -166 -174 150 148 148 36 61 -72 4 55 -378 -105 -7 -215 -19 -418 -245 11 106 155 105 42 -2 -76 43 149
5853 149 -3 79 -112 -103 104 -74 -304 245 -50 -86 -61 -17 -114 161 137 -24 94 -135 284 39 -16 38 -213
5876 -213 -109 298 -114 -320 -86 82 14 162 -272 -182 -133 -165 -95 155 -56 79 -21 232 -50 -197 -24 -2
5898 -2 72 -541 198 -37 162 20 2 -6 -73 -72 -18 -105 146 367 -114 -276 -125 -4 143 395 -36 -219 57 -134
5922 -134 -90 -249 -207 -121 133 11 -144 -63 -229 243 35 66 -3 -75 -425 -5 249 -21 -157 -84 207 -63 18
5945 18 51 394 -16 -114 207 -340 206 63 34 156 239 -302 -137 -185 186 -148 -319 -391 -205 123 91 12 -25
5968 -25 -23 63 -98 -70 93 -182 -92 121 -137 106 122 86 -43 81 133 123 -94 -383 -48 -270 133 -222 213
5991 213 170 -25 -145 -31 67 90 -36 -129 90 8 -155 -175 73 -228 87 -140 -42 -105 -65 65 140 153 -88 -2
6015 -2 -135 -208 -110 -26 -46 -168 68 -129 -438 -140 -46 160 58 235 -120 58 -112 221 -119 69 123 48 -25
6038 -25 -137 -32 26 -67 -21 47 64 94 165 -134 -103 6 54 -63 14 -181 -54 59 -234 252 9 93 55 354
6062 354 7 -244 -30 127 53 -18 245 78 -103 -83 53 -43 44 -305 210 41 234 -165 146 243 -99 -174
6084 -174 -129 -78 -132 -163 26 49 -103 171 -50 313 -186 242 66 380 -308 -159 156 121 -201 -36 -197 198
6106 198 -44 -135 254 47 -126 -83 -173 -156 -101 -197 -114 186 42 147 -121 3 -114 44 6 -211 142 8 -15
6129 -15 59 38 305 160 -145 -37 6 121 -80 -91 192 -156 -310 -1 -50 -41 28 -8 36 -6 -95 -220 -223 -55 115
6154 115 28 50 105 -15 99 119 237 143 -5 -39 79 -97 -5 157 246 160 181 -155 242 -37 316 237 301 -113
6178 -113 -62 82 -20 -282 -98 171 -34 322 173 -177 -13 169 -31 255 -67 -142 239 -115 125 -117 -8
6199 -8 -2 22 -5 58 -227 -163 -273 131 -31 -101 -242 -22 -23 78 160 35 -132 152 76 -25 345 -22 -141 -53 -22
6224 -22 45 -2 184 -76 -49 93 160 49 -32 164 68 22 -82 42 70 -160 47 116 -16 137 -58 104 187 274
6248 274 175 60 98 -64 -76 -106 312 -216 -38 193 152 -41 78 67 152 42 193 -174 101 65 -285 274 39
6271 39 18 24 -33 158 269 -179 305 87 -70 -155 144 210 -85 251 -135 89 25 181 -103 -105 178 -38 -92 -142
6295 -142 -251 -14 -29 -72 87 90 103 80 121 33 7 -248 71 231 173 -44 169 -32 279 34 24 -168 272 -75
6319 -75 -142 13 -209 75 -218 -80 -179 96 -117 -35 45 -122 -202 -28 -177 -3 -17 83 214 -36 -88 19 37
6342 37 -74 184 79 21 16 98 -53 -53 378 193 252 -226 -40 260 116 -104 -84 -146 134 0 -151 -30 249
6365 249 160 16 124 94 -83 -105 350 121 -210 -192 -12 150 -228 67 12 -138 79 215 280 111 121 107 -147
6388 -147 100 -196 -1 21 145 248 -36 -253 147 -173 -193 -59 104 208 -207 1 -201 13 -209 223 -40
6409 -40 -15 -70 -6 -125 115 270 128 1 -121 37 51 -41 -199 -54 -55 42 35 78 -47 175 123 179 -13 91 -151
6434 -151 -180 -126 -160 107 -124 -56 26 97 -24 6 367 -13 -3 234 29 45 -117 -151 -69 -205 99 -110 -45 271
6458 271 -60 50 127 -206 136 125 173 7 232 266 -101 -11 -22 341 22 54 -50 200 157 -161 164 40 -14
6481 -14 -158 -197 147 -323 -56 -64 116 -171 -37 12 171 147 -16 102 -242 63 -192 -218 -295 -65 -141 -170 169
6504 169 -285 125 -5 7 36 -387 276 180 129 -91 110 -7 -243 45 -344 17 -78 97 49 -105 159 -161
6526 -161 67 107 37 20 7 251 -130 31 129 43 -96 212 -36 234 -137 133 49 89 41 -299 -203 -221 88 -228
6550 -228 -209 39 191 182 23 -243 52 -250 472 69 41 242 -134 51 258 -123 382 268 92 71 29 -117
6572 -117 106 -396 35 -112 224 -23 -62 43 -125 -38 -202 -145 -92 -197 158 -35 -208 32 -230 -167 259 -411
6594 -411 -275 237 216 -72 171 -71 14 -243 305 32 -69 214 -17 -107 -34 133 179 -179 -151 -173 37 322
6616 322 311 75 39 -9 -57 48 -229 -20 -218 0 174 -192 170 18 208 -70 -31 119 56 -14 -19 81 195
6639 195 -106 160 115 124 92 119 20 260 100 -356 -110 47 55 -229 113 23 -8 205 -31 77 544 -43 -98 82
6663 82 222 35 26 -108 39 63 249 -190 -126 101 125 67 54 42 106 -306 289 -150 -192 -103 -200 329 -3 88 -150
6688 -150 -184 68 -223 -86 129 38 113 206 167 -52 -25 132 140 -94 -14 -112 54 -304 242 314 143 -268 -282 -53
6712 -53 -44 188 10 7 97 288 -21 -191 -173 145 145 204 70 -203 151 -266 79 -116 -142 -25 256 77 262 -262
6736 -262 -247 -79 13 8 -167 189 -103 -260 71 136 -48 47 -114 220 260 35 -187 201 -94 -9 29 -178 302
6759 302 295 -52 -33 198 30 -181 -75 65 83 -101 117 66 -5 -113 -47 87 3 -8 -33 -138 -256 46 -148
6782 -148 -43 200 33 47 101 -19 183 149 -147 130 -24 -207 -3 -37 13 1 -185 25 122 -280 96 -37
6804 -37 309 124 3 94 81 -37 -21 66 25 65 -37 -89 78 -181 -81 173 171 -417 2 211 67 73 201 -156
6828 -156 -7 11 52 -89 112 -155 86 -405 -89 -43 253 -34 198 -18 -256 50 140 28 255 106 45 -140
6850 -140 -135 86 -187 69 -214 -114 -221 -12 129 55 -12 -157 67 120 233 170 181 17 168 -9 -61 -149 55
6873 55 4 -132 -51 -234 190 115 105 -124 -146 -63 55 125 -69 -90 34 -75 -305 -272 136 -177 -68 -140 230 5
6897 5 181 -87 -461 277 -1 315 -489 -6 -227 351 -109 32 12 118 -160 -194 -101 7 -127 -131 71 14 85
6920 85 -135 6 47 126 -94 -63 -14 -184 -49 45 -52 -81 -435 -154 122 183 314 232 -30 23 -27 -23 -155 -233 86
6945 86 -42 -28 -50 61 -148 0 116 -39 50 153 -131 -59 62 -240 -270 11 17 160 -25 117 -60 -241 301
6968 301 232 20 -120 54 39 323 150 102 -23 130 -8 42 90 -23 51 208 39 317 -259 -101 62 -79
6990 -79 98 254 -84 81 164 28 23 28 -418 24 263 -226 180 -6 18 -181 -51 -19 86 295 10 -42 -58
7013 -58 -134 191 71 -226 -47 -53 -159 53 -90 -88 -118 -190 -172 -191 -17 102 302 -206 21 126 28 -136 -102 -178
7037 -178 -48 -15 -58 22 -31 59 75 -41 235 345 -88 -146 -101 29 -127 99 157 35 -220 -161 18 -24 26 24 -195
7062 -195 149 -98 203 82 116 -10 95 112 146 -126 -67 -42 -145 187 -135 -29 198 60 -105 8 -142 -4
7084 -4 232 -44 -157 -37 -196 91 149 -48 71 -151 -29 218 -175 -155 -198 123 -155 -65 -81 180 -191 110
7106 110 222 48 -135 326 -175 109 -281 -251 -275 15 94 -263 -118 2 -93 109 -212 237 94 148 76 -73
7128 -73 314 -159 -115 -141 -74 -144 309 96 76 203 172 -498 213 -93 -184 -33 148 95 -217 52 -307 186 270
7151 270 -40 -248 223 -405 -34 -29 -23 69 115 -43 186 94 154 -84 139 219 -62 -454 -16 192 50 -35 -50 123
7175 123 76 -113 -79 23 -166 -71 -260 -92 -228 -123 100 219 -172 -32 -141 -29 -109 2 -107 -82 -101 -174
7197 -174 108 141 -36 -71 -133 106 239 -116 229 -233 151 353 24 237 277 -242 -24 16 -41 -119 142 54 -45
7220 -45 -51 -134 -3 -16 57 -60 70 -14 -93 -255 58 -158 -63 -133 214 -143 -33 379 25 2 1 263 223 153 148 32
7246 32 -18 -68 -54 -331 -89 28 -105 -8 -48 16 -95 -119 -5 -74 25 76 -138 69 284 54 -216 -206 -46 -45 105
7271 105 37 -63 120 -15 -93 -186 -142 -143 -249 -39 -162 126 58 -46 167 205 -27 122 206 245 95 -269 -43
7294 -43 159 -11 25 54 113 -517 74 -12 216 -192 -63 216 351 8 52 233 117 -132 -65 -172 -149 251 117
7317 117 -5 13 -77 40 -203 -219 104 41 81 347 -43 286 -18 -102 -61 227 -76 107 -309 -252 -7 -243 44
7340 44 177 -207 -223 -104 -134 167 42 -65 217 94 27 -31 -302 -12 -581 -249 -41 -61 -159 122 -250 271
7362 271 46 -228 138 17 157 123 109 105 -205 -1 79 96 80 315 37 121 71 -6 84 143 -193 -87 7 181
7386 181 -117 7 93 -258 205 -153 -11 167 291 65 185 -213 189 182 -292 -142 -15 68 -17 -378 -69 -76
7408 -76 -33 144 132 169 -376 94 125 125 118 -69 -155 -20 226 -73 39 27 156 -243 -106 -46 -204 -139 81 -211
7432 -211 -278 -163 210 -106 -84 152 191 -32 -67 -44 103 14 -80 115 -153 101 -179 83 -252 -70 -35 -84 -114
7455 -114 100 -45 72 -401 167 296 304 210 273 352 -26 -253 -296 -26 119 -201 -1 82 -45 -130 -182 160 -103
7478 -103 15 -184 172 -76 -87 128 353 0 52 36 -81 85 95 -49 84 -156 -380 162 -134 -139 -364 370
7500 370 178 1 -1 -121 -169 -145 -55 -64 396 -71 -295 -5 6 155 44 -20 -187 17 -208 -210 215 119 85 -77
7524 -77 -196 69 -154 42 78 -246 138 211 52 106 -92 305 -194 -162 -21 87 219 -237 163 241 -195 168
7546 168 -127 430 104 -6 -68 -101 -304 289 210 -166 -148 -88 133 -241 -185 -77 -26 -205 -224 -54 169 136 8
7569 8 -18 87 -13 -106 -180 343 -100 -35 -154 11 137 244 -369 -158 54 -236 -289 -278 -177 65 66 -62 112
7592 112 226 -31 -215 77 187 33 105 44 -525 -306 156 45 154 -62 148 102 216 143 55 285 2 145
7614 145 160 9 504 -49 332 263 326 107 -189 -22 71 -186 -1 -65 -18 -111 -3 -76 -287 -215 -171 141 -4
7637 -4 -67 -155 38 73 235 -115 -25 -44 5 -199 404 415 91 -82 342 21 -64 -196 -3 428 162 107 1 99
7661 99 86 -126 -51 -315 259 -107 6 378 104 360 110 118 -4 286 -50 -215 -294 -89 -134 126 180 -172 102
7684 102 -58 -188 -59 -216 122 -126 -112 175 18 -50 138 244 140 -208 93 132 310 -71 188 -51 -72
7705 -72 -31 -296 -74 89 -242 -210 -120 35 263 174 24 -32 -27 198 38 -97 -63 -127 -17 -376 -168 62 -225
7728 -225 43 156 -75 -97 271 105 -260 -98 -104 -40 -22 82 14 52 24 -124 -171 46 -82 -81 -231 133 -146 -189
7752 -189 193 9 -105 -77 -96 20 24 -416 57 -83 -43 -132 -86 18 -227 -120 -137 113 -160 51 -184 361 114
7775 114 -49 -455 196 24 41 -135 137 210 -221 153 121 74 -278 73 -355 -3 -7 -131 31 -199 133 57
7797 57 5 -129 -110 -63 -106 70 -79 53 150 -65 -85 -155 113 89 202 71 -56 -425 -61 -225 -63 132 -115
7820 -115 8 70 -126 229 21 -269 125 -96 -168 37 -77 90 166 -140 -120 -107 105 59 -145 -337 -106 159
7842 159 132 -256 -95 29 -37 -327 247 44 -94 -246 56 2 -138 -1 38 -184 -43 -46 -396 -152 -10 87
7864 87 47 133 15 -9 60 -178 -45 91 -93 60 -39 -172 128 -119 -55 -103 -127 46 -71 88 183 64 -166
7887 -166 18 -177 25 -1 111 -165 337 -104 9 -331 -136 -40 252 -197 -235 -223 81 -292 187 378 -191
7908 -191 82 -195 -203 261 69 70 27 13 -20 21 64 90 -17 -24 1 -28 86 58 9 9 -252 32 -84 18 -105 -36
7934 -36 37 -34 -35 -74 58 196 118 59 120 -53 120 93 144 -88 -56 -171 -71 484 -182 111 -1 19 105 -238 90
7959 90 148 -35 -234 193 93 274 -41 109 91 -122 58 -162 -18 -17 -129 -167 213 -259 53 -106 49 237
7981 237 -34 -58 140 -21 38 -415 67 220 142 -164 317 -136 145 345 13 -278 15 73 281 164 139 201
8003 201 77 -17 23 -27 -14 62 23 35 128 1 -159 -128 58 12 111 281 376 -197 -61 -61 -22 -56 -165 44 -143
8028 -143 -16 0 -225 -47 -342 150 141 -63 64 -296 32 -250 0 -120 386 277 10 -120 -35 220 128 -122
8050 -122 -159 -153 -100 238 -134 -111 -439 -327 123 5 -187 323 -165 -4 -117 -129 -119 -287 -63 226 33 -86
8072 -86 20 -635 25 153 83 -165 111 187 117 31 106 -277 102 -55 -193 -5 -31 138 61 -93 226 157 -242
8095 -242 53 -3 85 -52 93 -162 149 -158 -146 -184 -356 -5 10 135 24 241 -28 54 -54 -72 10 59 322
8118 322 45 -2 19 -214 23 224 70 -207 216 296 -193 228 94 254 34 -141 -23 -98 -261 38 -59 -177
8140 -177 -198 253 -241 -60 -63 -43 95 -192 92 -115 151 -43 158 168 -334 26 171 -88 71 -136 -43 -44 174
8163 174 111 -233 169 -187 127 247 408 -120 279 241 -12 -56 30 12 -10 -156 196 -178 1 166 224 83
8185 83 -5 -63 -168 -99 -45 -123
8191a23
##END NTUPLES=NMR FID
##END=
