##TITLE=1H_DE-63_36
 D2O
 8 sc, 
 15.8.2024
##JCAMPDX= 6.0         $$ Bruker NMR JCAMP-DX V2.0
##DATA TYPE= NMR FID
##DATA CLASS= NTUPLES
##ORIGIN= UXNMR, Bruker Analytische Messtechnik GmbH
##OWNER= root
$$ XWIN-NMR		Version 3.5
$$ Thu Aug 15 15:37:32 2024 Russian Standard Time (UT+4h)  she@DPX200
##.OBSERVE FREQUENCY= 200.1318
##.OBSERVE NUCLEUS= ^1H
##.DELAY= (6, 6)
##.ACQUISITION MODE= SIMULTANEOUS
##.ACQUISITION SCHEME= undefined
##.AVERAGES= 8
##.DIGITISER RES= 18
##SPECTROMETER/DATA SYSTEM= spect
##.PULSE SEQUENCE= zg30
##.SOLVENT NAME= D2O
##.SHIFT REFERENCE= (INTERNAL, D2O, 0, 15.7039)
##AUDIT TRAIL= $$ (NUMBER, WHEN, WHO, WHERE, WHAT)
$$ ##TITLE= Audit trail, XWIN-NMR		Version 3.5
$$ ##JCAMPDX= 5.01
$$ ##ORIGIN= Bruker BioSpin GmbH
$$ ##OWNER= she
$$ F:/spectra/data/she/nmr/H-F/1/audita.txt
$$ ##AUDIT TRAIL=  $$ (NUMBER, WHEN, WHO, WHERE, WHAT)
(   1,<2024-08-15 15:36:20.21 +0400>,<she>,<DPX200>,
      <created by zg, POWCHK disabled, PULCHK disabled
       configuration hash MD5:
       00 E9 B6 7A A2 85 ED C7 34 08 36 98 17 FE 4E 26
       data hash MD5: 16K
       C3 E0 74 FC FF 21 6E 27 55 A6 A3 BE 78 01 66 04>)
$$ ##END=
$$ 
$$ hash MD5
$$ 0D AC FD 14 2B 54 2F 48 1D 05 95 C8 C9 16 85 B9
##$RELAX= 
##$RELAX= 
##$RELAX= 
##$RELAX= 
##$RELAX= 
##$RELAX= 
$$ Bruker specific parameters
$$ --------------------------
##$DU= <F:/spectra>
##$EXPNO= 1
##$NAME= <H-F>
##$PROCNO= 1
##$TYPE= <nmr>
##$USER= <she>
##$AMP= (0..31)
100 100 100 100 100 100 100 100 100 100 100 100 100 100 100 100 100 100 
100 100 100 100 100 100 100 100 100 100 100 100 100 100 
##$AQSEQ= 0
##$AQ_mod= 1
##$AUNM= <au_zg>
##$AUTOPOS= <>
##$BF1= 200.13
##$BF2= 200.13
##$BF3= 200.13
##$BF4= 200.13
##$BF5= 200.13
##$BF6= 200.13
##$BF7= 200.13
##$BF8= 200.13
##$BYTORDA= 1
##$CFDGTYP= 0
##$CFRGTYP= 5
##$CHEMSTR= <none>
##$CNST= (0..31)
1 1 145 1 1 1 1 1 1 1 1 1 1 1 1 1 1 1 1 1 1 1 1 1 1 1 1 1 1 1 1 1 
##$CPDPRG= <>
##$CPDPRG1= <>
##$CPDPRG2= <>
##$CPDPRG3= <>
##$CPDPRG4= <mlev>
##$CPDPRG5= <mlev>
##$CPDPRG6= <mlev>
##$CPDPRG7= <mlev>
##$CPDPRG8= <mlev>
##$CPDPRGB= <>
##$CPDPRGT= <>
##$D= (0..31)
0 1.2 0 0 0 0 0 0 0 0.06 0 0.03 0 0 0 0 0.0002 0 0 0 0 0 0 0 0 0 0 0 0 
0 0 0 
##$DATE= 1723721779
##$DBL= (0..7)
120 120 120 120 120 120 120 120 
##$DBP= (0..7)
150 150 150 150 150 150 150 150 
##$DBP07= 0
##$DBPNAM0= <>
##$DBPNAM1= <>
##$DBPNAM2= <>
##$DBPNAM3= <>
##$DBPNAM4= <>
##$DBPNAM5= <>
##$DBPNAM6= <>
##$DBPNAM7= <>
##$DBPOAL= (0..7)
0.5 0.5 0.5 0.5 0.5 0.5 0.5 0.5 
##$DBPOFFS= (0..7)
0 0 0 0 0 0 0 0 
##$DE= 6
##$DECBNUC= <off>
##$DECIM= 24
##$DECNUC= <off>
##$DECSTAT= 4
##$DIGMOD= 1
##$DIGTYP= 9
##$DL= (0..7)
0 120 120 120 120 120 120 120 
##$DP= (0..7)
150 150 150 150 150 150 150 150 
##$DP07= 0
##$DPNAME0= <>
##$DPNAME1= <>
##$DPNAME2= <>
##$DPNAME3= <>
##$DPNAME4= <>
##$DPNAME5= <>
##$DPNAME6= <>
##$DPNAME7= <>
##$DPOAL= (0..7)
0.5 0.5 0.5 0.5 0.5 0.5 0.5 0.5 
##$DPOFFS= (0..7)
0 0 0 0 0 0 0 0 
##$DQDMODE= 0
##$DR= 18
##$DS= 0
##$DSLIST= <SSSSSSSSSSSSSSS>
##$DSPFIRM= 0
$$ [...]
##$SUBNAM2= <"">
##$SUBNAM3= <"">
##$SUBNAM4= <"">
##$SUBNAM5= <"">
##$SUBNAM6= <"">
##$SUBNAM7= <"">
##$SUBNAM8= <"">
##$SUBNAM9= <"">
##$SW= 24.0689170037331
##$SWIBOX= (0..15)
0 0 2 0 0 0 0 0 0 0 0 0 0 0 0 0 
##$SW_h= 4816.95568400771
##$TD= 16384
##$TD0= 1
##$TE= 0
##$TE2= 300
##$TE3= 300
##$TEG= 300
##$TL= (0..7)
0 120 120 120 120 120 120 120 
##$TP= (0..7)
150 150 150 150 150 150 150 150 
##$TP07= 0
##$TPNAME0= <>
##$TPNAME1= <>
##$TPNAME2= <>
##$TPNAME3= <>
##$TPNAME4= <>
##$TPNAME5= <>
##$TPNAME6= <>
##$TPNAME7= <>
##$TPOAL= (0..7)
0.5 0.5 0.5 0.5 0.5 0.5 0.5 0.5 
##$TPOFFS= (0..7)
0 0 0 0 0 0 0 0 
##$TUNHIN= 0
##$TUNHOUT= 0
##$TUNXOUT= 0
##$USERA1= <user>
##$USERA2= <user>
##$USERA3= <user>
##$USERA4= <user>
##$USERA5= <user>
##$V9= 5
##$VALIST= <valist>
##$VCLIST= <CCCCCCCCCCCCCCC>
##$VD= 0
##$VDLIST= <DDDDDDDDDDDDDDD>
##$VPLIST= <PPPPPPPPPPPPPPP>
##$VTLIST= <TTTTTTTTTTTTTTT>
##$WBST= 1024
##$WBSW= 4
##$XGAIN= (0..3)
0 0 0 0 
##$XL= 0
##$YL= 0
##$YMAX_a= 135599
##$YMIN_a= -144674
##$ZGOPTNS= <>
##$ZL1= 120
##$ZL2= 120
##$ZL3= 120
##$ZL4= 120
##$ABSF1= 10
##$ABSF2= 0
##$ABSG= 5
##$ABSL= 3
##$ALPHA= 0
##$AQORDER= 0
##$ASSFAC= 0
##$ASSFACI= 0
##$ASSFACX= 0
##$ASSWID= 0
##$AUNMP= <proc_1d>
##$AZFE= 0.1
##$AZFW= 0.1
##$BCFW= 1
##$BC_mod= 2
##$BYTORDP= 1
##$COROFFS= 0
##$CY= 11.3945322036743
##$DATMOD= 1
##$DC= 2
##$DFILT= <>
##$DTYPP= 0
##$F1P= 15.6554695791079
##$F2P= 12.8336369535428
##$FCOR= 0.5
##$FTSIZE= 0
##$FT_mod= 4
##$GAMMA= 1
##$GB= 0.15
##$INTBC= 1
##$INTSCL= 1
##$ISEN= 128
##$LB= 0.24
##$LEV0= 0
##$LPBIN= 0
##$MAXI= 10000
##$MC2= 0
##$MEAN= 0
##$ME_mod= 0
##$MI= 1.114404
##$NCOEF= 0
##$NC_proc= 0
##$NLEV= 6
##$NOISF1= 3.799351
##$NOISF2= 2.8
##$NSP= 1
##$NTH_PI= 0
##$NZP= 0
##$OFFSET= 15.70392
##$PC= 1
##$PHC0= -25987.18
##$PHC1= -3.212523
##$PH_mod= 1
##$PKNL= yes
##$PPARMOD= 0
##$PSCAL= 0
##$PSIGN= 0
##$REVERSE= no
##$SF= 200.130013532006
##$SI= 16384
##$SIGF1= 3
##$SIGF2= 2
##$SINO= 400
##$SIOLD= 16384
##$SREGLST= <1H.CDCl3>
##$SSB= 0
##$STSI= 0
##$STSR= 0
##$SW_p= 3612.71676300578
##$SYMM= 0
##$S_DEV= 0
##$TDeff= 0
##$TDoff= 0
##$TI= <>
##$TILT= no
##$TM1= 0
##$TM2= 0
##$TOPLEV= 0
##$USERP1= <user>
##$USERP2= <user>
##$USERP3= <user>
##$USERP4= <user>
##$USERP5= <user>
##$WDW= 1
##$XDIM= 8192
##$YMAX_p= 0
##$YMIN_p= 0
$$ End of Bruker specific parameters
$$ ---------------------------------
##NTUPLES= NMR FID
##VAR_NAME=  TIME,          FID/REAL,        FID/IMAG
##SYMBOL=    X,             R,               I
##VAR_TYPE=  INDEPENDENT,   DEPENDENT,       DEPENDENT
##VAR_FORM=  AFFN,          ASDF,            ASDF
##VAR_DIM=   8192,          8192,            8192
##UNITS=     SECONDS,       ARBITRARY UNITS, ARBITRARY UNITS
##FACTOR=    0.0002076,     1,               1
##FIRST=     0,             0,               0
##LAST=      1.7004516,     0,               0
##MIN=       0,             -144674,         0
##MAX=       1.7004516,     135599,          0
$$ Real data points
##PAGE= N=1
##DATA TABLE= (X++(R..R)), XYDATA
$$ [...]
1891A36k4l22J96j74K40j91J57J04O5l54p7N4J60j91K51j98J50rR6LL6j18l9l4
1915h3k50L35n0J05j31M07m19k08K58k90L87l56M43K6j10j44N4P0p2O5J9K64n01
1938a81M48r8k91R4J07k46j25R2L87j53K63k86K62n4K0k77J37L9qK3n6k37q6L73
1962A47J58l05N2j25j07L37j07J43k40j44P8J64l47L01o2J31J0j23L6l9j53q7
1984b82M38j03k13J63p2k00M13j70J47j11qJ20j06K41k10j65R9L77n29K32K17
2005B78k29r4L49l31J97O5m89M91q9m16M03Ml75L58m1L56l79k45Q7P7Q0l60L85
2028H2J60j71j71J32j37L5q4j01K50L8k61K35l8j17L37l67K30j41R9k59K31J5
2050cO5J68j58J63j10k18K33k58j29L69r2R3j69J00N3l16Q5L89l89K49l59K22
$$ y = [136, 112, -210, -14, -188, 52, -139, 18, 122, 187, -167, -244, -190, -30, -221, 30, -168, -18, -27, 69, 72, 108, -10, -49, -83, -333, 2, -48, 57, -74, 333, -86, -294, -36, -326, 61, -295, 148, 174, 64, -80, -26, 44, -28, 37, 56, 320, -181, 267, 169, -122, -28, 79, -167, -292, -200, 187, 34, 297, 11, 273, 219, 239, -38, 99, 138, 130, 153, 97, -140, -226, 147, 305, 0, 52, -73, -180, 157, 50, 193, -47, -191, -113, 51, -296, 5, -57, 74, 84, -39, -3, -42, -195, -282, 156, 53, -160, 3, -69, -269, 144, -26, 121, 10, 2, 122, 16, 257, 47, -118, -19, 358, -171, 61, 278, 49, -45, 304, -27, 170, 235, -254, 237, 148, -268, 135, 139, -236, 122, 81, 437, 58, -187, -100, -23, 57, -303, 82, 242, 71, -100, 32, -105, -70, -154, -255, -5, 33, -228, 7, -31, -148, 189, -178, 52, -89, 10, -249, -18, -3, 62, 230, 72, 235, 125, -93, 140, -118, -247, 122, 30, 123, -46, 54, 107, -209, -124, 265, -124, 125, -234, -12]
2072a2P6l27K16m2J7j49M33k46L74j95k31j14P3L90m27J14k8J75p9p9j0RJ51P5
2096A64L5k66j88K47L03o0k29K5p3j18k6j7K77j67J63j99K70p8k01M11j87k11
2118a25L2L05j16rJ15j62N3j54M02l00J55j82l28L55j06p5K97l25K65K52j66n8
2140A25p4k34K32J3o9J00J56m78J57M00k85P6l12O7k08L69j9M2j22L4j27J1L46
2163B00l58J36L5k78M86p6k33K53J04l58J33j8O6j28k9o0R7j93N26j39q6l47M6
2186b21L50n52L30r0Q2O4j05Q0k41J28K68r5J88j53j24p5L03m14K69K2J81m0m3
2209A12n1O6l18M83om13K2k7J22J74N6l2r6p4J80m17O7K85j9j18o6k55N08k15
2233c2j88J36j4J25K19l83J59L0n8R6q9J1J42j18p8L33k48k5K3L4m78L24K8J26
$$ y = [-12, 64, -263, -47, -89, -72, -221, 212, -34, 340, 145, -86, -200, -127, 263, -164, -50, -78, 97, 18, -61, -71, -62, 89, 164, 199, -67, -255, -8, 295, 235, 6, 31, -42, -160, -186, -203, 74, -93, 70, -129, 141, 63, -138, 273, 86, -125, -93, 212, 96, 87, 202, 40, 93, -61, 341, 41, 196, 14, -314, 41, -65, -140, 157, -168, 97, 349, 183, 125, 51, -183, 49, 62, -7, 93, 249, -229, -72, 328, 43, 119, -193, -126, -334, 35, 16, 58, -64, -30, -157, -146, 200, -158, -22, 13, -265, 221, 145, -88, 165, 269, -89, 44, 26, 92, -36, -65, -125, -28, -221, 305, 166, 80, -267, -221, 129, -423, -93, -183, -101, -37, -142, -62, -303, -175, 93, -2, 186, 33, -91, -166, 137, -277, -8, 14, 195, 155, 112, 61, 127, -191, 292, 286, -127, -105, -132, -10, 164, 220, 188, 92, 18, 198, -219, -152, 133, 114, -4, -70, -325, 183, -32, -220, -84, -98, 27, 246, -137, 22, 52, -6, 90, 1, 12, 154, 36, -42, 291, 43, 18, 41, 75, -403, -79, -51, 75]
2257G5k8L0j05m8J14j53N33l72J57o16N45j97K40k35J01j1jj33J40j83j42K92
2279Cq2N9J34j72K17j06j75j58M93m50N79k41J16j01N8P8p7k47n6J88K29j68K31
2302C52n29K35j25R3J66m19N5K84k8O8mL12n96J88P0Q5j66J9n6J3rj42L19n32
2326c47L79O5l41K05N2j83J17j12L71n2l00J33j42L88k38r4M07o8j44m04N35m52
2348b25L64k21K98M9l6n3m12K7M40o5o5J6K7J64k66l8R9m0J46j21k6k0j77J36
2372AL77m40k52K53J65L2n9p5R0k68L91L37p16L45k75L28n73N80l54O0J98r1k07
2395a53J21J7l31M49k36K28k03J83k54M82j76j15Mj90J54K33l76J15K26p2J22
2416B28L3j53j75J59Lj93M8m8l9j8K22Q8l65j4N1n5K44j0k06m1K83M4n7J5N0j26
$$ y = [75, 47, 77, -28, -76, 38, -115, 418, 46, 203, -413, 132, -65, 175, -60, 41, 30, 29, -104, 36, -147, -289, 3, -79, -20, 114, -58, 159, 53, -122, -280, 213, -237, 342, 101, 217, 116, 174, 252, 175, -72, -128, 60, 289, 121, 352, -177, 58, -67, 26, 192, -227, -172, 112, 84, 152, 148, 460, -136, 52, 122, 207, 41, 60, 4, 17, 8, -134, 185, -347, 32, 97, -244, -39, 13, -170, -53, -165, 206, 154, -146, -13, -155, 233, -5, -99, 308, 240, 96, -308, 227, -225, 139, -82, 216, 265, 229, 176, -236, -209, 231, 166, 101, 117, 144, 308, 42, 4, 103, 63, 209, 88, 62, 42, -135, 1, 378, -62, -314, -61, 104, 136, 77, 2, 92, -176, 215, 552, -164, 181, -94, 234, -339, 241, -113, -53, 145, 54, -153, -32, -15, -346, 103, -133, 95, -108, 75, -179, 303, 127, 12, 16, -174, -20, 213, -163, -48, 178, 106, 228, 261, 108, -67, 92, 95, -98, -50, -98, -137, -155, 67, 155, -210, -224, -173, -228, 16, 6, -200, -241, 42, 86, 29, 44, 94, -32]
2442c2Po8j22L30q4R0n26N65J10l64J06J45l27J73j74j13J07LJ35J28p3j04K96
2465B08l65J28M8k4J14k52q4J58L24l20O3j50K55L4j53p4J36lj41K26k89M8R3
2488b0L9j41J50j23N4J56l92L11k77J35k5m4L57r6j93K14j12NJ09L4J73k33K91
2511C72m96K85j30k0J7K1J65j61m3J36m50L34l5L0m14J53J10J94k52K42k23K13
2533D8o7M61j71n6l60O0L56n81L14k9L83k73j47LN2k20K86O1l05N09j34j74P9
2556I5j62Oj21J88K50l68n1J07J9N0L3K1P8k28J10J58J02k16j13K82No7k26l35
2580c83N49K59l61o2k8q8J98P7k72q9K1J07L5J0K85l81K55m1P7m97L40Q1q7k65
2604b60K94l00K18n1n3L9K82%l92K58l55L97j75K61j99M9p0o2J18M3k54K37Mn1
$$ y = [-32, -25, -93, -215, 115, 31, 121, -405, 160, 270, -94, 12, 157, -170, 3, -171, -284, -177, -174, -39, 89, 16, -88, 208, -157, -29, 19, -5, 109, -143, -227, -69, 255, -65, -2, -152, 103, 137, -16, -90, 46, 43, -98, 128, -161, -113, -20, 19, -122, 28, -95, -41, 115, -277, 34, -243, -108, -133, -177, 180, 84, -109, 105, -7, -2, 107, 141, 314, 81, 372, -124, 161, 31, 11, 28, 49, 214, 53, 10, 146, -304, 30, -5, 25, -389, -236, -126, 68, -184, 58, -165, 48, -19, 442, 271, 215, -145, -85, 271, -310, 4, -25, 358, 85, -62, -59, -7, -227, 59, 120, -185, 324, 190, 16, 95, -67, -61, -182, 6, 256, -112, -163, -56, -37, 13, 46, 67, 145, -83, 27, 185, 287, 71, -42, 240, 245, 178, -48, -383, 166, 425, 64, 2, -26, -114, 84, 161, -111, -200, -179, -72, -37, -27, 258, -123, 132, 91, 168, -329, 11, 92, 5, -260, 34, -266, -48, -99, -152, -113, 169, 169, -223, 35, -320, 77, -98, 163, -36, 13, -57, -119, -1, 42, -212, 25, 29, -22]
2628b2K3K10l27J91J59l80K70j69J24p4J57k62L0J91m08N15n8O3l36q0M42m65
2650b06K04l15K31K55m09J23q9M4O9n3K77j7q0R0k94K12J02l34L00j50J47j58
2672e1Q8L05j04l43M10m19m9R1K58k72K21p2j97J90j60m06K67J20J41j32K95k34
2694e3l4K70j19J80j23R4k24J57Mk03k23L04l4pl73O12P2m71J85j15L21j64M2
2717I8l7L0J03n15M38k33l5K1K06m0j57K34K73n20J40k9j20J43mR2l4L3j44j29
2741a86J28L9M7n2L8L3j35N4N4k76J17J6RR9J04K1k22L44l52M8o8J85k80K15J20
2766A00l12J5P0K74k34L4l6j53N05k20k8k02J84J2N9l6J1K65n22K70q7n2J68L7
2790A22k78K55Oj16R4j53k09K72J4pR2k63rJ47K03p0k73q1M23l15L13l00J60K57
$$ y = [-22, 1, 211, -116, 75, 234, -146, 124, -45, 79, 5, 162, -100, -70, 121, -287, 228, 170, 233, -103, -183, 259, -206, -2, -317, -86, 169, -240, -117, -206, -162, -93, -146, 131, 114, 34, 124, -170, 42, 144, -190, 110, -40, 107, -51, 37, 342, 238, -105, 305, -114, -163, -72, 186, -86, 135, 63, -134, 56, -104, -510, -243, -123, 18, -114, 181, -53, -87, 183, 64, 244, 121, 215, -9, 148, 152, -51, -274, 30, -4, -11, -384, 228, 300, -171, 14, -101, 220, 56, 98, 61, 91, 194, -321, 117, -116, -151, -130, 76, 36, -121, 113, 386, -134, 6, -23, -143, 0, -4, 88, 54, 87, -57, -186, -58, -19, 28, -24, 14, 47, -88, -34, 20, -256, -139, -123, -114, -15, 89, 110, -112, 232, -120, -72, -140, 45, -235, -20, 100, -212, -197, -127, 147, -87, -53, -89, -242, 263, 43, 15, -187, -3, 9, 68, 32, 43, 308, -214, 56, -31, -83, 85, 122, -156, 99, 105, -11, 83, -70, -279, -7, 7, 0, 92, -171, -180, -33, 170, 100, -173, -254, 169, -146, 167, -133, 27, 284]
2814B84k06l31L65J25l6j28q9J91l54l9M7K07K7m59O36k69NJ4l3l9j51K16o7K4
2838f0K96l92M73k51r8l6j47O1nL1j3q1L14j80j07J45r5L83l77n8N9j64L18j43
2862a27j2r3K34j16J41J01j42jJ84j99J97l47K32J15n16M93k47K57k05J81Kj35
2884cj55K56J80k27N0k28M4K9Qj50R2j2j6m4rK54k23K84j71j46L72k01j98K88
2908G4k13L66j74l07J28K60J27k07k1Kq1J00K89m58j76L41n4q6J86L02j09j15
2930A74l69K70j74k53K84j02j09L44j02J93j10l40L97k00p8l4K24MN3n33L37M8
2952g6J68r3M5MK37k48j6L47k08O7m12M33j01l07N03m34K58l26J64J03j55r0J10
2975b7L8K12k86J22n3j53m5J65J40k32J58q5M0l26N47k65J89j34k93J82p2J61
$$ y = [284, 78, -253, 112, 237, 201, 73, -16, 175, -179, -218, -171, 36, 63, -396, 240, -29, -24, -10, -43, -82, -233, -17, -84, -60, 236, -156, 317, 66, -32, -68, -215, -154, -159, -128, -141, -222, 92, -88, -195, -50, -145, 238, -139, -197, -138, -302, 16, -127, -139, -232, 2, -114, 27, 128, -14, -15, 169, -30, 167, -180, 52, 167, -349, 144, -103, 154, -51, 130, 132, -3, -158, 98, 278, 51, 101, -127, -83, -54, -46, -196, -104, -116, -132, -176, -185, 69, -154, 130, -41, -187, 185, -16, -214, 74, -139, 227, 53, -254, -126, 134, 261, 54, 33, 35, -46, 54, 343, -115, -291, 50, -4, -90, 96, 398, 289, 174, -195, 75, -99, -352, -68, -170, -279, 65, -37, 156, 46, -294, 103, -97, -175, -209, 15, 19, 72, -461, -124, -76, 92, -1, 44, 48, 285, 37, 21, 368, 160, 227, -185, 248, 147, -160, 343, -91, 167, -159, 5, 108, -47, -137, -27, 11, 223, -63, 59, 6, -147, -192, -27, 113, -119, 39, -46, -6, -332, 215, -50, 139, 5, -288, -106, -178, -17]
2997a7R8k00L3J76k04L87l28J62J7k0k24K01J50k53k1L04m59J55M2j4K4k06L86
3020A89m11J64P2J16j26q4L77m56L86m61J17K02k44K20j89k06M05j46L67j77m09
3041b94K40j15K5K81k84J51l57L87K4o2J32o1j52J96p1l93K83J78J56l96J53J07
3063A28j08m5J25l92M62Pk35k87J75PM9L46m65L46j61lL76r8k95j30K00j23M75
3086C54n46O1R8l32K28J28J80o3l39O8J87K43m03J69q9nk25J12K33j22Q7j4Q4
3109I4k30K37j14l1m5M95p07K46J76k08o8J82J23l14K65J84j51k83K39J51j85
3130E6j55J20op8K13L2m15K84k40J88l3OPj85K94r3k03P4K53J47n39L66l3J70
3154B30k59N5n7P5J56O7j58l23K99K3o19M02j43K48J16m0j79J82n2k50m3M31l9
$$ y = [-17, 81, -119, -86, 90, -114, 273, -55, 107, 124, 104, -120, 81, 231, -22, -43, 261, -198, -43, -1, -15, 9, -197, 189, -222, -58, 14, 130, 4, -80, 297, -159, 227, -234, -117, 85, -159, 61, -128, -334, 71, -75, 292, 115, -294, -54, -169, -144, 137, -147, 4, -353, 34, 58, -4, 128, 67, -85, 111, 40, -353, -70, 108, 264, -132, 21, 128, 20, -25, 100, -292, 170, 177, -58, -345, -170, -163, -114, 232, -233, 113, -48, -51, 325, 227, -68, -198, 2, -121, 354, -192, -131, -33, -365, -137, -9, 171, 108, -231, -163, 24, 267, -136, 33, -56, -61, -286, -174, 59, -63, 24, 10, 94, -136, 101, -13, -44, -89, 406, -301, -55, 121, -87, -155, 27, 150, -164, 101, 285, 134, -149, 90, 241, 56, -99, 21, 15, -63, 150, 182, -233, 51, -189, -1, -34, -28, -21, -206, 88, -5, -208, -134, 119, 266, -273, 93, 60, 230, -29, 26, -31, 44, 200, 267, 109, -214, 85, 108, -511, -109, -252, -4, 112, 72, -107, 75, 23, -227, -270, 161, 122]
3177A22Q9j05j42mJ32Q2m44K63J55r3kk36L01L1l63M87m78K59M2Nj1j86NK19k53
3202a25j12J93M49m93O1j25K06l15J39O6o2r2K14k25K57O6j97K01k47L82m81M17
3224A77j18m7l7m5j09J84L36k88M1P6K17n31R2R5q8K86k84k19M50j48K0r8L12
3247B74l01k0J03O4j59K57k43j10j4N4K66q1r0p9nK39p9l08K78%K0m52L81j59
3271a64r9J98m4Q7N2m2k38K97J00J51j0k11q3Q7k47p3N5k0N40k42m6J84l51J02
3295a7K62j10N6j63J38%j52L38k76j43K95j95k18N2J99q1L3Mj26M15m87K78O2
3318A64m26M30k69L08N9j19k07K48j86k8J61J66l65l6jJ08J33j14k5JL7j59O1
3341e9L22k16m4j05O0N6O7q4K42l75PQ8l12M05j16L09k18j13oJ81l7j99J32N3
$$ y = [122, 211, 106, -36, -40, 92, 174, -270, -7, 148, 55, 53, -183, 118, 149, -214, 273, -205, 54, 96, 101, 90, -96, -91, 128, -125, -237, -44, 405, -88, -27, -152, 54, -261, -122, -56, -118, -210, 4, -221, 36, 102, -95, 106, -141, 241, -240, 177, 59, 12, -25, -70, -179, 5, 341, 53, 94, 170, 387, -144, -52, 43, -45, 241, -43, -262, 188, 40, 60, -38, 274, -27, -47, 56, 120, -39, 218, -25, -135, -149, -95, 171, 90, 0, -79, -84, 155, 76, -232, 46, 46, 66, -386, -5, -164, -263, -65, -109, -22, 30, -12, -250, 47, 147, 298, 288, 77, -6, 81, -166, -239, -184, -204, 336, 94, 48, 232, -119, -17, 245, 135, 191, 28, 166, 166, 14, 352, 76, -67, 228, 33, -185, -133, 66, -15, 18, 22, -104, 311, -176, 102, 164, -262, 168, -101, 207, 266, 147, -60, 188, 2, -26, 135, 301, -64, -100, -101, 7, 140, 26, 1, 2, 39, -120, -59, 263, 47, 3, -102, -42, 14, 81, -3, 239, -136, -129, -41, -353, 52, -64, 245, 27, -86, -92, 89, 52, -147, -15, 38]
3365C8K71l06K02l9m44K76j21L26j74j98K56k8O7k96L8R0q1J80k63L64m02J60
3387h4J16j22L29m72J38J78K61o31L23J17j89J00j75K37k81L88qj70k12K08k02
3408a51O2l6L83R9k21j42Q2J79j42p4n5Q1o5k89L13Mj23r6L79k77K51k47N6L2
3432Co3J76J82j10j39j02J63j04j34k08N19R0k78k4k26M86j92k99K29L05n26J99
3454e3J01K31j90l30K06J1j3J34j43r9J68j51Q2K71k64l3J95j77J5L17n12L11
3476G7k66J72m8L17J5j86l14N89l47j63J61J51k48J51M8o8q6j20R5R0j15p4J81
3499A2j85L42l33J99p3J02J2l9K44K0l64P4K14m32K00J7j25O4p0K8Q0l26N83j07
3523A37J38n01K41J54n9m32L64r4M8K32l32J56M3R4n07L38QJ44o8K3M3n9j06M7
$$ y = [38, 309, 3, 205, 166, -278, -2, -123, 203, 29, -169, 87, 59, 126, -170, -132, -42, -123, 57, -206, 158, -244, -84, 32, -90, 239, -233, -95, 83, 344, -287, 36, 153, -36, 64, -111, 126, -155, 233, 225, 55, -157, 51, -151, -89, -125, 258, 357, 136, -6, 76, 255, 113, 39, -16, 65, 0, -289, 24, 28, -95, -191, 188, -89, 162, -85, -29, 3, -60, 116, 298, 188, 49, -53, 110, 6, -128, -336, 183, 273, -5, -29, -255, 231, 39, -260, -31, 274, -252, -53, 48, 279, 89, -241, -35, -24, -37, 97, -46, -145, 23, -128, -46, 225, -39, -72, 123, -54, -39, 278, -234, 77, -189, -17, -65, 252, 267, 81, -233, 356, 9, -154, 7, 158, -90, 61, 109, 41, -45, -165, -70, 20, -95, -169, 12, -173, 169, -164, 35, -38, 64, 76, 37, 281, 301, -63, 11, 225, -207, -7, 10, -115, -51, -121, -93, -13, -339, 244, 137, 275, -226, 15, 169, 110, -322, 42, -52, -4, 228, -104, 52, 95, 189, -318, 20, 28, 172, 104, 127, 170, 111, 5, 52]
3547E2r5Q3J45j53j09K56j01lj50O6R0n3M0k54K50l4j89M80j90j63j16Q5j74J78
3571e9K69n5l16J63L5J3k7L8j99L82m00L05J21k67j01J34j53M90n89J39M41l97
3593c3J64m18K93j96L87l82L4N4L64m5m69L74j29Q0j8o21N38j55J10K33j53J85
3615A97j47Qo6j2R1J68m1m11L27n70M55N4o8j60l6J00J40P9j32Qq9L63l20Q4q
3640A4QM0j74K14j60J50k43J04j9N2K07m37K51j42K08l74L28p1p4J37L03ql73
3663e9N38j19l71j98L43k33J43L0K66k36k89J37K3l3O3J41j55j47j54K21N9Oj84
3686b08K60J65r1j26L5j38J84k70L55k27P7q4m9L23j49M7l50L11J93l86J35k11
3708b04m4N19k10m50N92j22r1M4J87m94M06J00k12K25k25J34k98J8K5J05l5J31
$$ y = [52, -43, 40, 185, 32, -77, 179, 78, 75, -75, -9, 81, 28, 68, -186, 64, 30, -159, 321, 131, -32, -148, -63, -237, -59, 210, 155, -161, 2, 37, 50, 23, 61, -138, 244, -156, 149, 270, 3, -98, 36, -117, 373, -216, -77, 364, -33, 131, -287, 6, -190, 197, -185, -151, -97, 267, 222, -247, 127, -2, 78, 60, -561, -23, -178, -68, 165, 12, 197, 50, 58, -8, -20, 71, 239, 198, -213, 114, -456, -1, 53, -15, -175, -211, -111, 29, 108, -24, -16, -105, 258, -62, 22, 14, 22, 62, -112, 102, -58, 92, -151, -47, -66, -14, 193, -244, 7, -135, 73, -301, 27, -44, -118, 19, 322, 314, -59, 479, 360, -11, -209, 134, -99, 44, 74, 340, 104, -185, -48, -25, -58, 5, 146, -9, -156, -310, -89, -30, -24, -208, 52, 217, 126, 0, 35, -103, 81, -189, 166, -61, 16, -68, -117, 206, 57, 104, -246, 65, 258, -128, 7, -204, -248, 271, 61, -389, 203, 81, -10, 34, 221, -273, 133, 233, 21, 246, 21, 155, -143, -125, -100, 5, -30, 101]
3730A01j67J60n2k59o2J02L06j61k8J27l95J73J73K47m2j71j49J44Rq0j02j17
3752b43K46j58K34n6k24K05R8j43J85j45pn5R7K81l77k30L19p0m6p9K00J26k2
3775A36m3n3j33J50K1J5j47k3J68j5l13J10Q2j33J84J16p3o5J48j07J77J03k09
3798I6p1j81J51r6O6O9k49J99J63j15j00k8J21k0k35L23J70j42j11L79k87m05
3820c03J77q3N3K04j66J47k0q9L33r2k46L1J14Q0j78m4m1n7J15J33l09K53j08
3843i6l09M29j78M55n29J56K9L97j11j90l67N49m66L00m6j6Nq7p4J68k71L97l57
3866b12l4L50q9k87L02j05K17j80M2J85m70K26J57j9j26k09L03p5J58j3l19K93
3888I5l12L06k38J39j94N74r3j09k02K14J39l71L11l48k4k56N29J3m31J20L89
$$ y = [101, -66, 94, 42, -217, -279, -177, 129, -32, -60, 67, -328, -155, 18, 265, 223, 52, -97, 47, 56, -24, -126, -243, 3, -155, 79, 23, -201, 4, 102, -41, 144, -1, -8, -63, 34, 315, -62, -292, 27, -43, -89, -168, 32, 158, 136, 93, 40, -93, 57, 78, 93, -54, -77, 91, 76, -237, -127, -45, -178, 6, 122, 49, -16, 132, 25, 202, 305, 96, 25, -156, -5, -101, -35, 34, -215, -16, 147, 32, -68, -96, 25, 5, -230, 93, 263, 121, 10, 389, 102, -303, -126, -209, -156, 48, -118, 29, 9, -80, 253, 161, -85, -54, 60, 140, -38, -82, -123, -180, -65, 68, -241, 12, -96, -405, 24, -154, 301, -228, -72, -43, 354, 243, 53, -314, 235, -231, 69, 23, 7, 12, -75, -149, 19, -252, 145, -212, -246, 104, 15, -272, 30, -75, 142, -38, 4, 189, -281, -55, 102, 83, -43, -252, 51, -24, 134, 121, -198, 95, -217, 89, -149, -10, -204, 370, 277, 168, -34, 180, 319, -52, 259, -89, -113, -369, 160, 173, -258, -138, 251]
3909B51j04K41m34j51M91m54Q5J54r4N0j75Q9N4j1Q8m9j9K11l98K36j62L06k64
3932e9J29k48N57l94K11k18L04l64m3J8K4M5j38M15l28K94k15n4K9p0J32k19L32
3955A40l47p5N63m15k7n5M30K35k05k21l8M4j25Q3Qj38M08k50J06k67J11J38M6
3978A49r7J71n64J04L84k52J19j84J95J08n10l3M17J44k00R2J04m45Q33n17L9
3999E7N0L3l3j56J31j85K14M3k08o3j63K40j26K27M0J70j27j6J76r3k12j85j2
4022a98K56j54J60K5j80O0J70P7o4R1l75K08K65j18R9k11l01L6K06k67J66J58
4044A09l01M41q9j74o3J42k15M47j6m57N7J20J75j98L8j24M9j22J62M4K39m65
4066b01L13k6n3J12p9n1l18J97o1J82j15K62q4k24L12r4j75j78J77K70j78J89
$$ y = [251, 147, 388, -46, -197, 294, -160, -75, 79, -15, 35, -140, -51, 3, -8, 80, 31, 12, 223, -175, 61, -101, 205, -59, 70, -178, 379, -15, 196, -22, 282, -82, -125, -107, -83, -38, -176, 239, -89, 205, -10, -64, -35, -105, 27, -192, 140, -207, -282, 281, -134, -161, -216, 214, 449, 244, 23, -15, 29, -96, -13, -5, -143, 265, 15, 121, -146, -35, 103, 149, 52, 223, -341, -237, 147, -105, 14, -170, 25, 133, -377, -410, 7, 151, -49, 43, 147, -298, 535, 18, 57, 107, 140, 107, -49, 82, -103, 111, 154, -54, -117, -280, -40, -166, 61, 101, 271, 144, 128, 304, 211, -1, -186, -198, 58, -96, 64, 89, -91, -31, 139, 216, 152, 243, -132, 76, 341, 223, 322, 111, -190, -154, 52, -215, -49, 109, -192, 249, 160, -14, -77, 65, -150, 297, 281, -176, -119, 1, 176, -22, 16, -108, -59, -181, -19, 25, 264, -201, 112, 86, 33, 145, 66, 15, -303, -106, -167, 15, -100, 162, 78, -146, 166, 72, -103, -281, -104, 166, -12, 177]
4088A77l21M83l59K65K16o77N24J19m16L70j34j43j87R6k01L21q9j22R4P3R3j78
4110Do4j63K2L1L21l0k26L88m22J10j24J12P5q8M11o7l40O9j54P4mL18k37l45
4134c29N46n27L94N5j65M1K45o24N13q8k78J63J09J25k00q1L7P3J30L8Q8j27l46
4157b08L04j5J43l02k8M8p8K29p27P86k5K89l90j16q6J46J42n0R6o6j94M52l49
4180AL0j0o7k6N8P7M4k62J02L35l60O4j81L66J42k65j98M01m35k2L03j03rP0L6
4205I1j74K87k8J8m39J31R2J10P1j82J58p3m7o5l33J28P7L58m99L51K8j14J56
4228A02j92O7k63L62J06j68Km9K84k59m9j47j65J19J45Q6J53k39J53n88L97K31
4250H8j5m6L3l64N22l53k9L77l92N08l92K00l42j95M28J87r4O7j88j58J57k24
$$ y = [177, -144, 339, -20, 245, 461, -216, 308, 427, 11, 381, 247, 104, -83, 13, -188, 133, 44, -78, 16, 89, 182, 4, -60, -223, -201, -170, 151, 121, -105, 283, -139, -29, -153, -41, 34, -54, 357, 290, -50, 19, -135, -61, -65, 253, 16, -329, 217, -310, 84, 139, -26, 15, 260, -364, 149, 61, -217, -54, 55, 180, -20, -101, -64, 9, 139, 177, 265, 138, -208, 96, 81, 224, -78, -106, -58, -136, 93, -634, 152, 127, 416, 26, -90, -176, -30, 112, 62, 158, 92, -102, 350, 1, 31, 21, -46, -72, -14, 63, 107, -155, -53, 282, -78, -14, -195, 171, 313, 48, -150, 251, -184, -206, 97, -6, -15, 55, 91, -83, 204, 176, 194, -245, -114, -22, 88, 159, -23, 135, 62, 15, -50, -383, -255, -178, 180, -319, 32, 60, -54, 102, -90, -23, -286, 76, 182, 14, 16, -33, 251, -8, -57, -204, -369, -250, -105, -19, 134, -105, 48, -540, -143, 88, 73, 27, 60, -304, 218, -135, -164, 213, -179, 329, -63, 137, -205, -400, 28, 215, 121, 188, 0, -158, -1, -225]
4272b25J64nk58L43R8K08o7k56q2R7j2L2k80J92J26k22j63K82l0J59O8P1o2j91
4296a3p7J77o2k14K54J40q6o0m9j64L86l77J39L05l88K56l47L89J12j72Q9j96
4318D2k40K07p3R4l8j41J88q3L5J52n9k69K19K10k14J04p5j36Q0J20j30l9K56
4341B10k08mo3j14L77j88l99O86k59j98N2J61N4P9l27L04j07R8k03j27K4J68K43
4364B59n36M10l45M35l11Q5Q5j55K96k79J05l76M59O5j94R9k71J73l6K05O4j14
4386A23k37j13L97k48K58k32j40K04j52K62RJ13j07n3o8J27J24m09K23j75Q2M7
4408C5m96L56n4Q6J62P6m1P2m08J65p2R5k78K86j15L63k21O7k94N50l26k08J80
4431b0j38Q5k22K75j91J24K04l01j2P8R2K37m3k91JL47l57L46j14P9k04o0j88
$$ y = [-225, -61, -66, -324, 19, 117, 325, 258, 2, -80, 17, 5, 37, -243, -51, 75, -147, -310, -28, -58, 101, 169, 240, 178, -13, -90, 87, 25, -189, 65, 205, 119, 59, 10, -154, 232, -145, -6, 299, -89, 167, -180, 209, 321, 149, 238, 42, -198, 9, -64, 30, -8, -149, 39, -44, -9, 143, 84, -185, 34, 244, 30, 134, 59, -77, 3, 123, -7, -46, 210, 2, -2, -65, -179, 198, 10, -389, 297, 38, -160, -108, 53, 107, 186, -141, 163, 56, 154, -49, -176, -152, 16, 259, -277, 133, -212, 223, -88, -3, 82, -73, 223, -56, 49, -327, 132, 197, 3, 102, -169, 4, -32, 173, 237, 123, -114, -227, 170, -78, 180, -52, -192, 12, -140, 122, 131, 244, 137, 84, 16, 143, 267, -142, 81, -94, -12, 35, -461, -105, -159, -73, 89, 165, 124, 196, -212, -47, -119, -24, -302, -16, -131, 232, 11, 78, -216, 334, 8, -200, -20, -158, -73, -295, -20, -211, -87, 117, -184, -196, -118, -26, 211, 168, -123, -122, 225, -132, 214, 100, 179, -25, -85, -273]
4454b73Q8K73j54K99l15M6j83J14K57p8j13j8J60J02r2k25J58p3o3O7L3j21k37
4477c48N61J04k24p5l6J22k57K54j29M26m13j49j62L49l63k3M44j89L04l55j19
4498b78J34P0R5l2l17L17J11R5q4j5o7l8n5L2L6K01j10J36l22l4J38O3j05Nl2
4523e6j12K41j14q9J18R0j99J77j75K56j68j29J30P3p6J33k85N17n52J4P9J15
4545a2K81l03J60j03j65K45K2o8k41L77m4j00L5j57J59N3N3k88j16J51K15k81
4567a27M2j23O03m38R0o17L63K97Q6M1j39Jq3M22m22j36K96%j26r7J61R0j39K57
4591C02k63j3k36K47j42J16J4P1J92m57L24o7L5l33M25k02J83k15J34k4J2k30
4613a27J24JN4j83j54L91n59M85J88j2k79K02k30j53P2k62M13j86L66j45Q8l35
$$ y = [-273, -185, 88, -66, 233, -82, -36, -219, -105, 152, 74, -39, -57, 103, 205, 113, -112, 46, -27, -90, -23, 10, -111, -348, 213, 317, 93, 18, -18, 104, -153, 101, -28, 398, -15, -164, -326, 23, -340, -363, 81, -108, 196, -159, -278, -144, -74, 21, -11, -328, -11, 100, 195, 111, 96, 29, -9, -64, -32, 4, 205, 95, 231, -91, -125, 13, 76, -29, -24, -56, -168, 73, -41, -130, -12, 78, -121, 56, -119, 137, -31, -160, -30, 43, -33, 100, -185, 332, -220, -206, -127, -12, 269, -34, 126, 23, -142, 103, 125, 57, -184, 193, 149, 49, 84, -73, 86, 139, 192, -96, -212, -61, 154, -127, -85, -208, 395, -43, 47, -570, -207, 90, 176, 217, 78, 79, -4, 418, -4, -140, 156, 156, 30, -67, 94, 184, 45, 302, 39, 26, -210, 37, -105, 11, 25, 96, 288, -169, 155, 88, 123, -210, 215, 13, 196, -19, 115, 91, 103, -127, -3, -2, 52, -131, -285, 106, -453, 32, 220, 208, -71, 131, -99, -252, -180, -442, -29, -215, 151, 6, 94, -241]
4635b41K6O73k69j81k56K24j09J87K06n43L01P6l73K27Rj17J8K66k25O6k22J32
4657a25K91k63J60j23J16j5K18j60j63L8LJ61M2j59L1J8k3M5j04J47j54K68J6
4680B65O1m88k8L03j27N4l99Q6J89K25r0j56M1p7L7l68O67j59k3L15l29q5Q6K54
4704B54j47j7r6l0J67j60K56MK5N8m40J57j65k19M06J27k93M15k01r5K78m00q0
4727a96nK7J14L30l47J75q8J58kJ73l42k01J02m0R1l21N33j56j02M3P5j4J1J1
4751B9k3m8p0J68j00J1k38J16k3k0p0K42R4m19M09l0j98K19J05k62k45K13r1M15
4775A84l96K0R9K77l18J01J01l4o2k41J91p7K06j56j3K4L22L06o28J35m6M1k22
4798a86K05M8L3J4j67n8K0O7J20k8j00j4m5K42k80KJ72P6j26J38j43n9j32Q60
$$ y = [-241, -215, 458, 189, 8, -248, -24, -133, 54, 260, -283, 18, 94, -279, -52, -43, -160, -142, 124, -101, -35, -257, -125, 166, -97, 63, -60, 56, 41, 259, 99, -64, -26, -23, 138, 180, 21, 52, 70, 47, 92, -12, 135, -19, 249, 265, 326, -162, -190, 113, -14, 40, -359, -273, -84, 141, 51, -105, -64, -141, -104, -472, 195, 36, 13, 328, -1, -86, 0, 254, 107, 90, -6, -36, 131, -29, 227, 231, 256, 314, -126, 31, -134, -353, 53, 180, -113, 302, 101, 6, 284, -116, -196, -201, -174, -60, 270, -77, 98, 10, 168, 166, 339, -3, -204, -102, -142, -51, -372, 161, 5, -97, -54, 21, 7, 18, 29, 6, -42, -112, 56, -44, -33, -271, -155, -178, -198, -268, -26, 68, -351, 58, 28, -170, 49, 154, -108, -353, -140, -231, 184, -212, -192, -93, 184, -134, -33, 68, 34, -28, -269, -78, -155, 51, -105, -118, -94, 228, 534, -94, 41, -5, 36, -186, 19, 67, 100, 114, -53, -111, -91, -24, 96, 68, -32, -46, -91, 151, -129, -127, 45, 121, -5, 133, -10, -69, -201, 659]
4822F59p50K21j76J77j15j23J03J34l13L20j11J37j26J14l40j52N15m12J84N8
4842DJ36k51J3J71J04k1lr4j25j93K65Qr4Q5o3K66m11K67n0p3K61N6l67L34j22
4867A03J6j12o6R0q4m8J95r9k9J01K6j85K15p6n7j16K33o2j17J71j53J43j06J37
4891A20J53k65j2qk4J82j05j7o0K9j40O4k88J98P1J73k94K53l7l6R9K27l67M17
4915C33k35r7k0j13K32p3J81J28m54q2j5J79RO5j23j74J76k27K96j44J40m6K87
4938B23n39K92J06j3k6o0q1J21k34K38J29j54J12k40OK14j63q2K08l8k62J80l
4961f6P6L9o4L33k11K6l52J35L33l89K90k90R7L38m91K38K4P1l24J98j65n6O9
4984a41k03R6K18k3L48n70P1J23J99j79K98k04K31k09j74M69l15q3J38r0J20Q3
$$ y = [659, -91, 130, -46, 131, 16, -107, -4, 130, -183, 137, 26, 163, 37, 151, -189, -341, 174, -238, -54, 4, 140, -111, -98, 73, 177, 156, 153, 59, -66, -259, 6, 14, -80, 5, -58, 208, -203, 64, 14, -59, 202, 258, -109, 225, 103, 119, 7, -59, 31, -53, -101, 94, -5, -34, 67, 93, -92, 123, 47, -10, -126, 107, 45, -72, 99, -54, 89, -17, 120, 273, 8, -4, -12, -36, 146, 41, 24, -36, -7, -147, -83, -371, -173, -102, 71, -223, 30, -7, -43, 56, 283, -84, 333, 98, 1, -19, -132, 100, 27, 208, 336, -118, -200, -215, -36, -27, 38, -85, -259, -83, -310, -14, -158, -18, -64, 223, -316, -24, 82, 69, 43, -17, -98, 23, -211, 27, 156, 2, 114, -126, -120, 94, -69, -151, 57, 19, -243, -63, -66, 10, 49, -15, 318, 107, 133, -219, -84, 249, -140, 150, -140, -43, 295, -196, 42, 66, 137, -187, 11, -154, -210, -141, -344, -248, -30, -53, 295, -275, -204, -81, 118, -61, 237, 33, 264, 55, -119, 350, 35, -48, 90, 0, 120, 203]
5006B03k15J84j90J28k28K40j97J90l30J75nK6j8j94J81J79k33L8L0J88J1k81
5028a18K24L6k7L4q7p0k42L15l73K87P6O1l82O0j23M32r8M7j07J94j41j59l7K86
5052H8j27Q5K29m2j95k44K62k82L29k01J29j41J12RK1J9J9J54p6k84J05O5P4j33
5076b5j80J69J80k78L7J19k28k3J65q1M57j68p5K27k60j35J73N0K0O8m0M4j9r2
5100A05m5nQ2L0R1k92J83o6M6oq0J19j52K6k07K43k35j64M68Oq1M5m3j46K00m14
5126b92L97J64j31l8j47Q6k03J00j77J43m9J36K52l12J63k05p3m8j5J59M08l96
5148g8j53O3L3L0K99l76M03r1j84j03Q7O8k3J57J62n74K73L58m24J40jL1j07M7
5172C7n03M28j3J79k84J49K69l11J59n7k37M37k04k00M10m00J37k37K26M9j43
$$ y = [203, -12, 172, -18, 110, -118, 122, -75, 115, -215, -40, -45, -19, -37, -231, -50, 129, -104, -66, -36, 152, 163, -118, 106, 142, 115, 149, 62, -8, -250, 65, -308, -21, 55, 116, -266, -206, -329, 103, 5, 52, -55, 139, -2, -161, -198, 88, -39, 46, 275, 233, 38, -206, 56, -226, 103, -98, 31, -110, 2, 11, 32, 51, 70, 224, 148, -136, -31, 34, 108, -25, -205, -36, 144, -134, -97, 22, -206, -229, -64, -145, 312, 144, 69, 296, 36, -99, 74, 124, 144, 212, 172, 216, 197, 105, 60, 55, 137, 167, 258, -34, 149, 83, 129, 123, 43, 162, 10, 36, -171, 72, -163, -327, 141, 147, 66, 111, 68, -78, 122, -292, 105, 269, 138, 100, -47, 39, -164, -64, -241, -98, -147, -11, 241, -71, 92, -113, -186, -234, -249, -90, 318, -78, -231, -168, -135, -105, 194, -182, 221, 130, -54, -157, -70, -2, -25, 132, 294, -280, -7, 351, -73, 67, 66, 97, -10, 37, -466, -38, -51, 128, -156, -7, 262, -49, 110, 53, -184, 253, 49, -151, 259, -141, -4, -241, -15, 34, -109]
5193a09K49k53PK80n45M46K8l96M10l5j91K82j80K26K35n47K14j23jM5q9M4P3
5216G0N0k56J66j56n18O36j15n3J14J72K67n16L66o4j6l0k76J41L9Q4m9L34l46
5239D4l37J93jj24Q8P6K10k20J04p0N7q7j29J89L2N7k38K16J23j47j8p9j87J97
5263e1p4P4J83l2Kj23J79J23j26l2l80M08J44n08K71J42j63m6q7L87m49j6j9R0
5287a03K43j71R3R0k70M7L09k84%n13O68P7k70K30l96K0L94j89j16M5j9J8J29
5310C2M6p3K14l07J50L4n9k16J64j7k86L64n5j37j81J55L27N6r7l60L69K23l07
5333C9J69P3l08L37m01o3L02j41j72J78ll97o3K74L42m65o3M25j10J99Qj29O0
5356I1OO6k71N7J71j19J60m38L40O6j58K83j43k3N3l51K23M6l02K27J53j39j34
$$ y = [-109, 140, -113, -106, 174, -371, 75, 103, -293, 117, 82, -109, 173, -7, 219, 454, -93, 121, -2, -3, 42, -47, -3, 70, 120, -136, 30, -126, -644, -8, -123, -176, -62, 110, 377, -139, 227, 163, 147, 117, -159, -18, 21, 105, 56, 390, 44, -293, -100, -101, -225, -137, -61, 149, -71, 33, -37, 20, -67, -196, -7, 25, 82, -156, 60, 183, 36, 18, -61, -248, -51, -125, -51, 132, 100, 102, -21, 158, 281, 155, 123, -257, 151, 295, -213, 58, 200, 37, -9, -96, 291, -158, -174, -193, -103, 140, -31, 62, 152, -118, -71, 238, -46, -46, -559, 109, 186, -84, 146, -250, -230, 164, -25, -141, -96, -115, -97, 32, 78, 5, 219, -88, 62, 96, 37, -179, -15, -32, -318, 46, -9, -146, -327, -172, 155, 211, 114, -246, 123, 346, 39, 208, 281, -27, 310, -91, -154, 148, 7, -165, 13, 10, -387, -450, -176, 166, -299, -362, 63, -47, 152, 160, 31, 91, 97, 163, -108, -51, 120, 1, 161, -277, 63, 129, -29, 254, 111, 88, 141, -210, 13, 59, -243, -16, 137, -2, -136]
5379a36L38Kk94M51n32L49n1j58n7j49K32p6J62j87J64J41m39K82p6J18P6o40
5401d80L63nl34L48K86j61N5p3K1rO7P7rl6P6l05j54K20J8J55K19l64J24q9r6
5426h6K26J7Ok29J46n7N6K04m49N0M97k98K54n65K33J93k51Q0m47N80r4j54K13
5449A25k35L91k86j2R3r6j56L76j57k47J97j54K08o9m43N09q2n6J92J1rL0J6%
5473A46n07N01J2j25K21k33K08l15j0N3k4J60r8m5R8j99K9K09O8q3j27K08k4r6
5497B7j4j4J11J29Qj41J09M8m11L23q6m9Jk41j35J64RpJ40J32q2m0L1J90M5l79
5523a32N8O6K08k52K3km45M19J61j44J12j84K9j53k0L73r2j4k63J98J85q5L8L3
5547A17K94k23k99QJ68k10K94k51J20K23m24J01K11L5j16j27K36q6p8k22j70K31
$$ y = [-136, 202, 204, -90, 361, -171, 178, 127, -31, -88, -237, -5, -81, 81, -106, 58, 199, -240, 42, -34, 84, 160, -480, -117, -122, -456, -108, 178, 17, 72, -1, 20, 11, 78, 155, 146, 110, 186, -119, -273, -53, -35, 120, 339, -25, 99, 10, -86, 140, 157, 163, -66, 80, 23, 79, 283, -166, -116, 381, 83, 337, -228, 5, 198, -53, 27, -420, 160, 66, -88, 125, -110, 281, -5, -17, 76, -20, -176, 200, 43, -204, -7, -161, 47, -22, -465, 44, -38, -94, 98, 109, 100, 130, 146, 146, -361, 140, 152, 27, 248, 15, 223, -92, -102, -49, -73, 87, -11, -56, 42, -157, -128, 81, 149, 66, -61, 147, 123, 27, 13, -1, 110, 239, 247, 106, 215, 263, -148, 175, 89, 40, 41, -200, -335, -171, -162, -169, -29, 103, 21, -19, 12, 202, 247, -132, -74, -8, 200, -52, -29, -31, -476, -57, 104, -40, 72, -112, -83, -236, -256, 117, 25, 11, -252, -54, 131, 46, 84, 117, 411, 188, -111, -103, 65, -145, 149, -102, 18, 241, -183, -82, 129, 164, 48, -79, 157, 71, -7, -229, -399, -168]
5569a68lPJ31J05j97J1L7M8Q1K27k58k16J15N07m94P2K26N6m73J81k09M0j32L16
5593A0m8J72N3l75K52j54K19k46L90l41q0J85J37l52L61j13lp5j85J49J63j57
5615c8J67k86L50j70K27m34M61j19k22J74m41O24n74J69L4L45j92%rp2p3K75j73
5638B3J13K4j48o9j56K48j42K95m6J94k69m53M16j21J2L70j82k62J35n7l1K49
5660A43j15J38m20L40j90j5K09j37j84J03Q4j7M7K98o3k3r4l74J58j06M25k93
5682h6K37J80n00K26j19o5O4O0n7J07K0o7o1M42n12J33J71k00K24j12j94K42j48
5705a5k91K34K6K61o4J58l91K43J27l25p2K80l25J63j13k21J02R8K98j14K12n48
5727b77K76p0PJ34j55o8J89P3J72p56M67J15r6K16J75k65K02k35k2M1N0k75J91
$$ y = [-168, -171, -164, -33, 72, -125, -114, -77, -29, 52, 279, 21, -195, -80, 427, -67, 5, 231, 287, -186, -5, -214, -174, -306, 10, -38, 134, 187, -188, 64, -90, 129, -117, 273, -68, -148, 37, 174, -178, 183, 70, 67, -8, -193, -44, 119, -38, 129, -157, 193, 23, 250, -184, 277, 158, -64, 110, -331, 293, -281, -112, -78, 267, 75, 75, 66, -6, -79, 196, 23, 136, 160, 12, -57, -213, 35, -107, 188, 142, 336, 67, -386, 30, -91, -79, 291, 109, -153, -18, -75, -106, 143, 28, 166, -254, 86, -104, -119, 90, -47, -231, -128, -44, -61, -14, 284, 221, 198, 104, -270, -112, -218, 207, -86, 151, 331, -169, 57, -62, -127, -63, -3, -60, 47, 67, 0, -61, 381, -131, 2, 173, -27, 197, 85, -109, 133, -15, -306, -72, -46, 215, 151, 309, -82, 161, 288, -37, -109, 171, -154, 9, -104, -325, -223, -125, 173, 59, 271, -277, -1, -71, -64, 70, -85, -153, 36, 109, 281, -475, -8, 107, 11, 227, 402, 137, 339, 104, 82, 123, 173, -102, 89]
5750H9j60J09Q3K46r73N15J91p1k05J76L5j15K82l05M14j65j60J77j8k45N70p52
5772b82K62j14J39K37k00L2ro9J09J21r3k34L41j11l09O39m96K14j30J56k04K25
5794B24l31Nj7J59n9L2JO3mL3m4j29K69n7k67K32o2J11j1l81J86J73m27M81j51
5819B9N3j06M0l1k47J43J38L40k08l4l15M88k03j69K96l66J25M18o38J11M06r3
5841A77j88n5k5j1K49j54j54L8Q5J51K4l36M5l7J61n3J47R2j90L10k53J29m3j96
5865h7q1Q0J38L1k03k28J80N63o71M50%k50R7J49k89O8O8J09k62R7K33r0L08l35
5889G5j3j49J95P8K3j1M0l03L16j38l9J3k41j60L24j49j7q0L80j65K31l64J60
5912Fj14O8n4j30L03j13k26L31r8j45Q2k43M05m2K7j31P1L2p2J15l31M10m35J91
$$ y = [89, -71, 38, 121, 367, -606, -91, 100, 29, -176, 0, 35, -80, 202, -103, 311, 146, -14, 163, 145, -100, 470, -282, -20, -134, 5, 242, 42, 74, 65, -4, 105, 226, 133, -101, 240, 129, -180, 459, -37, 177, 47, 203, -1, 224, -107, -102, -119, 40, -19, 13, 14, 77, 73, 106, 62, -67, 202, 145, -122, 110, 48, 159, 148, -233, -47, 126, -301, 180, 29, 82, -24, 16, -15, -262, -119, 19, 359, 151, 117, -198, 290, 87, -82, 214, -152, -27, 391, -247, -136, 270, 177, -11, -66, -91, -102, 147, -7, -161, -123, -38, 113, 137, -199, -154, -191, -30, -83, 64, 156, -34, 276, 23, 152, 109, -87, -168, -88, 50, 81, -122, -350, -170, 393, -278, 172, 172, -78, 19, 168, -121, -53, 15, 124, -138, -41, 192, 102, 410, 75, 62, -87, 108, 186, 209, 198, 238, -65, 251, 113, 74, 87, -154, -314, 10, -139, -156, -236, 144, -21, 210, -154, 6, -108, -40, -94, -224, 79, -34, -260, 71, -27, -172, -90, -333, 72, 30, 57, -74, -3, 29, -43, 72, -259, 151, -284, -93]
5936i3m2J47J81l26M26k93p5N1q3M14k72k48L11j42q4M78l83k15L22Q4N5m06M91
5959B98j74k10P4j28L16k47J11K52j52l36J58J53j77O8J11j18Q2j80R4m9Rl10
5981c55P2R3P9K57K4r6j80J87j54Q8k20L70j17J52n33L3K39M4k64K04J51k06J85
6004E3j29j97K28n8K33N8k15J62k72K60ok32K45k33K55j22L5M0l12M71j88k35
6026a59J17J21J20m76L99k84K18j06K33l38K08pJ3l5k33J12J94j94J24k1K5k16
6048a85J07K23M7k02N6r1Q4r0j36K92k96k21L31J56j18J21o1j87J65K63k47Q0
6070I1l04KK21k51K3J56L47j23p7J73p0j94j30k3J43K5j3m5l61O5J36L05j73K64
6094A87j05P3k90J19k00K62J02k8k46Qq4L52o0l38N30j68l16R0K72k59j11J98
$$ y = [-93, -135, 12, 193, -133, 293, 0, -75, -24, -107, 307, 35, -213, 98, -44, -128, 350, -33, -248, 74, 158, 213, -193, 298, 124, -86, -12, -140, 176, -71, 40, 292, 140, -196, -38, 115, -62, 6, 117, -1, 81, -99, -5, -54, -45, -355, -283, -190, -111, 146, 170, 74, -106, 81, -73, 15, -205, 165, 48, 200, -333, -300, -61, -17, -281, -77, 74, -132, 53, -76, -273, -45, -103, 130, 188, -27, 135, -137, 123, 117, -115, 130, -103, 152, 30, 65, 105, -207, 264, 76, -159, -42, 79, 199, -277, 122, -162, 56, -50, 183, -155, 53, 46, 59, 24, -209, -97, 97, -97, 27, 6, 31, -185, -78, 145, 192, -10, 46, -45, 39, -51, -187, 105, -191, -412, -81, 75, -43, 78, 17, -170, -5, 258, 11, 91, -213, -211, 10, -241, -218, -62, 285, 162, 85, 258, 188, -6, -136, -159, -16, 9, -4, -49, -410, -345, -209, 96, -77, 187, 82, 155, -135, -16, -216, 46, 148, 120, -126, -118, -202, 150, 90, -248, 282, 114, -202, -112, 160, -99, -210, -12]
6116a2q5L55j89q2k4oK89m20K15k81J14J08j03J32J8r5%j1k95J90K11k9L11k68
6140D3N9O2l54Q3j26L33l29J68k07J50k00K89L2Q0jk05N70m15q2N0k6M8OR9K58
6165C85k95m6j31N64j77m13J17K47j03j50Pj11J46J20j51j30J37j62J26q7j5K18
6187I6k35K37j23kK27j32l8J95N4m78J99J97r0k92L18K00o83K26q8K02j64J09
6209f5J49k33K00Q7j27M7q1L6p7l61P08m34P3o3L75j88K04n37O02m55J20j15J94
6232E9P1n7K33n07J29R7j06l24N19k05M86m21%J81P5l21j42O92n16O7J48l47K49
6255F0K19k11R7k37J21o1l00O16l38J20j53K63j4j07qj82Jj90L16j03J14J17j23
6278A7J22k94K24k27L29l99K56J51j94Rj66K47j35L24j78k65J04J72k97l2J65
$$ y = [-12, -97, 258, 69, -13, -37, -43, 246, -174, 41, -240, -126, -18, -121, 11, 29, -66, -66, -77, -372, -182, 29, 0, 311, 43, 102, 164, -190, -107, -233, 100, -229, -61, -268, -118, -318, -29, 3, 83, 82, -123, 447, 32, -50, 0, -26, 22, 28, 127, 385, 90, 44, -87, 477, 300, -113, 4, 251, 148, -2, 5, -106, 40, 160, 9, -121, 16, -146, -20, -107, -122, 96, -139, 98, -25, -27, 200, 68, 30, 225, 279, -199, 0, 197, 107, -185, 133, 333, -350, -124, -212, -10, -174, -65, 84, -149, 51, 138, 11, 58, -23, 13, -64, -425, 283, -151, -78, -141, 234, 46, 250, -287, 315, -140, -20, -135, 59, 130, 73, 306, -201, -72, 25, -81, -405, 114, -91, 395, -26, -26, 155, 230, -91, -233, 459, -57, 10, 158, -189, 60, 279, 68, 165, -72, 49, -12, -312, 304, -34, 86, -67, 196, 182, 75, 67, -115, -114, -304, 12, -91, 23, 140, 17, 139, -155, 69, -158, 171, -228, 28, 179, -15, -6, -172, 75, -60, 264, 86, -179, -75, 97, -200, -232, -67]
6299f7k32K89J99k94M51n78K29R9j77M9Q4j17k8N9o4M7lM4J31R4k30l2J74j82
6323e5L73n27N35j47l55q6L42k57M0K67N0j48L98k75r4m6QKj95O6PK65j75k30
6347b37K41j08l05P93n51L58J44j52l57M36j03k14J05n7o4ML70k90l2m07J54M00
6369A28l52K22J63l19R1K14J04k48jj12k90L81K83m4k77J84l5K18n0q8l70M44
6391B46j5l93L72m04L22K46j27n36K96J74J02m47J2J92k96J47K62j24l11J48k
6412a36J60l59K04K83l85J44J07q8k5l32L72K7k15M10n0J14k49J5J85j75J8J69
6434A94j61l37M35j84n8P3J9rJ76J97j09m29J76N3L35j60k25K26j73L15k60j29
6456c5J02Q6j12K07j48j84k7K92k86J30k02J13J74L04l67o4J12k30L87k07n0N6
$$ y = [-67, -299, -10, 189, -105, 346, -232, -3, 96, -81, -32, 52, -65, -93, -34, -98, -51, -54, -10, 121, 215, -15, -47, 127, -55, 318, -209, 326, 179, -176, -262, 80, -177, -137, 130, 180, 32, 430, 155, 61, 15, 23, 25, -170, -104, -97, 168, -7, -237, 4, -104, -409, 384, -167, 191, 335, 183, -174, 262, 159, -55, 50, -7, -71, -67, 303, 13, -19, -426, -272, 128, -224, -2, 161, -158, -67, 147, 251, 3, 2, -110, -400, -19, 264, 220, -57, 127, 92, 310, 260, 172, -198, 246, 231, -162, 210, -194, 128, 374, 247, -289, 7, 181, 283, -164, -152, 40, -256, -109, 153, 29, -282, -134, -136, 24, -335, -131, 152, -233, -89, 18, -70, -95, -427, -55, -28, -243, 167, 117, 231, -18, -3, 182, 7, 25, 194, 33, -304, 131, -53, -111, -38, -19, -28, 148, 345, 236, -193, -17, 36, 371, 211, -14, 212, 39, 354, 94, -35, 67, 153, 41, 248, 100, -84, -111, 181, -105, 25, -177, -64, 110, 414, 47, -17, 95, -135, 252, 45, -5, 51]
6478E1M6k3r9P8j29k11L96p0K03k88n6K21j15o0K39j33j31K78k95K60j60o0q3
6501a41J64k3K73m96qL48j55M9j57o7J57N9n5L32n65M67l12J75M34l86k03L00
6523A90j00k94K79k58J85K76j82j91L07k63M57n48K12m1m92M73R5j82J04k23J28
6544f8m2%J87L6k90J05J56K10j90k46K43k18J49J3j01j47J23M55n37P1K70l5l15
6567a71K06k93P1J1J2N1J10J90M0m53O26o7m11R8j20j26L28o2j65K8K11k36q6
6590b08L85k44L19n47M29n2j60k3j55K32o2L36j14k75K72R1k11j21q4K24k62J42
6612h8L73j51j37Oj92L83j79N3k80P42n71K25K58l81p5P0k08k2L29K3J12m65L78
6635B03J10m96K83M2j58K85l57M1j9l52M38K09j15L73o81M21k35K01m1N0k34L3
$$ y = [51, 97, 74, -25, 53, -76, -287, 109, 39, 242, -46, -102, 119, 4, -56, 183, 50, -81, 197, -98, 162, 2, -58, -141, 23, 0, 273, -223, -231, 117, -38, 11, -146, -213, -56, 3, -52, 280, -285, 182, -130, 45, 479, 93, -110, 190, 90, -204, 75, -183, 2, 278, 96, -95, 212, -51, 406, -142, 70, 29, -463, 10, 105, -77, 27, -196, -68, -110, -110, 77, 113, -177, -72, 84, 294, 104, -142, 101, -117, 32, 45, -56, -203, -80, 375, -162, -91, 179, 144, -171, 35, -258, -187, -176, -164, -113, -3, 187, 227, -226, 400, 333, -78, 20, -100, -226, 102, 40, -125, -97, 114, -122, -208, 177, -67, 252, -295, 134, 82, -78, -101, -256, -24, -86, 250, 136, -139, 133, 224, 13, -108, -192, 32, -230, -88, 285, 134, -3, 3, -189, 194, 15, 68, -212, 530, -41, 184, 442, 61, -14, 56, -152, -174, 155, 178, 290, -175, 203, 313, -183, 100, 142, -16, 269, -88, -47, -66, -418, 20, 229, 114, 487, -194, 227, -8, 193, 152, 202, -32, 1]
6657AK23l94L32j0n6n4k80J05J31K4j86K85j59j32J25K15j88J63k75J70k07K25
6679E8j29L3K16j91M3j63M29k46J35p4l01J98Rl2q1l69O95k02J17M3m54L41R7
6702A72j83J38l15Q4J08rj5J75P3l31K13l42L60j93k98L54m7J20%j58J51kM6p7
6726B4K02R7k16j03k2M5j47O9M4J51j57L4Q7P8J96n60n1J43K39k37k4J12K42o7
6750A79j7J17k50l3P2L9q2mp4l34J40K53n21M80K09l10L09l26M52m48j4L24Q4
6773B45k59n9J69O9n4l10J10L08m24J94K15K49l88oK14m16K41Ll37K79L7J71J8
6796B69j53l14J07k16j19L35j53K52p1N7l40J00J55O5j65J28k23P9K71k7n0K32
6818B19p4j86p5qK05M1l58L01r5N2k3K29l76K76j2R3k55j54J02K24J11k69ln7
$$ y = [1, 224, -170, 162, 152, 96, 42, -238, -133, -2, 22, -164, 121, -38, -170, -45, 170, -18, 145, -130, 40, -167, 58, -71, -38, 178, -13, 30, -133, 296, 50, 185, 111, -190, 8, 17, -15, -96, -465, 230, 28, 145, 188, -266, 75, 172, -11, 127, -188, -104, 4, -5, -20, 155, 228, -103, 110, -232, 128, -65, -363, -9, -56, 64, 64, -94, 57, 55, 101, 24, 226, 323, 107, 4, -18, 27, -120, -51, -7, 144, -13, 21, 108, 186, 382, -178, -229, -86, 153, -84, -108, 4, 246, 179, 162, 279, 29, -4, 68, 107, 25, 21, -53, -387, -247, 6, -515, -35, 174, -136, 173, -153, 299, -149, -163, 161, 245, -14, -73, 96, 165, 111, -199, -89, 219, -205, -11, 204, 453, 65, 59, 273, -143, 98, 101, -236, 43, 80, 251, 269, 116, -198, -91, -307, -426, -91, -244, 8, -63, -6, -346, -246, -91, -26, -191, -63, -286, -207, 64, 37, -13, 219, 145, -41, -116, -124, 81, 122, -236, 65, -30, 22, -1, 228, -148, 128, 116, 209, -46, -200, -98, 126, 237, -32, -35, -92]
6842i2J52JM8j00P4n05K30L83k77N2K65l80L48o4k32K35j39k61J93L9K51k42K
6865a9n6J85o5k70M3K05NJ83j39o0rK23l62J1L72j73K77l63k76J45r2LJ4L76l54
6890a96j4j6L68J59m11J89J3J65n8l68K78K5j7m4n5k79N33l05J33k07o2P6J72
6913G9j0j86pj82J34k8J15J91j56j48J39L67n40J17K08l32J90j16L61j89ooJ79
6936A74k87K7K33q7l54J76K23o1K13j64L3J22j21k54J24J21j22Q8k09K40j78P9
6958A6Q4k08j01J83l14K07N03l86m4J8j24L67k69jp9J97j66K8J33k76L54m07K09
6981g6O3J9k37p4K57J84k54M2L24K3O0j57j31l74K31M9O8N3k0j14K37j74J63K62
7005D24k41j23k70M8M8j3J5K83k57K1J37n8j7J39l1l39J27R7J35k43J11J8O8j97
$$ y = [-92, 60, 61, 109, 9, 83, -422, -192, 191, -86, -34, 231, -149, 199, 135, -97, 138, -1, -262, -69, -30, 221, -21, -19, -75, 110, 45, -225, -182, 23, 28, 211, 72, 12, 3, 226, -136, -125, 247, 74, 351, -12, -288, -143, -235, -232, -218, 158, -196, -210, -226, 142, 301, -110, 79, 92, 257, 199, -169, 109, 134, 117, 73, 18, -261, 272, -33, 100, -107, -169, -93, 79, 69, -117, -124, -306, -172, -200, -85, 106, -50, -198, -59, 308, -232, -115, 93, -239, -49, -165, 196, 7, 1, -5, 174, -113, -86, 147, 60, -294, -118, 105, 44, 257, 93, 126, 248, 127, -127, -3, 118, -4, 84, -125, 115, -63, 16, 100, -108, -209, -26, -340, -133, 370, -16, -60, -42, -166, 201, -68, -69, -148, 49, -117, -89, 44, -232, 122, -285, -76, -13, 6, -231, -305, -48, 136, -118, -76, 248, 271, 331, 174, 43, -331, -100, -51, 17, 70, 50, -64, 173, -1, 162, 424, 183, 60, -210, -162, -114, -127, -112, 171, -86, -65, 72, 14, -3, 136, 105, -234, -107, -10, 125, -118, -7, 11, 79, -118]
7029a18O2J07J13j15o9j18K15J89m06k1K31n8o6k66J28Q4O3j32J42K34j12l00
7051b13K20j73k1L80l7l39j37j26N30j67r3J25p5K59k47rL19j60j45K7J84J15
7073B17J11n38K95l66L95k54J32j84K3K41p1n3R8Q9k44J17k12L40m9j22K86m59
7095b08K34j27K08l7j46K63l09K66l7p7l51M52J08n40K62L10m54j0J42n7O1K1
7117b6j65L24j19j13l7p9L89k63M40k07k40k7k9RK83j93j04J96j38J15p0P2J52
7140A70j65j09o1m6L47l5j83L0ON7K70m65R2J14O1k59N88k30k42N0M34j09p07
7163c92N57o9k41K89m01L97O9k64J05j7k75M41P6l39P8k36L5K17j66K29k08K54
7185A39j39j40J22L0K6q1K45m75K44J53k7n3J17j12p5j85L18k7J92m93mo5K93
$$ y = [-118, -56, 51, 164, 49, -20, -138, 77, 266, -140, -161, 70, 12, -54, -320, -192, -108, -45, -177, -35, 199, 87, -213, 7, -166, -187, 193, 156, -183, -320, -446, 84, -83, -176, -51, -126, 133, -114, -123, 196, 36, -109, -82, 102, 217, 328, -210, 85, -281, 114, -140, -8, -192, -169, 72, 1, -52, 46, 135, -109, 8, -204, 136, 87, -35, 251, -208, 26, -101, 107, 70, -76, 187, -122, 144, 107, 30, -321, 131, 239, -301, -39, 271, -183, -193, -51, -108, -47, -26, -191, 133, 14, -99, -136, -215, 174, -89, 351, 144, -96, -123, -152, -143, 140, -53, -157, 39, -99, 16, -54, 18, 170, 5, -104, -165, -211, 136, 101, -82, -52, -46, 11, 281, -184, -92, 22, 83, -176, 412, 182, -60, -10, 424, 315, -392, 165, 96, -145, 144, -257, 140, 209, -55, 50, 33, -242, 199, 275, -64, 14, -222, -187, 30, -136, 93, -115, 139, 0, -140, -18, 12, 38, -43, 202, -273, -29, 124, 97, 44, 161, 49, -26, -211, 107, 80, 272, -221, -225, -290, 3]
7208Ck92K95l1Q8j50j13M41m63M27k80j23K88p0j27N9J62K36m95L53k23m3J26
7230F8k10P3K0k5j95J51M8Q1Q8K5o3q7O4p2L5J02J51k47J25jj10j17J70j57L00
7255B17k13nj0K59J76k36M2m10p0J84K25k97M08l02L7k42J03pJ89j78J41K65k92
7278a6N2J8p3m4j32Q9L44k58R9m5j39M3K35rm31l1L74R3k27Q2q3L17l05j30M81
7303C04m81j69M08j23K75M8k01j61L18n1j94J00j71L19j37J1j74o8NK12l5K23
7325B58r6j64o1J27n7J04j00j57L03k32P5K65j61j38J39k05L12k20l5r0K22M9
7347A38k20K31m6k99K16j07K31k09P8K30j52K59k01j84J82k37O6L1J02k40j14
7368b45J41J73l3L1M5J09m01j1L2L5K21r8K32k64J21j47J67r7j8j70L10L7j04
$$ y = [3, -289, 6, -25, 63, -87, -200, 241, -222, 205, -75, -198, 90, 20, -107, -48, 114, 350, -145, 208, -15, -58, 68, -142, -69, -49, -74, -269, -118, -70, 11, 99, 124, 61, -26, 38, -34, 1, 103, 254, 7, 132, 131, 21, -96, 74, -83, 217, 4, -1, -11, 248, 424, 188, 230, -180, -250, -66, 159, -138, 270, -32, 5, -237, -134, -141, 48, -130, 11, 276, -16, 36, 54, -19, -63, -195, -106, 238, -20, 79, 34, -105, -62, 173, 164, -267, -298, 76, 169, -58, 24, -59, 258, -47, -177, 304, -177, -346, 62, -61, 214, 262, 61, -100, 218, 167, -27, 73, -98, 221, 84, 95, -79, -147, -142, 70, 35, 258, 162, -2, -63, 64, 7, 111, 11, -146, 157, -75, 0, 265, 104, -34, 105, -100, 212, -8, -43, -133, 89, 138, -82, 149, 103, -196, 20, -87, 144, -65, 13, 243, 91, 350, 149, -35, 147, -90, -24, 7, 109, -131, -245, -104, 69, 36, 67, 112, 221, -180, -191, -159, -124, 97, -1, 231, -33, 88, -59, 108, 11, -7, -177, 133, 170, 66]
7391F6k38R6K02l09P1R0K8j58N8k4j72N77j83K12k19pP5n5R5j64J70k03R6Pl05
7416a94J35k3j99L81k33p1K03j26l8K30k39J56K20l23n5J79L6r7K39l00O6j66
7438b19K56j51K77rj60J28Rk08O4k10N31l38J39j08l17M24m0J62j67Q2lj90K58
7461B10m22J33n7J92J01m50L60j61J73j7R1l02L9J79pQ4n7k41j09O32l73L95j17
7484B76j01q3m1j76R7K49k9Rk57L39n67p1N55k24N15o70R4K02p9Q0J64l26J22
7507G8J05O8m64K55K47m25Rl2N07m04K08k44J05j41P1J65k83J28oJ95l11M25k12
7530D4j05R9j6K69l47K05m02j45L56k03M62j75r8J29L4J3n5m00K94j78K21K32
7552B34j85P7k04P1j45j06K95j66L3J53q1k77J85K66j67n0K23k86J16J39k57L9
$$ y = [66, -172, -76, 126, -183, -112, -22, 6, -152, -94, -118, -290, 287, 104, 316, 97, 90, 165, 110, 205, 41, 211, 8, 104, 111, -194, -59, -82, -281, 100, -133, -204, -1, -127, -165, 65, -174, -18, 202, -121, -176, 3, 39, -58, 181, -119, -53, -219, 37, -114, 163, 154, -6, 122, 131, -77, -13, -223, 308, -30, 109, 1, -316, 108, 68, 230, 63, 145, 142, -48, 210, -212, -79, -136, 56, 157, -293, 67, -94, 79, 62, 153, -149, -110, 69, 62, 146, 89, -152, -261, 371, -2, 393, 276, 175, 92, 51, -125, -28, 221, 192, 201, -56, 283, -284, -355, 200, -24, 491, -179, -85, 117, 38, 118, 282, -44, 78, 183, 251, -213, 42, 289, -136, -127, -159, 348, -56, 152, -92, 13, -128, -57, 108, -175, -47, -53, 142, -169, 256, 44, -61, 38, 22, 291, -56, 149, -253, -398, -42, -245, 217, 42, -56, 73, 107, 120, 65, -335, -41, -219, 2, 234, 49, 126, -78, -7, -152, -258, 37, -129, -96, 57, -24, -301, -116, 150, -17, -67, 156, -130, -14, 125, -132, -93]
7574i3K82p4j72K78j64p4K33l06k31K14P3K79j48j11J1p8o7J94m14L48nR3q9k28
7598b49Q9L30P8l33O5L7K52p1p3k43J38j64M05M4j21Rk59k52L01J02k40M2J33
7621B0K46p7j02O3k93J15J26n3r1l8j63n4L74K19l64k15K63K1J59k38N6Oj28P7
7645g1K13k1k11j92M40k71K4J18P3j59J86j32J32j01J81j38M6q3p2q2m1L45l88
7668b04J64Mn1j26Q0K87k01Nj34J21L5j58RL10k94J10L93k89Q4k59L30m6k4j13
7692C3Q0j35Q4j71K45o76M96P6O1p9k7Q9l34K10KJ32M6j16J06j29K4J27j12J74
7716B06k16j25j08L42J02j80R2K84k58k66K2O4N7k37O47o43J23J15J86k3j22j05
7738d3R8J63j90K5K97l44R4k6j40L1j93q4J78k54K08J74Q7L2J86j21j44M9r9l0
$$ y = [-93, 189, 115, -57, 221, 57, -17, 216, -90, -321, -107, -34, 245, 97, -14, -3, -81, -148, 46, -368, -20, -25, 68, -21, -249, -160, 170, 248, -85, -20, 17, 269, 198, 125, -118, 20, -144, 261, 305, 184, 193, -66, -318, -17, 85, -155, -113, 20, 266, 189, 87, 150, -143, -28, 98, 45, -46, -84, -247, -301, 73, 292, -72, -287, -24, -3, 156, -82, -26, -20, -148, -71, 142, 121, -90, -282, 158, -113, -89, 29, 102, -57, 129, -3, 129, 28, 209, 71, 117, 34, -38, -120, -161, 184, -204, -40, -36, -87, -213, -133, 154, -47, -42, -176, -55, -20, -178, -169, 141, -153, -43, 350, 61, 145, -114, 216, 170, 146, 33, 113, -22, 62, -109, 136, -540, -44, 32, 93, 14, -13, 76, -258, -48, -46, 86, 132, 16, 122, -7, 17, 144, 32, 206, -10, -135, -243, 99, 201, 21, 113, 397, 139, -127, -105, -41, 16, -221, 426, -217, -94, 21, 207, 184, 62, -43, 55, 218, 28, 53, 350, 6, 100, 74, -66, -35, -228, -312, -134, -388, -180, -6, 81, 113, 299, 178, 34, 83, -16, -46]
7762d6j2M56l01k54N3L50J02l75k48L59k34L29l7m08n8O39q2k98n8M69o17K56
7784a5o8J70j61J99J13N5k08j01K39l1k29p8J53j95L84m68J91L28n25K40O5L5
7806I3R0j67K93j74j83Q9J45j8m4j05NK54j97r4J58q9k4k21K69k09L37o9l41l8
7830b40K74j33K93j9q4k58Q6p2j99j48M87j39P6k88K58K54k62J10o7K86n30L37
7852B2j08O39o96Q6K8k7K17j49L1K6j25j23L25n1K31l92J74j2OJ65k89j9l83N91
7876A67k18J19lj17K94k89m0j15J20%q5O1%N4L56j12l08l8K48j61J13J8k23K26
7900F7j65j29Q7l8K19k08L07k43j84R3O5l9M5J73l02K28OJ83j1J50o38L39q6k50
7924c31L58J9j10r4M1J80l73J61J87m4j58L21l6k32J5j00Pm8Q2K38r5r8J02N3
$$ y = [-46, -58, 398, 97, -157, -104, 246, 348, -27, -275, 84, -150, 179, 142, -266, -324, 315, 233, -65, -123, 346, -271, -15, -83, 87, -74, 125, 238, 293, 85, -16, 223, 192, -37, -115, 38, -157, 227, -241, -50, 278, -247, -7, 58, 93, 183, 16, 309, 135, -48, 41, 186, 168, 124, 19, 24, 278, 81, -13, 145, 56, 32, -189, 80, -129, 208, 139, -202, -240, 34, -99, 194, 175, 91, -167, -81, -153, -352, -500, -13, -152, -76, -364, -106, 148, -114, -4, -71, 215, -315, 22, -86, 553, -143, -57, -29, -56, 161, 12, 43, 69, -56, -179, 146, 95, 326, -66, 108, 96, 102, 267, -22, -41, -424, 167, -51, 68, 65, -52, 242, -47, -87, -202, -82, -82, -167, -106, -106, -52, 304, 192, -116, -154, 94, -67, 46, 64, -159, 67, -98, -227, -140, -178, 41, -167, 140, -103, -287, -194, -129, -168, -123, 50, -252, -24, -18, 165, 154, 304, -334, 5, -81, -331, 27, 46, -64, -158, -117, 63, -310, -149, 38, -6, -164, 157, 121, -111, -96, -196, -189, -237, -155, 83, -12, -110, -8, 45]
7948D5J67l45R4j35M0J15j41k5q4L36k88j00J40J72K27l35J19K40j25r2j60K08
7970G3j59J83p1k7k9J2j19L51n52M0M55q0L1J00M4l77J56J19J8j20k1L1N7j76
7994f1J29m1j52n1K69J55k57l5K68k27j35Q4k63L36P6j38K20l9P4k17K01l70J58
8017a6k97K5J39J57J82j02o2J1Lj13R6j58J55o9l2j3K8J27q4J87m46L36o7J51
8041A38l26L65l6J11j66j53J77k35R8k00J9J20j06L99l6l38K04M8Ol3k70O21m96
8064h9o8L41k90k9J75r1k27L15L4N3l25L05r2j8J27k87n1M26j36m4j4J36j36p
8088HM2n1J45l38K25O5j26R1Q6r9k14K8R7O1R2M0m16L23n9mK02j9j46n3J09r2
8114cP6L5k33K64Rm12L91j05k1m2m6J66L21o20K5L73p0j0n18K68L00Q4n34L66
$$ y = [45, 212, -133, -39, -174, -134, -19, -160, -185, -269, 67, -221, -321, -181, -9, 218, -117, 2, 242, 117, 25, -135, 73, -86, 97, 26, -1, -30, -18, -137, 214, -338, -298, 157, 77, 108, 208, 252, -125, 31, 150, 168, 48, 27, 58, 115, -61, 68, 27, -125, -176, 93, 248, -9, -44, 224, -3, -138, -54, -317, 19, 95, -43, 177, 138, 212, -5, 196, -174, -16, -313, -288, -149, 8, 190, 88, 26, 37, 40, -73, 23, -135, 20, -49, -81, -94, -66, 61, -23, 164, -282, 54, -13, 138, -188, 177, 141, 252, 86, -67, 110, -125, -27, -227, -208, -88, -194, 205, 169, -169, 35, 83, 89, 56, -214, 407, -89, -157, 184, -106, -135, 40, -51, -278, 37, 71, 124, -201, 104, 12, -6, 121, -166, -217, 209, 73, 29, 15, 151, 15, 8, 50, -1, 144, -194, 31, 96, -30, 61, 147, 48, -166, -138, -41, 20, 112, 152, -264, 59, 0, -4, 198, 179, 33, -20, 89, -3, 73, 108, -125, 139, 148, -264, 127, 22, 1, -41, -87, 79, 400, -220, -195, 178, 108, 98, -420, -152, 148, 232, -302, 64]
8138F4J64k19j14K22K46m1k17rJ2M1j40l1k0M6p1K00q2J61k53M20k54m06L85j43
8162c9Lk27K38K7K2jj99L39j28Q8j87j2N7J13L8p4P6k39k4K07R0l02J37j32K43
8187A14m8J89k47J61
$$ y = [64, 228, 9, -105, 117, 363, 322, 105, 96, 108, 149, 9, -22, -42, 4, -67, 133, 51, 212, -41, 379, 125, -281, 104, -39, -36, -263, -25, 2, 24, 23, -176, 163, 35, 123, -64, -76, -19, 94, 132, 58, 134, -105, -129, 78, 168, -134, 3, -129, 114, 66, 255, 8, 169]
8191A69
$$ Imaginary data points
##PAGE= N=2
##DATA TABLE= (X++(I..I)), XYDATA
0@%%%%%%%qJ6j6J6k4L2m0M8n6O5p3Q8j05J23j46J70j95K26k59K97l37L81m33M88
31B58n48O16o90P71q60R57j064J182j311J452j607J776j965K179k415K681k986
48a574L333l733M205m766N448o305P408q889J1005j4293K0132l3592J19878L1751
62A30008k34482J8956O3002L5602O9789J9456j76588p0417J50255J08164o8583
73D5162n9244l3088l1328O5998J25806m2459j47100j4962R0247L9032J7480j3292
85D2252r8791m5718J11195Q1080n0433o1457k5865p522O8694P4277m9575r4313
97e6176j468N2596M1950J9769l9758p5668J255P9746L7383l3894m2803k7773O493
110c8348O2151M3370n2163o5901J1579L8885K3424K0536k7432p0892M995P5569
$$ y = [0, 0, 0, 0, 0, 0, 0, 0, -8, 8, -8, 8, -16, 16, -24, 24, -32, 33, -40, 48, -57, 66, -80, 90, -105, 121, -138, 159, -178, 203, -230, 258, -290, 326, -364, 407, -453, 504, -560, 622, -689, 763, -844, 932, -1033, 1146, -1269, 1412, -1574, 1759, -1974, 2231, -2535, 2913, -3392, 4016, -4873, 6132, -8161, 11971, -21621, 98257, 130008, -104474, -85518, -22516, 13086, 82875, 102331, -74257, -144674, 5581, 113745, 45162, -14082, -47170, -78498, -12500, 113306, 70847, -76253, -91215, -968, 38064, 55544, 42252, -56539, -102257, 8938, 90018, 39585, -21872, -47737, -55259, 13435, 87712, 38137, -56176, -57644, -5048, 36902, 56671, 16913, -58755, -57500, 22246, 59629, 25735, -17068, -44841, -38348, 23803, 67173, 15010, -50891, -39312, -427, 22997, 43533, 16101, -54791, -49796, 25773]
122B5773J9747l3486j9759k5392n780O1266L9444n4349n2117J7101K9165K1489
134B3102J7138l1642n8568J2008O5955J6618l4714k5492j5498M816N0374K8459
146E2556n0296m6685K0744L1191J3472R039k8098m7779J7209N8123M931l2016
158B391j7902j2120R253M5896J4032m7817l2666K1982K7496J2855R33l0253l4223
171d0143K1989M8408O13l2615j6184l306J2045L5510O712m3960k4084K6242K2576
184A3803L665k248k4837k4286K4777L7771p934k7448r540p32J2910K8463p99l6669
198a3104j5084K2876J8566K458m788k0946j6892K2383K9899q424k4647o298K475
211a1526J1015K1966l352l2610q676K2695J3280o91n176j8538j1021K2428K2904
$$ y = [25773, 45520, 12034, -7725, -33117, -38897, 22369, 61813, 7464, -44653, -27552, 1613, 23102, 40240, 8598, -49970, -37962, 27993, 44611, 9897, -15595, -31093, -26277, 24097, 52556, 2260, -44425, -23681, 7510, 20982, 30021, 1923, -45856, -28647, 29476, 34407, 2391, -15511, -27631, -18378, 27518, 41550, -6267, -38933, -16951, 10545, 23400, 24333, -5920, -40143, -18154, 30254, 30867, -1748, -17932, -21238, -9193, 26317, 33029, -10931, -35015, -8773, 13803, 17468, 15220, -9617, -33903, -9126, 28645, 20711, -6737, -16277, -17009, -4099, 24364, 23565, -13104, -28188, -5312, 13254, 15712, 10924, -10022, -26914, -4531, 25368, 16944, -7703, -14001, -11526, -511, 21455, 18103, -14507, -23183, -488, 12792, 12101, 6925, -11613, -22634, -206, 22698]
224B2698j1721j9487l744K585J1119J7123o122k6405m833J9558J0849k177n525
237C918j4403p127J9427J8378j2211j7454r06M478R223J3248p807k3001p84J8075
251C054Q174k926o518j2283l458J8134J2822j1986j4076K08M648Q519Q638q203
265D747j8111J721J6221N122m384n399r421p46J5653R187j2110j1470J773M736
279b481P047O882q558j4819L562J3427K990l866n203p402P90J3610N682j1134
293E27q688K610M817N616L924q234j1837M776J2365R99m439m613n674K181J1778
308F108L652j0593o548L260M014M913K575p896q545M677J0097L81m655l669m133
323f362K856J0047J379r543n031L206M146L970R79p424o705N631Q197m72m380
$$ y = [22698, 10977, -8510, -12254, -9669, 1450, 18573, 12451, -13954, -18787, 771, 11620, 9443, 3918, -10485, -17612, 1815, 20193, 7982, -9472, -10378, -5900, 3323, 16571, 8764, -14237, -15021, 3054, 11228, 8302, 1784, -10499, -13957, 4177, 16999, 5013, -9063, -8855, -4207, 4312, 12950, 4747, -13364, -11643, 4578, 9700, 5316, -83, -9504, -10250, 5403, 14590, 2480, -8990, -7217, -2481, 4566, 11448, 2890, -11929, -8367, 5060, 8050, 4184, -1019, -8421, -7631, 5979, 11661, 527, -8161, -5551, -734, 4882, 8806, 572, -11265, -6489, 5876, 6875, 2436, -2177, -7851, -5670, 6108, 9760, -833, -7381, -4121, -107, 4806, 7381, -515, -9060, -4383, 5714, 6095, 1440, -2229, -6362, -3506, 6541, 7920, -1623, -6654, -3448, 698, 4668, 5647, -1777, -8482, -2851, 5346, 4874, 494]
338D94l263k708L110Q513k09q209l595L780L349K788L34o653m772O036O428k002
354C421l922k142j864L485O472q27p664j979L997K335K359m02n673l381N331N325
370D871k119l175k146r69L327N325k001o436r84L670K543J091q35m520k593M938
386a3M360k066l148j613l08L046M106j905n186o89L346J701J149j412m448n79
402c659M496K989k333k347j402jL237L004k362m688M81L361J124M34j369l790
418b825m64M540K296k702k187o31N05K239K781k696l742P16L081K74N12j285l113
435b701NL875K024k633k074j70P71J825J905k415k945P57K570P40k00j423j990
452b079K43L376J101k466j583k18R68J904J165k260k896J629K316K61n60r19j980
$$ y = [494, -2769, -5477, -2367, 6146, 5937, -2272, -5867, -2087, 1262, 4050, 4384, -2269, -7041, -1005, 5423, 3421, -501, -2643, -4507, -1022, 5450, 4623, -3041, -5020, -1023, 1312, 3671, 3269, -2404, -5785, -454, 4871, 2752, -423, -2569, -3538, -211, 5114, 3113, -3323, -4307, -637, 1906, 2997, 2162, -2358, -4951, -13, 4347, 2281, -867, -2480, -2788, 258, 4364, 2459, -2727, -3416, -70, 1631, 2780, 1368, -3080, -3659, 837, 3826, 1493, -854, -2256, -2257, 980, 3984, 1622, -3066, -2585, 776, 1900, 2334, 965, -2825, -3289, 1251, 3547, 845, -1342, -1973, -1468, 771, 3552, 856, -2886, -2170, 911, 1185, 1697, 412, -2701, -2696, 1179, 3203, 570, -1504, -1674, -903, 922, 2827, 412, -2533, -1776, 794, 1534, 1334, -89, -2079, -1836, 1540, 2641, 175, -1408, -1626, -658, 1246, 2411, 151, -2745, -1116, 1200, 1461, 901, -18, -1998]
469a998J037K171J001k323j246N5J260J684q8k185j660J551J629J34k49j226j247
486a700Q69K350q8j623j229M12P11J510K16k143j023J080J489O71o39j471q33
503a441J077J895n27j464q62O35N94J305l33j304j400J444J370k54n43q65n77
520a250R12J632l17j701m06O20P13J048n27j657j82R01Q47j85m54q35j84J161
538A36J284o98j471J23N12K52O13k73j569r9J374P66m22k83q42k79J029J019q01
557C71j006j85Q89L48N42r24q27mJ149K96j73o09m92K7J006L44m51j037N0M54
577b32M58J89m39q37J84J306j09m00k85l18j75Q81N81o65o15K19J10N95l06J38
597B80r31R8Q40L23n20k23m62K24J003J32p85n42L25J64M14J17n21n46J94O99
$$ y = [-1998, -961, 1210, 2211, -112, -1358, -1303, -43, 1641, 1553, -632, -2292, -741, 888, 1022, 773, -453, -1700, -831, 1519, 1431, -192, -1421, -1009, -298, 1212, 1428, -715, -1738, -658, 831, 1502, 863, -608, -1441, -364, 1531, 1004, -460, -1322, -687, -93, 1212, 879, -425, -1825, -381, 989, 735, 192, -673, -1250, -338, 1294, 977, -724, -1130, -510, 203, 1251, 724, -933, -1115, -214, 633, 448, -6, -841, -1025, 136, 1420, 722, -749, -626, -114, 138, 751, 478, -1091, -1190, 184, 950, 528, 245, -597, -876, 153, 1172, 371, -635, -820, 69, 417, 959, 35, -792, -796, 353, 649, 476, -133, -625, -598, 408, 752, 301, -736, -686, -232, 226, 415, -24, -861, -677, 629, 520, 120, -165, -483, -658, 223, 804, 139, -476, -257, -147, 448, 142, 280, -651, -553, 287, 610, 90, -133, -595, -371, 632, 764, -21, -563, -238, -74, 340, 457, -64, -610, -416, 283]
617B83J57J3p32l21N9P65M49o13o60M14N3L82L75q11q49N32Q98L6o08j79j11L13
639a55L16J20m55n06O11J71J56R3l02o40L89N33J23o47J86l80O44J02P0o91p1
660c33J48L85M2j47j20l33M05K2J85l69o0Q2L3O49k23p96j25M72K92k3J22n91
682b83L7KO74j71j14n26KM23L39L9k71m59L49j9K95j30l10k04L54O0j34L38l64
705g3NJ61K45j18n06K69Q6N3MK4j63l99P16j15j87q4J75K47n65J14m7K79m27L72
729F6J73R0j22m44M50o39M91jl01L5K81K3P9m1k36k4qL97j51j60j3k76N12L9k66
754d6k27K59K39N5j91l0k98L45j44n7Q1j16l4m5M89j76j90J81j61r0J21j47J54
777b8j21j07K32n0Rl9j7k25M88m9l87K4K59K00J8j74j86r0J37K21N4j03k06j14
$$ y = [283, 440, 453, -279, -600, -541, 224, 673, 60, -600, -186, -133, 249, 624, -187, -1036, -504, 394, 430, -178, -357, -468, -155, 161, 281, -174, -680, -69, 102, 258, 351, 49, -591, -202, 331, 454, -193, -7, -387, 257, 359, 429, -262, -333, -185, 200, 242, 95, -25, -358, 47, 69, 254, -115, -175, -93, -60, 589, 366, -430, -555, -83, 209, 186, 308, -283, -246, -244, 430, 259, 145, -381, -379, 44, 383, 422, 151, -308, 41, 22, 317, 187, -123, -327, 27, 87, -47, 291, -73, -68, 93, 338, 220, -286, -17, 69, 122, 126, 150, -13, -412, 304, 189, 2, -82, 93, 340, -225, -111, -158, 121, -306, 66, 239, 329, 207, -237, 213, -426, 65, 64, -237, -202, 79, 102, 181, 140, -96, -120, -128, 269, 118, -42, -55, -331, 181, 220, -46, -273, -14, 225, 280, 89, 59, -239, 106, -38, -95, -14, -130, -164, -209, 280, 104, -86, 95, -66, -156, -35, -182, -28, -149, -256, -24, -74, -65, -104, -121, -346, 142, 93, -294, -270, -11, 189, 207, 33, -153, -243, -106, 115, 169, 66, -140, -254]
801b54p0K08J41m1l4j34JM29j35j75k03O7J37J51J99o25K50K09j11K6J43k94K99
824A84Nj98O6l25M53j85j46J22J03J79l31J0K06j53q0J82m3j20k95J21L44j5R4
847A78k33K68k30J51k08J73N1M3k60N9jK72k20J3j26k1k6k0J10k62J23N1k8K54
871A11m5j6Q6j69J73Mr5j72l32L20L29Q2J5l70p3L87j33k96q9L32L0j83j81K3
895b62l4N39K1m18R5r7M17j75P3k68J5K0k87L39m0K00Ok15J4M38k36r8J01k40
919i2K24j31J6k61J69j40N47l50P4M3o9k6j67K29j48k00J41o9K11k3K5l2n5K16
943A32q4K23m96K72l55L91k33k14J11N7K33J9j77J15k8J70j05j18O2r1Ok7j0J09
967c8l72M10nJ39J19l12k00N03j72j57K47J48l57j34J39LJ72j07q5K68j91j83
$$ y = [-254, -324, -116, 25, -16, -50, -184, -183, 246, 111, -64, -267, -200, -63, 88, 287, -338, -88, 121, 10, 36, 179, -115, 184, 189, -9, 57, -268, 185, 0, -146, -24, 79, 258, -73, -63, 143, -10, -90, 92, 49, -71, -366, -245, 99, 84, 178, -55, 213, -17, 134, -74, 99, 150, 193, -67, -8, -9, 263, 43, 56, -70, -91, -117, -137, -27, -289, -166, -115, -143, 111, 66, 50, 136, -33, 140, 144, 49, -123, -455, -135, 194, 276, 291, -79, -152, 235, 102, -194, -283, 49, 79, -104, -285, -262, -296, 243, 264, -154, -59, -156, 261, 86, 159, -109, -94, -74, -361, -22, -62, 138, 144, -71, -57, 381, 145, 47, 148, -92, 132, 1, 17, -244, -75, -215, 332, -18, 56, 99, 30, 4, -163, 66, -82, -282, -141, -210, 1, -22, 3, -29, -84, 132, 48, 271, -225, 47, -308, 83, -150, -364, -253, -196, 37, 56, -121, -6, -34, 136, 31, -87, -25, -116, -110, -137, -147, -38, -410, 0, -5, 134, 253, -59, -259, 244, 72, -85, 162, 310, -47, -181, -42, -39, 133, 26, -59, 209, 18, -165]
989a65R9o0K34m7o30P06l26L93j06k84m9J26J71p3J7j13Q9j39J72K66m74L16k31
1012a08J08K60l22N0j61K69n9Q9k75J48K0j93L4L37O5k35J03j54P8k88M48l93
1034a79K09l4k47n4L64J1k1R1k25Mq1J81K41m22M39j66n0l1p5M1J06l73j00K19
1058a52K20j42J49k37M42k25j34Q5j82L30j78J46j86J13K95k73j92K7N6J66J43
1079B71l69J10j65M7L86j85k25Q8J08k90K74k06K55k21K77M8Jl41K30q5j63K0
1101a35R0j54J31l06N03l05J78J56l31M6L43j79o1j32L83n92K67P3qj74m3R0M01
1124B41m73J81J25L52l96p8j43r3J59k84L00l8J94m5J01q6p7m8K19l10M20k36
1146a5p0M22l79R5J48j58j93L52m13j20J06M57k47K19%k76J54j06R4p3L8j42L9
$$ y = [-165, -66, -126, 108, 61, -569, 137, -189, 204, 98, -186, -235, -109, 62, -11, 6, -107, -18, -157, 15, 281, -193, 123, -108, 0, 260, -62, -12, -173, 96, 37, 126, -149, -1, 19, -174, -140, 197, 262, 27, 130, -24, 54, -234, 214, -179, 30, -4, -251, -305, 59, 70, 49, 140, -85, -81, -162, 19, 260, -162, 277, 111, 61, 30, -45, -4, 102, -271, -371, -152, 68, -74, 75, -162, 280, 55, -79, 6, -176, 154, -24, 122, -64, 49, 344, 71, -121, -94, -38, 128, 271, -98, 12, -153, -106, 280, 95, -130, -42, 66, -224, 50, -156, 99, -122, 155, 203, 204, -137, 93, 8, -155, -135, -45, -199, -68, -374, 129, -176, 2, 158, -173, -127, 216, 37, -24, -156, 227, -365, -98, -25, -33, -207, -250, -160, 241, -232, -51, 74, 426, 30, -48, -191, -284, -125, -409, -109, -147, 47, 2, 103, 17, -60, -108, 111, -199, 221, -15, -85, 337, -42, 53, 201, 43, -150, 202, -211, -331, -225, 232, -15, 204, 204, -72, 82, -24, 70, -3, 35, -107, -68]
1169f8J2J02J06j30m1j8O8j53K37j5j14j84K43J38j39p2J6J22j29Q4K59m00K75
1192A99l98R3O9J41j04R4J47l09n1L67l24k19O2J49OJ96P6j22P8j80K07j72J91
1215A96J2j85l9J82k19J12k24q3J57K43K63r6k67l68N38l2j8r8K91l18j06j14
1237a73K71K31l47j81K33j0J57k34m1M51m21M3qj19k6K77M5j43J08L0j63Q0k14
1260a54M83k22j25j52K50k26J26M1jL39K0m84QO1n6J2p8K03p8P4m2M5o2L13j87
1285A08r6J47J1m2j72lj03m4k2k2J53l03L37K35o2k26J30j38P5j05Q2q1L35p3
1309A21k43O4J63o6O1r5j46K66l57Q5K27J7l52J28m0M41O2m04K20k68J84k44q5
1332b61K90l06M01j61l2M12l37Lj34K45j79J83k14J05J46k12M13k91j55L24o31
$$ y = [-68, -56, 46, 152, 22, -19, -37, 31, -122, 115, 100, -14, -198, 45, 183, 44, -28, -12, 110, -19, 65, 324, -76, 199, -199, -106, -37, 104, 0, 94, 241, -68, -119, 248, -76, -295, -233, -84, -78, 118, 194, 72, 150, -30, 177, 5, 196, 208, 23, -16, 166, -53, 59, -165, -248, -91, 152, 415, 319, 52, -316, 222, 190, 172, 74, 365, 47, -59, -173, 98, 329, -18, -199, 34, 24, 181, -53, -94, 357, -64, -21, -29, -148, -174, 103, 148, 5, 113, 143, -20, 60, -154, 329, 107, -18, -170, 80, -146, -20, 21, 20, 359, 379, -105, -97, -36, -92, -80, -158, 45, -33, 41, -1, 44, -18, 295, 108, 12, 159, 170, 128, -44, -47, -150, -194, -216, -238, -85, -388, -51, 184, 122, -104, 26, -112, -37, -142, -60, -141, 194, 121, -122, -58, 105, 39, 100, 5, -141, 125, -232, -147, 80, 97, -255, -127, -167, 274, 336, -68, 152, -116, 68, -176, -261, 29, -277, 124, -37, -69, 343, 6, 9, -125, 120, -59, 124, -90, 15, 161, -51, 362, 71, -84, 240, -391]
1353c91P30j98K08m35J07j13K35L0j69M61m00o7L5P0q8m3J32j52K54k5r7j06J54
1376A32k05Q5q6J18K34m08M29n82l9N09j11j60J77k9J53k48j15K35j03K57j56
1397H7m5j15M84l84m70L84o0p4K32M7L7j07M0J90j84J80k94J13m6K20l45Q6j1
1420c5R9k37J37q0m5K04r5J94k90J08K40j38M0j34J21r6N6l4j80M42m19K94n15
1443c63M5L99k98K08jj0l1J95l04Q6J40j11q6J48P8j67P4n1Q0l5j9j24L33j47
1467C9j38q0M27l73L57m6k47J48l42J47J2K94k61o1J52n0j34J12K71l39K11k97
1489a98J65P1K13l26K85q9L2L3j12k25j00K34K20k09r4J70j06N3j25K23j89K24
1511A50j22J69k14j31%j34N09J13k18l67M11J43j72ol56O8J71j04J41L07m44j2
$$ y = [-391, 339, 141, 349, -86, 21, -92, 143, 173, 4, 465, 65, -2, 33, 103, 15, -28, 104, -48, 206, 181, 84, -22, 132, -73, 12, -74, 44, 278, -130, 299, -283, -322, 187, 76, -84, 93, 64, 217, -31, -146, 89, -14, 243, 87, 42, -73, 411, 27, -443, -59, -119, -193, 39, 86, 123, 16, 56, 246, 62, 242, -52, 61, 15, 235, -110, -24, -35, 64, -173, -36, -116, -161, 43, -52, 142, -148, -40, 200, 62, 102, -32, 89, -7, 49, 15, -165, 277, -142, 152, -363, -318, 81, -217, -9, -10, -20, -51, 144, -160, -74, 66, -45, -131, 17, 95, -72, 2, -49, 31, -4, -23, -147, 186, 39, -99, -179, 248, -125, 232, 186, -61, 87, -255, -108, -96, 198, -63, -124, 28, -22, -156, -44, 227, -112, 99, -198, -33, 38, 251, -75, 210, 121, 153, 186, 74, -151, -251, -17, 203, -6, -100, 70, -36, 17, -108, 115, -74, 150, 28, 197, -17, -148, -148, -282, 227, 340, 122, -245, 166, 309, 137, 131, -225, -157, 14, -90, 51, 358, -86, -98]
1533i8L13j47j62R3K97l65K62j72k0o8M03n75K57k74j0J11K01l85J46K73q6j69
1555a75L70j69J18l45M36j96O9j96K22k70N8K80p2k72K25rk38J64J2L22m92J80
1577B2j33J48j88N6m7j8Q1R0m1p4j10J63j28J14l1j44M07j6q9l11K86j1j29K58
1601A55l40J50K49k11m9j33K36j85J91q4P1j65J53J7k9k55J27J53j67J24K4j5
1623A7j32L22o4n63J50J55k27K26M32l71j36J87j88j66J51K83K04k26k57R4j22
1644b31j6K12K69l6k27K34l33L35o5j32J58o1j33k13K35j07L53j97k51K59M0J5
1666A08k48R1J29j25R2L7m88O1L41j80J18o1K24K6k6j61J12O8kQ5j52J95N5l50
1690e1J25k35J68L12n2n8k91J56k7K96m13Om12J89L35n8N7L3K09o40L76K40l73
$$ y = [-98, 215, 68, -94, -1, 296, -69, 193, 21, 1, -67, 336, -239, 18, -256, -266, -155, 46, -339, -193, 80, -6, -175, 195, 26, 144, -201, 235, 39, 108, -88, 134, -136, -78, 202, 130, -142, 83, 74, -164, 0, 12, 334, -158, 22, -111, 37, -151, -95, -142, -160, -79, 11, -30, -104, -214, -51, -179, -65, -96, -240, 167, 151, 62, -249, 37, 26, -103, 155, -185, -35, 214, 3, -46, -179, 57, -128, 63, -21, 50, -115, 38, 55, 26, -229, -102, 51, -116, 8, 32, 17, -115, 207, 143, -420, -270, -115, -342, -116, 316, -55, -191, -4, -192, -358, -207, 76, 280, 54, -203, -109, -231, -247, -35, 234, 198, -29, 205, -128, 207, 142, 10, 168, 107, -26, -239, -4, -111, 242, 45, -206, 53, 93, 108, -140, -49, 80, -45, 47, 84, -404, -343, -2, -182, -64, -125, 99, 125, 99, -62, 50, 118, 116, 201, 49, 244, 299, -51, 74, -161, 7, 319, 267, 209, -82, 74, 47, 343, -70, -64, -476, -287, 48, -10, 47, 80, 289, -351, 25, 265, -108]
1713a08K34j10k07k2k4J2L02k43K95K2j75Q0j62k2J62K8l05L27j10J50k48K91
1735A67j54J22k72J76J75J8M5j03k91J93J9l00J4L01l02K48k15J52pN9j23J39
1757F1L63m48J54p1p5j01J0m0J80J58k3J5m33L26n8rJ84n58M20J61n08K69o8K39
1781A48k77J46K97m85K39J2m52Q13k50k34N1M6%J70N6m05L1j76N12n58J9K31J59
1804I3K2L4l5j26j0j28L96n07J22K43m8k63K27J33l50l4K94j14Q3p5m8K12k62
1827a41J67j33J03J74k91L2M32o25K43Lk17L63m89K41J89o9O7K14j83m33N16r
1849A54l51K64k27J85R6k31j92J81N5K19j51p5k67J97J69j31J15J13J54k96Q5
1870F6k67M38k87J09k31K45l87M39m48J17K24j68K83n50O78j82J17k21J32j01
$$ y = [-108, 126, 16, -191, -213, -237, -225, 77, -166, 129, 151, -24, 56, -106, -128, 34, 62, -243, 84, -26, 124, -124, 167, 13, 135, -137, 39, 214, 232, 277, 174, -117, 76, 95, -205, -191, 110, -192, 56, -159, -7, -14, 45, -78, 61, 424, -24, 130, 59, -16, -117, -107, -147, 33, 191, 168, 183, -250, 76, 18, 9, 193, -365, 55, 216, -292, -23, -91, 148, -129, 17, 314, -171, 68, 80, -372, 441, 191, -43, 8, 54, 54, 224, 280, -125, -94, -270, 242, -316, -297, -66, 93, 115, 149, 114, -12, -22, -150, 246, -261, -139, 104, 56, -207, 20, 153, -197, -231, 63, -51, 32, -43, -91, 121, -141, 26, -107, -4, 170, -121, -89, 343, -282, -39, -36, -253, 110, -379, -138, 51, -18, 49, 263, 80, -353, 163, 154, -197, 67, -160, 25, 121, -110, -302, -121, -66, 153, 2, -73, -340, -143, 26, -105, 10, 123, 277, -19, 66, -201, 237, -50, 59, -172, 73, -314, 125, -323, -206, 18, -150, 133, -417, 261, 79, 196, -25, 107, 6]
1890Fj14J71J43l20L79l71RJ84J69k60k73K68l6l29N33n5j47K40n78J84l60M43
1912a14K45K57l57l0k0mK90j95k76J33M34m68m6PK1oK23j8j22K20l4r6o4k07K54
1937B7p7l3Q0J54o4J7J98k84k4K72k06k28K95l16R9K57j79j48K07k7r6K08k56
1960a24K54l85j3L42j47j02L14l00L1L86k69j33J88Kj51k0L30l36K15k8k64K71
1982F1m18L20k05J99O2m1J53j0j68L59l51J7m35M65J64n0r1J59l95J7O3Q2J5j15
2006a43K69p8j11P5o9j62M06o6l10L65Q7l96O2j76J94mJ69P2j89K4R8l67L83o
2030A27m3k72N1K78k28J4q2J41n6J70j50J02P4l05j52J71J97j91J99p3L6m0N67
2053E35o15j51K78N9j47M1j84p5k5L75K7J19m05J90j70J39m2K29mk40O0j23l9
$$ y = [6, -108, 63, 206, -114, 265, -106, -97, 87, 256, -4, -277, -9, -45, -374, 159, 104, -43, 197, -381, -197, -557, -114, 131, 388, 31, 1, -19, -23, 267, 72, -204, -71, 363, -105, -151, -144, -123, -129, 94, 76, -46, 174, 140, 44, -20, -227, 27, -50, -83, -3, 151, 87, 104, 302, 18, -6, 266, 60, -168, 127, -189, -90, 167, -12, -160, 47, 20, -76, 132, -124, 130, -255, -268, 74, -73, -175, 139, -161, -130, 256, -13, -146, 42, 44, -107, -127, 203, -133, 82, 54, -210, 61, -357, -37, -242, -43, 19, -22, 131, 121, -47, 312, -39, -22, -457, 8, 172, 122, 31, 190, -205, -188, -125, -43, -28, -143, 126, 48, -63, 12, -57, -219, 187, 121, -189, 176, 263, -133, -71, -247, -53, -57, 112, 184, -5, 19, 117, -250, 133, 127, 84, -188, -137, 141, -87, -73, -155, -14, -70, 100, -50, 52, 126, -179, -331, -160, 37, -154, 45, -28, 8, -32, 535, -80, -231, 47, 106, -41, 0, -184, -259, -284, 91, 118, 237, -168, 22, -148, -9, -51, 178, 174, -66, -6, -129, -168]
2076a68M13m31KK58j93K05k65K82k24K02o5k53N0K54j60R6N9n2m5K48o7r8p9m8
2100g9J04OK59j69j92R0j29K2J37Kj80J8O4J34j24J44l13L93L29p76J04K76oK
2124A16m14K11P5R6nj15J17j8k59K0Q6L24l13K70l2k9l80J59J19P4l26M07k60
2147g7M3J24l58L65j2n1J7L36k37r5J22j58J23J97Kl49Lk4J49j14J27J36k96L17
2171B90MJ5m55K34m70M14K62k87J7Q6m8m8j09j82L39q6k3P5p0K3J37j95k44M11
2195I0k65J68J78l36L75O0m41L84l12k95N67k04K13N7j54M8j47k9K4K4L18l49
2217b6Q3r7J23k02K74j32J5m9K59l4k07J21j15Qk24n1L63k45L11j46j30K49r3
2240E5n4J95j47p3j11J48r6q2K95k15N1O0j31q4Q4K70j49N1R5q8rQ8j33j98N17
$$ y = [-168, 245, -186, -184, 74, -119, 86, -179, 103, -121, 81, 16, -237, -187, 67, -93, 3, 62, 10, -35, 213, 146, 48, -31, -79, 25, 31, 290, 121, -71, 19, -110, -88, 49, 51, -129, -111, -47, 87, -37, 107, -206, 187, 516, -260, -156, 120, 114, 116, -298, -87, -12, 84, 79, -36, 81, 63, -196, -176, -90, 234, -79, 191, 159, 130, -250, -91, 28, 102, -224, 183, -77, -34, 90, -268, 97, 85, 34, 51, 387, 150, 55, 177, 19, 142, 339, 341, -8, -5, -29, 120, 6, 133, 269, -27, 290, 294, 309, -146, 88, -382, 32, 294, 7, 24, 110, 62, 14, -95, -277, 62, -24, -47, 28, -42, -19, 118, -77, -321, 90, -175, -7, 171, -165, 210, 270, -171, 213, -99, -394, 173, -31, 182, 239, 85, 133, -14, -43, -19, 5, 323, -26, 57, -40, 83, -119, 155, 23, 38, -11, 248, 214, 7, 128, 13, 21, -203, -254, 109, -136, 175, 29, -101, 148, 55, 1, 196, 49, -24, -135, 13, -83, -165, 130, -85, -34, 26, -105, -189, -105, 165, 16, 67, 162, 74, 65, 153, 20, -178, 339]
2265C39j91Q5k40o8O4r0J86j69Q5n1MQ4j89p3R4j03N12j13j05k41J19L05n30K96
2289A0J51j57j63J13k82K90j89m7L75k97L61k69%K31M3q8l43N0K99q7O9k62M74
2312B82K7l59J92j79p4L23k60m7K39k61j04M18j62R2%j41K37j56%j01N9J98r0
2335A33j19mO3j64L13l40K29j17J20k97k76M17J00k52K70J36l44p6J70j35o7K53
2357A3R7Jk43J08lp5P3p6o4P8j18K41o9J28kk05L94k79k21K39J28J40r7j97p4
2382h3R2J00L9Lj33J88j98O2j60J07QJ15j67L14p54M43M04l07j38L35k94J26k5
2405G7RM9k01K06r0j83K74K0j18k29M3J52l6J13q3J09k16m1j39K06L2K1P5k43
2429a93k4K66j85R4j94M34l60J50PJ58k2j34L37q2j40K8k57K59o7j0l53L92j17
$$ y = [339, 148, 233, -7, -75, -11, -101, 85, -84, 1, -50, -46, 38, -151, -224, -130, -233, 279, 166, 61, -180, -61, 244, -286, 10, 161, 4, -159, -46, -328, -38, -227, -274, 101, -196, 165, -104, -104, 127, 170, 82, -261, -211, 88, 1, 70, -192, 282, 309, -50, 142, -37, -111, 212, -48, -95, 144, -117, -221, 197, 35, 127, 127, -14, 223, 67, 67, -34, 25, 223, 133, 14, 10, 73, -91, 222, -118, 111, -6, 114, -183, -459, -42, 58, -194, 76, 212, -132, -208, -38, -173, -240, 13, 110, 111, -132, -24, -27, -102, -29, -105, -169, -91, -209, 32, -37, 91, 89, -116, 278, -1, -222, 17, 145, 285, 188, -9, -83, 9, 109, 148, 151, 18, 206, 8, 70, -90, 17, 25, 140, -27, 287, -467, -24, 380, 73, -65, 270, -24, 102, 77, 86, 135, -66, 140, 50, -133, 141, 161, 43, -186, -143, 9, -27, 86, 3, 112, -104, -145, -284, -78, -46, -25, 50, -193, -217, 49, -136, -42, -236, 198, -162, -12, -5, 153, 131, -3, 334, 252, 112, 140, -117, 142, 75, 65, -288, 104, -13]
2452a3j30L63l47K26m30L97j52K18q1l3k17J51R7q4PL2k87M40q9K77j78l9q5j06
2476f3L76m5N3j76k20M19n25K63K8j01j34r3L3M92r3n8j38o4l1J88J39k25J95
2499B20l62j46K85L07l05PK47n71J78P1K36o5p0l8K2L48m13J58k68M6J09k01N66
2522C61l55o0J62k09l7J95j67K97J68k46j73J4K99j13j73O8k41P7M50m06K02Q1
2544A94m11J30J6J53j17j73J62l0K35m07K98O5nj47q6L26k24o6K48j80J12K8P7
2567A98k53P7k4K32P6k19j28K93l48j14L44J2q4n8l4LJ43O5k56K39j46k37L50
2590A31J86m26J57J8K1j46J12O1r1k8m5L51j58pl42K31j20M00p0j18k5RJ80j66
2614A15o4L4j21K16q1K47k09o3k12J88j37K70j77J39l54p5N03k36j89K70n0N9
$$ y = [-13, -143, 220, -127, 99, -331, 66, -86, 132, 51, 18, -199, -48, 49, -35, -28, 4, -283, 157, 68, 345, 167, 128, 43, -63, 313, 268, 321, 145, -75, 344, -181, 82, 110, 9, -125, -218, -185, 307, 214, 156, 18, -46, -77, 111, 250, 25, 220, -142, -288, -3, 304, -1, 6, 253, -318, -140, -69, 167, 102, 32, -6, 16, 364, -49, 109, -159, -113, -4, -205, 361, 6, -54, 108, -101, -138, 57, -110, 187, 355, 109, -64, -50, 249, 136, -37, 31, -210, -133, 317, -89, 113, 194, -217, -87, -71, 82, -35, -208, -46, -76, 159, -248, 50, 115, 110, -37, -123, 203, -21, -87, 161, -19, 93, 121, 198, -55, 22, -2, 230, 306, 87, -41, 252, -96, -210, 134, 146, 62, 4, -30, -27, 116, 181, -75, 164, 18, -219, 131, 317, -109, 48, 66, 87, -59, 53, 114, 23, -5, -50, 301, 143, 136, -206, 25, -95, 305, 235, 117, 92, 101, 281, 115, 51, 85, -36, 180, 99, 346, 137, 74, -138, 50, -87, 183, 6, 145, -209, -284, 219, -17, -206, 64, 14, 73]
2636G3j27O8j70J8k11N29p0j46k78J09j36n1J35L27K9j57J96j87M68m78J56K38
2658C35k77pL5k34K0j82M60L4k72L44k48K03k72j1K43j59L0j21L44j32R0m54j08
2681c39N46k11o2K07j83m6J74r5l31N27k07J0K52q3m41M84k50m8K30r4J11k17
2703f6J38J66k72K08K8l68qK85p2M6m11K0Q1M58j69q4r5L85j14j61m8j1K07o8
2727G5l3j91J53k58K76K6N8j24j25M06k42p8qJ90k63J03M20l22o3Q6j6o5j24K2
2751i7J69k71j60L04k5L36j44j72L43l38p2L1J73r5O6J76l5k23q9p3K68j14J54
2774A12Q8m54M06Q4l2r4J3j17J28L2L8n83N22j82j6J98K7q5j35N4J3n1J2K06k19
2799c5M9jq7M7K5rj13K45l30K31L0kj37k78K21N3k38K99k7j07O9Q0J89j47q6J05
$$ y = [73, -54, 14, -156, -138, -349, 180, 110, -36, -314, -205, -341, -392, -257, 70, 99, -58, 138, -49, 419, -59, 97, 335, 58, 51, 86, -148, -128, -310, 150, 184, -88, 256, 8, 211, -61, -72, 171, 12, 42, -79, 265, 133, 223, -231, -339, 207, -4, -66, 141, -42, -88, 86, -9, -340, 187, -20, -10, 242, 159, -282, 202, -48, -96, 134, 40, 151, -66, 72, 238, -34, 174, 202, -166, -174, 111, 39, 85, -326, -306, -225, 233, 64, -20, -115, 270, 156, -5, -53, -64, 143, 75, 42, -149, 4, -254, 22, 48, 106, -18, -143, 263, 21, -57, -65, 125, -138, -35, 385, 63, 0, 86, 70, 5, -119, -97, 72, -199, -359, -55, -80, 256, 112, -60, 283, -55, -127, -96, 77, -18, 48, 224, 189, -34, -123, -196, 72, -42, 112, 200, -254, 152, 236, 204, 110, 123, 6, 134, 166, 204, -379, 143, -39, -55, 143, 170, 85, -50, 4, 17, -34, -22, 184, -35, 14, 13, -74, -27, -2, -11, -124, 121, -209, 22, 52, 50, -87, -365, -144, -91, -329, -30, -57, -164, -95, -15, 174, 27, -59, 46]
2825D6O9n4J24k00Q6rl04L61J38k22mk38k35N27K0j75J12o7Oj82J7qO63m1n76
2850a46J98l14K72J0l18N33k9j24m15J58K06K20j46r5JJ19j59J78k77N4J41k98
2872b31J45K80j43j03K2N6j10N7JJ54n7j21J67j28j01j6J57K45j38r8q2J18r4
2895b0J86j40L1J92m13K23q5r3m0N2K34k52K72k53j0k38K08J37k9P0J56k51O3
2918@j23L30m1n19L29o1J1J11k43N28m75L59k77N2K32k29R5J71j80q8L46r2J7
2941B53j56j55K01k42L6j59J50K59j36L9k63N7j9Jm9l2L24Nk02L78l57J07q5J75
2965A30M3j06l0k10J73K0j5K9k3r9mR9L9K01l8j45J36j17K25l00K13l38J16q7
2989h8J48m0j92R4k7N3j76N37m81M01j26J72k43L0k08J10J23k02J58N2o5M2n5
$$ y = [46, 115, 61, 185, -15, 71, 62, -242, 119, 257, 35, 31, -207, -442, 85, 105, -70, 42, -25, -19, -201, -184, -192, 471, 430, -146, 52, -262, 10, 20, -298, 235, 206, 82, -333, -175, 31, 251, 105, 10, 11, 130, -29, 149, -128, -74, 67, -231, -86, 194, 51, -52, -30, 26, -84, -27, -26, 128, 71, -50, 117, -11, -112, -128, 29, 274, 136, 38, -44, 74, -20, 166, 26, 57, 249, -164, 59, -26, -119, -159, -107, 127, -125, 147, -106, -116, -354, -146, -9, -38, 32, 188, -63, 0, -123, 207, 166, -353, -24, -85, -74, 37, -206, 322, -153, 206, -71, -19, 213, -16, 79, 250, 70, -18, 328, 236, 253, 97, -58, 143, -99, -63, -222, -72, 187, 51, 90, -173, -116, -135, -134, -183, -215, 109, 114, -88, 290, -67, 40, -45, 130, 173, 67, 37, -173, 0, 20, 5, 34, 11, -88, -92, 7, 46, 247, 209, 64, 200, 83, 308, 8, 221, -117, -1, -88, 60, 20, -172, -78, -105, -52, -228, 309, -172, 229, 103, 275, 32, 62, -146, -36, 87, -115, 43, 95, 30, 72, 17]
3012A7K62n62J83Q7M0k03K22l99N15k84J76J40k16p9Q0J37k94M34p5k3l5j68o5
3035a10J23R1m1r5n2O8Pk00L00j38J32k93j17M98r5j47K1J78j60j7O7R2k76o9
3059b33K29K48q0K21m75m4P5j05J04J44Kl46L19k71J76R0N8N8m23J35m5K44K1
3082A02Kj71j11j21K99p6N6k15M51l99j21M82k02J64j52J2j71P9J05J2J13k98
3104a60L29j10j07K49k04J91J59j56j59j55L1p7P8k56J85M46j6l29J12K11j19
3125A43l10q5L00j50k98N17n2N0M7l56J01L0m8p5L5qM18n33K76j17k30M16j15
3148d4K62n8O2k43R3j68J4O9O8k10J44j00P8o0M0l0j28M38m93K25k72N06l0j11
3172E2l21N67l79k21K33j5J59j25L18j86R3l54K35K8q4m31N46n18L73K26k49K4
$$ y = [17, 279, -283, -100, -13, 27, -176, 46, -353, 162, -122, 54, 194, -22, -101, -21, 116, -178, 256, 181, 158, 123, -45, -110, 13, 104, 63, -32, -84, -16, -9, -209, 91, -47, 85, -208, -325, 173, 78, -69, -48, 130, -30, -47, 20, 112, -164, -233, -4, 244, 164, 385, -90, -134, -59, -164, -60, 84, 86, -260, 59, -212, -36, 54, 112, 170, -253, -118, -163, 81, 102, 104, -67, -178, -299, 0, -76, -20, -235, 216, -183, -304, 178, -24, 140, -12, 0, -171, -92, 13, 25, 138, -160, 169, 59, -48, 201, -3, 188, 347, 191, 32, -123, -92, -169, -91, -347, -162, 284, 268, -61, 51, 262, 143, -167, -252, 48, -102, -400, 117, 65, 115, 162, -194, -93, -63, -111, -186, -151, -159, 259, -274, 2, -115, -345, 71, -44, 218, 160, 222, -21, 72, -96, -82, -13, 55, -155, -11, -111, -33, -93, -53, -83, -211, 227, -266, -41, -313, 193, 163, 52, -269, 298, -81, -302, -69, -84, 75, -50, 268, 82, 175, -179, 56, 84, 0, -431, 115, -403, -30, 196, -53, -29]
3194b9L33k44J20k94J00q0J09p6M9j16K45k63K12N5Rj22L8K35o2j42l9j04R6K00
3218B30m63M61j32l4L60n18K57M4k98j48J92j74J88R2L6J65o9M6j92o1K01l40
3240a57J79j6j66J08j4J42r9l06N91J88p12M71k52L19l34J34r0J45k98L5N26l58
3262C6J6j79J14k24J95J23K61l61j2K00m74K52K00k07j4J09l1k21M09j89k16J26
3284h7L3K05l7rJ62k56j92J43l2O1J57j85jK30j01k36L8J61N8j18j06K52j39j17
3308a16J47O4j28j7J5p3k0oQ9J8N8M9Pn93M69j55J34J94k99K73J58m69L56k65
3332a10J5n6l32N60K82k94j42L25l03J78j91J24j17k67J65J1r1K67K68l11Q0J09
3354A70l56M11k49q6n1L60m96J89J33k39K42k82M69N8k48k34L25K09m69l5l5M46
$$ y = [-29, 304, 60, 180, -114, -14, -94, 15, -61, -12, -128, 117, -146, 66, 121, 130, 8, 46, 281, 219, 77, 38, -66, 30, 230, -233, 228, 96, 62, 422, -96, 161, 205, -93, -241, -49, -223, -35, 57, 93, 258, 189, 235, 43, -18, 183, -157, 22, 6, -160, -52, -66, 76, -23, -329, 262, 450, -262, 209, -43, 276, -58, 76, -14, 131, -167, -132, 394, 36, 52, -127, -13, -237, -42, 81, 342, -19, -31, 169, -305, -53, 147, -60, -74, 35, 4, -217, 192, 3, -213, -87, -54, 151, 114, 105, 267, 11, -181, -38, -70, -9, 148, -37, -38, 192, 91, -145, -107, 54, 112, -6, -112, 140, 1, -116, 31, 95, -33, -50, -35, -108, -128, -134, -45, -27, 31, 80, 87, -506, -37, -192, -58, 136, -163, 110, 268, -201, 155, -110, -95, -151, -483, 77, 359, 65, -77, 248, -55, 123, -68, 56, -61, -328, -163, -152, -243, 24, 292, -19, 61, 170, -186, 225, -24, -110, -161, 199, -297, -108, 25, -214, 28, -254, 215, 273, 25, -209, 116, 325, -144, -179, -214, 232]
3376B32k95q9m0L18k41R8l38L22J4k7J73l10M15k22k41K99Q9j03O4K50j64l09
3398a05o5L76N8j94l28K46l11K57J17j48OK03k49P9K87k8k67N5l4L9L5k00j0J87
3422FL4k16L49l93M94l99N7j02Q0j07K77R8l42K76o7j96M13m5m32L06k00R7K10
3445A98n16K12K08K12l8m98N83k31j08M0K10j62m18M95o50L94j3p5P0P5q1L6N2
3468ej90K50j51J14O6j94J36j60J62j53P5J93J19m00J32k88K69J50l13K23n0j11
3490a26Q0j9k4K51J09l41N3K76j59o4P1k63J34l83M32M6q0K77m44L8K88j56J49
3513A45l58JK98m77M38J61j4k61J5K5K32m62M01q9j52l7J99j78PN6j48O3J28K05
3537A98N1m85J30K82j79J31l80K95o2o2J99j21j78J22j09J22L3L53o54J72J96
$$ y = [232, -63, -152, -192, 126, -115, -17, -355, -33, -19, -46, 127, -183, 232, 10, -231, 68, 157, 54, 118, 368, 204, -105, -170, 206, 264, 70, -258, -12, -323, -66, 51, -97, -91, 112, -137, -58, 229, 201, -66, -11, -45, -6, 29, -171, -181, 6, 40, -176, 173, -220, 274, -125, -68, -170, -90, -197, 80, 178, -164, 112, 45, -151, 262, 217, -215, 91, -109, -12, 198, -318, -106, 102, 314, 276, -222, 361, 130, 22, 62, 272, 110, -308, 187, -463, -69, -82, -157, -87, -12, -93, -57, -5, -195, 55, -96, 18, 84, -110, 26, -134, 28, -125, -50, 143, 262, -138, -6, -294, -25, 125, -188, 35, -15, -126, -46, -65, -89, 162, 271, -70, -17, 259, 100, 36, 107, -156, -22, -405, 27, 73, -7, 270, -174, -136, 152, -4, 145, -213, -212, 86, -391, 47, 208, 194, -67, -52, -27, 205, -257, 144, 55, -97, -134, 65, -113, -106, -50, -198, -135, -7, 198, 249, -236, -106, 176, -3, 128, -252, 43, -19, -81, 118, -3, -181, -59, -168, -46, -13, 340, -314, -142, 54]
3558E4q0j99N24n89O34m50J72j60K99l4j96Q1j02n9l2J22J95j20M9l85J0M9M53
3581B36m67K0M04l42Q4k43K79j87K60P2j46L8J34j9r5L6k70L37q0l56O42l37J17
3604A17k87K84K78m23l5M6j31L44m49l3K62P9l36L35J49K42j34j04n9l96N29l02
3626b4K0j67N12l18L1j98L11j21J70m63J64r6K47M6R7n17K41J56l19L84k25L73
3648C04p29J58J07K64l29L72k40M6P6J66p6k3l69K95O4r6j86L59J6j36m0j10J36
3671B9j42K17k99J52K42k50j80K16L19k84j02j6k5j1j67M19j30J53j84K34l19
3692a28L43j14Q6p3j47O2K35m09K89q3J08k70R9k3k04J80M9m4j45J67Jjj13J48
3716A3L18l26O7j63M40l42p3J04k11L72J3l88L01m65N30l44J90q6l3N6j78J23
$$ y = [54, -26, -225, 299, -290, 344, -106, 66, -94, 205, 171, -25, 56, -46, -105, -137, -15, 180, 60, 109, -276, -266, -217, 236, -231, -211, 193, -149, -65, -308, -29, -216, 44, 116, -30, 8, 142, 123, 28, 64, -206, 131, 51, -305, 337, 0, 117, -170, 114, 392, -31, -66, -20, -151, 193, -256, -289, -27, 52, -284, 51, 200, 442, 308, 204, 145, -251, 278, -24, -4, -171, 341, 23, 54, -144, 167, 46, 216, -247, -83, -179, 68, 114, 211, -306, -65, 91, -228, 156, -69, 304, -425, -267, -160, 104, -225, 147, -93, -47, 29, 195, 119, 96, -273, 22, 86, -10, -196, 163, 179, 43, 3, -107, 29, -113, 104, -195, -43, 199, -51, -231, -15, 304, 20, -82, -98, -123, -134, -301, 118, -12, 141, -43, 191, -128, 215, 101, 187, 114, -33, 29, 264, -145, 144, 61, 169, -101, -2, -25, -229, -49, 0, -44, -189, -22, -21, -22, -135, 13, 331, 5, 72, -91, 349, 7, -66, 38, -173, 199, 212, -176, 125, -340, 190, -154, 36, -50, -83, -27, -205, -82]
3738h2j4J52K34j95k83L52Lm85J56K55K80k14Qk90J42j1J65n3M8J09j03m74M01
3761A01P1n5m2j79R5N8k42M71m72j48N92j01j14r3J9K00k33L42j38j17J73k60
3783g2j2L07j54l42L62k8j0j19R1J88l3ql90J89j02K48q0j84J72K85l43j46L26
3806A45o2j94K87l67O2kJ29k01K30j76L49k54j88N64l81M13m03O3j33l9J55j49
3828a52K17Rj00N4m6j8L37p4m0j75J98n14R1J82j52J61k10J52K90m86K21M02l93
3851d6J41l46N36k11j79L7J6M8j88J40%K64j98J2M8j46J09l56K72L11j68l03J31
3874g6K70k50J68L5j09k25lK91N5l40J07J0K87l09j3L59j68jk84K54l12L88j26
3897HL54m99J48j0k49K86m7j11R6n5k49M77l12J7L56m8j38m3oj04p7K40rj11O1
$$ y = [-82, -96, 56, 290, 95, -188, 164, 167, -318, -162, 93, 373, 159, 167, -123, 19, 8, 173, 120, 168, 277, 174, -300, 101, 172, 117, 75, -104, -9, 49, -193, 278, -194, -342, 250, 149, 35, -58, -39, 161, -72, 270, 132, 15, 188, -72, -84, 223, 69, -273, 89, 61, 51, -68, 23, 211, 178, 170, -220, -31, -133, 115, 35, -149, 23, 308, -35, -181, 145, 83, -111, 176, -191, -129, -131, -2, -203, 27, -149, 200, -54, -242, 322, -59, 354, -49, 14, -119, -158, -3, -152, 65, 74, -26, 28, -18, -36, 301, 227, 187, 12, 210, -304, -213, -31, -183, -22, -232, -80, 210, -276, -55, 347, -46, 95, -251, 285, 74, -105, -68, -52, -4, -192, -52, -52, 212, 14, 26, 74, -72, 37, -319, -47, 264, 96, -207, -76, 194, -56, 112, 147, 38, -187, -190, 101, 156, -184, -77, -67, 220, -89, -102, 257, 89, 88, -196, 58, -254, 134, 8, 362, -137, 11, 1, -248, 38, -9, -120, -24, -79, -328, 149, -163, -146, 210, 162, 24, -19, -25, -129, -206, 34, 25, -86, -25]
3922b5K14J81k75l73J48r0K94m52N30k25j92L68j11k6K28k34j75J41M3N2J4j20
3944h5J82J12j40j47K02l12J57j27L60l29J35l4k31M76j24l8j6pJ63j29k6l00
3966b58R7J16Q1j45J73q1N2m9R4R9p6J92l48j3k55Q8MJ46L77n69L9J83K43P1l16
3991e5K30o3k46L21l61J54K2M9l98M72r7m6R9j55j6J20J9K4L2Ro0J04k0r6o0q1
4017i9L83j85k21K10o1l15O9J30m7M11j35j24n2N9k87K62K32j48Ok05J04L5k15
4040a93J07J22k7K2K61k56R9l46K11j4J6N5q7N6k84M56n57K64M52m24K04k96J50
4063iK74k86k10N93m04j61N0J67m1K69k36K14j68k95K91j17J26o6RQ8n0K85m40
4086a17K18k57K60r2K43j57j66p9K43R2j45j6O4K6j26L50m47M5l9J52L29o51K62
$$ y = [-25, 189, 370, 95, -278, -130, -220, 74, -378, 152, -73, -265, 103, -8, -34, 194, -40, -215, -74, -31, 21, 35, -85, 97, 209, 69, -78, 124, -188, -31, -158, 202, -127, 8, -26, -257, 219, 95, 57, 41, 34, 197, 68, 42, -258, -161, -45, 36, -109, 64, -17, 35, -14, 80, 179, 103, 295, -53, -66, -321, -233, -229, -83, 294, -275, -236, -53, 190, 261, -55, 175, 112, -134, 187, -174, -20, 2, 51, -347, 125, 28, -18, 81, -74, -90, 30, 49, 73, 105, 114, 54, 158, 138, 42, -18, -99, 284, 99, -122, 88, 27, -288, -219, -89, -136, 275, 140, 16, -36, 23, -264, -2, 230, 82, 88, -117, -13, 22, -193, -86, 36, 9, 31, 292, 36, 135, -211, 0, -14, 2, 57, -30, 26, -258, 198, -359, -95, 357, -67, 137, -159, -9, 265, -21, -231, 362, -42, -203, -153, 14, -27, 242, 6, 220, 52, -243, 48, -69, 57, -9, 0, 88, 38, 323, -117, 101, -156, 104, 12, 255, 98, -68, -147, 96, 188, 43, 27, 91, 117, -9, 341, -106, -61, -100, 52, 381, -270, -8]
4109hJ79j06j38J66R6j74l0j3k27J49O5J30j59J32j38J0N6P6j16J07P8J30j44
4132A21k79J26J5l1Nm0L13Lm16J93l0k05J73K6L11p1k47m3j12K82l12K64Rk56
4156b01L35J43l05j26M71j67k90L02l02j27O43p44L28K09l42J94l3j15L35m83
4176b75L85k23m9K50o5k00J58o1j9J73N9l28l06P58j84q3pj57J65o4P0j17J16
4199dj56k8K27k50L77k52o9j19K56j12M65k55qo0J3J97n43M06j07J38n06K34L35
4222A79k01j29K53L1k1p3R3j71o0J87p6j45J02j73J7L83j14J85k90m9%J51l12
4245b33K29J09n87M19L5P7j62K26m0m9N3k17l1l7J96j2K30j75K7R3j60L24l74
4268e9M90k82J47m28K14j00l15M79j28J29k72m3o8L19nN5R5l69R5J82j24j76R1
$$ y = [-8, 171, 65, -73, 93, 189, 15, -15, -28, -255, -106, -41, 89, -70, 62, -76, -66, -10, 66, -50, 57, 135, 265, 121, -158, -32, -17, -48, -43, -83, 230, 233, -183, 10, -20, -225, -52, -26, 285, 214, -33, -76, -188, 94, -218, 46, 55, -201, 134, 277, -28, -154, 317, 150, -140, 162, -140, -267, 376, -368, -40, 169, -173, 21, -12, -127, 208, -275, 110, -113, -162, 88, 23, -177, -19, -80, -99, 74, 133, -195, -501, 257, 73, -10, -17, -174, -9, -73, -3, -120, -4, -160, -188, 39, -211, 166, -86, -155, -274, -18, -130, 335, 80, 72, 12, 25, 222, -321, 85, -22, 116, -390, -156, 179, -22, -151, 102, 133, 112, 39, 132, -39, -99, 88, 12, -133, -31, -204, -187, 196, 82, 267, -23, -72, -72, 79, -233, -4, 105, -482, -63, -28, 49, -113, 113, 73, 24, 77, -140, -171, -208, -12, -24, 206, 31, 58, 151, -9, 315, -59, 431, 149, 296, -132, 82, -18, -333, 146, 18, 147, -125, -168, -236, 83, 78, 133, 228, -141, -46, 136, 12, -164, -73]
4291g3K66r2j9m06L28Q8R8j8m5j60MJ37k32K40j36J3J56k71l4N0O5Q7j74N54k70
4316A56m91O68o80K71Q4k48J26j90L56p6l66N10P0J19l15J23Rk40j83P8L45k28
4338a02J46k88K43K04n42M90k72J41k56K33jj07K14j55L26k73Q5j16O6p3K44J7
4360B24m22M34j16J77l98l2R0L55k81K49j60j44N9m2L29n78LJ00J89l64J68Q7
4382g3r0O8Q6LlJ28j7k39J98J14r0K55j46j85K35n6k86M6M16l14m4K69j25rM2
4407A83J47l89Q4j58Q8j00K72n5j74O3k4J97n1o8j33K01j88K41l36L2M54m36J61
4430A1O5k11J6l4K02r3P2j6j92kK51k19J06o3j5Q2L17l24m0R3l53M60J3j96k1
4455i1L57j64N3l21L2N9j45M33j9k84K34k81m9L34k55j4J7m2K82k66j31L29r5
$$ y = [-73, 193, 101, 82, -324, 4, 92, 190, 172, 127, -33, -29, 108, -124, 116, -20, -7, 149, -122, -156, -106, -41, 46, -128, 426, 156, -335, 333, -347, -76, 8, -240, -114, -304, 52, -24, -390, 120, 190, 309, -6, 117, 126, -114, -297, -219, 126, -102, 44, -244, -1, 203, -339, 151, -121, 20, -236, -3, -4, -111, 103, -52, 274, 1, 86, -30, 36, -37, 207, 224, -198, 236, 120, 297, -101, -133, -43, 312, 31, 280, 120, -24, 35, -7, 322, -256, -253, -153, 36, -328, -160, -73, -163, -95, -9, -6, -9, 119, 102, -137, 61, 175, 85, 340, 194, 9, 244, 188, -98, -52, 364, 50, 6, 275, 150, 141, 183, 330, -59, 25, -133, -45, -145, 127, 72, -102, -39, -63, 134, 83, 15, -118, 83, -105, 136, -200, -168, 286, -150, 11, 76, -135, -119, -153, 49, -44, 28, 12, -180, -182, 69, -150, -44, -107, -122, -40, 277, -47, -87, 6, -347, 113, 126, -70, -91, 266, 102, 155, -166, -134, -75, -220, 213, 194, -90, 144, -137, -186, 148, -107, -121, -104, -146, 136, -130, -261, 68, -27]
4478b7k4J20l58K49m9J32j70K75l15J73N2k10M82m11j90N6L16j65J28j47J78l35
4500b40L94l52K35n2K02m36K57J83l97K89m15K16P7J1O1k75M01j0N2k63J16p8
4522b4K28m29M18k7J04j95R3O9n70L00j52K57n3j44J92k00J84k01M04k97P0m1
4544a4j01K96l05P9l75M67j32K96l25j20J36K19r6J35j9p8m20M71K4j26J51m8
4566A15Q1l77J04J23l12L75k7k05M21j22Jj96m5N3L48k68j38j4J64l22L39k11
4588a13K53L5K6l73J72j30J60K6k12N11l37j40J16l42K92j10O3M8P6L2l53J45
4610a55mL57n45K09J30J47j63J8P4l29J04J15Q2J4j13j19J53J78LJ10k27Q6j70
4633d5L63n36K02K04j68K61l38K78j49j78o1j21J02P0Q6r7M5R4k81J64n7M7L87
$$ y = [-27, -51, 69, -289, -40, -89, 43, -127, 148, -167, 6, 58, -152, 330, -81, -271, -215, 101, -64, 64, -83, 95, -240, 154, -198, 37, -15, 187, -249, 8, 191, -206, 83, -332, -116, -39, -28, 33, -242, 159, 149, 201, -62, 54, -24, 204, -225, 193, 166, 270, 75, 168, 237, -333, -33, -185, 72, 19, -125, 67, -133, 51, -150, 254, -43, 27, -14, -115, 181, -124, -45, -420, 47, -85, 211, -114, -234, -98, 121, 25, 160, 141, 63, -357, 114, 138, 12, 163, 115, 196, -181, -77, 46, -266, 109, 82, -123, 298, 176, 177, -19, -64, -11, 337, 69, -69, -83, 81, -241, 98, -113, 140, 175, 201, -172, 0, -130, 30, 56, -156, 355, 18, -122, -6, -348, -56, -166, -103, -55, 21, 53, -300, -155, -159, 198, -347, -138, -8, 139, -24, -6, 68, -261, -157, -42, 40, 54, -59, -178, -25, 153, 156, 266, 39, 125, -45, 318, -218, -16, 188, 20, 281, -57, 221, 72, -106, -167, -288, -186, -116, -30, -127, -82, 12, -269, -105, -162, -115, 272]
4656B72m89M68j05p8J3l52M18k80K05j45M03m95N54m05K79j04j26J8j12J4j94
4677b41J45L5RK88n25M20j9p0j01L2J09p3K0Nq4L4l83J02K18L0j01K08J35l27
4701a34M33k40j61K1k48J89J25R2l4Mn5K81k67p8J81j43J57j26k24J24K51k94
4723a46j97O19J8K5l58O1K2O4k43N71k57k52n1M25n43J46j74M37K8l46J03nP5
4746B2j42K34k69k46M26m8R1j56Jlo5K32j59J03j88Q5M13m40OK98p8J79k49k53
4770b06J42k07N58l53m1p8M8L39k06l29M20j21m9J78k70J64m3j8mj32j61K98O8
4793cj78O06n73O9l55L35L88j94o0L08j30j27k1L18o05JL82k75M82l32N1J67m44
4816a90L89j31M6j88LK95l24K02k37N0M7M14k22l56K14nj36L00k75L98q4l94o1
$$ y = [272, -217, 251, 146, 68, 81, -271, 147, -133, 72, -73, 330, -165, 389, -16, 263, 159, 33, 51, -61, -47, -241, -96, -61, -52, 236, -289, 131, 112, 42, -59, -27, 82, 9, 29, 34, -50, -16, -399, -297, -79, -49, -150, 58, 193, -134, 299, 59, -102, -81, -329, -140, -15, 77, 43, 47, -8, 273, 6, -72, 109, -34, 123, -3, -227, -103, 148, -146, -343, 276, 294, 319, -39, 22, 44, 108, -135, 436, 179, -73, -124, 301, -242, -96, -270, 167, 195, -151, -48, -53, 22, -120, 114, -155, -401, 25, -23, 68, -88, -87, -90, -155, 77, -82, 21, -167, -82, 331, -109, -103, 195, 117, 296, 47, -206, -64, -271, 287, -66, -107, -185, -137, 202, -4, -333, 87, -34, -83, 95, -175, -11, -54, -72, -76, -208, -369, -71, -3, -181, 425, -148, -79, -434, -99, 289, 95, 35, 343, 213, 86, 65, 383, -222, -221, 161, -114, 368, 36, 87, 254, -190, 199, 68, 114, -74, -71, 224, -100, 102, -135, -85, -38, 376, 154, -202, 12, 7, -129, 171, -104, 294, 210, -184, -245]
4839b45R7qL20L2j05m00L88kk28K49J46jl85K85l6p8J09l22K85J63j12j52K9q7
4863e8k05K40K17k59K97k50K39l74J46J08kl29L05L3l9m2j70J53N4j18P7p7P8
4886B4j97j0o9K31k8J34p6L6J24m5O2P9j61j18j57K35j2k93N92k01j93j22J75
4909A0j05j81M89k84K32O1o06J62P7K12J1l9j90J73k36M38q5p9N9l48j32L27k82
4932c16L50j96J24r3j57J42m1J79j63L85k73Q8j22m6J63K95k91O5k03k81M01m4
4954c4K02o4j64k18K29L63n75L27o2k05K95L6j17j13L25l71nJ57L9k46K79k29
4976a51P5K19k14j29M21l91K92j20J36j54k7K69n01K14L54K4o46M81j53j74N38
4997C63m62N17k96l53J80J4l63O79Q9l98o2L23l84K66j1j51p1K2J5j83L65mj55
$$ y = [-245, -148, -156, 164, 196, 91, -309, 79, 77, -151, 98, 244, 243, -142, 143, 107, 29, 138, -184, 101, 264, 152, 0, 29, -58, -263, -23, 194, -65, 232, -18, 221, -153, -7, 101, 99, -230, 75, 108, 69, 27, -143, 10, 64, -54, 23, -54, 24, -173, -183, -252, -21, -49, 85, 9, 45, 169, 124, 186, 265, 104, -14, -171, 64, 52, -241, 351, 150, -43, -165, 10, -95, -276, 213, -71, 161, 222, -384, -222, -145, 67, 78, 39, -151, 22, -214, 224, 139, 60, 119, -229, -361, -34, -316, 34, -162, -38, -131, -288, -146, -187, -8, -171, 214, -59, 29, -93, -139, 24, 319, 28, 93, -110, -391, 10, -34, 168, 104, -60, -278, -49, 314, -261, 66, 4, -201, 94, 130, 13, -100, 225, -146, -151, 6, 45, -201, 78, -151, -76, 143, -71, -200, 221, -170, 122, 2, 138, -16, -43, 226, -275, -61, 293, 317, -329, 152, -1, -175, 363, -99, 418, 122, -231, -51, -37, -400, 279, 368, -30, -92, 231, -153, 113, 102, -49, -120, -98, -83, -266, 99, 95, -60]
5020f0J08k27l9K38k36M15k18j69J71l7K71j2J06k36l89K12M4j93Q8K33j03PP9
5043E3k66L9M27m37K73L5k14K38j07l7J43j17k15L76lM7j92P3J36k53L43k13j77
5066d8j39J9Q4m9J7K28p5Nj57j23L66j81K09j32l5j09J54q1K80l15L11j8k33Q3
5090F1o6j1K71k17J05k90J57O0j88J21k2N2j66J16L35l1l66J92k96L12j88k68
5112c27J38j71L66L71m19K7j50K1k33L21o5k39M30j24J80l26J15L8j60M1M4K22
5134A00J51k55j10M1K29m56N71o13K60J7N8l8R8p5k59O02k27k47J40o0J94l47
5156b26K50J03j67K95m15N08n93K61Q3k14J12K9K24o0j98j97K29m08N70J1j8j51
5178B8J57r0j04M5m38M99j48P8j51K01J26j9j51J8K1k78rL00k88O5P2K82j01l57
$$ y = [-60, 48, -179, -218, 20, -216, 199, -19, -188, -17, -54, 217, 205, 311, 75, -314, -102, -58, -251, -163, 70, -33, -26, 53, -213, -174, 253, -184, 89, 124, -90, 148, 41, 4, 147, 30, -185, 191, 188, 235, 43, 116, 252, -1, 342, 129, -48, -187, -168, -84, -133, -116, 112, 37, 42, -115, -238, 128, -53, 156, 24, -11, -120, 34, -47, 233, -82, 229, 211, -22, 61, -5, -16, 255, 38, 143, -147, 10, 70, -118, 3, -19, 33, -133, -17, 318, 287, -79, 113, -183, 129, -59, -327, -189, -360, 6, 377, -42, -15, -165, -144, -377, -56, -121, -360, 70, -54, 126, -200, -85, -47, -207, -166, -122, 100, 251, -4, -114, -73, 156, -300, 271, -342, -82, -65, -7, -45, 53, -22, -281, 321, 94, -153, -13, -73, 121, -226, 24, 127, -40, 255, -160, 348, -245, 16, 99, -115, -3, 26, 250, 190, -8, -205, 24, -384, 186, 197, 179, 28, 185, 95, -9, 36, -402, 97, -51, 27, -124, 77, 203, 184, 33, 51, 72, -206, -215, 85, -203, -138, -66, 216, 115, -242]
5202b42K41j88J2Q7J14J00k1j05j68P7j97M37n60O53K4o22K72K8J91J1j54J30
5224A20l2j14j97J04L83j69O5k09r9K83Om30J48J18K12j72J91k80O3J82l61j66
5246c54P3K78m47M58p6K6nk69M56j88k04K92J6j01j30K79l20K3K65j79J46j27
5268h8L3Nl16K01J90M7l81N2L23K43k04q8k96K08J80k14M2L93n28M3J5K18J20
5291A98j37j13J17j04J88q1o5j51K19p6K22K8k0j70j13J46k68L05J06l70P4K87
5313B22l16J44J74l08k04M40l10J75j0J72k40j53k03M48Q1J49k73J12l75L15l6
5334Dm09J26M01j21R8l54L40r4P9J66l31K91j47J33k0K7k63K91k93L30n80M16
5356I0r6l80K14L59l53J63j05J70J32l46P4JO9K31k26K28o16L59r3L06j24j41
$$ y = [-242, -1, -189, -177, -90, 24, 124, 103, -2, -170, -93, -290, 147, -413, 240, 264, -358, -86, -58, 133, 144, -10, 120, 88, -26, -223, -119, 264, 95, 160, -49, -148, 135, 141, -289, -141, -23, 189, 17, 208, -72, -9, 173, -188, -354, -281, -3, -450, 8, -68, -42, -47, -316, 140, -48, -252, 40, 56, -45, -175, 104, -216, -193, 72, -107, 39, -88, -55, -50, -366, -165, 25, 72, -309, -257, 66, 309, 105, 17, -279, -71, 109, -105, -63, 330, -198, -155, -140, 78, 198, 61, -52, 65, -39, 149, 68, 3, -148, 71, -5, 217, 245, 225, 55, -58, 88, -180, 125, 231, -139, -65, 222, -94, 50, 224, -84, -288, 152, -158, 17, 7, 179, -61, -214, -417, 31, 112, 261, -12, 100, -275, 40, 4, -405, -279, 122, 1, 99, -255, 85, -9, 70, 236, -95, 196, 49, 182, 162, 189, -74, 217, -76, 254, -326, 90, -6, -386, -172, 187, -166, -3, -108, 62, 194, -152, -78, -77, -8, 223, -3, 225, -391, -32, -125, 181, 57, -84]
5378h4J01L1O2k12J2o5K60N2l67J70J68j77k66N30K7j15l10J63j53K37k49M4Q6
5401e5M3k8K71j04J64m05J24k8K29k84N7j07M3p4K34j8J50l56J51r3J08J59pk83
5425a09J49l2o8J80l33N1RK86l4j57K82k12m47M61j4J77m74Q6K95P8j74j76j76
5448c52K65K16j09M8k32K04j36j50J35J85j01J72k5j44K10l00n9K78j69J91n12
5469c85K15P4J59P3j10k24O6J45N9J75n76K62J10k04J93j30p5j68L42l0K77m24
5491a76K45j29J82l53L00Q1j59j13M1J32o1J96k12R0r8j87j4L26j51Rj10n7J61
5514e7L27m63K52j01J71Q6L0j36l7J24j66o1K92l69K7K77k5j70m64Q24l27k6q0
5537g2K89k32k19N5K92k03lL59m11O8K02k32J42P7j83O7K16j41K2j33j12k08Q8
$$ y = [-84, 17, 48, 110, -102, -90, -155, 105, 157, -210, -40, 128, -49, -315, 215, 242, 127, -183, -20, -173, 64, -185, -141, -55, -12, -40, 231, 127, 291, -114, 10, -18, 211, -73, -16, -123, -80, -154, 80, 62, 212, -144, 7, -86, 22, 181, 174, -109, 40, 8, -60, 120, -213, -162, -153, 133, 99, -58, 224, 12, -435, 26, 12, 189, -285, -199, 96, 174, 0, -176, -352, -87, 129, 20, 68, -164, 40, -96, -246, -111, 74, -27, 145, 120, -24, 186, -114, -173, 105, -64, 127, -385, -170, -96, 63, 136, 26, -198, -132, 13, 72, 247, -329, -67, 43, -161, 32, -98, -173, -341, 1, -29, 248, -176, 69, -60, 122, -231, 69, 150, -9, -122, -81, 51, -10, 186, -26, 64, -34, -221, -235, 91, -60, -51, -161, -218, -57, 270, -193, 59, -42, 129, 215, 245, 109, 72, 196, 30, -31, 261, -108, -81, 196, 171, 1, -463, 361, 34, 8, -72, 217, -15, -234, -179, 113, -90, -93, 266, -145, -77, 125, -107, 35, 112, -71, -4, 212, 71, 93, -40, -152, -360, -272]
5560b72M53J26l08k38J83k29K31p2Q4Q3l3k2J25K24m07j00K34j27j02J79j57J05
5582d0J21j46K52n1k25n0K82j20n7j23L50k19j1J97j95J84m20L59p4j00K66m33
5604b53M37k46J91l12K37k13K17j13N6J64m78L19K48k24L7r1l43M13kO7q6p8j51
5627b04K58K5k37K32q5Q1k39K30O0l87J96j9j68K28j27J19J42j54L0L0J47j16
5649D2j11L48k18k68J51Q6K34m08K43J63o4k49m4J26l4J46l39K16O6k53J22K57
5671B12m13L63j67k51L5M02Mn66L89K9loR6LM0Q8k37r2Q8J49R4l44K14J11l16
5696g8P4j45J45j06R5K86j45k26J4j10K95PJ07j53p8R0j17j56K24J51l7n12M74
5719I9j14J09j30j10J21J74m1J10j05k92K62j43O3J79k73O8K86j87JL20k33m10
$$ y = [-272, 181, 307, -1, -239, -56, -285, -54, -126, -42, 41, 8, -14, 111, 335, -72, -172, 62, -65, -167, 12, -145, -40, 81, -65, 187, 136, -89, -139, 143, 23, -34, -157, 193, -26, -37, 160, -35, 149, -271, 88, 14, -86, 180, -253, 184, -62, 129, -183, 54, -159, 58, -55, 1, 165, -313, 6, 254, 30, 67, -24, -367, 46, 44, 111, 25, -53, -204, 54, 79, -158, 74, -11, 70, -169, 61, 121, -266, -70, -89, -257, -29, -156, -37, 105, -49, -19, 11, 158, 42, -69, 279, 61, -207, -56, 30, 264, -144, 99, 262, 198, -51, -95, 31, -3, 143, -196, 20, 86, -167, -45, 212, -201, 162, -5, -256, -221, 181, 185, -381, 8, 37, 34, 28, 124, 127, 167, 255, 18, -74, 14, 163, 257, -87, 127, 238, -78, -4, -149, -4, -110, -15, 271, 126, -100, -86, -196, 99, 106, 213, 60, -18, 72, -45, -201, 23, 174, 137, -375, 99, -15, 94, -36, -146, -25, 149, 108, 218, 113, -179, 83, -60, 3, 182, -91, -23, 263, 76, 77, 397, 164, -246]
5741b46J82K01p3j71P1Nj1R3L4j18K59j72l8j99J86j78J65Q7j02O0l0j32L43k32
5765a6M30l50J96k33J21l18j09K28R8k07J49K27l38J56N6o4j78N61m09j92K72
5786H0N0j37r5j89J81L43m31J50K26R0j0m16M7Q5j73L81l03O5J31J8k6K41l03
5809EO5J67m08L71n32J91J28j91M65l19J2J01k37J05J29j85j33K39m7m23O16k55
5831a36O2j06K29k1k0kJ66k72K41r0n32M57R7j49Q0j22P2O8j9K07m42L62k46N
5855a11O8o9R9M8O8J13o2j19J3k71l05M86j97J90J1J3k05L70l26L86m43N07p03
5878d39N20k53J03q3K49R5k95K20k72K21j76J99l06L69j74L25k91P8k59L0J51
5899A2J73r3k35M38l36J33J78o3k14rj11k5L46j62n6J21K5l45M49l16M44k61j06
$$ y = [-246, -64, 137, 64, -107, -36, -31, -42, 51, 85, -33, 226, 54, 16, -183, 3, -175, -10, 77, -25, 35, 5, -127, 216, -16, 414, 64, 260, 27, 148, -170, -279, -51, 47, -160, -11, 216, -122, 34, 90, 26, -152, 409, 0, -192, 80, 130, -7, -102, -291, -110, 233, -198, -48, 178, 268, 258, -158, -111, -26, -199, 182, -121, -56, 75, 93, 67, 308, 5, 70, 237, -171, 200, -332, -141, -13, -204, 261, -58, -46, 55, -182, -77, 52, -133, -266, -27, -74, -497, 119, -136, -74, -180, 49, 28, 8, 6, 172, -100, 141, 51, -481, -24, 73, -76, 4, -118, -46, 22, 3, 210, -232, 130, -116, -111, -43, -112, -13, 35, 103, 216, 154, 35, 48, -223, -528, -42, -239, -49, -38, -25, -230, 140, -186, 200, -243, 264, -439, 81, -172, -69, -152, 97, 192, -103, 117, -155, 66, -110, 89, -217, 152, -22, 303, 12, 90, -169, -139, 12, 185, 92, -143, 295, -41, 92, 270, 207, -7, -16, -127, -152, 194, 32, -24, 97, 122, -223, 226, -90, 354, 93, -13]
5922a3j24J59L70n14R8n8R3j06N1j9L33k9J91n47K78l36L91k64j21P5O0J05mm68
5946c99L78O5k6R4l4j66K93k86J18J22q5o0o8J00l1n31L87K86j81l7Q4k20n7J88
5970f6Q9J34k44J90n8m0PL4q8k10K02K8J3J14j66M5l0P5j53K79r8K28m05P2j94
5995b42n6K54P9M9j74K60K4o9O4j81j55K10J89l47k4J20R1J2m3r1j88M19l63M20
6019B58k47m08M42l21L85j56l42M33o5l2p4n9J84O7Q9rk92N7l8j12K47p6o9O1
6043g7J30K37n3m10Q1K13J07m29K01j57J1J05k4o2J56K35l09L24n8p0m31K59j79
6066b00M03m53K81p5J70M9k02P0j30J12o6L7J54j51j36K21k47J35n4L07k9k33
6088c7J03k23L99o8l00j35L03O9j48j74J79L6L61m25J13j23j02K9j22NJ30J25
$$ y = [-13, -137, 22, 392, -122, -24, -82, 11, -95, -44, -63, 270, 241, 432, -115, 163, -173, 218, -46, -167, -92, -32, 73, 69, -399, -21, 44, 18, 112, 78, -88, 205, -81, 37, 159, 74, 14, -54, 46, 15, -516, -129, 157, -24, -61, 23, -197, -254, -66, 23, 157, -87, 103, 45, 5, 12, 46, -42, -252, -50, -22, -9, 105, -61, -16, -46, 29, -124, 155, 57, 285, -120, -48, -242, -298, -44, 35, 84, -90, 170, 194, 125, 189, 8, -147, 63, 252, -95, -119, 1, 92, 104, 61, -30, -218, 201, -162, 258, 11, -397, 45, -276, 109, -47, -389, 44, -21, -53, -127, -186, -2, 65, 154, 145, -147, -90, -128, -240, 7, -69, -138, -77, 53, 290, 237, -173, -92, 121, 228, -201, 0, -157, -146, -41, -65, -127, 29, 264, -45, 279, 221, 151, -280, -21, -200, 203, -250, 31, -44, 126, 175, -27, 43, -87, 25, -41, -4, 150, -1, -137, 84, -163, -28, -82, 225, 196, -37, 66, -157, 242, 174, -126, -261, 42, 111, -37, -211, -32, 4, 365, -60, 53, -70, -172, -143, -265, -260, -130, -5]
6110ep8j6J19j87L37k48J52k24M47k88k35k3R4L41j86j45O5O6k08K38k35K81j04
6133d2j6j45L87J5n96L80J23j97J25k3J1k17J48j63N89l76j66J02K93k02j71K67
6155A26k3N7j30n6k60N53k64M6o3J37O6r3k29K47j18J33J53j50l20L24j82MN5
6178A3K4j2j17p6L6M82k21j20j73M47m60K97J86k15j17R4Pn02K67k88M33L6p6
6201e5K63j05j95m6K41k24j21L58l69kK33N2j17L9K21k90L72m77L64k52k8P7r8
6224a59N56m03KP6L0J38j05P4k20k17L04k04j41J62j52L15q3j17J5O0J38P9k71
$$ y = [-5, -83, -99, 20, -167, 170, -78, 74, -150, 297, 9, -226, -249, -155, 186, 0, -145, -80, -14, -222, 16, -219, 62, -42, -58, -203, 184, 199, -397, -17, 106, -91, 34, 11, 22, -195, -47, -210, 379, 3, -163, -61, 232, 30, -141, 126, 103, 160, 30, -26, -286, 267, 3, 49, -14, 123, 189, 96, -133, 114, -4, 129, 282, 132, -188, 136, -46, -42, 13, 37, 25, -92, -168, -132, 350, 129, 9, -164, 283, -177, 120, 306, 91, -26, 68, 75, -427, -160, -448, -15, 21, -55, 208, 103, -92, -138, 103, -121, -242, 116, -253, -255, -22, 30, -87, -48, 173, -117, 255, -222, 142, -110, -138, -61, -159, 397, -6, -4, 72, 102, 240, 135, 209, -11, -228, 76, -128, -269, -107, -259, 56, -27, -144, -129, -69, 69, 148, -123]
$$ [...]
8191C
##END NTUPLES=NMR FID
##END=
