##TITLE=1H_DE-63_35D
 D2O
 8 sc, 
 15.8.2024
##JCAMPDX= 6.0         $$ Bruker NMR JCAMP-DX V2.0
##DATA TYPE= NMR FID
##DATA CLASS= NTUPLES
##ORIGIN= UXNMR, Bruker Analytische Messtechnik GmbH
##OWNER= root
$$ XWIN-NMR		Version 3.5
$$ Thu Aug 15 16:12:21 2024 Russian Standard Time (UT+4h)  she@DPX200
##.OBSERVE FREQUENCY= 200.1318
##.OBSERVE NUCLEUS= ^1H
##.DELAY= (6, 6)
##.ACQUISITION MODE= SIMULTANEOUS
##.ACQUISITION SCHEME= undefined
##.AVERAGES= 8
##.DIGITISER RES= 18
##SPECTROMETER/DATA SYSTEM= spect
##.PULSE SEQUENCE= zg30
##.SOLVENT NAME= D2O
##.SHIFT REFERENCE= (INTERNAL, D2O, 0, 15.7039)
##AUDIT TRAIL= $$ (NUMBER, WHEN, WHO, WHERE, WHAT)
$$ ##TITLE= Audit trail, XWIN-NMR		Version 3.5
$$ ##JCAMPDX= 5.01
$$ ##ORIGIN= Bruker BioSpin GmbH
$$ ##OWNER= she
$$ F:/spectra/data/she/nmr/H-F/1/audita.txt
$$ ##AUDIT TRAIL=  $$ (NUMBER, WHEN, WHO, WHERE, WHAT)
(   1,<2024-08-15 16:11:10.85 +0400>,<she>,<DPX200>,
      <created by zg, POWCHK disabled, PULCHK disabled
       configuration hash MD5:
       00 E9 B6 7A A2 85 ED C7 34 08 36 98 17 FE 4E 26
       data hash MD5: 16K
       78 5B 4B 0A 5E 77 B8 DA C7 FB F3 FD 87 9B 8A B1>)
$$ ##END=
$$ 
$$ hash MD5
$$ A5 E2 53 52 74 32 D1 93 B7 5C 38 8B 37 0A D9 5B
##$RELAX= 
##$RELAX= 
##$RELAX= 
##$RELAX= 
##$RELAX= 
##$RELAX= 
$$ Bruker specific parameters
$$ --------------------------
##$DU= <F:/spectra>
##$EXPNO= 1
##$NAME= <H-F>
##$PROCNO= 1
##$TYPE= <nmr>
##$USER= <she>
##$AMP= (0..31)
100 100 100 100 100 100 100 100 100 100 100 100 100 100 100 100 100 100 
100 100 100 100 100 100 100 100 100 100 100 100 100 100 
##$AQSEQ= 0
##$AQ_mod= 1
##$AUNM= <au_zg>
##$AUTOPOS= <>
##$BF1= 200.13
##$BF2= 200.13
##$BF3= 200.13
##$BF4= 200.13
##$BF5= 200.13
##$BF6= 200.13
##$BF7= 200.13
##$BF8= 200.13
##$BYTORDA= 1
##$CFDGTYP= 0
##$CFRGTYP= 5
##$CHEMSTR= <none>
##$CNST= (0..31)
1 1 145 1 1 1 1 1 1 1 1 1 1 1 1 1 1 1 1 1 1 1 1 1 1 1 1 1 1 1 1 1 
##$CPDPRG= <>
##$CPDPRG1= <>
##$CPDPRG2= <>
##$CPDPRG3= <>
##$CPDPRG4= <mlev>
##$CPDPRG5= <mlev>
##$CPDPRG6= <mlev>
##$CPDPRG7= <mlev>
##$CPDPRG8= <mlev>
##$CPDPRGB= <>
##$CPDPRGT= <>
##$D= (0..31)
0 1.2 0 0 0 0 0 0 0 0.06 0 0.03 0 0 0 0 0.0002 0 0 0 0 0 0 0 0 0 0 0 0 
0 0 0 
##$DATE= 1723723870
##$DBL= (0..7)
120 120 120 120 120 120 120 120 
##$DBP= (0..7)
150 150 150 150 150 150 150 150 
##$DBP07= 0
##$DBPNAM0= <>
##$DBPNAM1= <>
##$DBPNAM2= <>
##$DBPNAM3= <>
##$DBPNAM4= <>
##$DBPNAM5= <>
##$DBPNAM6= <>
##$DBPNAM7= <>
##$DBPOAL= (0..7)
0.5 0.5 0.5 0.5 0.5 0.5 0.5 0.5 
##$DBPOFFS= (0..7)
0 0 0 0 0 0 0 0 
##$DE= 6
##$DECBNUC= <off>
##$DECIM= 24
##$DECNUC= <off>
##$DECSTAT= 4
##$DIGMOD= 1
##$DIGTYP= 9
##$DL= (0..7)
0 120 120 120 120 120 120 120 
##$DP= (0..7)
150 150 150 150 150 150 150 150 
##$DP07= 0
##$DPNAME0= <>
##$DPNAME1= <>
##$DPNAME2= <>
##$DPNAME3= <>
##$DPNAME4= <>
##$DPNAME5= <>
##$DPNAME6= <>
##$DPNAME7= <>
##$DPOAL= (0..7)
0.5 0.5 0.5 0.5 0.5 0.5 0.5 0.5 
##$DPOFFS= (0..7)
0 0 0 0 0 0 0 0 
##$DQDMODE= 0
##$DR= 18
##$DS= 0
##$DSLIST= <SSSSSSSSSSSSSSS>
##$DSPFIRM= 0
$$ [...]
##$SUBNAM2= <"">
##$SUBNAM3= <"">
##$SUBNAM4= <"">
##$SUBNAM5= <"">
##$SUBNAM6= <"">
##$SUBNAM7= <"">
##$SUBNAM8= <"">
##$SUBNAM9= <"">
##$SW= 24.0689170037331
##$SWIBOX= (0..15)
0 0 2 0 0 0 0 0 0 0 0 0 0 0 0 0 
##$SW_h= 4816.95568400771
##$TD= 16384
##$TD0= 1
##$TE= 0
##$TE2= 300
##$TE3= 300
##$TEG= 300
##$TL= (0..7)
0 120 120 120 120 120 120 120 
##$TP= (0..7)
150 150 150 150 150 150 150 150 
##$TP07= 0
##$TPNAME0= <>
##$TPNAME1= <>
##$TPNAME2= <>
##$TPNAME3= <>
##$TPNAME4= <>
##$TPNAME5= <>
##$TPNAME6= <>
##$TPNAME7= <>
##$TPOAL= (0..7)
0.5 0.5 0.5 0.5 0.5 0.5 0.5 0.5 
##$TPOFFS= (0..7)
0 0 0 0 0 0 0 0 
##$TUNHIN= 0
##$TUNHOUT= 0
##$TUNXOUT= 0
##$USERA1= <user>
##$USERA2= <user>
##$USERA3= <user>
##$USERA4= <user>
##$USERA5= <user>
##$V9= 5
##$VALIST= <valist>
##$VCLIST= <CCCCCCCCCCCCCCC>
##$VD= 0
##$VDLIST= <DDDDDDDDDDDDDDD>
##$VPLIST= <PPPPPPPPPPPPPPP>
##$VTLIST= <TTTTTTTTTTTTTTT>
##$WBST= 1024
##$WBSW= 4
##$XGAIN= (0..3)
0 0 0 0 
##$XL= 0
##$YL= 0
##$YMAX_a= 100692
##$YMIN_a= -106512
##$ZGOPTNS= <>
##$ZL1= 120
##$ZL2= 120
##$ZL3= 120
##$ZL4= 120
##$ABSF1= 10
##$ABSF2= 0
##$ABSG= 5
##$ABSL= 3
##$ALPHA= 0
##$AQORDER= 0
##$ASSFAC= 0
##$ASSFACI= 0
##$ASSFACX= 0
##$ASSWID= 0
##$AUNMP= <proc_1d>
##$AZFE= 0.1
##$AZFW= 0.1
##$BCFW= 1
##$BC_mod= 2
##$BYTORDP= 1
##$COROFFS= 0
##$CY= 11.3945322036743
##$DATMOD= 1
##$DC= 2
##$DFILT= <>
##$DTYPP= 0
##$F1P= 15.6554695791079
##$F2P= 12.8336369535428
##$FCOR= 0.5
##$FTSIZE= 0
##$FT_mod= 4
##$GAMMA= 1
##$GB= 0.15
##$INTBC= 1
##$INTSCL= 1
##$ISEN= 128
##$LB= 0.24
##$LEV0= 0
##$LPBIN= 0
##$MAXI= 10000
##$MC2= 0
##$MEAN= 0
##$ME_mod= 0
##$MI= 1.114404
##$NCOEF= 0
##$NC_proc= 0
##$NLEV= 6
##$NOISF1= 3.799351
##$NOISF2= 2.8
##$NSP= 1
##$NTH_PI= 0
##$NZP= 0
##$OFFSET= 15.70392
##$PC= 1
##$PHC0= -26001.22
##$PHC1= 13.78748
##$PH_mod= 1
##$PKNL= yes
##$PPARMOD= 0
##$PSCAL= 0
##$PSIGN= 0
##$REVERSE= no
##$SF= 200.130013532006
##$SI= 16384
##$SIGF1= 3
##$SIGF2= 2
##$SINO= 400
##$SIOLD= 16384
##$SREGLST= <1H.CDCl3>
##$SSB= 0
##$STSI= 0
##$STSR= 0
##$SW_p= 3612.71676300578
##$SYMM= 0
##$S_DEV= 0
##$TDeff= 0
##$TDoff= 0
##$TI= <>
##$TILT= no
##$TM1= 0
##$TM2= 0
##$TOPLEV= 0
##$USERP1= <user>
##$USERP2= <user>
##$USERP3= <user>
##$USERP4= <user>
##$USERP5= <user>
##$WDW= 1
##$XDIM= 8192
##$YMAX_p= 0
##$YMIN_p= 0
$$ End of Bruker specific parameters
$$ ---------------------------------
##NTUPLES= NMR FID
##VAR_NAME=  TIME,          FID/REAL,        FID/IMAG
##SYMBOL=    X,             R,               I
##VAR_TYPE=  INDEPENDENT,   DEPENDENT,       DEPENDENT
##VAR_FORM=  AFFN,          ASDF,            ASDF
##VAR_DIM=   8192,          8192,            8192
##UNITS=     SECONDS,       ARBITRARY UNITS, ARBITRARY UNITS
##FACTOR=    0.0002076,     1,               1
##FIRST=     0,             0,               0
##LAST=      1.7004516,     0,               0
##MIN=       0,             -106512,         0
##MAX=       1.7004516,     100692,          0
$$ Real data points
##PAGE= N=1
##DATA TABLE= (X++(R..R)), XYDATA
0@%%%%%%%%%%%%%Qj6J6j6J7k4L1l3M0m7N3o1P1q2R3j06J20j37J54j71J90k13K38
36A25k65K96l29L66m05M48m99N51o09O78p50Q31r27J035j157J304j480J690j954
55a051K293k747L392m378O096j6360J03273k307j11310k0643q210K2571R7745
68F8364L2328j28387p4011P9065P5148l690j6000n0875o4809M7449J19441o386
80G7637j05939l6026L1699L2318N5644J4398r8076o9337P1891P9640o369l1888
92A5592m5354m3479M8548R2945q872q3873l2592K4239M3535M5324j0916p9340
104c4243l7096N9896O3289l566l9742m4991j9834N2172P1625j7433p4444k5110
116d9477K3341L6109M3339j0193p8505l0167N9888M5968n878k3984m3882k5150
$$ y = [0, 0, 0, 0, 0, 0, 0, 0, 0, 0, 0, 0, 0, 0, 8, -8, 8, -8, 9, -15, 16, -17, 23, -24, 29, -32, 39, -43, 50, -56, 64, -73, 81, -90, 100, -113, 125, -140, 156, -173, 193, -212, 236, -263, 288, -321, 357, -393, 438, -489, 546, -611, 693, -787, 903, -1051, 1242, -1505, 1887, -2491, 3605, -12755, 90518, 88211, -23099, -43742, -51952, -29381, 68364, 100692, -27695, -101706, -22641, 52507, 48817, 32817, -18058, -82867, -35418, 84023, 77637, -28302, -64328, -32629, -311, 55333, 69731, -28345, -97682, -25791, 53849, 47480, 15592, -29762, -73241, -24693, 68252, 59380, -24493, -57085, -32846, 10689, 56013, 45097, -34243, -71339, -11443, 51846, 48280, 8538, -36453, -56287, -4115, 67510, 50077, -24367, -49477, -26136, 9973, 53312, 43119, -35386, -65553, -5665, 40303, 34425, 10441, -33441, -58591]
128e8591N5847O4629k7464o4139j5853J9971L7186M1680j8549p7566k2409O3780
140a478M8967j0697l1105m0405j9313N6166O5104l0256o9324r351K7228K9544
152A5080L5110j7365p5471j6151O8718L9234k1032l0267l4601j1862N8255N6278
164F5926l7914o8963n411L3692L3064K6497k3890o9496j2602O8740M0902k6099
176B4446l4552k5321m129N2627M9882m1191o6358M962M1123K5519J4315k6171
188A5152o2403j499P0606L1674l4483l4794j8913K987N0469M0037m2569o1072
200d4808P614M0514K2341P337k4836n2630Q73O4768K6997l7830l2917r238P316
213b4499M4427L3604m4395n7469J4477M4161J8265K001k6263m8165O372O3987
$$ y = [-58591, -2744, 61885, 34421, -29718, -45571, -25600, 11586, 53266, 34717, -42849, -65258, -1478, 47489, 36792, 5687, -34718, -54031, 2135, 67239, 36983, -32341, -41692, -14464, 15080, 50190, 32825, -42646, -58797, 9921, 49155, 28123, -2144, -36745, -48607, 9648, 65926, 28012, -40951, -46362, -12670, 20394, 46891, 23001, -46495, -59097, 9643, 50545, 24446, -10106, -35427, -39556, 13071, 62953, 21762, -44596, -39634, 1489, 27008, 41323, 15152, -47251, -48750, 21856, 53530, 19047, -15747, -34660, -31673, 18796, 58833, 16264, -44808, -37194, 3320, 25661, 32998, 8162, -44468, -43595, 21173, 48170, 10340, -22577, -31815, -24499, 19928, 53532, 9137, -48332, -33855, 10306, 28571, 30572, 4309, -43856, -37484, 26503]
225B6503K1591l9172l0285n979J0297L9439K5589m2361n0040J6652M2917J3311
237B8462n785k4909l8831R540N8875J7936m2838l0651N54J4150L6127K0748m2546
250H32m7306K0019M2837J0882q092k4428l3322J2940N4678J2218m1728k7249N181
263b2538J7772L0679J2178m1410m0415K2946M3369P020j4756k4149k6763J5322
275b0745N1390Q585m3019k4991Q214J7094K7299R415m0742l4966K5715L9398K171
288B4818j5782k1650k1255J8853M6731K462m2801k1352J2582J9614K3318M318
300B9856l9370l1571K8126L8627p20j7881j9640j7390J8366M3785l24m3364j6890
313b8390J5950J7444J8726R49l8080k5959L0416L6338m939k0751j7689j2745K0245
$$ y = [26503, 48094, 8922, -21363, -27342, -17045, 22394, 47983, 5622, -44418, -27766, 15151, 28462, 22677, -2232, -41063, -31523, 27352, 45288, 2450, -28201, -27647, -13497, 22630, 43378, 832, -46474, -26455, 16382, 27264, 19172, -5256, -38578, -25638, 29040, 41258, -470, -27719, -22538, -4766, 25913, 38091, -3319, -43734, -20788, 22581, 29601, 14845, -9304, -36067, -20745, 30645, 39230, -3789, -28780, -20566, -3472, 23827, 33242, -7500, -42466, -16751, 22647, 24818, 9036, -12614, -33869, -15016, 31715, 34177, -8624, -29976, -17394, 2220, 25538, 29856, -9514, -41085, -12959, 25668, 24948, 7067, -12573, -29963, -11597, 32188, 31864, -11500, -28390, -12440, 5004, 23730, 24679, -13401, -39360, -8944, 27394, 22455, 1704, -15985, -28730, -8485]
326h485M0182k892m3440j5448J9047J8374J4050l11l4721k3099L0926L4329q199
339B0313k2459j2783p980J8733L6088o184m2916j1937K3227J8009R256m482l1986
352a5101j9750L1326L3399j0956k4795j0889l382J8102L1046p098m0513r737K4354
365c994J7580M468p066k7866j4351L0590L0180j3375k5064r380J665J9371K6179
378B8937j0104l8275p227K5132J7208L054r771k6133j0049L0076K5791j4962k4066
391a0389o440L092J8846K1716j2933l5236l412K6499J4719n71j1030k4119o906
404b6164L1133K3600j7755k3915l866N787J7205J9516j3642l4006l43K7120J2854
417A7524m588j0644j9844m386K9957K0713j9834k4379l02Q937J6072J4650j5211
$$ y = [-8485, 31697, 28805, -14635, -30083, -11036, 7338, 21388, 21077, -13644, -36743, -5817, 28512, 20313, -2146, -14929, -22909, -4176, 31912, 25728, -17188, -29125, -5898, 12111, 21367, 16885, -15101, -34851, -3525, 29874, 18918, -5877, -16766, -20148, -2046, 29000, 21902, -18611, -28348, -3994, 13586, 18054, 10988, -16878, -31229, -639, 29541, 16166, -8898, -18278, -16613, 2758, 28937, 18833, -19442, -26669, -1537, 15671, 18725, 8954, -17179, -27228, 2848, 28639, 13677, -10389, -16829, -13737, 5109, 26825, 13892, -21344, -24756, 1743, 16462, 15891, 4861, -19258, -26164, 4969, 28569, 10814, -13101, -16967, -11180, 6025, 25541, 11899, -22107, -22450, 4670, 17524, 12936, 2292, -17552, -21938, 8019, 28732, 8898, -15481, -15783, -6846, 9226, 23876, 8665]
430H665l1384J266K8050J2198p448j2498j6741j492K8256J7245k0017k2771J219
443a5452J0765J4239J1055j5856k7548M281K7381R877r644j3233j3605K218K7117
456A1595J3667k1410k1168L021J2588J3083Q669j7121k5256O477K6473O617j0028
469G207j2176j2057M242K5873J0235k2880j8592N726J2826J1514N458j7865k2721
482b3210R488K6660L987j2581j0968r467N327K4563Q560k3908j7396R129J2840
495C024Q514L699j6610k0743J1165K5714J559j4787r568o210O524K2533O140k4536
509c582j6390J1249J4071O268Q24j5483j8046J1166K5483L34j6661r034k247O533
523e515J9490M221k3663j4309J3253J4389L398j347j4793j5041J2672K3864j722
$$ y = [8665, -22719, -21453, 6597, 18795, 11347, -1151, -17892, -19384, 8872, 26117, 6100, -16671, -15452, -4687, 9552, 20607, 4751, -22797, -18516, 8865, 18742, 9098, -4135, -17740, -15522, 11595, 25262, 3852, -17316, -14295, -1707, 11376, 20045, 2924, -22332, -15855, 10618, 17235, 7207, -4969, -17026, -12784, 13089, 23324, 444, -18148, -12422, 404, 11918, 17376, -489, -23210, -13722, 12938, 16925, 4344, -6624, -16091, -10764, 13799, 22359, -1549, -18945, -9816, 3024, 11538, 15237, -1373, -22116, -10951, 14763, 16322, 1535, -8033, -14243, -7719, 14814, 20954, -3582, -19972, -8723, 5348, 11616, 12440, -3043, -21089, -9923, 15560, 15894, -767, -9801, -12048, -5515, 13975, 18196, -5467, -19776, -6523, 7866, 11264, 9917, -4876, -19917, -7245, 16619, 14897]
536A4897j6970q451q71Q395J7531J876k2478j2651J3398J4049K597l598j3387
549e663j2444J2788K2098l031j8414o642K075P893J5529J21k2929j0225J5505
562c339J2984N07m566j2667j0035J3909K0240n363j7231n523L599Q517J2843j718
576A2157k0864q869J5983J3198k350o297j0311q071J3591J9445p036j8431l402
589a1257N239Q267J1134k865k0752o492J6650J1611k969p508r657n006J4011J6070
603A6476p831j7330k807P842P934P789m179j8179n601J7414J1449n953p527p673
617h176l757J3401J5232r327j7263p14P977P185P253n495j7716k311J6452R812
631A2553o133q763o872j054J3660J2522j0119j6754Q8R763P560L901n803j5998
$$ y = [14897, -2073, -10524, -11395, -3000, 14531, 16407, -6071, -18722, -5324, 8725, 11322, 7724, -5663, -18107, -5319, 16779, 13748, -4666, -11308, -9233, -1340, 14189, 14310, -8619, -18844, -3339, 9645, 10152, 5586, -7081, -17116, -3207, 17033, 11670, -5561, -11084, -7485, 1032, 13875, 12157, -8707, -17576, -1593, 11605, 9255, 2958, -7353, -15424, -1833, 17612, 10576, -7855, -11257, -6018, 2249, 13383, 10518, -10234, -16726, -76, 11535, 8566, 1058, -8599, -13605, 406, 16476, 8645, -8685, -11492, -3650, 4284, 12073, 7894, -10285, -15886, 1528, 12977, 7024, -503, -8176, -11933, 1468, 16700, 7373, -9890, -10604, -2627, 4558, 11811, 6316, -11400, -13711, 2741, 12553, 6420, -2343, -9215, -10269, 3391, 15913, 5794, -10960, -10872, -1109, 6451, 10352, 4549, -11449]
645a1449j859J7584Q531q056p969m879r75J2837J1630j0888j6038K110R988N866
659F433L496p126j5303P73J7178P549q605r340m078J974J2113R136j0856j5458
673a2114K823J1529N563L51p372j2642K075J6752N474j0712q002j415K685J1304
687F299O788j2219j2833M451J0957M139k87p865j0966L473J5568M309j0384q107
701f677o69M175R757N510j2324j2330O160J1285K337j677o946r807M113J6129
715I036J952j1965o306J123L638R509L953j2748j0520P628J0199J309k795n986
729a973q468M620J4589J697j2145o248L067L904P562L285j1866j0464P837J1567
743F964j59m173n065p689M899J4718P18j2932n275L141M809P170J451j1618r087
$$ y = [-11449, -13308, 4276, 12807, 4751, -3218, -8097, -9072, 3765, 15395, 4507, -11531, -9421, 567, 6433, 9929, 2803, -12500, -11727, 5451, 13000, 4395, -4945, -9023, -7049, 5064, 14200, 3344, -12114, -9291, 2238, 7801, 8152, 780, -11862, -9787, 6965, 12439, 1727, -6275, -7690, -5005, 6299, 13087, 868, -11965, -7514, 3443, 7582, 7295, -570, -11536, -8063, 7505, 11814, 1430, -6677, -7346, -3171, 6586, 12096, -228, -12558, -6398, 4887, 7224, 5547, -1399, -11206, -7093, 9036, 10988, -977, -7283, -6160, -2522, 6987, 10940, -1808, -12328, -4700, 5499, 6808, 4013, -1973, -10441, -5821, 8768, 10465, -1680, -7928, -4861, -957, 6605, 9890, -1976, -12440, -4603, 6964, 6805, 2632, -2433, -10122, -5223, 9495, 10213, -2719, -7994, -4853, -44, 7126, 8577, -3041, -12128]
758a2128Q481J0988k01n520n352m773N049J2520M07j3139n033N342N137N183N51
773G512j0876q344R009J0900j700n954m704l990N670J2362j987j2475m183N667
787c093N612M505j215j0850n878R348J0409k697o898m878j200O055J0245k241
801G224j2724l064P062N066K863j564j0087n156J0281R235m226o386l889p96O447
816B86R407l917j1653k161O876N580J611k839q880l676R742R000m705p556k683
831e568O90N950P871l944j1697j326Q616L946O10k570q483k764J0457P523n738
846C573o999j939J418N720P035m620j0690j081Q362M607n41l473p238j915R847
861B066O997o128p321o93K126N263N900m923j0893Q61Q521L536j175l891o447
$$ y = [-12128, -3647, 7341, 7140, 1620, -3732, -8505, -3456, 9064, 9471, -3668, -8701, -3359, 1778, 6961, 7512, -3364, -11708, -2699, 8201, 6501, 547, -4157, -8147, -2477, 9885, 7898, -4577, -8760, -3093, 2519, 7024, 5809, -5041, -10919, -1571, 8838, 6141, -757, -5635, -6835, -780, 9465, 7224, -5500, -8564, -1502, 3564, 6427, 4863, -5224, -10380, -99, 9136, 4910, -1476, -5365, -6161, 286, 9693, 5776, -5877, -8038, -1162, 4418, 6029, 3190, -5690, -9366, 376, 9376, 4671, -2885, -5568, -4878, 1072, 8943, 4999, -6698, -8024, 592, 4538, 5148, 2578, -5905, -8669, 1788, 9311, 3573, -3426, -5365, -3947, 1773, 8808, 4188, -6502, -7583, 779, 5386, 4845, 1372, -5866, -7781, 2066, 9063, 2935, -4386, -5079, -2953, 2310, 8210, 3287, -7606, -6745, 1776, 5312, 4137, 246, -6201]
876f201o09J0011N719o734p127J59K508N677M131n379r558J325Q876K764k257
891C305l588n305l95R592N396p907o419R48L285M426L774o146q898K358Q991K196
907E613l078l688m967J328R095L647p701o163K113L531L971K615n472q588K797
922d947R073J735m047l644l486Q85R011L254q210n732K895L619L243J889n890
937c52p366L714Q614J333m919l448k447J393Q109K784q205n972L484M914K502
952D138L70n328o425L642Q755N30n200l610j202K178P351J368q132m899L859M354
968A749K085l20n008n645M610P984m31n257l007q85K615O530Q09q085m307M382
984b181M487J725j011n361m204M491P558j028n356k593m64L262N750M4p957l595
$$ y = [-6201, -6810, 3201, 8920, 2186, -4941, -4782, -2274, 3403, 7534, 2155, -7403, -6078, 2798, 5562, 3305, -283, -5588, -5983, 3609, 9005, 1098, -5321, -4373, -1088, 3338, 7112, 966, -7932, -5574, 3417, 5613, 2535, -1153, -6120, -4792, 4303, 7950, 249, -5914, -3801, -270, 3701, 6316, 844, -7744, -4947, 4126, 5861, 1814, -1830, -5316, -4431, 4580, 7834, -376, -6108, -3213, 406, 3649, 5538, -352, -7718, -4004, 4610, 5943, 1024, -2424, -4871, -3478, 4631, 7415, -790, -6762, -3278, 1636, 4138, 4508, -820, -7245, -3603, 5152, 5682, 482, -3128, -4330, -2152, 5199, 6567, -1565, -6464, -2605, 1749, 3834, 3514, -1494, -7139, -2529, 5455, 5024, -233, -3240, -4125, -1510, 5020, 5829, -2256, -6563, -2181, 2306, 4031, 3020, -2341, -6545, -2054, 5504, 4476, -880, -3473, -3937, -675, 5075, 5119, -2838, -6433]
1000f433N082M214Q80j190m740m062M812P369j554n804j779M76K229N318q2p992
1016c256l063N661M364m38j612l860m056N391P072k366o234j403J171K894M690
1031D955p87p585k713N742M123m79k017m228k371N047O459k820o256r57J672L197
1047I82L878j405p329k227O359M179j529k700l029j762M874N732l118o293o98
1062d086K908K969K324j403o680j649O378L956k774k319k638j574N395N007l141
1077B673o301J2K931K407K264j781o243j056O347L334k531k945k014m44M320M520
1093E493l336o215O51L141K146J260j237o002k82O249K656k798k863j784L38M105
1109A522L387l473n395P92L709J598R13k029m947O8N873K492l346k704j261M38
$$ y = [-6433, -1351, 2863, 3743, 2553, -2187, -6249, -1437, 5932, 4378, -1426, -3205, -2729, -500, 4818, 4736, -3256, -6319, -658, 3706, 3268, 1656, -2204, -6260, -869, 6203, 3837, -2397, -3800, -2629, 265, 4955, 4168, -3417, -6130, -388, 3735, 3256, 1239, -2989, -5360, -313, 6146, 3326, -2930, -3887, -2215, 982, 4860, 3455, -3874, -6101, 258, 4437, 2908, 208, -2821, -4583, 291, 6023, 2905, -3388, -4086, -1178, 1791, 4115, 2712, -3968, -5617, 761, 4717, 1943, -376, -3014, -4588, 807, 5814, 2673, -3628, -3616, -685, 1722, 3986, 2205, -4038, -5094, 1253, 4587, 2056, -889, -2903, -3347, 973, 5493, 2157, -4058, -3407, -266, 1880, 3140, 1903, -4099, -4381, 1868, 4524, 1726, -1137, -2921, -2583, 1522, 4909, 1436, -3959, -3167, 542, 2140, 3053, 1024, -3923, -3855, 2018, 4510, 1164, -1540, -2801, -2363]
1125b363M049L280m207m874R99L893J686K7k054m564N38N653J935l067k834q05
1141b708O05M124K865m123n158J636M067J062K17k606m052Q72N945J560m109k272
1157b075m33J192L511K438m714m318J882M240J123j091k221l329O50N843J399
1172D097m157k381N42R87L222J724m345m110K331M357K90j218j743l232J465N268
1188C097P39m342k514Q23J878K604J403m171m004L094L581L68j736j787k405J762
1204a610M799L93m163k445J438J739K206M89l609l327K926L662k51j411j800k305
1220c269J821M552K18m404j644J423J541K333j30l502k925K759L979o39j846j740
1236a473j421J538M632j00m695j320J764J874J304K75l695k624L279L622r92k056
$$ y = [-2363, 1686, 4966, 759, -4115, -3116, 777, 2463, 2490, 436, -4128, -3590, 2063, 3998, 931, -1903, -2708, -2103, 2021, 4886, 763, -4395, -2759, 1308, 2370, 2587, -19, -4071, -3199, 2746, 4306, 197, -2075, -2508, -1316, 2195, 4633, -81, -4399, -2517, 1723, 2846, 1755, -466, -3795, -3145, 2698, 4097, -60, -2441, -1899, -912, 2310, 4034, -311, -4421, -2090, 2267, 2557, 1339, -404, -3636, -2171, 3097, 3836, -506, -3020, -2197, -319, 2285, 3688, -483, -4487, -1393, 2188, 2556, 820, -967, -3372, -1610, 3189, 3582, -581, -3026, -1588, 151, 2357, 2846, -763, -4090, -1164, 2498, 2247, 836, -964, -3269, -1448, 3104, 3322, -1082, -2726, -1303, 238, 2571, 2441, -1061, -3986, -1227, 2752, 2113, 267, -1473, -2894, -1356, 3276, 3176, -1519, -2839, -1075, 799, 2103, 2378, -1317, -3941, -662, 2960, 1968, -88]
1252h8j587p72J826L664p17l666j470J913J796J101Q0l301k288L061L438q47k648
1269e05j188m46J789L453m02m497j085K625J343J047p14k802j726L041L006j436
1285A503k394o54n18K073K727o32m035p39K485J643K94o66k984q38K773L085j787
1302A336k521o15N57J547K722j353l859k32K279J693K78j069k629o99L197K318
1318B950j796k328o30N23J828J806j032l561m39L232J515p12q38k256l16K714
1334F60K311k000k300j91O43J716J786j588l472J77K903J116q93q56k052j31K999
1351H28K008k163k226o3J112J242J540j297l439L63L184Q27j077q96j528m22L202
1368A195J452k493j895L62J064J369R33j602k813Q24K601O08r45j336q99K22K404
$$ y = [-88, -1675, -2447, -621, 3043, 2326, -1340, -2810, -897, 899, 2000, 2080, -1221, -3509, -448, 2990, 2143, -505, -1693, -2139, -350, 3103, 2701, -1796, -2881, -256, 1087, 2134, 1420, -1382, -3108, -67, 2939, 1503, -891, -1545, -2063, 10, 2737, 2105, -1930, -2669, -184, 1459, 1753, 1087, -1897, -2735, 38, 3123, 1336, -1185, -1800, -1243, 304, 3026, 1673, -2186, -2418, -139, 1554, 1832, 763, -1866, -2565, 632, 2950, 1154, -1174, -1804, -1281, 547, 2353, 1321, -2240, -2679, 553, 2068, 1356, 518, -1738, -2054, 660, 2971, 971, -1329, -1520, -877, 839, 2625, 1037, -2435, -2258, 645, 1761, 868, 12, -2040, -2171, 828, 2836, 673, -1553, -1616, -504, 738, 2278, 981, -2458, -2095, 1089, 1916, 839, -57, -1585, -2007, 1195, 2647, 154, -1741, -1379, -315, 1054, 1987, 385, -2428, -1604, 997, 1605, 660, -676, -1575, -1353, 1051]
1385A051J366k385k142R50J328N44J286j770k619O77L297K84j429q68j052L13
1401a169K542J449l005j730P34J489R87K85j644k038R89K177M19j368r26l83L60
1418h32K166Q16k775j144R95J350M84L29j531k053R39K914j25j238j311l93M87
1435i22K365O61k581j399J352J236M70k4j464j533J050K481l7k039o75J94M09
1452d56J883J43j668j829J477J091N14l74j281j427J378K277o68j239n70q2P28
1469a03J412j01j943j090J495J223j22j31j112j303J368K143m28j963l97L39M82
1486b31J739k29k024p49J514R04k58N4j573q40J648J675q89j410j41P2O78J421
1504A361k60j908r39J981N08j40k53j047q76J294J752l31j827M6J75M84J174k70
$$ y = [1051, 2417, 32, -2110, -1160, 168, 712, 1998, 228, -2391, -1714, 1583, 1867, 438, -430, -1482, -1169, 1373, 2822, -183, -1913, -1179, 310, 1297, 1582, -62, -2100, -1111, 1066, 1485, 117, -809, -1192, -832, 1334, 2150, -625, -1769, -774, 576, 1060, 1389, -142, -2195, -1256, 1658, 1533, 295, -1016, -1409, -922, 1443, 2104, -477, -1876, -524, 712, 1182, 1158, -306, -1839, -789, 1692, 1655, -384, -1059, -865, -456, 1427, 1570, -98, -1927, -450, 641, 1155, 781, -500, -1927, -549, 1728, 1060, -179, -749, -831, -103, 1309, 1208, -735, -1825, -330, 893, 771, 640, -472, -1775, -407, 1736, 1308, -655, -1052, -713, -231, 1508, 1279, -745, -1494, 20, 924, 666, 720, -853, -1693, -45, 1630, 741, -669, -810, -738, -60, 1361, 1101, -807, -1746, 235, 743, 603, 350, -697, -1573, -279, 1473, 1142, -685, -639, -464, 20, 1194, 924]
1522I24j975o02J508J365o79m49o13n88J292J438r45j909L83N85O24P91j93j669
1540g12m04J286Q04k59n77q02j58R33J516j156j370j76J141N07O26n55j584k06
1558a146J613P74o30o69p36p4J183Q79q58j148r6M65Q85L78p39j160q0J654M87
1577I82o76m34l78m59J281R04r07j199J90P08K88P04p32j255k28J710N99j097
1595Am67k29L89P52R54j155j338M68Q58P05j48o17j131K83J246N04q83l91k67
1614d66J54O93R03j433j024O48R23M8j24m48j073O43J072L92p70o35r7M78N29
1633D13N52q63r28K88J096O1k74n06o85O2J728j73j065m56L55K59Q22J60r94q92
1653a040R82M10L34n04k40q21L32J311J1j327m5O00j53N95L05r81j025R03J296
$$ y = [924, -1051, -1653, -145, 1220, 541, 92, -521, -1109, 183, 1621, 676, -1233, -850, -265, 359, 1150, 957, -712, -1116, 170, 974, 715, 138, -664, -822, 111, 1627, 471, -899, -1075, 66, 573, 1199, 644, -940, -1146, 467, 1241, 611, -58, -794, -868, 315, 1194, 336, -812, -908, -443, 442, 820, 81, -1079, -1159, 495, 982, 306, -128, -506, -965, 316, 1220, 313, -886, -696, 12, 300, 1004, 272, -983, -1211, 499, 1098, 1, -466, -695, -306, 446, 1400, 245, -1093, -625, 233, 938, 790, 173, -958, -675, 571, 1075, 192, -199, -466, -312, 381, 1284, -149, -1173, -525, 398, 446, 322, -126, -1199, -556, 516, 908, 138, -497, -594, -116, 413, 965, 102, -826, -538, 558, 619, 345, -161, -846, -784, 944, 771, -294, -750, -395, -136, 686, 846, -148, -1040, -58, 352, 686, 182, -58, -879, -547, 764, 775, -552, -597, 3, -150, 445, 750, -231, -1256, -353, 943]
1672I43p79M4n17m54L30J103m07o58o8M82J6L04N08j184q03J337P41m07l76l61
1692b06m10K27J243k03r12l79N00L42J46M49j108o11P21J075o30m44o7k72M80
1711e9M60j4q47K3L92L28J14j43n77q37J295L98l80m07r1k87N86Q68m57r73k44
1732h52P06L64j38K70o59n51Q03Q46m21n27J35m73J64J004n9j025k73R59q8m1
1752A44J29o16l49Q47M49n96o54O15n14O09O13j77j057j09R64Mj95J43m61m43
1772f54R31M44l83r89P49k43N11K13n02o20m0R69N7J08l05l73m25P85P56j041
1792e2m68L42o5M09L84o02o28N68N03j24j76J50n77m0N97L30n81l83J48J17K16
1813F8J49l03q15M10J048o0o35L0j26j68O50K82n39n28K17L30J7L32p5p29J57
$$ y = [943, 164, 208, -309, -763, -433, 670, 263, -395, -463, 19, 35, 339, 847, -337, -1140, 197, 938, 531, 155, -206, -616, -389, 854, 651, -261, -640, -140, 202, 348, 797, -311, -922, -201, 874, 244, -200, -267, -539, -59, 401, 387, -460, -437, -45, 283, 397, 254, -323, -1160, 135, 533, 153, -254, -345, -632, -46, 822, 365, -608, -852, -146, 218, 80, 350, -309, -860, -57, 789, 368, -159, -24, -497, -333, 671, 612, -413, -686, 273, 185, 144, 273, -343, -692, 155, 604, 8, -646, -31, -545, 64, 677, 500, -557, -666, 298, 302, 107, 250, -211, -654, 277, 721, 338, -651, 98, -145, 366, 579, 77, -543, -583, 386, 443, 551, 246, -127, -552, 233, 989, -52, -520, -178, -243, 166, 550, -52, -680, -112, 391, 267, 91, 241, -336, -376, 221, 551, -30, -413, -265, -148, 68, 217, -86, -901, -491, 557, 497, -138, -108, -234, -402, 248, 530, -9, -537, -320, 10, 27, 359, 284, -445, -288]
1834b88O33R1l44j04m52K15M69L80q36p8J96J82K39K64m29n26K78P77k30m59O7
1855D5l38j01M47N92r20j47K97L17J71Pl02l93L41L27M9k73j27j90j91M55N78
1876F44n34l52O9M20p7R0m93P8J60Q48m80m45P0k17j23Q93R0r01l52Q37j18J56
1898B63k3k77l53N11N61p93j54J51N3j40N82j26p03K52N14P2l79J53m90L22j81
1919a85Q91m29n34L74j13n3J75K26o96k01N71L54m63Q9j98l46K89M24j89j76J5
1940a75L44j88J49N8k63j63J11O14l61k69p5k79J88O39p1n11m8L72m54O35P0p01
1962c78J9M26J85j80M1k28k95o7R90j81l46kJ93J27k85L95n07l35O38j46j0j90
1984a36J19%L01J89l54l81M3L47l9j00J70n96o6L33L25m78K90m2k39q8N64K21
$$ y = [-288, 345, 436, 92, -12, -464, -249, 220, 600, -236, -314, -118, 64, 303, 567, 138, -388, -110, 667, 437, -22, 45, -293, -394, 53, 645, -275, -422, -125, 192, 363, 370, 68, -325, 16, 343, 392, 119, -8, -198, -389, 66, 644, 110, -242, -173, 247, 170, 260, -233, -155, 5, 853, 373, -72, -2, -219, -342, 551, 641, -260, -612, 225, 107, 263, 240, -37, -390, 121, 682, -111, -265, -114, -61, -201, 381, 255, -448, -196, 318, 390, 11, 164, -326, -4, -185, 706, 277, -257, 117, 4, -49, 126, 352, -344, -545, 26, 380, -83, 6, -192, -538, -249, 175, -14, -190, -175, 169, -19, 130, 188, -75, -238, -127, 487, 126, -143, -218, -497, -309, 330, 259, -252, -300, 72, -382, 253, 323, -378, -359, 67, 252, 72, 113, -115, -410, -477, 513, 332, -14, -16, 177, 304, 19, 414, -93, -428, 210, 64, 54, -136, -17, -17, 284, 473, 119, -262, -219, 128, 89, -11, 159, -437, -503, -170, 155, -323, -33, -75, -314, -402, 162, 383]
2006C83o66K21L05j71j11K47k26nJ14J0k35K30l25M78k96O10p58m88O14M3PK82
2028B63L4l56j8L00J95o19K51j29k7N2L14k53k28J07L47j36l04M77m37KK11J75
2050B21j54J83N1o59L40K68l09q9J67K9J12k56J61J86j21L8j7l45J05J46K89l27
2072A9j46J69k8q5K30j16n34O26k91l8L77j36j03k0k05J13J08K08j49m7L41P9
2094C72m64MJ37j22q5p1L48j77j87N45r2m01M26m68o2K79J48K82m09K40j72M8
2116A19J43K8m06p4J97j55JM81m72J3J62j2J35k04J05n9l45L94L7l53K95J31j14
2139D7j73L9K29l79M02l56j9R7M9J54j65M5j15J57L02m61J76k9n1rj92M62k78
2162f8k40K93k6QJ26j59M69o47K01J49K7j54O8k6m25N90k10j77J16l1O4p6K68
$$ y = [383, -283, -62, 243, 72, -39, 208, -18, -23, 91, 101, -134, 96, -229, 249, -47, 563, -195, -683, -69, -26, -19, 263, 297, -59, -77, 223, 418, -201, 50, -79, -106, -54, 260, 7, -221, -114, 233, 97, -207, 270, -167, -165, 46, 221, 67, 250, 301, -358, -18, 250, -59, -148, 19, 48, 160, -96, 65, 251, 130, 168, 151, -194, -89, 57, 346, 19, -127, 42, 14, -71, 159, 43, -491, 135, -156, -194, 183, 47, -56, -76, -281, -168, -60, 148, -1, -48, 293, 372, -92, -88, 49, -73, -158, -229, 119, -58, -245, 300, 208, -193, 233, -235, -297, -18, 130, 412, 3, 243, 71, 119, 262, 290, -116, -190, 7, -148, -147, 334, -138, -125, 37, 25, 160, -44, 61, 2, -343, 51, 88, -265, 30, 161, 47, -126, -87, 142, -237, 165, -191, -210, -113, -64, 90, -75, -30, -145, 12, 314, -147, 29, 0, -51, -60, -252, 210, -68, -308, -15, -41, -33, 93, -66, 403, -244, -43, 106, 133, -21, 47, 21, -404, 186, -24, -201, -85, -116, -52, -128, 140]
2185A40k61o1j95R80o92K9J52q6j64R0K46p8l13J24L42l75K36k53L66k71J67o9
2207E4l26K16K28j82J68j0j75p4L08J50p60M33l69L90m5L03j02k41j10o7J09J12
2229A0k20J66j36K20j85J25m7K39k19K52J09o10J53J36M32l70q3k17O8M94j10
2250B07k5j43j92J02LK50l09j2k58P66l72r6k03L31j43j1K21l8P9j45l0J4K40
2273B36m33N0L9L05j18L64n64l6q9o1Q27k62l78K28j63K73k97l9n8l00N64K82
2295C70k18k06k8K44j52o5j3J86n1j19J94J19k65k11R8J22M24k29m91J78L57Q9
2317C33K4k87l59K34L52j87j89J53j38k19N40n0j37N6j10p6L27k28j20K7j8L84
2339C12j02j46N4o81N3O24L72o31j35K99l44K75J97q6j19l50N42K42o15L66l84
$$ y = [140, -121, -182, -377, 603, -89, -60, 92, 6, -158, -68, 178, 100, -213, -89, 253, -122, 114, -139, 227, -44, 123, 54, -272, -56, 172, -10, 158, 148, -27, -101, 207, 357, -403, 30, -339, 51, 6, 309, 207, -34, -144, -211, -102, 10, -210, -44, -180, 40, -145, -20, -67, 172, -47, 205, 314, -296, -143, -7, 425, 55, -28, -245, -177, 317, 207, 182, 39, -153, -51, -48, 202, -107, -119, -377, 389, 17, -79, -282, 49, -94, -105, 116, 78, 157, 12, -18, -4, 236, -197, -147, -108, 197, 79, 443, -121, -157, -246, -307, 520, 258, -120, 108, -55, 218, -79, -118, -176, -476, 88, 370, 152, -54, -82, 162, 10, -55, -68, 118, 67, -52, 142, 261, -4, -215, -117, 5, 429, 200, -291, -113, 244, 333, 357, 70, -289, -55, 297, 110, -79, 74, -64, -283, 257, 207, 70, 126, 16, -60, 267, 39, -81, -54, -72, 312, 210, 64, 118, -563, -510, 114, 486, -145, -280, 19, -325, -50, 147, 61, -58, -408, 134, 376, -239, 127, -257]
2360b57r0M72m1l8k34J40K6Q5jN9l41K95J87j36k43k4k5L10k26R6R4k75p5Q9N09
2385C56r9l84J55j07K67K9l93QK23j64M81n4n42o3Q1M50j0k27N8k48j37L08L74
2408C62l18m72J71M8K11J95m76l9N12q9K15j22m34q7O54Jk42K5n0l36J32M25m68
2431a82j15K60P4K60j97Mk39o4L95L00l45k23k40K76J72L96n84K09k42Q5j4K23
2453B09m1k56Q5J85K03o8m13L23k33L53l8l34Ql09R5M54J2j49m12J70n4M14L7
2476B41n21M00j33R5M85m30l48j61L39K12q6M1n70J86J64N30m7m65Q0q2J43L98
2498D71l19j51o0J89J44J83k99l00j02L87K17k95L8n17M22J19j5j81k3k96O70
2519B82l1m6m22J03k50O11J36l60J68n16L36L6J46j75l29M37j1M28n01N7l10k8
$$ y = [-257, -347, 125, 84, 46, -188, -48, -22, 63, 62, 121, -220, 75, 262, 126, -117, -141, -166, 144, -82, 14, 108, -167, -242, -153, 356, 257, -127, 28, -79, 188, 217, -176, -168, 55, -109, 372, 318, -224, -287, -206, 244, 234, 7, 65, -183, -320, -12, 362, 44, -428, -257, -209, 2, 197, -279, -318, 194, 105, 320, 198, -236, -323, 331, 332, 90, 115, 65, -271, -139, 286, -182, -297, -37, 37, 297, 100, 104, -135, -199, 196, 496, 151, -72, -312, -36, 136, 532, -52, 157, -85, 0, -14, 209, 168, -88, -3, 182, 385, 317, -96, 227, -6, 347, 309, -25, -17, -326, -231, 223, 235, 86, -326, -156, -210, 204, 241, -280, 120, -13, 82, 567, 137, -211, -372, -33, 179, 93, 134, -436, -250, -86, 444, 397, -68, 12, -70, 73, 471, 152, 1, -59, 130, 274, 457, 158, -142, -244, 143, 360, 65, 103, -414, 8, 127, 112, -69, -92, -388, 282, 251, 205, -217, -114, -364, 247, 383, 23, 191, -325, 11, 47, 193, 18, -311, 126, 115, 543, 42, 99, -211, -239]
2541b39M95j27K7j96J25J28R3p7l51k73L55k4J64q4l9k66L59J12J19l17j08k71
2563c95L40K30j01k23k35M05q3L18j92l23m6N26j51K32l43l40N7K44O59m42l58
2584b21j31J15M99p8j99j09m05N78L81q0m80q8K1J27L69N4n56k49M21L74j40m34
2606b31r8J92K90L46m41n2m32K66L59R2p5l83o7L25L54k0l32l37j16L00J83j25
2628bl13L5O1L27o8J10j50m78K91N82m43R5m63J51K06K18O9m66j12K92M1K00j48
2651C5J78l81P0K32Q7k21j51K4J75L01K9o64r0N13K23j4m44Q6l75O33j71K14j63
2674A26l26k73P23J7l69k21J41K53O2K02l49j54j16K74K17j65j65l76M7Q26N1
2695D25l96j74j68J17L37J64m17k57J22P35k71j46L2m04nO93o9Qm43j29L50p3
$$ y = [-239, 256, 129, 156, -40, 85, 213, 306, 229, -122, -395, -40, -64, 100, 16, -23, -289, 70, 182, 301, -16, -124, -395, -55, 175, 74, -149, -384, 21, -62, 256, 64, -259, -305, 221, 70, 302, -41, -381, -324, -80, 579, 137, -221, -352, -237, 262, 184, -15, -124, -529, 49, 430, 350, -130, -218, -197, -70, 299, 353, -203, -452, -31, 343, 203, -231, -329, -137, 153, 499, 58, 6, -426, -160, 199, 291, 216, -167, -234, 91, 445, 425, 93, -244, -360, -60, 123, -2, -315, -280, -219, 108, 40, 150, 0, -478, -187, 395, -48, 47, -416, -265, -59, 159, 228, -238, -350, -58, -17, 183, 35, 213, -168, -98, 134, 221, 0, -151, -127, 48, 349, 378, -286, -376, 137, 360, 346, -98, -12, -387, 246, 75, 289, 126, -200, -473, 250, 267, -102, -323, -182, 71, 133, 335, -14, -168, -284, -10, 207, 42, -123, -499, -452, 374, 425, 29, -145, -313, -196, 141, 305, -112, -369, -247, 488, 217, 71, 103, -301, -306, 387, 318, 326, -117, -246, 104, 31]
2717C1P3j2m15K71K90J82j25k24k54J73J40Q1r6m08j09L61K92J25k10k40j29J45
2739e8K21ol32m2o5O17Rj98k31J38j85M52N8m68k32K45j21J8K79l41J71j56N45
2762C18l2k42k15M2L82l3J72n18j16j51P13K04k75n51n8J65P25m31p4l05K56K16
2784A92K61n00K20k91k0K66M64q11r4J15p9P05l40o6l86J48O35r0j06l6m02j2
2806b27J51J56j57m66k4N93J80J49n79k98O06LL43l26k20j96K68J93J06k99k22
2827b66J39K55J27j82J95q12K67L82L17k89j64m43N66L26j85j32l88J85K6M33
2847C57L7m79l88L58Q0K41k34r9k06L42J46J80m65n5j13L11K46k2m79j54L92K13
2869B09nk17k23j00N38r9J09k29m56O0P13j32j42l95k24K89N13K98m66N1m08M53
$$ y = [31, 104, 92, -323, -52, 238, 420, 295, 71, -183, -10, 130, 211, 115, -293, -402, -41, 251, 376, 166, -74, -203, -58, 163, 157, -175, -217, -282, 335, 344, 146, -85, 53, -132, 320, 378, -90, -322, -77, -198, -180, 99, -242, -71, -227, 318, 286, 44, -171, -129, 253, 220, 392, -126, -242, -393, 320, 524, 249, -302, -360, -195, 530, 99, 25, -280, -24, 192, 453, -47, 173, -118, -138, 128, 592, -219, -313, -198, -277, 428, 88, 22, -364, -216, 419, 329, 223, 187, -215, -227, -76, 80, -77, -543, -567, 26, 206, 355, -224, -522, 84, 87, 430, 104, -116, -312, -44, 149, 255, -44, -266, -127, 128, 255, 73, 268, -544, -277, 105, 422, 133, -31, -474, 92, 418, 233, 101, -287, -102, -76, 357, 394, -85, -473, -115, -35, 206, -28, -127, -333, 9, 155, 335, -130, -185, -298, 13, 259, 237, -242, -396, -4, 209, 204, -13, -236, -336, 202, 103, 212, -17, -473, -413, 300, 168, 26, -369, -593, -304, 209, 507, 41, 92, -316, 137]
2891A37K71j72j77m16k30N00M62m57kj54K26K64R8r1l35%L19L14n68K6l75J50
2913b10M98K0j97j68j53J80M65p1n29J50k28K51P6J48k93n2J5J19N11n71k13R
2935b43K56Q4P5m34j39N69k46M09m50O3j0j31K53M23m59l73J24O55j2l92l67l6
2957c81J94N21k84K9m06J1J71M86K68n61l30J46K19P9N1m95J88j08M36J26l38
2978B2n71J85P04k03l6j84L9j34J54mJ92m81j49N77L24l68o6k55J86O2K55M9m05
3001a07j45J65J83K95j61l07j4L77J03j52k59k2j94J37L20j2m84MP0M98j28R8
3023B65l04l72O34K45J6m32j54j15J63L20n2n62N4K29M53l23k74J14m0k68M19
3044A6N68r70j97M72K53j26J04l17%K45J69K92p08p6J7K57J11Pk24k11K83L20
$$ y = [137, 408, 236, 59, -357, -587, -87, 375, -82, -84, -238, -12, 252, 350, 259, -76, -76, 243, 557, -11, 15, -360, -210, 288, 308, 111, -57, -210, -30, 435, 364, -165, -15, -243, 8, 84, 232, -61, -113, -98, 21, 532, -39, -252, -243, 13, 97, 172, -262, -401, 168, -78, 331, -119, -56, -66, -197, 56, 479, 20, -353, -229, 426, 414, 22, -345, -381, -187, 334, 50, 79, -327, -316, -145, 341, 609, 48, -282, -136, 83, 162, 213, -282, -94, -202, 234, 360, 22, -549, -364, 340, 137, 101, -83, -44, -178, -24, -28, 164, -317, -466, 111, 435, 67, 1, -254, -68, -6, 249, 298, -107, -252, -87, 96, 391, 230, -77, -91, 286, 389, 237, -22, -44, -238, -101, 219, 207, -277, -273, -203, 295, 167, 265, -39, -411, 223, 468, 484, 52, -102, -217, -54, 266, 214, -348, -294, -65, 388, 65, -209, -95, -135, -403, 16, 584, -386, -583, -111, 142, 16, 120, -197, -197, 48, 217, 509, -199, -275, -258, -1, 110, 117, -107, -318, -35, 285]
3066B85J61m14j39j27K04K14j13J23n24R1M17R3k35m34K05J60K71J62j92l27o1
3087a80J78J58J54o61R0J89J23J53J78k06o28M72J66J2l1p75M04j20N29M67j030
3108c58r3L85M4K32k6k63L7QJ50J43k86k46J19J70o7J81r7n60M99K67k30q6lK5
3132e5k47K29L86k92k6j09K80j72K85l14M1m2L15L0k06k84J71J26j96L27j50L0
3154A27j37J15J42jn93J59m5K93L06k35n00l0O04j99J63m77OL41L62k68L44r49
3176d72K05L56J96J58m00j58k30N13j18J76k16k40k26N32k7l6Mm82N89o7k4L1
3198F4m15K23L78j22P0k32j59O4L42j45J0j75j05J20L95k07l22Rp1K77J44j69
3220b6R8K03l9j02L20m47l47L97l3J33R2k74mR1R9R4j82k73J57k42K09M27o52
$$ y = [285, 446, 32, -107, -234, -30, 184, 71, 194, -330, -239, 178, 271, 36, -398, -193, -33, 238, 400, 208, -119, -180, -2, 156, 310, -351, -261, -72, 51, 204, 382, 176, -452, 20, 186, 198, 167, -608, -204, -324, 205, 672, -358, -451, -66, -22, 210, 184, -79, -42, -34, 116, 259, -27, -273, -154, 16, -51, 130, 33, -527, -28, 239, 9, -77, -80, -55, -302, -73, 313, 21, -5, -114, 166, -6, 279, -35, 6, -36, 279, 309, 103, -181, -10, 116, -80, 247, 97, 127, -10, 105, 247, 246, -347, -188, -233, 60, 366, 131, -369, -399, 205, 6, 169, -308, -302, 39, 401, 133, 477, -472, -267, 89, 285, 443, 43, -115, -345, 168, 50, 226, 10, -230, -456, 76, 49, 13, 17, -465, 124, 57, 33, 64, -351, -128, 250, 128, 198, -34, -193, -129, 213, 68, 78, -97, -202, -82, 313, 106, -216, -207, -278, -1, 143, -26, 72, 275, 236, 134, 454, 7, -340, 57, 24, 157, 249, -25, -29, 62, 161, 255, 73, -200, -43, -285, -76, 351, -301]
3243c01M8J28K52K91l62j78J89l05L17L1pk24J35J48K02k22r7j42j8K33R7j52
3265F3m07J39m0N7L13k30O6j06q0N24n5m65K70k28L68n9k89J49k19K70j28J51
3287F4k56k72L98R1L3r7L7m8j73N35o29K21n9m9O1J51K45l21l12J71L69J12m0
3310B32j53k18k69N72j96k4m43L65m5K56j92Q2j80j15L17L81n22n2j30K55J85
3331A06J36j92N8k13k5O81l53l53K0p1K45J57k58k03P4j02L59n6l6m8l02L09K59
3354A92k11N1l95K82L51k71N6j58N2J15K27m76M38l00r5K74PK54m84J0J61M66
3376E46k88k36k06r8K70J75J3p4k97K98k54N18n59J63j99L66J50j05j02l33K50
3397bM03K0m66k41j03L01L78j41j84M5m04K00L49k9j39m42K0N72K7K24k83j04
$$ y = [-301, -253, -125, 127, 418, 56, -122, 67, -238, 79, 110, 103, -121, 14, 162, 364, 142, 45, -97, -115, 118, 215, 63, -344, -205, -245, -188, 125, -105, -39, -145, -225, 299, 244, -221, 49, -179, 189, 130, -159, -10, -229, 41, -87, 64, -192, -464, -66, 25, 58, -39, -2, -50, -223, 312, -317, -96, -155, -204, -143, 8, 253, -68, -380, -209, 160, 272, 232, 79, -139, -408, 164, -32, -56, -499, -134, -179, 77, -115, -33, -213, -328, -11, 370, -152, -204, -334, -79, 106, 242, 50, 108, -105, -130, 551, 198, -155, -135, -206, 39, 196, -62, -265, -191, -293, 66, 10, -26, -74, -376, -67, 192, -19, 32, -363, -81, 270, -1, 55, -103, -51, 64, 291, -185, 253, -47, -142, 132, 139, 393, -91, -81, 80, 546, 258, 22, -184, -282, -12, 163, 176, 102, -195, 103, -151, 367, -192, -29, -228, 138, 288, 183, 81, -252, -2, 401, 421, -45, -286, -389, -88, 290, 149, -35, 10, -394, -194, 155, 126, -13, -455, -435, 137, 164, 388, 105, 1]
3419Aj09P1K36q2m47q4M10P7L52l70k4k56J76J74qm10j39M63K62m49M64o35L81
3442E4J7J27j96p3m0j90N77r9l52k0J32j44O18l83J68m37K36J92K7J17o12K7K50
3465dJ36L9j28j62J36M2J27p2j48l64L11L97J09l49j78J11l96M25J16J24n78K1
3487b85L38Q3N8l0j42j6P2J19j93j26k7K50L34q8p16J69J23m1M28q1q6k50N2L82
3511C27j36l05J22j19n1L35q0l34k5J84N3M31m91q3k34K32K57O1L7p05L87J75
3533C8K62l76J76k37K5L70k33p6j15l31J87L76K27l08J01l58K20L36l09J31l3
3554G3K2k8K99m22j54J06K09K12l12j89J4J60K13j96Q9j95j94L57j71J45K8k31
3576a65j30M25J2j32J74n13J18R4L90j77k92J32j35L38J84j32l59m6J38N87n15
$$ y = [1, -108, -37, 199, 117, -330, -414, -4, 73, 425, 55, 31, -225, -49, 125, 117, -293, -432, 31, 293, -156, 308, -327, 54, 71, 198, 2, -71, -111, -301, 276, 177, -175, -195, -63, -207, 411, 28, 196, -241, -5, 187, 214, 331, -281, -254, -4, 132, 171, 43, -119, 17, 59, 186, 114, -34, -398, -87, 310, 419, 70, -108, 3, -393, 32, 148, 272, -306, -285, 53, 136, 194, 164, 22, 6, 78, 197, 4, -122, -149, 101, 435, 347, -369, -200, -77, -118, 310, 229, 143, -107, -55, 327, 191, -114, 8, -111, -162, 173, 93, -241, -266, -82, -29, 402, -89, -172, -406, -174, 83, 144, 181, -524, -137, 38, 300, -76, 100, -137, -112, 258, 25, -51, -166, -497, -310, 66, 293, -15, 86, -272, -52, 284, -25, 106, 73, 95, 67, 366, -56, -210, -104, 105, 317, 5, -184, -170, -10, 203, 7, 96, -99, -293, 64, -107, 38, 66, -165, -295, 130, 142, 10, 184, -329, -211, -117, 273, 96, -196, -64, -199, 139, 323, 191, -168, -214, -76, 511, -4]
3597dj63J05L01k32L28n51J8R9L65q6k72q7k8J01J72L06k19k96j83M56P8j00K39
3620C47o16q2L83L1p0M9k2j72J20RL08n42K90j39J60K0K4rl35L1L63K92n69M2
3644h7j26K39K90k39k91M2k6N36k90j18K5j03M15M8l27m14K92R7M74l85j18n53
3666f19L10J12O27m96j61O0J21O9J87j97L2k10L09m9J0j14k30M8J47J99P8l67
3688a34L6K7M6L92k89k52kr0N28J11n66k92M98o4L58j36m08k72L06J30L26k00
3710E3k34m7Q4L44J5l35j97N39j60K3K37k73l09Q1O29l31J9l76j7N01J18k68o1
3733C5l9k5r6L45k26K79l35j2L38j16l84mJ93M76j80q9j73K50o21L15M02k20j89
3756g6q9L07J31K22l54l29j28M35R1k2o28L39O3J38J54k97Nl13K92L79n9n51N1
$$ y = [-4, -167, -62, 239, 7, 335, -216, -198, -99, 266, 180, -92, -179, -207, -106, 66, 372, 153, -143, -326, 130, 208, 108, 347, -269, -351, 32, 63, -7, 42, 20, -152, -32, -23, 285, -257, 33, -106, 54, 74, 98, 89, -246, -215, 148, 440, -129, -87, -213, 26, 316, 77, -214, -172, -198, 338, 48, -70, -45, -148, 267, 315, -12, -426, -134, -37, 437, 52, -66, -619, -309, -197, 430, -66, -227, -167, -46, 23, 210, 13, 45, -165, 144, 95, 105, -9, -239, -191, -44, 155, 233, -134, -98, -71, -25, 367, 78, -174, -176, -266, 262, 373, -193, -485, 13, -51, 307, 171, -237, -509, -203, -73, 253, 53, -181, -228, -144, 200, 215, -120, -317, 222, 62, 85, 322, 49, -260, -179, 450, 119, 138, -238, -255, 246, 364, 96, 35, -4, -29, -125, 220, -6, 273, -62, -74, 264, 148, -236, -240, -47, 429, 249, 160, -13, 237, -384, -69, 333, 113, -76, -165, 142, 273, 495, 141, -188, -316, 119, 210, 188, -440, -101, -38, 100, 254, -43, -38, -351, -59, 320, 261, -290, -239]
3779b39j04O06j22k42j75n5K27K23J79j63k15r4P0M65k07m94J24M18N1j92J95
3800B56l44l72L95J94J66l54j59J89L38j20p5m58J73M3L82k7k83j16j08K96L2
3821D8K68l76k14K91r9K62K04o44k73N39n5M21j70l06n5L00k41K27m7O9m27L82
3843A04J54j13k34p1m1M74M16m57l61r1L59m8K12m35j39k6O59k80L8m7j81jK90
3866A81N7Lm58J58j21M45m33k36L50J10m5N4K34p40N39k8k9L67l76k54J05L65
3888B48k49K28k26j81q8M63J06l01j23N7P7L23p2j38l30J8M74j01j25L9n5m02
3910c58L90M32k89k72m5L24J53j30j30k60J49J93N2m7j98J2j51N09m2k71J5k72
3932b36N5N99p70L33N6l68N24K10m45k2l05M68J04O0l44k13J62K34j11M0l83K10
$$ y = [-239, -343, 263, 141, -101, -276, -331, -104, 119, 298, 135, -80, -174, -104, 361, 154, -340, -216, 202, 253, 61, 256, -88, -460, -65, 129, 295, -59, -218, -29, 309, 189, 114, -344, -171, -128, 254, 227, -56, -172, -280, 16, 48, 316, -60, -274, 17, -82, 180, 384, -260, -533, 6, -49, 372, 202, -104, -159, 141, -100, 127, 80, 149, -278, 104, 258, 145, -89, -160, -201, 273, 689, 232, -129, -220, 139, 91, 303, -132, -271, -297, 362, 82, 120, 73, -108, -109, 181, 238, 241, -217, -59, -180, 265, -168, -404, -54, 56, 11, 65, 299, -441, 98, 70, 41, 408, 32, -222, -117, 248, -1, 227, 1, -180, -268, 195, 301, 0, -123, -66, 11, 334, 262, 124, -206, -188, 286, 185, 60, 99, 44, -358, 32, 464, 175, -97, -142, 182, 335, 205, 75, -185, -36, 157, 209, 162, -36, -24, -175, 334, 292, 21, 36, -236, -181, 418, -352, -19, 37, -331, 193, 403, -42, -64, -369, 99, 203, 263, -81, -294, -132, 102, -9, 31, -352, -142]
3954a42P6n5K36j6j36m62M76Oj0Q3k61l3L17K93l88K5j00q6L2L40m36L27J9J30
3978B35j60J50m44j87J23O29k49J94j69n71nR36k13k80%m39M06J65k48L38m23
3999b12K20k1J23k82p3Q5J38J27q6J69p95N95N4L4J37l47o5n7M70L01o92L37n89
4022d29N97L5j30k0m18L82J10Jj28j23j20J84K90J66k75k37p3J1K79J59l38k25
4044c02K89K07n5p4l38l0M01Q8K15%m94J31m1K35k68J05n58K96L23M9O5n26J65
4067a17J59M68k67k21k45j09L00J89K3n26PK20M11P7l15l94J35L41K78m88k63
4088c37R4M8L16j11P8r1j26K31K2k04j74J67j46J24J17J74n5j42j57J60M57k03
4110B42o47P6J27M66j45j46l97K37J76J32K2m49J81kK06j6K00p96L16K33r7K93
$$ y = [-142, -66, -121, 115, 99, -37, -499, -23, -17, -27, 56, -205, -238, 79, 372, -16, 9, -91, -177, -145, 195, -241, 86, 105, 235, 75, 225, -219, -406, -283, 346, 97, 291, 122, -449, -454, 482, 269, -11, -11, -450, -44, 121, -127, 211, -212, 8, -13, 110, -172, -245, -160, -22, 105, 19, 188, -607, -12, 42, 76, 213, -134, -199, -256, 214, 515, -177, 160, -429, 168, 203, 73, 53, -365, 17, 127, 128, 0, -123, -243, -59, 231, 397, 122, -115, -188, -177, 102, 261, -77, -302, -13, 194, 139, 65, -273, -303, 98, 186, 401, 401, -93, 38, -3, 232, -36, 69, -489, -193, 130, 179, 244, -282, -117, 42, 510, 243, 22, -223, -332, -32, 157, 180, -346, -339, -119, 292, 369, 54, -340, -205, 136, 414, -74, -337, -243, -195, 121, 10, 88, -3, -129, 102, 124, -80, -254, -87, -233, -109, 8, 182, 127, -15, -172, -12, 445, 242, -405, -329, -202, 264, 119, -27, -424, -187, -11, 121, 143, -306, -125, -127, 79, 63, 263, -533, -217, 16, -81, 212]
4132B12j52lk49K69J62k10m59K01J68O3K51k86l4m21N05K68j69k16j81K82l26
4153c25O11m86J17L87p0P2j90N2n69J21P8L54l53L42k94J61J41r4r3K3N2R0J50
4176B77l26n5j02j41O41k61N5n49K46L12no7P1l76k1K37J35j05L20o63L00K64
4198A87K09l80l90R9K85J23J67k20k7N5l29N22j05j54R5l11L44l6j38L6l10K20
4220e8M63k28l61j08N8K72J00K78k20l33J30J75k3mj4k94N16l46Q5j9n11M44j96
4243a94J87p8O5o3j24M75%k55r2R6L8J0J5m35N5K24K18l8p2m26J99J89M8J40k42
4268f0K3oN3j2J00k11k6nN10n04j7L27m09K92l1j19j42K07k25K78K13J28n24P9
4292h1J01N77o09J92j37j29L1OK51n60j4J29N15j53K06l35r5J12J34P1r8n5m56
$$ y = [212, 60, 57, -192, 77, 239, 29, -430, -229, -61, 2, 253, -33, -67, -488, 17, 285, 116, -100, -281, 1, -325, 286, -200, -83, 304, 234, 306, 116, 168, -401, -280, -202, 152, -201, 141, -153, 8, 149, 55, -38, -15, 37, 127, 277, -49, -104, -206, -347, 294, 33, 88, -461, -215, 97, 92, 25, 96, -280, -301, -64, 71, -34, 286, -377, -77, 187, 396, 16, -374, -275, 10, 133, 300, 80, 53, 108, -221, 301, 196, 42, 137, -174, 170, 134, -4, 32, -278, -58, 405, 177, -184, -292, -234, 38, 138, 416, 196, -137, -7, 168, 145, 141, 127, -167, 349, 3, 88, 69, -442, 2, -194, -7, -85, -20, -83, -207, 268, 268, 13, -79, 17, 55, 65, 80, -355, -300, -76, 142, 104, 32, -394, -195, -6, 42, 182, -60, -37, -43, 10, -2, 98, -113, -139, -144, 366, -138, -155, 172, -237, 55, 24, -95, -237, -30, -255, 23, 236, 364, -160, -81, 20, 597, -12, 180, 43, -86, -55, -49, 202, -358, -372, -243, 272, 119, 325, -10, -105, 7, 141, 212, 114, 59, -397]
4315c97N78O5l09M3KO7O3K67k68l29j9L76P9L76p00j06j20K42L20o5m3l48K49
4338B3L14p1j80l99P7k4J90K50n47J37k25O06K45l03j71J89k38M05r7l18j52J38
4360a51n9J51q3q6K68q2L87k51j22L4j83L1K05K56k19m30L44L7Q8k06j62M80l47
4383a00R0K54l32r9k8p3K86K31k60j36J0L90L09m65p0l37K97n3Q0L16m24m48Q67
4406C05k20j34K41k44K4o4K31j39r7P3n3p7N45j96n33K05K38j60L5j24K75k51
4428a20J80J5p8k71l6j74O13J94m12R1R1kj59J67q1j38q0K1N74n63o3J54K99l83
4452a61K72J51m07j48O78l03J14j86j35o1M39l06J3K86k22j57M26l97K48k69q8
4473b13M96j73j9k97j45K09J79j34K55k66k26N09j55J45l50jo3P41q5l40k91j4
$$ y = [-397, 181, 246, -63, -20, -18, 49, 112, 379, 111, -218, -237, 139, 218, 594, -106, -212, -332, -90, 230, 165, 122, -226, 23, 337, 266, 86, -313, -236, -260, -70, 180, -367, -230, -455, 151, 396, 93, -78, 111, -127, 278, 181, -137, -289, -151, -210, -59, -142, -228, 40, -42, 345, 94, -28, 6, -177, -146, 59, 315, 96, -334, 10, 47, 135, -71, -233, 247, -100, -10, 244, -88, -187, -215, -288, -2, 229, -31, -167, -157, 233, 542, 77, 7, -330, -33, -86, -6, 310, -114, -562, 305, 85, -49, 192, -52, -28, -92, 139, 0, -97, -24, -77, -154, 391, 195, -338, -133, 105, -55, -20, -144, 131, -120, 60, 75, -3, -274, -310, -484, 129, 323, -89, 2, 93, 91, -68, 99, 18, -120, -200, -179, 395, -168, -231, -77, 222, -161, 111, 262, -145, -293, 385, 82, 196, 10, -125, -186, 253, -53, -40, 246, 24, -133, 293, -104, 144, -125, -213, 283, 110, 91, -206, -351, -142, 37, -97, 158, -108, -334, 175, 20, 165, -185, -186, -249, 492, 407, 67, -224, -238]
4495b38M79r2J93m06p6k28M36M07j22m59J15Q8J36j81k06rk3L41l16L40l49p8
4517b48L34j71p1J59m3k27K76P5K89m53l1J31j51M73j93l25k38L68J77j28o3j99
4539b59J68j61K37Kr3k23M75k29k6J30j44j30j48L34J26R3l24j4L15j60K5j72
4561a78O9J16K8L01o26J34k14L97L00m99J46j43J38J29L35l72m36N59m17J42L25
4582B34j4n50M54Oj16mj6J14j96K83K12m02j43j1J73J92j47k53J93j39K28J68
4604B66l47K36k40k30K62M14k55R6l47j65N90J6m0l85m4K39o3o2rJ16j99J24K68
4627B41o0o76M67L01k09J25l14J11O4J19j37L14l58k88L20j8M05k45l42K63r5
4648a2J38NP8j03l60M39K02n34J78j24L55j48J60l55k49P6K45K40j39j10r3Q2
$$ y = [-238, 241, 149, 342, -64, -140, -368, 68, 475, 353, -106, 9, 97, 233, 52, -154, -163, -186, 155, -161, 179, -170, -248, 86, -85, -156, 3, -40, -267, 9, 84, 373, -80, -111, 20, -131, 342, 149, -176, -414, -46, 131, 3, -60, -259, -91, -252, -15, -13, -106, -329, 146, -83, -109, 21, -123, -253, -401, -67, 59, 152, -172, -186, 129, -31, -6, -178, -109, 7, 35, 336, -290, -156, -370, 27, 327, -172, -26, -169, -31, 98, 433, 61, -375, 184, -233, -91, 234, 220, -330, 124, 130, 14, 10, -6, 108, -88, 195, 407, 5, -138, -149, 24, 216, 69, -184, 9, -130, 98, 266, -81, 155, -85, -315, -53, 361, 106, 202, -145, -310, 280, 296, 256, -129, -173, 66, 3, -59, -68, 48, -151, -27, 241, 181, -495, -28, 273, 64, 189, -125, -14, 50, 169, 32, 346, -12, -300, 20, 2, 407, 162, -180, 83, -12, 126, 131, 209, 106, -254, 185, 387, -147, 31, -93, 262, 114, 274, -81, -330, -254, -9, 231, 92, -18, -111, -29]
4670b9L7j17K72J32l34j7K66J11m23p6L85k26J44o2j61j22N16J58j31m68N6L0
4692e9O5K32o1m69K31J7J43q9k30M23m74K95m7R7j17J07r8K54J56o1m78J66K55
4715B58k60k10J67k9j46K22J48M7k24j66K1K72k1K10m37O2j51M35j8l5o5j60O5
4738a5J00k0k12j04M18k11K71k45j6j29J81j02K22k12k83N85k49J44L2n8n6l81
4760c40L52j67L00m45J11K61R9Qj50p0q2J52n2J58k47J62k16L3J78K08l55j27
4782b29K65n9J01n6j22J13n8N2J72l41J31R4j95J72J32j25j01J40J93Jo6j83j12
4805h1J18MJ9l49j63M25M82l64Q8K6l65K68J40o9l05k3J78KJ79n22L76k37q4J77
4829h0N9L25l59n1J79P8k70rj11K24K42o1k71j39K3L97J39j44m14L9L93J27m19
$$ y = [-29, 8, -109, 163, 295, -39, -56, 210, 321, -102, -178, 207, -19, 125, 63, -98, -220, 296, 454, 323, -145, -89, -59, 6, 238, 177, -292, -61, -44, 99, 10, -220, 203, -271, 24, -23, 74, -43, 64, -34, 220, 376, 315, -163, 3, 258, -2, -212, -45, -74, -220, 2, 150, 197, -27, -193, -172, 100, 79, 289, -148, -86, -237, 198, 180, 145, 80, -80, -15, 85, 65, -147, -251, 167, -44, 227, -18, -34, -163, 18, -84, 138, -74, -357, 228, -21, 123, 155, 97, 41, -340, 12, -155, 145, -300, -189, 72, 171, 179, 29, -41, -123, 29, -23, 135, -112, 50, -166, -133, 45, 253, -102, -229, 36, -23, 78, 22, -100, 13, -45, 7, 179, -162, -31, 63, -132, 40, 172, 47, -54, 86, 279, 280, 214, 31, -81, 37, 41, 60, -289, -452, -27, 455, 91, 179, 205, -160, 108, 248, 179, -126, -149, 29, 31, 210, -312, 64, -173, -257, -80, -21, 304, -55, -106, 73, 151, -119, -128, -239, -15, 227, 166, -105, -244, -221, 176, 315, 171, -243, -204, 189, 316, -103]
4852a03J86k15l4J94j10J76l4n4j10R9J44J6l51l3L11k82O19l76J14m71O4M56
4874B06l26J65O5l3o4j05m5R6j9l79J52J90Q1j45J8j22M18J16j99l55L09q2L75
4897C17k88J24l40K5J80jJ00k26J88k20K92k5j31r7oK20J12r8k78nK20j86K68
4920A45j10J24Q6k56L14k68k0l1j47J31J32j4k38j49K06J08j3n6j02j06K29N7
4942B2J63m91J27M84k57R4j83k06j26L33K02j36k88K16q1J68K76l07K2KR5m3j39
4965e3jl65M56P2J30m0k38k74K19K00j77N2l66J39L15l4k80M98k49j4Q7j14K46
4988B09j33j7l06j6M75j88k0k97K84j42L59N3m36JJ45P6j76M4j10Q7K14j56O7
5011A7J07l57Q2M9L51l05j02J18j24J84K48l49l3j4q2M54r4l87N7K52L79m84J45
$$ y = [-103, 83, -132, -166, 28, -82, 94, 60, 6, -104, -5, 139, 155, -196, -229, 82, -200, 419, 43, 157, -314, -250, 206, -120, 45, 110, 77, 13, -92, -137, -41, -60, -439, -287, -97, -16, -161, -143, -265, 153, 269, 70, -285, 24, -58, 317, 29, 153, -187, -162, 18, 17, 117, -109, 79, -141, 151, 126, -5, -102, -108, 112, 224, 126, -152, -157, 63, -123, 145, 35, 159, 245, -11, 303, 35, 15, -16, -163, -32, 100, 86, -152, -301, -95, 13, 0, -56, -158, -264, -35, 22, 185, -306, -179, 305, 48, 142, -41, -247, -373, -40, 162, 26, -262, -46, -127, 41, 317, 10, 32, 34, 129, 86, -53, -54, -419, 37, 109, 239, 199, -39, -313, -94, 106, -71, -19, -385, -246, 69, 35, -245, 253, 4, -10, 77, -37, 209, 76, 59, -247, -263, 212, 24, 4, -293, -9, -151, 208, 261, -175, -174, -29, 47, -129, -85, -195, -108, 106, -50, 17, 124, -233, -151, -102, 249, -56, -158, -40, -164, 20, 268, -81, -114, -128, -210, 244, 150, -237, -180, 72, 451, -33, 112]
5034A12l94Q1J75J11j12K86l94K97l78K57Q4l89R1n3Q0K68O6k75k69M41K82j10
5056B57k20J15l32o6K38J83j40j25L85q4l29J87l94K51J1J29l12L0J77J94J15
5077B70k57J65k2l88M18kl88K49k78L08m9J02k40J68j60J28J41j87l69M30K06
5098B45m4J40j81k81n1J43k9K10j04j34L6r8j7j87L61l80J99K22k5J00l30L72
5120A67j15K1r7r9K01j98K46M3l5j36k45Q8oJ12J94J9m01O8L53n7l44K29l08J93
5144a07L76j62N3l47J91P1n0k5k48J42k67L43K64n14L52J48k01J02l15J10j37
5165b21J52P4L7j70Q4j98L40R0Mj02j18J42n9K68k29N9j70k69K94L68k64k97L13
5188A28k32N1J62j07j7Q9J50nl35J7k1L13J18k41k08L12k18K1M68l13r8k54M0
$$ y = [112, -282, -201, -26, 85, -27, 259, -135, 162, -216, 41, 125, -264, -173, -226, -146, 122, 188, -87, -356, 85, 367, 257, 37, 152, -180, -246, -8, 175, 35, -90, 295, 211, -118, 69, -325, -74, -63, 66, -246, -216, -39, 155, 270, 13, 178, 156, -232, 186, 184, -204, 45, -233, 75, 26, 128, -112, 56, -104, 24, 165, -22, -391, 39, 245, 201, 341, 160, -121, -172, -29, -58, 152, 48, -86, -50, -148, -165, -352, 9, -371, -172, 50, 25, 125, -205, 167, 52, 73, -24, -123, 78, -120, 126, 169, 134, -2, -247, -159, -165, -53, 141, 160, -241, -173, 180, 123, -221, 8, -300, -107, 269, 107, 160, -187, 4, 75, 25, 0, -248, -106, -373, -30, 234, -280, 72, 220, 19, 121, -194, -84, -221, -69, 5, 42, -128, -44, -242, 98, 188, 192, 90, -28, 114, 55, 323, 94, 153, -17, -286, 8, 376, 112, -185, 128, -104, -53, 109, 2, -15, 74, 224, 219, -116, -99, -120, 193, 311, 70, -138, 174, -44, -23, 445, 132, 34, -220, -180]
5211a80K07N0p2QJ2Q1J68j11n05K23k7J12j61Q3Q2m5k43L47L6O0M3k27j88K26
5235b1O8l12M27o40N91k40K62n23J84L36n3K01j38j91j6J8J79j63k7k20J86J7
5257g5p2K16K4k27M8L12m1l58j07M31j98J54J14k01j6J45M1k70K03k49L5K44l88
5280b35K70m5j51J73kl9RJ09Jj57J59j41M9Q8k16J66M0o1l70L45N1J11l0nlq3
5306C3j30M46m17R1j14K16n8j8J21m1l74K59j11J18L99l62j28K42j57J61j09J26
5328A93l21J64l20Q0K38R5j17L5L08j63l44K12J53o8k58M2J57m0M5j36J46k40
5350a39M6J60K9j69m6L09k32k37K88k51J75Q1O4K23k58J35l5k58J66k34L86k09
5372fJ7k57K83q7L85l76l66M56m6J04l69J98kJ69J89m48J27k32J54K49l12J14
$$ y = [-180, 27, 77, 5, 13, 25, 106, 274, 163, -342, -119, -146, -34, -195, -112, -30, -75, -318, 29, 65, 125, 168, -59, -247, -21, 47, -265, 162, -478, 113, -127, 135, -388, -204, 132, 79, 280, 142, -49, -65, -47, 132, -31, -58, -278, -92, -75, -147, 69, 93, -134, -86, 226, 185, -173, -280, 151, -47, 107, 221, 20, 4, 149, 190, -80, 123, -126, -91, 153, -235, 35, -10, -161, 12, 10, -29, -20, 89, 90, -67, 92, -49, 0, 88, -128, 38, 78, 17, -353, -8, 43, 154, 124, 119, 116, 33, -97, 349, -68, 23, -91, 125, 67, 49, 170, 129, -245, 14, -97, 21, 420, 58, -70, 172, 15, 176, 67, 193, -128, 36, -284, -204, 34, 129, 12, 47, 355, 192, -152, 60, 213, 145, -113, -71, 86, 46, 91, -45, 101, -139, -93, 67, 96, -73, -119, 190, -42, -279, 9, -242, -67, 14, 78, 301, 43, 178, 143, -115, 51, -183, 203, -6, 11, -246, 37, -50, 335, -41, -407, 49, 3, 107, -262, -64, -66, 103, 292, -156, -29, -261, -107, 142, -170, -56]
5394e6j90L15j72j0O9j54J82k07mM21k51Q5j41l12L54K75k40J70L4K58k9l98m2
5417d3J46j06P0P4j19O4m28L45k35M22j14R8p1K1J92o26K09J74p4J53Q6l44k25
5440c31K86M2P5oj97J63J83J4o5l91K20l05L04J28j01k51J15K54j68J92j56J24
5462A29j16R1L30l91k7k1J55m0R0m88J27j75M57K70l46O7j85k84L76l38M38j40
5484b1lr6N23k89L1k17k58L43j87L01j96L53P8o34K87j48J08J83l95k0L56O2q9
5507G2l7j85L40J9p7j57J25j52J4J82k46n0K5J56j16J72j34O5j8J59l19qJ92k71
5531b49n3M81j86K4m6K24j62K3m07K01L72j53N0Q8j38qk47J14j3K57j15k12j29
5554b84M24K43m64m9O8j54K97q7m9m1K79j34l7J74l92M16k23K96m66j1J62k83
$$ y = [-56, -246, 69, -103, -113, -44, -198, -16, -223, -227, 194, -57, 28, -113, -425, -71, 204, -36, 134, 168, 426, 397, -1, -43, 103, -3, 67, 141, 22, 86, -342, 3, -232, 190, 76, 174, 103, 124, 316, -310, -101, 73, -1, 152, 238, -106, -331, -45, -3, 72, 66, -131, 32, 215, 229, 164, -227, -7, -312, -8, 120, 19, -232, -117, 137, -31, 161, 5, 129, 13, 104, 434, 43, 16, -5, 150, 110, 200, -288, -161, -336, 121, 391, 45, 112, -73, -357, 19, -319, 119, -21, -24, -120, 403, 114, 145, -72, -330, 13, -174, 127, -69, 284, 362, -272, 15, -133, -25, 158, -237, -257, 99, 161, 72, 35, -150, 190, 209, 132, -25, 100, -52, -38, 144, -102, -152, -127, 29, -87, 85, -49, 16, -2, 157, -162, -170, 22, -249, -302, 179, -7, 17, -29, 195, 33, 56, -351, -150, 222, 69, 119, 207, 69, 61, -186, -72, -85, 172, 57, -155, -284, 140, 383, -81, -130, -62, -216, 81, -6, -55, -96, 183, 49, 12, 186, -206, 210, -13, 283, -183, -194, -32, -315]
5576c15N6J99K64K49k06l37M24p1m30J39K62m70L70K33l09j24J21j68K78J39n
5597B99j32k50J19j38J38j43N31o06K25n5j23j9J08R6J9j08l8j5Q4J69j15O1l62
5620b55J49K97k37Q0L21m43m6J45J19j16J44r4K55l76j91L82N1j58O1O9Q3j60
5642H0l5K48n27O43m97J23l86K05M71l01N9R9J57m28j79K83p2j07k0J18K08m8
5664I4l4j88J16O6k15N3J20q9K73j50J25j63k35K59J70N4j0m61L22j77J32j04
5686d2o6j62L34k26Q7L0L26n31J66j94N20J6j08j09n0K71l68l2M29j90J2J69m24
5709a42k4J42k08K38j63O1O1J28l89M26M4k22K51l04k35J42K76k12L40k66L51
5730B95o3k35L5o6J01j9J99j10j47m8K53j75j47k89K41O08l18j92l58L27K80j45
$$ y = [-315, -259, -60, 204, 453, 247, -90, 334, 263, -167, -28, 234, -236, 134, 367, 58, -66, 55, -113, 165, 304, 299, 167, -83, 36, -102, 36, -107, 424, -182, 43, -12, -135, -154, -46, 50, 69, -39, -77, -92, -8, 161, 46, 107, -255, -106, 191, -46, 34, 355, -88, -134, 11, 130, 14, 158, 64, 319, -57, -248, 134, 185, 27, 88, 157, 240, 80, 45, 293, -234, 409, -88, 35, -351, -146, 325, 24, 83, 182, 339, -89, -268, 15, -57, -164, -184, -66, 142, 94, 60, -128, -12, 54, -161, -108, 12, -77, 196, 46, 171, 8, -227, 32, 202, 256, 246, -215, 107, -70, 62, -42, -108, -270, 64, -162, -75, -45, 281, -250, -84, -278, 242, 258, 150, 41, -9, 262, -106, -138, 291, 101, 113, 282, -142, -166, -24, -232, 6, -157, -96, -35, 93, -296, 130, 174, -48, 203, -101, -336, -194, 82, -130, 210, -56, 295, 232, -3, 32, -34, 67, 48, 247, 137, -10, -58, 195, 20, -127, -416, -175, 433, 115, -77, -435, -108, 172, 27]
5752B7J14K33k31l08K45j35J52j28K60J6o8k55m1J5PN3LK45L5k98l8J20j76K61
5776A08l15L19j05j69L09O8j00r6j34L4K11k89J07K2j76Q4J35o8n6k17M16n41
5798d53N56j04j94J61J06J5J33j39l51M62q9l6k7Q7j61J01j43L5L6r6L5m2Q2l0
5822e6k92K98k39J56K22N9J07j91k75M22l2j40k86K18N0k15J83j14p5olL09j47
5845d7q8j95M34MK83m12K89l52K32j35K51m57K02L19m84O8K59j55j9j56K14K40
5867B95l06K55k43pk1j49R4O1J05j37L89n08Q3L8L16l03L0rm2J69K49m30R0k55
5891b36k0J90K5n7K16R5j28o9J86k82K58R3j90k6l26J84J20p5N8o4L6K51n41L38
5915C6l1J72M3k26K44o5j1L1k65N38m92PL12l34k0K66l24J04J6r3n7J05J85k57
$$ y = [27, 141, 374, 143, -165, 80, -55, 97, -31, 229, 245, 177, -78, -119, -104, -97, -44, -41, 204, 239, -59, -97, 23, -153, 108, -207, 112, 7, -162, 147, 215, 115, 19, -115, -81, 130, -159, -52, -30, -206, -122, 13, -55, -111, -328, 88, -453, 103, -1, -195, -34, 72, 87, 220, 81, -270, 192, 103, 67, 40, 127, -34, 67, -76, -41, -5, -101, -66, -108, -26, -56, -348, -50, -289, -133, 89, 148, 255, 64, -211, 211, 179, 39, -247, -29, 21, -194, -11, -125, -200, -206, -209, 100, -47, -135, -330, 104, 108, 391, -21, 268, -84, 148, 13, 264, -193, 9, 328, -156, -88, 171, 16, -3, -159, 55, 295, -11, 244, 1, -6, -27, -176, -82, -21, 84, -53, 336, -172, -89, -51, 265, -38, -8, -17, -59, 110, 359, -71, 19, -236, -256, -66, -41, -98, 118, 213, 85, 16, 202, -80, 178, 271, 81, 55, -271, -87, 33, -42, 16, -48, -12, 239, -302, 36, 5, 177, 220, -6, 238, 173, 162, 193, -72, 466, -26, -19, 293, -41, -61, 205, -119, -15, 1, -92, -149, -44, 141, -116]
5939a16L76Q2n40P2J82R1j46K65o63M66j03J04n1k9j05J28j36K79o2j13o0K61
5961A82N0l9k16L73k02j27k6Q3j40J80j36J43j11k39L43j69o5p4K22k71M67n09
5983b81M52m5o9k5K16j00J65m07O1N8J41j83P3J9J48k80O3K69j80p1KK81o4Pj52
6008I8l20K05J68L0l76M5J44j72L97m48J17n2J37J06Qk17LQ0L81j41l16K9j48
6031b42M80k31j34qP3j50m6M42l46L5r2o1L60k90N31o75L62j36Q7K5j39L79j41
6054H3k60K26m6N5k7J66r7j32l22J99L12j10j2J68j70j12k3L81j47Om14K72n4
6077e8k5R6K0j08l0K02K53J12k21l44L0j04N1L80j30j77K36r5k24L62n19K33j71
6100b31L80K4l13K14j04r4L17j34l29K87L37m61P7J50k33K99j7n38M05M59p39
$$ y = [-116, 260, 342, -198, -126, 56, 147, 1, 266, -397, 69, -34, 70, 19, -10, -115, 13, -123, 156, 94, -19, -79, 182, 232, 193, -23, 350, 148, 21, -5, 78, -62, 118, -18, 125, 14, -225, 118, -51, -116, -190, 32, -239, 228, -281, 171, 126, 57, 32, 248, 148, 313, -94, -33, 25, 166, -17, 56, 75, 223, -57, 6, 275, 95, 24, 26, 307, 243, 250, 98, -222, -17, 151, 181, -195, -150, -6, -178, 219, -229, -112, -164, -27, 79, 87, -130, -127, -47, 334, 193, -123, -94, -242, 238, 7, -127, -135, -62, -212, -258, 184, -162, -127, -219, -280, 80, -210, 321, -354, 8, -128, -41, -16, -155, 224, 83, -177, 49, 3, 58, 31, 197, 100, -32, -354, -155, 157, 47, 35, 203, 33, -79, -102, 279, 132, 138, -276, -4, -58, -83, 13, 33, -75, -105, 97, 350, 462, 241, -103, -73, -177, -126, 254, 124, -53, 183, 88, -136, 226, -293, -60, -231, 149, 173, -140, 74, -30, -124, 193, 59, -270, 17, 354, -107, -30, 120, -113, 186, 169, -369, 36, 495, -244]
6121b44J33Pq8M49l73J90m9P0q2Q0j2p8J92l87L25l73L19k10n4J66M3m3J45j95
6145f9J75j47L10k48k73M6J15K97l98O3M7k2R5k8j15j58M19j63pj1J54J26J0j69
6169D9k46J83K4n4q9N2RMK69j36J3l37L32j36m8J46l05M34q5j03OL27k61M2k57
6194a67KO6j37N0l9L91m38M12M1Q8k85o0J76n7K16k18k8k90k62M42q9K55J28o9
6218A28n17N40n98J53K24j46Q7J47J79j27k95J96j09M88j82l12K9l0oN06k88j56
6240h9L38j76J48l32Q9p0K26k03M8j12J17l7QJ91k53M12q9j39j07l00K99pQ1J03
6264A46k83K00j05q9M53l95j49L80J23j68m55J78K18J09K69n95K63l46L00j24
6284g0K90k96O9r0j06J86P0q2K28j6l2Jj40q7P5lQ5j47k02M47l06K30j10J0R4
$$ y = [-244, -111, -104, -192, 257, -116, 74, 25, 95, 13, 93, 81, 3, 195, -192, 133, -240, 79, -131, -185, -19, 24, -19, 126, -69, 106, -41, 269, 21, -252, -206, -91, 206, -192, -129, -82, -104, -9, -37, -152, -310, 109, -54, -61, -72, 82, 208, 218, 49, -197, -14, 10, -44, -133, -81, -72, -68, 201, 65, 78, -259, 73, -63, -111, 35, -270, 164, 79, -24, -18, 309, 48, 90, -167, -165, -99, -236, -186, -225, 166, -272, 140, 181, 269, -16, -76, 100, 43, 259, 41, 13, -277, -539, -97, -186, 69, 197, 128, -389, 151, -447, -294, -70, -216, -129, 18, 197, 70, -225, -29, -138, 350, 168, -144, -115, -145, -151, 355, 67, -89, 249, 73, 221, -111, -22, -92, 134, -69, -21, -133, -16, -53, -45, 146, -107, 305, 216, 77, -30, -330, -31, -38, 43, 146, -137, 63, -42, -131, 322, -73, -222, 158, 281, 113, -342, -164, 54, 163, 432, -163, 100, -246, 54, -70, 220, -76, -7, -97, -203, -17, 53, -29, 199, 183, 151, 152, 12, -75, 0, -3, 82, -65, -267, 180, -126, 104, -6, 4, 98]
6309I8k5J07l56m3J15J10K19k65M69k93J99l15m6K04l02K08j33l4J60J50l58j81
6331c12M94j68P0j2j30J64j23L3J35j24j94O8p3P8K32P0j29J58j52k09M86l46
6353A6j76K3L61j38J21l49L42l48J87J3r5J93l33L63k67n8%R5J41l3j18L6K4Q7
6377H7l03J69M9j67K61J5j85j54K20M1j09L42n41L92l56L41J9l2K4p9M6j08P2
6400D4J98N0k17M9m3j34L38l12j13j09J94P8J85m5k34nM7k02K63k6k56J10L76
6423B36r1l5j54l53L02K39k67jn1J80J7K19l82N55l28j8o0k09M53j08m8J17k59
6446d6l7M09l10l59J55R8J50R6l52O2J11J48r8j90J25K07j09m0j6L12n12K17N6
6469G7m96L63P8j72j21L07j38K91l47K09l75K42M16n38K02j01Q6K74m89L01MJ37
$$ y = [98, 73, 180, -176, -219, -104, 6, 225, -40, 429, 136, 335, 20, -26, 178, -124, 84, -49, -83, 77, 227, -131, -312, 182, 14, 84, 72, -58, 106, -17, 16, 151, 27, -167, -99, -172, -94, 138, 208, 79, 237, 85, -124, 362, 16, -160, -137, 224, 86, 207, -142, 200, -148, 39, 52, -43, 150, -183, 180, -87, -145, -145, -50, 91, 58, -60, -24, 0, 87, -216, -47, 2, -165, 96, 111, -74, -228, -8, 33, -76, 266, -275, 117, -239, 102, 121, 89, 113, 34, 80, -28, 44, 242, 292, 75, 124, 81, -53, 285, -27, -140, -249, -55, 23, 208, 163, -71, -76, -29, -231, 32, 6, -250, -140, 236, 145, 110, -44, -397, -95, 144, -123, -124, -175, 5, 22, 241, -141, 414, 86, 68, 8, -201, 252, 144, 96, 213, -46, -83, 326, 16, -343, -188, -90, 60, 156, -196, -134, -23, 125, 27, -163, -38, 169, 60, 20, 4, 316, -196, 21, 77, -419, -56, 22, -150, -271, 36, -102, 189, -158, 51, -324, -82, 334, -204, -2, -103, -17, 257, -232, 69, 73, 210]
6491B10j56k31M2L3j16M23O2l91M6nL3N61m32k08J66K66j65l21L51m00J78q9M13
6514B70m47J99k33K50K77j14j42N7J35l65L02j83k9j30n1l2M20m5q9k45K85l89
6536b99M71m7m6N0j50J23j1O1j10P9l35L19m77M77l61L97M0k55K96n4m90K30l7
6559a29K70j27L27k45j88L30l4K3q4l78M84j81m74L76J48K32m27K39K9j31J01
6580A61p7J13m17K20j9J39j37J06j97k9j9R8K20l69K51n8K49J29m18K48n88O30
6602B36m7J07l36m8J32R0l9j65L1j27P4K85k25N0L44j52k27R9r4N6j5j51LN03
6626C84o44N04k17j26K81q4K75k61j13M6J01k33K41rj53Q6m27M68R7k67P1j03
6648h3K16o0r6j27K00jmk55J29P2j81P5K2R4J11r0J00R5k60P3J07j52J59j22P1
$$ y = [210, 54, -177, -135, -102, -218, 205, 267, -124, -78, -83, -50, 511, 79, -129, 37, 303, 138, -183, 168, -232, -54, -143, 270, -177, 22, -211, 39, 316, 202, 60, 117, 252, -113, 189, 6, -23, -153, -204, -236, 184, 139, 50, -195, 90, -299, 172, 125, 79, 129, -21, 102, 91, 152, 42, 121, -214, 105, -372, 105, -256, 141, 181, -74, 222, 168, -322, -92, -129, 141, 14, 341, 96, -92, 238, 204, 227, 143, -235, 249, 68, -406, -30, 118, 350, -77, 162, 191, 60, 161, 84, 197, -220, 0, -19, 120, -17, 89, -108, -137, -156, -58, 162, -207, 44, -14, 235, 364, -54, 194, -394, 236, 189, 296, -40, -88, 44, 134, 95, -70, -39, -166, -92, 193, -32, 18, 362, 210, -17, 82, -12, 44, 29, -122, -119, 384, -260, 244, 27, -99, 182, 98, 373, 112, -1, 45, 146, -87, 154, 145, -8, 78, -349, 119, 216, -51, 20, -83, 133, 73, -23, -150, 50, 49, 45, -210, -81, -9, -190, -115, -93, 1, 112, 22, 122, 217, -43, 30, 137, -15, 144, 22, 93]
6673I3J03k76J4K84r9k84L49j86P6M0o0r4o5j19K61l7k26K67K29l56j08K33j95
6696a56o8K33j59qK56j5j05P5j30J93p1k82K30l6J02K0k62K63k59J08K4p9n8L92
6720B08k92K5M1L26m26k7j51L72j41J71o9l70K66K17O1m09M22l05P9j98K13R3
6742A06J22l44K30j98L21J86n61J01L06j19l0r4K56j32m32R1j13K67nK71l91J05
6764e7L4J03O2j11K47k41P1k79J06K30k36RJ0J90l10J60J77M9l96K18l7j34L02
6787A67l24K20M33m38l07L75j69q8K17J45l11K02n78L86K30k8k37o8K57j92J20
6808A2N1l1K9J52k63k1J40Q0j91K60l51J8k27K07J87k2k95J72J66j68J68J20p1
6831A22j86J16l6l1R0j55K98Q4m14O3j47K71J37j45j85J44k2j82Q7l6r5O3k5K41
$$ y = [93, 196, -80, -66, 218, 119, -165, 184, -2, 74, 114, 54, -40, -105, -224, 37, 0, -226, 41, 270, -86, -194, 39, -156, -224, 9, -150, -158, 98, 83, -22, 53, -77, 116, 45, -237, -7, -43, 59, 79, -183, 80, -179, -71, -47, -126, -184, 208, -84, -59, -18, 308, -118, -145, -296, 76, -65, 106, 37, -333, -67, 150, 211, -198, 224, -81, -2, -200, 13, 106, 228, -116, 114, -84, 237, 423, -138, -37, 269, 150, 120, 26, 282, 150, -282, -191, -304, -37, -42, 229, -162, -57, -23, 80, 142, 31, 278, 37, 108, -171, -65, 165, -71, -62, -52, 138, -172, -12, 165, 214, -182, 36, -1, -135, 167, -157, 63, 496, 58, -249, 126, -43, -131, 86, 231, -80, 122, -456, -70, 160, 132, -105, -173, 84, -108, 12, 63, 32, 61, 213, -50, -71, 69, 149, -42, 218, -133, -115, -342, -135, 52, 30, -265, -93, 73, -95, 73, 193, 122, -64, 52, 16, -15, 75, -80, 218, 302, -112, -49, -196, 75, 212, 67, -118, 26, 4, -178, -91, -127, -222, -159, -184, 57]
6855E7j07K10k66q7oJ64K93l96L89j74p3j95L12l11L82j74n9q6M4j01j67N80j26
6878A03J23l69L72k37j12J37J64k86J48k04P8M0j33L12m51M29K14l74Nn9Q2j58
6900a76K46k56L96J8k31M5l01L52q1j45%J61lQ5J13j73K25n84N0L50j6k53J45
6923c3RlJ79p8l39K53K20n04K09M06n13J55L86n24J28K93n65K90O1Q8L73m30J23
6946A84j52j6j40O3K05j20K48k57K93m42k3K69l67K45m4J28q8J36k13J51k64K31
6968B7k61L74l85L23M0l55L33k8k01L50j66j76L56r7j36l4K44m93J60J66k80L63
6990A24r8k05J73K65l6j34J3J0%r7J88p9n26L07K60n9k72K23k10J15r7q9J34J99
7014A09k29J12J11k69K66J1l03J63Q7K8j14lj51J90L1R3Jj82k15J00J37K7J20
$$ y = [57, -50, 160, -106, -193, -199, -35, 258, -138, 251, 77, 4, -191, 121, -190, 192, 18, -41, -127, -83, -184, -351, 229, 103, 226, -143, 229, -8, -120, 17, 181, -105, 43, -161, -83, -43, -176, 136, -315, 114, 328, -46, -41, -100, -18, -176, 70, -186, 210, 228, -3, 42, -259, 93, 12, -133, -133, 28, 25, 110, 223, 50, 275, -309, -259, 91, 75, -178, -33, -24, -27, 152, 74, -265, -12, 208, -296, -87, 319, -194, -39, 347, -177, -49, 244, -321, -31, 30, 118, 491, 61, 184, 32, 16, -124, -61, 144, 24, 272, 15, 308, -134, -157, 112, -255, -10, -54, 74, -14, 122, -91, 60, -204, 27, -234, 140, -245, 78, 118, -237, 96, 68, -133, 217, 51, -125, 231, 134, -2, -36, 208, -285, -125, 41, -239, 124, 26, -179, -6, 259, 223, 89, 102, 112, 112, 15, 203, 124, -402, -95, 165, 106, -166, 57, -153, -38, -135, -224, -90, 109, -120, -8, 103, -166, 100, 111, -192, -29, 58, 86, -28, -31, -182, 8, 39, 132, 133, -49, -264, -164, -27, 0, 120]
7037A20j69K00j59O1j27P5KJ70k59M14m5l36j66M19j28J25r6l82M63k75O9q0n1
7060a55J46j5K62l18J8k03M48l38O3M1J68j22r2K37p1R9j68R9k08m2M00j76k34
7083a61K97q8J00k95N4P4L40l16j86J04J79MR0l56j10M55j42j00n0RK07j13j3
7106a7K0PJ17l8J07L0j37l60J88l5l5M21j19K7m03L89j46j15l6j08J68j38J93
7129b0J9k40L09j45J99k25M15j59j90m6p4K29n3jK4%l7K15n53L45n1Q9o2j88J54
7154d6L73r0l32M64n11J07L61k64j31Ql19K15N6j01K80k21l08K30L18Oj63J31
7176F3k99J11L1J56J47n27N77k31J30j08Q5k41J24k39OL1P8n3k74P02k7j55J29
7199B16j89j68K92p5k31j3K47J1j16J20k14k8J13J78o7O9j48L07j27k30r0J01
$$ y = [120, -49, 151, -8, 53, -74, 1, 3, 173, -86, 328, 283, -53, -219, 200, 72, 197, 101, -281, 182, -93, -24, -104, -155, -9, -24, 238, -80, -62, -265, 183, -155, -92, -51, 117, -5, -97, 140, 69, 168, 0, 99, -109, -151, 249, 73, -161, 136, 48, 148, -147, -93, -19, 321, 5, -181, -77, 102, 106, 196, -160, -270, 185, 43, -57, -107, -98, 109, -4, -17, 3, 10, 127, 89, 196, 226, 89, -271, -83, -118, -153, 268, 149, 176, -227, 162, 16, -99, -135, -243, -75, -213, -20, -1, -241, 68, -77, 122, -103, 312, 153, -37, -83, -157, 72, 19, 18, 42, 42, 5, 220, -333, 12, -39, 50, -12, -200, -46, 327, 237, -95, 369, -142, -35, 326, 62, -69, -61, -380, -165, -109, -210, 70, -151, -459, -229, 89, 95, -68, 63, -236, -125, -94, 62, 209, -318, 259, 28, 158, 50, 135, -106, 18, -221, -215, -184, -106, -159, -433, 269, 242, 87, 216, 27, -141, 151, 76, -155, -168, 79, 90, -26, 94, -120, -148, -35, 143, 76, 145, -3, 304, 177, -53, -143, -42]
7221d2J4N7N3K63l77j49M32j95m42M91j82N9K39j00j22Q3j06j85PO2K9L85m38
7244a64j08J95J02j36K79q2l00K48o4R9l54L5J49K44k27R5J23o2k3o2j3j2O5K24
7268B51l6k77j3R7k79N64m18K54m3q2J14j74J76k64J40l2K36k75j54m7M71m10
7290b01M37j92K27k38P0k25n4M65k59J72l47n6K99j6k33P1p7m0K99N5j76j50K07
7313C8k91L71j68L4K0RK44m04K12R3r2q3l5L0j98J99j12K20l0NO9k66nj34m3N54
7339B37j50KJ6J11k24m8K83m54K23J52l44J18J09N1j70l4L66o95L34R9j60K14
7361C6J38j38q0j15Q6K31l98K82p2l8M6O5j66K7K03nn7K24l52m1p8R3K09K26j8
7386C08k34P1j62mL40l37l64L71N9J23k25N6n4R9Q7lMj11%K9j73R3K17k78J58
$$ y = [-42, -28, 29, 82, 345, -32, -181, 251, 56, -386, 105, -77, -18, 221, 121, -1, 82, -24, -209, -202, -140, -111, 274, -164, -272, -77, 25, -111, 168, 86, -214, 34, -30, 69, -285, -250, -101, 143, -84, 11, 134, 72, 49, -13, -26, -38, 27, 251, 215, -62, -75, 22, -257, 307, -111, 143, 100, 18, 132, -42, 134, -130, 10, -22, 214, -61, -215, -262, 209, -201, 236, 44, 271, 33, 103, -122, -176, 289, 30, 202, -145, -201, 98, 82, -151, -80, -157, -197, 102, 157, -19, -169, 38, -253, 118, -50, -16, 4, 13, 257, -147, 65, 158, 66, -17, -52, -22, -220, -21, -133, 87, 57, 62, 131, -135, -140, -274, -317, 237, 87, 89, 105, 216, -8, -56, 227, -227, -4, 148, -196, -78, 31, 82, -88, -122, 244, -451, -117, -18, -178, 36, 174, 36, -44, -159, -73, 158, -240, 42, -30, -68, -22, 43, -123, -96, 107, 102, 45, 269, -83, -124, -202, -109, 100, 326, 308, 74, 145, -17, -21, 319, -18, -382, -11, 48, 171, -54, 2, -52, 47, 134, 131, 135, 24, 24, 53, -120, -27, 190, -88, 70]
7411G0j63n2k82M68NJ61l36J22O8j73l9P9Q8j52J37Q9k67J46l44N69j12J70m88
7434b36K14p1NK15n3l21L20l2r3M64k34k28j33K56j89K38k26J01k70K93R9l2n6
7457C1k67J86K11j39R8k95K18k08J4l0K17j84K50n6k4j9Q8K3jL3J53l18k32J67
7481h4j37M55n31K22J13j0J61l66j50M65k20K8J73k37J11R0n47O02n7nK36l38
7503b6l8J30J67m18J13j63K07k2j55K28p7J72l16M09j77j50L11l53K67l46L12
7524G5qr6j63n0L74k02L21m21J88L43n06o3K06Qo3J34r9K93Q1m43q2M21n0j41
7548E7j98l17N49M6J90k41l19k8J23pn6J4J87J03q9k7k3J33j98K00j16j96M28
7571B15l15J33j91K21j91L1K08k02K15l20J54k70O1N4J13J75J13j27J49n62L38
$$ y = [70, -93, -145, -427, 41, 46, 207, -129, -7, 61, -112, -151, -72, 16, -136, 1, 90, -177, -31, -375, 194, 82, 252, -236, -22, -93, -88, 127, 74, -247, 73, 41, -52, 412, 178, -50, -183, 73, -116, 122, -104, -3, -273, 20, 119, 87, 31, -236, -50, 161, 22, 120, -175, 43, -165, -151, -181, 36, -148, 102, 46, 22, 3, 91, 114, 113, 146, 299, -19, -251, -84, -221, 234, -297, -75, 38, 28, 189, -177, -327, 138, -82, -54, 119, -118, -7, 83, -464, 138, 81, 76, 312, -26, -64, 66, 233, -185, -72, -235, -28, -50, -205, 23, -54, 118, -198, 211, 34, -116, 195, -158, 109, -237, 75, 67, -29, -192, -242, 132, -70, 251, -170, 18, 361, -145, -208, -2, 6, -57, 77, -22, 271, 352, -91, -173, 248, 198, 57, -141, -458, 91, 137, 327, 86, -233, -261, -138, -145, -201, -187, 0, 103, 14, -13, -36, 97, -101, 99, -17, -213, 215, -100, 33, -158, 63, -128, -97, 111, -91, 124, -196, -42, -312, -251, -197, -84, 91, 204, 77, 226, -336, 2]
7592BK5l72N29j70K11r8m2j66j34j3oP7J54N0n2J03q8J47O6o79O92m1m82M42O0
7617B15j06k13J03p3J34j18Q0L06o26K89k11J44K6K66l48oL22m14L68j56k8N3
7639Gk16R8K94q7p3J64l50qM93l32K42k41j96P7J62j71L9j12L88k04j52M51k07
7662F6J53m36J95Pj44R5m6K7J3N5j8L09k71J8j18j04K76k08O9L4J90om62O51j60
7687A85j20j86J27l10J63J52J29k15j47O84n75K58R0k22j58M41m05K8j42K29J26
7708A32k51Q8O0j25j32J54J01J82l42M61k69k73J02J28q7J07qj59L17O2j79R0
7730A59j94k54J99O8j18L46k65K5K41j56l3p3J99l32K32l5K7J42q3j42K60j61
7752E2J44l27J05M5j88j14M30l23L05K8j57J06Lq9j98K39m62K21M16l85K53j26
$$ y = [2, 27, -345, 184, 14, 225, 127, 85, -81, -215, -228, -234, -157, -3, 47, -5, 98, 10, 157, 223, -456, 236, 195, -287, 155, 215, 109, -104, -1, -74, 60, -58, 22, 328, -298, -9, -220, -76, -50, 216, -132, -138, 184, -230, 138, -18, -46, 7, -209, -111, 183, 96, 23, 187, -163, -171, 322, -10, 232, -9, -205, -128, 34, -137, -98, -210, 178, -26, -178, 273, 66, 219, -217, -22, -15, -159, -64, -110, -83, -70, -15, -33, 276, 5, 23, -95, -199, 77, -131, -62, -28, 162, 156, -306, 345, 185, 65, -121, 6, -304, -141, 11, 140, -75, -222, 462, -113, 145, 235, 13, -145, 296, -109, -81, -223, 6, 132, -119, -31, 29, -96, -228, -74, 27, 209, -133, 328, 59, -214, -112, 16, -71, 36, 28, -131, 186, 248, 69, 159, -35, -289, -90, -22, -140, 206, -59, -34, 207, 51, 18, -55, 144, -188, 44, 9, 36, 178, 95, -47, 213, 52, 196, -131, -26, 19, -169, -283, 147, -176, 129, 157, 0, 106, 109, 20, -178, 61, -401, -180, 236, -149, 104, -22]
7774b2MK29j61l3j76K4M99m24p2K80mj37O8l88N89m8j84j4K26k93r9K61m18K13
7798h0P9M00m15K9n3r9J76p5j5k80J89J98K99m74J65K8k23J11J41J0j13k63L00
7821C5j20j83L45K30j77k42R5jJ38j77Q6J28j93o3J74j93L72j44p5n7j10L44k56
7844d4K53m17OM4L22j66J33j15j43R7L90j61k85L14k02k49Q9J16O4J34q8L45n49
7867a12n6K7K40m0l9K2J18j56j16J17p9L93k31J29k28j84M81j74j85j50K31k7
7889a9K56k90j13J90J54k72k9J78j39J87k00J61r0J01rmJ10j13n9R9J56m91M9
7912a87j44M75k11m0L31k94M5J10L5k97K40L8kj82J40K00k19M0R9k54J72j92L00
7935B03m85M05o5j06K97l76J32j04J47K52m86J92J55k31K65k62q7j34K62K92l66
$$ y = [-22, -18, 211, 50, 17, -159, -135, 364, -60, -132, 148, 144, 7, 75, -313, 276, 228, 44, 30, 256, -37, -136, 125, -293, -80, -1, 399, -16, 13, -40, -139, 37, -38, -53, -333, -144, 54, 353, -121, 44, 72, -151, -40, 101, 111, -2, -265, 35, -85, -268, 77, 307, 130, -112, -17, -18, 120, -57, 29, 157, -36, -99, 75, -118, 254, 110, 35, -22, -132, 212, -44, 209, -208, -202, -158, 164, -2, 131, 16, -127, -30, 360, 199, -86, 228, 26, -223, -134, -18, 46, 180, 92, 437, -112, -168, -141, 99, 59, 20, 42, 160, 4, -112, 5, -74, 319, 88, 217, -11, -195, 286, 112, -73, -223, 8, -19, 237, -53, -166, 24, 178, -94, -123, 55, -84, 103, -97, 64, -26, 75, 66, 62, 172, 59, 0, 99, 255, -236, -187, -331, 144, -67, -107, 224, -70, -25, 85, 120, -177, 63, 101, 99, -83, 57, 257, 38, 78, 177, -77, 95, -97, 203, -282, 123, 58, -48, 249, -127, 5, -99, 48, 300, -186, 6, 161, -70, 195, -67, -154, -288, -26, 266, -100]
7956a00j8J04j2L3j91J7L96m29L18j50k9L28j99K7l36K8K85J89r6Rj00J2j97J11
7980@K47j83j14J76l12N44l70J3rk43K93L30m50K3l7q3J10J20n9K51n65K35k66
8003c49M78J73j30l95K68J00k97k2Q8J69j52j5M2N7j70K25k01L0P3j44m2N7M64
8026C07n67L8M59k8k97K11j03mJ34l93J16L65p0q1K7j36L5o4k22P5J73r9M44j78
8050A42n10K85J51K46k76M1O9k11l4J40j79O4J45o3r7K52j01J39m1k38R0Q2n4
8073D2m9mj58J03N0J0R0j65K14k73j50M63j15j09J2j63P8J94j6k54M4K91k68K90
8097A57j83l7J31l02K42K0m2qJ91k44j47k8L56k54J95o6k73K04J43O1l4l6n9M6
8121C3J25j68p6J94Q8q5O1k55L33l18Q5m8Q4J77j48pr1K7J32k33J78k88l0J28
$$ y = [-100, -118, -14, -26, 7, -184, -167, 229, -200, 118, -32, -61, 267, 68, 95, -241, -213, 72, 261, 165, 174, 74, 86, -111, 0, 247, 64, -50, 126, -186, 358, -12, 1, -8, -251, 42, 372, -78, -55, -92, -175, -65, 55, -4, 247, -318, -83, -349, 129, 302, 172, -223, 45, 145, -152, -174, -86, 83, -69, -84, -42, 15, -155, 70, -131, -101, -28, -172, -214, -157, 307, -260, -222, 237, 209, -88, 123, 20, 16, 150, -243, -127, 238, 168, 87, 114, -22, 13, -51, -273, -198, -25, -124, 320, 142, -368, -83, 68, 314, 38, 79, 148, -63, -97, 43, -136, -72, 73, 10, -87, 165, 64, 203, 162, -76, 14, 96, 42, -7, -11, -169, -66, -16, -6, 84, -81, 133, -140, -290, 173, 58, -51, -39, -202, -124, 70, 54, -200, -156, 135, -133, 157, -26, -63, 68, -234, 8, 28, -14, -22, 169, -75, -222, -250, 106, -148, 47, -19, -292, -88, 55, 116, 82, 46, -13, 33, 158, -10, -86, 108, 196, 111, 172, -83, 250, -68, 17, -31, 53, 230, 82, 75, -16, 11, 143, -90, 88, -200, -230, -102]
8145a02k2K21j23k52L63q9k03L57k96o9K13q4K34J00j25J33m77M01k17K57j58
8166F2j36J91k55L03j15j4L07m69M37m35K71j45J39j48k8l7j22J97J20r1j5J68
8188A85l09K54j3
$$ y = [-102, -124, 97, -26, -278, 85, -4, -207, 150, -146, -215, -2, -86, 148, 248, 123, 256, -221, 180, -37, 220, 62, -74, 117, -138, 165, 50, 36, 343, -126, 311, -124, 147, 2, 141, -7, -35, -72, -194, 3, 123, 32, 17, 185, -124, 130, 117]
8191A17
$$ Imaginary data points
##PAGE= N=2
##DATA TABLE= (X++(I..I)), XYDATA
0@%%%%%%%%Qj6J6j6J7k5L2l8M6n6O6p5Q9j04J21j40J62j86K13k41K74l12L49l92
32b08M40m93N51o16O85p59Q46r38J037j150J274j408J560j732J922k139K388k674
50a414L011l413L903m515N302o359P870j0216J4383k4010Q6768K3279j63244L640
64f5015M2895L7246N1481P480j27630n2969J06668Q4803m4547m9580l1742k2771
76f3681N4094J00226l1484j20648j9497P5241L9777J5439j3773q4226m5146R3869
88A91Q1578m0151o2065k3783n725N4176P4503l1863r6196j3211N7826M3932J2568
101E1780l1419o8777j3730P5834N5383l3892n8038k4371J1805N4499M9610l8960
113B9724q0438o093N3743L6007J0899k7190o7401j0661P5381M3291l5461l9791
$$ y = [0, 0, 0, 0, 0, 0, 0, 0, 0, 8, -8, 8, -8, 9, -16, 16, -22, 24, -32, 34, -41, 48, -56, 65, -75, 87, -99, 114, -127, 147, -165, 184, -208, 232, -261, 290, -326, 359, -400, 446, -492, 545, -605, 669, -739, 821, -911, 1011, -1128, 1260, -1414, 1597, -1816, 2087, -2428, 2874, -3485, 4385, -5831, 8552, -15458, 71310, 94589, -68655, -65015, -22120, 15126, 66607, 74087, -53543, -106512, 156, 84959, 40412, -9168, -40910, -63681, -9587, 90639, 59155, -61493, -80990, -5749, 34028, 49467, 35694, -48532, -93678, 191, 81769, 41618, -20447, -44230, -49955, 4221, 78724, 46861, -49335, -62546, -4720, 39212, 51780, 20361, -48416, -62146, 13688, 69071, 35179, -22859, -47230, -35425, 19074, 68684, 29724, -50714, -56807, -3064, 32943, 43842, 16652, -50749, -61410, 13971, 57262, 21801, -17990]
125a7990k1718J085N5456M8628m5507p0367N540M7152L1228J1470l2257o4961
137e2241j699P7705M0034l9731m5949j7852P642N4200M5686m7564p4042R835N3276
150I300K3042L599k7366o0353J586P7699L0648m8005m0047q412J2186N2025L5963
163F1865n3326o8282J7431N6578K3388m416l2782n2228P278P5727K9524n0827
175I930m2316q85J8437M3103K8657n1240o3289K4180N9149J2713j5082l0565m1943
188d9151J4563P2682J8188n7074l7869P159K1862L8995J9612n1360n5041K6351
200c1083N5660J0572j8696k7637l2595J5433O3969J4583n5541l3818J5093K3879
212a81L0020J3327m9242m8986L1980N6058L043k3487k5880k7483J8871O1072Q585
$$ y = [-17990, -39708, -38623, 16833, 65461, 19954, -50413, -44873, 2279, 33507, 44977, 12720, -52241, -53940, 23765, 63799, 24068, -21881, -39733, -32091, 22109, 67795, 20231, -53811, -43976, 9300, 32342, 35941, 8575, -51778, -50192, 27507, 58155, 10150, -29897, -38309, -26123, 25902, 61865, 8539, -59743, -42312, 14266, 37654, 33238, 456, -51772, -44494, 31233, 60757, 9930, -32386, -33271, -14834, 28269, 56926, 5686, -57603, -33423, 25726, 38439, 23357, -7208, -49151, -34588, 38094, 56282, -792, -38661, -31502, -9640, 29355, 48967, -2393, -57434, -31083, 24577, 35149, 16453, -11184, -43779, -28346, 35623, 50206, -5335, -39153, -24060, -181, 29839, 43166, -6076, -55062, -23082, 32976, 36019, 12532, -13348, -40831, -21960, 39112, 47697]
225D7697n6016k9828J7018K3441K5888P036m5267m0497L1394N0903o55k7152k2885
238a8923j7536K0258N3417M669n5541k7418K3134K6020K0757K188m3518l6715
250d9208L4144M9850m225k7903k0844j3316K1527M7918n59n2721k1760K4932K5700
263A3535J4207m038m0261k8133L4690M6234q186l2100j8434o333K2447M2664l862
276C2430n1712j8937K7463K4140J1278n264l7578k3519L6374M0559j1944l0083
288f793j4830j996K3078L7300r220m9165j3412L0074K3413O759r564l5104j8674
301c8134L6676L8185j4827l1495j1722Q39K1170L3353j0647m7144r488L1496J9795
314A8057K061j0143l1090j4291L7129L4441j8873l1557p775N276K1495K8837j2820
$$ y = [47697, -8319, -38147, -21129, 2312, 28200, 35236, -10031, -50528, -19134, 31769, 31114, 3962, -18923, -36459, -16201, 37216, 41885, -13656, -41074, -17940, 8080, 28837, 31025, -12493, -49208, -15064, 34786, 30561, 2658, -18186, -31502, -9975, 37943, 37384, -15337, -37097, -12165, 13535, 27742, 23704, -16557, -44690, -10000, 36234, 28048, -4052, -22486, -28819, -6372, 36292, 32430, -19282, -38219, -10756, 13384, 24662, 19398, -18180, -41699, -5325, 35234, 23290, -6793, -21623, -23619, -541, 36759, 27539, -21626, -35038, -4964, 18449, 25208, 15644, -19460, -38134, -1458, 36727, 21900, -9595, -21317, -20478, 692, 34045, 23398, -23746, -33234, -1738, 18057, 20118, 9975, -21115, -35406, 1723, 36164, 17291, -14266, -22041, -16765, 4730, 33567, 20747]
327B0747m5912o853L3598J9529k067j1520k7181j1816L6180L1260k0934l1386
339a6355l361Q536J8447K3120j4423m2593l669L5760J7522p569j3354k3220p709
352b8868L5017K9291k2910l2191j260J2165J7097J8598j4551l8575j612L5046
364G247J6034j0628j4273j7852l335L2402K4048k4118l0326J630J5012J6424J3400
377B5665j6880l5162J709L4267J4162j1851j5860j5711m97L1127J9496k4276k7617
390b1428L494J5728J4642R609j7588l1245M876L4370J0295j4698j5103j2584L060
403a6572L0191J6208k6035k6592P121J6753J2463P463j7938k8870O933L3483Q151
416B2759j7265j3723q557L979K7190J3288k7165k4359R851J8490R705K905j7503
$$ y = [20747, -25165, -32018, 1580, 21109, 19042, 7522, -19659, -31475, 4705, 35965, 15031, -16355, -19716, -11180, 7267, 30387, 15964, -26629, -30298, 5462, 22984, 15415, 2061, -21159, -28868, 6149, 35440, 12530, -19661, -20921, -8756, 8341, 26939, 12388, -26187, -27799, 7247, 23281, 12653, -1620, -19472, -22807, 9595, 33643, 9525, -20801, -19171, -4159, 12265, 25665, 8785, -26377, -24668, 9599, 23761, 11910, -3950, -19661, -20158, 10969, 30465, 6189, -21428, -17934, -2206, 12436, 22045, 4457, -26788, -21912, 12458, 22753, 8055, -7048, -19632, -16572, 13619, 29827, 3792, -22800, -15679, 1074, 13537, 21000, 3062, -25808, -18875, 14608, 22759, 5494, -8229, -16786, -12807, 14383, 27671, 506, -23853, -14002, 4488, 14193, 17098, -405]
429d05k5454Q957L2647O396j9476j4135n505P068K4450J0187k6033k2486J1531
442a2258J8869P860o70j7043k0664J1004L0450L295j9778j3388k757R018K3070
455A7008N667k6570j9301J3001J8535O735l040j7264j7939J3052K8326j00k0000
468a890j1379m86R355K0918L221k6674j5849J5440J7690L211m351j6332j5268
481b2394J4832K7115j895k1776r488J942R853J8551J566k6331j4484J7701J6890
494A2082K41n360j4346j2948J5118K5597m964k2420o863M845R165J5784n10k5573
508a0152j2337J8998J7166k299p540j2842r819J5003K3802n687k3105n708P968
521f552Q947J2226j726k3457j0149K0210J5690m851q884j0471p491J5522K0791
$$ y = [-405, -25859, -16902, 15745, 22141, 2665, -11470, -16975, -9907, 14543, 24730, -1303, -23789, -12258, 6611, 14471, 13801, -3242, -23906, -12902, 17548, 20843, 1065, -12323, -15080, -6062, 17008, 22675, -3895, -23196, -10195, 8340, 15075, 12035, -5229, -23168, -10116, 18210, 18110, -1890, -13269, -13755, -4400, 16518, 19739, -6935, -22784, -7344, 10346, 13557, 9206, -7126, -22394, -7562, 19553, 17658, -4118, -13606, -11664, -1811, 16740, 18306, -8025, -22509, -4808, 12082, 12323, 6963, -7383, -20331, -5213, 20384, 15420, -7000, -13863, -9018, 147, 15931, 15421, -10152, -22489, -3491, 13675, 11376, 3836, -9006, -18825, -3822, 19980, 14293, -8812, -14520, -6552, 2395, 14621, 12895, -10562, -20711, -501, 15189, 10338, 1454, -9017, -16508, -986, 19805]
534A9805p624k2299m134Q875R773J0076m179k1860p723J9359J4960n553j0304
547h28q893m445J4382J8628q538k1797k272J0701Q719P302m687k0767n644K0811
561B672J3127p690j0430p627k629J5227J6278j0401k0545o63J1191Q514M819n959
575E884j8326l946K0134J2199r576j0536n460m80J3690J4307j1049k0845J296
588a2708J3176P243L446o724j7661j726K0519J0452j1382j0534l918J536J3681
601E400J1218j1967j8125K149J3873O602j34p266j4367k8J9097R287j2234j0937
615g432j639K648J2192J0062j2654j7547M156J3823N046k83p870j3500J729J8895
629G626P181j2840j0017r20M565J1725O797j2695j6237N678J4866L876l347p191
$$ y = [19805, 12181, -10118, -14252, -5377, 4396, 14472, 10293, -11567, -19290, 69, 15029, 9476, -828, -9721, -14166, 216, 18844, 10306, -11491, -13763, -3062, 5657, 12959, 8272, -12495, -18139, 2672, 15799, 8109, -2321, -9948, -12577, 2650, 18928, 8527, -12018, -12681, -1490, 7024, 11843, 5884, -12442, -16388, 3746, 15945, 6369, -4167, -9627, -10107, 3583, 17890, 6841, -14004, -12708, 468, 7711, 11157, 4433, -13228, -14954, 5565, 16017, 4635, -5899, -9817, -8281, 5400, 16618, 4651, -13474, -11325, 2548, 9150, 9016, 1750, -12617, -12645, 6452, 15739, 3505, -7432, -9071, -6423, 5769, 15831, 3177, -14370, -10214, 3609, 8655, 8372, 502, -12998, -11269, 7626, 14807, 1967, -8050, -8970, -4405, 7320, 14117, 1422, -14815, -9137, 5729, 9605, 6258, -933]
643i33j0964K036J8605N818j4006r666J685M449J0179O056j3277j4467O891J4103
657F509K687l958p704r420M382J6814M160j4023r447K346O838R038L314j2990
671a454j3365P499J5062J513o083p299p040N435J5758K759j5276p813M849O088
685F33P677J697j2817j1191R075J3478J87o518p030n925O800J4568K81j4242p132
700a0459N476O756O261N28j2484r348R541J3027j663p219n841l832O200J4421
714A1364j440j5247m809O946O090M620K27j2371q292J1145J1690k931p627m235
728d870l229O151J2381j492j4448m514P766O010L131j132j0382p747J0456J2615
742A0696m115q564l204j985N658J2164k478j4720l502Q702N989J852j507j0660
$$ y = [-933, -11897, -9861, 8744, 14562, 556, -9110, -7425, -2976, 7203, 13259, -18, -14485, -7594, 6509, 9196, 5238, -2466, -11886, -7504, 9310, 13470, -553, -10000, -7654, -816, 8222, 11536, -1454, -14819, -7320, 7742, 9255, 3172, -4127, -11167, -5732, 10026, 12785, -2491, -10304, -5455, 633, 8310, 10007, -2810, -14001, -4926, 8552, 8739, 2221, -4809, -10734, -3934, 10634, 10915, -3327, -10459, -4983, 1773, 8034, 8562, -3922, -13270, -3729, 9298, 7635, 416, -5425, -9257, -3057, 11364, 9924, -5323, -10132, -3186, 2904, 7524, 7751, -4620, -12912, -1767, 9923, 6992, -635, -4870, -8099, -1948, 10433, 8941, -5507, -10021, -2255, 3755, 6886, 5754, -4628, -12375, -1919, 10696, 6581, -1983, -5187, -7172, -1514, 10650, 8172, -6548, -10050, -1348, 4641, 6493, 4986, -5674]
756e674n372J0608J0975m633r010k915L18O163R431l069j3441l512J0004O063
770E936k49k383q971m697J0639J0456n299r661j985J143O407R017m588j3621j437
785i293R659N988j76m370q475k419J0507R575o303j0296j051L394N771O537m539
800D509j3006l27J1021M811k543l651p226k171J1227P894p682q689M54L008N547
815C176N813o329j1009N49J0124M805k902m750o268L4J0170O568p745r019Q72
830e911M965M697L928n597j0848J609J1039L296m328m201m958M73J0201M976q562
845G79p395J699M560M869K476n589r776J989J0163L420m745m899l628J109R264
860D296M963q560q231K801N653L106K094n841r026L121J0795J635n561l947l044
$$ y = [-5674, -11046, -438, 10537, 5904, -3106, -6021, -5703, 460, 9891, 6822, -6619, -10131, -127, 5936, 5687, 3304, -5667, -10364, 275, 10731, 5432, -4229, -6214, -5071, 1336, 10353, 5765, -7856, -9293, 366, 6354, 6178, 1808, -6667, -9086, 1421, 10996, 4693, -5603, -6654, -3260, 2511, 9048, 4509, -8497, -8824, 2197, 7008, 4465, 814, -6412, -8583, 2644, 10538, 2856, -5833, -5379, -2371, 3176, 8989, 2660, -8349, -7800, 2324, 7129, 4227, -523, -6791, -6757, 3413, 9981, 2236, -6783, -5911, -946, 3751, 7679, 2082, -8766, -7157, 3882, 7178, 2850, -1351, -6309, -5836, 4365, 9341, 779, -6616, -4917, -357, 4512, 6988, 1399, -8377, -6388, 3775, 7195, 2450, -2449, -6077, -4968, 4296, 9259, 699, -7532, -4731, 922, 4028, 6122, 281, -8745, -5624, 5171, 6806, 1245, -2702, -5746]
875e746J879Q725L487r186o890L952N602L001J77n632p753L961R947J284o333
890D75m037j570K154Q607K149r172o371M609N542K093J11o045o872M789J0051
905F513o6o683l661j099L054P343K067r615n599N154N779J598j090n573n839M862
921b855R707n84p723k735N48K435O856J181r336n622O185N865N13j785m910n032
937g292M983R060j207p812k419J293L025N813K37r091m105O192N451J21k589m469
953b809m087N615Q105j533p753k195J678L758M345n5q819l719O738N696j187l023
969G55l626k913N063P493k473p367j503K117L554M138j384q044k577O892M771
984D896j429l024l868j837N660O182k786p228j058K725L301L111j290p848j951
$$ y = [-5746, -3867, 4858, 8345, -841, -7731, -3779, 1823, 4824, 5001, -631, -8384, -4423, 5524, 6808, 475, -3562, -5132, -2978, 5629, 7778, -1394, -7765, -3156, 2386, 4479, 4590, -1455, -8327, -3538, 6513, 6447, -236, -3897, -4996, -1942, 5401, 7468, -2147, -7746, -2592, 3187, 4785, 3695, -1878, -7717, -2855, 6852, 6268, -1455, -4190, -3642, -1207, 5649, 6830, -2506, -8128, -1943, 3922, 4435, 2650, -2260, -7292, -2309, 6751, 5544, -2268, -4687, -3394, -369, 5444, 5681, -3410, -7515, -1323, 4128, 4249, 1660, -2809, -6896, -1281, 6824, 5291, -2462, -4657, -2979, 779, 5124, 5069, -3750, -7469, -731, 4965, 3778, 755, -2871, -5784, -721, 6772, 4299, -3068, -4571, -2454, 1100, 5238, 3854, -4190, -6767, 125, 4896, 3467, 443, -3425, -5262, 398, 6580, 3794, -3434, -4492, -1767, 1534, 4645, 3355, -4493, -6444]
999f444P299M007j841l276l187j503N605O031l628p085k8L348K449K787j915o947
1015d328j512O802M385k986l232k471j002N243N385l480p272O9M209K502J981
1030D293k460o427j111P387M257l976l549j824R0M787M737l686p317N30M874K474
1046C079L98k099o206k20P445L106l976m022p00K71M942L733m253o535J062N186
1062A211J987N8k738m966j59P288K587m314l440p06J257M146L390m610o228J672
1078c565N445J385r33k481m017L18O803K116m542l813K22J689L588K744m566n435
1094e042J978N173J004j095k655l398R85O053K117m974l114K84J818L419J618
1109D171m272m835K048N349Q70j609k606l283J634N809J166m798k782O67K199
$$ y = [-6444, 855, 4862, 3021, -255, -3442, -4945, 660, 6691, 3063, -4022, -4050, -702, 1747, 4534, 2619, -4328, -5840, 962, 5347, 2361, -871, -3342, -4344, 899, 6284, 2804, -4468, -4399, -190, 2312, 4293, 1833, -4594, -5705, 1682, 5939, 1963, -1586, -3410, -3320, 1467, 6204, 2518, -4799, -4269, 605, 3079, 3477, 1378, -4828, -5048, 2397, 5503, 1527, -2495, -3195, -2924, 2018, 5751, 1498, -5037, -3975, 1211, 3198, 3256, 518, -4448, -4607, 2681, 5268, 954, -2486, -3192, -1935, 2211, 5601, 991, -5237, -3565, 1880, 3265, 2332, -149, -4166, -3848, 2955, 5071, 529, -3284, -3062, -1373, 2215, 4959, 393, -5042, -3064, 2109, 3113, 2018, -637, -4035, -3050, 3003, 5120, 146, -2968, -2684, -866, 2553, 4171, -101, -4936, -2888, 2461, 3331, 1722, -884, -4167, -2533, 3276, 4442, -356, -3138, -2471, -272]
1124b72K990J279m466m497K549N211J50j903k114k890J961N014J212n114k708
1139c598J691K139K563R26m391m499L029M932L21k250k055k323J659N412L93n170
1155a221k419J694K528J935P59m331l503K958M871o03k494k065j635K275N038
1170C787L8n570k121K542K486J265K11m069l363L752M493r44k526k063n85J707
1186i60M450j35n230j726K920K132Q42l09l880k137L594M286j487k816j397n62
1202b415K117L975p04m871j571K857K576M88m40l657k477L722M017k014k538j185
1218b120q2K617K966j038m712q31K877K088mn41k883j661L310L719j676l702l91
1235b064M99K003K954j465m285q65L489K203n67r50k831j295L528L313k439k974
$$ y = [-272, 2718, 3997, -469, -4966, -2417, 2794, 2944, 1041, -1073, -3963, -2002, 3012, 4224, -890, -3598, -1907, 232, 2795, 3721, -670, -5169, -2140, 2792, 3113, 863, -1192, -3515, -1856, 3556, 3949, -1221, -3640, -1946, 582, 2517, 3276, -1055, -4558, -1600, 3271, 2668, 174, -1891, -3526, -1251, 3787, 3825, -1745, -3866, -1324, 1162, 2427, 2638, -1431, -4794, -1042, 3451, 2507, -19, -2082, -2667, -960, 3490, 3355, -1875, -3601, -681, 1451, 2293, 1984, -1896, -4033, -439, 3847, 2360, -456, -1853, -2415, -298, 3677, 2973, -1898, -3469, -612, 1964, 2452, 2012, -1645, -4122, -400, 3617, 1603, -935, -2120, -2202, 415, 3381, 2343, -2369, -3200, -323, 1765, 1761, 1220, -1663, -3324, -14, 3705, 2029, -1673, -2064, -1565, 438, 3392, 1927, -2358, -3223, 266, 2469, 1902, 952, -1879, -3174, 354, 3667, 1228, -1746]
1251a746m19P80K027K270j306m468J78L198J828q13j166k217j051L593L104k653
1267A139l125L77N64J699K084j316m198j14L779J144p16r87k334n86L607K352
1283C369k502k907K37J243J471J821j778l864L53L631J199j350j162j599k64L169
1299A067K308k415l184L60J599J311J125j546l684Q45L240J139j443j346j027
1314a651n9L118J671k786k683P16J491J609M33j281l429J094L288P35j862j154
1330g50o79J15K485J535k441k775J297J560P51N71j653k849J008L564L80j720
1346C99j495p01O10K592J183k447k474Q91K052P17l3j500k300J053L308L01k305
1363a49p94o10N32K433J213l221k042J583J905L53M0j547k202J571K783k81j704
$$ y = [-1746, -2165, -1385, 642, 2912, 1606, -2862, -2684, 514, 2342, 1529, 363, -1854, -2905, 688, 3792, 1139, -1986, -1609, -1045, 654, 2738, 1422, -2776, -2890, 889, 2033, 1317, 330, -2004, -2590, 1017, 3369, 867, -2040, -1803, -560, 911, 2732, 954, -2910, -2557, 1074, 2273, 923, -239, -1838, -2102, 1067, 3375, 960, -2224, -1864, -265, 1046, 2171, 625, -3059, -2214, 1026, 2165, 722, -624, -1651, -1710, 1408, 3079, 293, -2390, -1674, -183, 1426, 1859, 578, -2851, -1757, 1531, 2266, 404, -750, -1429, -1314, 1171, 2706, 265, -2510, -1213, 347, 1098, 1669, 16, -2833, -1825, 1739, 2119, 399, -1096, -1797, -1187, 1405, 2588, 141, -2333, -1442, 610, 1327, 1294, -206, -2506, -1453, 1855, 2156, -149, -943, -1553, -1021, 1412, 2625, -596, -2638, -1055, 850, 1203, 1243, -304, -2506, -935, 1848, 1567, -137]
1380a37q93m87R26K368J62k630k031J579K299p4k01j188k110J420L287l82k287
1397c79p75j15P55K143M36k897j580J945J483M25n33j789j233J889K385k93k510
1414f43j018R91J025J209K70k819j283J906J685l13m44j251j307J601K433o24
1430A418k057m11J91P01J730l41k371r18J700J881m74o10j281j241J994J985n06
1447A390k408k98P47P86J102m5k253j180K166J407m57j008q80n33J368K069j222
1464G51k084JJ069Q05Q95k86k653n22K030J214p56o16o49o33J528J718q53j998
1482a039l73J583O44K47l59j909n76K064J102j116n48o26J04R94J685j204j746
1499a073K02P49O65M17m31j961k60K174R67j215o57m37L7J107J433j250k044L58
$$ y = [-137, -1030, -1517, -591, 1777, 1939, -691, -2722, -1143, 1156, 1082, 881, -307, -2417, -997, 2290, 1908, -379, -1154, -1269, -514, 1629, 2065, -832, -2412, -467, 1016, 1441, 908, -881, -2114, -225, 2160, 1867, -643, -1661, -670, 355, 1564, 1834, -985, -2268, -362, 1323, 1010, 566, -685, -1992, -391, 2042, 1418, -639, -1050, -859, -158, 1572, 1231, -1140, -2058, -358, 1523, 1049, 439, -842, -2083, -89, 1896, 1390, -1018, -1316, -569, 217, 1319, 1274, -979, -2159, 7, 1414, 957, -51, -931, -1464, -96, 1973, 751, -1333, -1332, -263, 542, 1437, 1151, -1502, -2024, 6, 1220, 464, -152, -801, -1434, 94, 1812, 959, -1039, -1412, 171, 815, 1062, 703, -1206, -1782, 282, 1384, 268, -280, -906, -802, 192, 1877, 673, -1073, -871, -122, 543, 960, 529, -1432, -1692, 482, 1449, 234, -423, -860, -823, 284, 1717, 467, -1577, -1219]
1517a219J058J037J88m82j598k72J747R61j059r14k28K67Q39J262j226j771Q02
1534f08Q72M92J07p12j568M10J652Q09j449j153N65Q3R15J018j232j657Q36J276
1552F56j96K85q49j120L80J734L93j226q17R1M66P62P36j242j342P35J093j75
1570C64J91k31j314J84J249J031j548n28J35M79K48J049j431j369J001J154J90
1587H54j97r53q91N78J502J65j247o18L94J56J215l7j013j414P27J213Q7l00k35
1606a4q28J90J378J77j463n04Q88L57O41J89j344r12J069Q30J7n70m55o38P28
1625b64J131P9j267k59K50M87J88p4n46r42Q32J304n80n42j05K7n3J732p76j296
1645f74j52P36N27K93Mj144o39Q24R96m35n21k44j88M13R01o8j329nO28N47J89
$$ y = [-1219, -161, 876, 1064, 582, -1016, -1288, 459, 1420, 361, -553, -781, -514, 325, 1587, 361, -1410, -608, 264, 756, 863, 151, -1417, -1007, 645, 1454, 5, -1148, -583, -500, 415, 1433, 201, -1456, -620, 656, 460, 745, -104, -1224, -844, 890, 1283, 57, -760, -669, -203, 559, 1295, 53, -1289, -554, 539, 364, 555, 324, -990, -806, 443, 1474, -74, -602, -467, 12, 260, 1309, -122, -1491, -490, 664, 854, 657, -296, -1187, -609, 893, 1058, -189, -807, -413, -257, 958, 921, -92, -1506, -779, 434, 521, 221, -14, -842, -652, 726, 903, -560, -1064, -176, 181, 822, 1011, -333, -1245, -176, 654, 671, 101, -354, -992, -264, 867, 946, -321, -580, -330, 157, 345, 271, -275, -1217, -385, 919, 339, -203, -308, -281, -334, 1398, 622, -674, -826, -90, 437, 730, 734, -410, -1049, -225, 771, 336, -185, -429, -617, -204, 697, 629, -700, -705, -77, 470, 659]
1666F59r6j524k28J126J204j017n36L7j97M88J006j49j164k67R51K11m9J82j241
1685f04l64J379N21n87p24Q1o7N17O87n38j157K08R91O4l32J60o02m83R34J052
1705A136o49j001J55n5M88Q27j90j118k67J067K94l04l08q11L77O36O33p11p82
1724e83j4P37K82L56k82j299j30J094R5k38j49l63Q8O72O95j092n15M42J52P9
1744B7N94o05q54J99R88K24m83j26n37K73O16O08p01r82N25N47pL25k14j198J84
1765e97J267m59o2l60k78K2P05O53n50j117N15M82J13j42j17p60N49P13j67o07
1785a97J4j10N2Q85k1o76o10N00M41k47N63m94q67M98J043m6j342O72n23M50L33
1806C18K29p23m31M21M49J24k56l22n25P15K23p3o51M91j88J70L78K33n76q01
$$ y = [659, 563, -961, -1189, -63, 1141, 124, -412, -375, -572, -84, 922, 773, -391, -658, 293, 504, 455, 637, -604, -968, 411, 932, 345, -379, -298, -365, 152, 839, 301, -856, -648, 343, 407, 75, 235, -367, -850, 84, 1136, 487, -514, -359, -414, 74, 901, 711, -407, -674, 393, 687, 383, 75, -736, -359, 277, 910, 199, -583, -597, 140, 422, 778, 496, -803, -933, 161, 256, 18, -131, -494, -406, 266, 961, -131, -646, -204, -52, 27, 621, 16, -838, -639, 349, 573, 90, -36, -573, -300, 316, 924, 223, -759, -234, 313, 306, 631, 417, -781, -597, 670, 211, 149, -211, -489, -467, 238, 891, 341, -776, -261, 221, 334, 192, 75, -685, -136, 577, 410, -197, -183, -293, -241, 644, 623, -53, -663, -163, 278, 31, 594, 100, -767, -269, 774, 728, -614, 58, -465, -15, 318, 547, -176, -607, -186, 263, 387, 131, -191, -716, -1, 222, 149, -502, -11, -199, -29, 349, 582, 6, -795]
1826g95J067O9m99N02l68n21N18L84R7p58L59k19J47O91j94n13m03N92N5m7N2
1847B16k94p6K23P22o85m97P3K69q9L97J07p23l11P50M17k29n54L72j00k79P28
1868D37l43n42L82L6m4p7L21o39k00Q33K44k24j26J14m67M1P28Kq26o4J39L80
1890A05L3J76o68l37R21J62k43n11M53l51k6Q36m91k06L09k62M1K48J96p04R2
1911b27K16J53k69j5R5k08M21K23k72m14J8M91l8j64K08o37J22M30M65o05k43
1932b50L27m2j49K85o6m00N1O41l55J50O4l98o4L73L74q13m8K91n8L8N37p06j60
1955c78L84J55j43q7L71n34O2M21n2k19l31K69q0L86J51m4p90L09L21j91J28J18
1977B26m57J06L96L56n16k71J37J57K19k20o1l14J11M93m38j86M03k80N4l5L19
$$ y = [-795, 272, 341, -158, 344, -24, -545, -27, 357, 454, -304, 55, -164, -17, 674, 480, -33, -436, 156, 211, 164, 216, -78, -154, 69, 791, 106, -391, -318, -49, -138, 259, 366, -357, -668, 82, 499, 270, -284, 88, -12, -291, 437, 94, -448, -66, -30, -74, -151, 170, -469, -669, 164, 408, 184, 58, 172, -295, -254, 474, 476, -350, -414, -275, 105, 138, 314, -354, -691, 230, 392, 149, -362, 91, -260, -286, 550, 59, -147, 162, -100, -59, 189, 385, -319, -227, -11, 142, -127, -142, -47, -255, 166, 389, 117, -297, -279, 212, 174, 10, 218, -419, -297, 133, 598, -7, -250, 77, 35, -114, 171, 105, -295, -244, 397, 42, 192, 256, -142, -206, 167, 541, -272, -320, -29, -87, -49, 488, -218, -378, 6, 161, 18, -69, 302, -232, -170, 251, 199, -20, -351, -82, -162, 224, 375, 331, -459, -150, 171, -20, 108, 226, -231, -125, 271, 627, 111, -160, -23, 134, 353, 133, 72, -242, -131, 362, -76, -262, 141, -139, -85, -120, 199]
1998A99j08m52L26j09q1M55l14k29kP45l46P0k50J2l57M02K83l69M9JR3k86O85
2021D17m67N9k3q4l5O9L43m39j12O93N5l83k68K73M12k76l28k9n5L92P0l23N6
2044A7j54L91m86L94M8l67j5J61J62j15J47m0n99M05L32K17l89j70J50k12J34
2065A1J40l39K81j31M05l54R8l92l8L98J24J5l36K87l56K76J11O8n3l17L38k71
2087c5oK06j42l66M53j50K57l84L90j64j63K72j44r9J01L57l61J69k28r8L9R4
2109bK73m32L10J53j71n68L53K64l68L5M64k83j99J02M47m63L2K66j24j03JJ4
2131Aj7k32L77j81J02K17k96l17L58K01l36J62q2l07L83j18K59k49R6m9k52K18
2153f2L5J35j94J28k38l9n8K16j17M08r4k07k6p6J70k27L70r7k25J34Q0K17k05
$$ y = [199, 91, -361, -35, -144, -225, 230, -84, -313, -315, 430, 84, 154, -96, -84, -441, -39, 244, -125, -76, -75, 18, -268, 417, -50, 9, -14, -98, -133, -64, 279, -160, -272, 421, 476, 93, -175, 98, 510, 234, -94, -123, -178, 214, 284, -39, 17, -137, 254, -232, 162, 210, -157, -172, -11, 151, 36, 183, 143, -456, -51, 281, 498, 109, -61, 89, -123, 11, 151, -188, 93, -38, 367, 13, 111, -281, -319, 79, 203, 218, -118, 169, -187, 89, 200, 268, 215, -102, 236, -35, -41, 165, 23, -343, 110, -40, 217, -167, 223, 59, -104, 168, 24, -75, 26, 383, 22, 191, -37, -135, -96, -2, 271, -161, 149, 302, 131, -437, -84, 180, -188, -153, 311, 28, -171, -69, 378, -85, -53, 213, 89, -14, -13, 1, -16, -248, 129, -52, 50, 267, -29, -346, 12, 213, -123, 39, -43, -350, 33, -85, 174, -75, 21, -28, -280, -62, -27, 108, -86, 42, -196, -235, -293, -77, -194, 214, 120, -87, -113, -189, -19, -246, 124, 27, -198, -64, 16, 233, 28]
2176B8q6J56k33J11M9M6r3jJ42j66M82l74m63K7L16K76l48k74N79m2l45N69p10
2199c54q2N42j92K84l88J79O7L5p2N2k10n0R4J96l83L14m8m07M04j9j51K70P9
2222A60o1k03L40n86J37K0k9K06Q4J19j29m10K86J81k22L44l56P2J11J24j92j02
2244a06o3L20l21K85J09k35k12K78j19N4M5p4L41n78L6M33j49p6m7J81p7K4n9
2267a0j29J17M60m00L11l63k60K51m9K52n5k55l6K40K3n9R5l82K29PJ12ok09j09
2291b25R4L30L82m99k2jQ7r7L94n93j92L64N0Q2l7J0k91K72J54K3m47j06R6N0
2315a22N2J68Q3k14k7L88m7j83j36l53K34J81N6l54OL40R1J34l06J5m56L94J46
2338I0M0l08n9R0K49J03l07rj2J71K71J4r1p47j14M89N25k71l27K35j64mM97k27
$$ y = [28, -58, 98, -135, -24, 25, 71, -22, -23, 119, -47, 435, 61, -402, -375, -59, 217, -131, -405, 174, 132, -213, 356, -354, -436, 106, -86, 198, -190, -11, 56, 91, 19, 71, -139, -189, -95, 101, -282, 32, -16, -423, -19, -38, -189, 81, 160, 99, -104, 236, -350, -213, -193, -222, -16, 68, 187, 58, -352, -66, 115, -107, 237, -119, -47, 64, 188, -4, -106, -169, 151, -170, 115, 224, -11, -223, 55, -64, -10, 35, -39, 302, -276, -240, 193, 44, -32, -79, 102, 25, 49, -10, -139, -22, 438, 38, 349, -14, -274, -23, -72, 180, 125, -130, -166, 74, 97, 38, 133, -249, -20, -13, 99, 93, -116, -225, -131, 199, 581, 82, 60, 59, 146, 49, 443, -150, -342, 22, 72, 154, 117, 127, -164, 108, 262, 285, -162, -268, -172, -122, -70, 98, 181, -33, -60, 328, 281, 98, -38, -391, -157, 24, 80, -274, -268, 72, 163, 297, -9, 6, -450, -56, 90, 130, -178, -237, -147, 102, 205, -102, -111, -123, 48, 319, 333, 242, -505, -619, -130, 395, 124, -203, 32, -132, -136, 361, 134]
2362A34l00L7K26J04k83M32o53M5N57m48M92q9m87K64J94j49O4l84J40O5M35j05
2384B91m34N7l38L22M33k73m25J16J27L20l9k4l23P3J03K09K19m37m0k97L8N65
2406B43l29J93m20K27R6J39K3k82k44J35L25J3k13j28Q4J76K46J07p04R3J22J66
2428F8M59j88o12k8J78J18L44m22J80q7r2K20r3l33l1J77K2J75r6j25J82k82P63
2451D97l43k12l16J97L62J22J8o22Q9K98J07k23k02R2P7K38J51j43n60J74K04
2472EQ4J55l23j61J85N2J86j70j36N8m1N6J78k29L07o48M72R8J65l88k25K29J37
2495D6N37l01k87k63J18K89M25l33m17m6J7M72j53J9m02L4K15N53k72n12l47M39
2517a69M23r1j66l30K04P1L15oj08m92K05L69M9k4k53l97J03L58J09k13j50J3
$$ y = [134, -166, -129, 97, 201, -82, 350, -303, -258, 299, -149, 343, 254, -233, 31, 225, 76, 140, -244, -104, -39, 396, 291, -143, -86, -424, -102, 331, 58, -367, -251, -124, 196, 157, 133, -190, -117, -14, 195, 414, -23, -63, -360, -322, 243, -86, 107, -313, -86, 10, 149, 172, -110, -354, -219, 106, 119, -94, -222, -138, 38, 284, 391, -313, -220, -98, 68, 527, 339, -273, -301, -123, -5, 339, -83, 97, 10, -82, 138, 45, -288, -319, -142, -120, 55, -41, -166, 16, -266, 497, 154, -58, -374, -177, 185, 307, 325, -297, -208, 90, 197, -26, -228, -136, -59, 179, 330, 187, -373, -199, 5, 89, 244, -79, -240, -55, -3, 183, 13, -123, -65, -106, -50, 128, -101, 206, -442, 30, 128, 293, -95, -320, -91, 46, 583, 282, -5, -268, -150, 139, 564, 231, -186, -232, -215, 257, 104, 123, -279, -245, -30, 523, 251, -261, -608, -169, 254, 163, -3, -333, -129, -58, 257, 251, 143, -349, -144, 225, 274, 250, -3, -400, -297, 61, 170, -43, -193, -180]
2539a80N7J86J01L2l95L4J76K40j59j62o6K51r2K72L9n48k94O05L40J3o41k57
2561d48O14j73R3j12l06J9J93K95L7k17j65J78P9L22l74j0Mk01M67J3j32j27k47
2584a98J78M03rl47n29L09J68K91k50j86J40k81M12K03k91k73n9M16mq1M3l93
2606c38J23L60J97j49k40m51L09O11k39j91l17K15K69J68K64p81l43K98M42%j08
2627I9m82K0L42M63p4k80l65k82L94N65m42j3k05J93j5L74pl31j28L6N28Q4l87
2650H7m70L72r8M54n4l77k25Q7M68r7J94r51J08N97J96n9j18o92N68J56K64k43
2672A67o6k94J30L45j0k31o69K28K67M76k16l60k38K28M49M68q23l5j62L03K26
2693A83N24o62l19k54N12K61l13rk33N00K21K54n87L3m69J81L66N7k18l97L37
$$ y = [-180, -123, 63, 164, 196, -199, -165, 11, 251, 92, -70, -136, 115, 23, 295, 334, -214, -508, 97, 437, 450, -191, -448, 166, -7, 86, -26, -332, -313, -120, 175, 212, -5, -170, 8, 87, 409, 35, 25, 29, -172, 295, 308, 176, 49, -198, -20, 383, 374, 27, -502, -193, -25, 266, 16, -170, -30, -311, 101, 304, 13, -260, -319, 97, 93, 12, 55, -338, -215, 145, 342, 193, -47, -498, -189, 422, 183, -8, -325, -110, 159, 327, 591, -190, -533, -235, 207, 207, 99, -383, -363, -21, 442, 368, 88, -277, -559, -165, 400, -42, -55, -260, -67, -82, 292, 285, -46, -174, -138, 390, 474, 87, -383, -11, -109, 345, 291, -86, -311, -224, 244, 147, 341, -610, -502, 95, 291, 232, 114, -578, -10, 146, 410, 167, 101, -193, -63, 282, 272, 41, -628, -400, -133, 343, 127, -233, -471, -243, 206, 674, -149, -184, -346, -43, 183, 707, 45, -274, -528, -16, 245, -68, -77, -310, 190, 411, 665, 78, 111, -358, -177, 189, 246, 28, -369, -32]
2714c2m7NL01N6n06K44L63l72Kr0j67L57J99R1o66k65N68J67J62j95l94J44R1
2737A6J23J86k52j78k39K69M74k46k22m12L13O6L7k51K06k53L79K92n9K9m79J49
2759e2J08J75l6k99N5j79K92K24n60K22l20J62K33K98l29j94J45M5L26k62l96
2780c42K65k39O00K22l80n06K44M8K43j17m07J31K5R7N19l52j68p3J44K05L48
2801E07o09Mj45M18J67r1n07J67j14M64L82m09o52J19M25L80l29k77l06K82M60
2822C36K52J3q69jJ90K75J27j73j51j17N8K08M50q82j83K36N59J40k77n52j3J19
2844b55L13L84M7q74k82P92j20L53k89K28l96L23K14l10l00k01J60N47n9k91m74
$$ y = [-32, -79, -74, 227, 283, -223, 21, 384, 12, 14, -76, -243, 114, 313, 404, -262, -527, 41, 208, 370, 175, -219, -75, 16, 139, 325, 73, -105, -344, -75, 399, 153, -69, -481, -168, -102, -65, -316, -110, -363, 16, 308, 249, 278, -201, -52, 56, 231, 195, -104, -49, -228, 64, 288, -272, -50, -370, -208, 25, 323, -6, -200, -55, -10, 316, 54, -342, -77, -316, 284, 506, 126, -380, -136, -88, 155, 38, -369, -238, -213, -116, 403, 51, -117, -190, -46, 159, 507, -102, -98, -243, 175, 342, 251, -256, -89, -203, 261, 643, 234, -418, -299, 126, 506, 177, -100, -406, -124, 336, 588, 601, -268, -269, -79, 196, 323, 150, -1, -118, -60, 148, 598, -284, -467, -231, 328, 468, 191, -361, -374, -255, 58, 442, 489, -385, -667, 125, 5, 358, 69, 297, -99, 224, 438, 128, -172, -373, -213, 334, 275, -16, -490]
$$ [...]
8191G0
##END NTUPLES=NMR FID
##END=
