##TITLE=1H_DE-63_35
 D2O
 8 sc, 
 15.8.2024
##JCAMPDX= 6.0         $$ Bruker NMR JCAMP-DX V2.0
##DATA TYPE= NMR FID
##DATA CLASS= NTUPLES
##ORIGIN= UXNMR, Bruker Analytische Messtechnik GmbH
##OWNER= root
$$ XWIN-NMR		Version 3.5
$$ Thu Aug 15 13:42:51 2024 Russian Standard Time (UT+4h)  she@DPX200
##.OBSERVE FREQUENCY= 200.1318
##.OBSERVE NUCLEUS= ^1H
##.DELAY= (6, 6)
##.ACQUISITION MODE= SIMULTANEOUS
##.ACQUISITION SCHEME= undefined
##.AVERAGES= 8
##.DIGITISER RES= 18
##SPECTROMETER/DATA SYSTEM= spect
##.PULSE SEQUENCE= zg30
##.SOLVENT NAME= D2O
##.SHIFT REFERENCE= (INTERNAL, D2O, 0, 15.7039)
##AUDIT TRAIL= $$ (NUMBER, WHEN, WHO, WHERE, WHAT)
$$ ##TITLE= Audit trail, XWIN-NMR		Version 3.5
$$ ##JCAMPDX= 5.01
$$ ##ORIGIN= Bruker BioSpin GmbH
$$ ##OWNER= she
$$ F:/spectra/data/she/nmr/H-F/1/audita.txt
$$ ##AUDIT TRAIL=  $$ (NUMBER, WHEN, WHO, WHERE, WHAT)
(   1,<2024-08-15 13:41:49.35 +0400>,<she>,<DPX200>,
      <created by zg, POWCHK disabled, PULCHK disabled
       configuration hash MD5:
       00 E9 B6 7A A2 85 ED C7 34 08 36 98 17 FE 4E 26
       data hash MD5: 16K
       C6 74 48 67 99 3B AC BC DA FA 19 DB 88 05 C6 1E>)
$$ ##END=
$$ 
$$ hash MD5
$$ BB C9 1A CF 72 90 A9 A2 95 14 88 71 A7 F4 C9 B6
##$RELAX= 
##$RELAX= 
##$RELAX= 
##$RELAX= 
##$RELAX= 
##$RELAX= 
$$ Bruker specific parameters
$$ --------------------------
##$DU= <F:/spectra>
##$EXPNO= 1
##$NAME= <H-F>
##$PROCNO= 1
##$TYPE= <nmr>
##$USER= <she>
##$AMP= (0..31)
100 100 100 100 100 100 100 100 100 100 100 100 100 100 100 100 100 100 
100 100 100 100 100 100 100 100 100 100 100 100 100 100 
##$AQSEQ= 0
##$AQ_mod= 1
##$AUNM= <au_zg>
##$AUTOPOS= <>
##$BF1= 200.13
##$BF2= 200.13
##$BF3= 200.13
##$BF4= 200.13
##$BF5= 200.13
##$BF6= 200.13
##$BF7= 200.13
##$BF8= 200.13
##$BYTORDA= 1
##$CFDGTYP= 0
##$CFRGTYP= 5
##$CHEMSTR= <none>
##$CNST= (0..31)
1 1 145 1 1 1 1 1 1 1 1 1 1 1 1 1 1 1 1 1 1 1 1 1 1 1 1 1 1 1 1 1 
##$CPDPRG= <>
##$CPDPRG1= <>
##$CPDPRG2= <>
##$CPDPRG3= <>
##$CPDPRG4= <mlev>
##$CPDPRG5= <mlev>
##$CPDPRG6= <mlev>
##$CPDPRG7= <mlev>
##$CPDPRG8= <mlev>
##$CPDPRGB= <>
##$CPDPRGT= <>
##$D= (0..31)
0 1.2 0 0 0 0 0 0 0 0.06 0 0.03 0 0 0 0 0.0002 0 0 0 0 0 0 0 0 0 0 0 0 
0 0 0 
##$DATE= 1723714908
##$DBL= (0..7)
120 120 120 120 120 120 120 120 
##$DBP= (0..7)
150 150 150 150 150 150 150 150 
##$DBP07= 0
##$DBPNAM0= <>
##$DBPNAM1= <>
##$DBPNAM2= <>
##$DBPNAM3= <>
##$DBPNAM4= <>
##$DBPNAM5= <>
##$DBPNAM6= <>
##$DBPNAM7= <>
##$DBPOAL= (0..7)
0.5 0.5 0.5 0.5 0.5 0.5 0.5 0.5 
##$DBPOFFS= (0..7)
0 0 0 0 0 0 0 0 
##$DE= 6
##$DECBNUC= <off>
##$DECIM= 24
##$DECNUC= <off>
##$DECSTAT= 4
##$DIGMOD= 1
##$DIGTYP= 9
##$DL= (0..7)
0 120 120 120 120 120 120 120 
##$DP= (0..7)
150 150 150 150 150 150 150 150 
##$DP07= 0
##$DPNAME0= <>
##$DPNAME1= <>
##$DPNAME2= <>
##$DPNAME3= <>
##$DPNAME4= <>
##$DPNAME5= <>
##$DPNAME6= <>
##$DPNAME7= <>
##$DPOAL= (0..7)
0.5 0.5 0.5 0.5 0.5 0.5 0.5 0.5 
##$DPOFFS= (0..7)
0 0 0 0 0 0 0 0 
##$DQDMODE= 0
##$DR= 18
##$DS= 0
##$DSLIST= <SSSSSSSSSSSSSSS>
##$DSPFIRM= 0
$$ [...]
##$SUBNAM2= <"">
##$SUBNAM3= <"">
##$SUBNAM4= <"">
##$SUBNAM5= <"">
##$SUBNAM6= <"">
##$SUBNAM7= <"">
##$SUBNAM8= <"">
##$SUBNAM9= <"">
##$SW= 24.0689170037331
##$SWIBOX= (0..15)
0 0 2 0 0 0 0 0 0 0 0 0 0 0 0 0 
##$SW_h= 4816.95568400771
##$TD= 16384
##$TD0= 1
##$TE= 0
##$TE2= 300
##$TE3= 300
##$TEG= 300
##$TL= (0..7)
0 120 120 120 120 120 120 120 
##$TP= (0..7)
150 150 150 150 150 150 150 150 
##$TP07= 0
##$TPNAME0= <>
##$TPNAME1= <>
##$TPNAME2= <>
##$TPNAME3= <>
##$TPNAME4= <>
##$TPNAME5= <>
##$TPNAME6= <>
##$TPNAME7= <>
##$TPOAL= (0..7)
0.5 0.5 0.5 0.5 0.5 0.5 0.5 0.5 
##$TPOFFS= (0..7)
0 0 0 0 0 0 0 0 
##$TUNHIN= 0
##$TUNHOUT= 0
##$TUNXOUT= 0
##$USERA1= <user>
##$USERA2= <user>
##$USERA3= <user>
##$USERA4= <user>
##$USERA5= <user>
##$V9= 5
##$VALIST= <valist>
##$VCLIST= <CCCCCCCCCCCCCCC>
##$VD= 0
##$VDLIST= <DDDDDDDDDDDDDDD>
##$VPLIST= <PPPPPPPPPPPPPPP>
##$VTLIST= <TTTTTTTTTTTTTTT>
##$WBST= 1024
##$WBSW= 4
##$XGAIN= (0..3)
0 0 0 0 
##$XL= 0
##$YL= 0
##$YMAX_a= 234327
##$YMIN_a= -251356
##$ZGOPTNS= <>
##$ZL1= 120
##$ZL2= 120
##$ZL3= 120
##$ZL4= 120
##$ABSF1= 10
##$ABSF2= 0
##$ABSG= 5
##$ABSL= 3
##$ALPHA= 0
##$AQORDER= 0
##$ASSFAC= 0
##$ASSFACI= 0
##$ASSFACX= 0
##$ASSWID= 0
##$AUNMP= <proc_1d>
##$AZFE= 0.1
##$AZFW= 0.1
##$BCFW= 1
##$BC_mod= 2
##$BYTORDP= 1
##$COROFFS= 0
##$CY= 11.3945322036743
##$DATMOD= 1
##$DC= 2
##$DFILT= <>
##$DTYPP= 0
##$F1P= 15.6554695791079
##$F2P= 12.8336369535428
##$FCOR= 0.5
##$FTSIZE= 0
##$FT_mod= 4
##$GAMMA= 1
##$GB= 0.15
##$INTBC= 1
##$INTSCL= 1
##$ISEN= 128
##$LB= 0.24
##$LEV0= 0
##$LPBIN= 0
##$MAXI= 10000
##$MC2= 0
##$MEAN= 0
##$ME_mod= 0
##$MI= 1.114404
##$NCOEF= 0
##$NC_proc= 0
##$NLEV= 6
##$NOISF1= 3.799351
##$NOISF2= 2.8
##$NSP= 1
##$NTH_PI= 0
##$NZP= 0
##$OFFSET= 15.70392
##$PC= 1
##$PHC0= -25994.33
##$PHC1= 6.387481
##$PH_mod= 1
##$PKNL= yes
##$PPARMOD= 0
##$PSCAL= 0
##$PSIGN= 0
##$REVERSE= no
##$SF= 200.130013532006
##$SI= 16384
##$SIGF1= 3
##$SIGF2= 2
##$SINO= 400
##$SIOLD= 16384
##$SREGLST= <1H.CDCl3>
##$SSB= 0
##$STSI= 0
##$STSR= 0
##$SW_p= 3612.71676300578
##$SYMM= 0
##$S_DEV= 0
##$TDeff= 0
##$TDoff= 0
##$TI= <>
##$TILT= no
##$TM1= 0
##$TM2= 0
##$TOPLEV= 0
##$USERP1= <user>
##$USERP2= <user>
##$USERP3= <user>
##$USERP4= <user>
##$USERP5= <user>
##$WDW= 1
##$XDIM= 8192
##$YMAX_p= 0
##$YMIN_p= 0
$$ End of Bruker specific parameters
$$ ---------------------------------
##NTUPLES= NMR FID
##VAR_NAME=  TIME,          FID/REAL,        FID/IMAG
##SYMBOL=    X,             R,               I
##VAR_TYPE=  INDEPENDENT,   DEPENDENT,       DEPENDENT
##VAR_FORM=  AFFN,          ASDF,            ASDF
##VAR_DIM=   8192,          8192,            8192
##UNITS=     SECONDS,       ARBITRARY UNITS, ARBITRARY UNITS
##FACTOR=    0.0002076,     1,               1
##FIRST=     0,             0,               0
##LAST=      1.7004516,     0,               0
##MIN=       0,             -251356,         0
##MAX=       1.7004516,     234327,          0
$$ Real data points
##PAGE= N=1
##DATA TABLE= (X++(R..R)), XYDATA
0@%%%%%%%%%%qJ6j6J6k4L2l8M6n4O5p7R0j03J22j43J62j86K12k40K74l11L50l95
33b10M44m94N52o18O86p61Q48r40J039j150J272j409J561j729J919k136K385k670
51a411L001l397L879m479N244o259P678r796J3236k5064K35105k1222k63772k0982
65h8239k2907K9835K35904P9734l09370j63519J90236J62198j3793k4069j10850
76c4840j56372R9319K73508r533k31236o9684O0049M9289J34413N1254k22933
87e6766j50429J61811J50889q522l9941j15339j13141J27555J98325l7536j54200
98c7294o7725J1543J01972J29998l9293j78103n9003J09365J05051K1468n2179
109D5800j19755o1386J25122J42541m9480j16939l7019q042O6933J43887k7624
$$ plain form
0 0 0 0 0 0 0 0 0 0 0 0 -8 8 -8 8 -16 16 -22 24 -30 35 -42 48 -55 67 -76 86 -100 112 -128 146 -165 185 -210
33 -210 234 -260 292 -326 360 -401 447 -493 546 -604 668 -741 820 -909 1010 -1126 1259 -1411
51 -1411 1590 -1807 2072 -2407 2837 -3422 4256 -5540 7696 -17368 217737 196515 -67257 -88239
65 -88239 -111146 -81311 154593 234327 -75043 -238562 -48326 113872 100079 76010 -34840
76 -34840 -191212 -91893 181615 172082 -59154 -128838 -68789 -19500 114913 166167 -56766
87 -56766 -207195 -45384 105505 96983 57042 -58297 -171438 -43883 154442 116906 -37294
98 -37294 -105019 -93476 8496 138494 99201 -78902 -137905 -28540 76511 97979 45800
109 45800 -73955 -135341 -10219 132322 82842 -34097 -71116 -79158 -12225 131662 104038
120A04038j91752l3676J14296N0427L2853O14j48283q3676J57938J28920o9959
131F1740q8272l9796k6524Q9266J43767n1547j83315k6542J16403O6044J6262
142G7486k3576j27888o8756J51101J31931q3149j01361j5827j3792P2419J38572
153A37160n5764j84587l999J15873M5518K1460k5185j38030m3096J58929J01424
164A29703q3101r0999k8370M079R2807J06774p5056j62377M114J19113N0281o02
176F6366m0196j14394k5020J55224Q3868j00522q0073k600N098Q1220R2736q7538
188C4169j41193L3076J01001K6788O522m0063j10119j923J42743N6559q8253o7618
200d8311r643J2651Q2399P2264q6108j24573L3809R7971K2760l921l7134r7982
$$ plain form
120 104038 -87714 -121390 -7094 43333 76186 76800 -71483 -155159 2779 131699 61740
131 61740 -26532 -66328 -92852 -3586 140181 88634 -94681 -121223 -4820 61224 77486
142 77486 53910 -73978 -142734 8367 140298 57149 -44212 -60039 -73831 -1412 137160
153 137160 81396 -103191 -107190 8683 54201 75661 50476 -87554 -130650 28279 129703
164 129703 46602 -44397 -72767 -68688 24119 130893 55837 -106540 -102426 16687 66968 66366
176 66366 26170 -88224 -113244 41980 125848 25326 -54747 -57347 -52249 28971 121707 34169
188 34169 -107024 -73948 27053 53841 60363 20300 -89819 -91742 51001 107560 19307 -48311
200 -48311 -57954 -45303 37096 109360 23252 -101321 -67512 30459 53219 49298 12164 -85818
212h5818M126J39178M1338r5831n1165Q46P048Q0371O3029r6612j03565M8216
224d8839P8916J6437L103m4417q9545J9546J22931K7045q1012m7378m812J5301
236c2724P6378M8736r0995r3688M8970P6509J1785j957m3896q3531K8772J21001
248F5360J1009q3890l4315k181J4309P9863L4490r8841p2237N5974O1628R338
260D0507j03m8247p2250L8634J06194J031p6710k7876J134J5039P1712K8591r6166
273a8510o4943O2253N6357Q0L14m4775o9914M4813J03273j1956p4152j8911J302
286c4769J6062O9314J6769r2348n0555N9444M9953mn422m4235n4349M5500Q8446
299F3806j3390o8817j7855M751K0032O1805Q270q7068l9946N7999M2635J575o533
$$ plain form
212 -85818 -81692 57486 98824 2993 -48172 -47326 -40278 40093 103122 6510 -97055 -48839
224 -48839 30077 46514 49617 5200 -84345 -64799 58132 85177 4165 -43213 -48025 -32724
236 -32724 43654 92390 1395 -92293 -43323 33186 44971 43014 -882 -84413 -55641 65360
248 65360 76369 -7521 -41836 -44017 -29708 50155 84645 -14196 -86433 -30459 31169 40507
260 40507 40404 -7843 -80093 -41459 64735 65766 -10944 -38820 -37686 -22647 49065 77656 -18510
273 -18510 -83453 -21200 35157 35237 35551 -9224 -79138 -34325 68948 56992 -17160 -36071 -34769
286 -34769 -18707 50607 67376 -24972 -75527 -16083 33870 33866 28444 -15791 -70140 -24640 63806
299 63806 50416 -18401 -36256 -31505 -11473 50332 58602 -28466 -68412 -10413 32222 33797 27264
312B7264m8309m5815N3782P5128k2097n7191j5269RK6629N9682o431q2468k4466
325e9552N5197L3512K291p508n0346l7459N9663O5825l1077n1642p576j008K5111
338d569N8991j1807q3673j3031N7636K3676j248m033m8717l3248O2579N8131l7123
351B3564m6739j832n6K4332N3063j6611p8116o372N6347J9831m037o124m5247
364b7997k6526O1261N0650l9022m2091k74J637K4809M7402k1890p0875M04N2201
377I689J5901l271q555m4333j7549O0813L9962l9609l6398N01K361K7788M1558
390D8858k8212o4167P470M8040J1988k980j0244m3178j0830O1128L1187m1457
402G603k9966J720K049K9122L6430l3307n8110J4252M4894O993k616j1337m1655
$$ plain form
312 27264 -21045 -66860 -13078 62050 39953 -17238 -32507 -32498 -5869 53813 47382 -35086 -59552
325 -59552 -4355 29157 31448 23940 -26406 -63865 -4202 61623 30546 -21096 -28672 -29680 -4569
338 -4569 54422 42615 -41058 -54089 3547 27223 25975 21942 -26775 -60023 2556 60687 23564
351 23564 -23175 -25007 -25063 -731 52332 35721 -42395 -48767 7580 27411 23374 17250 -27997
364 -27997 -54523 6738 57388 18366 -23725 -23999 -22362 2447 49849 27959 -42916 -42512 9689
377 9689 25590 22319 13764 -30569 -48118 12695 52657 13048 -23350 -22849 -20488 7300 48858
390 48858 20646 -43521 -36051 11989 23977 20997 10753 -32425 -43255 17873 49060 7603
402 7603 -22363 -20643 -18594 10528 46958 13651 -44459 -30207 14687 21680 19064 7727 -33928
415c3928m156O0336K3099m3165k4805M349K167K8443L2238l5968n2586J9613M1561
428A7198K792l167j1298l8840J65N8414J5696m2723k0356O300K780K7359K6437
441D0757l7887m5568K2859L7530P61l672j3134l4532N906N2978J0282m0266j6893
454b0879N649M483K6889K0947l8347l8135K4422L3026q34l874j4560l0940J1265
467b0888M9185L295l7896j2748M826N543K7622J4812l9820l0576K6232K7111o66
480A6032l305j6574k7852J5045M5281j958l5098r013M298N919K7300J0145m0557
493a0337k4866K9392K2720l914j541j6631k6443K0213M1755q775l1826m316K375
506a2194O487K7419N221l9874j8592K8960J8665m001j839j7230k2957K1764L8379
$$ plain form
415 -33928 -38084 22252 45351 2186 -22619 -18270 -16103 12340 44578 8610 -43976 -24363 17198
428 17198 19990 16823 5525 -33315 -33150 25264 40960 -1763 -22119 -15819 -13039 14320 40757
441 40757 2870 -42698 -19839 17691 18452 14780 1646 -32886 -26980 25998 36280 -3986 -20879
454 -20879 -15230 -10747 16142 37089 -1258 -39393 -14971 18055 17221 13347 -1213 -32153 -20888
467 -20888 28297 31592 -6304 -19052 -14226 -8683 18939 33751 -6069 -36645 -10413 16698 16032
480 16032 12727 -3847 -31699 -16654 28627 26669 -8429 -17442 -13144 -7225 20075 30220 -10337
493 -10337 -35203 -5811 16909 12995 11454 -5177 -31620 -11407 30348 21573 -10253 -14569 -12194
506 -12194 -5707 21712 26933 -12941 -31533 -2573 16092 12091 10252 -6978 -29935 -8171 30208
519C0208j1230l1712j124M438M770K5839K939m0659j3362L1316J4259n592o27
532I463j7896k0271K5032L2864j5114k6460k45K857P681K3581k057l6061r648
545b6274K8586J3304o005k772j5944j7177K4740L0550j7024k5947K135L565P243
558a020K3269n241l7119l236K9139P813m989k328j8804j1018K6879K2678j8076
571G947k0700J684M029Q937J8587p847l1777j047K6660O836o609j504j6592j1132
585b2528K7731K0915k1658j7334M718Q48R213K0503j2937l1290N342K4737L263
598A1523l769m249j7451m410K6770J4537k0258j5887M965L519P966J5926j1392
611G790k8693N630K5210M97n814q48j6586n412K8142J2593k2851j1720N424N44
$$ plain form
519 30208 18978 -12734 -13858 -9420 -4650 21189 24128 -16531 -29893 1423 15682 10090 9463
532 9463 -8433 -28704 -3672 29192 14078 -12382 -12627 -9770 -2089 21492 19435 -16626 -26274
545 -26274 2312 15616 9611 6839 -9105 -26282 -1542 29008 11984 -13963 -11828 -8263 -1020
558 -1020 22249 17008 -20111 -23347 5792 13605 8616 6288 -12516 -23534 3345 26023 7947
571 7947 -12753 -11069 -7040 1897 20484 12637 -19140 -20187 6473 13309 6700 5196 -11396 -22528
585 -22528 5203 26118 4460 -12874 -8156 -7308 1905 22408 9471 -21819 -16477 8260 11523
598 11523 7754 3505 -13946 -18356 8414 22951 2693 -13194 -8229 -4710 3256 19182 7790
611 7790 -20903 -15273 9937 10434 4620 3772 -12814 -18226 9916 22509 -342 -12062 -6638 -6094
625f094J0710J5236j6092k4540R071K0597K060m627o251j4037K70K4546Q953k0901
639a099j1844O788L709P910J1505j5350k1453J1439J8771k497l263l385j5838
652a4607K673K5454K269j9620n161K575J679J3218Q358j9059j5852J2514J4288
665H729r46k339o563j3534N260K3646O41k0396m583O291O51J0418Q487j9621j5566
680a9425J7630J2241o703P46l840j5564O671K3522l770j7789r11L192k32J2749
694H517O368j9233j2985J4567J2845m535k224m183j2957O346K2650k285k0735
707g844j243O666J56J0258N936k0294j1549J8529R876o871q47m907j1377R458
721d053J8841o547j5221r3L586K432R717J857j6981q710J5061R914m835l186n120
$$ plain form
625 -6094 4616 19852 3760 -20780 -11709 8888 10948 6321 70 -13967 -13697 10849 19802 -1099
639 -1099 -12943 -6155 -2446 5464 16969 1619 -19834 -8395 10376 7879 4616 1231 -14607
652 -14607 -11934 13520 15789 -3831 -8992 -6417 -4738 8480 16838 -2221 -18073 -5559 8729
665 8729 7783 5444 -1119 -14653 -9393 14253 14894 -5502 -10085 -3794 -3143 7275 15762 -3859 -19425
680 -19425 -1795 10446 3743 4489 649 -14915 -8244 15278 11508 -6281 -7192 -4000 -4232 8517
694 8517 14885 -4348 -17333 -2766 10079 5544 3320 -863 -13820 -7474 15176 12891 -7844
707 -7844 -9087 -2421 -2265 7993 13929 -6365 -17914 615 10491 3620 2773 -2134 -13511 -4053
721 -4053 14788 8241 -6980 -7073 -3487 -1055 8662 10519 -6462 -15172 -111 9803 4968 1782 -3338
736c338r184R387J8729p294j6964J612N025J361J0749J15k0172l641J7141M890
750H416n205j145p063o698J2989J2483r660j1526J930L467K681P944j123j5873
764h383l288J4686N137n592j271m829q154J2099J4470j1282j2474M860J761J990
778b70J0775m303j7629J682J4954J243l886p94p710m030J3076R244j0565r367
792g580L600K820J872P714l243j4959N08J4394J176n213J599p280o227J4085J0169
807A3435j3319p856N156q9L723R460o910j5006M536J2434j86l528j333o931j482
822g896J2609O750j1769p657N215K165J916P298n337j4499M856J3574k542m373
836C10J143p299k560J4237M991j2744m546M350%M887O584q364j1670N968J0655
$$ plain form
736 -3338 -12522 -3135 15594 8300 -8664 -7052 -2027 -666 10083 10198 -9974 -13615 3526 8416
750 8416 3211 2066 -4997 -11695 1294 13777 4117 -7409 -5479 -2012 669 8613 7490 -8383
764 -8383 -11671 3015 8152 2560 1289 -3540 -11694 405 14875 3593 -8881 -4021 -2260 -270
778 -270 10505 6202 -11427 -9745 5209 6452 2566 1772 -5938 -9968 3108 12352 1787 -7580
792 -7580 -3980 -1160 712 8426 5183 -9776 -9268 5126 6302 1089 2688 -4592 -10819 3266 13435
807 13435 116 -7740 -2584 -2673 1050 10510 3600 -11406 -6870 5564 5378 1850 517 -6414 -7896
822 -7896 4713 11463 -306 -7963 -2748 -583 1333 8631 3294 -11205 -6349 7225 4683 310
836 310 1453 -5846 -8406 5831 10822 -1922 -6468 -2118 -2118 2769 9353 989 -10681 -4713 5942
851E942q66m048j367n574j85J2104L683j1809m894N691P15K580O414p978j1424
866a1016P806J0037m213j915R5p388J389J2474N44j1067j665L677p5M494M449
881G626q766q628P484Q499l228k107j161o518K023J2297j83j1888r90N131p00
896a109M179M770r986p720R713O514m319j247q54o696L477J1476k494j0150K42
911d204L687l26M280L408r696o380Q992O715m677j489k78o511L486J1295k711
926E591j1106J364M347p74L796K660r519m873R455N005m416j101j202n106M218
941a661R408l666q931J147L079L21M284J171r290l534Q884M157m139q30j672m727
957e999N504Q316m781q107K312K326k9M768M60r799j557Q931K197l751j46k161
$$ plain form
851 5942 5076 1028 -339 -5913 -6098 6006 9689 -2120 -7014 -1323 -608 1972 8386 408 -11016
866 -11016 -3210 6827 2614 699 794 -6594 -5205 7269 7813 -3254 -4919 -1242 -1317 3177 7626
881 7626 -1140 -9768 -2284 6215 2987 880 -281 -6799 -4776 7521 7338 -4550 -5540 -409 -1109
896 -1109 3070 7840 -2146 -9866 -153 6361 2042 795 -59 -6755 -3278 8198 5704 -4446 -4204
911 -4204 -517 -843 3437 6845 -2851 -9231 -239 6476 1799 310 32 -6479 -2993 8302 5591
926 5591 -5515 -4151 196 -578 3218 5878 -3641 -8514 941 5946 1530 429 -773 -5879 -1661
941 -1661 7747 4081 -4850 -3703 -624 -303 3981 5152 -4138 -7672 1212 5369 1230 400 -1272 -5999
957 -5999 -495 7821 3040 -5067 -2755 -429 -458 4310 4770 -5029 -6586 2345 4542 791 645 -1516
973a516m536O380P243n590p015L079J523J16M892p93r236j93Q487J544m403M91
989D73k289l932O744O127n946o237L529J698o05M548p38q939N88Q419k6l282P00
1006H32k645l054O178N788o741m834L031J733r8M391j686q252R28Q029o23l052
1022g5O36k900k501O734M678p144l703L675J14L23M822l141p389K439P405j685
1038B288k480J056l157k344P167L435o840l265L951l89N17M746k723p749K684
1053c103P268j872k668J434l456k041P500L012p417k998L952K37L55M200l654
1068G49o610L542O460k211k180N69l216o47O897J587o786j882L314N51J031K764
1084C932l551o156M242N558k301k140N45l105N76O239L33o729q47L388P5J067
$$ plain form
973 -1516 -6052 328 7571 1981 -5034 -1955 -432 -316 4576 3783 -5453 -5646 2841 4385 -18 473
989 473 -1816 -5748 996 7123 1177 -5060 -1531 167 -438 4110 3372 -5567 -4979 3440 3414 132 832
1006 832 -1813 -4867 1311 7099 358 -4476 -1445 288 190 4581 2895 -5357 -4429 3600 2977 -75
1022 -75 561 -2339 -4840 1894 6572 -572 -4275 -600 -486 -163 4659 1518 -5871 -3432 3973 2288
1038 2288 -192 864 -2293 -4637 2530 5965 -875 -4140 -189 -578 -61 4685 1962 -5787 -3103
1053 -3103 4165 2293 -375 1059 -2397 -4438 3062 6074 -1343 -4341 -389 -152 203 4403 749
1068 749 -5861 -2319 4141 1930 -250 319 -2897 -3544 3353 4940 -1846 -3728 -414 137 1168 3932
1084 3932 381 -5775 -1533 4025 1724 -416 129 -2976 -2400 3839 4172 -2557 -3404 -16 59 1126
1100A126K678m362m660M646M399k432j699L53k826K39O468l41o271P9L107o55
1116a51J314K458m668l536M466L716l511l0L87l315P29O313j249n556P07K505
1132E79j031J328K380m409l724M931L307l015l42j40k696J039N631j115n418R76
1148a719K373j474K177J916m844k397M794K089k440kl92k823J484N398k040m670
1164b570Q52J859o90K490J115n047k104N055J834k843K80l25l206K795M628k437
1180A686m338J173K076j076K600O79n590o99M928J276k757J67l70k722K887M106
1196D026k947m078K061J191l38J872M19m894n08N265J51k954J077o60k185K684
1212A82L861l724l404K711Q49j149K647j42m663J84M404K35k587M48l55j923K616
$$ plain form
1100 1126 3804 -558 -5218 -572 3827 1395 -304 49 -2777 -2538 3930 3589 -2682 -2603 504 -151
1116 -151 1163 3621 -1047 -4583 -117 3599 88 58 445 -2870 -2141 4172 2923 -2633 -1926 579
1132 579 -452 876 3256 -1153 -4877 54 3361 346 4 -136 -2832 -1793 3838 2723 -2695 -1719
1148 -1719 654 -820 1357 3273 -1571 -3968 826 2915 475 473 81 -2742 -1258 4140 2100 -2570
1164 -2570 -1718 141 -549 1941 3056 -1991 -4095 960 2794 -49 231 -94 -3300 -505 4123 1686
1180 1686 -2652 -1479 597 -479 2121 2800 -2790 -3489 1439 2715 -42 125 -245 -2967 -80 4026
1196 4026 1079 -2999 -938 253 -85 1787 2206 -2688 -3196 2069 2220 -734 343 -317 -2502 182
1212 182 4043 319 -3085 -374 475 -674 1973 1831 -2832 -2648 1756 1991 -596 -148 -503 -2426 190
1229A90L511l280l429K696R05j051K267j70m959R74M577p74j812J175j461k050
1245b691L767K346l819k084K615q8l13K229j113l707Q21M064p06j635Q49j472
1261i37j239L107K454l660k145K389K97n12K329j000m282J550M009j352j270R55
1277F93k011p99L767J019l643p89J950k18K46J983j504l180J402L082j034j567
1293f03Q70j114r54L416J057l661p61K036n58k2K589k158l208K528K913k059n25
1310b14N15j849l3L609K76l473l31J805j81J32J536j749k376J773K591j631j071
1327f71J343j905j39L607J0l757J06K529j370K38K318k747k029K579J629j298
1343D43j46J72j534l04L296k53k914l73K022m02Q9J664j990k048K243J937j998
$$ plain form
1229 190 3701 421 -3008 -312 593 -458 1809 1639 -3320 -2346 2231 1457 -355 820 -641 -2691
1245 -2691 1076 3422 -397 -2481 134 46 -267 1962 849 -2858 -2037 2027 1321 -314 535 -937
1261 -937 -2176 931 3385 -275 -2420 -31 266 -246 2083 1083 -3199 -1649 2360 1008 -262 693
1277 693 -1318 -2117 1650 2669 -974 -1763 187 -31 215 2198 694 -2486 -1084 1998 964 -603
1293 -603 267 -847 -1801 1615 2672 -989 -1750 286 -272 -294 2295 137 -3071 -543 2370 311 -214
1310 -214 301 -1548 -1581 2028 2304 -1169 -1500 305 124 256 1792 43 -2333 -560 2031 400 -671
1327 -671 672 -1233 -1372 2235 2245 -1512 -1406 1123 -247 -9 2309 -438 -2467 112 1741 443
1343 443 297 469 -1065 -1369 1927 1674 -1240 -1613 409 7 96 1760 -230 -2278 -35 1902 -96
1360i6o11J221j808N29K795q60k916Q32J717j555Q31J940k849j345K755O65j208
1377C7L9j32j178L70K579m89l152J114J190m63K55J397k394j101K470J064k102
1394d96M66N04j954J146K312j863j778J559M97p10J565J80k341p54K085P68j272
1411h6L88k15j407O77K542r16k346J103O42r00J127J171k816q13K842K49j691
1428d49N34r7j530J264K292j874j304J157J23m10R59K57k127j25K143J32j231
1445b86P7M98j562J192K030j378j820J006L19n68J379M2k344O8K374l46j007O92
1463C66o13j103J766J201j777p41J040p9k20J013n2j905L34J708j92j248Q23m82
1481a61j011J797P59j788p69J282J11m81R39K11k036M89J905j174l37Q89r42q23
$$ plain form
1360 -96 -707 514 -1294 -765 2030 1170 -1746 -914 803 -752 79 2019 -830 -2175 580 1245 37
1377 37 76 -56 -1234 -864 1715 1226 -1926 -812 378 -85 170 1567 -827 -1928 542 1606 -496
1394 -496 -30 474 -1480 -334 1978 115 -1663 -104 393 -317 1248 1428 -913 -1667 418 1186 -86
1411 -86 302 87 -1320 -643 1899 983 -1363 -260 382 -518 609 1780 -1036 -1849 993 1242 -449
1428 -449 85 -12 -1542 -278 2014 140 -1164 -7 116 -294 665 922 -1205 -1330 813 945 -286
1445 -286 -209 289 -1273 -81 1949 571 -1249 -243 76 -492 887 929 -1415 -1347 1027 681 -326 366
1463 366 -247 -1350 416 1617 -160 -901 139 60 -160 853 801 -1104 -770 938 746 -502 321 -161
1481 -161 -1172 625 1384 -404 -1173 109 220 -261 678 889 -1147 -658 1247 73 -264 625 -317 -1140
1499a140J826Q43k096j39O40L72n81J338m33j678L84J910q21r19Q33p31p44J680
1517E44P72j943j08J147m76j47J376q06j697J200J242j031j84M67q45n43J722
1534F90M10j748N5P43j74lR98o02j480P98J538j146m25J043r95q48K004M16k026
1553g52J74J312r70J66J118j023j256J095J061j079n6O99j339n1J488J86j512
1570g39N7R13l53j92J126j013j121J449Q18j065K00O93j164r1J135Q6j495M45
1588c11J36l12Q00O31p89j260R33R16p96K8K82r66j09J518k52j019N71K20m51
1607b30L18Q61j149q38R67N92n21J18M94j366K53J340o23q46M06K48l69M52N60
1626F67p49r24J202J83n24L21lr19L46J060j95j049L99K56m90P67K41q12p14Q51
$$ plain form
1499 -1140 686 1529 -567 -706 -66 306 -275 1063 630 -1048 -664 1246 425 -494 339 -392 -1136 544
1517 544 1316 -627 -735 412 -64 -211 1165 359 -1338 -138 1104 73 -111 356 -489 -1032 690
1534 690 1100 -648 -593 150 -24 -27 971 369 -1111 -313 1225 79 -346 697 -298 -1146 858 1274 -752
1553 -752 -578 734 -236 -70 1048 25 -1231 -136 925 -154 -210 489 -850 -901 587 773 -739
1570 -739 -682 231 -122 -314 812 -201 -1322 127 945 -120 80 773 -391 -482 653 739 -756 -311
1588 -311 -175 -487 313 944 155 -1105 -172 744 -52 -24 258 -708 -817 701 449 -570 1 221 -230
1607 -230 88 949 -200 -1038 -71 521 0 118 612 -754 -501 839 216 -630 -224 24 -345 107 667
1626 667 -82 -1006 196 379 -145 176 173 -746 -400 660 465 -584 -185 71 -419 348 589 -223 -937 -86
1646h6O50q05M55p0q10J47J479q89n74L33L42m87N01O31j108o20J162K45l21L71
1666E46k60q24L51J111m72r57M99k16l26Q98L36j459J95R12k73k75O85l61q31
1685g21L15J191p76n19O36j63l15Q05J26j302L25P48k45j17M81l89p65N73J124
1704A012j137n36Q28n52j97J033pj040K65P86l53m44J088p33n86N00J024r88l71
1723d08N57p8k98O16R2j074K05N74M2m03M05m94n51J042N97q33n26Q54n57k95
1743e33R51r9j005K21P20k34J44J49j48m78M23M40q33J20L00k50m7P68m63p31
1763e85L58P04l88M6L87m95o33P99J59p39L69L38o02j47R02p3r63K14P28m08j05
1784a34N06p91n9R80k9p94K92J00n44M51N18m40q56N29K98Pj0M02o69J59K88n1
$$ plain form
1646 -86 564 -241 214 144 -666 -519 960 71 -503 -170 172 -315 186 817 -291 -911 251 496 175 546
1666 546 286 -538 -187 924 452 -505 -6 -222 -548 350 686 -773 -578 334 61 -214 471 110 -721
1685 -721 -406 785 9 -510 126 -37 -352 453 579 -723 -398 350 105 -12 469 80 -685 -112 1012
1704 1012 -125 -661 167 -385 -582 451 444 -596 -331 455 102 -342 746 13 -573 -73 951 -37 -408
1723 -408 149 71 -227 389 481 -593 -388 186 228 -175 230 -264 -815 227 824 -9 -535 319 -238 -533
1743 -533 418 319 -686 -465 255 21 165 314 166 -312 111 551 -282 -162 138 -112 -159 609 146 -585
1763 -585 -227 477 89 135 522 27 -606 193 352 -387 -18 320 -282 -429 473 400 -563 -349 379 -29 -134
1784 -134 372 -419 -478 502 473 -321 -29 71 -473 -22 496 56 -800 -271 27 34 24 426 -243 -84 204 153
1806A53m96M56l20o2n9N30j66m75L11L26j18j21M92o55m05Q59J19o87L46k7k87
1827b86N87M4k94m44M16K23m22M03O6o18O5Q35j52m36j03j33J6K27L56p13J33
1848b30Q4n1J85J79n5p43L25Q04m42n19J64J22J89j95P65o91l37N08Q5l54L64
1869A57r8o16K79N74r1k25l36K36o02P87M78n45k98P41r3l40L32j21q55N77M28
1890C69j0n10j6Q4m46O85L55n80j34L05j50J44M22k00p52L48O06j94p55P24r9
1911A96m16N74K06q55k01N19n4k60Q44n93m32M09M86l27l41J72n8j45M24J8m22
1932b56q5L07J47j54K53l20l37J53P33k67l37M15n07p8M47J92m93j43M59Jj87
1953e7L21l61j54L09O0r8l04K74k87P0M83j05o00L93L31j91K68k98m6m39K55N93
$$ plain form
1806 153 -343 113 -207 -269 -328 202 36 -439 -128 198 80 -41 451 -204 -609 250 369 -318 28 1 -286
1827 -286 301 345 51 -393 23 246 -176 227 293 -325 -260 575 423 -13 -116 -249 -233 -6 350 -363 -230
1848 -230 -146 -197 -12 167 112 -631 -306 498 56 -463 -299 -177 12 -183 582 -109 -446 62 147 -207 157
1869 157 59 -557 -278 296 205 -20 -356 -120 -722 65 543 -2 -300 441 348 8 340 219 -636 -59 369
1890 369 359 -151 -167 -83 -529 156 511 -69 -203 102 -48 96 518 318 -434 -86 520 326 -429 295 196
1911 196 -220 354 560 -295 -496 23 -31 -291 553 -40 -472 -63 423 96 -245 -73 -131 -276 148 166 -256
1932 -256 -341 -34 113 -41 212 -108 -445 -292 441 174 -163 252 -255 -333 114 306 -187 -330 129 130 -57
1953 -57 264 -97 -251 58 118 20 -284 -10 -297 -227 256 151 -449 -56 275 84 352 54 8 -431 -176 417
1975D17n66k49N20k21o6J47L74n59J94j36K17M7J36l34m24N54K33k77P1j81j06
1996b09K19N82n57j79j11N31J6l84j12j41j00P22O8j17K1k61J9l23N18j04k23
2017a25L4K66l05K86J53m33k78O63j84k12j67O09m47j02O09k83l84k67O23n0n2
2038d6L91n96k82M62K07l01K96k87o3J02O06o43M9J89OO2J85r4p28L29J28N52
2060E24m31j54J06j36O6L83n15k23K14O23n35M6M10p63J40M58M2q3j05R7l11J49
2082BJ88p6k01J95J9r0K57k82k43j46P77l08P6r6J24m51K05L65m07j46K5M08l57
2105a62N03j73l15j45O78j97l15J42k55n4K48L41l90R1j3l08L45J52l9j65o6R1
2127fM9l86M12j95R2J46J46j02l27J89K62m15M05k38m74L41K10j45k75K52k16
$$ plain form
1975 417 -149 -398 122 -99 -165 -18 356 -203 -9 -145 72 119 255 -79 -503 51 284 7 78 -103 -209
1996 -209 10 592 35 -144 -255 276 292 -92 -204 -345 -445 277 345 228 249 -12 7 -316 202 98 -125
2017 -125 -91 175 -130 156 309 -124 -402 261 77 -135 -302 307 -140 -242 367 84 -300 -567 56 6 -46
2038 -46 345 -251 -533 -71 136 -165 131 -156 -219 -117 489 -154 -105 84 90 152 337 243 -485 -156 -28 524
2060 524 93 -61 45 -91 -25 358 -157 -380 -166 457 -78 -32 378 -385 -245 213 255 172 67 164 -147 2
2082 2 190 114 -87 108 127 37 294 12 -231 -377 400 92 168 72 196 -255 -50 315 -92 -238 -213 195 -162
2105 -162 341 168 -147 -292 386 189 -126 16 -239 -293 -45 296 -94 -3 -16 -324 21 173 134 -31 -97 -6
2127 -6 43 -343 69 -126 -34 112 258 156 -171 18 280 -135 270 32 -442 -101 109 -36 -311 -59 -275
2148b75J86K76j89k34k19L04N9M0L24l61k09K03M21n1m79L23n2k75K46L52p39
2169c49o8O18k03jL02k97m75M44L07j62j94N4k38M7P48k52l57j52J46J19K70n6
2191B51j96m31N98L41k22p14M60j16k26M45j06m16J74J50L9j79M22n95j51Q28
2211C56k80qk50K11l13K18N62r7l43l05L37j3Q8L93o24l62L26K12n5j74j07N8
2233a70j11N73j87m46K06M52o3n12N64n26k80P33K41m73J08p5k03J1N65l14k02
2254a09l07M85j67%L71m24l40N66O21n85k55K00K4m52N72q3o07L44K66r8J63N7
2276B42k64j05K10M80o03P0j05j13K23r8L32k64l24L10R2q7L68n37k7L22p7j26
2298h1j01L02n2k23L04j01j44P0Q8j10p3K10n9l23Q78m07j10k00O9p1n6K32M96
$$ plain form
2148 -275 -89 187 -2 -236 -455 -151 -92 -52 272 -89 -298 -95 326 275 -204 119 67 -208 38 390 -349
2169 -349 -417 201 -2 -3 299 2 -473 -29 278 116 -78 -24 -262 -215 533 281 -76 -228 -82 37 307 251
2191 251 55 -376 222 563 341 -373 87 -29 -255 190 84 -332 -158 -8 31 -148 274 -321 -472 356
2211 356 76 68 -182 29 -284 -66 496 399 56 -249 88 75 163 556 -68 -430 -104 108 53 -121 -228 -170
2233 -170 -281 292 105 -341 -135 317 254 -258 306 -220 -500 233 474 1 109 34 -169 -158 407 93 -109
2254 -109 -416 69 -98 -98 273 -151 -491 75 696 111 -144 56 80 -372 200 117 -490 -146 120 22 185 242
2276 242 -22 -127 83 563 -40 30 -75 -188 35 -63 269 5 -319 -9 83 -4 364 -173 -200 122 45 -81
2298 -81 -182 120 68 -155 149 48 -96 -26 62 -48 -121 89 30 -293 585 178 68 -132 -63 -134 -190 42 538
2321E38p49M5M44p8j9l41l26L26L83o5k72o6j46J76M37k66n9k62J66K63k81L83
2343B31l36J55l38K99L33o56K53K86j30o9K08k37n78M45K61k8N4k23j55Q0M54
2364C09o8j21k52J12K4N7Qn0j50j25N37l74Q7o2m94P90Kr9ol24L54n19K46P3J0
2389c5j45qL75Kj33n6O7k44O57k62l24J18o8J35J0J24m46J7K83J82j38j37L09
2412B83n73Q3M09j23j79j69M9M25k86L08n04j45M63L41j31l71L0k03L82q9r2j13
2434b05l73L95N8K12J6q5k26P0K44J3j64J07l10ON44l75K5lP3J53n2K13q42M34
2458g2L06J20m98L98l35j86L34l1m21K91j66R6L89l45N8j99K63M4J79k32N2r0
2480d5J47J60j4k14p0p7M1N2J08L69q71K43K20J84n04ML10k24j54P82n88J48J84
$$ plain form
2321 538 -211 -166 278 200 181 -160 -486 -160 223 158 -114 -180 -326 -150 287 21 -38 -300 -134 129 -152 231
2343 231 -105 50 -288 11 344 -312 -59 227 97 28 236 -1 -579 -134 127 99 153 -70 -225 -145 309
2364 309 241 120 -132 -20 4 61 69 19 -131 -256 281 -93 -6 -68 -562 228 230 131 125 -199 155 -364 -118 -45 -35
2389 -35 -180 -188 187 189 56 0 67 -177 480 218 -106 12 -56 79 89 213 -233 -216 67 249 111 -26 283
2412 283 -290 -207 202 79 -100 -269 -220 205 -81 227 -277 -422 41 382 251 -120 -90 -293 89 0 -92 -205
2434 -205 -578 -183 -125 87 103 18 -208 -138 106 119 -45 62 -248 -242 302 -73 -48 -51 22 175 123 336 -506 -72
2458 -72 234 354 -144 254 -81 -267 67 36 -385 -94 -260 -164 225 -120 -62 -261 2 46 225 -7 45 -45
2480 -45 102 262 248 34 -36 -113 -72 -20 88 457 -414 -171 49 233 -271 -267 43 -181 -335 447 -141 7 191
2503A91k05j60J57M67m85j46rM91j95m4n32L39J35L6j02J51q7j5n1L30l61J8j0
2526h7k39K43mL4p9M0J70p7J4m1k47N37m48L94j30k46j36J78J19k16K34j15m1
2549a43L71N6l57LM0l92O38K8k09k65j09N93l14K90k88j22K26R0j35p3j88M23
2571A63l28J55J27O2p56L16K73K62m36nP3k4L02l62P7k60N4J91J71j1j21l51M18
2594a0J13l03O8oL54j58K29l22k24J58K06K13j11l37J87m63J89N55l22p8j97K02
2616e7M5L7P0j29j9j00J95l44M34o5l63M49k91O13k10l07P5J80m6l20J83L9KR
2640H0k41N01l51m71N01J87k07K75l89J96j40L66l53j38K21J11o0nkk75j00K92
2662bL81o3m85K95q6J56k2k76J05Q3l3L31m97Q0q4j15N8K89R8m2l43J04j95M63
$$ plain form
2503 191 -14 -174 -17 450 -35 -181 -190 301 106 62 -470 -131 4 40 -62 89 2 -13 -64 266 -95 -77 -87
2526 -87 -326 -83 -87 -53 -132 -92 78 1 15 -26 -273 264 -184 210 80 -166 -302 -124 -5 -221 13 -102 -143
2549 -143 228 284 -73 -70 -30 -422 216 244 35 -230 -339 254 -60 230 -58 -180 46 136 1 -72 -260 163
2571 163 -165 -10 117 179 -577 -261 12 274 -162 -167 -94 -118 184 -178 -101 -361 -307 -116 55 44 -77 -428 -10
2594 -10 103 -200 -132 -138 216 58 287 -35 -259 -101 105 318 207 -130 57 -406 -217 338 16 -62 -259 -57
2616 -57 -12 25 95 -34 -53 -153 42 -302 132 67 -296 153 -138 475 265 -42 33 213 167 -153 30 69 71 80
2640 80 -161 340 -11 -482 19 206 -1 274 -115 81 -59 307 -46 -184 37 148 88 83 81 -194 -294 -2
2662 -2 379 316 -169 126 40 196 174 -102 3 86 53 384 -113 -33 -117 -232 -174 115 213 171 -172 -68 -263 200
2686B00k49j40J27P1M6O7J50k52k85R4M80k60j76K15j81m1L0K41k05l08L53r0
2708a13L31k10l68L42K04K45o74J21K24j1n0J85p0k12RJ17J12J07j41l62K81l1
2730C6l9J47N4j46k84P5L52k43k59L32o7J08Q3J98m07N0j15J27J14r4j83k54M10
2753eL39m38k09j26N39n2k36K52j92J79om4M7M9J03k28M1J05j58l5J4p0K52r6
2777B5R9l07j6R3N86k70n39L79j05L07J35n63L2J89j69K59J69J11o41J66R2j2
2799B0J4K74j96K4k56L26k72j72J5J45L76j45j09J9l76M99l28K6L9m1P3O9K50
2822B74n70j26N28J98m4k89jk82J25M03M0j53j05J46k41K46J04m73J76J77j02
2843C1L01k09j42J26k71K99j90J98k11n5J17K39j51Oj70N5Q7o7J01j77R0rq9k21
$$ plain form
2686 200 -49 -189 -62 9 55 122 272 20 -265 -171 309 49 -127 88 -93 -134 -104 137 -68 -376 -23 -113
2708 -113 218 8 -360 -18 186 431 -243 -122 102 91 41 226 156 -56 -47 70 182 289 148 -214 67 36
2730 36 -3 144 198 52 -232 -157 195 -48 -307 25 -42 66 149 347 -60 -10 -125 2 116 22 -161 -415 -5
2753 -5 334 -104 -313 -439 100 48 -188 64 -128 51 45 1 48 97 200 -28 13 118 -40 -75 -61 -131 121 25
2777 25 124 -183 -199 -106 480 210 -329 50 -55 252 387 -176 -144 45 -124 135 304 415 -226 -60 32 20
2799 20 34 308 112 136 -120 206 -66 -238 -223 -78 298 153 44 63 -313 186 -142 -116 -77 -118 -45 24 274
2822 274 -296 -422 106 304 260 -29 -30 -312 -187 216 256 103 -2 144 -97 149 253 -220 -44 133 31
2843 31 332 123 -19 107 -164 135 -55 143 -68 -123 -6 233 82 88 -82 -27 60 -7 94 -83 7 -2 -91 -312
2867c12L77l13j03K15K70L53o29K7K03R1k01k3j22J52J82J04j80L3L9o5n08K56
2889a54N34l71K1K64n16L11p8R8k32K89j35j34J32j74K38j22r2O5L2Q3P9o3%J43
2913B18k49O2K80j2j90p6J34k60J85L8l87J70j42L23K9j28L03l61j76J71J12o4
2935b0j48M22m07J75K17j96J2j62K37m7q4K15j37k35J51k3j24K11l86J97M1Q5
2957fL27k16P7j57r4K91j63j65%K46J80l11o6%p9K03L30o64J19L24k24J8L67l46
2981ij54N0J1M35k53R5j67J0J18q4j41k77K25jkj0J49j34K96mjJ54o56L84k89
3006b55K35J07j77p8J26M8j63p7J36j25K28J27l91J95k9j7m4m5N79n86J80m6L80
3029C08k47k6O5l05J72m7k5mn0j07L29j7N1l11n1N03j5j88q0Pj89J63R3J12l96
$$ plain form
2867 -312 65 -248 -351 -136 134 487 -142 -115 88 179 -22 -45 -167 -15 167 271 91 124 163 98 -410 -154
2889 -154 380 9 30 294 -222 89 11 109 -123 166 31 -103 29 -145 93 -29 -121 -56 -24 59 138 75 75 218
2913 218 -31 31 311 299 109 33 167 -93 92 130 -257 -87 -229 94 123 -5 298 -63 -239 -68 44 -20
2935 -20 -168 254 -153 22 239 43 55 -107 130 83 -1 214 77 -158 -7 -30 -154 57 -329 -132 -91 -6
2957 -6 321 105 182 25 -69 222 59 -106 -106 140 320 9 -57 -57 -136 67 397 -267 -148 176 -48 -30 337 -9
2981 -9 -163 -113 -102 333 80 175 8 18 136 52 -89 -366 -141 -142 -144 -154 -5 -139 157 153 152 306 -350 34 -255
3006 -255 -20 87 -90 -168 -42 6 -157 -234 -98 -223 5 132 -259 -64 -93 -110 -154 -199 380 -206 -26 -72 308
3029 308 61 35 100 -205 -33 -80 -105 -109 -159 -266 63 46 97 -214 -265 238 223 35 -45 -38 -227 -64 29 141 -255
3054b55K46K17l05K14K12j20l63N64m89R2J05j49P5o1L1j20rP5QN3K05k64j04
3077a42j51K9L28J35o7N6k23j45K44j63j31L33k05K93q7M1m52K46R7l4JQ4k79
3100a92J69L0r0J67qn3j49rJ48r9J36k60K99L8p4n7l9J03o1J3k92K94K70j71J89
3125C02k09j37nR6j36J0J22j0oj20R5L13n88M16k54O7k00O91k66j77Q5j95J71
3148F5l72M33k9m00L68J16k67J94k6k51K91j02k21OoK56J08L20j79m77K96j62
3170c9J28j51k92L16P0k31J86N4m82L27O6K59m10k3M7K2J77L01l11J44j4m61K15
3193a02J10nK61l72O2k3j17L56l80q1N42k64k09J24R9m0M1J35N6p6j0j85j5J63
3217G0p7l9n5M00l4n41L10M02m98Q0k61O82l85j90n4J61p9L12k23n0K1K8J45J07
$$ plain form
3054 -255 -9 208 -97 117 329 209 -154 410 -79 13 118 -31 44 -17 14 -106 -115 -40 -32 21 226 -38 -142
3077 -142 -293 -264 64 199 132 188 -35 -180 64 -99 -230 103 -102 191 104 145 -307 -61 36 2 3 87 -192
3100 -192 -23 7 -83 84 76 23 -126 -135 13 -86 50 -210 89 127 53 -4 -43 60 -1 12 -280 14 284 113 302
3125 302 93 -44 -49 47 -89 -79 43 33 27 -93 2 315 -273 143 -111 -44 -244 447 181 4 89 -106 65
3148 65 -307 126 97 -303 65 181 -86 108 82 -169 122 20 -201 -195 -201 55 163 483 304 -173 123 -39
3170 -39 89 -62 -354 -38 32 -199 -13 41 -441 -114 -48 211 -199 -222 -175 -153 24 325 14 158 144 -317 -102
3193 -102 8 3 264 -108 -46 -69 -186 170 -210 -291 251 -13 -222 -98 1 -39 2 137 193 117 107 -78 -93 70
3217 70 -7 -46 -101 299 265 -276 34 436 -62 18 -243 439 54 -136 -190 -29 -108 204 -19 -69 -48 -20 125 232
3241B32k28m4M57l55k17n0L90m52L60l1mk34J93j62J07L73n42J73R7J44j60l04
3263b57M06o2K49l41O6n4l4N0j1j75M02J05o11K06J03k5l17J66L54k71j24L33
3285A58k71J81J4R9j94K02k61J79K18k01j05j96O75k89l39J76om6k6Nq3j05K35
3308B0J40j20K2r1N6q4P8k28P3L3K16k80K19M9j9j23J6J00j79L66o6k85j35L54
3332A32j05O6k12J76l17K8J90m4J72Km55R0K48K49j11k24R3J96J04k20p5j07O8
3355e6N6L80m66J37K61o51L05L60k63r5L14j07l16O7R7J13K7l02K11k66J79q4
3377i9K10j26J20l8l4J76K7l97K10j8K35m19K80K8m88P7M6K94n19N75j22k15K56
3400E9k28O2K73k32K54r1j51j96P9m4K85k81K96k18L87n05N27k96j7M3j30N9J31
$$ plain form
3241 232 4 -40 417 62 -155 -205 185 -267 93 62 58 -176 17 -145 -38 335 -207 -34 63 207 47 -257
3263 -257 149 87 336 -5 61 7 -27 23 12 -163 239 344 -267 -61 42 17 -300 -134 220 -51 -175 158
3285 158 -113 68 82 181 -13 189 -72 107 325 124 19 -177 498 209 -130 46 40 -6 -32 -27 -110 -215 20
3308 20 160 40 62 -29 27 -57 21 -207 -134 -101 115 -165 54 103 84 -39 -23 77 -102 264 198 -87 -222 132
3332 132 27 93 -119 57 -260 -232 -42 -86 86 88 -367 -277 -29 220 109 -115 -22 174 278 58 -17 -124 -56
3355 -56 0 380 -86 51 312 -339 -34 326 63 -32 282 175 -141 -74 23 136 163 -139 72 -194 -15 -99
3377 -99 111 -15 105 67 33 209 236 -161 49 31 266 -153 127 155 -333 -256 -210 84 -435 140 18 -197 59
3400 59 -169 -107 166 -66 188 97 -54 -250 -171 -215 70 -211 85 -133 254 -251 276 -20 -37 6 -124 -65 66
3423F6K75m34L4J07P4l67J69J77N2m6j02j94L92K9j23k40J91q0j68J26K53j02
3445H9l23N64j34l54q3M47J01o39K22JP7j19j61M92l5j23p0l59M68P4J96n05L13
3468A39K32o25L53p2K2K5j22K22l35Q7O7J6m1J37R1k24K83n70M35j57l7k74K41
3491a07J16L6j32M7qj41j68J09L66j79Q0J7k78K22O1k93l52P04p8k68M35l15J24
3514bj30J51J3j80K61k06L57m54J36o9J87j81o4K19j97M77m48J28j65J46k8J55
3536A06L1k95L45l3p0J51k00K06k37P2n21L08K29o8m0j01P1j47M4J42k0j91L10
3559I2J24q4k14L83n20K2K35J15k58K02o4k6K37j98J17k26J02J18L7k74J92N7
3581A69Oj10Ll27L78j63K26j91m8j3J56j64J07J07k40J00j08M8j0R8l95N04r1
$$ plain form
3423 66 341 -93 -59 48 122 -245 -76 101 153 107 5 -189 203 232 109 -131 60 -20 -188 -62 191 89
3445 89 -234 330 196 -158 -241 206 307 -332 -110 -109 -32 -151 -312 180 145 22 -48 -407 61 135 331 -174 139
3468 139 371 -254 99 27 49 74 -48 174 -161 -74 -7 9 -32 105 196 -28 255 -315 120 -37 -74 -348 -107
3491 -107 9 45 -87 -40 -48 -189 -357 -248 118 -61 19 36 -242 -20 41 -252 -604 100 22 -246 189 -126 -2
3514 -2 -132 19 32 -148 113 -93 264 -190 -54 -123 64 -117 -181 38 -159 318 -130 -2 -167 -21 -49 106
3536 106 137 -158 187 154 84 235 35 241 4 76 -445 -137 92 24 -16 -117 -46 -193 -149 -7 -27 -218 92
3559 92 216 132 -82 301 -219 -197 38 153 -105 97 33 7 244 46 163 -63 39 157 194 -80 112 169
3581 169 175 65 68 -259 119 -44 182 -9 -57 -70 86 -78 29 136 -104 -4 -112 -64 -74 24 -371 133 42
3604D2o8nJ35k83L26rP5k61J19r6o6K24j18Nj79K19K38j38k24M6p9Q8l3M41m31
3629c2J41k67L20l75J45J69m19L69Nmm1q0K70J1j00k3k66L2K16j72J66J65j78
3652E2j00K0J73l74K97k61L70k79Q6l63K77L2J65O4k91K37j0k26K2M30k96k8l7
3675d0J07k83J13R8j54J54R1n0lj88K97J9J34o88M43J00n09M54j97L25k70N4J59
3698A66q0P1j09l23L00O2L2k7pj68Q1j18L9J36m61L46j94J03O7J84k21J12Q2l19
3722b46J83L62k90qm8r0r5P6J39j65J44K03k15K37l45L25kk88p2K82q7N1J84l56
3746a21J73o9j24n7L77j12k2j03m7J47j25N8J6L81l28j04N5K48j54m9p5j46o7
3769b48K11o8k40K94N1k17K57Q8m24L31k3L02n80J92L1Q4l08M87rm90K39L93n88
$$ plain form
3604 42 -26 -31 104 -179 147 138 213 -48 71 -25 -91 133 15 20 -159 60 298 160 -64 -18 -97 -9 -42 399 -32
3629 -32 109 -158 162 -213 -68 101 -318 51 56 52 11 -69 201 212 112 89 -177 -145 71 -101 65 230 52
3652 52 -48 -28 145 -229 68 -193 177 -102 -16 -379 -102 -70 95 159 -132 105 95 -131 -109 321 25 -3 -40
3675 -40 67 -216 -103 -5 -159 -5 86 36 33 -155 142 161 295 -393 50 150 -359 95 -102 223 -47 7 166
3698 166 86 157 48 -275 25 87 119 92 85 -83 -2 -120 -81 55 -406 -60 -254 -151 -84 100 -121 -9 73 -246
3722 -246 -63 299 9 1 -47 -137 -232 -156 -17 -182 -38 165 -50 187 -158 167 165 -123 -195 87 0 51 235 -121
3746 -121 52 -17 -141 -198 179 67 45 -58 -105 42 -83 -25 -9 372 44 -60 -5 243 89 40 -35 -181 -248
3769 -248 -37 -105 -345 -51 0 -217 40 128 -296 35 12 314 -266 -74 -43 41 -267 220 211 -279 -40 353 -235
3792b35L57M12n81n2J20P6k75L98l01j35J71K05k92R1j67p7k30O15k42m4M2M8
3814i6J78k7j55L04l49J59j93J21J52r0M60o68L71o19N42j72R0O6k45L42j45q9
3836f3J98k05J38j81k45L59l7P2M1j06J21k39j5J69j25P1O7j34K30k07j08L69
3858A70k57J58j47J90r5J8l09K17k50K56k11J98L17m42l4J11J03K60k23j53J97
3879G4J73m98M09k54P8%k67N75j88k66K63j61J18k12L06k05k5P4j35J32n6J60
3901I5j39q1r5K44r4R4k7K05k39K01m13R9M77k56r2lK00l71K19k87J72%j90M59
3925A78k76R8j1L4R0j57K67k45k66J33P2L12k45m3Q1J36k72j6O00l95j23J58j11
3948aK7j08L5j77M12j41p2j83J30Q4l1o1j51N4M60j04j55k03K51j74L67j17p4
$$ plain form
3792 -235 122 534 -47 -99 21 97 -178 220 -81 -216 -45 160 -132 -41 -208 -285 -515 100 -142 -186 -144 -96
3814 -96 82 55 -100 204 -145 14 -179 -58 94 4 464 -204 167 -452 90 -82 8 74 -171 171 26 -63
3836 -63 135 -70 68 -113 -358 1 -36 36 77 -29 92 -147 -162 7 -118 -47 20 -114 116 -91 -199 170
3858 170 -87 71 -76 114 19 37 -272 -55 -305 -49 -260 -62 255 -187 -221 -110 -7 253 30 -123 74
3879 74 247 -251 158 -96 -18 -18 -285 290 102 -164 99 -62 56 -156 150 -55 -80 -6 -141 -9 -65 95
3901 95 -44 -125 -220 24 -70 24 -3 202 -37 164 -249 -150 327 71 -21 -24 176 -195 24 -263 -91 -91 -281 178
3925 178 -98 0 -11 23 113 -44 223 -22 -288 -155 -83 229 -16 -59 22 158 -114 -130 470 75 -48 110 -1
3948 -1 26 -82 -47 -224 188 47 -25 -208 -78 6 -25 -86 -237 -183 277 173 18 -185 66 -108 259 142 68
3971F8j18QO04k10J47j55l90j55N11l87M4J62p3K9l99M07J76k30k04k8J87Q4j74
3994i6j8M5K92M2p6j80j3J69Jm72M21l32L77m99O85j95j27J56m8k28K52m15L09
4017E0J49j67P8k17j83M03L7j52j14J68j01j8o0Q5o3LO2n5k4Q2m5m6K43j63q2
4042a30k02K43K58l20K28n1q0j44K95j13K16m38K05K0K7m2j83M32J31m70K92m8
4064A26k12J31R6k55r1K18o3k91L63K57n82L65j89mK93j13l3J0k58M16j88kM4
4087C8L07k00J24j86k1K25l12J61p1k53O7K43K05k15K63n69M68q3l49L63j96l6
4109b7J26RJ16j10k00j09O8K84k05J9K57Q8k78M5N0j51J13m47L66k3J81k33r4
4132a55K14M9nk18L29r3k21K5Q9o6l4j14Q5L74l58J46J6l10J86Kn9R4k26L5P8
$$ plain form
3971 68 -50 -42 562 352 499 344 -46 -201 310 -77 -33 129 56 85 -314 93 269 39 -165 -193 -6 78 -96
3994 -96 -114 -69 223 265 189 9 -4 165 166 -306 115 -217 160 -339 346 151 24 180 132 -96 156 -259 50
4017 50 199 32 110 -107 -290 113 150 -2 -116 52 -49 -67 -127 -42 -105 -102 -40 -95 -119 -37 -82 -128 115 -48 -130
4042 -130 -332 -89 169 -151 77 26 -54 -198 97 -16 200 -238 -33 -13 14 -28 -211 221 352 -118 174 126
4064 126 -86 45 141 -114 -205 13 -50 -341 22 279 -303 62 -127 -131 162 49 16 26 -232 184 -4 -6 38
4087 38 345 145 269 83 62 287 -25 136 65 -188 -121 122 327 112 375 -194 274 191 -158 205 9 -27
4109 -27 99 108 224 114 -86 -195 -127 157 -48 -29 228 316 38 83 133 -18 95 -352 14 -9 172 -61 -155
4132 -155 59 108 103 -115 214 121 -100 -75 14 -52 -86 -200 -115 259 -99 47 63 -247 -61 -59 -118 -24 -250 -215 -137
4157a37K97k79Kj05J15o7N5K22j3p8k80N60l72J49j59J38j29K07k95J32l5K21
4179A49j11k37M82k51J11J79j77k88j60J98n5K57M1l0j39j30L2J74j80J58O2j6
4201F9m05P8K31lk20j15L96NJ69k04j74q5j9L44k56L58l22L81l20K63k84L42l02
4224g3j42J91O4j10j17K30j83O05n32M3J10l6j12j23J62k8p7OL3K05J75l25K64
4247B30j51j05J53K52l32O5p8J5O5N7k54J77Q8j02J21m07M14k67m3j84J64K60
4269A38j59oP8P1k08K99mk02l81K30l1K15r0J49o2O5p3k31K63j06Q6R6o6m50L11
4294f8K5j09Q9j00J62M8M9j87qK49J02l61m1J32n5M9K23r9m1m5j81k56M77k17
4318a63M86l49j51L34l02J12k94J1J32K09N3M2J5l32L42k0j40L8m39L64m6m4J60
$$ plain form
4157 -137 160 -119 -117 -222 -107 -174 -119 103 90 12 -268 292 -80 69 -90 48 -81 126 -169 -37 -72 149
4179 149 38 -199 283 32 143 322 145 -143 -303 -105 -160 97 138 108 -31 -161 -129 45 -135 23 85 69
4201 69 -336 -258 -27 -30 -250 -365 31 36 205 1 -173 -258 -277 67 -189 169 -153 228 -92 171 -113 229 -73
4224 -73 -215 -24 40 -70 -187 43 -140 465 -67 -24 86 50 -62 -185 -23 -51 -128 -122 -89 116 291 -34 230
4247 230 79 -26 127 379 47 112 34 49 114 171 -83 94 182 80 201 -206 208 -59 -102 -286 -122 138
4269 138 -21 -27 51 122 -86 213 209 7 -374 -144 -175 40 -50 99 37 102 29 -202 61 -45 41 137 71 -379 -68
4294 -68 -43 -152 -63 -163 -1 47 96 -91 -99 150 252 -109 -150 -18 -73 -24 199 100 59 14 -167 -423 54 -163
4318 -163 323 -26 -177 157 -145 -33 -327 -316 -184 25 78 120 135 -197 145 125 -15 23 -416 -52 -98 -142 18
4341A8m2J86r9k84J05m0J53J79j56j05Jq4Q2L0l6M8L67o29OK38LR3j44K19k73
4366a64L32j61l8J93j19nl6j49K0L39j74N3k12k20M92j30j75P6J39m4j46K8K48
4389A47nk68q8L18j60l7J97n3j51j18K47j7Q1p6l16L07J67j60Q8K60k66J79m55
4412a79K15P2p6J35k46Q4R8K0qK2J07n73K69k53K61J39k78L37j21j11j08K52m4
4435A4K06r0P5k88o0K72M9o1N0l5j06k80K70On0L09j89n5l0q7R1K29j69l7j83
4460a49L45l28j4J53J19j62J46Mk35q6M82m17nK03j20JJ05k31N2J67k20J07m1
4483a24K62k09P5K61k15O7k90jL0L30k81j5N2L4J04P5P0l70K88l25j06N43r6j75
4507a6R9oq0J95j49o4K82l42L2q7P6o6J24q1j58J63k49L91P0J35j84K24k16q1
$$ plain form
4341 18 -24 162 63 -221 -116 -156 -3 176 20 -85 -84 -168 -86 -56 -92 -44 323 -306 -300 -62 -59 34 -110 109 -164
4366 -164 168 7 -31 162 43 38 2 -147 -127 212 38 91 -121 -341 151 21 -154 -78 61 17 -129 -101 147
4389 147 142 -126 -214 104 -56 -93 104 51 -100 -218 29 12 93 17 -299 8 175 15 103 363 97 276 -179
4412 -179 36 108 32 167 -79 5 103 123 115 137 244 -329 -60 -313 -52 87 -191 146 25 -86 -194 58 14
4435 14 220 130 205 -83 -143 129 178 117 167 132 26 -254 16 22 -28 281 92 37 7 -80 11 240 71 34 -149
4460 -149 196 -132 -146 7 126 -36 110 114 -121 -207 275 -142 -147 56 -64 -63 42 -189 -137 30 -190 -83 -124
4483 -124 138 -71 4 265 50 117 -173 -174 -144 186 -95 -110 -58 -24 80 155 225 -145 143 -182 -288 255 159 -16
4507 -16 83 77 -3 192 43 -21 261 -81 -49 -136 -60 -126 -2 -83 -241 -78 -327 64 134 269 85 309 93 12
4531A2j61K59j99K00m65N88j50j74m7K61O9O1l68k94N38%k44oK16Q4o4j11p5J21
4555E1J5J1m53M29j49J29L1m17N05J31l20j42L04j07k01J35m7l30N15n2o3n9K31
4578A47l28J85J8j25L68m26j9K77K9p0p0m6n0K37j69n0j45K43K38j05P6l27J82
4601G0j66J71k55O0R5K36j71N6n5l4J78m11K67Jj36j77K58l8K09J34k77j86K94
4624A23J7L2Lk77L9L45p8o91N64j23J23j77j69N11k28j19k64M56o3L3K3k50L0
4647a40jJ91J19J48l05J04m42M45K9l16K17j70j03J41J95k34K83j14j76K31p7
4668B5k20J84qO2J38l96J12J10J78l58M75k63o6L87p00M26J39k09j6j29N31m79
4690g7j96L64r4J71k53j46K28Rm2M8P6k56m2J56n9n5MK31L30l31J85l53K96j52
$$ plain form
4531 12 -149 110 -89 111 -354 234 84 -90 -137 124 193 254 -114 -408 130 130 -114 -120 96 180 116 5 -70 51
4555 51 66 77 -376 53 -96 33 64 -353 152 283 -37 -179 125 18 -183 -48 -95 -425 90 38 -25 -84 147
4578 147 -181 4 22 -103 265 -161 -180 97 126 56 -14 -60 -110 127 -42 -92 -237 6 244 139 215 -112 70
4601 70 -96 75 -180 -120 -25 211 40 96 41 7 185 -226 41 42 -94 -271 -13 -51 158 292 15 -171 123
4624 123 140 172 175 -102 -63 282 204 -487 77 -46 77 -100 -269 242 14 -105 -369 87 24 57 80 -170 -140
4647 -140 -141 50 169 317 12 116 -326 119 148 -168 49 -121 -224 -83 112 -122 161 47 -129 102 25
4668 25 -195 -11 -19 43 181 -215 -103 7 185 -173 302 39 -27 360 -340 86 225 16 0 -129 402 -77
4690 -77 -273 91 -3 168 -85 -231 -3 6 -36 12 88 -168 -210 -54 -113 -168 -164 67 397 66 251 -102 194 42
4714D2k24L73j85K06j2K68l69j78J80J38m04J73K80j67L9l80J34k66J25K51k05
4735a81J39j24K90r7j15J87L8j68Q8k94J34K01J01l09r4K40j09J97k90L09j49
4756fQJ43j15j58M4On0K65l03L79l74L2n9P0o3P1L7P5p9K10n2j50J6q4J23j1K1
4783dr5R5n0rj45L08J95k58p8K55j76j91l4JJ86K36r9o6J1Nl90M97k06L5J83N8
4809B64l10J43K2o3j07j09J30m5Q8m6pp2L24n76K44M0p7R0J16l04J75M13l80P
4833d0j33rK82Nk91K28Kp2R8L23m96J48j57q2M85k39K4j2K30k13k24P2O1R3j75
4858i2J54K05j83K5J42l14J03J35l92K29j70M29n09K4K72j13r6K76L2l0k42J43
4880B8Pm9k37M29j07j31K33m00L41m77J56J13J78O0j8k62R9j04N9L1j17o1N01
$$ plain form
4714 42 -182 191 6 212 200 468 99 -79 101 239 -165 8 288 121 160 -220 -86 -352 -227 24 -181
4735 -181 -42 -166 124 27 -88 99 137 -31 57 -237 -103 98 199 -110 -204 36 -73 124 -166 143 -6
4756 -6 2 145 30 -128 -84 -78 -128 137 -166 213 -161 -129 -188 -118 -181 -110 -73 2 -77 133 81 -69 -53 -137 -14 -25 -4
4783 -4 -99 -4 -54 -63 -208 100 295 37 -41 214 38 -153 -187 -186 0 236 137 71 82 87 -303 194 -12 23 206 264
4809 264 -46 97 119 56 -51 -160 -30 -75 13 -33 -40 -112 212 -364 -120 -80 -157 -67 49 -255 -80 333 -47 -40
4833 -40 -173 -182 100 105 -186 42 44 -28 70 393 -103 45 -112 -194 291 52 76 64 294 81 -143 -71 -10 83 -92
4858 -92 62 267 84 109 251 -63 40 175 -217 12 -158 271 -238 -214 58 -55 -151 125 157 127 -115 28
4880 28 35 -14 -251 178 71 -60 173 -227 114 -363 -207 -94 84 144 126 -136 -37 -141 -82 -51 -168 -229 272
4903B72j58r3j43pJ23j17N2J65J54j61q7N2k21r5J03J72k9j8l19J84j6K50j88
4926a25L40m2q1K32l45K82l56J80P0m28K80J38j46j2o7J30k12K44k56R3J12k04
4948a73L08l9j13K05k41J21k9K2k71O73k70m27n3K21J74oJ51P3n80P2N32r5m72
4971b17k6N64k53K6J30k98P5J25j63L0q7J52r2J70n04N19J96j12l63J87j36L9
4993c8M08o44M76k97j90J78K01j94J28Mj82P8j20L80j01j17j26K79k5P5p7q5k0
5016ik06M31l12J04j11L98k38k32K70N40n53L7J6l1k97J52m2l2J49O6j87K0J54
5039H7J28n17L72J9o4K08o0k23j46K18M1k85K86m8J07J5l25Q7rK73k80J58LN7
5063A02k81L20l78L21ok8j98K22O1p0l9j53P7P2l28J64L7j79L90k64K93l39Q8
$$ plain form
4903 272 114 21 -122 -129 -6 -123 -71 94 248 87 0 52 -169 -264 -161 11 -18 -36 -355 -171 -187 63 -125
4926 -125 215 173 92 324 -21 261 -95 85 155 -273 7 145 -1 -13 -80 50 -162 82 -174 -81 31 -173
4948 -173 135 96 -17 188 -53 68 39 61 -210 463 193 -234 -287 -66 108 102 253 326 -254 -182 350 255 -217
4971 -217 -243 321 68 94 224 -74 1 126 -37 -7 -94 58 -34 136 -368 151 347 235 -128 59 -77 -38
4993 -38 370 -274 202 -95 -285 -107 94 -100 28 32 -150 -72 -192 188 87 -30 -156 123 98 173 96 11 -9
5016 -9 -215 216 -96 8 -103 295 57 -175 95 635 82 119 135 104 -193 -41 -83 -115 34 100 -87 -67 87
5039 87 215 -302 70 89 25 233 173 -50 -196 22 63 -222 64 16 123 138 -187 -100 -109 164 -116 42 45 102
5063 102 -179 141 -237 84 78 50 -148 74 135 65 26 -127 -50 22 -306 -142 -105 -284 106 -158 135 -204 -116
5086a16K70p2j85K24k46K62l87L97j58KM7J15l68J16K32k75J16q5J01Q2k1k56
5108b05K0N9j24J04J19p0K46J20P3k72J7k47J89O2r1Q9M2J5o4NJ31k06J08M8l64
5133a96K73N5j58l29K59j85J43j00j95N15l41K69N5M8j61k00J47p8L42k16N24
5154D71m65J73k55j21j8j3L25j18J33j03J24k14J1R4J36k97n7L59j36j81M4L32
5176B24k52J54l09L58N2P8n89M05j23k07Q4P6K42k94K06p4q4J70j57q4j57M51
5198A70m20q9L94l04M04j05j31L43j82lj63L44l90J54j64J07Lk4J57l80K96J73
5220A90k44K74l75Q6J74Nm8k29P3J89J58m55J25R3N1n7K1n3J32j12O6j18J96k44
5244a02L4l2K89l26K64k6l25M67m39Q6J97j06Nk23K35o4J48j35J32j5K84p58M73
$$ plain form
5086 -116 154 82 -103 121 -125 137 -250 147 -11 -9 38 153 -215 -99 133 -142 -26 -111 -10 72 51 -205
5108 -205 -185 -126 -250 -146 -27 -97 149 269 342 70 87 -160 29 91 0 89 131 146 82 87 218 12 120 168 -196
5133 -196 77 132 -26 -355 -96 -281 -138 -238 -433 82 -259 10 65 113 -48 -248 -101 -179 163 -53 471
5154 471 6 179 -76 -197 -215 -228 97 -21 112 9 133 -81 -70 24 160 -137 -194 165 29 -152 -108 224
5176 224 -28 126 -183 175 227 305 -284 121 -2 -209 -125 -49 193 -101 105 31 -53 117 -40 -124 -281 170
5198 170 -250 -339 55 -249 155 50 -81 262 80 77 -86 258 -132 22 -142 -35 -32 -56 101 -279 17 190
5220 190 -54 220 -155 -69 105 110 62 -167 -94 95 253 -202 -77 16 67 10 31 -22 110 -2 64 -54 142 -102
5244 -102 -68 -100 189 -137 127 101 -224 243 -196 -110 87 -19 -14 -237 -2 -66 82 -53 79 64 348 -410 63
5267F3l1j53K62m3j90J31j01K1q3K15j55j71M86n58J85Q6J30k37J62k04R5J38
5289D8j18J70j12J27r0K2l29M64l37L10kj78L0L5M8j91J29k6K15kk29Q3l77M29
5313A19k5m03K06J83J22m53K38J27J05j06N5j72R4j17n3K8k1L05J51l26j50M53
5335C60l95n7m4J44k18L53L27o49L92m07J74J57l80L28j40J7NN3J14o0l24L57
5357A07j21m6k67L13M2n7J38q8K85k97p8k5J38k35N23o51J12J9Q0K39p3J67k41
5380a6l6K27l05J80J33j93j19K0M25k51k1l4J93R4l64K78p1j88M9k83L53j12M24
5403C83l88J58l09j24J50Rk6K93p9o9Q2k15oj0K13K6j88R1j49J9J24J73L0k20
5427c2lK30k36j00L17m5l52K80J1k3j70J35j50L0K39k42K19j06K10M1n18M26m12
$$ plain form
5267 63 32 -121 141 98 -92 39 -62 -41 -124 91 -64 -235 251 -307 -122 -36 94 -143 19 -185 -90 48
5289 48 -70 100 -12 115 25 47 -282 182 -155 155 153 -25 5 40 88 -103 26 0 215 213 -16 67 -310 119
5313 119 94 -309 -103 80 202 -251 -13 114 219 113 168 -4 90 -27 -80 -52 -73 232 383 57 -93 360
5335 360 -35 -92 -136 8 -210 143 470 -179 213 -194 -20 137 -243 85 -55 -38 -33 20 134 74 -250 107
5357 107 -14 -60 -327 -14 28 -29 109 21 306 9 -69 -94 44 -191 332 -319 -207 -188 -108 131 58 225 -16
5380 -16 -52 175 -130 50 183 -10 -129 -109 316 65 44 10 203 297 -67 211 140 -48 1 -282 71 -41 383
5403 383 -5 153 -156 -280 -130 -121 -147 146 67 -2 80 -135 -141 -151 62 88 -100 -9 -158 -139 -15 158 188 -32
5427 -32 -35 195 -41 -141 176 131 -221 59 70 47 -123 12 -138 -108 131 -111 108 2 212 253 -265 161 -251
5450b51L44k3L9j71r1J77R5j8K49j97k24J02k02J39RJ10l4m8J48k69K59p4r6o
5474c3M46n41J00l72O51j59P2k59P3N05o16K11K3J3j37j7j12L97k82L27j91j11
5496a2J21L6k76N4J88l21K68k94K12j13K15k01qo4J68p7J29J49j56J88k61j91
5518b46M87k57L41m61J16PK28m65J39j09R3J33nO4k48O9p1L18p8Jl59K09k9J69
5542D6j27j8M3L38m71Q6KRM1m7o5K71M5n1QK4k99K51j17N1J71k09K52k80L43l33
5568c6L64k59k88L49k65j11K40K61m42J88r1R0M8O9J25k77j78K82p2M3j6j79K5
5591a30J19J11k24j42M39l74J80O7L83k04k70l12K99Q1j20K35p7l60N21l88J99
5612C3j01K00k42P5L48j20N1j56k35K53k4j23M1J07j83L5J02m50N04p1k52K05
$$ plain form
5450 -251 93 70 109 -62 -153 24 119 101 350 153 -71 31 -171 -32 -23 87 53 5 153 -116 143 69 -27 -33
5474 -33 413 -128 -28 -400 251 92 164 -95 -22 483 -133 78 101 114 -23 -40 -152 245 -37 290 99 -12
5496 -12 109 145 -131 -77 111 -210 58 -236 -24 -137 78 -123 -131 -195 -27 -104 25 174 18 206 -55 -246
5518 -246 241 -16 325 -136 -20 -13 215 -250 -111 -220 -127 6 1 65 -183 -114 -185 133 55 56 -303 -94 -123 46
5542 46 -81 -99 -56 282 -189 -103 -101 -92 -51 -98 -163 108 153 102 110 134 -165 86 -31 20 191 -18 234 -46 297 -36
5568 -36 328 69 -219 130 -135 -246 -6 255 -187 1 -90 0 48 117 242 -35 -213 69 -3 40 24 -155 -130
5591 -130 -11 100 -124 -266 173 -201 -21 46 429 225 -45 -357 -58 23 -97 138 61 -299 222 -166 33
5612 33 -68 132 -110 -35 313 193 244 88 -147 106 82 -41 0 107 -76 -41 61 -389 115 44 -208 -3
5634cj86L08J36m51J92N1j30N00l96O4l02M44k40k02lM35k01K70l10m9j89K26
5656c6Q3l53J20J19J67k95K84R2j47K01k80mJ53k40J49j65l6J09J99L41k09k33
5678A9K85m66J00J22K21m86K99o4j81M72m78O28l36L5k64J96m53L58o7j56L81
5699A65k95L07k43J48k66J52J17j03O2q4L9M4J37k07J7l26J37L02r9k06j05J49
5721a58k01P14n80K08l0%J28j84O8K56k80q3L65l41L16k26K42r9k47L64o93L03
5743a58L73m18L38K6n63J9K89j09J23J95j74J15M2l92K35Kl13N99n0l87K23J49
5765A64k87j10M33k98M76l98j39J96J94l00J59j92M7O10p84K02k39K04K38J8n4
5786A40p0k10J91Q4k94o9K31O0j31n4J09pK17j26j36J13J02l90J97j35K39k85
$$ plain form
5634 -3 -189 119 255 -196 -4 47 -83 417 21 85 -217 227 -13 -215 -218 217 16 286 -24 -73 -262 -36
5656 -36 47 -306 -186 -67 100 -195 89 181 34 235 -45 -49 104 -136 13 -152 -188 -79 120 461 252 19
5678 19 304 -162 -62 60 281 -205 94 30 -151 321 -157 471 135 170 -94 102 -351 7 -60 -216 165
5699 165 -130 177 -66 82 -184 -32 85 -18 44 -40 -1 43 180 -27 -10 -336 -199 103 4 -202 -307 -158
5721 -158 -359 355 -225 -17 -47 -47 81 -103 -35 221 -59 -142 223 -118 198 -28 214 115 -132 232 -461 -158
5743 -158 215 -203 135 161 -402 -383 -94 -203 -80 115 -59 56 98 -294 -59 -57 -370 229 179 -208 15 164
5765 164 -123 -233 200 -98 378 -20 -159 37 231 -69 90 -102 -55 555 -229 -27 -266 -62 176 194 140
5786 140 70 -140 51 135 -159 -228 3 63 -68 -122 -13 -20 197 71 -65 48 150 -240 -43 -178 61 -224
5808b24L44j23K80n6j95Q0k45M2Q4j14Q4J34k57L72p0l85O16m53R8J48j20k69
5830b29J28N4J89l61J81k41L47j63k1J78l26O05l21O7M09l60k48K91l67M9m4K68
5852H5L1j91J77r8j4k15K8K19N0J37j07j92K18j11j37L68q2l53L25k52j70K24
5874f0J3j41J60J41p5q5j68R7J91j77p6K46k14O6l4J22J55j68j44M06n45M0K53
5897Cj33Q0o4J94O1k27k5K8K35j24J33j59m3k51J40K91j57M54p16K65j06j99J91
5920a29K10k10L52Lj22n8K22n82O95l09q5J2L6j94J48k03J04L03k94K08J96p2
5942B31m39n9J68J0L82m48J2N06j98p8n4K7j53L89m58P3J81P4l90J46K5M2n1J75
5966A13J27r7l16J34k17R0j29K54l3N0o6K03j28j28k8K81l2j51J46l29L52J09
$$ plain form
5808 -224 120 -3 277 221 26 106 -139 -97 -13 -127 -43 91 -166 206 136 -249 367 -86 12 160 40 -229
5830 -229 -101 -47 142 -219 -38 -279 68 -95 -116 62 -264 341 20 87 496 136 -112 179 -188 -139 -183 85
5852 85 116 -75 102 4 -10 -225 -197 22 72 209 102 -90 128 17 -120 248 166 -187 138 -114 -284 -60
5874 -60 -47 -188 -28 113 38 -47 -215 -118 73 -104 -180 66 -148 -82 -116 6 161 -7 -151 255 -290 -250 3
5897 3 -130 -50 -114 80 141 -86 -111 -83 152 28 161 2 -41 -292 -152 139 -18 436 -280 -15 -121 -320 -129
5920 -129 81 -129 223 226 104 46 268 -314 381 72 -13 -1 35 -159 -11 -214 -110 193 -101 107 303 231
5942 231 -208 -267 -99 -89 293 -155 -143 363 165 87 33 60 -93 296 -162 -89 92 166 -224 -78 -53 -11 -62 113
5966 113 240 143 -173 -39 -256 -166 -295 -41 -74 -24 -90 113 -15 -143 -171 110 78 -73 73 -256 96 205
5988B05l07P0j46K58p8J61l5l68l3M90q4p5KL21n71L08R4n6P7k7r9l87K00L3K64
6013B17m79K06m46N35j59K44K40k72k53k6j62K32j34K04p6L70r9J27o30K35m1
6034a67K67J15k93L35k75J85k45J04j39J42p7P3j06o4J37P1K6o1r7j25O6JJ34
6057GJ03m9J1J46M2j55l09J98k17O49n20j5K9p3l9L87j89j47N5J92k63K11mJ01
6081A51j15o8R3o8K12k63k63L08k75K13j29J63J32j96l0J84r2Q7l8j71K24p2j64
6104a77jP6J27J0j76l1J51K8J07Kk69J08K14r3r7J54j38p1L01r9k52J36K6j03
6128f7O7Pm5j84P5J10k09K09J14J82k8m35K98l34K36P6m2m2j0J3j73O6K48k14
6152h2n3J12J0k84K69j1J7N7J44P7k55j41j32M01j94L59k24J41m46PL90j60j32
$$ plain form
5988 205 -102 -32 -178 80 2 163 128 -240 -273 217 133 58 60 381 -190 118 212 156 233 206 107 -280 -80 -47 217
6013 217 -262 -56 -502 33 -126 118 358 86 -167 -193 -355 -123 -257 -53 -129 241 142 269 -361 -126 -167
6034 -167 100 215 -78 257 -18 167 -78 26 -113 29 -48 25 -81 -145 -8 63 89 28 -69 -194 -128 -127 7
6057 7 110 61 72 218 260 105 -204 -6 -223 426 -94 -109 -80 -153 -192 195 6 -141 -86 106 -157 54 50 151
6081 151 36 -32 61 -7 205 -58 -321 -13 -288 -75 -204 -41 91 -105 -135 49 -43 44 6 -165 59 -13 -177
6104 -177 -178 -102 25 35 -141 -172 -21 7 114 116 -153 -45 169 76 -21 133 -5 -76 225 126 -126 10 36 -67
6128 -67 0 7 -38 -222 -147 -37 -246 -37 77 259 231 -204 94 -240 -4 72 30 -12 -22 -9 -182 -116 132 -82
6152 -82 -135 -23 -13 -297 -28 -39 -22 35 179 256 1 -140 -272 129 -65 294 70 211 -235 -228 162 2 -130
6175a30K4J71m8j62L32k30J91q7K8l43R8J72j04K18n8j49J94L5k90L43k10J34
6197A29J7m04K25J33J17m60M03j31l25M38j67m0O6K24m36K75l18L49k27K50M7
6218A65l36j8K77j18j51M9J88J02L0p4m1j94q1J86K09L5l17K43j64k68K96l12
6240b94J78K81k92J67K6J29k54M25k51k32M6j13p8J56J49k49K59p5J01j44R1J12
6262A38l06Pk9J87pP8j56k4K61j36L04k21J5j75J10j0K4o4j32K48Lk70L69j78
6286C6o8K48l23P2q8M1k5L88j89j32QQ0j36K04l20K57j2J7m5K8j0Q1j29k35J02
6311a50K84L3j80l31K29P1J46K2q2r5j99M42r3M8j54P3N6J11m15Q4Q3P0M4M6k20
6336g7n5J31K7K20n56K00q7L47p8K27j75j65N67l43j39J81L5n14j32K93n1J35
$$ plain form
6175 -130 -106 65 17 -145 187 -43 148 61 89 -254 -156 16 -88 130 72 -77 117 152 -138 205 -5 129
6197 129 146 -258 -33 100 217 -243 160 29 -296 142 -25 -65 1 225 -211 64 -254 95 -132 118 165
6218 165 -171 -189 88 -30 -181 -132 56 158 188 114 73 -121 -202 -16 193 228 -89 154 -10 -278 18 -294
6240 -294 -116 165 -127 40 66 195 -59 366 115 -117 -71 -184 -262 -106 43 -206 53 -22 79 -65 26 138
6262 138 -168 -161 -190 -3 -10 68 -88 -112 149 13 317 96 111 -64 46 36 60 -4 -136 112 115 -155 214 36
6286 36 -32 216 -107 -35 -123 -82 -107 281 92 -40 -32 48 -88 116 -204 53 41 58 13 41 31 112 -17 -252 -150
6311 -150 134 167 -13 -344 -115 -44 102 124 42 -53 -252 190 97 145 -9 64 120 231 -184 -100 -17 53 97 143 -77
6336 -77 -132 -1 26 246 -310 -110 -197 150 72 299 124 -41 526 183 44 225 260 -254 -386 -93 -144 -9
6358ij0j85m9M04q4q2P5lJ43k44Q6j78L53l01J58M8l18K20k51L14m1j29J3O0R2
6383H2j96L10m99N48k29J4N3m1p7kn3mJ20k28L00k3j28n7j67L82Nl28K60J14k02
6408d6K21m23M76l97K74k83L54l75K05Q3k84K2K62J78j99K84l14O6l43K25m3l21
6430c78M15J53k15r0K06n0ll03L18J06l99M7K95N2j84j31K38r9K7j29J71L0n9
6453A8K15m05K50k66J27o0m7N54j13o70K29K25k53L01j72j66K62k17K94j52j74
6474b20L26k44J47M0J6k60LK34K01l81j03M08q8kj29P6jL4k80M25l19J8K31J42
6498B74k22k51K27J91n59K17Q9J85l6k28rk73L05P4k36L95j9J73m85Q6J8r4K36
6521E8K7q6L42q0l05Q8j80L09j35J38j42J61k40Q0j47M81l1j95l26K54R2k01J3
$$ plain form
6358 -9 -19 -204 -253 151 67 -15 60 57 200 -44 42 -136 217 -84 74 122 -196 24 -227 87 46 -83 -70 -10 82
6383 82 -114 196 -303 245 16 30 83 42 -35 -37 -90 -94 26 -202 98 75 -53 -110 -277 105 110 -218 42 156 -46
6408 -46 175 -248 228 -169 105 -178 176 -199 6 89 -195 -173 89 267 68 352 38 104 -239 -14 -57 -378
6430 -378 37 190 -25 -115 91 41 38 -265 53 159 -240 -193 102 154 -30 -161 77 -22 5 -124 47 77 18
6453 18 233 -172 78 -188 -61 -121 -168 386 273 -397 -168 57 -196 105 -67 -233 29 -188 106 -46 -220
6474 -220 106 -138 9 49 65 -195 -192 42 243 -138 -241 167 79 77 -52 24 23 57 -223 202 -117 -99 132 274
6498 274 52 -199 28 219 -340 -123 -34 151 115 -113 -122 -395 -90 -16 -252 143 124 297 -188 -102 -84 -178 58
6521 58 85 -1 341 261 -44 44 -136 173 38 176 34 195 -45 35 -112 369 338 143 -183 71 163 -38 -25
6544b5K56k11L2N4j93L04j22k05K6o9L15k14P7j80j22K60J91m30N37m40K14%j05
6567e0J26k72J66j65J85j49N20l87QN0j55k6K65r9p5j35K25J49k69L09l46j72
6589b97O77m37J04J71l16P0k25L32j44J23m7k39L03p8J1r4J76j29m38J55L98m5
6611C1N4K67l40J88k87m1K01l06QK69j66L06k71J93k03M15j75k45J6J5K48om39
6634b68N53l11j33M64k44K40j91J55k75j37L75q2q2j74l04N34k7J8J37k1k45j25
6656a43K4J26M6K8k24J59J63j77o8n0J73j09l3L1j26P6L01m11L6K43k05K38J1
6679A09j81J3q1K26L2R1J03m56L49j53M16m72Ol38J55L14l41L53q4M5p4lk29J22
6703g8k34J65J51l83L61k22N45l34J56O0m35L35m51o4K76J47n41N14L16j46l96
$$ plain form
6544 -25 231 20 52 106 -87 217 95 -110 -84 -153 162 -52 25 -155 -277 -17 174 -256 281 -159 55 55 -50
6567 -50 76 -196 -30 -195 -10 -159 361 -26 -18 32 -123 -149 116 17 -58 -193 32 181 -88 221 -125 -297
6589 -297 380 -57 47 218 -98 -28 -253 79 -65 58 11 -228 75 -3 8 -86 90 -39 -477 -322 76 31
6611 31 85 352 12 200 -87 -128 73 -233 -225 44 -122 184 -87 106 -97 318 143 -102 -86 -71 177 171 -268
6634 -268 285 -26 -159 305 61 301 110 265 -10 -147 228 146 64 -110 -414 120 93 111 248 227 -18 -143
6656 -143 -119 7 53 81 -143 16 179 2 -66 -116 57 -52 -85 -54 -180 -104 197 -214 -178 65 -140 98 109
6679 109 -72 -59 -140 86 118 209 312 -144 205 52 468 -4 2 -336 -181 133 -208 145 61 106 32 29 -200 -78
6703 -78 -312 -147 4 -379 -18 -240 305 -29 127 187 -248 87 -364 -428 -152 -5 -546 -32 284 138 -258
6724b58M4J31J58mj78J22j41M36l34lJ42Ll13K25J55K9j51n1q4K19j21j2j43J05
6748b4J66l37M03J22l06K50k80K62m08J82J77j83K06o9l0Pn9m16L00m7L56l96
6770a24J94n8O8j57n9M6k94M74k72j07K34j18K48j07k36j6K41k87J09K80j45j09
6792a95J41K89m67K56N7m30K40K63m80J42K49n9O2j55J2j0J80Rj5k31K58Pr3N6
6816H6j87K12M7k22L83l81R2K4l6o2j7K44k76J27K9j67K18j65k11N0K97m22L05
6839c2K22j28k56N2K16j29jL86m81K94o7J57k96K88j80J08l48K67k06J3Q8j34
6861a67M11k64J67j90J62O4k47j16K05K4J0Mj21J04k83J66q0K97j18q0m4k70M56
6884I0j17J33l39J58OK3j5Q2J57Q5k82k18L26J43k85J80j61Q9O8k20n3r2J67L0
$$ plain form
6724 -258 -214 -83 75 71 -107 15 -126 310 -24 -27 115 118 -195 30 185 214 63 12 -72 147 26 14 -129 -24
6748 -24 142 -195 208 330 24 274 -6 256 -152 30 207 24 230 161 131 138 79 -337 -37 -84 272 -124
6770 -124 70 12 80 -77 -136 -90 -384 90 -182 -289 -55 -173 75 -32 -268 -284 -43 -330 -221 59 -86 -195
6792 -195 -54 235 -232 24 81 -349 -109 154 -326 -184 65 6 68 -87 -75 -85 95 104 89 -142 116 123 30 86
6816 86 -101 111 158 -64 319 -62 30 54 18 -44 -61 183 -93 34 63 -104 114 -51 -262 -212 85 -337 -32
6839 -32 190 62 -194 -142 74 -55 -56 330 -151 143 76 233 -63 225 45 153 -195 72 -134 -121 -33 -167
6861 -167 244 -20 147 -43 119 183 -64 -180 25 49 59 63 -58 46 -237 -71 -151 146 28 -52 -96 -366 90
6884 90 -27 106 -233 -75 -69 -46 -61 21 178 263 -19 -237 89 232 -53 127 -34 55 123 -97 -150 -242 -75 -45
6908d5J31j49o4Nj28L48j78M9n1j46K17P6o5k46j8L26L29m95J01k60J58J99j08
6931a4R5l29O0j7L7J17J18J10P7k60j44K08j00q3M94l98j15j0j5J28K76l42n2
6954a59K63r5j35K7J05j14k57K57PP2q4j18R1k8J41J92p9JJ16k92n1M80m07K47
6978A80m6m8k83l1M42j90J7j30O2p0NJ92m15K66J22l76K52J38j43J36J25n4q0
7001G1Q9j81j47O9l5J23J58k45M05l68j22o6K20KpJ80k03Q4o3jK22k9k74K33N2
7026A67n7k42N7J01N6N4L8j56j33K98qm13L1J24k42L57P3j17kj81J79j24P1Q2
7050A3J43m35Q2Q9M8N5k2Mj4l2l00N52j12J38l47J00P5K14o2n49L63J15o0r1M1
7075Hn0J08J71l13o2M38l88L0k58N24j89k61J95J03okm0J4l8k58Q5K49j10J55
$$ plain form
6908 -45 86 -63 -127 -122 -250 98 -80 -31 -82 -228 -11 65 0 -246 -264 62 391 -104 -3 -263 -105 94 -14
6931 -14 81 -248 -188 -205 -168 -51 67 177 254 -6 -150 58 -42 -125 369 -29 -144 -154 -169 -41 235 -107 -159
6954 -159 104 9 -126 -99 6 -108 -365 -108 -101 -29 -113 -231 -140 -168 -27 165 86 87 203 -89 -140 340 -67 180
6978 180 134 86 -197 -228 214 24 41 -89 -27 -97 -92 100 -315 -49 73 -303 -51 87 -56 80 205 151 71
7001 71 160 -21 -168 -99 -134 -11 147 -98 307 -61 -183 -249 -29 -27 -34 146 -57 27 -36 -37 185 156 -118 115 167
7026 167 110 -132 -75 26 82 136 174 18 -115 183 175 -238 -207 -83 -325 32 105 -12 -14 -195 -16 -140 -69 13
7050 13 156 -279 -197 -108 -60 -5 -27 -23 -37 -69 -369 183 71 209 -138 -38 37 251 189 -360 3 118 58 -33 8
7075 8 -42 66 237 -76 -138 300 -88 -58 -316 208 19 -242 -47 56 50 48 8 22 -16 -274 -189 60 -50 105
7099A05j00j10j58M33M1k19j27M80o04K11J54n00N89J7k67J11J63m34L43m81J14
7120b39J30N9K3J04j91J91J94k17q2j35N7K66m17J16L84j95j64p3J41k56M06K3
7142A25Lj55j69M9O0J76n1p9k3J11n9J2qk65K91n9J4l2M4J49n5J15n11L64p7j37
7168a67K34j77J12p7mK00j65k33J55N12k70j43L42l19j9O5m00N50M0j40r0o4K43
7191A85l06R8K7k10N14k31k29J74J46j17o8K52l50M38k95k79J81j25j5M38j51
7212G7o6K00M4k27K1k63L04j9k09Q8J12mN1k64J15L33l90L60n7m93L61J56k98
7235f8O1N9j12j34M23l4k8r7j94M68k73j48L45K6m53L76Q5m61K88o9k78K33J0
7258B5K8p9N5Rk5j35k18M95k21J07K4j23K4J86o2P9j99K2K5J52j40n8L13k0l31
$$ plain form
7099 105 5 -105 -263 170 211 -8 -135 345 -259 -48 106 -394 195 212 -55 56 219 -215 128 -353 -239
7120 -239 -109 -50 -27 77 -114 77 271 54 -28 -163 -106 160 -257 -141 243 48 -116 -189 -48 -304 102 125
7142 125 128 -27 -196 -147 -87 89 38 -41 -64 47 -12 0 -8 -273 18 -41 -27 -59 -15 134 79 194 -317 47 -30 -167
7168 -167 67 -110 2 -75 -79 121 -44 -277 -122 390 120 -23 319 0 -19 46 -354 196 236 96 6 -58 185
7191 185 -121 -23 4 -206 308 77 -152 22 168 51 -17 235 -115 323 28 -251 -70 -195 -210 228 77
7212 77 11 211 255 28 49 -214 90 71 -138 -50 62 58 109 -155 -40 293 -97 263 206 -287 74 230 -68
7235 -68 -7 52 -60 -194 229 195 167 70 -124 344 71 -77 268 294 -159 217 302 -159 129 60 -218 15 25
7258 25 53 -26 29 38 13 -122 -340 155 -66 41 65 -58 -34 152 90 169 -30 -8 17 169 29 -29 284 264 -67
7283f7q2M58k47L1J70n94L69O8j36J90K1k54Q9Q1n5%N9k79J58k82O99n93J36P9
7307A9j84K09j31m3M8J19j65j0R2J13m76L59M6M8J31j47q4J60j9k1K72k47m7p2
7331c0j18K47j30O7p0r5j12J21j6K3Q6j59L6K36l51O2K76j00O0p1k2r5J16j29
7355a68J95K03k51N5k43L3Q6J2j65N03%Jj60j47k73j61L98K54l33L67m8j80j37
7378a59LJ69j42R6J15l92L40n6j5p1K43O9m08R6J44m05N80Jj92m9J30J0R8k43
7402c8o2M23m13L42m13l6K86l85J79n0MK07j45K55l73J77K4j82p3M00l17r9K90
7425Aj58J48J75k95m0J84R0j70l2Mo3K07k20J63o0M00l16r6j84K44o1K13M1m87
7449c12N91k10J60k29N6R8k62J06K57m51J02J89j57J74O8R4o71L34J59l90K85
$$ plain form
7283 -67 -149 309 62 93 263 -331 38 106 -30 160 181 -73 16 97 42 42 101 -178 -20 -302 397 -196 -60 19
7307 19 -165 44 -87 -130 -82 37 -128 -138 -46 67 -409 -50 -4 44 175 28 -56 104 85 64 336 89 42 -30
7331 -30 -148 99 -31 36 -34 -129 -241 -120 -136 -113 -27 -186 -150 86 -265 -203 73 -27 33 -38 -60 -155 -39 -168
7355 -168 27 230 -21 34 -209 -176 -90 -78 -243 260 260 261 101 -46 -319 -480 -82 172 -161 206 158 -22 -159
7378 -159 -156 13 -129 -33 82 -310 30 -26 -41 -112 131 200 -208 -112 32 -373 207 208 16 -33 97 107 205 -38
7402 -38 -100 323 -90 252 -161 -197 89 -296 -117 -167 -163 44 -101 154 -219 -42 -18 -200 -273 127 -190 -289 1
7425 1 -157 -9 166 -129 -169 15 105 -65 -97 -93 -156 51 -169 -6 -66 334 18 -78 -262 -18 -79 134 175 -312
7449 -312 279 69 229 0 56 154 -108 -2 255 -196 -94 95 -62 112 180 274 -397 -63 96 -294 -9
7470iQ5o6r4k3k43L72mj92L26J39k60k72M1P2L22l37K79J61m92Q4J61J52j77k19
7494a94K62J60j17j32K53k91K00k83J22l4J19j24P4o2o5j92N3M08q7o3k94N56
7516B69m94o5K93Mj72J68q5J63k35L42k74J04Q3k91J79K47k88r1k12L14l4K32
7538A57n0j26j49J53J42j88k20K48oP1k05K61o7K67q0m55q3L43k52K65K7J58k53
7561d2K2j67o0M54m2j63M3J05J59N5m07o8l7P9j7q1NK41o7K60n2m84K37k02J97
7586c2k3J68P3J28Pk35k8r2K4R9k0L4l2j42R6n5j3RJ22N7j03l5J40k88K6L14O2
7613B61m11J3J46K19k69j78l0k0M92L45n19l2k03K64l06K17P24q14Q7j98lM89
7635B74k92M9Q0r2j12Q2J94l10J72r6L24j65J53k16n6K43l16j4M88k90m6J38k34
$$ plain form
7470 -9 76 10 -84 -107 -350 22 18 -174 152 291 31 -241 -200 -128 194 -143 136 297 -195 -111 50 202 25 -194
7494 -194 68 228 111 -21 232 -59 141 -142 -20 -54 65 -59 15 -47 -112 -304 -251 157 70 7 -287 269
7516 269 -225 -290 3 7 -165 3 -82 81 -154 188 -86 18 101 -190 -11 236 -52 -143 -355 -41 -75 157
7538 157 107 -19 -168 -15 127 -61 -281 -33 -39 32 -173 88 21 288 208 -247 -330 13 -239 26 53 211 -42
7561 -42 -20 -187 -247 207 165 2 45 150 309 364 -43 -111 -148 -69 -86 -167 -162 79 12 272 220 -264 -27 -229 -32
7586 -32 -55 113 186 314 321 86 58 -34 -10 89 69 103 71 -71 25 -30 -43 -34 88 145 42 7 147 -141 -115 199 261
7613 261 -150 -137 9 228 -41 -219 -249 -269 223 568 49 17 -186 78 -228 -11 713 -101 -14 -212 -215 274
7635 274 -18 31 111 19 -93 -11 183 -127 45 -51 273 108 261 45 -11 232 -84 -98 390 100 54 192 -42
7658d2n6rm9k01L09L39j4j76J46j05L5q9K9l6j25L42j42j14K6j01J49j70J9JJ66
7683A32J37l43K59j46j2q9r9O0J42l3J89j32J96p9l88M04J1n12J58j21N18j45
7705A07l0r1K7j4P6m0q9J74k95L94j58lq5K24j97l0l6J23j79J95L6j07L8p3P6
7730D3m0r6J53k08L33j10k88J01J31j16J71n7j5J65j40n3J6k5k22J57M2j3l0L26
7754B25j82p4K89l93K68j02k0J1m6k24L71n4M8p5j21kl50M25j22k8J93R2j16m9
7778c6k13O3K33Rn2o9j8J48Qj9q0K45O4l47j19L1K49J41pl47m1L06j23q9L21l12
7804e4K0O4K8J42m14M07k88o3N9K60n5J25k23P8l02M14l30J60P7j44P7K40k49
7827B9r5j02J37J80n0O9j76k80L61j17l56M86j9k1p6j47P4L84j69l16L27k55O4
$$ plain form
7658 -42 -98 -107 -156 -357 -48 291 277 101 247 142 177 88 117 81 -44 298 156 42 68 -33 116 -54 -35 -34 132
7683 132 269 -74 185 39 27 -62 -161 -101 41 8 197 65 261 182 -206 198 209 -303 -145 -266 252 107
7705 107 77 -14 13 -1 75 35 -54 120 -175 219 61 58 -27 197 0 -30 -66 57 -122 73 109 2 40 -33 43
7730 43 3 -93 60 -148 185 75 -213 -112 19 -97 74 17 2 167 27 -26 -10 -35 -257 -100 -58 -71 -101 225
7754 225 43 -31 258 -135 133 31 11 22 -24 -248 123 69 117 42 -79 -81 -431 -6 -128 -156 37 129 13 -36
7778 -36 -249 -186 47 56 4 -65 -83 65 73 54 -26 219 283 -64 -183 -152 97 238 231 -116 -157 149 26 -63 258 -54
7804 -54 -34 30 58 200 -214 193 -95 -158 -99 161 106 231 8 86 -216 198 -132 28 105 -39 38 278 29
7827 29 -66 -168 -31 149 99 168 -8 -288 73 -44 -400 86 67 46 -30 -177 -103 281 112 -204 123 -132 -68
7850f8J14mJ43m2j94J98k27J19J14J01n94M72k35QJ54Q4n1j76JJ26P4j47M76m11
7874C5n0j03J17r7N8K35j20k39K54j26k4J15k9r8l1o9K63p9kJ04j73N4k46M99
7898B48M9m69N16m12p1L40J99l33r9J49k71k5L63k01J9J01N7j31k06J80k1k69
7920b87L22M3k42Q2j7j0K41j21p6KO0JK9J0J76j91O5l58O41k80J01k64o6J02K9
7945hL06n43N28l46L39k24J8J35l76J02J73k89j8N40j83j52k0J51m15J56r2J36
7967h2J8n8q7L70K3k39j44j42M31k68L51j73k0J9j46L90l08R4J00k40j04M14k04
7990eo9O6K1J51k20o5j74M34Nk74J82P9j65J62k69r0J19Pn1j12L36k25O3k11J72
8015a33J70K73K5n98L61j71J04l33L18j84J56j79R1J73k91N27n64O9L40l3N2P7
$$ plain form
7850 -68 46 42 185 143 -51 147 -80 39 153 254 -340 132 -103 -95 59 143 92 -84 -83 43 117 -30 446 35
7874 35 -15 -118 -1 -98 -40 195 75 -164 90 -36 -60 55 26 -72 -103 -172 91 12 10 114 -59 -5 -251 248
7898 248 297 -172 344 -68 -139 201 400 67 -32 117 -154 -179 184 -17 2 103 160 29 -177 3 -18 -287
7920 -287 35 78 -164 -82 -99 -109 132 11 -65 -63 -3 -2 27 37 213 22 87 -271 370 90 191 -73 -139 -37 -8
7945 -8 298 -245 283 -63 276 52 70 205 -171 -69 104 -185 -203 337 154 2 -18 133 -282 -126 -218 -82
7967 -82 -64 -122 -209 161 184 -55 -199 -341 90 -178 173 0 -20 -1 -147 243 -65 29 129 -111 -215 199 -5
7990 -5 -74 -8 13 164 -56 -121 -295 139 144 -130 52 131 -34 128 -141 -231 -112 -105 -156 -268 68 -157 -94 -305 -133
8015 -133 37 310 335 -263 98 -73 31 -302 16 -168 -12 -191 -100 73 -218 309 -255 -186 154 121 173 250
8037B50jk62M9q8J23J60m21L51O0k96N4J50j46J61j09L59n20R3l07N38j62O2l84
8060b86M65k65N18k76o5j04j18K62o3j38p2J8K26J58n49N88J6k77j37k33K36J3
8082h3J0L01n98K04M1K46k54OM2K57N1m94M63k88K21j02q1n0k07L21j2n4m2PL52
8107B57k53j38jM30m59K80m5o3m4j55M48l65j33K37j70Q0p4Q4oj81J29N59p76
8130c59M51j24J40j98Q9L75m50K99N4k29O5q2k74J13J97l3m0j7J0j2J1J68k21
8153f7J88j35KK63j22r9N7Q5k33L47l22M1l45M65k68K70k53LK03j98K31m36J14
8176b09J75j05J85J71j28r3J33j16K7k67K93n1j74Q5K68
$$ plain form
8037 250 249 -13 36 -52 71 231 -190 161 221 -75 -21 129 -17 144 35 394 -126 -33 -340 198 36 98 -286
8060 -286 179 -86 432 156 91 -13 -131 131 68 -70 -142 -124 102 260 -289 299 315 38 -99 -332 -96 -83
8082 -83 -73 228 -370 -166 -125 121 -133 -127 -85 172 223 -271 192 -96 125 23 -58 -108 -315 6 -6 -60 -102 -95 257
8107 257 4 -134 -135 295 -164 116 71 8 -36 -191 257 -108 -241 -4 -174 -94 -168 -84 -90 -271 -142 417 -359
8130 -359 92 -32 108 -90 -1 374 -76 223 277 48 113 31 -243 -130 67 34 -6 -23 -13 -25 -14 154 -67
8153 -67 121 -14 -12 251 129 30 87 172 -61 286 -36 5 -340 125 -143 127 -126 -123 80 -118 113 -323 -209
8176 -209 -34 -139 46 217 89 -4 129 13 40 -227 66 15 -159 -74 194
8191A94
$$ Imaginary data points
##PAGE= N=2
##DATA TABLE= (X++(I..I)), XYDATA
0@%%%%QqQj6J6k4L2l2M0n6P2q8J04j20J43j70J96k27K66l11L58m09M66n29O02
29C21o82P67q63R70j083J209j351J503j670J854k054K274k520K790l089L424l795
46a995M213m690N235n864O603p486Q560r904J1636j3964J7292k2465L1656n2837
60c4010J86510N7068l82289K9025J02728N7970J28603L0480l07476j19965K59381
71H025J85538j07995j00676o8291o2991J16961K34176o2906k69848m1757J59382
82a0382P0904M4923o637j95530j09444K11060J65122q8225j07569o2347l9791
93a27916J38128J69747r0651j92692j9600Q9968R7978O5646q0110j69436j1357
104a30295J56754R3274m5753r0830q0424k180J35266J12038r4416j45079K763
$$ plain form
0 0 0 0 0 0 8 0 8 -8 8 -16 16 -16 24 -32 40 -48 56 -64 79 -91 105 -122 144 -167 191 -218 248 -281 321
29 321 -361 406 -457 513 -570 639 -712 791 -879 975 -1079 1195 -1325 1465 -1624 1800 -1995
46 -1995 2218 -2472 2763 -3101 3502 -3984 4576 -5328 6308 -7656 9636 -12829 18827 -34010
60 -34010 152500 209568 -172721 -143696 -40968 17002 145605 176085 -131391 -251356 8025
71 8025 193563 85568 -15108 -83399 -146390 -29429 204747 141841 -128007 -169764 -10382
82 -10382 60522 105445 98808 -96722 -206166 4894 170016 81791 -25778 -88125 -127916
93 -127916 10212 179959 89308 -103384 -122984 -33016 64962 130608 50498 -118938 -130295
104 -130295 26459 119733 73980 -16850 -97274 -99454 35812 147850 53434 -91645 -88882
115h8882O2643O1535Q1015n3772j83698m915J67404N0655m3614l3077j00007m2489
127a27202J68475J15482j22878j20305J1935L7028P5908R0309p9803j76681J2570
138a15162J62388N5539n3254n4432q0216k1269J52957J08860j26197j29404L2673
149f7517N0720N2298Q1283p3131j75332K7714J63113L0275n0147m3725q8258n744
161i8451J62195P8200j30730j07138K6796N5308O9847N3636r3877j45845M2146
172h7913J53556K9524o5161n3839o2674J1419J47598N9257j38351r1783N0346
183d8021M9676M8786M5664r4332j26959O5742J31832K05n1782m1879o3493K3984
195f0577J38229L1506j25374p0160M0496M7400N2594L0571r3066j07273O4708
$$ plain form
115 -88882 -26239 35296 116311 62539 -121159 -126074 41330 91985 48371 15294 -84713 -127202
127 -127202 41273 156755 33877 -86428 -74493 -37465 38443 128752 48949 -127732 -115162
138 -115162 47226 102765 49511 -4921 -85137 -106406 46551 155411 29214 -100190 -67517
149 -67517 -16797 35501 116784 43653 -131679 -103965 59148 89423 39276 -4449 -92707 -98451
161 -98451 63744 141944 11214 -95924 -69128 -13820 56027 109663 15786 -130059 -87913
172 -87913 65643 95167 30006 -23833 -86507 -75088 72510 131767 -6584 -98367 -48021
183 -48021 1655 50441 96105 1773 -125186 -59444 72388 72593 20811 -21068 -84561 -60577
195 -60577 77652 109158 -16216 -86376 -45880 1520 54114 84685 -8381 -115654 -50946
206e0946J21589k503n6281l6632n0728K5338J28891K0498j27101n2886N0655L5361
218E255M5477K7627r7463q9943P8032J00368j4592m2192l7119n0620L8251J15361
230G8442M218j10575m3626M0367L7840M5661J5278r2084p7151P5966R3413j7347
242E0402m4232l3987m2926M1377J11438r725j11468k6784M3745K9681M6191Q795
254F2507r8102n8129Q3921P3606k2451l5184l4847l7738M8870R6927j9968r9335
266c9923j8338M1861K6648L9081M856r1561n0407Q5138O7459l2048l2781k6709
278b6724l6551N0334R3445l0422r6438n913M0601K2244L7848j849q8825l6024
290g8274Q2439N5394l0194l1965k6428k5263N0398P7349l1600q5675m815M0118
$$ plain form
206 -50946 70643 68140 11859 -24773 -75501 -50163 78728 99226 -27875 -80761 -30106 5255
218 5255 50732 78359 -19104 -109047 -31015 69353 54761 12569 -24550 -75170 -36919 78442
230 78442 82660 -27915 -71541 -31174 6666 52327 67605 -24479 -101630 -25664 67749 50402
242 50402 6170 -27817 -70743 -29366 82072 72347 -39121 -65905 -22160 7521 53712 62507
254 62507 -35595 -93724 -9803 63803 41352 6168 -28679 -66417 -17547 79380 59412 -39923
266 -39923 -58261 -16400 10248 49329 54185 -37376 -87783 -2645 64814 32766 -15 -26724
278 -26724 -63275 -12941 80504 50082 -46356 -52269 -11668 10576 48424 46575 -42250 -78274
290 -78274 4165 59559 29365 -2600 -29028 -54291 -3893 73456 41856 -43819 -48634 -8516
302h516K4133L0946q737q1344k5958P8731M6640k9477k9287k8984j9920N6610
314D837O5814m1018p2577J855L1583K5251L2373j9936p7325r851P4913L2481k7251
327B1149k4383k9993j4306O0010N5750m8492o4560J0990K8636K0157L1687k1810
339B4835p6827n61P5739K1941l0546j7655k7605j3964O1208M9336n3643n7627
351d5369J7182K6476J6410K8079k3674p0998N620P3062J5451l2279j6158k3667
363b9865r289N8672M1370n3844n1241J9571K4718J5673K4546k7307o3809J2226
375c8579O6809R429k9336j5384k3074l112N7555L0691n3872m2552K0472K2099
387A146J6716K0793l1879n6960J8539O1032M309k7473j4145k2715J243N7251K2385
$$ plain form
302 -8516 15617 46563 37826 -43518 -69476 9255 55895 26418 -2869 -31853 -51773 4837
314 4837 70651 29633 -42944 -41089 -9506 15745 48118 28182 -49143 -58994 15919 48400 21149
327 21149 -3234 -33227 -47533 12477 68227 19735 -44825 -33835 -5199 14958 46645 24835
339 24835 -51992 -52553 23186 45127 14581 -3074 -30679 -44643 16565 65901 12258 -45369
351 -45369 -28187 -1711 14699 42778 19104 -51894 -46274 26788 42239 9960 -6198 -29865
363 -29865 -39154 19518 60888 7044 -44197 -24626 92 15765 40311 13004 -50805 -38579
375 -38579 28230 37659 8323 -7061 -30135 -33247 24308 54999 1127 -41425 -20953 1146
387 1146 17862 38655 6776 -50184 -31645 29387 33696 6223 -7922 -30637 -29394 27857 50242
400E0242n5235l4243K2194J9135J6087J7658l4505n1221K5997N5817k805k5847
412C274j1981k0921M837N5710J4879n5824k7083K4528J6312J4411J5132l6020
424b746m5475K9768N1445q004k4538r485j8765Q094N1498Q604n4281k0828K5614
437i099J3924J2973J1351l5775l8994L2778M5250j0816k2730q993j6558J1714
449a4975M7560K269n0760j5693K4493J3123J2233P699l6042l1607L4022L9055
461C1377j3201k0083q981j4582J5025M3471m182m7098r568K2653J0888J3483L682
474B2884l6971k4656L5860L1933j3529j7503r485j3169J8423L9206r260m3892
486b0159m799K1710R294J2565J569l6785j9137L7650K6517j6984j4066p933j3627
$$ plain form
400 50242 -4993 -39236 -17042 2093 18180 35838 1333 -49888 -23891 31926 29121 3274
412 3274 -8707 -29628 -24791 30919 45798 -10026 -37109 -12581 3731 18142 33274 -2746
424 -2746 -48221 -18453 32992 24988 450 -9035 -27800 -19706 31792 40396 -13885 -34713 -9099
437 -9099 4825 17798 29149 -6626 -45620 -12842 32408 21592 -1138 -10131 -26689 -14975
449 -14975 32585 34854 -15906 -31599 -7106 6017 18250 25949 -10093 -41700 -7678 31377
461 31377 18176 -1907 -10888 -25470 -10445 33026 28844 -18254 -27822 -5169 5719 19202 22884
474 22884 -14087 -38743 -2883 29050 15521 -1982 -11467 -24636 -6213 32993 23733 -20159
486 -20159 -24958 -3248 6046 18611 20180 -16605 -35742 1908 28425 11441 -2625 -10558 -24185
499b4185K1283L6766j5495m0246J341J9415O755J3508j488l6891j2999L7824K0656
512B6244j7273j2346p888j0667K1543L2972j7552l8276M733J9212N281J1988k604
525A5367l6113q754L8904J5830j9699r303p189r721K3919K8316k1923l2065P298
538a5133J6451N205J0719o261l1774m311L5226J3056j8540r737o013o845K2763
551D806K5237k2241l1344J0434J6069L373J0660p615l2434Q58L5808O552j7670
564B493p260p377l775K5194J7562k4284k3829J0586J3539M480Q240j0229k7049
577b1709L671L1899N073j8250n575n640m066K4001J6986k6598k1713J4611J0207
590B897K980J0673j2834k7981R887L0589q06j5294n442p027N34K4543R664k5288
$$ plain form
499 -24185 -2902 33864 18369 -21877 -20536 -1121 5634 19142 17654 -19237 -32236 5588 26244
512 26244 8971 -3375 -11263 -21930 -387 32585 15033 -23243 -18510 702 5983 17971 15367
525 15367 -20746 -29500 9404 25234 5535 -3768 -10957 -20678 3241 31557 9634 -22431 -15133
538 -15133 1318 6523 17242 10981 -20793 -25104 10122 23178 4638 -5099 -11112 -17957 4806
551 4806 30043 7802 -23542 -13108 2961 6334 16994 9379 -23055 -22197 13611 20163 2493
564 2493 -4767 -12144 -15919 9275 26837 2553 -21276 -10690 2849 7329 15569 5340 -21709
577 -21709 -18038 13861 18934 684 -4891 -10531 -14597 9404 26390 -208 -21921 -7310 2897
590 2897 5877 16550 3716 -24265 -14378 16211 15405 111 -5331 -12358 -11824 12719 22383 -2905
604b905j6753J3118J0984K281O162j0951k3696R136K9154k169j7069j679n666
617a0053j544K4110R645k7549j3353J5051O941L191P558j4932k1041J3538K4400
630A5962l399j3784m962m850M049K0833M515k4537j2051J4455R732J167L076j2683
644b477j7563J4406K2232p558j2497n13o691L613K2433M1k4472m684J2133M155
658B558N923L095j7562j2887J6919J6506o790r354l577o120O966K0113k418k3781
672a0409l299J4111L213K981M118j7149j2610K0126J4998j2660o661J276q744
685a0709N870K1426n790k2252P33J1314J173N459K991j7531j0167J8259J3968
698A4744r772q856j08n158O065J8856m594k3377M3J4936J042K118K864j6586r902
$$ plain form
604 -2905 -19658 -6540 4444 6725 12887 1936 -21760 -12624 16530 14361 -2708 -4387 -10053
617 -10053 -11597 12513 22158 -5391 -18744 -3693 3248 6439 13997 -935 -21976 -8438 15962
630 15962 12563 -1221 -6183 -11033 -6984 13849 18364 -6173 -18224 -3769 5963 7130 10206 -2477
644 -2477 -20040 -5634 16598 9040 -3457 -3970 -10661 -7048 15385 15426 -9046 -13730 -1597 2558
658 2558 8481 11576 -5986 -18873 -1954 14552 7762 -1592 -5169 -11289 -4323 15790 13372 -10409
672 -10409 -13708 403 3616 6597 10715 -6434 -19044 1082 16080 3420 -3241 -1965 -10709
685 -10709 -4839 16587 10797 -11455 -10722 592 1765 7224 10215 -7316 -17483 776 14744
698 14744 4972 -3884 -3992 -9150 -3085 15771 11177 -12200 -12157 2779 3821 5939 8803 -7783 -17685
713a7685K1389J1628j3328o188N42n400Q414J6116q598j8828L160J0235K007L902
727G366j035j4904n263J7226J0345j0620p727n32k826Q599J4463q910j9143M333
741h628J2212L18K659p75j6657k252K0259M941j2102l362j364k801J1195J0123
755A3766j2137j3290N891Q552R78K552k908j2749q28J6452M904j1121l805n2l262
770g057R504J1767j2474j4704Q570P981j399M857l374j5624L064J7753l1r986
784a153j658k069j522J1538O932j3045r566P168O815m38K318l453j2027K304J6029
799H173N92j1117l96n01l854J1623Q758j4920r632R661M223m61N194o283j2920
814a1860O191J4587k166q497q96k206J63J0707M328j2870q135Q950N729j315K159
$$ plain form
713 -17685 3704 15332 2004 -4184 -3642 -9042 -628 15488 6890 -11938 -8778 1457 3464 7366
727 7366 6331 -8573 -13836 3390 13735 3115 -4612 -5144 -7970 629 15092 6182 -12961 -8628
741 -8628 3584 3902 6561 5786 -10871 -13123 7136 12077 -25 -3387 -4751 -7552 3643 13766
755 13766 1629 -11661 -5770 2782 3760 6312 3404 -9345 -10173 6279 11183 62 -3743 -3795 -7057
770 -7057 2447 14214 1740 -12964 -4394 3587 2188 7045 3671 -11953 -8889 8864 8833 -1153
784 -1153 -2811 -4880 -6402 5136 12068 -977 -10543 -3375 3440 3002 5320 1867 -10160 -7856 8173
799 8173 8765 -2352 -2748 -3249 -7103 4520 13278 -1642 -11274 -1613 2610 2149 7343 1060 -11860
814 -11860 -5669 8918 6752 -1745 -2641 -4847 -4684 6023 10351 -2519 -10654 -1704 4025 2710 4869
829D869m280j1574N537J5012l371r503J281j996j388J1724M163j4653n231R033
843c77K872L80L108p129r628P620J2340l800p837p05j111J382R450J994j2874
858d315m653R100L752j681K866o033r545Q534J1919o278o820J555k613J050J0940
873G778m18j3101j206P764J595K89K181p470o733Q349R534n346o017O10j815J750
889b256J0021j388j2982o32R209L08J13K425p854o527J0589P556p281m321J599
904a421k966K689R887l277j1766J035P930l62P28J596p774m738R609P359p313
919A216m446J866k371K292R371l159j1926J492Q367p29J59J717p627l881J0005
934B346N747p728l245J184j802L393P762m535r952K599O623l55N13K3o991k410
$$ plain form
829 4869 589 -10985 -5448 9564 6193 -3310 -2029 -4025 -5413 6311 10474 -4179 -9410 -377
843 -377 2495 2875 5983 -1146 -10774 -3154 9186 5386 -2451 -3156 -4267 -2885 6565 8559 -4315
858 -4315 -8968 132 3884 2203 5069 -964 -10509 -1975 9944 3666 -3154 -1599 -4212 -3162 7778
873 7778 7360 -5741 -6947 817 2412 2701 4882 -2588 -9321 -972 8562 3216 -2801 -2191 -4006 -2256
889 -2256 7765 6377 -6605 -7237 1972 2280 2393 4818 -3036 -9563 1026 8582 1301 -3020 -1421
904 -1421 -4387 -1698 8189 4912 -6854 -5819 2111 1749 2477 4073 -3701 -8439 1170 8529 1216
919 1216 -3230 -1364 -3735 -1443 7928 4769 -7157 -5665 2702 1973 2132 3849 -3778 -7659 2346
934 2346 8093 365 -2880 -1696 -3498 -105 7657 3122 -6830 -4231 2392 2037 2550 2573 -4418 -6828
950f828R501M309o993k761J130j977M141P060n229r141L331N685r31J516m56p897
966e540l88R650K364o771j230K17k105N152N927o500p538M472M589j017J235m24
982B093p544O8R592J555p060p99R42k031M489O039p028p174N193M637j805J211
998B378o01p515Q41R957j23o583j74J65j267M548M853p143n605M803M322j839
1014A017J585j283o710J786Q312p70n831L60P9j405N272L218o892m251M976K580
1030B043j482K460k267o308K724Q023j894n021O35l77j322N799K687p734l102
1045e136N434J574j115K224k308o402L017Q009k062n394J105j20j206N290K489
1060E399p694l104N933J696j416J722k509n807L865P318k874n120J848n49p12
$$ plain form
950 -6828 2673 6982 -11 -2772 -1642 -3619 522 7582 2353 -6788 -3457 2228 1297 2813 2357 -5540
966 -5540 -5928 3722 6086 -685 -1915 -1698 -3803 1349 7276 776 -6762 -2290 2299 1282 2517 2093
982 2093 -5451 -5383 4209 5764 -1296 -2095 -1153 -3184 1305 7344 316 -6858 -1665 2972 1167 2378
998 2378 1777 -5738 -4897 5060 4937 -1646 -1820 -1655 -2922 1626 6479 -664 -6269 -1466 2856 1017
1014 1017 2602 1319 -5391 -3605 4707 3937 -1894 -1534 -1455 -2860 2412 5630 -1262 -5513 -537 2043
1030 2043 561 3021 754 -5554 -2830 5193 3299 -1722 -1087 -1464 -2786 3013 5700 -2034 -5136
1045 -5136 298 1872 757 2981 673 -5729 -2712 5297 3235 -2159 -1054 -1174 -2380 2910 5399
1060 5399 -2295 -5399 534 2230 814 2536 27 -5780 -1915 5403 2529 -2591 -743 -1292 -2004
1075b004N510J086p480k032N793J347j434J499l225m364M094O463l262m157J242
1090i24o27J87M897K11p018p75N078R97j347J147k792m108M803N144l635l687
1106b449J976j007r0N239n61o585j9N196n15m92J198k900l627N219M056l873k525
1123a759J608j394L76M938o03o679P80M171j47r24J834l880k582M860L544l939
1139B04j885J587j546Q30M439j238o039J248M101r28j05J359l709k638N519K700
1155C899m112j335J262j653J364M659k156n588J495L880q26k87J155l875j554
1170c672N349K447m857n95J263j923J772M046k569n370K426L278j294L76R39l811
1186b195j265N540J273l930m18O46j372K092L180k866m236K293L166j459O07J67
$$ plain form
1075 -2004 3506 4592 -2888 -4920 873 2220 786 2285 -940 -5304 -1210 5253 1991 -2166 -924
1090 -924 -1551 -1364 3533 3744 -3274 -4049 1029 2026 679 1826 -966 -5074 -271 4873 1238 -2449
1106 -2449 -473 -1480 -1570 3669 3108 -3477 -3496 1700 1185 693 1891 -1009 -4636 583 4639 766 -1759
1123 -1759 -151 -1545 -1169 3769 3166 -3513 -2733 1438 1291 367 2201 -1679 -4261 599 4143 204
1139 204 -1681 -94 -1640 -810 3629 2391 -3648 -2400 1701 773 668 2027 -1682 -4320 1199 3899
1155 3899 -213 -1548 -286 -1939 -575 4084 1928 -3660 -2165 1715 889 602 1757 -2118 -3672
1170 -3672 1677 4124 -733 -1328 -65 -1988 -216 3830 1261 -4109 -1683 1595 301 677 1616 -2195
1186 -2195 -3460 2080 3353 -577 -995 -349 -1721 371 3551 685 -3551 -1258 1908 449 1056 1223
1202A223l712o23N486N13l988n9Q83j414K283K923l550l756L064K329j546O77
1218G33J86l467K52M713L6l859M88P74j242J819K677l142l445K862K049j580Q39
1235F93K0l142j4M904j97l679N11N96j112K170K488m151k213L181J146j183R37
1252I55l00l007J207L886j027k795N58M60j235K127K045l673k239L243J255j512
1268e2J293m08m133J854M837j998k584R34l63r39L090J148l976j103K886L59p42
1285A03N30n09k593J785L176j379k187O47K21q44K158J711l865j436L058K20r12
1302a16J641j359l000K266L378k413j749J544j084l92L057L08l628m72K706j34
1318E53l41O89j311k053K091L114k144j892R85L81j203K631M86l993j33L659j274
$$ plain form
1202 1223 -2489 -3112 2374 2887 -1101 -1160 -277 -1691 592 3515 -35 -3791 -727 1602 56 733
1218 733 919 -2548 -2296 2417 2453 -1406 -918 -144 -1386 433 3110 -32 -3477 -615 1434 -146 693
1235 693 713 -2429 -2443 2461 2264 -1415 -904 -308 -1420 750 3238 -913 -3126 55 1201 18 955
1252 955 655 -2352 -1145 2741 1714 -1081 -523 -63 -1298 829 2874 -799 -3038 205 1460 -52
1268 -52 1241 833 -3300 -1446 3391 1393 -1191 -257 -620 -1559 1531 2679 -1297 -2400 486 845 103
1285 103 633 124 -2469 -684 2492 1113 -1074 -427 -206 -1050 1108 2819 -1046 -2482 576 796 -116
1302 -116 1525 166 -2834 -568 2810 397 -1352 192 -892 -1284 1773 2081 -1547 -2019 687 553
1318 553 212 901 -410 -2463 -372 2742 598 -1294 -309 72 -1131 1500 1986 -2007 -2140 1519 245
1335B45l92J597j950k349K938K487k490j161J060r09L23K589o13k935l18K662
1351G84q0o87Q75j375j585K371K268k463j587J920r47l69K947o91l617J282K141
1368A187j178m4J378j910j440K476J627k661N9N84r72N09K012m17k939K58K422
1385I51k45p09R20j616j401K829J288k724l85J525j196M55K369j608k586J734
1401c99J472j247P94L63k050l11K350L80j887r4O27o65L08J835r49k525J450J820
1419A272q91k54R60k142l61K459M42k073j83J018j096O73J920j598k039J711J088
1436I06q27P12n02j295l01K228K65j890J45P50j135J144J441j501k020J647J169
1453I36r43L29L13j804N8K380l01j571L66M97j139J410J297k441p63J252Q37o37
$$ plain form
1335 245 -147 1450 -500 -2849 89 2576 86 -1075 -15 -924 -601 1988 1375 -1560 -1878 784
1351 784 704 17 892 -483 -2068 303 2571 108 -1479 441 -506 -875 2072 1381 -2236 -954 1187
1368 1187 9 -35 1343 -567 -2007 469 2096 -565 -506 78 -894 -385 1627 1210 -1729 -1471 951
1385 951 706 -3 917 -699 -2100 729 2017 -707 -1092 433 -763 -308 2061 453 -2133 -399
1401 -399 1073 -174 620 983 -1067 -1378 972 1352 -535 -629 -2 -667 -359 1476 527 -1998 -548 1272
1419 1272 381 127 1087 -1055 -1416 1043 1485 -588 -771 247 -849 -176 1744 146 -1893 -182 906
1436 906 79 791 289 -1006 -1307 921 1186 -704 -559 191 -944 200 1641 140 -1880 -233 936
1453 936 -7 322 635 -1169 -1111 1269 968 -603 -237 260 -879 531 1828 -613 -1376 -124 713 76
1471G6L92k22j325M06J616j5j609M37K97p65R02J335j691j361J880M0o87P10M47
1490H63k408P88K252r85j065M12m4l59J357M91j749n11J215J64n52P69k45j144
1508g51K70K064p54j707J047k27q91J116J220j893q35J810j81n63P95j57j486
1525a123J012J220n38j411Q67j07l35J158N7j384o66J383L28l33P4J74j667J021
1543b70J026o30o19L48Pr11J562Q33k152MJ223j95m99J024m66j735J613P90j202
1562b49j14M56m90l03J277K04j242j28J038m5o49R43n20j275N75J614j187n07
1580f02J057q80l34J335J64j831M91J109m51N0L16p15o58J257M72o16l09K70k65
1599a40j60J229l01j484L57Q58n91p2N99n49p33Q53J163j312k5M78n00p2J202
$$ plain form
1471 76 468 246 -1079 -673 943 928 -681 -244 53 -712 190 1525 -166 -1527 353 393 -294 416 863
1490 863 -1545 -757 1495 510 -555 -143 -187 -546 811 1302 -447 -958 257 421 -131 638 393 -751
1508 -751 -481 1583 829 -878 169 -58 -949 167 1387 -506 -1341 469 288 -275 520 363 -1123
1525 -1123 -111 1109 571 -840 27 -80 -415 743 800 -584 -1250 133 461 128 202 376 -1291 -270
1543 -270 756 126 -493 -145 -138 -1049 513 1346 -806 -802 421 226 -273 751 285 -1450 163 953 -249
1562 -249 -363 93 -397 -700 577 781 -461 -589 449 404 -245 698 178 -1097 -522 1092 -95 -602
1580 -602 455 -425 -759 576 740 -1091 -600 509 58 108 424 -291 -949 308 780 164 -145 125 -140
1599 -140 -300 929 628 -856 -499 359 -232 -304 295 -254 -987 -134 1029 -283 -308 170 -330 -402 800
1618H00k43j285M28Q48o81J89L35n92q54J353M95j144R4N76j050N44R40l82j077
1637g06M04O56q19P22K17o48o16R04P23j228N19k6l96J92J041n94r07P78R0o22
1657c16P45L24j122m13J366k49p37N83k91j75K80R53r78o17N08N13p10L90K39
1676B93j038L5J359m72p20M03L82r71Q14O21q72l96O60k04l84M81L53r06p6J161
1696E23j94q22M65L13j069P35O63n06r40R59J61o91N74M69q12k92R17j70n95L25
1716A3k20k04L46J041o38r06R79j77m11M21J20q76J74O70J12p39K94R2n67P11
1736B35M29o71n83O25j40k46R83l24j155M02P02k1m48L60q0o23R64K32j060m69
1756h88J009j49l33M91k26n05M73N39k54k81M24o21j97N15N21p95n6N84j91J2
$$ plain form
1618 800 557 -728 -300 548 -133 56 391 -201 -1055 298 793 -351 -257 319 -731 -187 753 371 -706
1637 -706 -302 354 -465 257 474 -174 -790 114 837 -391 128 102 -294 -102 939 345 -562 216 306 -316
1657 -316 429 753 -369 -782 584 335 -402 181 -110 -285 -5 948 -30 -647 -139 374 -336 54 293
1676 293 -745 -710 649 177 -543 -140 242 -729 85 706 -166 -562 98 -106 -490 -9 344 -562 -638 523
1696 523 329 -493 -28 285 -784 -49 614 108 -832 127 288 -403 171 640 -172 -464 453 283 -312 13
1716 13 -207 -411 -65 976 338 -568 411 234 -177 244 364 -512 -338 332 444 -295 -1 91 -476 235
1736 235 664 -7 -590 35 -105 -351 632 308 -847 -445 257 236 -212 148 68 -555 409 641 -419 -888
1756 -888 121 -28 -361 130 -96 -601 -128 411 157 -124 300 -321 -518 -3 518 -277 -333 251 60 72
1776G2M64m74q54P85K95m66j08O28m41m37O88M10p13j01J76J06k0N48m02r18N48
1797b14N67r2l08L9m90k09J047N03p14m69O02m02K59M34m88o59M61M57k27l35
1817b38J44m56J96N56M28j034j14O41l50j39P21n79k84N43M10l15j25J18l61J13
1837a25O73k27k36l57J20j0K75K69n25p38R15N13l81p2K7m11j78R07q8m13k75
1858c37Q73q86P2P72m79m99O52K69n59N48m06o8j66N10r6o75N70k30j84M51K38
1879C70l38m10L89K05l58K30K00o92J77P84j91n77J53n4k18N31L12q14k56O86
1899A29O2j73J53k24n61L35O90k40k95M1M50p70Q60L1p66j36O30O1o30K31K78
1920A56n32N13J36l64j23J91P8l89N20n2n53m7N00kk99L05m2m11K06L77l50k44
$$ plain form
1776 72 536 62 -792 -7 288 -178 -286 342 -99 -536 152 562 -151 -252 -76 30 10 558 156 -762 -214
1797 -214 353 261 -47 -8 -498 -707 340 843 129 -340 262 -140 119 553 65 -594 -133 324 97 -238
1817 -238 -94 -550 -354 202 630 -404 -518 123 -227 -366 355 -224 -508 35 445 130 5 123 -238 -125
1837 -125 548 321 85 -272 -152 -162 113 382 -143 -881 34 547 166 94 121 -290 -468 439 351 -62 -337
1858 -337 536 -350 -278 494 15 -484 168 437 -122 426 20 -48 -214 296 200 -475 95 -135 -319 132 370
1879 370 32 -378 11 216 -142 88 288 -404 -227 557 366 -211 -58 -112 -330 201 513 -301 -557 129
1899 129 191 18 171 -53 -614 -279 411 171 -124 -83 367 -403 457 488 -278 -414 216 277 -353 -122 156
1920 156 -376 137 273 -91 -214 -23 55 -334 186 134 -419 -466 34 32 -267 38 -4 -415 -209 168 -182 -426
1942d26L97N2k78N75J48r85K26L12J72k87L15k79m56N62N05p50N13l39j6j73L48
1963A36L27p84P4N31O8n71O22m96l11K97M07j75j80ml3N1N3M17r82M16M11r0j59
1986B5J01k83j51O33k9j95j64J12J48m07L68mm60L10J88m5o4J21n28j13N92K49
2008D04o90q3N45k60j02L87jn90K41K26O6k98L96m97m14Q68jk32k30K24j30J03
2030f8L26j77j13J10J75n32J77J75j33l37P68k23j43k99O40p34L82O82n02n01
2050c27J08L60k03o0N37n37k08O11J63n33q3K70k95K99L18m56m40N06M2N3N8j0
2072A73l52l02Q00r9m30L06J63m36J35K43k38j87K04n0o8M20j18k95l92R21p0
2093C28p28M4LN52l45L64r6n41J90N14m71K97J51l72k82Q38o4p24K36K49p8k54
$$ plain form
1942 -426 -29 23 -255 320 468 -517 -291 21 193 -94 221 -58 -514 48 553 -197 316 -23 -39 -212 136
1963 136 463 -321 -247 284 352 -219 403 -93 -404 -107 300 125 -55 -59 -92 -41 12 429 -553 -137 274 184 25
1986 25 126 -157 -308 325 296 101 -63 49 197 -210 158 154 -306 4 192 147 83 204 -324 -437 155 404
2008 404 -286 -369 176 -84 -186 201 200 -390 -149 77 143 -155 241 -256 -670 198 197 -35 -265 -41 -171 -68
2030 -68 258 81 -32 78 253 -279 -102 73 -60 -397 371 148 5 -294 346 -388 -6 676 174 -327
2050 -327 -219 141 -62 -122 415 -122 -330 281 444 -89 -172 98 -197 102 420 -36 -476 30 72 125 183 173
2072 173 -179 -481 319 220 -210 96 259 -177 -42 201 -37 -224 -20 -70 -138 282 164 -131 -523 398 328
2093 328 -400 -356 -353 199 -146 218 122 -419 -229 285 -186 111 262 -110 -392 446 382 -342 -106 143 65 -189
2115a89O37q47P7L56Pn28N22J02k23j09K53J96m40J14K49k30%L36l15j89Q6M41
2137C06r5j50j24l46L26M65k78k36j13J37o5K38J52l64k47K95M15k47j41K61k90
2158a01j15N64k98o9j69O09l85lK77l66m62P68l37J4J68k27k20J60K87j30j18
2179a53k0J91k68K69L2n34K35pM98q5J1l33k15L36Q91j199J28K23k49K06L91j26
2201B22m16l78N69m4mM09l54n27M56K14pm82K88L6L09j19J6l41R1L7J83j17L3
2224G4J84m64K57K89k74l19j04J71j31O63l30j5k24L57K01j80Ll58J82R4J04j28
2246E2l19N3L71J38r1j27k98n3M75j18K06n29J04j65K58J69m94n4N21k01N4M41
2268C93m40j60q3J06L70l03J88j28J91NQ6l20n1K0P4L1L83k07m88J22K84l58L15
$$ plain form
2115 -189 448 -399 -322 34 41 -487 35 137 -86 -195 58 254 -186 -72 177 -53 -53 283 -32 -221 -135 306
2137 306 211 61 -63 -409 -83 382 104 -132 -245 -108 -173 65 217 -147 -394 -99 316 69 -72 189 -101
2158 -101 -216 348 50 -19 -188 421 36 33 310 -56 -518 250 -87 -73 95 -132 -352 -192 95 -35 -153
2179 -153 -173 18 -250 19 51 -483 -248 -255 243 158 169 -164 -379 -43 848 -351 -223 0 -249 -43 348 222
2201 222 -194 -572 -3 -47 -51 358 4 -523 -67 147 140 -342 -54 -18 291 172 188 -153 -62 -25 158 41 74
2224 74 258 -206 51 340 66 -253 -357 -186 -317 346 16 1 -223 134 335 155 158 -200 -18 76 180 52
2246 52 -267 -214 157 295 204 77 -221 -274 201 83 289 -240 -136 -301 -43 126 -368 -422 99 -102 -48 393
2268 393 -47 -207 -290 -184 186 -117 71 -57 134 139 225 -95 -146 -126 -52 -21 362 155 -333 -211 73 -285 30
2291C0j08K3Q5J5J73l95j2P3J52p9K79k02n08N65K09k83K31k17j74K71K66l15
2313G9j49l0K51m37K27L51N6n68L97J48n56L93m20Q0P0P1N9k36J70J49l58L77
2335A24J92n39k94M71L62m30M1m9J83k25K71j12q5j24J62R4J64K08n64j84L46
2356A2K35Q0l51j11l8P6L93k16j20k96Q2K41N8K64l61k57O1N82j60l30R9q1K03
2379F5K16m3m21K04m8J62k72K52m89J5J88J12m0n6J95j07j80J72O9k72%k16N79
2402H5R8j89j3k3QRJ40k69K05k70J56K90j41l87J08N22j7K11l43k50r8L1J93k55
2426a99K53p7r1Q0L9K68n81L05R1k18J98J33j0m65Q2J19L27m55L26l87L72J14
2448B24n7n54J33L62k03K83j54j09j03P8L30m84L32q7k2Q0K05R9q70L88L62m4
$$ plain form
2291 30 -78 -55 30 45 218 -177 -189 -116 36 -43 236 34 -474 91 300 17 248 31 -143 128 394 79
2313 79 -70 -100 151 -286 -59 292 348 -220 177 325 -231 162 -258 -178 -108 -37 22 -214 -44 105 -253 124
2335 124 316 -223 -517 -46 316 -114 -73 -122 61 -164 107 -5 -90 -214 -52 42 206 414 -150 -334 12
2356 12 247 327 -24 -135 -173 -97 296 80 -40 -336 -254 -13 45 309 -52 -309 -248 334 174 -156 -57 -138 65
2379 65 281 238 -183 21 -27 135 -137 115 -374 -359 -171 -59 -99 -155 40 -67 -247 -75 -6 -278 -278 -494 85
2402 85 183 -6 -19 -42 -34 -25 115 -154 51 -219 -63 227 86 -301 -193 329 312 523 180 -70 -168 -137 56 -199
2426 -199 54 -23 -114 -34 5 273 -308 -3 88 -130 68 201 191 -274 -192 -73 254 -201 125 -262 110 224
2448 224 167 -387 -254 108 -95 188 34 -75 -178 -100 230 -254 78 -9 -31 49 254 353 -517 -129 233 189
2470A89k11K66n05r5N06o5n16J93J18L70J84l70j95q9j45M20o6%p7l54K50M64
2492B72lk92L0k38J94K32J17m10n8o7J10L18k46J35m20L37jK45j44K4k52J26M4
2515E3K52n12J08j6K73j35J51k85M0j90N98j20n31K10r6o5O28l3m82j93M6M22
2537A23k02P7K1k70L4L04k09O8n9M5j68K57L72k62m00J78O2J47K74m70j08j65
2559c51O50j33R5k86J35j89K19K2j67rK6N1k26k22K74O3j00L87mm33J12j31N5
2582a62K59K52m40k93P88m85o9j82R0m5L37p6M75o32j12M5JL09L9k99K6j0K40
2605E6K04m00J60l60L15K94M8p16N49J5k94K83j95J94k37J37M4K33j14m19L69
2626A66l03N0O54q88L21M9l59M96J83n45L0K39k30j65L97j54m52P73L0j27j56
$$ plain form
2470 189 -22 244 -261 -356 150 85 -431 -238 -120 250 434 64 -131 -220 -365 55 -11 -11 -88 -442 -192 272
2492 272 269 -23 7 -231 -37 195 312 -98 -156 -223 -113 205 -41 94 -326 11 10 255 111 135 -117 9 53
2515 53 305 -207 -99 -115 158 23 174 -111 -71 -261 337 217 -314 -104 -200 -265 363 330 -152 -345 -299 123
2537 123 -79 -2 19 -251 -217 87 -122 -54 -113 -68 -236 21 393 131 -269 -91 -29 118 392 -78 -186 -351
2559 -351 299 166 261 -25 110 -79 140 162 -5 -14 12 63 -163 -385 -111 -48 -148 239 235 -198 -86 -217 -162
2582 -162 97 349 -91 -384 404 -81 -150 -332 -242 -287 50 -26 449 -183 -295 -250 -249 60 99 -200 -174 -184 56
2605 56 260 -140 20 -340 -25 269 317 -399 150 165 -129 154 -41 153 -84 53 97 330 216 -203 166
2626 166 -137 -87 567 -321 0 49 -310 186 369 -176 -146 93 -137 -302 95 -59 -511 262 292 165 9
2647In1j81K89R0k47k55M82k22O4J6J0m0m46N63J64j05k30L37m18J37K53j07l17
2670b05j43N22j67L47m73J10j99O16j83j37j31j15J63k57P94j43m86k5M19k52
2690E5o1l3Q3M4R2K08l95nJ28r7K37j58l0k29N9K43j89k51M12l99K08M3L58l63
2714d0l69O18p9j0P0P0n21L11L4p9k03N24l59j13M59j22r5j01J38j22M8q9K11
2737A81m61K41p1K57l32M16j29l80K77J72j38k91K99j01K33l34J38k45K85j11
2757i4O1o2J51m24J66J92J62q4O9k84N8K33L73o80j56N57j60k39L31j23j98k6
2779a77K19m5M9j23K59k98K27J75J0p14M22o8K32j98j92K77N1J62j49k14l91R01
2801D15l17m8K91l44j11R1O2j71l0L03l20O1J21J70o86N10J94l30M51r9k64l52
$$ plain form
2647 9 -42 -223 66 156 -91 -346 136 -86 -22 -6 4 -36 -482 81 245 140 -90 247 -171 -34 219 112 -205
2670 -205 -348 174 7 354 -119 -9 -208 408 225 88 -43 -158 5 -252 542 399 -87 -112 307 55
2690 55 -6 -39 44 88 180 388 -7 -12 116 19 256 98 68 -161 -102 141 -48 -299 113 -286 -78 -35 323 -40
2714 -40 -409 209 130 120 190 260 -261 50 84 5 -198 326 -33 -146 313 191 96 -5 133 11 59 -30 181
2737 181 -280 -39 -110 147 -185 231 102 -278 -1 171 33 -258 41 -60 173 -161 -23 -268 17 -94
2757 -94 -33 -95 56 -368 -202 -10 152 68 137 -147 -89 144 517 -163 -319 238 78 -161 170 47 -151 -177
2779 -177 42 -3 46 -77 182 -116 111 286 296 -418 4 -64 168 -30 -222 55 106 268 119 -95 -486 415
2801 415 98 50 341 -3 -114 -23 39 -132 -162 141 -179 -118 3 173 -513 -3 191 -139 312 213 -51 -403
2823d03P36nm58J17l37M84l82O49m12J2l18K45M31j80j69Qj33J90j17l5P8j20
2845a19J24j03L04l59k35M76r7j54M65l82L04m75O29n07M12m22K38j23J19R8R7
2866B90l80q8O03l34k00K57m94K48K28j83L20k48L24o15K30K17p1j08j76L29J90
2887C39l15K85k79k16K12J48j47o4O2K7m3K94k94j72L87k20J71q1J5k05K26k33
$$ plain form
2823 -403 333 328 -130 -13 -350 134 -248 401 -11 1 -317 -72 359 179 10 18 -115 75 -42 -77 1 -119
2845 -119 5 -98 206 -153 -388 88 -9 -163 302 -80 224 -251 378 -129 283 -139 99 -24 95 193 290
2866 290 -90 -178 425 91 -109 148 -346 -98 130 -53 267 19 343 -272 -42 175 104 -4 -180 149 339
2887 339 24 309 30 -186 26 174 27 -37 25 52 9 303 9 -163 224 4 175 94 109 -96 130 -103
$$ [...]
8191a75
##END NTUPLES=NMR FID
##END=
