##TITLE=1H_DE-63_34R
 D2O
 8 sc, 
 15.8.2024
##JCAMPDX= 6.0         $$ Bruker NMR JCAMP-DX V2.0
##DATA TYPE= NMR FID
##DATA CLASS= NTUPLES
##ORIGIN= UXNMR, Bruker Analytische Messtechnik GmbH
##OWNER= root
$$ XWIN-NMR		Version 3.5
$$ Thu Aug 15 13:52:45 2024 Russian Standard Time (UT+4h)  she@DPX200
##.OBSERVE FREQUENCY= 200.1318
##.OBSERVE NUCLEUS= ^1H
##.DELAY= (6, 6)
##.ACQUISITION MODE= SIMULTANEOUS
##.ACQUISITION SCHEME= undefined
##.AVERAGES= 8
##.DIGITISER RES= 18
##SPECTROMETER/DATA SYSTEM= spect
##.PULSE SEQUENCE= zg30
##.SOLVENT NAME= D2O
##.SHIFT REFERENCE= (INTERNAL, D2O, 0, 15.7039)
##AUDIT TRAIL= $$ (NUMBER, WHEN, WHO, WHERE, WHAT)
$$ ##TITLE= Audit trail, XWIN-NMR		Version 3.5
$$ ##JCAMPDX= 5.01
$$ ##ORIGIN= Bruker BioSpin GmbH
$$ ##OWNER= she
$$ F:/spectra/data/she/nmr/H-F/1/audita.txt
$$ ##AUDIT TRAIL=  $$ (NUMBER, WHEN, WHO, WHERE, WHAT)
(   1,<2024-08-15 13:51:51.93 +0400>,<she>,<DPX200>,
      <created by zg, POWCHK disabled, PULCHK disabled
       configuration hash MD5:
       00 E9 B6 7A A2 85 ED C7 34 08 36 98 17 FE 4E 26
       data hash MD5: 16K
       EB 97 8F 46 3A 38 DD EC 0B CB 03 60 25 75 91 49>)
$$ ##END=
$$ 
$$ hash MD5
$$ 48 17 F3 F7 F1 84 83 76 F4 FF C2 24 FB 06 18 C7
##$RELAX= 
##$RELAX= 
##$RELAX= 
##$RELAX= 
##$RELAX= 
##$RELAX= 
$$ Bruker specific parameters
$$ --------------------------
##$DU= <F:/spectra>
##$EXPNO= 1
##$NAME= <H-F>
##$PROCNO= 1
##$TYPE= <nmr>
##$USER= <she>
##$AMP= (0..31)
100 100 100 100 100 100 100 100 100 100 100 100 100 100 100 100 100 100 
100 100 100 100 100 100 100 100 100 100 100 100 100 100 
##$AQSEQ= 0
##$AQ_mod= 1
##$AUNM= <au_zg>
##$AUTOPOS= <>
##$BF1= 200.13
##$BF2= 200.13
##$BF3= 200.13
##$BF4= 200.13
##$BF5= 200.13
##$BF6= 200.13
##$BF7= 200.13
##$BF8= 200.13
##$BYTORDA= 1
##$CFDGTYP= 0
##$CFRGTYP= 5
##$CHEMSTR= <none>
##$CNST= (0..31)
1 1 145 1 1 1 1 1 1 1 1 1 1 1 1 1 1 1 1 1 1 1 1 1 1 1 1 1 1 1 1 1 
##$CPDPRG= <>
##$CPDPRG1= <>
##$CPDPRG2= <>
##$CPDPRG3= <>
##$CPDPRG4= <mlev>
##$CPDPRG5= <mlev>
##$CPDPRG6= <mlev>
##$CPDPRG7= <mlev>
##$CPDPRG8= <mlev>
##$CPDPRGB= <>
##$CPDPRGT= <>
##$D= (0..31)
0 1.2 0 0 0 0 0 0 0 0.06 0 0.03 0 0 0 0 0.0002 0 0 0 0 0 0 0 0 0 0 0 0 
0 0 0 
##$DATE= 1723715511
##$DBL= (0..7)
120 120 120 120 120 120 120 120 
##$DBP= (0..7)
150 150 150 150 150 150 150 150 
##$DBP07= 0
##$DBPNAM0= <>
##$DBPNAM1= <>
##$DBPNAM2= <>
##$DBPNAM3= <>
##$DBPNAM4= <>
##$DBPNAM5= <>
##$DBPNAM6= <>
##$DBPNAM7= <>
##$DBPOAL= (0..7)
0.5 0.5 0.5 0.5 0.5 0.5 0.5 0.5 
##$DBPOFFS= (0..7)
0 0 0 0 0 0 0 0 
##$DE= 6
##$DECBNUC= <off>
##$DECIM= 24
##$DECNUC= <off>
##$DECSTAT= 4
##$DIGMOD= 1
##$DIGTYP= 9
##$DL= (0..7)
0 120 120 120 120 120 120 120 
##$DP= (0..7)
150 150 150 150 150 150 150 150 
##$DP07= 0
##$DPNAME0= <>
##$DPNAME1= <>
##$DPNAME2= <>
##$DPNAME3= <>
##$DPNAME4= <>
##$DPNAME5= <>
##$DPNAME6= <>
##$DPNAME7= <>
##$DPOAL= (0..7)
0.5 0.5 0.5 0.5 0.5 0.5 0.5 0.5 
##$DPOFFS= (0..7)
0 0 0 0 0 0 0 0 
##$DQDMODE= 0
##$DR= 18
##$DS= 0
##$DSLIST= <SSSSSSSSSSSSSSS>
##$DSPFIRM= 0
$$ [...]
##$SUBNAM2= <"">
##$SUBNAM3= <"">
##$SUBNAM4= <"">
##$SUBNAM5= <"">
##$SUBNAM6= <"">
##$SUBNAM7= <"">
##$SUBNAM8= <"">
##$SUBNAM9= <"">
##$SW= 24.0689170037331
##$SWIBOX= (0..15)
0 0 2 0 0 0 0 0 0 0 0 0 0 0 0 0 
##$SW_h= 4816.95568400771
##$TD= 16384
##$TD0= 1
##$TE= 0
##$TE2= 300
##$TE3= 300
##$TEG= 300
##$TL= (0..7)
0 120 120 120 120 120 120 120 
##$TP= (0..7)
150 150 150 150 150 150 150 150 
##$TP07= 0
##$TPNAME0= <>
##$TPNAME1= <>
##$TPNAME2= <>
##$TPNAME3= <>
##$TPNAME4= <>
##$TPNAME5= <>
##$TPNAME6= <>
##$TPNAME7= <>
##$TPOAL= (0..7)
0.5 0.5 0.5 0.5 0.5 0.5 0.5 0.5 
##$TPOFFS= (0..7)
0 0 0 0 0 0 0 0 
##$TUNHIN= 0
##$TUNHOUT= 0
##$TUNXOUT= 0
##$USERA1= <user>
##$USERA2= <user>
##$USERA3= <user>
##$USERA4= <user>
##$USERA5= <user>
##$V9= 5
##$VALIST= <valist>
##$VCLIST= <CCCCCCCCCCCCCCC>
##$VD= 0
##$VDLIST= <DDDDDDDDDDDDDDD>
##$VPLIST= <PPPPPPPPPPPPPPP>
##$VTLIST= <TTTTTTTTTTTTTTT>
##$WBST= 1024
##$WBSW= 4
##$XGAIN= (0..3)
0 0 0 0 
##$XL= 0
##$YL= 0
##$YMAX_a= 211287
##$YMIN_a= -189045
##$ZGOPTNS= <>
##$ZL1= 120
##$ZL2= 120
##$ZL3= 120
##$ZL4= 120
##$ABSF1= 10
##$ABSF2= 0
##$ABSG= 5
##$ABSL= 3
##$ALPHA= 0
##$AQORDER= 0
##$ASSFAC= 0
##$ASSFACI= 0
##$ASSFACX= 0
##$ASSWID= 0
##$AUNMP= <proc_1d>
##$AZFE= 0.1
##$AZFW= 0.1
##$BCFW= 1
##$BC_mod= 2
##$BYTORDP= 1
##$COROFFS= 0
##$CY= 11.3945322036743
##$DATMOD= 1
##$DC= 2
##$DFILT= <>
##$DTYPP= 0
##$F1P= 15.6554695791079
##$F2P= 12.8336369535428
##$FCOR= 0.5
##$FTSIZE= 0
##$FT_mod= 4
##$GAMMA= 1
##$GB= 0.15
##$INTBC= 1
##$INTSCL= 1
##$ISEN= 128
##$LB= 0.24
##$LEV0= 0
##$LPBIN= 0
##$MAXI= 10000
##$MC2= 0
##$MEAN= 0
##$ME_mod= 0
##$MI= 1.114404
##$NCOEF= 0
##$NC_proc= 0
##$NLEV= 6
##$NOISF1= 3.799351
##$NOISF2= 2.8
##$NSP= 1
##$NTH_PI= 0
##$NZP= 0
##$OFFSET= 15.70392
##$PC= 1
##$PHC0= -25995.9
##$PHC1= 6.387481
##$PH_mod= 1
##$PKNL= yes
##$PPARMOD= 0
##$PSCAL= 0
##$PSIGN= 0
##$REVERSE= no
##$SF= 200.130013532006
##$SI= 16384
##$SIGF1= 3
##$SIGF2= 2
##$SINO= 400
##$SIOLD= 16384
##$SREGLST= <1H.CDCl3>
##$SSB= 0
##$STSI= 0
##$STSR= 0
##$SW_p= 3612.71676300578
##$SYMM= 0
##$S_DEV= 0
##$TDeff= 0
##$TDoff= 0
##$TI= <>
##$TILT= no
##$TM1= 0
##$TM2= 0
##$TOPLEV= 0
##$USERP1= <user>
##$USERP2= <user>
##$USERP3= <user>
##$USERP4= <user>
##$USERP5= <user>
##$WDW= 1
##$XDIM= 8192
##$YMAX_p= 0
##$YMIN_p= 0
$$ End of Bruker specific parameters
$$ ---------------------------------
##NTUPLES= NMR FID
##VAR_NAME=  TIME,          FID/REAL,        FID/IMAG
##SYMBOL=    X,             R,               I
##VAR_TYPE=  INDEPENDENT,   DEPENDENT,       DEPENDENT
##VAR_FORM=  AFFN,          ASDF,            ASDF
##VAR_DIM=   8192,          8192,            8192
##UNITS=     SECONDS,       ARBITRARY UNITS, ARBITRARY UNITS
##FACTOR=    0.0002076,     1,               1
##FIRST=     0,             0,               0
##LAST=      1.7004516,     0,               0
##MIN=       0,             -189045,         0
##MAX=       1.7004516,     211287,          0
$$ Real data points
##PAGE= N=1
##DATA TABLE= (X++(R..R)), XYDATA
0 0 0 0 0 0 0 0 0 0 0 0 -8 8 -8 8 -16 16 -16 24 -25 32 -40 45 -51 61 -71 80 -91 105 -119 138 -154 170 -194
33 -194 215 -242 272 -301 333 -373 413 -458 507 -562 622 -688 760 -844 938 -1045 1166 -1308
51 -1308 1473 -1671 1913 -2216 2606 -3127 3859 -4946 6633 -14512 211287 150538 -85505 -44571
65 -44571 -76176 -82038 135504 192448 -80717 -172197 2072 93400 54758 46077 -14147 -121360
77 -121360 -56992 141929 119240 -71020 -88066 -14094 -24600 60915 137310 -46407 -173554
88 -173554 -15300 78779 37627 47262 -26323 -145972 -34428 122098 62526 -38729 -59550
99 -59550 -62864 6431 99586 51777 -65999 -79451 -1622 59647 58543 14695 -45047 -72134
111 -72134 2007 92068 48209 -32507 -29102 -37251 -24671 83892 80013 -63772 -71418 9502
123 9502 2824 36353 75021 -48559 -117112 14943 81750 16962 -9726 -35841 -74781 1512
135 1512 101226 43059 -75017 -72273 5827 39179 44328 34466 -47368 -94861 15753 99239
147 99239 19114 -32164 -12331 -45916 -15220 98314 50773 -78839 -46198 21273 11405 43884
159 43884 46859 -64490 -84613 35950 76504 13396 -23746 -43451 -49023 19299 86242 25202
171 25202 -76995 -58555 20804 35801 29958 17648 -55303 -71095 40659 76369 -10565 -31515
183 -31515 -11784 -33406 13911 79968 5662 -71643 -17333 24039 14197 37066 18206 -59719
195 -59719 -46895 41859 53544 1844 -20489 -27943 -29936 20784 65023 6415 -63796 -27684
207 -27684 24604 16969 21211 12020 -53781 -45002 48182 46596 -20000 -18028 -14500 -29303 25842
220 25842 60576 -13075 -54380 -6779 15404 13096 30902 5721 -50091 -27371 38431 36378
232 36378 -4755 -14074 -18955 -21106 24013 51691 -8304 -51542 -8442 20304 11017 23095 2449
245 2449 -52588 -22631 47235 27243 -16582 -11091 -19640 -21065 32232 42084 -21803 -39551 -708
258 -708 11009 11686 22940 -4164 -42872 -12097 37665 20738 -11914 -9153 -14512 -15195 28515 38618
272 38618 -20850 -37858 5024 13518 7522 23010 -4979 -45978 -5702 40556 12491 -13399
284 -13399 -5714 -17498 -13481 30572 28222 -24024 -29181 5002 9654 7842 16660 -8593 -35966
297 -35966 -2135 34585 10316 -13392 -6841 -13086 -9099 28530 25032 -23699 -25670 7105 8784
310 8784 8887 16880 -11532 -33100 4138 30345 5558 -9322 -6099 -14728 -2916 28087 14898
323 14898 -23679 -18520 6362 6835 9379 11896 -15137 -27963 7785 26354 1462 -8872 -4982
336 -4982 -14372 -1820 27999 10870 -24728 -12920 8144 3578 9275 12923 -16343 -24154 12358
349 12358 22488 -2469 -6808 -3273 -13414 1321 26621 6076 -23596 -9501 8707 3155 8577
362 8577 10324 -16518 -21276 12787 19721 -3896 -6207 -2977 -12216 2114 23890 2971 -22048
375 -22048 -6283 8157 2017 8154 7502 -16785 -15931 14507 16268 -4412 -5449 -3942 -10761 5235
389 5235 21381 -723 -19716 -3886 6956 2236 8566 5302 -17109 -12266 15031 12261 -5568
402 -5568 -3716 -3858 -9644 6909 18511 -3990 -17968 -735 6359 1677 8120 2793 -16999 -8707
416 -8707 15599 9160 -6075 -2741 -3735 -8614 8319 16588 -5751 -15313 1645 5510 681 7365
430 7365 1864 -16107 -5722 15081 6485 -6118 -1632 -3953 -7307 8828 13869 -7392 -13174 2285
444 2285 4215 1042 7228 -203 -14998 -3527 14020 4474 -5598 -1412 -3851 -5855 9334 11410
458 11410 -8151 -11224 3373 3770 772 6978 -1411 -13900 -460 13006 2216 -4595 -452 -4732
472 -4732 -4568 10217 8846 -8698 -8634 3149 2674 1920 6244 -3128 -12161 1146 11771 1424 -4623
487 -4623 -264 -4369 -3405 10038 7035 -9416 -6906 4617 1505 1263 6206 -4217 -11478 3511
501 3511 10137 -720 -3360 127 -5395 -1590 10224 4488 -8941 -4705 3593 1473 2212 4927 -4605
516 -4605 -9913 3715 9594 -1448 -4305 293 -4580 -1510 10022 2681 -9969 -2954 4559 -170
530 -170 2310 5088 -5961 -8015 5537 6732 -2160 -1857 -672 -4894 468 8759 1475 -7895 -2705
545 -2705 3130 509 2158 3555 -5516 -7426 5333 7081 -2920 -2287 388 -4640 798 9485 -746
560 -746 -8660 98 3448 -581 2845 2814 -7038 -4079 5923 4042 -2604 -835 -656 -3373 1374 7131
576 7131 -655 -6965 -705 3175 -374 2175 3066 -6188 -5116 6447 4478 -3561 -149 -577 -4756
591 -4756 3014 7783 -3272 -6618 1359 2071 -19 3460 332 -6423 -1713 5455 2459 -2349 -592
606 -592 -406 -2538 1866 5649 -1490 -5782 1101 2330 -1379 2899 2198 -6398 -3010 6729 1666 -3040
622 -3040 846 -1706 -3574 4168 5579 -3911 -4275 1733 1173 1048 2780 -1280 -5137 -291 5020 1316
638 1316 -2841 -699 -381 -1987 2506 4310 -2943 -4459 2525 764 -1722 3488 615 -6270 110
653 110 5304 -574 -1428 1269 -3006 -2319 4819 2846 -3903 -2342 935 623 1358 2089 -1713 -4096 718
670 718 4464 498 -2723 21 -400 -1948 3408 3536 -4270 -2067 3244 -485 -714 3623 -1252 -5025
686 -5025 1720 3631 -1028 -464 692 -2958 -792 4345 1485 -2802 -1924 403 797 1067 1842 -1656
702 -1656 -3995 945 4472 -648 -2404 618 -1307 -1142 4291 1387 -4713 -497 2700 -1132 -52
717 -52 2695 -2166 -3081 2476 1887 -1217 286 79 -2413 -57 3487 858 -2746 -1450 1063 780 664
734 664 1351 -1403 -3408 2141 3499 -1538 -1358 909 -2012 -10 3887 -638 -3710 1142 2081 -1231
750 -1231 923 1836 -2741 -1196 2273 774 -712 263 -127 -1333 93 2259 745 -2137 -530 1109
766 1109 -13 710 2098 -2137 -3016 2379 2528 -1803 -169 424 -2340 877 3321 -1524 -2675 1140
782 1140 903 -658 1536 310 -2136 -321 2125 397 -631 -187 110 -1224 253 2288 -274 -1964
798 -1964 194 890 -761 1048 1210 -2765 -1480 2626 804 -1619 515 -526 -2151 1399 2520 -1675
814 -1675 -1642 1185 262 229 1312 -271 -1892 -357 1736 237 -1375 108 -151 -905 604 1931 -975
831 -975 -1706 1006 202 -959 1413 734 -2052 -293 2261 -55 -992 568 -825 -1096 1862 1064 -1605
848 -1605 -927 578 52 141 608 -368 -1593 79 1336 429 -681 314 -154 -825 1022 1254 -1357 -1071
866 -1071 999 -77 -548 1329 4 -1795 649 1438 -278 -329 644 -1014 -364 1383 557 -1415 -427
883 -427 364 233 178 793 -367 -1454 293 1050 -364 -662 589 -598 -593 1110 640 -1430 -256 1036
901 1036 -594 156 1369 -512 -1424 931 1059 -423 143 122 -662 -127 1061 515 -809 -329 427 -256
919 -256 32 878 -384 -1126 625 794 -565 -128 505 -637 -495 1231 123 -1012 94 813 -462
936 -462 -124 574 -497 -673 507 386 -490 -23 211 -769 5 699 48 -567 -174 481 28 62 801 -571
956 -571 -1119 745 575 -240 -45 185 -926 -104 1162 -244 -557 337 187 -338 129 440 -974 -521 588
975 588 528 -168 183 109 -525 27 679 -40 -401 71 233 -215 414 876 -170 -34 403 213 -383 111 54
996 54 -242 129 795 -582 -532 147 53 -365 296 112 -580 -398 356 461 -298 330 181 -105 265 455 -600
1017 -600 -584 143 63 -355 88 200 -382 -302 483 -174 -163 7 -95 -315 539 421 -315 -68 53 -194 -28
1038 -28 295 346 -739 -67 728 -92 -180 444 -336 -429 200 352 -269 -93 441 206 19 169 283 -519 -94
1059 -94 289 -21 -119 -16 -41 -271 155 255 -650 -98 170 -164 -46 413 116 -48 -72 289 -144 -148 500 -26
1081 -26 -517 500 279 -526 -80 97 -173 -159 333 205 -455 -27 137 123 48 182 -8 -128 389 -111 -338
1102 -338 -332 330 135 8 423 -175 -413 299 253 -259 5 -7 -149 -146 570 185 -304 -19 -19 208 -92 183 96
1125 96 -168 -107 -114 53 -122 163 -83 162 47 -365 -262 5 124 -390 46 -12 -242 -319 24 271 -153 27
1147 27 142 -145 -15 35 -31 -68 47 211 -211 -23 91 -277 -33 -237 -181 135 162 -211 -237 -15 -172 -149 -88
1170 -88 -61 97 -10 -24 151 -275 -76 265 40 -245 198 -348 -208 146 -100 167 -211 42 9 3 231 -159
1192 -159 31 122 74 88 -230 52 49 55 -201 204 -269 -283 196 -113 -43 204 -186 -73 -331 330 129 -41 338
1215 338 -168 -71 33 -103 48 116 53 0 -231 488 173 -83 -390 -143 83 132 -56 -75 -150 73 -247 -340 -192
1238 -192 215 -327 24 313 136 -22 -223 -30 -160 200 250 -141 2 215 90 -129 -16 227 210 194 -226
1259 -226 112 -71 -32 32 161 -101 93 13 42 90 363 159 -186 84 -262 -510 -79 -79 117 296 -52 177
1281 177 125 -118 -56 -84 2 -168 -177 231 -250 6 -94 143 -68 -234 -125 -267 -184 178 -113 -48 -101 279 245
1304 245 -160 -277 -105 174 -152 18 -27 -364 55 79 -53 -30 41 48 -322 30 161 18 263 62 -91 -218
1326 -218 145 -69 -34 -47 -272 32 25 109 42 -197 -223 -261 -147 -47 121 -90 25 56 -116 -41 77 -235 -140 -25
1350 -25 -29 29 72 62 88 -82 -203 -51 -57 -118 22 34 -137 -118 -186 14 9 -160 -16 -21 -149 34 1 211 -89 -19
1376 -19 -25 -100 -114 -92 -99 256 -81 22 -88 273 182 -157 78 -132 -19 75 -39 29 -187 -43 -81 -8 -128 -156 0
1401 0 116 -59 54 66 -387 107 -171 258 -121 196 183 70 274 -114 321 229 -17 -219 266 -154 47 -284
1423 -284 -9 -137 76 -112 125 178 -58 -197 22 99 -128 312 225 8 49 -43 133 32 253 -142 -335 -123
1445 -123 198 -32 -117 -342 37 97 258 247 131 -290 43 -53 277 50 198 -113 16 -60 -75 107 18 103 85
1468 85 219 -167 -268 154 92 127 -52 115 -138 -93 73 -58 -6 161 -239 19 25 166 264 -174 -38 166 0
1491 0 -174 139 50 154 101 -266 32 198 56 9 -36 -178 118 -187 -100 226 332 -193 -188 111 -147 -209 -72
1514 -72 113 -29 229 71 2 -133 114 69 240 85 123 46 346 163 -70 -277 66 -232 154 -133 -126 -128 -216
1537 -216 231 -177 88 144 205 -189 -117 91 -188 -173 170 131 -85 88 115 212 0 122 11 3 215 -4 -319
1560 -319 31 -222 -156 153 -157 -44 -35 -59 -299 -77 -11 -204 -80 -199 145 -238 -167 243 26 78 100 102 75 -116
1584 -116 -90 40 -53 -88 -59 -235 -41 131 153 -167 195 -35 -75 174 148 -231 163 -24 20 -19 251 -1 -69
1607 -69 182 64 0 -4 137 76 -38 126 291 -390 127 -181 -146 249 18 6 -57 8 -49 -18 48 4 -106 -131 -118
1632 -118 -97 132 132 154 -160 -26 42 142 -19 -65 162 84 51 242 -3 -66 435 -94 -184 133 72 228 18 -54
1656 -54 48 -135 -156 110 240 -302 256 -12 8 194 117 -33 -65 -142 237 -262 13 -103 60 284 32 125
1678 125 -126 64 -96 165 181 -229 -4 -350 291 -101 -181 215 146 70 -103 226 126 18 221 -130 -252
1699 -252 274 -254 -333 192 -46 -83 -8 -76 7 10 75 49 -4 117 -66 67 -125 -168 9 18 -121 -124 62 338 -4
1724 -4 -196 -154 48 92 -245 -240 -96 -90 60 48 198 0 284 43 -266 -63 107 63 -26 214 243 -241 -44 245
1748 245 -37 56 -5 -105 -73 187 280 -393 6 28 20 -102 -31 61 -20 -74 -54 -220 -189 267 -42 -345 17 334
1772 334 -243 -51 195 -64 -180 97 -56 91 -62 -20 217 222 17 -109 -59 165 53 -236 -133 172 -297
1793 -297 -160 173 -15 53 -28 142 84 314 -148 -160 114 -8 75 273 8 -296 54 -10 -352 207 252 287 1
1816 1 -32 -70 141 -37 232 36 148 -178 129 -501 -131 29 229 -311 -212 210 -17 -243 -247 320 -313 68
1838 68 151 -207 -419 38 -315 0 188 126 -237 170 -70 -159 -19 -348 133 -267 116 -65 -155 9 -1 -56
1860 -56 -252 -97 152 157 8 -279 81 -200 -71 -239 -275 -67 259 -204 115 -58 -30 81 74 269 47 90 -237
1883 -237 12 -134 -52 93 -407 64 52 -16 -221 2 52 -158 78 40 -143 -164 142 257 -187 288 -52 -23
1905 -23 -455 120 -120 -127 -85 9 -188 -163 -95 155 296 65 26 -267 218 -127 -37 -123 -293 25 4 -224 24 53
1929 53 -149 359 -72 -285 157 144 -173 153 -109 -168 41 231 180 199 -7 9 -111 -7 72 51 44 236 40
1952 40 -277 156 93 -28 -143 111 -27 185 106 -136 91 48 113 -14 173 229 27 -87 287 -83 -232 -297
1974 -297 -349 -21 249 107 64 -68 -30 -96 -47 -201 109 22 276 204 -32 71 120 77 68 81 -185 86 -49 112
1998 112 12 -15 -67 115 -159 -357 97 64 -116 -173 188 -148 -49 153 -141 -156 -49 74 -212 -121 -195 -69 -200
2021 -200 -212 74 71 -72 -274 15 -79 -213 96 -19 -112 7 -148 -164 -18 6 84 289 156 66 128 16 301
2044 301 9 -320 218 47 198 181 22 -104 -94 -234 -74 47 -149 -100 -206 336 140 -187 48 6 42 -110
2066 -110 113 139 139 -37 86 272 -190 -93 -3 219 161 362 103 -222 17 39 44 52 -97 -33 -64 98 8 113 297
2091 297 58 -34 36 -105 66 455 55 -69 -104 9 45 -82 -180 159 90 -157 -102 -80 -20 -118 -85 -90 24 -55 234
2116 234 -18 -155 71 -158 -91 57 -3 295 -7 76 213 -50 106 70 -47 -86 69 161 195 -8 31 204 -225
2139 -225 -41 82 -125 179 -52 -64 -137 60 225 85 62 -64 -183 -87 225 -27 25 -86 -40 91 136 42 71
2162 71 -1 131 166 -34 -21 -151 -58 276 -74 -65 -209 118 -131 -172 156 -11 52 320 173 38 -46 -295 -124
2185 -124 -359 -37 25 -7 39 5 -20 -400 19 -85 -151 -112 -12 -88 348 -56 110 -335 228 -150 119 192 55
2208 55 -570 -18 -17 -27 -2 -23 -24 -52 -12 -317 107 72 124 217 -260 8 0 -31 90 87 -206 -67 267 -23 -351 -42
2234 -42 -185 13 -15 -72 50 207 97 257 65 -210 -50 -36 99 -85 244 -174 86 -74 18 -256 -120 -309
2256 -309 14 0 116 -241 -41 -101 -85 5 -113 -32 8 16 300 11 88 -187 86 -178 -96 -13 58 -233 96 -62
2280 -62 59 -123 -184 239 -312 -41 142 -117 -275 -8 -133 -48 60 169 18 -40 -231 6 233 150 -40 60
2302 60 -203 18 -36 -358 44 -157 154 83 -287 203 -91 -140 290 48 -111 18 -185 -105 -90 115 -27 97
2324 97 -212 -276 -144 -46 64 135 22 -77 -53 130 -168 -115 -203 -18 194 -60 -37 -47 204 41 296 65 30 94
2348 94 16 91 -6 174 134 -107 -26 43 -85 -13 94 -48 -24 164 -165 37 -157 110 -72 151 139 -33 52 -166
2372 -166 124 -39 13 97 234 -31 403 -231 62 238 251 196 -72 287 -259 -66 107 20 -166 -8 -131 -214
2394 -214 204 -223 219 42 -121 234 -25 -243 -303 178 91 -87 7 -264 -96 22 217 304 -51 275 -203
2415 -203 58 -249 -209 -114 29 29 -160 33 -266 73 64 55 -299 -153 72 246 -205 -163 98 11 -216 -77 176
2438 176 39 -141 573 139 26 320 -123 -201 -3 26 164 -155 -39 209 -125 -9 -32 -58 -240 55 -57
2459 -57 21 102 -244 -243 -463 -50 40 -284 -11 -23 -108 -141 -348 51 29 -29 -105 86 126 125 96 -20 48 31 -245 -45
2485 -45 -50 -14 287 -42 95 62 130 -87 -46 236 131 -188 241 -23 -87 -1 318 4 -190 -131 -113 253 38 143
2509 143 71 -49 -188 -12 -177 -37 -95 -278 65 -269 106 -209 227 301 -257 56 -106 -176 -182 -324 -303 -421
2531 -421 -51 -41 -142 85 201 107 10 217 100 147 190 76 -10 23 340 -115 -166 -116 144 -106 -13 197 -189
2554 -189 9 -53 123 38 190 -67 62 266 7 -282 6 62 -196 197 121 174 -191 -207 428 378 -132 6
2576 6 61 -256 101 48 -115 -130 37 -16 73 52 -135 -326 45 -347 -12 -164 -23 -74 145 -121 -17 -87 -258
2599 -258 -166 -87 152 46 38 44 -46 230 -189 167 327 -25 -147 169 295 137 -246 107 28 69 108 -60 33 32
2623 32 -21 -177 182 -240 344 40 -6 6 -225 -74 214 12 148 16 -75 -238 23 -64 -131 -378 -261 -42
2645 -42 250 86 51 -50 110 184 -48 -198 97 -133 90 4 -106 -299 -255 99 77 33 -231 176 -187 140
2667 140 -71 480 203 46 -40 -389 171 -148 217 191 -137 -23 -101 130 -151 -77 211 8 -238 -52 -169
2688 -169 -167 -147 197 62 200 -75 -195 -144 10 79 -181 -199 -234 22 -40 52 38 -39 -97 -65 44 27 221 -173 162
2713 162 -229 -16 100 92 22 54 -229 -322 18 240 -12 4 202 231 194 207 496 83 144 11 -186 53 3 49
2737 49 -19 -170 -216 -64 -74 272 206 -36 155 181 -53 -348 -137 -84 120 -56 336 152 297 26 22 6 95 33
2761 33 -258 -21 34 -122 241 341 -16 -31 -4 58 -110 -114 52 -113 1 -30 30 -229 -172 124 -293 -175 -40
2784 -40 -96 -73 -84 93 130 -89 54 -40 -249 -159 -49 215 -159 96 -279 234 -106 -199 -228 -170 -134 262 -160 62
2808 62 -95 66 33 94 118 128 -335 -234 236 13 251 -179 -241 68 147 31 116 -159 -106 108 -117 13 213
2831 213 36 177 -141 14 -28 232 -52 397 118 -22 -262 35 17 154 -148 -4 -52 -293 9 -21 -44 -88
2853 -88 110 74 -101 -327 -50 86 -33 -197 76 -24 136 383 122 180 194 111 51 168 -99 -16 91 -128
2875 -128 -326 106 245 -119 -51 -225 11 -74 -145 -67 17 64 28 95 217 491 91 101 30 -3 61 136 244 35
2899 35 -46 -48 123 -54 -81 -48 -186 214 189 -40 207 -67 15 -287 -125 308 -62 -218 -136 14 -24 74 230 -88
2923 -88 40 23 19 184 -73 189 56 -203 -82 -213 -54 436 66 34 -66 138 148 -144 -246 -121 -56 198
2945 198 192 -25 22 299 223 54 -88 163 -177 -134 37 107 -92 148 -289 34 -198 49 -63 153 1 61
2967 61 167 -72 -234 131 -122 68 89 249 -262 67 17 -39 -194 300 -229 -141 -57 -180 -42 -200 38 -16
2989 -16 -101 -162 8 274 -79 -94 -365 -14 14 -34 91 108 211 76 118 -52 -208 -342 110 -102 -136 -183 88
3012 88 -162 241 155 239 19 30 -5 -265 290 220 -39 57 4 -12 46 -335 -145 -2 117 -93 20 63 -66 83
3036 83 258 -151 153 -84 48 244 -5 -293 -3 132 160 -22 -139 84 -73 -69 -41 104 209 46 57 147
3058 147 331 -223 166 -314 -153 -303 -104 -55 32 -126 -202 -4 -136 115 -66 219 -252 304 -80 495 -136
3079 -136 -101 -162 -83 66 158 -49 146 -64 -17 113 -185 -247 -123 -62 -145 0 304 -184 -222 443 -671 41 43
3102 43 69 -133 5 334 -485 9 -45 -182 -125 96 89 -41 -11 -114 -113 218 -393 -201 215 -79 -26 48 128 -86
3126 -86 -289 58 -86 -12 -280 -244 77 148 -110 -151 -192 -157 220 -16 -104 -332 241 -101 -239 3 28 -208 163
3149 163 32 -342 -81 26 -1 14 -31 -31 77 -59 9 -104 59 43 -269 -69 395 -122 85 205 -183 -118 -12
3172 -12 26 -176 66 131 46 -28 232 -16 -77 299 -80 -52 -8 49 54 119 -61 -334 13 -15 116 252 504 -130
3196 -130 -201 -1 154 -8 -55 -232 -142 -278 -124 -110 -216 74 -267 -142 -213 36 325 152 -60 124 -179 119
3218 119 -105 30 99 65 -26 -53 -410 39 174 293 -140 -103 6 -90 -74 -90 36 -59 114 -39 -26 -40 -14 67
3242 67 66 -193 -181 225 -92 85 -31 -32 180 -148 -79 -6 -26 -255 36 21 -259 144 -18 -217 -109 56 -150
3265 -150 19 -120 142 19 -125 -107 -44 212 -200 25 31 -24 -129 -44 87 -191 -151 124 -141 -12 -35 151 -12
3288 -12 148 67 -55 187 230 -18 -42 -81 -79 -46 -242 189 -136 165 -202 -77 64 -29 -41 38 123 269 106 -210
3312 -210 177 243 47 -178 -276 98 205 131 -147 -9 55 -145 81 -88 504 -73 -456 -222 -289 209 -134 -172
3334 -172 44 -116 -25 65 -108 -187 -244 -294 46 -120 124 -54 94 304 36 -103 -47 281 218 109 -1 -34 -85
3357 -85 -2 -139 15 -108 -134 196 -60 158 -182 -54 27 134 16 180 242 224 -244 268 17 -84 -31 -157
3379 -157 326 -112 21 -48 131 -48 123 357 103 193 -19 89 110 107 41 130 25 -42 98 -122 -99 91 -133
3402 -133 260 119 89 305 75 51 -58 9 -39 41 53 -19 -9 -132 -191 -410 -20 72 -102 -94 -183 149 -110 -127 -18
3427 -18 103 -34 -285 -29 -88 69 87 250 -146 79 29 -260 341 -285 -221 68 16 210 -240 -84 -128 24
3449 24 -117 36 -228 63 -44 -20 29 170 39 -63 -72 107 -181 138 130 168 74 -191 90 337 -124 -289 -293 -106
3473 -106 -63 -48 54 -51 13 175 -105 -140 -295 -114 -38 59 -81 -125 -102 25 -28 -133 -86 58 38 14 -200 -237
3497 -237 165 243 251 -264 -136 -155 112 80 -183 -129 29 -251 -13 137 -69 -60 -87 153 -34 -80 -53 -395 -240 34
3521 34 -131 77 -85 240 27 303 -118 3 -28 124 -193 -26 -32 280 284 -150 -37 146 49 -127 -122 284 -65
3544 -65 15 122 -236 -39 58 92 35 -262 -395 -11 20 331 -42 190 169 -110 324 56 -230 74 -77 -249
3566 -249 119 134 8 -1 -15 99 -132 -20 -114 -79 -140 -73 -76 8 186 -253 -57 -102 216 -236 -234 -30 -171 -399 31
3591 31 -82 264 104 229 163 21 -145 -68 42 -93 17 -200 78 241 128 -248 72 105 -170 58 292
3612 292 -171 195 245 46 -30 -221 -250 106 14 183 188 -30 -313 -216 -205 -68 -218 -24 19 -293 -290 252 152 -88
3636 -88 30 -14 -107 25 -306 -131 5 -169 -40 49 56 110 41 79 -104 -164 -84 29 -25 -132 -44 441 -34 40 111
3661 111 84 206 -31 99 92 309 364 -307 -24 -147 -42 167 270 10 -237 137 81 -331 -70 -199 43 102
3683 102 278 -309 88 -47 179 -182 -89 81 -200 255 94 -123 22 2 76 -56 -165 33 -13 -268 -2
3704 -2 94 -224 -81 -295 186 -159 -150 176 183 -2 66 36 -189 59 290 -451 74 -330 -68 200 -194 46 71
3727 71 141 -24 267 -237 149 139 -439 214 -114 185 215 -27 227 -60 -70 -127 14 -89 -116 75 -60 -187
3749 -187 -49 -59 247 -138 -86 63 -314 169 203 -71 -151 -119 -42 -125 120 30 401 53 -76 205 21 11 -46
3772 -46 -164 -215 -74 67 147 6 77 74 -261 84 -200 129 -147 39 -50 59 260 -78 9 -124 20 -24 98
3795 98 76 -41 -93 8 144 -10 24 -318 -317 228 60 -168 106 -169 -176 -286 265 151 138 246 23 6 90 -194
3819 -194 -222 256 83 -67 -38 490 -113 99 -98 -84 36 -435 166 -88 -62 -298 -86 -133 -459 -86 191 -21
3841 -21 265 288 -146 -88 71 200 -68 -188 64 -158 -276 -45 15 177 -273 124 -81 350 -86 -64 -61 -266
3863 -266 111 383 15 -144 56 -390 88 -103 -89 224 -263 -9 162 -39 98 31 -40 84 -413 160 397
3884 397 14 -111 52 95 -87 182 49 79 79 41 290 -91 -67 -314 -151 302 1 -113 443 340 -199 -190 216
3907 216 -110 -222 103 138 -150 -42 -9 70 0 -325 -5 144 -110 -98 31 85 -12 -113 301 289 152 -235 -16
3930 -16 -309 -247 -362 -8 -57 -126 79 -233 261 60 117 106 -26 245 288 314 24 -217 164 -34 71 67 71 -190
3954 -190 -98 -62 92 -62 274 -65 342 166 -256 156 78 -149 72 -139 186 193 227 -104 354 31 211 85
3976 85 -115 20 -156 -15 262 -57 -198 -214 35 43 36 12 30 144 -266 -1 -228 222 -25 109 -30 26 179
3999 179 -266 -67 -186 13 -95 12 -19 120 52 115 -100 -112 208 -221 127 106 103 176 -96 -60 151 -77 -241
4022 -241 -175 166 -302 -120 10 147 -158 -106 -105 -77 25 -60 -236 240 107 -115 -157 -78 -391 -3 -59 61 -31
4045 -31 202 118 -37 188 216 -99 120 48 -12 195 -106 189 -79 274 35 186 -9 138 4 -229 342 -34
4067 -34 -260 98 -217 -60 -50 -83 264 190 -8 -179 -286 -90 123 -16 103 38 137 -220 146 65 190 107 94
4090 94 -425 -96 -7 127 -21 172 60 -33 54 95 -292 341 260 302 -118 -118 358 305 -237 -186 30 76 -223 -276
4114 -276 -11 -158 -28 -62 68 -175 167 320 -391 -58 406 -307 -303 132 -56 142 181 44 -59 105 -16
4135 -16 15 -58 -33 -13 -7 95 4 35 -54 2 4 -140 -150 -84 -20 -11 122 -382 96 325 289 55 -16 -52 -90 156 49
4162 49 -111 -149 -43 -204 140 -117 205 62 -7 -77 -57 192 -167 180 -280 22 83 -128 19 -205 -28 -48
4184 -48 -138 152 -148 242 -409 -63 54 -26 11 -103 -4 -131 89 -251 -213 -43 35 165 13 56 -72 -309 -208
4207 -208 -353 240 -141 -128 110 197 181 29 66 -114 -50 -128 139 15 17 -288 156 -251 74 51 -9 34 253 -217
4231 -217 72 -55 -11 122 109 -110 -510 -3 -82 109 -71 -77 -152 -186 -88 43 -319 88 202 -232 -263 20 204
4254 204 -247 -11 15 -297 191 -20 409 -13 140 -101 -16 53 -369 55 -173 29 -50 -209 5 -484 -67
4275 -67 -85 485 185 -79 -109 37 -85 -147 -64 202 -14 57 -21 11 27 43 -405 -29 406 -122 94 -49 77
4298 77 -201 102 359 -118 -90 265 -15 -233 114 409 59 201 136 -55 68 47 -70 -64 62 37 76 96 -217
4321 -217 -17 155 -172 105 -165 -41 145 -300 129 -68 51 85 44 13 57 65 162 -110 -189 156 346 338 58
4344 58 88 -24 -164 -60 252 484 87 -270 161 -191 -35 -82 130 207 286 -228 133 -56 256 -108 -219 45
4366 45 -45 -100 -34 -2 158 117 -246 189 -22 112 -102 -37 244 -134 52 -63 134 -43 70 -127 -296 -74
4388 -74 -105 -220 -197 138 -54 132 -12 19 105 -379 28 -225 -38 15 152 149 -95 -90 -236 23 169 176 70 -136
4412 -136 140 103 21 61 -103 24 -223 143 52 -161 -130 172 -194 118 -81 46 57 -141 -63 81 49 89 179
4435 179 -85 17 6 107 -111 108 4 145 -149 -71 217 107 143 -47 110 46 -153 209 -161 -120 43 -318
4457 -318 6 -281 -159 -131 -52 -51 -17 -342 66 39 15 -226 111 -33 -55 14 282 -17 243 110 -193 123 -146
4480 -146 42 187 26 18 236 341 108 84 137 -150 -177 56 120 -41 -39 -166 8 -121 -248 -63 -38 53 -168
4503 -168 65 153 25 -11 186 112 -308 204 -159 -166 -465 -295 -142 -100 203 143 177 -166 -78 20 358 -29 -69 -77
4527 -77 38 -108 -8 240 328 0 -109 -105 207 -126 45 48 -271 58 152 210 -1 94 2 85 3 -157 -105 -230
4551 -230 -164 -189 -29 80 240 12 -45 -166 -93 6 37 -62 137 121 31 240 136 -361 83 -156 226 55 -222
4574 -222 -195 307 -341 -86 186 148 58 25 173 -177 -9 -52 14 256 196 62 -95 -53 38 -262 94 -96 186
4597 186 -132 -104 57 303 -214 161 -48 -75 203 -139 -133 -127 86 27 -52 -26 -22 244 158 -250 -41 116 -165 -84
4621 -84 -166 3 97 240 51 85 49 131 -264 -83 -280 78 164 -13 145 276 -35 24 -96 -32 -60 -41 193 -100
4645 -100 114 -44 70 -45 -23 -172 -78 -87 28 -307 -249 -41 -52 156 128 -149 101 -138 276 -130 119 95 171
4668 171 -297 -23 114 -132 136 -237 -177 -166 -176 -297 84 290 175 220 -37 -53 -31 -296 12 92 64 60 47 -38
4692 -38 308 -79 43 -99 132 -135 198 339 250 7 231 77 268 -115 -96 64 30 223 -78 -98 96 -247
4714 -247 -39 162 13 -50 29 67 33 -239 -7 29 -37 227 -15 257 32 103 -106 -208 -198 -21 33 207 107
4737 107 -207 -31 -226 121 142 -136 -172 225 -7 -203 -66 -167 -39 -60 148 -80 -250 118 227 38 35 140
4759 140 -87 132 349 -78 -201 -14 42 28 -85 169 -93 254 -110 117 -240 -187 -177 273 240 -281 171 -88
4781 -88 -39 -55 -115 -17 175 -84 131 126 -153 16 -257 304 -339 -96 158 -160 -169 36 -118 -190 264 -246 266
4804 266 213 46 258 -312 149 70 122 16 255 -161 -223 27 0 35 211 -86 -97 59 -206 560 120 -129
4826 -129 108 149 -49 -147 119 294 -196 442 171 -11 33 -294 -34 323 -18 -49 83 288 26 -19 -122 -6
4848 -6 36 183 175 275 -356 -291 93 -50 -54 -262 -120 -6 343 -176 -83 -72 74 117 98 187 -246 13 70 -12 66
4873 66 12 114 -103 -82 197 144 -109 -311 -109 -232 -247 228 -95 -268 -16 8 92 -63 -235 -116 -60 -187 123
4896 123 209 -229 -74 83 -100 -31 67 111 230 -88 8 306 -423 -72 -12 191 -265 -64 -59 166 177 -22 -49
4919 -49 239 235 -313 1 -30 -310 -103 12 -78 37 -260 85 197 -135 -21 -51 -106 -91 -192 -234 6 129 -231
4942 -231 170 -170 -29 93 -123 -15 -276 222 15 0 -30 -69 -106 123 -56 -136 -70 -79 -206 76 -96 24 157
4965 157 -54 -28 -198 9 -98 -82 123 -71 -168 -53 -94 50 -51 -4 -182 207 67 156 155 -226 227 306 -154
4988 -154 -30 115 255 -276 231 -196 111 310 33 -120 -281 563 -152 17 -88 100 32 -124 9 -29 -100
5009 -100 -81 52 -126 -1 4 -74 10 -99 -204 247 -116 81 -484 50 -128 110 -129 16 134 55 -13 -209
5031 -209 -43 53 70 132 51 -34 155 99 -64 -19 -127 -261 24 -176 330 -31 180 -151 79 91 17 -130 -4
5054 -4 175 -256 48 184 -117 96 -42 -176 84 115 50 162 219 -123 126 -155 234 -46 32 -153 -43 -34 -386
5077 -386 -74 -37 -287 -255 -16 -216 63 -204 54 70 60 97 -40 -12 171 -42 -70 168 -147 -295 107 184 182
5100 182 270 46 -51 37 164 -163 -188 143 -67 67 -97 -12 102 207 -99 128 17 61 -148 -52 256 -19
5122 -19 166 150 26 -89 -30 -144 -217 72 110 -177 59 -76 253 24 210 71 78 156 131 -204 -131 -267 -94
5145 -94 44 -63 1 -106 78 -68 270 -111 -235 -328 466 61 44 -14 -61 -450 188 -243 191 182 175 -188 40
5168 40 65 -8 -146 214 -209 209 -48 -177 164 -375 296 127 -120 -31 -97 -42 -125 -94 221 -141 113 33 151
5191 151 345 249 225 365 -200 86 285 64 48 -291 74 58 -132 224 56 306 285 53 -125 -120 -1 23 157
5214 157 -249 -195 186 73 -38 -93 82 -142 -63 -76 -307 87 -139 38 -73 -189 6 15 169 -43 -119 180
5236 180 283 -53 55 50 25 -156 -235 -214 35 103 -204 216 310 142 -138 52 7 19 -162 84 301 -32 -448
5259 -448 -230 -70 353 121 33 59 264 61 27 27 19 -58 224 29 -203 202 -364 85 123 -296 -301 49 106 249
5283 249 -116 -10 -207 89 -278 -206 131 0 -103 -50 -115 -44 -134 0 -11 250 -68 87 79 -22 144 -101 -291
5306 -291 -120 -124 155 234 -3 169 -20 -237 130 263 -237 -131 113 131 233 -59 116 -128 19 -144 -28
5327 -28 -254 -102 -71 -14 -180 -49 -63 -150 89 -62 -36 -146 72 -58 106 128 161 164 81 -22 83 64 -161 -43
5351 -43 63 -107 84 213 -23 236 -122 166 -219 -304 -303 10 109 -147 -146 -172 -214 -46 -37 -287 58 -186 491 -41
5375 -41 -141 -114 -143 10 8 51 -93 136 129 -261 24 235 -46 -269 -300 -17 4 79 220 -72 41 266 13 -122
5399 -122 -9 -22 225 -95 4 -164 77 154 -116 -102 318 -299 -250 172 2 70 -75 221 -11 -186 82 -65
5421 -65 147 152 -207 92 -198 31 201 67 132 149 35 183 212 -142 292 -311 -65 96 -29 -143 170 -132
5443 -132 61 -4 231 72 255 -160 -166 186 313 181 -92 10 63 -122 -94 -297 -360 -178 -53 158 -36 63
5465 63 75 -154 -241 292 1 -116 -7 42 166 -121 -98 78 -150 -94 272 138 286 -88 -42 92 413 38
5487 38 -107 74 83 189 -63 161 121 -12 23 105 147 -232 -116 79 -280 38 61 -13 -256 138 417 -109 134
5510 134 202 -29 -20 -52 -19 275 475 -34 -61 233 186 147 234 62 -67 43 -42 115 224 -202 -125 -73 52 -3
5534 -3 34 -117 -2 202 -132 85 -67 -202 102 223 165 -70 -97 -51 -179 16 -11 -3 -422 -1 33 -75 -115 220
5558 220 -215 274 -330 -239 -205 -205 -25 23 -100 -113 -87 203 -11 176 -290 -235 -265 8 169 -234 53 88 266
5581 266 -111 108 -47 334 -11 71 -58 -244 155 143 -84 -86 29 -7 121 22 -65 -40 266 7 -175 124 -43
5604 -43 30 -3 -250 112 95 -82 -56 -345 -102 56 316 -58 221 202 150 -50 -155 81 -192 -46 128 68 -227
5627 -227 2 104 30 -93 -296 -116 69 -30 -235 81 221 -66 8 -346 98 -60 28 2 299 -139 -114 1
5649 1 -48 167 -127 466 -18 -110 191 -203 236 -233 -68 234 -377 146 162 -227 166 -248 143 100 54 2 -78
5672 -78 -85 96 123 -73 -104 -408 -208 352 159 175 0 131 -57 103 27 -120 -215 48 132 -86 1 -241 63
5695 63 -251 -5 -137 -8 235 16 -19 -89 -75 138 -134 15 -323 -21 226 237 208 -241 -76 -50 170 -141
5717 -141 -7 -156 230 -149 -155 -65 112 26 213 -142 -99 48 -269 161 145 -93 166 91 -14 -34 26 43 -22 98
5741 98 104 -110 96 -124 -222 -32 106 98 -53 -193 -7 92 118 -73 296 121 -210 149 -16 263 -176 186 -151
5764 -151 -195 157 48 162 -286 137 -40 -97 56 156 57 110 -63 -254 -25 19 -129 -86 94 4 -63 155 -52
5787 -52 -318 26 19 72 -110 108 -150 168 159 -99 11 -41 25 114 -31 322 88 -54 -203 212 -17 160 -211
5810 -211 -231 -185 153 50 -36 -198 100 40 110 17 108 56 13 47 16 179 9 35 -27 18 139 42 43 -244 -96 156
5836 156 -2 130 -3 -171 88 221 -400 -137 178 -69 13 85 -160 189 -232 -277 -172 -248 56 57 222 112
5858 112 203 173 -126 -101 -71 112 174 165 -19 186 69 92 -27 258 33 -93 -94 -279 -266 -90 -156 -166 -123 -114 -116 -83
5884 -83 -185 -329 -117 66 152 149 -15 -18 -50 -132 -34 173 109 -46 15 -60 140 119 -368 228 23 -134 -32 -57 -178
5909 -178 -195 -186 -22 -116 48 160 15 17 79 -59 -118 -220 46 38 107 95 -146 308 -135 294 -155 148 -23 -39
5933 -39 308 -67 -61 -102 195 139 4 158 325 344 -195 44 200 -44 -94 154 292 -79 -324 -149 -138 -45 -158
5956 -158 -181 107 1 149 152 54 114 -43 338 187 19 106 -314 -91 46 1 83 -25 -78 338 116 -206 152
5979 152 -151 -84 -55 179 194 -74 34 -44 102 111 -85 50 -225 41 43 48 217 -80 33 160 56 -120 214
6002 214 106 47 61 143 -115 165 -125 129 168 -74 54 288 -71 -144 54 203 -30 -3 -417 -140 203 115
6024 115 94 -107 -157 -44 -269 -155 -168 -202 -51 -121 -234 -7 -27 145 17 150 154 92 -41 -309 154 -41 91
6047 91 148 -176 17 -370 -117 189 112 225 230 -74 69 207 -209 -161 99 145 -65 81 -274 -146 -130 -175 -10
6070 -10 56 -99 -211 98 159 28 -328 -74 -96 383 45 291 35 -70 9 31 307 -104 -65 -177 -98 9 127
6093 127 -112 178 -131 82 9 -206 366 126 5 290 195 -110 297 -35 180 -18 142 -9 299 243 53
6114 53 -313 247 -251 -309 118 -347 124 -79 -242 138 -159 102 -49 -166 -34 -34 98 41 96 203 104 -32
6136 -32 23 -247 48 67 -189 -197 -198 -121 -106 -191 155 -204 -118 21 -46 259 28 124 -54 90 68 -3 -65 319 -287
6161 -287 57 0 22 -2 113 12 242 271 -68 -179 58 142 15 -5 172 -75 -136 -91 -80 -558 -166 184 378
6184 378 94 103 123 -151 -71 -185 -31 -122 -109 303 147 -2 -189 -142 307 56 -3 -18 81 -76 -304 -201 199
6207 199 235 -120 192 -136 29 -210 47 -117 109 -56 -36 59 23 -107 -292 169 50 435 -67 -232 -237 120
6229 120 75 266 -28 -91 519 146 144 -87 -76 -397 -137 -148 -3 -74 -118 274 -33 69 -228 38 -150 290 -192
6252 -192 106 13 -160 153 121 184 -13 35 -171 52 -188 -71 -285 -431 -153 110 62 132 -209 329 110 -228
6274 -228 110 -270 85 -87 -126 -158 -32 243 -157 -146 59 -68 -232 -166 -129 11 -28 -64 112 -153 210 -28
6296 -28 -69 -105 123 -68 -35 -124 28 100 -95 -70 77 -45 296 26 -92 77 -189 72 98 113 13 60 141 -214
6320 -214 68 -7 -283 43 -436 -133 -25 104 139 -166 11 -262 -353 114 -37 161 -53 -51 89 140 -107 -86
6342 -86 167 -115 -30 -124 29 -22 -117 50 -214 -62 -29 -36 -130 172 123 -12 2 -117 69 121 65 -35 -96 -301 179
6367 179 58 38 -321 -117 0 -91 -5 53 -198 186 -63 -492 -171 332 58 -304 98 -161 87 -74 10 20
6389 20 3 153 -32 35 330 140 121 -230 154 93 42 -93 -310 90 -145 57 70 -234 99 -296 258 235 147
6412 147 173 124 -184 32 -136 -147 -271 -38 198 -109 116 33 -54 -17 -22 18 128 93 202 -28 -24 186 82 116
6436 116 -91 -117 305 -110 138 95 -287 -73 -42 127 116 45 -291 203 52 183 -38 -60 38 52 75 -245 0
6459 0 -160 -32 91 -185 -189 113 -40 29 -77 257 -170 140 -334 -30 -82 -85 231 169 338 -54 127 120 54 -42
6483 -42 59 -279 -208 257 52 16 50 -168 80 26 212 -108 46 -232 46 -87 -31 -59 39 2 -124 124 42
6506 42 -130 -328 -334 261 206 222 84 160 297 -175 -1 -74 189 131 -167 -64 196 -409 -120 179 94 182 112 14
6530 14 -39 -195 -73 7 -270 95 -52 44 -235 -60 -79 36 -23 24 52 140 -124 255 -7 -357 -72 -63 98 -133
6554 -133 135 -204 -296 309 -474 -142 -16 -282 296 21 138 6 -171 -69 134 -133 -199 192 46 320 -98
6575 -98 12 203 -98 320 -44 85 70 -24 -268 31 201 -29 68 43 -352 199 -209 -128 -78 -136 -84 107 10
6598 10 -327 127 22 62 173 430 7 121 277 -238 2 68 -23 -8 -36 102 -48 137 -242 49 182 150
6620 150 402 -293 67 -163 -57 225 -114 140 -389 153 44 271 9 -23 -159 90 87 -16 -263 239 -34
6641 -34 5 -54 162 -142 6 84 -225 -108 -73 -21 -94 81 226 -305 -192 -70 32 -164 -63 67 55 -50 180
6664 180 60 78 22 74 -117 -26 -91 -58 -42 -158 -100 -35 -306 -27 111 -40 241 112 58 -154 -133 45 186 -26
6688 -26 -155 11 -263 205 -187 168 -19 -222 -63 -151 -201 23 68 357 162 -8 80 68 20 220 -51 -354
6710 -354 15 -326 -69 103 113 90 121 -74 -172 429 -259 3 -140 -305 33 -98 -75 -341 330 238 38 -291
6732 -291 -157 3 69 44 154 160 -31 98 -165 -3 -111 -141 118 35 -118 171 126 -121 -66 -52 -11 -66 -126 -110
6756 -110 168 -60 61 327 186 102 -281 -91 48 259 165 -344 -163 -90 31 -217 109 189 17 -70 -71 -34 -253
6779 -253 215 123 -152 -6 -143 -53 53 224 33 -306 -233 -62 -200 199 -234 -12 66 168 357 -28 547
6800 547 -104 36 92 150 14 7 -236 16 155 51 -9 103 129 12 -78 15 -154 -14 -318 -270 56 -46 7
6823 7 -108 -10 20 454 -316 221 110 -197 188 -26 150 109 -41 116 -85 59 131 -41 267 58 71 263
6845 263 -33 151 66 -53 -413 -110 -55 223 191 -214 -159 -510 221 -40 -222 195 173 -209 -195 -140 215 134 -293
6868 -293 -26 -78 -78 228 95 212 -24 82 162 -143 100 107 -70 41 41 -142 -218 296 -311 401 209 261 123
6891 123 -152 0 -75 -185 -25 19 -114 82 39 58 -85 185 -35 -32 15 133 57 -225 -4 -302 37 23 69
6914 69 -67 206 -162 -166 -248 -281 287 74 279 -200 116 13 118 -4 -158 -370 157 106 239 86 91 8 -29
6937 -29 249 67 -403 182 55 -171 105 -122 -99 66 -296 99 311 357 -108 400 5 -130 -131 -71 84 236
6959 236 202 142 457 12 83 15 -222 -25 125 23 167 -187 -89 12 4 -380 -28 80 -88 -65 178 -31 64
6982 64 151 -212 62 98 -3 -33 -273 96 44 -12 -275 -175 168 -83 51 190 27 -143 137 -147 -183 -109 -393
7005 -393 211 315 -186 -21 -83 267 143 -112 36 135 -217 139 63 403 102 13 63 44 175 -373 -32 -62
7027 -62 -59 5 133 -22 -27 54 59 65 29 222 52 39 44 -125 -2 -56 152 142 -69 -28 -247 1 -98 195 -269 -52
7053 -52 42 142 183 105 225 293 -141 -125 177 76 187 -44 82 229 -197 -89 195 -341 162 258 -119 230
7075 230 66 -344 -167 -86 402 77 19 -3 -21 -71 257 329 158 -5 -195 -84 17 -234 -75 -202 -93 322
7097 322 -196 -19 246 155 -373 157 -99 -158 -181 100 59 49 215 -166 -240 -107 311 134 3 32 204 -81
7119 -81 -146 -167 -140 -259 37 -33 141 198 -4 -19 149 11 89 -52 38 62 -239 111 -11 77 -98 108 -113 -229
7143 -229 -32 125 231 83 36 135 -209 137 137 -46 60 9 37 -27 182 198 -54 -54 159 -177 74 7 -163 -63
7167 -63 -114 -139 76 26 -72 -74 50 -159 336 5 226 -177 41 28 -189 -74 -355 61 159 206 10 81 161 0
7191 0 177 -110 72 50 53 -15 -80 -61 106 -241 -72 -258 -179 10 -101 -19 129 99 -5 -166 95 116 -218 -91
7215 -91 -50 172 -68 64 82 143 -10 -50 -177 -125 66 -87 -94 -220 -160 -2 80 -88 22 -38 -141 174 -11 -82
7239 -82 -209 55 -36 -247 238 13 29 -314 53 -105 9 -168 82 -35 -30 167 271 44 83 -45 -12 207
7261 207 80 52 75 -34 -131 -134 -79 -42 19 59 38 -105 104 202 18 -51 -215 33 -26 -52 -253 12 -245 244 31
7286 31 214 -184 -10 106 -22 11 -23 214 -33 -107 -52 -142 109 99 157 21 -108 -25 -2 -206 52 -8 -34 29
7310 29 -106 193 -266 -172 44 -118 3 241 14 28 135 -123 -144 19 -106 -19 -11 -256 130 158 16 88 -77
7333 -77 -131 40 -107 -87 -99 -122 5 -21 -127 -66 57 37 206 8 208 6 -94 244 140 54 3 -261 -54
7356 -54 243 -70 45 -119 -77 54 19 59 -43 -195 -153 -188 -80 -351 297 79 269 269 247 65 -208 210 -123
7379 -123 46 37 -169 -107 56 84 174 174 -104 180 0 236 102 -91 154 -1 192 -188 59 -128 53 -208
7401 -208 211 -187 179 -221 -134 307 131 -35 -289 226 228 -159 122 11 110 -53 73 155 10 47 151 87
7423 87 74 -54 -122 -383 27 238 -119 -25 141 141 -275 -777 99 -122 82 68 22 46 266 -84 -73 -55 -55 -270
7447 -270 128 87 -84 -93 -48 -73 -68 54 -11 55 52 44 -183 162 176 53 -102 246 -10 93 61 265 -96 1 53 -164
7473 -164 -189 -132 111 -259 119 -249 56 -122 -379 7 -46 -130 150 -14 -45 199 23 -89 -286 -151 -73 283
7495 283 106 178 163 47 -49 -24 22 14 53 -336 68 -49 120 35 110 -29 -80 186 -105 12 321 234 -36 -177
7519 -177 166 -400 -39 43 31 109 341 53 -261 115 63 71 -208 -183 -141 -223 -42 -204 -56 233 54 -108 32
7542 32 -183 140 223 -151 25 -181 114 121 100 -44 -147 -98 -81 141 -163 152 -97 -138 22 -202 -61 37 120
7565 120 251 182 257 -324 -140 -63 -31 141 -203 -4 -89 -34 -148 -179 -111 -70 -233 -140 -137 54 -258 91 55 73 41
7590 41 -290 -10 -23 7 -165 -196 -6 -96 -285 98 75 17 149 15 -142 158 -307 -73 -123 41 37 155 205 210
7614 210 37 -58 -29 25 54 -10 -321 130 253 159 96 -441 -84 307 -138 -10 -178 70 -5 1 -144 110 -188
7637 -188 -72 29 -128 54 13 57 242 232 -7 105 -141 -129 -222 -65 20 -241 71 -57 -68 34 -128 158
7659 158 -71 208 -129 -125 289 -187 -192 -53 99 -163 -137 -35 29 51 246 -133 -195 -182 -157 163 93 -201 22 -32
7683 -32 79 -159 12 6 16 192 -162 -129 47 203 -109 -58 59 -133 -80 -70 -103 -146 113 144 144 46 -281 -6 312
7708 312 -185 66 47 187 -193 -139 2 -97 -33 -35 161 -167 293 92 -194 -70 -125 31 -199 45 26 102 100 -156
7732 -156 240 -211 -137 30 -190 -175 -55 -218 67 -1 360 -87 -253 109 128 -148 -133 170 -90 -109 25 22 179
7755 179 236 131 177 71 60 -81 -19 44 -9 93 -170 -75 11 -171 -128 -195 -423 -57 64 -247 -106 21 -296
7778 -296 202 -1 34 354 -26 -49 158 -80 -95 -208 -45 -197 32 -78 136 -78 -4 -1 -56 107 -49 34 12
7801 12 -5 35 392 59 221 155 76 -54 62 -41 -47 22 19 64 -63 -73 107 -56 342 72 101 280 110 -22
7825 -22 -262 51 69 262 64 -120 155 36 -36 122 -25 -54 67 -205 91 -155 -157 17 10 264 -202 -266 186
7848 186 -6 74 183 281 -12 119 -13 -33 47 -209 -212 236 28 65 -25 52 -152 -430 144 -79 80 -381 152
7871 152 -8 421 231 -34 -187 96 -62 92 41 -421 -45 -90 181 66 -119 63 -166 -139 28 -197 -88
7892 -88 -36 -48 60 25 -221 -133 34 147 -86 -155 -150 29 135 89 125 242 -239 -59 35 3 -19 10 65 -155 130
7917 130 -201 -473 56 -47 -158 -71 -43 176 68 12 112 -93 172 -26 -194 2 13 -209 -215 -51 -40 94
7939 94 -200 -180 98 116 84 29 -146 -69 71 31 -254 235 2 182 199 -82 91 167 13 361 -351 -31 63
7962 63 -394 -39 73 -156 -155 -14 9 -31 157 -105 -150 -58 -52 164 -18 53 135 -184 8 -239 -176 96 -92 -251
7986 -251 222 190 -159 -101 182 -296 -53 40 90 156 -170 190 295 138 -37 18 -88 -578 44 91 -236 -39
8008 -39 -42 -9 91 -67 213 -186 218 337 84 -20 -217 -192 -60 104 -74 -325 -182 -342 30 -70 240 -43
8030 -43 -105 -1 78 -50 -146 -63 -15 -139 -279 172 -29 -56 67 -281 -84 31 125 309 304 -254 -222 -126 -186 -123 51
8055 51 -310 -214 118 20 251 172 -76 -52 -95 -66 -139 356 72 -3 74 -234 -166 -19 93 69 -126 -295 63 -139
8079 -139 49 -12 -155 45 -124 50 29 -279 -46 281 -71 -12 391 -110 -12 154 4 -92 -7 112 -242 72
8101 72 51 -227 -30 130 -13 -35 -190 68 6 -213 -54 126 -145 -250 -165 209 90 -82 -202 249 43 105
8123 105 159 -147 -71 -46 473 25 -144 -332 128 -226 92 -2 20 141 -6 117 145 -142 181 -114 -284 -141
8145 -141 95 68 191 -190 -7 21 -17 -121 17 480 15 -214 -14 135 175 -204 -15 438 216 -300 -163
8166 -163 -59 57 44 -13 61 280 -324 135 25 -304 -224 -34 232 -75 132 87 46 -228 174 -144 -216 -227 -82
8189 -82 -267 -168
8191a68
$$ Imaginary data points
##PAGE= N=2
##DATA TABLE= (X++(I..I)), XYDATA
0 0 0 0 0 0 8 0 8 -8 8 -16 16 -16 24 -32 40 -47 56 -64 73 -88 104 -120 142 -160 184 -213 241 -274 312
29 312 -351 394 -445 498 -557 622 -693 769 -856 951 -1050 1164 -1288 1426 -1579 1751 -1943
46 -1943 2159 -2404 2689 -3019 3408 -3878 4455 -5185 6141 -7454 9379 -12478 18284 -32900
60 -32900 145791 182015 -173605 -88895 -7015 -5066 119431 157357 -119471 -189045 39219
71 39219 145211 32978 -21151 -47288 -92204 -23717 140331 90402 -116701 -122110 23675
82 23675 32581 41903 81604 -64980 -174580 13817 135327 30782 -17563 -38279 -108435 -2287
94 -2287 148059 55440 -83746 -64116 -13071 40463 94187 27775 -86933 -67594 36628 79690
106 79690 38577 -23474 -57766 -46045 27025 91067 27517 -69066 -47628 -4857 3046 64837
118 64837 54897 -83813 -87498 35717 39402 13953 35548 -50748 -106131 33584 106118 1614
130 1614 -49517 -31491 -35367 24149 96685 22183 -93698 -61554 43758 65486 26455 -2744
142 -2744 -50044 -67769 35754 107850 6372 -70255 -19599 -7251 1133 79266 35332 -96905
154 -96905 -54647 52210 31099 12411 16145 -63198 -72067 54011 85542 -12546 -56095 -35149
166 -35149 -14817 36189 72856 1285 -88431 -46730 51997 54228 7883 -10358 -46221 -46490 53107
179 53107 82207 -24653 -57406 -1319 138 16916 62990 -4558 -82017 -12698 51986 19400
191 19400 7973 -238 -54367 -34742 55271 54195 -21709 -42187 -19676 -5664 27464 50445
203 50445 -9336 -70664 -20637 46706 25413 -1719 -4389 -41454 -30464 55611 50550 -35524
215 -35524 -35377 2157 -4431 24566 49744 -21144 -61825 3512 38292 13523 9775 -5469 -44750
228 -44750 -16839 47885 35491 -22068 -29137 -9690 -3283 23533 38215 -18157 -56422 -1772
240 -1772 38668 11388 782 -6651 -41464 -13106 53726 27008 -33989 -21815 -3205 -4635 29705
253 29705 34187 -29553 -44150 10775 28435 8881 7091 -9105 -35069 -3341 43813 18673
265 18673 -25900 -17140 -1628 -2059 24020 28592 -26813 -41798 13101 28354 2567 4216 -8978
278 -8978 -37738 -304 46527 10067 -29301 -11614 -3310 -3601 26745 22364 -29739 -31205 15036
291 15036 21481 3095 3666 -10017 -28442 4253 38751 8183 -25513 -10081 -2 217 23040
304 23040 18248 -28269 -27753 16244 19830 2047 3986 -12191 -27294 8607 33807 1113 -21727
317 -21727 -7334 -3725 2123 23374 9187 -28160 -18272 15680 14186 2217 1995 -13955 -21659
330 -21659 12808 29565 -2702 -18789 -4099 -2906 2634 23406 6785 -28242 -13198 17495
342 17495 9540 1576 4503 -14264 -19715 15355 25098 -7122 -16216 -1873 -3451 3406 21108 2513
356 2513 -27298 -9169 17172 7149 186 3132 -13971 -16942 15899 22198 -8823 -14279 -452
369 -452 -3264 3856 19584 221 -24289 -5128 16299 5638 644 2308 -13801 -12260 17250
382 17250 17823 -9441 -11531 -393 -2569 5538 17323 -3448 -22377 -1984 14477 3977 793
395 793 650 -14006 -9202 17109 13275 -11231 -9272 -1 -3066 6283 14986 -6048 -19792 1555
409 1555 13016 1690 1326 164 -13705 -5754 17366 10282 -11199 -6769 1028 -2987 7257 13465
423 13465 -7504 -17350 3722 11261 282 1454 -64 -13328 -3953 17005 6606 -11811 -5024
436 -5024 1060 -2976 7160 11515 -9027 -14665 5032 9409 -70 1407 -1054 -11944 -1519 15653
450 15653 4369 -10515 -3768 930 -2142 7192 9183 -9481 -12175 6000 8188 -1066 1718 -1461
464 -1461 -11362 417 14464 2118 -9646 -2084 -118 -1655 8361 6905 -10476 -9675 6245 5707
478 5707 -571 1827 -3072 -9703 1970 12709 459 -8765 -1407 331 -922 7738 5421 -11035
492 -11035 -7394 7542 4651 -1473 2831 -3395 -9742 4245 11483 -2230 -7228 72 -1270 -650
506 -650 8366 3237 -10116 -5097 6481 3683 -551 1650 -4221 -7972 4636 10263 -2620 -7211
520 -7211 331 -105 -435 8055 2083 -11061 -3245 7826 1543 -1015 2581 -4498 -6627 6603 8108
535 8108 -3911 -4830 605 -1181 997 6962 44 -9287 -2296 6006 1961 -755 993 -4095 -5851
550 -5851 5707 7764 -4466 -5425 1711 -1287 691 7577 -921 -9695 276 6484 -290 -83 1375
565 1375 -5406 -3496 6626 4444 -4232 -2775 418 -1049 1292 5529 -1134 -7446 -323 5455 747
580 747 -494 1672 -4708 -4355 6361 5219 -5445 -2866 1252 -2406 2080 6459 -3922 -7810 2373
595 2373 4557 -872 1075 64 -5203 -888 6182 2347 -3819 -1547 708 -883 1319 4090 -1947
610 -1947 -5913 1436 4420 -964 214 1573 -4892 -2556 7260 2459 -4924 -640 583 -2451 3487
625 3487 5039 -4727 -5028 2950 2846 -437 903 -1181 -3863 532 4993 934 -4035 -1495 1415 -694
641 -694 1095 3376 -2688 -4736 2943 2682 -2284 1119 1091 -5113 -359 6187 -360 -3718 941 -755
657 -755 -2054 4421 2654 -4697 -3178 2565 2001 337 699 -1902 -3180 1199 4496 339 -4277 -257
673 -257 1037 -1071 2174 2746 -3966 -2809 3812 1281 -2179 2189 82 -4647 1439 4015 -1353 -1776
689 -1776 954 -1914 -779 3856 1050 -3889 -2220 2198 1593 125 116 -1798 -2917 1536 4474 -970
705 -970 -3784 609 966 -1166 3069 1592 -4975 -1015 4265 -266 -1762 2308 -1315 -3085 2463 2604
721 2604 -2094 -933 595 -1525 291 2834 479 -2862 -1196 2015 1320 -200 261 -1332 -2540 1734
737 1734 3842 -1841 -2660 1162 -125 -622 3087 -89 -4319 472 2902 -1121 -472 1157 -2364 -1294
753 -1294 2555 1333 -1921 -527 227 -1019 34 1992 120 -1981 -814 1347 386 -51 906 -1499
769 -1499 -2027 2264 2939 -2163 -1460 1175 -857 -8 3123 -1146 -3523 1396 1911 -966 667 451 -1890
786 -1890 -252 2339 517 -1344 -496 140 -405 356 1690 -309 -2225 -174 1935 -182 238 1102 -1926
803 -1926 -1912 2747 1376 -2616 2 469 -1320 1396 2205 -1680 -2153 1616 648 -325 528 -110 -1534
820 -1534 88 2198 413 -1235 -571 336 -296 -117 1601 -628 -1915 871 1141 -964 403 941 -1942
837 -1942 -858 2524 125 -1593 575 -270 -1041 1419 1164 -1721 -1244 1040 619 -193 392 -437 -1151
854 -1151 119 1524 -92 -1181 -5 301 -692 436 1462 -705 -1065 1037 453 -588 500 309
870 309 -1607 398 1813 -329 -933 398 -291 -706 1309 925 -1099 -699 1044 501 -38 263 -146 -1135
888 -1135 439 1207 -279 -989 -84 92 -360 399 682 -1291 -620 1146 -268 -617 609 -191 -1109 349
906 349 1159 -582 -686 344 -402 -220 920 432 -911 -431 468 73 -250 301 -418 -488 518 1194 -688
925 -688 -675 230 27 -203 961 178 -1268 -234 964 -144 9 613 -562 -1012 264 772 -549 -361
943 -361 187 -69 -240 824 366 -711 -236 496 131 9 390 -474 -820 617 920 -681 -407 145 -279
962 -279 -26 555 65 -829 150 705 -570 25 317 -423 -583 563 424 -299 -333 437 -306 108 655 -141
982 -141 -660 229 378 -251 -63 -19 -486 -510 541 381 -60 -56 338 -341 111 700 -424 -877 144 545 -52
1003 -52 -346 289 -602 -85 558 127 -549 361 302 -28 93 463 -144 -245 38 573 -58 -4 296 -309 -443
1024 -443 544 81 -440 30 160 -169 31 272 -381 -421 152 338 -5 -7 -98 -547 -319 425 258 -587 308
1045 308 274 -154 316 513 -187 -191 111 -6 -369 8 -23 -366 -172 448 116 -401 -92 -59 -169 352 156 -345
1067 -345 -65 19 -212 176 122 92 -279 96 701 131 -537 313 35 -60 107 513 -83 -62 142 91 105 -321
1089 -321 114 -262 176 226 -211 -46 96 114 -363 120 145 -236 71 159 150 -79 249 -109 -167 132 248 -224
1111 -224 179 469 -295 -263 175 260 -156 -185 218 -70 -18 141 -577 -430 380 82 -92 -2 -31 -15 -123 -54 -210
1134 -210 -308 279 7 171 107 182 -25 -278 -79 18 -407 -31 169 -122 37 -25 -39 -52 -26 159 -184 51 -121
1157 -121 -86 -299 157 344 -90 -267 45 96 -36 145 -166 -252 496 401 79 139 264 36 151 -110 -39 -134
1179 -134 214 187 -208 60 -157 -182 -176 222 94 -169 80 93 -236 165 -7 -183 -378 -223 88 -374 88 71
1201 71 322 -17 -130 186 107 138 -12 81 76 198 284 -46 123 205 -34 -41 69 -31 74 55 -38 -94 191 -121
1225 -121 47 -77 -151 -38 -105 173 192 169 140 78 -178 -26 -54 269 22 274 402 192 262 202 -7 183 167
1248 167 85 -29 302 -225 37 -111 -7 -55 -129 303 149 16 -16 130 7 -254 332 206 -5 -17 -70 -212
1270 -212 153 -56 -93 -76 27 177 215 -54 -37 108 -4 17 424 150 117 -10 -125 16 383 -176 -261 349
1292 349 10 -17 216 -124 -142 27 91 -84 -40 -136 170 23 96 86 174 118 54 -309 -150 18 -56 -124 -306 -15
1316 -15 -139 111 -378 -126 -248 -60 32 216 143 9 284 279 10 -7 35 -78 113 -60 -95 -1 115 -180 80
1339 80 -88 100 104 -176 -190 -34 63 -157 367 79 347 42 -141 64 45 -17 123 76 6 -142 35 -119 284
1362 284 186 -33 -94 194 164 344 113 -49 -5 -113 102 220 -49 39 325 111 -18 -324 272 -167 29 45
1384 45 149 66 -22 -68 50 16 2 -71 -19 254 -176 -167 143 118 -97 209 136 145 -318 64 -30 233 -141 -144 86 -5
1410 -5 44 71 156 111 180 174 66 -63 -175 -97 170 -86 -137 46 -251 -48 24 49 83 137 -313 -123 -241 -485 442
1435 442 -42 -245 -149 -65 -158 -68 96 159 5 173 -202 -102 -32 211 -32 -43 -41 200 -30 -25 3 -51 -101 -271 206
1460 206 -241 46 -91 -64 142 63 -82 -23 104 -151 -317 -225 4 76 85 129 223 -216 74 -129 -42 171 53
1483 53 123 114 152 17 -55 -36 -101 -343 83 -58 -134 -267 34 182 -15 -113 198 46 -45 -16 -269 -160 -260 246
1507 246 103 48 -45 -117 267 -64 236 -313 -43 249 -120 151 302 -149 -56 357 99 -168 40 -235 106
1528 106 30 73 -8 62 -103 -10 154 -104 172 61 -95 27 50 19 124 142 47 113 122 -101 -449 -213 -262 -273 -79
1553 -79 177 -114 165 43 -158 -368 63 106 52 -38 209 10 75 -7 93 -58 131 129 42 113 -48 -285 -272 61
1577 61 202 -120 63 -66 90 -186 128 92 -334 205 90 -52 53 77 -73 -199 91 72 -14 -84 -217 -367
1599 -367 57 210 -39 -283 146 114 -69 3 -160 104 69 144 -60 16 99 57 110 18 -102 93 -144 169 204
1622 204 -126 -68 148 78 -161 352 -14 -176 153 -7 -96 111 261 136 -18 8 37 10 56 185 109 20 168
1645 168 126 -247 535 171 -518 -308 -191 185 44 -4 41 -27 157 110 -126 -22 -20 181 115 -33 289 -19 -179
1668 -179 255 -414 -319 73 -72 -8 -67 -77 -148 104 114 -67 37 36 -242 -125 -148 10 -92 12 49 -9 -172 125
1692 125 248 -129 -37 299 -122 -350 205 107 179 -113 8 -305 57 283 137 256 -168 367 36 -211 95
1713 95 82 -152 -110 -9 -203 -49 160 -278 90 49 201 105 -76 -193 -249 313 29 208 -12 -15 165 -150 221
1736 221 307 -42 9 65 -262 109 278 -117 251 -230 -16 -178 -23 207 32 -199 -28 233 -73 98 -112
1757 -112 -46 -80 -138 -89 -223 -94 152 -116 109 -165 -165 -246 -49 146 -11 -170 -350 57 -104 48 -16 23 24 134
1781 134 98 -35 428 -64 -420 93 239 9 31 -43 -24 104 -32 -6 96 -5 158 34 9 259 -280 -103
1803 -103 -133 -147 -11 -109 138 -225 100 125 -125 -131 -85 3 135 65 139 145 -68 -177 -33 -132 63 55 56 81 -85 -393
1829 -393 -79 -299 67 162 155 2 -120 65 75 -46 -360 260 143 38 -261 -105 71 -57 122 176 259 105
1851 105 -101 -102 -251 -70 -100 139 87 75 332 54 -125 43 84 -72 168 -158 144 32 -229 -195 171 -73
1873 -73 107 131 33 299 -108 -182 82 8 -222 92 -323 -76 -70 50 33 -52 -267 65 124 -18 -180 9 133
1896 133 -69 108 190 145 -188 -171 -197 50 -44 230 79 -90 -13 -241 -396 -154 -16 -136 -29 17 155 -56
1918 -56 -45 -103 74 -229 156 -48 -140 -274 96 -82 -53 -347 -151 -113 182 -242 -260 418 49 -91 -119 184 269
1941 269 -116 -19 138 -133 33 -35 200 166 7 -148 -107 52 6 63 159 -133 180 120 -185 -11 112 -75 236
1964 236 -59 285 477 241 15 193 158 -143 25 109 -85 -7 96 -70 94 119 -202 258 -35 26 14 -71
1986 -71 -17 31 -319 -232 150 108 114 150 -406 297 -50 -323 -52 287 -219 6 -19 165 -127 -11 -56 -140 -213 101
2010 101 97 -243 -95 144 159 -18 288 40 -154 -327 16 -55 148 51 38 118 154 14 -61 188 123 187 -6 287
2034 287 1 -121 111 -34 -311 -253 -155 173 305 194 47 212 -139 -119 -118 -44 99 -2 255 91 126 40 37
2057 37 243 -100 -8 -418 -50 50 -19 -313 -67 -69 -34 -246 36 96 -22 -28 180 16 -191 226 193 323 -133
2080 -133 115 -210 42 -137 136 73 114 -163 -185 148 -44 120 119 38 66 -90 -376 -42 52 -177 153 -386 76
2103 76 -79 -78 312 -131 135 235 63 -21 -70 146 85 -200 -32 3 27 -212 -187 32 -76 89 -258 143 66
2126 66 -66 210 -106 95 -37 109 175 -128 141 177 120 159 138 -63 -137 158 176 -186 -178 142 -16 -242 176
2149 176 11 -75 -133 -159 0 -38 444 211 37 60 216 -44 -44 84 -98 84 112 58 -178 161 104 -140 90
2172 90 202 -106 -139 191 -69 -83 269 153 -210 41 -90 -17 -74 259 -210 -14 141 -234 -141 93 48 -272
2194 -272 56 364 -312 96 75 -269 -41 -131 154 -150 -110 126 45 56 47 116 150 104 89 163 -79 62 148 -254
2218 -254 162 42 -171 -86 -146 -194 -150 89 52 373 25 -91 -136 -47 239 -466 -131 -1 111 134 39 152 -5
2241 -5 353 -199 -26 62 -101 -259 -340 -69 14 -18 -19 195 229 19 6 65 -11 13 295 111 152 70 174 -167 145
2266 145 -92 256 57 161 -206 145 -133 119 210 -81 53 -4 -89 -115 -48 -74 67 24 64 90 32 96 153 400
2290 400 113 125 122 -69 51 112 161 -197 63 -16 249 159 104 -176 67 67 -38 -29 -39 109 -102 -132 -237 -74 52
2315 52 -62 -114 -68 238 -37 -135 150 43 -151 296 -118 269 77 62 -212 -151 60 130 -38 -193 -116 -4 251
2338 251 335 82 -51 -82 198 -90 -263 16 -282 -183 252 84 179 -129 349 123 -83 65 99 110 29 112 249
2361 249 127 -201 74 247 57 71 -169 -155 -87 103 5 -131 -64 33 -10 -121 -136 -220 32 0 -79 140 -124 -4
2385 -4 156 326 31 26 -121 -239 174 68 102 204 -211 -116 -88 170 207 -78 -101 -376 -83 244 -191 117 -52
2408 -52 -36 -162 236 -77 194 -91 126 -108 -65 170 77 316 135 15 58 36 120 15 82 39 -60 110 16 -16
2432 -16 -12 94 -100 21 -80 225 53 -160 94 74 323 227 -105 43 330 110 69 -74 117 -201 -115 -102 -115
2455 -115 274 -281 119 154 173 -35 -231 -37 -3 -156 -65 -153 -170 -49 -238 44 -143 23 -158 196 -107 70
2477 70 122 -73 117 49 321 -300 -122 -10 26 -112 -135 258 -46 304 -204 -291 132 -351 -341 -195 167 -115
2499 -115 204 151 -130 -68 27 -202 -6 163 216 2 -9 26 -44 92 126 219 -67 -91 -113 314 -161 132 148 -267
2523 -267 -141 118 94 -79 -291 -37 1 -32 -42 153 -134 -80 182 153 167 -105 -112 132 187 -79 156 133 -265 -135
2547 -135 31 -59 74 -208 29 35 178 -58 -404 167 -22 -167 152 290 -155 -178 -163 195 216 99 -170 -122
2569 -122 -5 142 -27 -27 -148 -118 17 -251 83 76 -214 -86 -133 -115 10 6 -21 -191 -125 -108 216 -94 92 -252
2593 -252 17 140 225 97 122 -21 -18 105 -163 249 -162 -80 -6 262 197 -246 59 -185 -39 76 -216 -58
2615 -58 -3 183 52 -119 104 77 342 -90 278 -3 -145 87 -39 211 -8 -99 400 14 -48 328 -109 -105
2637 -105 61 78 -51 143 54 275 -112 -64 107 315 9 122 -186 232 63 -135 -144 130 20 -102 -63 135
2659 135 179 15 -55 58 -20 -117 62 90 -90 27 -219 -245 -278 -170 139 64 -16 -81 127 -103 -65 -81 18 -47 -153
2684 -153 -44 222 138 -172 -47 -209 -59 367 76 -255 101 -244 -13 105 41 141 -158 -76 -304 -114 -310
2705 -310 123 -291 -22 -95 -17 99 -110 -15 81 -54 227 -6 6 -191 3 155 -220 46 204 -282 -19 317
2727 317 17 96 -214 -40 245 104 93 -117 -27 -325 44 35 76 0 6 -112 -42 7 -175 65 -47 -78 -219 149
2751 149 -130 104 70 -124 -271 -112 168 47 159 62 -132 294 13 -30 160 -201 75 184 56 -7 -62 22
2773 22 284 25 -241 -1 174 181 167 184 -180 8 142 -387 601 -33 -31 -355 229 -139 54 4 178 -21 -90
2796 -90 85 -120 163 -85 -129 176 -46 129 82 -65 -120 -22 -123 -69 86 -154 -290 128 122 142 -21 -262 210
2819 210 124 -225 240 -27 -103 114 106 271 -8 -214 194 112 286 158 -136 -140 -185 -160 -6 -21 -85 -139 -219 193
2843 193 -17 -98 7 -26 -258 109 -144 128 -21 -388 -57 -182 231 -31 127 280 -110 -52 77 -61 28
2864 28 106 18 -326 -140 129 14 -191 -51 182 62 -63 91 -187 28 -126 1 -135 -19 -60 -130 -222 -61
2886 -61 -122 8 93 116 -60 264 -56 -83 321 196 -317 336 229 -285 103 -6 86 168 172 171 166 -62 -141 107 27
2911 27 -233 96 341 162 -31 107 138 -168 -144 38 -94 130 -133 149 -129 -183 -98 -97 27 -116 -54 -56 170
2934 170 -252 -28 138 -72 -338 136 4 -100 -311 185 -229 -125 -210 -52 72 -171 -178 36 94 -181 130
2955 130 108 -57 12 52 -63 26 -152 45 169 -226 239 213 172 28 -90 -243 176 -122 -308 411 -179 223
2977 223 -99 -54 -23 116 -393 -210 -231 128 62 -39 97 -188 -318 -213 20 -236 -244 69 111 -184 -17 -263
2999 -263 52 129 -209 -8 -220 -416 190 67 -156 -8 114 10 -43 -11 -104 -161 -62 93 -238 -367 -235 90
3021 90 -115 -244 -20 87 282 126 -62 131 -151 -151 -179 148 91 133 174 78 -104 33 -203 -41 229 101 144
3044 144 -125 -290 -148 -86 -135 114 38 197 172 -134 -142 411 -383 98 26 288 159 -106 -184 71 33 -254 25
3067 25 -304 -192 216 -60 -147 72 -20 52 142 91 214 61 -331 177 -260 -103 165 -164 -275 260 -67 173
3089 173 30 113 -101 252 -53 -15 -267 -65 -8 114 -34 259 326 147 177 70 41 -111 150 92 163 -159 -257
3112 -257 70 -26 -15 260 151 -272 -187 -184 70 255 65 -18 134 92 -135 -47 35 311 86 436 -79 -140 128
3135 128 -128 117 -187 149 -69 97 253 130 16 193 135 -214 288 184 -83 -128 101 115 44 13 60 -75
3157 -75 256 -107 -84 148 342 8 44 -3 -136 42 -79 -69 97 14 161 -39 51 -127 137 48 121 29 -31 172
3181 172 -26 -134 -177 34 276 -103 21 37 204 2 -1 264 -115 175 134 228 -167 54 -64 114 -44 233
3203 233 246 157 -236 -118 27 39 152 -87 -60 83 37 -361 51 338 -103 55 75 53 65 -265 64 88 -333
3226 -333 -13 32 189 -116 -76 113 236 -83 18 191 -133 188 -270 71 -232 138 -88 293 -143 -104 -27
3247 -27 -12 -52 126 49 -190 -69 -66 97 -410 129 378 55 132 238 140 378 24 230 -3 -39 72 1 150
3270 150 89 -85 -35 -188 -361 -196 -98 -77 -165 -27 -27 68 242 -378 90 156 174 -132 -137 -80 64 117 -20 348 9
3295 9 125 201 104 -33 -14 63 85 127 188 -142 -67 -320 139 -16 61 99 -197 19 -12 -30 8 -167 -79 379 -1
3320 -1 -32 245 61 127 -45 -222 -81 -202 -82 -29 -323 -66 269 -254 67 -233 153 -127 59 94 -188 -141
3342 -141 90 -4 -208 -38 -81 -56 149 63 76 104 319 -74 -2 -226 -24 180 109 28 21 87 105 75 -91 -12 14
3367 14 -247 31 219 -144 20 132 -114 -228 -117 -246 -63 43 187 -163 2 -53 221 62 40 210 137
3388 137 152 121 -404 88 7 4 129 -121 -90 383 153 -96 -51 248 -50 -191 -131 -157 -169 -164 -134 94 -50 22 154
3413 154 -269 21 -26 63 38 11 353 -101 54 -12 121 -183 -298 -311 -53 -73 1 -81 -258 79 91 -114 165
3436 165 -36 -31 -3 -36 47 154 -95 -124 21 10 32 -129 72 9 -342 140 157 7 115 43 -154 39 190 20
3460 20 109 55 78 -87 -78 82 -35 98 -26 -89 216 -10 -352 211 -183 281 102 -120 14 -176 -242 317 75
3483 75 51 101 -103 20 -42 176 -243 -256 -15 37 -127 207 135 -27 -229 194 214 146 -182 -139 -78 237 195 -13
3507 -13 342 7 99 -118 109 287 -91 -152 -181 -96 -141 -154 -130 -50 67 -370 418 141 231 121 -41 51 -124 -24
3531 -24 41 327 -129 44 108 98 100 -56 28 303 -53 -90 45 58 20 28 191 -36 -112 33 -114 59 14 38 -3
3556 -3 -4 123 99 63 -271 -51 -193 -247 -108 -242 -239 91 -171 161 -169 148 -156 373 -60 168 -56 -241 -137
3579 -137 97 77 78 -64 -141 -271 -53 -187 -54 57 -105 1 27 137 -273 10 -6 233 -56 67 361 43
3601 43 -166 -47 -77 351 251 -138 -199 20 33 -66 -121 144 282 104 94 -109 -18 -165 246 200 272 89 -23
3624 -23 -173 52 219 -47 -76 -91 108 113 -15 400 305 -35 -181 -34 -46 -147 -38 -19 31 139 -284 -175 -193
3647 -193 7 -81 -399 189 43 -124 14 -391 -82 18 -322 -57 46 60 -243 -373 -259 -180 59 163 25
3668 25 -32 189 148 -68 -100 283 -211 50 77 -174 145 474 40 -68 -280 120 30 -340 98 -10 -42 -27 -118
3691 -118 -259 -236 -40 278 -12 -114 -175 91 1 178 193 179 -155 8 -276 169 -52 71 135 208 60 -236
3713 -236 168 -293 6 75 -23 -2 213 -281 62 -223 -8 100 194 390 -136 -46 274 -133 165 -84 288 -207
3735 -207 73 -31 -231 -16 115 69 -109 -56 -66 -109 84 -11 -376 169 41 -27 -202 -164 136 127 210 332 -57
3758 -57 44 -224 -56 -102 209 117 -312 -96 -169 -82 60 -96 -76 65 -187 -111 15 -300 -61 -196 -25 -1 -94
3781 -94 -133 34 120 136 29 -148 240 -116 43 40 79 -101 38 -321 253 -102 -126 132 -225 -143 -180 36 -152
3804 -152 -19 -126 -29 88 92 -86 -19 -364 241 -155 103 110 -184 -43 19 -53 61 142 -171 172 -344 -133 -17
3827 -17 283 -63 241 2 208 194 327 8 11 136 -182 35 286 -63 4 -9 -89 -112 -6 244 -207 126 -221
3850 -221 -149 92 101 58 -174 -14 25 -55 190 -78 201 192 -146 -91 91 181 24 57 125 210 -231 -282 68 276 -17
3875 -17 218 285 300 -253 19 -222 55 57 238 -158 -23 -119 39 -208 151 -169 265 -133 98 -38 -278 18
3897 18 -30 -179 -114 -169 167 11 308 -5 57 -28 -88 198 -69 -217 -266 29 177 43 61 33 90 11 -128 137
3921 137 -116 -216 -307 -92 -71 291 127 -42 -66 205 -228 126 23 -86 71 134 -152 -264 -42 138 280
3942 280 -67 -69 -65 -73 -10 -18 -125 160 210 -100 12 102 147 165 -199 163 -89 -176 -173 -277 252 126 -263 -263 -188 59
3968 59 84 2 179 -5 -188 61 54 -132 -218 214 10 -364 -9 -81 -189 112 182 -95 89 -50 44 -206 108
3991 108 -224 -120 442 240 235 -310 -15 -71 274 -194 -33 264 294 -96 -67 35 -326 -49 -220 67 -4 -61
4013 -61 147 -121 241 186 -41 -150 115 -68 -4 367 -255 -111 -96 -3 -496 65 58 -55 219 123 -193 140 21
4036 21 -79 91 -8 221 -63 -27 192 45 -47 -237 49 127 258 -85 -104 121 -132 -144 61 94 -20 -38 371
4059 371 196 -59 -11 -131 163 -212 124 225 -298 83 44 74 425 -188 8 87 111 -118 -52 -91 -151 -233 -234 -25
4083 -25 -139 -135 263 113 108 -30 -73 50 -226 62 -266 271 -131 -97 6 75 -4 396 -59 -234 124 5 213
4106 213 -12 100 -79 26 18 246 137 -93 271 -284 -30 -278 -46 47 -112 -91 -108 199 357 61 -160 -75
4128 -75 307 204 18 212 -112 -6 -172 41 71 -172 5 -61 56 10 -110 -14 91 -123 1 -59 -11 -96 -268
4151 -268 196 169 -35 60 -163 -258 137 80 -100 16 -154 -122 -56 -116 -108 328 204 302 145 -114 -21 -184 -114 -57
4175 -57 -128 -28 -76 -290 0 -142 46 -93 -213 221 -134 -4 -36 159 140 27 -149 203 24 23 48 194 132
4198 132 19 186 -101 7 122 32 -284 -34 18 -349 -15 152 -97 15 -289 114 146 -8 7 -404 -176
4219 -176 232 -157 355 193 200 157 -42 70 226 -380 -64 11 36 152 -123 309 129 -6 -95 -16 -111 -201 62
4242 62 95 126 -100 117 90 -113 -55 -92 245 -152 151 -53 69 -35 225 -108 -130 -65 102 61 38 77 216 143
4266 143 60 147 160 150 246 -149 86 141 -234 -47 -311 255 29 12 391 86 -5 195 -173 -44 -16 -94 172
4289 172 -139 -108 -110 193 122 -37 -208 -38 367 -117 -147 -9 -127 -22 -276 210 -472 -99 -376 96 167 -135
4311 -135 24 78 79 59 -18 19 5 -16 162 -9 112 59 -2 106 150 20 -20 135 -174 -226 187 -206 -26 -219
4335 -219 -146 -296 46 10 -48 335 49 -284 -67 247 32 -260 310 95 71 -105 371 -15 35 244 -149 43
4357 43 -105 192 242 96 379 199 -123 12 -302 -205 169 -245 110 -44 53 -180 -14 -148 113 -98 162
4378 162 -162 60 -12 251 -212 218 10 70 181 76 -10 38 124 265 -16 -120 309 -151 259 153 250 10
4400 10 -195 317 171 -42 314 70 -92 -95 -26 235 -146 35 16 172 -55 -211 -108 -113 -101 -526 -113 -103 -288
4423 -288 -268 -167 229 -12 27 -46 32 -155 157 -177 -149 114 -12 148 -9 55 -138 -71 121 243 -218 -204 69
4446 69 51 17 -282 -29 114 165 49 274 27 67 -16 -130 5 -123 105 -69 41 6 148 -227 25 21 48
4469 48 298 133 79 -290 -41 -164 122 52 -185 -116 -11 -64 -7 129 -194 65 -233 261 79 -153 -132 -308
4491 -308 -136 12 96 -203 47 -159 -120 -313 -16 -12 -221 121 158 346 153 52 33 20 -132 -260 50 66 37
4514 37 120 64 65 119 -7 -121 -75 71 -89 102 142 54 168 -101 27 5 301 211 138 -209 334 32 -38 89
4538 89 -370 79 277 93 32 -221 93 210 -60 -89 262 -44 125 4 -20 268 -75 161 126 -155 97 -91
4560 -91 -52 -373 -286 14 -63 -500 -268 59 222 325 -121 63 -104 355 106 -154 258 263 252 33 -42 173 -213
4583 -213 108 -135 -114 15 -60 27 130 53 36 148 85 208 120 259 -38 352 44 -255 -234 59 42 37 53 -58
4607 -58 230 220 -101 169 -124 175 -208 286 -385 -271 167 49 -90 144 -129 81 170 -346 -36 10 -234
4628 -234 38 -46 -225 4 215 -173 -222 -145 229 -240 -104 133 -101 307 145 -35 99 -243 364 -20 -149
4649 -149 235 -308 75 -303 -96 -1 187 94 163 183 -158 262 74 -37 -118 108 50 45 -229 -198 -320 50 326
4672 326 545 -114 -14 219 -22 189 -16 -273 212 -26 -145 56 140 25 -149 246 284 -7 220 -75 97
4693 97 -81 -18 -27 95 43 -133 18 62 48 -70 32 -148 -95 128 -41 28 11 -17 -264 35 -163 52 47 -19 74
4718 74 125 49 302 -94 -3 45 47 34 -260 142 77 -124 -124 -11 -10 -60 -229 143 165 -41 68 -75 144 238 117
4743 117 90 -228 140 60 -127 -566 -86 -146 -146 274 -139 69 367 49 155 105 -121 -96 -196 177 -159 -54
4765 -54 307 162 158 -57 -19 -35 177 92 28 244 230 -25 228 -195 44 -194 -115 -203 58 219 -238 272 -261
4788 -261 -34 -209 -96 28 456 -131 -201 144 -141 -261 -267 -327 -309 18 108 -294 -82 -111 -65 -52 85 187 -119
4811 -119 119 -40 65 -126 258 -39 241 372 92 -118 -153 171 135 -119 144 -102 -7 38 246 74 194
4832 194 86 -218 -196 19 -214 108 -286 -1 -111 -155 -281 346 -203 -219 9 298 -36 215 -178 -253 -17
4853 -17 173 -171 49 -158 50 -20 -88 403 147 -23 212 -242 -187 -224 39 -83 147 22 0 -66 35 278
4875 278 -90 183 -247 -120 -73 -12 -70 -155 -289 231 201 209 72 -290 -32 -198 52 110 -56 292 -103 -44 33
4898 33 -130 -366 102 -9 -234 50 226 61 47 -189 -197 53 -25 295 -122 7 -8 -51 115 -3 214 -130
4920 -130 34 -144 221 -46 -140 194 -56 -300 -111 59 -217 -81 -436 -254 12 3 9 -80 -99 -67 42 23 -259
4943 -259 -256 55 -128 44 216 -143 131 88 -67 -174 77 -302 -23 -44 61 13 47 118 76 -172 -110 -190 -76
4966 -76 -240 262 -197 47 230 147 -105 -55 -140 -75 316 -58 -113 -19 288 -92 60 26 -31 -164 218 -140 -24
4989 -24 89 -156 -232 -319 -30 262 80 55 121 128 43 -107 140 -182 2 114 -79 263 111 -152 -114 -1 33
5012 33 53 247 -286 68 -30 20 66 173 8 84 -325 8 132 38 163 179 25 -199 -174 54 117 58 -60 67
5036 67 273 1 82 -231 -73 -80 27 136 -369 -70 -103 40 -420 126 37 -63 248 56 -69 94 11 151
5058 151 -40 29 354 -109 -226 -51 -77 -122 -79 38 -28 -266 82 128 -57 60 329 222 -85 -120 160 -25
5080 -25 -139 -69 -15 -89 -69 122 154 -13 106 -75 323 -187 -120 189 -90 220 -151 100 -10 72 26 125 -141
5103 -141 -246 29 -87 268 97 51 317 -123 189 -385 -82 186 -239 331 -82 191 22 46 -332 58 -43
5124 -43 -170 308 19 -8 151 122 228 -241 -161 216 136 169 64 85 -201 162 -174 84 128 -68 -68 46 -83
5147 -83 61 146 -81 45 -50 -197 50 56 227 32 -54 13 153 14 -36 -39 -109 61 259 -3 -182 -66 -6 -77
5171 -77 -87 -213 239 -106 224 -105 8 -70 -114 27 40 92 -70 250 -22 -77 -165 -351 -130 -27 -252 15 -34
5194 -34 -171 -43 279 -82 -262 27 48 -221 -85 -185 181 -49 -279 9 18 -162 -115 57 94 279 -83 165
5216 165 -5 142 -78 -57 -59 -156 -426 -182 -78 -76 26 -125 8 4 -170 38 138 -91 -137 -220 281 -61 85
5239 85 -141 -205 -249 -61 290 37 -129 -70 -122 -254 -33 88 224 96 44 38 225 86 -291 -217 167 12 3 -280
5263 -280 138 -119 49 15 27 183 -317 -1 82 3 254 21 204 237 440 117 -13 3 97 194 -177 -178 77
5286 77 -301 -2 173 129 -154 -140 65 -47 200 127 166 124 5 -161 25 14 228 26 -252 20 -4 -122 66
5309 66 -238 199 70 106 -97 34 324 430 -200 -232 -21 134 56 139 49 -28 31 192 78 166 -74 -70 18 -79
5333 -79 157 218 172 19 63 36 -82 -421 -215 -40 -101 300 -86 262 258 146 133 259 88 135 2 -98 6
5356 6 124 -296 203 57 134 207 -107 146 -214 212 302 -59 211 -80 99 -64 143 -154 37 299 -59 133
5378 133 214 -163 -125 89 -95 104 405 -42 172 165 -58 26 -315 -10 57 41 146 -4 289 148 101 -144 62
5401 62 157 -42 117 177 -234 121 126 -212 34 30 124 -103 86 -152 102 -172 -7 130 246 238 -152 13 -126
5424 -126 -177 -95 105 175 -40 -77 14 140 -45 88 257 -48 -55 -42 219 132 127 -276 19 14 284 -433 202 457
5448 457 -290 124 -48 -2 -11 223 4 45 -222 -162 134 -3 -319 -166 -93 30 176 -12 -143 125 25 -460
5470 -460 -322 -428 42 77 89 -111 -40 125 -322 -142 5 -418 27 206 -61 61 115 -9 -175 -135 -198 171
5492 171 -155 100 120 193 -345 -130 87 -101 154 189 -65 261 -288 -289 -162 369 73 91 -74 30 185 -168
5514 -168 -91 -76 -401 147 38 -62 36 -70 212 -369 293 -115 -397 173 -114 -197 -186 -100 83 -4 91 -219 -343
5537 -343 121 -117 -143 109 30 -37 248 67 49 122 5 224 107 11 0 33 -40 139 95 -139 -84 348 -185 185
5561 185 235 206 -94 65 83 -147 -44 61 -121 -113 154 -145 -182 -37 123 -233 -42 399 -71 107 -116 -424
5583 -424 -189 -93 33 -27 62 158 186 -194 -171 317 73 -42 34 -76 215 46 28 221 -351 -34 -38 -90 178 4
5607 4 105 -170 183 84 37 -116 -96 236 198 -175 -71 -14 -149 59 -113 -72 146 56 -55 127 91 112 -78 -186
5631 -186 103 -168 95 -277 18 -21 -100 -16 0 -40 71 -173 11 -21 -318 380 -56 4 -43 -125 187 -188 90
5654 90 148 -172 -79 -186 -58 310 -77 -44 95 -174 199 13 100 -77 205 -199 -334 -47 -114 57 -29 -148
5676 -148 320 -30 -320 259 -32 123 21 -19 15 -92 -255 -157 159 -404 -393 99 -221 17 194 -167 -6
5697 -6 -67 -199 -149 166 -98 -33 188 -43 1 60 -87 -4 97 -129 -157 -134 159 0 102 32 237 -209 -189 -124
5721 -124 59 238 -254 135 -190 -113 0 116 168 129 -5 130 -81 -135 -198 1 -18 32 118 12 239 -5 70
5744 70 -28 -170 72 162 -286 -30 -25 19 125 156 296 -6 238 14 128 272 165 280 146 73 -14 125 -77
5767 -77 74 -141 45 -185 124 -50 -204 -113 -237 -108 7 -61 -25 -169 32 -167 -105 -78 103 -127 -169 125
5789 125 -324 101 107 26 39 66 163 -98 -272 -66 1 20 275 283 206 -86 11 169 -56 -37 131 111 -35 193 -24
5814 -24 -51 267 241 39 185 24 208 39 15 -217 0 -139 274 -445 139 174 244 216 0 371 -138 184
5836 184 -141 212 194 -90 -200 -54 207 -85 33 -6 -328 77 -12 -144 -5 -196 -216 -55 -163 85 -111
5857 -111 106 -166 -401 47 84 124 96 -100 62 -5 421 -166 12 -56 -12 -111 -340 -107 21 92 85 51 -131 -57
5881 -57 -308 53 214 230 30 4 153 92 -354 -29 4 99 -2 -138 -78 -161 -98 -301 -105 71 71 187 -70 61
5905 61 131 -11 -272 48 25 114 -198 122 -170 55 45 -104 3 -239 3 84 65 -93 72 193 -83 10 33
5928 33 59 -34 -58 92 -62 200 564 67 -109 -49 131 97 0 -12 6 -99 -147 -97 85 -217 -37 -339 -134 -238
5952 -238 -133 -357 -61 -12 -10 -15 -258 67 -218 -128 328 30 -251 28 -4 117 266 119 93 -150 -35 290 -77
5975 -77 98 172 -136 28 164 235 -246 77 175 -93 -177 66 35 -257 216 5 78 137 -14 -74 -224 -330 -292
5998 -292 -102 46 -327 -278 278 -101 -132 78 123 109 -236 119 257 -99 -156 -62 -76 0 145 -276 -3 83 -156
6021 -156 147 31 28 -143 34 285 -283 166 -159 164 -5 -113 58 352 -463 -136 15 -87 -237 -179 60
6042 60 130 23 188 -66 -249 15 -23 92 43 21 37 -263 -295 121 -359 -107 -60 -228 50 33 -275 -176 351
6065 351 171 -536 35 -46 -47 193 113 -78 -58 20 -215 92 18 -216 -52 -270 220 166 -99 429 -97 103 -116
6088 -116 13 46 95 -241 39 197 -72 -146 -245 361 -81 -173 -54 35 241 202 22 54 108 160 107 -149 -207 -96
6112 -96 122 -134 -126 139 -36 -76 -250 -227 139 -104 -72 181 -35 -127 -18 -141 46 -40 -18 -28 -31 -134 -11 -320
6136 -320 -94 58 -270 147 181 -227 83 -15 88 108 -161 191 381 247 -72 -147 -21 -146 269 -38 -75 37
6158 37 122 110 -122 8 65 -120 251 -350 -302 162 -244 -190 -54 -445 -51 27 -224 -141 193 21 -66 -108 -143 81
6182 81 -102 -110 26 -15 22 147 -67 -231 -8 456 -35 86 299 77 280 252 158 65 99 15 -253 71 225
6205 225 -292 0 -209 -43 -19 -39 -217 272 273 -246 -162 95 197 22 209 37 -197 312 -100 -241 -75 12
6227 12 -51 -142 -188 -142 -122 188 127 264 -244 179 -90 -68 -41 -134 -155 -92 -269 148 1 -139 86 24 7 -206 38
6252 38 -333 21 37 119 322 -126 -114 -99 151 161 -180 -77 25 -45 21 -568 -156 131 -196 -258 -324 201 -200
6275 -200 44 -237 -233 -338 -68 117 113 229 0 82 51 91 -165 50 -140 -118 88 -404 -323 216 31 -162 -149
6298 -149 133 -165 -101 -122 111 121 80 -17 -262 -33 25 103 14 137 184 -150 -46 -82 190 -43 76 247 -4
6321 -4 68 102 -44 -180 -86 203 -144 -219 -220 79 -87 241 70 -145 211 -211 185 73 31 57 139 -176 -79 159
6345 159 96 122 224 16 52 -34 -206 -13 225 -269 -215 -89 213 -148 254 -208 62 341 63 90 209 215 174
6368 174 -25 3 -7 6 221 83 -183 192 17 -240 85 63 59 25 218 -23 -29 121 198 196 -19 -49 -94 67 -64
6393 -64 177 347 123 44 -48 -103 -24 149 -169 12 -87 -167 32 314 97 -82 -80 -105 -51 -207 -74 -114 -18 -83 14
6418 14 228 -224 -50 417 -204 -38 40 -64 -363 184 -15 -9 -209 25 -303 -205 30 13 -172 -6 -144 84
6440 84 4 110 43 59 -19 -220 -113 44 -43 197 171 36 -112 -150 49 17 -235 -59 105 423 268 -148 -27
6463 -27 15 96 165 -93 -38 -49 -231 125 -33 -173 -53 -117 -246 -150 -6 184 167 -189 -119 -66 160 -56 -49 8 117
6488 117 -48 -33 -108 36 -6 -194 40 106 230 206 -38 47 140 -142 -51 60 89 -112 -247 -138 8 375 76
6511 76 94 153 -6 192 -117 25 259 252 99 76 -18 179 165 -102 62 -209 200 87 -125 -105 -288 178 47
6534 47 -399 77 -127 -112 -19 -57 134 75 279 -108 -294 75 92 -6 6 52 -74 95 -311 254 190 262 -21 178
6558 178 -269 54 121 -116 22 189 -181 213 -190 -395 268 -207 269 208 78 -63 -35 -283 282 -12 120
6579 120 -211 -61 203 263 310 156 36 -69 -124 -167 236 38 95 -32 77 -57 487 71 59 -62 170 144
6601 144 -224 -310 168 -196 212 -203 143 -91 -22 119 -143 39 -158 232 -163 88 -182 -66 14 33 38 1
6623 1 -357 -172 122 110 -124 4 -89 -218 75 169 190 -40 -131 96 -140 -205 -64 -241 22 223 262 56 150
6646 150 -224 -247 -104 229 -137 416 366 -27 89 234 46 -250 -228 177 51 149 149 -33 -95 305 50 -167
6668 -167 178 -215 70 -11 -51 271 -147 2 273 -147 -259 -28 51 303 107 91 -50 -112 -134 -69 -42 136 66
6691 66 -57 256 -125 32 -29 155 -5 -94 70 -131 155 38 -137 5 -191 -187 -267 -73 261 83 191 40
6713 40 -1 65 47 -26 34 -429 -80 43 42 -151 -14 235 -12 -109 -103 -4 165 128 230 -154 -188 -69 122 84 -373
6738 -373 -244 -56 159 -66 73 212 -335 -68 -115 -61 -104 -95 225 -118 -32 -174 143 183 -209 -9 103 2
6760 2 251 -164 63 -42 9 -41 60 -465 -19 307 -92 125 -233 51 -335 -252 14 226 137 309 113 316
6782 316 -233 -98 -67 128 -65 -143 -5 -269 135 -365 74 14 -137 141 -27 -249 97 302 133 -78 13
6803 13 57 -100 -126 283 187 405 272 -53 168 -83 12 -7 99 -73 -123 333 138 -320 205 -85 142 125 -65
6826 -65 63 126 -122 208 -176 -62 141 -145 36 -330 61 343 -332 -236 109 -187 39 -35 45 -367 -162 -113
6848 -113 -693 73 -42 -6 83 112 -127 -265 -81 -161 -187 -94 173 -95 -274 -92 -134 -8 376 18 77 64 231
6871 231 170 -147 -98 46 -28 357 390 15 5 270 24 -188 28 -101 -65 -171 -97 -146 -142 -151 -24 -17 296 177 -30
6896 -30 82 -11 184 0 73 38 20 119 155 108 148 -88 -25 -121 78 -151 -79 -224 2 200 42 -23 137 94 8
6921 8 299 -269 -74 4 113 249 79 -209 -7 211 -65 91 -160 413 -19 -215 13 -40 82 -98 17
6942 17 -179 61 157 -47 30 -80 -326 111 165 -73 -92 -140 172 66 -14 182 26 140 109 -216 -91 -228 242
6965 242 143 39 -15 -11 56 77 292 26 -248 26 231 143 -176 208 -158 125 -3 -230 237 191 232 275 -85
6988 -85 114 36 -58 111 146 113 238 -163 -16 66 16 42 -105 -2 51 78 -106 24 44 -26 306 -94 80 35
7012 35 122 227 -92 -65 44 -40 79 -62 -256 -446 0 150 -56 -128 219 30 -55 -59 102 15 41 109 -52 -202
7036 -202 125 246 0 -139 -186 85 59 -50 -188 -10 -14 -44 71 139 -129 68 292 -120 208 279 88 -38
7058 -38 4 -156 121 35 140 -3 301 -57 173 185 -145 -92 66 -78 106 136 -349 169 -175 84 103 76 -348
7081 -348 202 -265 98 277 -240 23 -49 -198 -121 -108 240 144 95 -61 84 212 -180 -285 -230 -322 85 197
7103 197 79 -109 -139 -64 -296 -49 8 -136 157 -135 107 -141 -245 -74 -139 -132 -199 372 271 33 -139 22
7125 22 227 -103 199 -82 60 62 19 -91 113 -14 182 173 -31 20 -77 -1 -42 -50 -111 28 117 -350 275 -6 120
7150 120 -59 353 58 193 -103 75 49 -442 17 122 -7 9 42 -43 -267 308 124 240 -127 -133 -238 -369
7172 -369 231 -58 -145 -41 340 -107 -117 149 33 97 163 -157 253 -242 -333 -36 -39 -252 59 185 76 -99
7194 -99 -189 -37 188 171 -106 -109 94 104 13 -75 -95 -145 266 84 316 181 26 -117 90 -23 -19 12 245 -13
7218 -13 95 -352 -46 -21 -150 -93 -52 -133 -67 203 -132 -104 47 -69 -50 -12 -210 71 74 82 -48 302 -13 -548
7242 -548 244 -113 -76 19 -159 -98 308 64 294 178 -193 -81 -136 -219 296 -95 89 271 -113 114 31 101
7264 101 34 -99 -94 97 -308 -229 106 83 137 37 -123 -38 235 -78 -125 -13 352 -131 -12 77 -355 52 80
7287 80 454 -64 118 -183 336 -67 -47 147 -69 -11 26 -88 154 140 8 19 -33 50 -21 -186 -119 -86 -123 -77
7311 -77 -270 112 29 -85 -172 -68 135 -33 -90 56 44 1 87 -137 139 140 46 -200 103 165 132 -269 3 74
7335 74 -16 -224 -95 -196 -74 305 206 -91 15 -210 103 -152 -34 193 -257 14 86 -228 68 -221 -36
7356 -36 -184 -53 137 -35 104 59 -189 -69 24 -26 126 -144 309 17 91 -39 -163 11 82 77 -29 -41 98
7379 98 -134 -186 -232 -251 -62 -21 -117 176 -71 182 236 75 -71 120 -28 131 78 -193 218 223 190 -181 -131 -5
7403 -5 110 43 196 14 -118 161 -231 -337 -373 35 -113 -3 -44 67 -175 -2 -158 -36 -64 -113 -156 122 -36
7426 -36 -385 -8 -122 90 -59 3 171 68 279 -110 199 238 161 -204 28 6 149 -161 -4 -64 -90 227
7448 227 -151 -263 -133 83 302 29 255 33 197 48 284 111 -104 84 288 -97 21 349 -88 -152
7468 -152 144 149 -30 -44 681 27 -329 -262 -5 -40 -299 -168 -37 -137 91 437 -274 30 272 -153 89 -445
7490 -445 -63 177 77 -102 -22 -42 -23 -192 39 -39 -58 174 40 99 -90 10 -59 26 146 103 84 -62 -159 -80
7514 -80 218 -2 -107 -126 31 349 13 -18 189 499 -85 -5 18 -118 220 27 -58 107 65 -255 -31 180
7536 180 -169 161 -15 124 170 22 -10 -398 -182 -139 -164 -38 138 -182 -311 -206 -100 265 0 -275 72
7557 72 -154 30 -161 -167 -22 -254 -51 -92 18 -43 -86 -161 -201 -3 -82 109 -30 -178 118 -490 -100 -160 55
7580 55 152 56 368 208 -334 -149 164 -124 146 46 168 300 -52 53 -49 215 -484 160 -93 -5 15 -85
7602 -85 263 -143 225 51 -13 -232 305 58 214 -221 90 -51 21 -115 -183 -10 125 -242 -92 -80 368 6
7624 6 130 86 -56 -25 -100 -81 -168 48 100 110 -149 -43 121 -88 -171 -43 168 -31 20 -121 32 -3 264 -324
7648 -324 35 181 -329 -169 157 -117 258 110 -111 77 -94 -152 73 -46 -94 465 161 -133 454 23 81
7669 81 -73 106 -190 41 243 24 24 -28 -202 47 114 -19 -279 2 -155 205 -272 -63 -250 -35 -174 19
7691 19 -114 -94 202 -87 -135 145 357 -71 151 26 -87 -192 40 56 -43 -64 -139 25 -67 -153 139 26 -41
7714 -41 163 60 -68 304 33 219 26 110 127 77 -173 -185 310 170 -379 -287 224 36 158 -109 -104 174 36
7737 36 126 -66 150 -158 -80 109 -27 -52 -144 -425 -225 -48 -11 124 200 167 33 95 132 -88 87 -76 28
7760 28 -334 -305 -217 -165 192 -14 43 57 18 -41 -31 -74 33 -349 -128 35 -227 -440 156 -70 51 -23 135 43
7784 43 -138 -76 -167 207 37 -36 -126 -26 -28 -152 140 -80 -268 -19 -121 -14 180 83 195 -344 -122 -225 154
7807 154 -13 1 74 -68 -42 -122 -171 50 51 -84 215 -11 -223 -159 -132 -28 -244 -76 22 24 234 -4 117 -35
7831 -35 -198 70 184 103 129 -142 225 80 -127 -32 31 560 -234 -193 254 -171 -61 198 -38 79 210 306
7853 306 13 182 -56 34 -75 218 -24 -237 -181 -194 84 -43 60 29 149 299 159 -181 -59 -114 224 -193
7875 -193 2 -69 47 167 15 -92 -54 73 -47 242 48 72 -45 -48 -16 -8 -197 22 52 75 -68 -2 -19 -193
7899 -193 66 4 -74 60 -152 23 -67 -230 -169 53 -4 -275 -13 -257 15 197 -157 -119 50 -63 -84 -23 5
7922 5 -91 166 259 103 -200 -113 -65 -66 -252 -265 -124 -270 -237 -141 52 16 80 6 194 22 -169 -86 29 -111 10
7947 10 127 -52 315 -202 21 -234 -64 -99 -64 -60 -45 -243 270 -36 128 -88 7 120 171 -140 -59 210 -109
7970 -109 169 60 -74 203 205 -19 28 -304 39 -149 -72 19 -106 278 21 -117 128 134 -266 -82 46 219
7992 219 171 24 -28 -82 189 126 30 -132 -143 -180 41 43 -269 -246 -8 -234 39 235 -80 153 85 334 114 -391
8016 -391 228 -167 -198 -142 150 -145 24 -100 -95 292 33 91 17 311 -105 -128 -193 -90 -244 -24 49 -184 146
8039 146 51 8 -50 -193 171 132 262 -169 46 162 29 327 -104 -86 63 67 -134 -179 201 -172 -472 228 -278
8062 -278 2 -22 179 54 -169 -92 -124 177 -80 233 96 -135 147 -166 173 90 472 44 -237 -34 138
8083 138 -166 66 -62 -311 -76 -37 90 -252 -237 2 21 -181 -135 -115 -129 -156 -18 -219 -156 -143 8 -112 -40
8106 -40 208 -270 -277 -38 -35 241 -178 233 49 -219 -17 312 226 -150 160 123 94 178 111 -168 -98 18 -179 75
8130 75 -143 -134 -126 -217 156 -175 181 -100 51 75 123 237 63 158 -100 -118 150 341 84 -195 103 -82 -103 356
8154 356 39 301 151 227 -53 -33 210 183 117 136 -64 24 146 -220 -190 155 -13 -218 61 208 145 152 -208
8177 -208 62 253 -80 -85 80 -156 -201 253 403 -64 -289 -124 -271 -113
8191a13
##END NTUPLES=NMR FID
##END=
