##TITLE=1H_DE-63_34
 D2O
 8 sc, 
 14.8.2024
##JCAMPDX= 6.0         $$ Bruker NMR JCAMP-DX V2.0
##DATA TYPE= NMR FID
##DATA CLASS= NTUPLES
##ORIGIN= UXNMR, Bruker Analytische Messtechnik GmbH
##OWNER= root
$$ XWIN-NMR		Version 3.5
$$ Wed Aug 14 14:04:58 2024 Russian Standard Time (UT+4h)  she@DPX200
##.OBSERVE FREQUENCY= 200.1318
##.OBSERVE NUCLEUS= ^1H
##.DELAY= (6, 6)
##.ACQUISITION MODE= SIMULTANEOUS
##.ACQUISITION SCHEME= undefined
##.AVERAGES= 8
##.DIGITISER RES= 18
##SPECTROMETER/DATA SYSTEM= spect
##.PULSE SEQUENCE= zg30
##.SOLVENT NAME= D2O
##.SHIFT REFERENCE= (INTERNAL, D2O, 0, 15.7039)
##AUDIT TRAIL= $$ (NUMBER, WHEN, WHO, WHERE, WHAT)
$$ ##TITLE= Audit trail, XWIN-NMR		Version 3.5
$$ ##JCAMPDX= 5.01
$$ ##ORIGIN= Bruker BioSpin GmbH
$$ ##OWNER= she
$$ F:/spectra/data/she/nmr/H-F/1/audita.txt
$$ ##AUDIT TRAIL=  $$ (NUMBER, WHEN, WHO, WHERE, WHAT)
(   1,<2024-08-14 14:04:05.09 +0400>,<she>,<DPX200>,
      <created by zg, POWCHK disabled, PULCHK disabled
       configuration hash MD5:
       00 E9 B6 7A A2 85 ED C7 34 08 36 98 17 FE 4E 26
       data hash MD5: 16K
       E4 F5 5C 7A E8 F0 BF 3E C6 69 C1 2C 1B F5 14 23>)
$$ ##END=
$$ 
$$ hash MD5
$$ DD DE 73 81 3A E9 01 DC 32 DB 0A C4 9C 86 D2 DD
##$RELAX= 
##$RELAX= 
##$RELAX= 
##$RELAX= 
##$RELAX= 
##$RELAX= 
$$ Bruker specific parameters
$$ --------------------------
##$DU= <F:/spectra>
##$EXPNO= 1
##$NAME= <H-F>
##$PROCNO= 1
##$TYPE= <nmr>
##$USER= <she>
##$AMP= (0..31)
100 100 100 100 100 100 100 100 100 100 100 100 100 100 100 100 100 100 
100 100 100 100 100 100 100 100 100 100 100 100 100 100 
##$AQSEQ= 0
##$AQ_mod= 1
##$AUNM= <au_zg>
##$AUTOPOS= <>
##$BF1= 200.13
##$BF2= 200.13
##$BF3= 200.13
##$BF4= 200.13
##$BF5= 200.13
##$BF6= 200.13
##$BF7= 200.13
##$BF8= 200.13
##$BYTORDA= 1
##$CFDGTYP= 0
##$CFRGTYP= 5
##$CHEMSTR= <none>
##$CNST= (0..31)
1 1 145 1 1 1 1 1 1 1 1 1 1 1 1 1 1 1 1 1 1 1 1 1 1 1 1 1 1 1 1 1 
##$CPDPRG= <>
##$CPDPRG1= <>
##$CPDPRG2= <>
##$CPDPRG3= <>
##$CPDPRG4= <mlev>
##$CPDPRG5= <mlev>
##$CPDPRG6= <mlev>
##$CPDPRG7= <mlev>
##$CPDPRG8= <mlev>
##$CPDPRGB= <>
##$CPDPRGT= <>
##$D= (0..31)
0 1.2 0 0 0 0 0 0 0 0.06 0 0.03 0 0 0 0 0.0002 0 0 0 0 0 0 0 0 0 0 0 0 
0 0 0 
##$DATE= 1723629844
##$DBL= (0..7)
120 120 120 120 120 120 120 120 
##$DBP= (0..7)
150 150 150 150 150 150 150 150 
##$DBP07= 0
##$DBPNAM0= <>
##$DBPNAM1= <>
##$DBPNAM2= <>
##$DBPNAM3= <>
##$DBPNAM4= <>
##$DBPNAM5= <>
##$DBPNAM6= <>
##$DBPNAM7= <>
##$DBPOAL= (0..7)
0.5 0.5 0.5 0.5 0.5 0.5 0.5 0.5 
##$DBPOFFS= (0..7)
0 0 0 0 0 0 0 0 
##$DE= 6
##$DECBNUC= <off>
##$DECIM= 24
##$DECNUC= <off>
##$DECSTAT= 4
##$DIGMOD= 1
##$DIGTYP= 9
##$DL= (0..7)
0 120 120 120 120 120 120 120 
##$DP= (0..7)
150 150 150 150 150 150 150 150 
##$DP07= 0
##$DPNAME0= <>
##$DPNAME1= <>
##$DPNAME2= <>
##$DPNAME3= <>
##$DPNAME4= <>
##$DPNAME5= <>
##$DPNAME6= <>
##$DPNAME7= <>
##$DPOAL= (0..7)
0.5 0.5 0.5 0.5 0.5 0.5 0.5 0.5 
##$DPOFFS= (0..7)
0 0 0 0 0 0 0 0 
##$DQDMODE= 0
##$DR= 18
##$DS= 0
##$DSLIST= <SSSSSSSSSSSSSSS>
##$DSPFIRM= 0
$$ [...]
##$SUBNAM2= <"">
##$SUBNAM3= <"">
##$SUBNAM4= <"">
##$SUBNAM5= <"">
##$SUBNAM6= <"">
##$SUBNAM7= <"">
##$SUBNAM8= <"">
##$SUBNAM9= <"">
##$SW= 24.0689170037331
##$SWIBOX= (0..15)
0 0 2 0 0 0 0 0 0 0 0 0 0 0 0 0 
##$SW_h= 4816.95568400771
##$TD= 16384
##$TD0= 1
##$TE= 0
##$TE2= 300
##$TE3= 300
##$TEG= 300
##$TL= (0..7)
0 120 120 120 120 120 120 120 
##$TP= (0..7)
150 150 150 150 150 150 150 150 
##$TP07= 0
##$TPNAME0= <>
##$TPNAME1= <>
##$TPNAME2= <>
##$TPNAME3= <>
##$TPNAME4= <>
##$TPNAME5= <>
##$TPNAME6= <>
##$TPNAME7= <>
##$TPOAL= (0..7)
0.5 0.5 0.5 0.5 0.5 0.5 0.5 0.5 
##$TPOFFS= (0..7)
0 0 0 0 0 0 0 0 
##$TUNHIN= 0
##$TUNHOUT= 0
##$TUNXOUT= 0
##$USERA1= <user>
##$USERA2= <user>
##$USERA3= <user>
##$USERA4= <user>
##$USERA5= <user>
##$V9= 5
##$VALIST= <valist>
##$VCLIST= <CCCCCCCCCCCCCCC>
##$VD= 0
##$VDLIST= <DDDDDDDDDDDDDDD>
##$VPLIST= <PPPPPPPPPPPPPPP>
##$VTLIST= <TTTTTTTTTTTTTTT>
##$WBST= 1024
##$WBSW= 4
##$XGAIN= (0..3)
0 0 0 0 
##$XL= 0
##$YL= 0
##$YMAX_a= 165605
##$YMIN_a= -151028
##$ZGOPTNS= <>
##$ZL1= 120
##$ZL2= 120
##$ZL3= 120
##$ZL4= 120
##$ABSF1= 10
##$ABSF2= 0
##$ABSG= 5
##$ABSL= 3
##$ALPHA= 0
##$AQORDER= 0
##$ASSFAC= 0
##$ASSFACI= 0
##$ASSFACX= 0
##$ASSWID= 0
##$AUNMP= <proc_1d>
##$AZFE= 0.1
##$AZFW= 0.1
##$BCFW= 1
##$BC_mod= 2
##$BYTORDP= 1
##$COROFFS= 0
##$CY= 11.3945322036743
##$DATMOD= 1
##$DC= 2
##$DFILT= <>
##$DTYPP= 0
##$F1P= 15.6554695791079
##$F2P= 12.8336369535428
##$FCOR= 0.5
##$FTSIZE= 0
##$FT_mod= 4
##$GAMMA= 1
##$GB= 0.15
##$INTBC= 1
##$INTSCL= 1
##$ISEN= 128
##$LB= 0.24
##$LEV0= 0
##$LPBIN= 0
##$MAXI= 10000
##$MC2= 0
##$MEAN= 0
##$ME_mod= 0
##$MI= 1.114404
##$NCOEF= 0
##$NC_proc= 0
##$NLEV= 6
##$NOISF1= 3.799351
##$NOISF2= 2.8
##$NSP= 1
##$NTH_PI= 0
##$NZP= 0
##$OFFSET= 15.70392
##$PC= 1
##$PHC0= -26000.3
##$PHC1= 12.78748
##$PH_mod= 1
##$PKNL= yes
##$PPARMOD= 0
##$PSCAL= 0
##$PSIGN= 0
##$REVERSE= no
##$SF= 200.130013532006
##$SI= 16384
##$SIGF1= 3
##$SIGF2= 2
##$SINO= 400
##$SIOLD= 16384
##$SREGLST= <1H.CDCl3>
##$SSB= 0
##$STSI= 0
##$STSR= 0
##$SW_p= 3612.71676300578
##$SYMM= 0
##$S_DEV= 0
##$TDeff= 0
##$TDoff= 0
##$TI= <>
##$TILT= no
##$TM1= 0
##$TM2= 0
##$TOPLEV= 0
##$USERP1= <user>
##$USERP2= <user>
##$USERP3= <user>
##$USERP4= <user>
##$USERP5= <user>
##$WDW= 1
##$XDIM= 8192
##$YMAX_p= 0
##$YMIN_p= 0
$$ End of Bruker specific parameters
$$ ---------------------------------
##NTUPLES= NMR FID
##VAR_NAME=  TIME,          FID/REAL,        FID/IMAG
##SYMBOL=    X,             R,               I
##VAR_TYPE=  INDEPENDENT,   DEPENDENT,       DEPENDENT
##VAR_FORM=  AFFN,          ASDF,            ASDF
##VAR_DIM=   8192,          8192,            8192
##UNITS=     SECONDS,       ARBITRARY UNITS, ARBITRARY UNITS
##FACTOR=    0.0002076,     1,               1
##FIRST=     0,             0,               0
##LAST=      1.7004516,     0,               0
##MIN=       0,             -151028,         0
##MAX=       1.7004516,     165605,          0
$$ Real data points
##PAGE= N=1
##DATA TABLE= (X++(R..R)), XYDATA
0@%%%%%%%%%%qJ6j6J6j6K0k8L2l9M7n6O6p4Q8j03J18j36J55j74K00k29K55k87
33a53L24l60M02m50M98n53O17o82P54q38R29j027J137j261J399j557J737j943
51a027K183k470K819l249L796m520N524p001R321j7440J77669k5084j87386j3545
65f0410k7671L8976J73999K2960k09314p7938J15426R5086K981l0131p8975p0436
77a05447O3621J50268l379j45023m5707N0865K6288P3233M1319j42914j02828
88a39704J13425R3270j5131j3463p3237q4279R2786J28960l7773r3518l5477O719
100e7422P1902P4620m1928j01149k3426O5962P1472K665n6814n5568j1031O1412
112F95P7724k5482q4264j7616J9582L0329O5862j0141j07380j9883P0961K6718
$$ plain form
0 0 0 0 0 0 0 0 0 0 0 0 -8 8 -8 8 -8 12 -16 16 -23 24 -32 34 -40 48 -55 63 -73 82 -92 108 -121 134 -153
33 -153 171 -189 213 -237 261 -292 325 -357 397 -441 488 -539 598 -663 736 -821 916 -1027
51 -1027 1156 -1314 1505 -1744 2052 -2468 3056 -3945 5376 -12064 165605 140521 -46865 -60410
65 -60410 -88081 -49105 124894 147854 -61460 -139398 -23972 71114 74095 43964 -35011 -105447
77 -105447 -41826 108442 105063 -39960 -85667 -34802 -8514 64719 106038 -36876 -139704
88 -139704 -26279 66991 51860 38397 -34840 -119119 -26333 102627 64854 -28664 -64141 -57422
100 -57422 14480 89100 47172 -53977 -77403 -11441 60031 62696 5882 -49686 -60717 695
112 695 78419 52937 -31327 -48943 -29361 968 66830 56689 -50691 -70574 387 27105
124B7105J2969k890q5686l5649R6028N8875m3596m5909k9320j725O9751N8481
136G8434n0605q6006n019O5042M7683m644l7952n4373j4321P8034O1813n3696
148B4390o0159N068O976L2610N9715l9217r0797J6323O2592J0886N012j8551o8381
161e3533k019Q4638L1941m7559m3135j3576J7242N3940L1953m8153o9404R715
173d7950O5341K5811j8568k8534m0204J210P4356L0248o2023l7117J6100J1167
185a0163L2352L0925n2069n6729L3544M6590J801m423k4411m2280J6149O1681
197C2967J1152m2670l0185P44J8669L4088J6183m1257m8241K2251M9950M569j6922
210A1298j8566l0396J1641O1375O527n3632j7426J3848R748L0883J3469m9885
$$ plain form
124 27105 40074 37184 -48502 -84151 11877 70752 27156 -18753 -48073 -49798 19953 78434
136 78434 27829 -58177 -63196 1846 49529 44885 6933 -47440 -61761 16273 78086 24390
148 24390 -35769 -30701 -23725 8885 68600 29383 -61414 -45091 17501 28387 33399 14848 -53533
161 -53533 -55552 29086 61027 13468 -29667 -43243 -26001 27939 59892 11739 -57665 -47950
173 -47950 17391 43202 24634 -3900 -44104 -42894 31462 61710 -313 -37430 -21330 -10163
185 -10163 22189 53114 1045 -55684 -22140 24450 26251 21828 -2583 -44863 -28714 32967
197 32967 44119 1449 -28736 -27992 -9323 24765 40948 -309 -48550 -26299 23651 28220 11298
210 11298 -7268 -37664 -26023 35352 41879 -11753 -29179 -15331 -5583 25300 38769 -11116
222a1116l3688L4196L2867j9q169k3273k5443K0504M4732O33l7285j8755Q589
235a6227J5168K3308P142l8289l1519K8814L5541m332j3315j6235k3122K0447
247a2619M6602o867m1451q440R888J2501K5243O11m1504j7404L0013K3509k630
260A7452j1040j8875j3737K1917L3030q009l2801q050J1268J2168J7415k30l5825
273a5317j6100L0755K1497p909q697j5727j5345K4255L2650j4890k9898j536P563
286h699J0860J9440n797l4096p156K7901J5587p124r036j3792r106K2385K5501
299B6868j4185k8112M14J0813Q184J4706m965l0979o174K8732J2064q848o938
312A580j2495q551K2364K1787j6446k2916K243Q772Q554J2192q752k5902j742
$$ plain form
222 -11116 -44804 -10608 22259 22240 14071 -9202 -34645 -14141 30591 31224 -6061 -24816 -16227
235 -16227 -1059 22249 29391 -8898 -40417 -11603 23938 19606 6291 -9944 -33066 -12619
247 -12619 33983 27116 -14335 -22775 -12887 -386 24857 25468 -16036 -33440 -3427 20082 17452
260 17452 6412 -12463 -26200 -4283 28747 20738 -12063 -20113 -8845 3323 20738 20508 -15317
273 -15317 -31417 -662 20835 12926 4229 -11498 -26843 -2588 30062 15172 -14726 -16262 -8699
286 -8699 2161 21601 15804 -18292 -25448 2453 18040 10916 1880 -11912 -21018 1367 26868
299 26868 12683 -15429 -15015 -4202 3982 18688 13723 -17256 -23430 5302 17366 8518 1580
312 1580 -10915 -19466 2898 24685 8239 -14677 -12434 -3662 4892 17084 8332 -17570 -19312
325a9312K4869J0402r091q337j0197l560J9957J7652j6219k0785L451Q986P997
338E813R499q567k3504J475K2935O293q571o646r729j571J9612J2308j6533j6223
352a3409M222Q141P320P966j0551k0332L879K0564M075p574o720q412l49J8738
366G558J0022j6772j3043M853O789O239P247j1126j7449O207J8056J860p458n402
380b419p829J403J7771O586j6354j0828N685O341N854N061j0833j5397P479J6115
394H635N68p633m286o437J744J6101M688j5837q269N809N693N064L827j0856j2553
409a3742P906J4753o59p385m095n255L058J4519K276j4318o849O466M653M497
423E825K215j0044j0492Q871J2330k104o363l547m346L385J3355M91j3698m793
$$ plain form
325 -19312 5557 15959 6868 -1469 -11666 -15226 4731 22383 6164 -14621 -11170 -2184 5813
338 5813 15312 6745 -16759 -15284 7651 13944 5373 -1273 -11002 -12573 7039 19347 2814 -13409
352 -13409 -9187 -1046 6274 14240 3689 -16643 -12764 7800 11875 4301 -2419 -10831 -11180 7558
366 7558 17580 808 -12235 -7382 -593 5646 12893 1767 -15682 -9475 8581 10441 2983 -2419
380 -2419 -10248 -8845 8926 15512 -842 -11670 -5985 356 6210 11271 438 -14959 -7480 8635
394 8635 9203 1570 -2716 -9153 -7409 8692 13380 -2457 -10726 -4917 776 5840 9667 -1189 -13742
409 -13742 -5836 8917 8258 873 -3222 -8477 -5419 9100 11376 -2942 -9791 -3325 1328 5825
423 5825 8040 -2004 -12496 -3625 8705 6601 238 -3309 -7655 -4270 9085 9576 -4122 -8915
437h915O597M012L853J790j0571p943Q782J0524k871n494k914l822M129J1732
451H889q99j2684k814O034L343L061Q92r215p041R693Q775l798n108j897l610
466f379M327J0567k016j1830j326O267K184L006N85r300n409R141P761l740m874
481a036k138k583M854Q910k331j0800j104N758K727J818M4q448m054R732N897
496G246m723l668j794k301N288P839m026r410M87N010K102K168r95p854k110Q027
512A286M528l783l573j361r97M022O813l786q377P31N041J596J584j224p163j587
528f250Q533L612m696k621j375j075N077N312n060o480J640L743J801J148k004
543A305n982l05P107K869l980k894n28m50L948M934m478o661K031M370M96J360
$$ plain form
437 -8915 -2318 1694 5547 7337 -3234 -11177 -2395 8129 5258 -236 -3150 -6972 -2843 8889
451 8889 7990 -4694 -7508 -1474 1869 4930 5822 -3393 -10434 -741 8034 4236 -872 -2769 -6379
466 -6379 -2052 8515 6499 -5331 -6657 -390 1794 4800 5385 -3915 -9324 -183 7578 3838 -1036
481 -1036 -3174 -5757 -903 8007 5676 -5124 -6228 -470 2257 4075 4119 -4329 -8383 1349 7246
496 7246 2523 -1145 -2939 -5240 48 7887 3861 -5549 -5062 -52 2050 4218 3223 -4631 -6741 1286
512 1286 5814 2031 -1542 -2903 -3900 122 6935 3149 -5228 -4497 544 2140 3724 2500 -4663 -6250
528 -6250 2283 5895 1199 -1422 -2797 -3872 1205 6517 1457 -5023 -3383 360 2161 3309 1305
543 1305 -4677 -4982 2125 4994 1014 -1880 -2408 -2858 1090 6024 1546 -5115 -3084 1286 1782 3142
559C142j247o767K72P861R83l859j742j426o3N121L243n675m246J869L629J372
575B467J66j962m484K00O163J857n039r51J01p97L900L680m973m970L359K444
591A161L51J276j855n458J533O449n40k821j537j239Q75M600J041m479l614K526
607a731L328N93o37j821l133J102N587n9m096o89P18o45L602J656m846k804L618
624b57J194J61J392k804l564K500M088m11k306j380n88J175L302P73l894k941
640c560K297L275r3q11j343l282K214M675j308l909Q35J96l40L798J49m649q64
657b720K983L33N05N69k859j900K788K704q50j774j428k1J294K620M2l361k191
674c266K529K400m22l21j756k371K842L853k203l038J014l09P23L127r86m107
$$ plain form
559 3142 1895 -4872 -4600 3261 4244 385 -1357 -2783 -2846 2275 5518 -157 -4403 -2534 1095 2467
575 2467 2633 671 -3813 -3613 2550 4407 -632 -1583 -1482 -2279 1621 5301 328 -4642 -1283 1161
591 1161 1512 2788 933 -4525 -2992 3457 2917 96 -1441 -2680 -1805 2795 3836 -643 -4257 -1731
607 -1731 1597 2190 1553 -268 -3401 -2299 3288 3229 -867 -1556 -838 -1483 2119 3775 -1071 -3875 -257
624 -257 937 1098 2490 -314 -3878 -1378 2710 2299 -7 -1387 -1975 -800 2502 3275 -619 -3560
640 -3560 -1263 2012 1919 1108 -235 -3517 -1303 3372 2064 -1845 -1010 -814 -1154 2644 2793 -1856 -2720
657 -2720 263 596 1101 1670 -1189 -3089 -301 2403 1553 -221 -1649 -1670 -376 2244 2286 -1075 -3266
674 -3266 -737 1663 1241 920 -836 -3207 -365 3488 1285 -1753 -739 -1048 -325 2802 1816 -2291
690b291K75K413K49O64n12k109o96K381J839r41k033n17K62R56K171l12l405j172
708b778L269J012o75J27j753k371L688K582k806j368M22m24J468J923j590l170
724b444J343J756L07k7n65j581J37J679J050j041j838L18K41O67J516k07l119
741a808K90K564j60n04J48j938p59L240J145k519m01j58K94J387J371k254j882
758a944J025J592O67n18j270p72K52J520J458k082j180J130j37N27R83p14k221
775a684Q18K153r53M15l39j881J11K635J3j524l32l36N55J432J09j654j380J259
793e83J597mo77n01p91K79J712M75k000p22J092n8Q33P80j516j200R88J284q32
812A56K20l09j621P43K192o63r84n04l84Q46J041J61j609m70P22J557k48o53m64
$$ plain form
690 -2291 -2016 397 646 1310 798 -1311 -2007 374 2213 1272 -761 -1278 -1016 -60 2111 1799 -1606 -2778
708 -2778 491 1503 828 955 -798 -3169 519 3101 295 -1073 -651 -1075 393 2316 726 -2444
724 -2444 -1101 655 962 935 370 -1211 -1074 605 1655 614 -1224 -906 -665 2 1518 1311 -1808
741 -1808 -1518 1046 886 382 530 -1408 -2167 1073 2218 -301 -702 -860 -566 821 2192 -62 -1944
758 -1944 -919 673 1340 822 -448 -1220 -968 552 2010 -72 -1252 -122 -259 268 1251 537 -1684
775 -1684 -866 1287 334 749 410 -1471 -1360 1275 1288 -236 -568 -904 -349 1083 1192 -462 -1842 -583
793 -583 1014 1010 333 -168 -959 -680 1032 1507 -493 -1215 -123 -181 652 1432 -84 -1284 -296 988 156
812 156 376 67 -1554 -811 1381 718 -266 -770 -1154 -308 733 894 -715 -1185 -463 1094 846 193 -271
831b71q80O69J538j19j511l04N84K15M72O02j465p61J418K60l56K70q96o52J010
850a77P16k06n85j61J22L64M58K18j258n45J015R80o72l10J8q10P44J181o20r90
870e18J76K20Q7R13m84r70j63J060L84n75N9n37k72K97R57k39q40j52N59k00P62
891E24k58q25j88R75K88n49P0l13l40Q30O67p94q59N02J87K96J62r6j032K07P50
912B04J21m1k70k98m8M04P19l31p48Q0L96l1M60n45p81L83O73J28n22J70n58K1
934d14O01O17q29o58L63L80L4N25o94o66N60M08j07j25p7k08k0P24K91q86l21
955e02L03J73L35K91m89o73K99J120p09R1j93o84J33Q46L06j109K82L47k89M55
975C33L09n92n74J00R32r9n27J88k91J35N35N6n78k70J69K96o8L98n66l51M91
$$ plain form
831 -271 -1151 -482 1056 937 -574 -878 -294 -79 393 995 -470 -1231 187 447 91 361 -535 -1187 -177
850 -177 539 333 -252 -413 -291 73 531 749 -509 -1054 -39 941 269 -41 -23 -833 -89 1092 472 -518
870 -518 -342 -122 -35 878 394 -576 -739 321 705 130 189 -348 -620 -323 634 395 -445 -597 -38 -238 524
891 524 266 -559 -747 228 516 -33 37 -276 -616 214 881 87 -772 -270 -83 213 375 279 -753 -546 204
912 204 325 284 14 -284 -332 72 791 460 -288 -208 188 157 617 72 -709 -326 347 475 -47 123 -435 -414
934 -414 187 804 -25 -683 -320 60 94 619 -75 -741 -181 227 120 -5 -82 -290 -310 414 705 -181 -502
955 -502 -199 -26 309 600 111 -562 -263 857 148 239 46 -638 -505 341 647 -462 -180 167 -122 333
975 333 642 50 -524 -424 508 409 -118 70 -221 -86 449 505 -73 -343 -174 122 54 452 -114 -465 26
996B6M68p58K41J21o54J82O72L86o86l25K55K25J5j83k70%J6O48l80J21J87k91
1018A6R3K67r2l61o27P42L6l3J67m48m0J22N77l03l4l91J14N5O89o46j91L48l1
1041B9J29m1L50q10R9J87J13K11l78k11L47k49J99J4m22M58n9pN9L12n24j69N15
1064A52J92o87J00J74m6M9O18j62l83n04O12k01M10k91j84k0M96l7n60J04J30
1085c8n1L03R1k89j51J85n6L68l00q3r6k31O68N3o76L95l9j59M75j52k10k97n1
1108c41L08Q4m9K68n16L37Q2K2K25m43j37o8K91J62k31m04L05J05m3R1k48J28
1130g2l23O47l24j0N1j2l92L65K56n57M58r6J83k30K73m59N6j52M42J25j44k47
1152a62N2kL72kl63Q1O4K67j82p8j79NK3P4K36l68J04K02k08K84J0l33l77M59
$$ plain form
996 26 494 -264 -23 98 -556 -374 298 684 -2 -327 -72 153 168 -15 -285 -285 -269 379 -1 120 307 16
1018 16 109 376 284 -77 -704 38 74 41 208 -240 -280 -158 419 116 82 -309 -195 -140 549 -97 -288 60 29
1041 29 158 117 467 -343 -244 -57 56 267 -111 -322 25 -224 -25 -11 -433 25 -34 -41 18 330 -194 -363 152
1064 152 344 -343 -243 -69 -115 -66 552 390 7 -497 115 -86 324 33 -151 -171 325 288 -272 -168 -38
1085 -38 -89 214 305 16 -135 50 -6 362 62 -21 -117 -348 320 373 -303 92 53 -106 369 217 7 -290 -341
1108 -341 -33 51 2 270 -246 91 173 195 420 -23 -160 -228 63 225 -6 -410 -105 0 -43 48 -200 -72
1130 -72 -395 252 -72 -82 -31 -43 -435 -70 186 -371 87 -9 174 -56 217 -242 -186 -338 104 229 85 -162
1152 -162 -110 -112 260 258 -105 -24 40 307 125 47 -132 -127 -104 -30 206 -162 -58 144 -64 220 230 -103 -480 -21
1176b1M41l50O5l16j1L93L68k85l34J74r9K7J68N3k19Q7j53J21J18q9J6l48P7
1199a17J51j57L4P9J28k6qJ93m27O9J03J31j25J14q2l83R6J54k01J42J49j14R8
1222AK26m0j30l7O6j48J19j07J19m72N10L4j26r0OK47k21K77k33o5k44M62nk7
1246A22m9l41M3K61J08J16m10K17j50R3K55l47jJ85J41p0l11K89j88NJ40Q6k03
1269il27L31K71j7k21k42n4K82k8M3q3K6k13K28N6j65l4kK04k67P1K86j6l24p6
1294b80L23L46m25J33k65J33J01L2J7m35L76l05J38J21j48J87L2J06l43L86m70
1315b40P8K17M04m37l37J43k0J6J06K40k34j13J73J28K04l04K3l11L5R47m51j99
1337F8l91K56k02K81L67n01J77K77m70K06J2l46K43K7J69j01l1l66M00J32O2j71
$$ plain form
1176 -21 420 70 135 -181 -192 201 569 284 -50 124 25 52 220 273 54 141 -12 109 227 138 154 -194 -117
1199 -117 34 -123 -89 -10 118 92 84 277 -150 -81 22 153 28 142 60 -323 -227 -73 -274 -132 17 -97 1
1222 1 227 187 57 20 86 -62 57 -50 69 -403 107 141 15 -75 -69 178 -43 234 1 -64 -308 154 149 122
1246 122 73 -268 -225 36 144 260 -150 67 -83 10 265 -82 -83 102 243 173 -138 151 -37 -32 108 194 -9
1269 -9 -336 -5 266 249 28 -214 -268 14 -14 29 -54 -28 -241 -13 43 -122 -156 -158 46 -221 -150 136 120 -204 -280
1294 -280 43 389 -36 97 -168 -35 66 98 115 -320 56 -249 -111 10 -138 49 81 187 -156 230 -240
1315 -240 -162 55 459 22 -315 -172 -192 -176 -70 170 -64 -177 -4 124 328 24 47 -264 -229 718 267 68
1337 68 -323 -67 -269 12 379 -122 55 332 -138 68 80 -266 -23 4 173 72 41 -325 75 207 269 98
1359I8j17k2L32r8l53P0j51K3M44k85J04k02M04j49j10J83p9j37J2K36j46j22
1381f5P5lq4j96K22r9J56K04m20L80o9j27m9j09L14n9r2K04j65j30j58K61j09
1404a18p8M42j82O1K15j79k48J56j62o4jK51M9k41M09j80k68J08L15l05j96K17
1426AL8M2j9M5k28K6q0L52l11M72l85J01p5k27K46K6J13k25NO1J43j62J01j95
1450a35k4J64L20l30J41r4j56J15l69L72J37k17J49j04K48m60L38j61K94j01k30
1471a03Mk2K04k99J80qn6mN6M4p4K26k58K5n6K83J78l11N2j04J34m3J30k97m4
1496a63L36j24l4j82O4K35J9k01m1k64J53K87m57J31K94j28K27Q6r5K5j06j81
1518a19p0L2K76J18m17J28J75l6n6L7l68J5J70J98j14P3j40Q3K03l59K93j58J20
$$ plain form
1359 98 -19 -41 291 193 -160 -90 -241 -218 226 -59 45 -157 247 98 -12 171 92 -45 -33 203 57 -65
1381 -65 10 7 -77 -273 -51 -150 6 210 -210 170 101 -26 -75 -184 130 71 -21 183 18 -112 -270 -9 -118
1404 -118 -196 246 64 125 340 161 -87 69 -93 -157 -158 93 142 -99 310 130 -138 -30 285 -20 -216 1
1426 1 39 81 62 107 -121 -95 -175 177 -134 338 -47 54 -21 -248 -2 24 137 -88 -83 -22 121 -41 60 -135
1450 -135 -159 5 325 -5 136 42 -114 1 -368 4 141 -76 73 -31 217 -243 95 -66 228 127 -103
1471 -103 -99 -121 83 -216 -36 -44 -100 -104 -48 -4 -78 148 -110 -85 -141 142 320 9 61 -43 91 48 178 -119 -163
1496 -163 173 49 15 -167 -103 132 151 -50 -91 -355 -202 85 -372 -241 53 -75 152 238 143 168 62 -119
1518 -119 -189 -157 119 237 -180 -52 123 87 31 68 -300 -285 -115 83 -31 42 -98 -15 188 -171 122 -36 84
1541H4l57K41O4r9L60m27L86N5m81K92q5l39J08J83J80m43K79J28J82l45Q3q8
1563c9k88Q9L14j38Ko2L7K76p1J5k12L8k41J04J17L07m68K67K13k57k72L67k35
1586a37J90J08k70N1j9N3j54j17P0k5j35K07K62k23M71l75k53J03L43k17m4K66
1608A55l66K29M37p81L05j8N8q4j1j31J8J61p3j21K28n3J85j46K25l17L83P1m01
1631d7K22k29k23M36j29k5p9K64k36j6j69J08J72M7K6j77J95j34J18k4l4K2l0
1654E8M2j6J27j11NK21k50j66J97k7K7j66n2J43n0K06l47K66N2J03q5k83j62L12
1678D4j38j1P9P5j80K09J4j04j08k43L26M73l36Q0j57Q9l38K29j25L8O7J48q6
1701D5j7r3O2K55k57Q4J06k33M5r0K18j93o7pk06L55j78l78N28J3j71k9M16q1
$$ plain form
1541 84 -273 -32 32 -67 293 -134 252 307 -174 118 33 -306 -198 -15 165 -278 1 129 311 -34 49 -39
1563 -39 -327 -238 76 -62 -60 -122 -85 191 120 135 -77 -39 -280 -176 -59 248 -220 47 260 3 -269 98 -137
1586 -137 53 161 -109 -58 -77 -24 -178 -295 -225 -250 -385 -178 84 -139 332 -43 -296 -193 150 -67 -111 155
1608 155 -211 18 455 -326 -21 -39 19 -65 -76 -207 -189 -28 -101 -222 6 -47 138 -8 217 -100 283 354 -47
1631 -47 175 -54 -277 159 30 5 -74 190 -46 -62 -231 -123 49 96 122 -55 140 6 124 100 66 88 58
1654 58 100 84 211 100 105 326 76 -90 107 80 107 -59 -111 32 -18 188 -159 107 159 262 177 -106 -268 44
1678 44 -94 -105 -26 49 -131 78 92 -12 -120 -363 -37 436 100 180 23 112 -226 3 -122 -84 -17 131 45
1701 45 28 -65 -3 252 -5 79 185 -48 -3 -93 125 -68 -135 -142 -348 7 -171 -549 -21 -8 -179 -208 208 127
1725A27k12j29N74j11m92J33M7L6M5oJ16R8j83m7k26N90l68j64K21l89L52K9J94
1748B35n15L80j56K05P7k51j13K97K6o4J62k46J78k07l2j48J41R6j87K10J45k99
1770f6O4R5j57K75m9j97j15M16j06J17m57K26j71RL40k90k30L85j73n6j68M9L35
1793G6k00K52O2n08L87l04J79M40n37J10K10k31J81j00J42J6j45L5k69J76j36
1814a64J5n8K19J77m06N4m0R2n0N08m30J18j06L02m69%N91p10M20JK6m4q9K51
1838B08l34M76l42j93J77k47J14K15l89K66L8m6O2M19j23k81kp3m9J37k52K45
1860B6J51j68p2J44j1k94N26k86J0J56l73J42l17L98O0k20K08j52j23L61L6l01
1882i9O7j8O3m29M00OL22m10K33O6j58j89R2j27m4L98j63M7k64L5J83j04k73L27
$$ plain form
1725 127 -85 -214 360 249 -243 -110 -63 -27 18 12 128 226 43 -4 -230 360 -8 -172 49 -340 12 41 235
1748 235 -280 100 -56 149 226 -25 -138 159 185 121 283 37 215 8 -24 -172 -31 65 -122 88 233 -66
1770 -66 -2 93 -64 211 162 -35 -150 266 160 277 -180 46 -125 -116 224 -66 -296 89 -84 -140 -308 -259 76
1793 76 -124 128 190 -318 69 -235 -56 384 -153 -43 167 -64 117 17 159 175 30 65 -204 -28 -164
1814 -164 -149 -207 12 189 -217 -163 -203 -111 -161 347 -83 35 -71 231 -238 -238 353 -357 63 64 90 46 -43 208
1838 208 -126 350 8 -185 -8 -255 -141 74 -315 -49 -11 -57 5 424 301 20 18 -55 -104 33 -219 26
1860 26 177 9 -63 81 70 -224 302 16 26 182 -191 -49 -366 32 92 -128 80 -72 -195 166 202 -99
1882 -99 -32 -50 13 -416 -16 -10 312 -98 135 201 43 -146 -54 -181 -225 173 10 57 -207 -172 11 -93 -366 -39
1906c9kL40l62J53k51K95j08J09q7l09L12k26q5O0K33Mm3R3j78j15J43K45L9m5
1930A76o7p8l70M06j18j33J65J36j09K16j97r7M3J16J87o35K13K20m4j39r2N13
1952C12j69M9l41K00r7pL65k93o4J88j67k5K6l43M93k1j82K02j77l7J2O9K5p5
1976e7j7J81mr0Q4J09l45K85j57j39J85k4J43o4K23j72l21K30L5j80M2Kr9R4K9
2001b7O2k81n9N22l13k65M04l14L59J31l81L36j69J5k9o9K05k4j3q3j26J70k77
2024b26K36k33J39J09m04M58k67K14n8j46L2J13j85L42l35L33l00m0M03j58K9
2045E6k00J98l36J32j78M61p9L3k22K94l72L46L1k13L00n44M54j33K16k18j95
2066a69J4o4J52j93Q1M04j73J11k43J23k57K63J93q0k23J06mk44K36r9J36m73
$$ plain form
1906 -39 -41 299 -63 90 -161 134 26 135 48 -261 51 -175 -260 -200 33 37 -6 87 -91 -206 -63 182 221 176
1930 176 109 31 -339 67 -51 -184 -19 117 8 224 27 -70 -27 89 276 -359 -146 74 30 -109 -201 312
1952 312 143 192 -149 51 -46 -53 312 19 -45 143 -24 -49 -23 -366 127 106 -76 126 -51 -88 -76 -7 18 -57
1976 -57 -74 107 103 13 97 206 -139 146 -11 -150 35 11 154 90 313 141 -180 50 85 -95 -53 -51 -150 -56 -27
2001 -27 35 -246 -305 217 -96 -361 43 -271 88 219 -162 174 5 20 -9 -78 127 103 90 7 -119 51 -226
2024 -226 10 -223 -84 25 -379 79 -188 26 -32 -178 -146 -33 -218 124 -211 122 -178 -218 185 27 56
2045 56 -144 54 -282 -150 -328 133 54 87 -135 159 -213 133 164 -49 251 -293 161 28 244 26 -169
2066 -169 -155 -219 -67 -260 -179 225 52 163 -80 43 -214 49 242 162 -61 45 41 -203 33 -66 70 -403
2088d03N24m18k3L41Pj0K33m2Q7m49k5qL40L51n41j80K09p5K94J18m48L37m6p0
2112A03o2N8k09K18Q0j03o4n9J50j61j27K37q4%j55M2Q1M3l06L48k64Q1P3K9L45
2137B94j61k93K53j7k60L63l38j05M00k32P9L29j32k56kL97l6m61L9K23l06J60
2159f2K29k38J06K0L6J19n5j13P6k24J57J07j34O4jM2j85LJ13j95l1K46n3l36
2183c09L97J47l68J35pJ70l78L09j81j89M11kJ37l65K2J6ro3K33J30M7m14P2J51
2207I2j83K86l39K07k67K66j14L3J67l31J75j91J48j22L58j06p7M9q9q2K98k53
2229g5j0L64m25R1k88N63k54K00m1q6q6r9J87K07j05j6l21M64j59L7k46m4mN3
2253i3M40k84j40J82j70Q8K1L8J56Nn97K71P6K46o2j56J91k53L23l80J30K19k73
$$ plain form
2088 -403 121 -297 -320 21 28 18 251 209 296 -153 -178 -186 154 505 -36 -216 -7 -82 212 330 -118 219 173 103
2112 103 41 99 -110 108 188 85 21 -38 112 -49 -176 61 -23 -23 -178 -136 -55 -12 -318 30 -234 -153 -80 -51 294
2137 294 133 -160 93 76 -184 179 -159 -264 136 -96 -17 312 180 -76 -78 319 283 -178 -139 84 -222 -62
2159 -62 167 -71 35 55 91 210 155 42 118 -106 51 158 24 88 87 129 -56 -53 60 -135 -166 80 27 -309
2183 -309 88 235 -133 2 -5 165 -213 96 -85 -274 137 135 272 -93 -71 -55 -64 -127 106 236 283 -131 -59 92
2207 92 -91 195 -144 63 -204 62 -52 -19 148 -183 -8 -199 -51 -173 185 79 2 51 -38 -120 178 -75
2229 -75 -85 279 -146 -55 -343 220 -34 166 125 39 -47 -146 41 248 143 127 -194 270 111 148 -98 -142 -146 -93
2253 -93 347 63 -77 105 -65 23 44 82 238 243 -354 -83 -7 239 177 21 212 -41 282 -98 32 251 -22
2276b2j2n8M08l16P7K2j59L14k1m58m6K93J01r5k49L95j39j24p1n4M33k87Q7k8
2300iJ06m3k7K25o8l16J60j21K37k38K08j92K01q4k63K39k46L00q6R3kJ7n3j20
2324h2M2J13p5j7nk44J38K66k71J70K1l52K47J60j11L31m06J97l99N46j87j14
2346c2r6j07L2K09j52J50j87J75P3o3R7j41J99l7j44K41l2j46j40m2L04k14j67
2369b20M03l72P3N0l3o4K15M1n2l0J72k52K20j16n0j71j6N4J99P3k76L17k08p9
2393a22qQ0j54K09M21m31m6Pk3j95K72k70K24r2p0J12K56k96L04m77K01m8K8J47
2417B9J78k52L89m47J28l00J56L35j81J67j99N3K6N3M5j68k5k45N57k30o6n7J18
2440F4K41l27J14o0J01j38R9P1m31L90l1j69K33j15j05M9q8K05M9k43j65J65K
$$ plain form
2276 -22 -34 -92 316 0 77 99 -60 254 233 -225 -271 22 123 28 -221 174 35 -89 -160 -214 219 -68 19 -9
2300 -9 97 54 27 252 184 -132 28 -93 144 -94 114 -78 123 39 -224 15 -231 69 -17 76 74 91 38 -82
2324 -82 -40 73 -2 -19 -24 -268 -130 136 -135 35 56 -296 -49 111 0 331 -75 122 -277 269 82 -32
2346 -32 -128 -235 -203 6 -146 4 -183 -8 65 2 99 -42 157 120 -24 217 185 39 -101 -143 161 -53 -220
2369 -220 183 -189 -116 -66 -99 -163 52 93 41 11 183 -69 151 35 -15 -186 -202 -148 51 124 -152 165 -43 -122
2393 -122 -130 -50 -204 5 426 -5 -51 -44 -67 -262 10 -260 -36 -128 -198 -86 170 -126 178 -299 -98 -146 -118 29
2417 29 207 -45 344 -103 25 -275 -119 216 35 202 3 56 82 135 180 12 -13 -258 299 69 3 -54 64
2440 64 305 -22 92 32 133 -5 94 165 -266 124 93 -76 157 42 -63 -14 -102 103 152 -91 -256 -91 -89
2463h9q1L55P8l31o2J93k12M7j04J78J43l63L79k02PK05J10n22N34m10J82J29
2485A64N7Lm37J95O9k12J73m8L5O7j37l2K23J19j65M1j06K83l77K72j91J95k3
2508A68j56K4J7l38K38N7N5j67M3J01j43J23n1L10m99M72l12K91qk3k83K6K36
2531A81QJ94n09K63k99K93L7j35R4r0l28J33J44j30K51J29q4k69O1J61l09L79
2553A75j31q6K27m6n5j07J1n9L84n6k21J32l27M49k09jj28J1J22j59J65K2L1j73
2577b9R0J24k40J33n5k28M2M25l83J61j13n8OL8JJ66j20N8k91L29O5n22M82p3
2601HK28m69K54k30K9L93j08l26K28J64R3k4j81m0p6j03K25nj72J90k1R8l91N07
2625B71n31P3N98n49P5J09k70N4L00P8m29qJ43K54j38j4l4K3j29MJ65L1P0J99
$$ plain form
2463 -89 -170 185 263 -68 -130 63 -149 -102 -206 -28 115 -248 131 -71 -64 141 251 -271 263 -147 35 164
2485 164 221 224 -213 -18 51 -161 12 -36 -1 66 -71 -103 120 239 74 115 9 292 -85 187 -4 191 168
2508 168 12 36 53 -285 -47 10 65 -102 -59 42 -101 22 -29 281 -218 254 -58 233 225 202 -81 -55 181
2531 181 189 383 -126 137 -162 131 168 33 127 37 -291 -158 -14 -144 107 236 152 -117 -56 105 -204 175
2553 175 44 -42 185 139 84 -23 -12 -71 313 257 36 168 -159 290 81 80 -48 -37 85 -74 91 113 144 -29
2577 -29 61 185 -55 78 23 -205 -163 262 -121 40 -73 -131 -125 -87 -86 80 -40 18 -273 56 121 -401 81 8
2601 8 236 -233 21 -209 -180 213 105 -221 7 171 264 240 59 19 -57 -160 65 60 -112 78 57 155 -236 271
2625 271 -260 -187 411 -138 -63 46 -224 -170 130 208 -221 -229 -86 168 30 16 -18 5 -124 -120 45 76 146 345
2649C45m01K12k26n5J76j80JL04j05O4m0k2j98J56l9n5K4p6L03n80M66N3j52p9
2673a04L68l20J6j02L8J51j18M5J36J03r1K5n1J09k76n0J1K53J64m20K98m84O59
2696C60m14J67k82J41K75j56L08o76L01l82K06J74L7l3L0p2K14m84L61k04j4L13
2718A70k56M5J63j19K89j74J86k73k86K76L00m47l4J68j42Q6J26q9K2J85l31k4
2740a59Q7Q2mm75L48K42j85l0J68k5k11M38l12n1j57K26j54K43r4j46K12j52J93
2763H4k37J98k15J78J27o2k03P21o11k18K6K99m24K43j80K69l6K6K33n76J64K23
2785B9J7j94J08J25l5j4P7k85K08k30J59K28k52N3R0r3J71k79K31J7k2j65qK53
2809A89r7l3J36J36k38l24J65M72n96L95O4k83j27l3J28p5P2J22j55n5K36j68
$$ plain form
2649 345 -56 156 -70 -125 51 -129 -128 176 71 135 95 73 -125 31 -8 -63 -39 -115 188 -392 74 127 -25 -104
2673 -104 264 -56 -40 -142 -104 47 -71 -26 110 213 122 147 96 205 -71 -121 -110 143 307 -113 185 -299 360
2696 360 -54 113 -169 -28 247 91 399 -277 24 -358 -152 22 59 26 56 -16 198 -286 75 -129 -143 170
2718 170 -86 -41 122 3 292 118 304 31 -255 21 321 -126 -160 8 -134 -48 78 -11 11 196 -135 -159
2740 -159 -72 10 6 -469 -121 121 -64 -94 74 49 -162 276 -36 -87 -244 -18 -172 71 -23 -169 43 -109 84
2763 84 -153 45 -170 8 135 73 -130 591 -20 -238 -212 87 -337 -94 -274 -5 -41 -15 218 -358 -194 29
2785 29 46 -148 -40 85 50 36 113 -172 36 -194 -35 193 -59 -6 84 -9 162 -117 114 131 109 -56 -64 189
2809 189 92 59 195 331 93 -231 -66 406 -190 205 269 -14 -141 -174 -46 -121 -49 73 -82 -137 99 -69
2831f9L9N1J72k76Q8k81L97l52M98m54J80q2J42J08l23O10n03n4K28l8J65k35
2853A1j52r4K05J25l56M92l52J36m57N10m0K2j86J02r3N3J21K53l60o1K48k58
2875a31N7L04j37Q4k67J21R7k24L0J53k38j41J09j25L94J68J2k06k46L21k32J01
2897DP9j78p7L32j30L15l93J37j80L04j31m17M11k46k41L78R2j82N7R3r4m5K31
2920A19l81l4K14p9K91l47j8P4K57j06k33N07o85N75j33j36K48l24K98m37L34
2941Dk0J27k16j3k60M85R2l24J23%Rj30J0K6q1M18k67j58K44j71J64j03k87L23
2965eL08k72q4L9O0j58K98l43j7K24q7J86l04R6RK30j33r6q4L69K1j19j59O5j82
2990a38J13o1M30j12m47K39j17K10l6p4l2Q6l3N2l2J1lR0p0J7J8l20K01k45J60
$$ plain form
2831 -69 -30 21 193 -83 5 -276 121 -231 267 -187 -7 -89 53 161 -162 448 -55 -109 119 81 246 11
2853 11 -141 -235 -30 95 -261 231 -121 15 -442 68 28 50 -136 -34 -127 -74 47 300 -60 -121 127 -131
2875 -131 -74 230 93 177 -90 31 128 -96 -66 87 -151 -292 -183 -308 86 254 266 60 -186 135 -97 4
2897 4 83 -95 -172 160 30 345 -48 89 -91 213 82 -335 76 -170 -411 -33 59 -123 -66 27 -67 -112 119
2920 119 -262 -296 -82 -161 130 -217 -235 -161 96 -10 -243 264 -421 154 21 -115 133 -191 107 -330 4
2941 4 -16 111 -105 -118 -378 107 199 -125 -2 -2 7 -123 -113 -87 -168 250 -17 -175 69 -102 62 -41 -328 -5
2965 -5 303 31 -53 -14 46 -112 186 -157 -174 50 -37 149 -155 -59 -50 180 47 -49 -133 236 257 138 -21 44 -138
2990 -138 -25 -86 344 232 -215 24 -93 117 81 7 -25 61 28 80 48 59 56 146 76 93 111 -209 -8 -253 -93
3015i3O6R5o4k56j6M62j18k54j15P0L23L8m5J41m48K91m8R4J28j41OR2k81J29
3039E6J55k11l36j00M63K20l01r1K12m6J32P0j09j25J91m33L38k90L56j35l8j38
3061a60L9J08j7P0p9r8J10j5j70L12K06m14K17p5m3l0J37k5j55J60NJ29j86P6
3085A02M5l17K74M16o38j46kJ32J54o0j5L65j32j91K13j1R5j43L6k89J60n4J50
3108A44j75k09K16L74l06j4L38n61r6J1J89J82j74MP9J80k32J94Mk41O7k8L74
3131C20j42m71M78j48j7j84L54kj43P1m0k27J21J98J72n38J87K08j31J88j63j9
3153G2P4o4l73K61J84o1k39J46r2l2L1J19J43j75K3o5j44K00Q2m03P2L07l28K93
3177C1j56Q5j5K16k16Q2jK07k19K9j0l3K22j41J40j95J49q5o5j70o0N26l89J82
$$ plain form
3015 -93 -27 68 4 -252 -268 194 76 -178 -293 -223 100 138 93 234 -214 77 29 123 251 110 116 208 -73 56
3039 56 211 0 -336 -436 27 247 -54 -145 67 21 153 223 114 -11 180 -253 85 -205 151 16 -22 -160
3061 -160 -121 -13 -30 40 -39 -137 -27 -42 -212 100 306 -108 109 34 -9 -39 98 73 -82 78 83 212 26 102
3085 102 147 -170 104 520 -118 -264 -266 -134 20 -40 -55 310 178 -13 200 189 284 141 177 -112 48 -6 144
3108 144 -31 -240 -24 350 44 30 368 -193 -289 -278 -89 93 -81 -77 2 182 -50 144 148 -93 -26 -54 320
3131 320 178 -293 185 37 20 -164 190 188 45 116 76 -151 -30 168 340 -198 -11 197 66 254 91 72
3153 72 146 82 -291 -30 154 93 -146 0 -92 -124 -93 26 169 -6 17 -48 -192 8 90 -313 -241 66 -262 31
3177 31 -125 -40 -55 161 -55 27 26 233 14 43 33 0 222 81 221 26 175 90 25 -145 -205 321 -68 114
3201A14l04n2K14qM8J1j15J12k04R0K2K04k53L9L47n13J72J4J0K92j12N7p1o4
3225E0J10k05j14L70l35L95n08O7K95l0k22M3J07j34P3K4k35R7K95k19O2m39L81
3248g2P5L0J93l54M5k37L76j67M03j95j43p5K36k97L97L62o01j19J96j82L25j37
3270E9j65J75k53M04j45l78M91m03K64j7k32Q0K57j3o3K43n32L09k32Q0p5J71
3292B5J56k40K96m5j57j70j73J25J36L09l10j55K68m6k40r7K19J48K7jK45l44
3314b4R6Q0k30K58j05k9o6J39k44K59r7J39J6k09j21K25J2J8L6k16L05j32j05
3337Ek11N77p11M73qj05q9J09l77O16j83j63P8j76r6K48Q3k18L58r9j27p9J0p8
3361a63J79o4Q5L1R1J30m1m44pJ97J21l5pk68k5j3J22l7l0J34kL3o4lJ98J09q5
$$ plain form
3201 114 -190 -242 -28 -36 12 23 -92 20 -184 -94 -72 132 -121 -82 265 -248 -76 -62 -52 240 128 185 114 50
3225 50 160 -45 -159 211 -124 271 -237 -170 125 95 -127 -84 23 -111 -38 -14 -249 -152 143 -76 -14 -453 -72
3248 -72 3 33 226 -128 -83 -320 56 -111 292 97 -46 -121 115 -182 215 577 -24 -143 53 -129 196 59
3270 59 -106 69 -184 220 75 -303 188 -215 49 32 -200 -120 137 124 61 304 -228 81 -151 -71 -146 25
3292 25 181 -59 237 192 35 -135 -308 -183 -47 262 -48 -203 65 19 -221 -318 -99 49 76 75 320 -24
3314 -24 72 152 -78 180 75 46 -20 119 -125 134 37 176 192 -17 -138 87 99 117 153 -63 242 110 5
3337 5 -206 371 -340 133 125 20 -69 40 -337 279 96 -67 11 -165 -261 -13 70 -148 210 111 -16 -95 -85 -163
3361 -163 16 -48 37 68 159 289 248 -196 -203 -6 115 80 73 -195 -220 -233 -111 -148 -178 -44 -46 -13 -77 -80 118 227 142
3388A42k87K26k45K36j96J3m1J2J2K14J8k54J82M0j86J60K0k29L04l16oJ65q0
3411i6J2k13M00j27j39j20K49J79o6j88N1K31k25p5J79o0Q5k46PL48l74L02l30
3434b16Q0M73l40k1R3NJ45l54R9r4Q4Q6l6N0l8K93q1j84q0J65j71N5j33K08l03
3459b15K0N28l10L75n55J75R7m5j39J44jk7K98l85L61k60j03m2j8J39k16r8L73
3482I6l6k73K96N4p5k66L92k24l33M79j29J85j74l40L0K26o8O2J1p2J66r0r3o
3506a82N24m38k4P5j84l22M45Q3k1J53j1M9l92J89M7Q9M1l71J50o0J31J18m0K49
3530B98k83j34J99K96p15L75j4J43J17j80J43l10OJ31M4k80K75k34J10l20J40
3551a93l9M47p4l41L80j24j23K86k44l09L43j67L70m35K67J33j40m3k10J77O0
$$ plain form
3388 142 -145 81 -164 72 -124 -111 -152 -140 -128 86 104 -150 32 72 -114 46 66 -163 141 -175 -181 -16 -96
3411 -96 -84 -297 103 -24 -163 -283 -34 145 79 -109 -58 173 -52 -127 52 -8 77 -169 -162 186 -188 114 -216
3434 -216 -136 337 -3 -24 69 74 219 -135 -36 -130 -46 40 4 54 16 309 228 44 -36 129 -42 13 -120 88 -215
3459 -215 -195 333 23 398 -157 18 115 70 -69 75 74 47 345 -40 321 61 -42 -84 -102 37 -179 -277 96
3482 96 60 -213 83 137 62 -204 188 -36 -369 110 -19 166 -8 -348 -318 -92 -160 -98 -87 -159 7 -83 -176 -182
3506 -182 342 -96 -120 -45 -229 -551 -106 -23 -44 109 98 147 -245 -56 -9 80 121 -250 -100 -160 -29 89 49 298
3530 298 15 -119 80 376 -339 36 22 165 282 102 245 -65 -59 72 116 -164 111 -123 -13 -333 -193
3551 -193 -232 215 141 -200 180 56 -67 219 -25 -334 9 -158 212 -223 44 177 37 -6 -216 -39 21
3572B1j68J67J16K3O7k50q1L3K68m37M07N3k24o0n7J63j32J29J13j0j91l2J25
3595D3k54O41m11m1R2j78P2K9R8m5j17k5Rj51L41k83L69k11J3k4K03p2L0J10l95
3620a57J3j23O28n93N87p0p9m49L18K49m13L04o2j47M4j69L10j99J29M7m21L30
3642G7O2j01m0j27J2L0J2J26j51R2j20K80j59k9m02L87J51K01j75j73L32l7k30
3665A8j53L47l93L81k98K24k02LJ59j14l7L7k14L44o5J58j41j22JK39o65L51J44
3688BJ10K75l75J41m00M43m17K74Q7j40j04j72M17p2J51l99K57J8l9mK87k88m5
3711Gj03J5J82j62k0K63j38KP9j60J98k57J5J24K0m24L21j22J02J48j38K33j64
3734B1q9L00m60J72M8q4J77m06K36p5N5K61j60k77M55j71L3J06k70J91k6k65L74
$$ plain form
3572 21 -147 20 136 159 226 -24 -105 -72 196 -241 166 219 -5 -65 -122 41 -91 38 151 141 -50 -82 43
3595 43 -211 430 19 -22 70 -108 -36 -7 91 46 -71 -96 -87 -238 103 -180 189 -22 -9 -33 170 98 128 238 -157
3620 -157 -144 -267 361 -232 355 285 206 -243 75 324 -89 215 153 6 50 -119 191 -8 121 168 -253 77
3642 77 139 38 -2 -129 -117 -87 -75 51 -100 -8 -128 152 -7 -36 -438 -51 100 301 126 -47 285 248 18
3665 18 -135 212 -181 200 -98 126 -76 -73 86 -28 -65 -28 -242 102 37 195 54 -68 -67 172 -493 -142 2
3688 2 112 387 12 153 -247 196 -221 53 140 0 -104 -276 141 69 220 -179 78 96 57 53 340 52 7
3711 7 -96 -81 101 -61 -81 182 44 46 125 -35 163 -94 -79 45 65 -359 -38 -160 -58 90 -48 185 21
3734 21 -68 232 -228 -56 -8 -92 85 -321 -85 -160 -105 156 -4 -281 174 3 36 142 -128 63 37 -228 146
3757A46l78N22l08q7J12P3rk71L46n4k98J63J2L0Q6p7j79K52l7k64K93P8m0K02
3781C13n08K94R7k49J79Lj07%J6P5p3o0j94Q3M9K62k77j8K45k54K53l67N21m37
3805a54K32k18Q7j57J37J04m3J28J31l57J14K4R5k02r8K59R6j66M2N7m26L87k97
3828b25L90j70j11QL46n18K55Q3L42n77n8J22N75p58L10J57k44J46n6J24J49l90
3850a00K36J80k79J37l00J04j46K68m37K36J20L5J17j17j90J59J17j39k62L92
3870A31k07K52O3j48l9m7M6n5m5R4k4j13J34J39k21KR6j6l4m17J42M17J1j46n8
3895d3P4m94O60l5m46L48N7j49K89J3j47k95J96j01Q9J44j54J57J76m69M49m19
3917a00J2ON1k70J91K95p6j59L7L54n45M13k46K54j33L2k59J66j05P5K54l28J38
$$ plain form
3757 146 -232 290 -18 -105 7 80 71 -200 146 92 -206 -43 -31 -1 85 8 -171 81 44 -220 73 151 111 313
3781 313 -195 99 196 -53 126 129 22 22 38 113 40 -20 -214 -131 -82 180 -97 -115 130 -124 129 -238 283 -154
3805 -154 78 -140 -53 -210 -73 31 -12 116 247 -110 4 28 123 -79 -177 82 178 12 54 111 -315 72 -225
3828 -225 165 -5 -116 -108 238 -280 -25 58 400 -177 -235 -113 462 -296 14 171 -73 73 17 141 290 -100
3850 -100 136 316 37 174 -126 -22 -168 100 -337 -101 19 54 171 54 -136 23 140 1 -261 131
3870 131 -76 176 239 91 52 5 51 -4 -49 45 21 -92 42 181 -40 -38 58 42 8 -409 -267 150 161 15 -43
3895 -43 31 -463 197 162 -284 64 121 -28 261 274 127 -168 28 -73 16 160 6 163 339 -130 319 -100
3917 -100 -88 -82 -31 -301 -110 185 109 -50 -13 341 -204 209 -37 217 84 116 -143 23 -82 -7 247 -81 57
3940E7k0j46K12k10J57k13N9K36l85L43j64K24k0O7j22m32K34J21K2J40k25R0
3962B5k30M67j29j36Rj89K01J13j65j66k5J08P5J6J94l44K40ol40m7R5J20K05
3985I1k19nL04l52M44j67l51M7L98k21J97k94L36j36r3kl26K83pm5Oq4K19n1j33
4010a61j88J12K42M2k98J12K70j19N7j20k55L51j68OQ5n3j0j3M4K18n11J76K27
4033D6N5k70J74k08J90n2J14K13l40j39j73L48J65M8j32K75l89J90j26k1M8J63
4055A79j67l2K26m93M46l24J67k8j38K22q8J36k73L23j02j19N5K78J91n87j59
4076b87N17j06j8k85JK6j36M89M6j20o7n3k61K14R7K49k65k5L8k92K16rK41m9
4100A61k50R3k43K05n1K91j05J6j97j9K71j51m2j7K02j72k43J91qN7kJ99j71J36
$$ plain form
3940 57 37 -109 103 -107 50 -163 -104 132 -253 90 -74 150 130 197 75 -357 -123 -2 20 160 -65 25
3962 25 -205 262 133 -3 6 -183 18 131 -34 -200 -225 -117 -42 -26 168 -176 64 58 -282 -329 -234 -114 91
3985 91 -128 -133 171 -181 263 96 -255 -208 190 -31 166 -128 208 72 -21 -23 -349 -66 -73 -118 -112 -196 23 -28 -161
4010 -161 -349 -237 5 47 -251 -139 131 12 69 -51 -306 45 -123 -117 -32 -85 -95 -108 -64 154 -357 -181 46
4033 46 101 -169 5 -203 -13 -65 49 262 -78 -217 -390 -42 123 171 39 314 -75 115 -11 -32 16 179
4055 179 12 -20 206 -287 159 -165 2 -26 -164 58 -30 106 -167 156 54 -65 -10 268 459 -128 -287
4076 -287 230 124 106 -179 -178 -152 -288 201 247 127 60 7 -254 -40 57 306 41 16 54 -238 -22 -31 210 161
4100 161 -89 4 -239 -34 -85 206 101 117 -80 -99 172 21 -21 -38 164 -8 -251 -60 -68 -11 -13 186 15 151
4124A51j69k3Q1q4K24o9j63J77Q5j75l10J76K69l02K10J80o0j92m32M06K1j74
4146a73K55q2k63O26j79l42K88P6o9k32J93M47n59j87j14L22P0l07K44o4J1M4
4168Elr9N4m7J41j44L0N2o0L37l37P8r6j44K27Q5M0j26J47n1oK2m03O33l80M7
4194BJ36j61j59K76l37o4L13K49j78J04Mp7j73K18O3j93l94L05O8O8O0m00K81
4217A1J52j61k45L93j01J18l07K82k22K25j26J09K9m67M16k96M34k77K8M1K28
4238B64l83k1J82J18l33K68M9j89l4L18j41J64n61N13q7K0j17M7Q8l44L09n64
4260d34O26j76J36k0j95n5J89N9l70O9K43l20K85l07L76k36L2J80j40K23j41o2
4282c8J50j47L13j35J25k44M9j4J22l8m2n0J80l23J28j48r1J63j76K07K82j52
$$ plain form
4124 151 -18 -41 40 -44 180 111 -52 125 210 35 -275 -99 170 -132 78 258 198 6 -426 -20 1 -173
4146 -173 82 0 -263 363 184 -158 130 206 137 -95 98 545 -14 -201 -315 7 77 -230 14 -50 -39 5
4168 5 2 -97 -43 -90 51 -93 -63 -11 -71 266 -71 7 -89 -233 -6 79 119 -7 140 89 83 105 -298 335 -45 2
4194 2 138 -23 -182 94 -243 -307 6 255 77 181 185 108 -65 153 216 23 -371 -66 2 70 130 -270 11
4217 11 163 2 -243 150 49 167 -140 142 -80 145 19 128 157 -310 106 -190 244 -33 -5 36 264
4238 264 -119 -140 42 160 -173 95 144 -45 -79 239 98 262 -299 214 127 147 30 77 165 -179 130 -434
4260 -434 192 16 152 132 -63 -118 71 130 -240 -171 72 -248 37 -270 106 -130 -98 82 -58 165 24 -38
4282 -38 112 -35 278 143 268 24 73 59 181 143 101 51 231 -92 36 -112 -203 -40 -216 -9 273 121
4304A21n5M1j39K2n9k67J58J74J2K82k06k11o3K36p1K03j20k68K84j57J92Q6l41
4327a46K00M6k09P7K16k35J15j87J85L4k80k1J09J1L54j90M6j40m19K88K80j41
4349gK32j10m30L05j26M9j72L82k20L13l79J6K67J29j42j63L48j35k80J95m56
4370c84N19J27j03r1j76K7O9K38l39J56l29J14K53k07N3P5k03M82m80M42l64J6
4392a05M79k10J23m23J62j11K01j41M5J42J01k95j53J46j11M97o81L5L79q0J02
4413A02l33J95j01J40kO3J5k28K35k54J63J56n1o5J98l57N9j79q0M37l35L19P5
4436A72k34K67m42K74K2Q2o5P5p9L6m05N25k24J7K29k54J61j56j75j36K39J27
4458E6j42K38m63K91P8m09J97K50L3O5J05j27k9O5j70k18K93q1l31L04K28j19
$$ plain form
4304 121 66 107 -32 -10 -69 -336 -178 -4 8 290 84 -127 -190 46 -25 178 58 -210 74 -83 109 195 -146
4327 -146 54 100 -109 -32 184 -51 64 -123 62 96 -184 -205 -96 -85 269 79 125 -15 -434 -146 134 -7
4349 -7 225 115 -315 -10 -136 -87 -259 123 -97 216 -163 -147 120 249 107 -56 292 157 -123 72 -384
4370 -384 135 262 159 68 -108 -81 -12 226 -113 43 -286 -172 81 -126 -73 2 -201 281 -199 243 -121 -105
4392 -105 374 164 287 -136 26 -85 116 -25 20 162 263 -32 -185 -39 -150 347 -334 -299 80 0 102
4413 102 -231 -36 -137 3 1 64 79 -149 86 -168 -5 151 100 35 233 -124 -65 -244 -324 113 -222 97 172
4436 172 -62 205 -237 37 59 141 76 151 72 108 -297 228 4 21 250 -4 157 1 -174 -310 -71 56
4458 56 -86 152 -311 -20 58 -351 -154 96 129 194 299 172 143 208 38 -180 113 32 -299 5 233 114
4480A14k23N9l2K97j79j6O1k95o2K71O7j42L3J22k4j65K79j31N2Jk31r7L06j86
4504a21l2J48l8Q9j36K53j17mJ32k5k37J33j04K3%K6q2J70J34j06j69OJ71p0N
4529D9n3M4j74K43o8%r7O0j81J84J00j61m4Q8P1m09N15k45L97l33m5N6J40n5M1
4554A23o8l36L72k97L92n7j03P3n6J04j35j56K7L3n6j00L36o0j45PK02m24K95
4577b9k73J94mK49p5J46l83j5K69j83K1m7q9L71J76k70j68L12j2n7l09J59K3K43
4601B49l9l20K73P9m06L31k31O0J30j38J12q5P1k36j21L98j50m15K98nK05N2j16
4624dJ68k08lK14k86j34N21j32l0l9J07L9k09Q9J0P3k61K8J30r6M0m9p8n3J82
4649A9O2j95J84j94R7q0k9K75l36K29Q6j36L0j46%K33J6j25n3o7K08j4k98K42
$$ plain form
4480 114 -109 -50 -82 215 36 20 81 -214 -276 -5 62 -80 -47 75 51 -114 165 34 86 87 -144 -241 65 -121
4504 -121 -153 -5 -43 46 -90 163 46 42 174 149 -88 45 -59 -36 -36 -10 -92 78 212 106 -63 -57 114 44 49
4529 49 -4 40 -134 109 41 41 -56 4 -177 7 107 -54 -98 -10 61 -348 167 -78 319 -14 -59 -3 137 82 123
4554 123 55 -281 91 -206 186 129 26 99 43 147 12 -144 -117 -84 -140 -240 96 36 -109 -102 100 -324 -29
4577 -29 -302 -108 -112 137 62 208 -175 -190 79 -104 -83 -130 -219 152 328 58 -110 202 190 133 -176 -17 6 249
4601 249 210 -110 163 242 -164 167 -64 -4 126 -12 100 15 86 -150 -271 127 -23 -438 -140 -145 60 112 -4
4624 -4 164 -44 -47 167 -119 -253 268 136 106 67 174 213 4 93 103 176 -85 -57 73 -23 17 -32 -110 -163 19
4649 19 81 -114 70 -124 -27 -107 -136 139 -197 32 118 -18 12 -134 -134 99 115 -10 -63 -130 78 64 -234 8
4673Hq1j56M35n97M65J29p1q7L5r6l0Q5M3J09l26L45k85l3k1R6j05j00J90J54
4697A06P8p0k37J67K32n17K70P0o8J81m16l4K42J09k48K3lO1K59j0r6k00K31p3
4721E7l42L97k51L64k08k35J12K95j88J51M5j34q9P0m39N05k31l6K79l51J82L45
4743B98J08m90K94k01j23L83k59k46Q8r9K34k05J91J68k02j08J13J30j54K42m05
4764b43L27K06l55L28m27n7K21m3M11m60r9M43l11P4j7J17r6Q5j36K97l32k7K37
4787A43J4m28J94K68j24l6J39m3j92j6J39l44O2L54k27K49j88K42j41l14K71M6
4809F8j97K6Mm6K04p5j16K67l55J78k8j6r4K41K5j59J18k7m9q4J42o0j22j05K34
4834b6J89m92K85q0jmJ11J3O6m21M67Q7m09L34j59O6N2J18n9M4o5j00j02K31K03
$$ plain form
4673 8 -73 -229 206 -391 74 203 132 45 80 -16 -46 39 82 191 -135 210 -75 -108 -129 -33 -138 -238 -48 106
4697 106 184 114 -123 44 276 -241 29 99 31 212 -204 -238 4 113 -135 -112 -115 -54 205 195 99 -101 130 57
4721 57 -285 112 -139 225 17 -218 -106 189 1 152 197 63 -26 44 -395 110 -121 -157 122 -229 -47 298
4743 298 406 -84 210 9 -114 269 10 -236 -148 -247 -13 -218 -27 141 -61 -169 -56 74 -80 162 -243
4764 -243 84 290 -65 263 -164 -221 0 -43 368 -92 -191 252 -59 15 -2 115 19 104 -32 265 -67 -94 143
4787 143 157 -271 -77 191 67 31 170 127 -65 -81 58 -286 -224 130 -97 152 -36 206 65 -249 22 68
4809 68 -129 -103 -99 -145 59 -16 -132 135 -220 -42 -70 -86 -180 61 86 -73 45 18 -31 -115 27 -33 -155 -260 -26
4834 -26 163 -329 -44 -124 -125 -129 -18 -5 61 -360 107 194 -215 119 -40 26 78 196 137 181 116 16 -86 145 348
4859C48k58o3j56m5L12k16K32O6n31N30j51K15k45q9J76l65K70J21k02J24L22
4880C95n64L15j72j8R5L9J20m76M55r7J53l30K36r8o6K8p7K17m92L14o0pk3O0
4904e3J0O2j22K20j68Q6o5k9qn4L53l60L88k27K2k02M36k26k5J85m10P1L53n0
4928A87j83Lj6l64J89K6L1J61N2j39l2K3J82j39J21M2J39j89q1p6J96j74K9j63
4952a75K15l7k63n1N75R4l81J88J35l41L19j81k2J02j48k80J66J22q3L99m75Q3
4974c9J2J28k32L07j65m1%k14K84J9k8l19L09r7j53K32L47l54J6m1P3r4L6RP4
4999F9k1O1j6j47J85k42J5K33J2k56m3K39j72J10j05J47j45OJ24p2J9p5r5j19
5023b88j29M50q4q3L41J62j53j44k4J80k65m9P0m0R3j6P1j04O9k73L73j5J04l32
$$ plain form
4859 348 90 27 -129 -174 138 -78 154 220 -311 219 68 283 38 -51 125 -240 30 151 -51 73 395
4880 395 -169 146 -26 -44 51 90 210 -266 189 92 245 -85 151 53 -13 15 -62 155 -337 -23 -83 -90 -113 -53
4904 -53 -43 19 -103 117 -51 35 -30 -59 -67 -121 232 -128 260 33 55 -147 289 63 38 223 -187 -116 237 187
4928 187 4 7 -9 -373 -184 -158 -127 34 86 -53 -85 -62 120 -19 102 144 283 94 13 -63 133 -41 -12 -175
4952 -175 40 3 -260 -311 264 358 -23 165 300 -41 278 97 75 177 29 -251 -85 37 -46 353 -122 -39
4974 -39 -27 101 -131 176 11 -30 -30 -244 40 59 31 -288 21 -76 -229 3 350 -4 12 -29 44 -50 -14 -5 69
4999 69 48 109 93 -54 131 -111 -96 137 149 -107 -150 89 -83 27 -78 69 -76 -70 54 -18 1 -74 -169 -288
5023 -288 -417 33 -51 -134 207 369 216 72 48 228 -37 -86 -16 -56 37 21 92 -12 57 -216 157 142 246 -86
5047h6j23P8j08M58j83K28l46J08pM6o5r2r7K62r2q2J55j50J72n1m8m8J1R4J7
5072E1j92k9O1K07l39K93j09K34j0m06M41j72nj03K10j71r0k11L24J56j35J58
5094A63P5k27J85j34l40L97k21J7L86l81R4k64n8M43P0l07L4J35l49K50q7k5L65
5117B21n78O41j66l6j35Kl11L69J5j51L7J6m3k27K95j14L84j12l90Q5M09j00M2
5140A53p1m75N26l21Q4J40n3j51j6o6L18p9j58M6K83j92R5L7J14k12J12p2K11
5163B53m19o7M91lj8l45J31j50K72J43m89Q2L53m7l30K8o1K37l19M80j44k70J75
5186a7r7J85J60n42P8J22j7O0k0J90J94k35N5p2j72J78l7p4J58m2k1j80L15l19
5210a50J2p5J01J37j51M48m67J01o1L58m3l4k89l9L64r8j95j8J87k50K02L7o7
$$ plain form
5047 -86 -209 -131 -239 219 36 264 -82 26 19 65 0 -92 -189 73 -19 -101 54 -96 76 25 -23 -71 -60 34 51
5072 51 -141 -170 -109 98 -241 52 -57 177 167 -239 202 30 25 -78 132 -39 -129 -340 -16 140 5 163
5094 163 238 11 196 62 -278 119 -102 -85 301 -80 14 -250 -308 135 205 -102 -68 67 -282 -32 -119 -144 221
5117 221 -357 284 118 82 -53 -51 -362 7 22 -129 -92 -76 -119 -346 -51 -165 219 107 -283 -198 211 111 153
5140 153 82 -393 133 -188 -104 36 -17 -168 -184 -250 68 -11 -169 -123 160 -32 63 100 214 2 114 42 253
5163 253 -166 -233 258 255 237 -108 23 -127 145 288 -201 -119 234 187 -143 -115 -176 61 -258 222 78 -192 -17
5186 -17 -114 71 231 -311 -233 -111 -128 -68 -88 102 296 61 116 44 -128 50 13 -61 97 55 34 -146 169 -150
5210 -150 -138 -213 -112 25 -126 322 -145 -44 -105 253 210 176 -113 -152 212 114 -81 -99 88 -162 40 77 10
5233A0K76k88l5M03j28J40m35KJ38r1m0R8K8r8l27O6j08M38m2O9j53j06K43K00
5257B60m24K5K06M1k35M05m33q7K03N7m8J73k8j52m9K25J8k37J66j26R1m2L07
5280C16l35J72j53R2k5j05j87M81K1l67j9K66k15o7J32M1k13J89N2n8r3K0L5j25
5304a45P1K8J86L5l00q8K09K09k5l79L5J27N10j56m53O4J06j15Q8L87k72j3K4
5327A33j50J19k72Q2k2K51k32J0J01o4l2o9J28J49k35r6K48l16L72j23M9J87l78
5350a60J61L7j21R1j36K66l43J43L45m08p3j92L86k52N36m93K43M0K55m72k6K62
5372H9q3J84m15K10j91K05J57k82j21K41j2j50L14N9L8j31m42L99l8J35j8l18
5394a70N7L49l73O4j14R3K14n8L6m24L02OQ4k39N7J28k44N9J53k21J81q2J04J00
$$ plain form
5233 10 286 -2 -37 366 238 378 -57 -55 83 -8 -48 50 78 -20 -347 -281 -389 49 7 76 -77 -183 60 260
5257 260 -164 -139 67 108 -127 278 -155 -242 -39 18 -30 143 115 -37 -86 139 157 -80 86 -40 51 9 316
5280 316 -19 153 0 92 67 -38 -225 256 277 -90 -109 157 -58 -125 7 48 -165 24 76 18 -75 -55 -20 -145
5304 -145 -74 -46 140 175 -125 -213 -4 205 180 -199 -164 -37 473 317 -136 -72 34 -81 7 394 122 109 133
5327 133 -17 102 -170 -88 -110 141 -91 -81 20 -44 -76 -145 -17 132 -103 -199 49 -267 105 -18 31 218 -160
5350 -160 1 38 -83 8 -128 138 -205 -62 283 -125 -198 -390 -4 -256 280 -213 30 70 325 -147 -173 89
5372 89 6 190 -225 -15 -206 -1 156 -126 -247 -6 -18 -168 146 205 243 112 -330 69 31 166 148 -170
5394 -170 -113 236 -137 -73 -187 -94 120 62 98 -326 -24 -18 66 -173 -116 12 -232 -173 -20 -241 -60 -142 -38 62
5418F2j87N9j54j2J08pR8J9o8J85p1m04N0L59r2j48J08K21n9n6R5j95k1L34j19
5443A05k19P3K87j47j73J8M8l32M13j14J29J8j97K45R4m26l12M67k07M27N3j20
5465A30k21J33K6J78j6k88j55K16J15m53M31O6l77j9J93k44K53j30q0J86j51M19
5487B12k69j88J22J13J05k23J10j76R3J71M9k24M20k33k15J30j43L30j25o3Q7
5508H3k31m3M8k7K32k81M4J45m4P4k21L83m72L72k07K79r4Jrq2K6J54r3J50k57
5533g0K00k93K22J45k1j50j8P0n38L87j59q1K91L84k28n7J2k1J57k42k8j23M00
5556B39k59q8K27k50K64k87R9R1o1J80J05m82M71k29j68Q6J77o8K71qm49J81j51
5579a09J79r6m1M6q9J12n1P2j69j18J4k3L73r3Mk02L38k79P1K28j07J5j26K48
$$ plain form
5418 62 -125 -66 -220 -232 -124 -131 -33 -14 -82 103 32 -372 -322 37 -55 -203 -95 126 67 11 106 -89 -110 224 105
5443 105 -114 -41 246 99 -74 -56 -8 -340 73 -41 88 106 -91 154 248 -178 -490 -23 -230 197 250 130
5465 130 -91 42 68 246 230 -58 -213 3 118 -335 96 162 -215 -234 -41 -285 -32 -162 -242 -56 -207 212
5487 212 -57 -245 -123 -10 95 -128 -18 -194 -101 70 119 -105 315 82 -133 -3 -146 184 59 -4 83
5508 83 -148 -191 -143 -170 62 -219 -175 -30 -74 0 -221 162 -310 62 -145 134 40 41 32 -50 -24 130 37 187 -70
5533 -70 130 -163 59 204 183 33 15 85 -453 -66 -225 -306 -15 369 141 84 96 75 232 -10 -38 -161 239
5556 239 -20 -108 119 -131 133 -154 -55 36 -25 155 260 -222 249 20 -148 -62 115 47 318 310 -139 42 -109
5579 -109 70 -26 -67 -21 -110 2 -49 23 -146 -264 -250 -273 100 7 11 -191 147 -132 -61 167 60 75 -51 197
5603A97j51J32j69k75J89p9J50j65J33Q5p9N6j67M6j15O1J3mK37m28L08J14K52
5626C41m66r2J61j50L07j24j77j9N71j98l42L02q6n0J47o85M61o8J03K6n1K42
5648A53j94J24j84JO2p8k3K46k85L37p1j86Q9O2k25k92L44j64K06N6j28o6l8L34
5672H0L2Qj23J99M8m84O9L55j10p4p0M41j94k02J2j20M11m37M21l70K0L1M28k48
5696A23j44j61J37M2l44N78m12L37j52p6K44k89K38J5J1j37K8K7j89L07J27k69
5718D1J43l81L63j31k02l0J10K14j51q1K70j23O9N4o6k02J80k48L57j87J64j5
5740A48k56K87k37J16J57j94j34J83L9k76K45n7K26k72m28L73K00N4K7j48Ql4
5762B7j18J96N5J31m67K18Mn5N9K0l96M55l08L56q1Lj20J32j13j00P1Q0j59J97
$$ plain form
5603 197 46 178 9 -266 -77 -156 -6 -171 -38 47 -32 24 -143 -97 -212 -151 -138 -142 95 -333 -25 89 341
5626 341 -125 -217 -56 -206 101 -23 -200 -219 352 154 -188 114 28 -22 125 -560 -99 -167 -64 -38 -89 153
5648 153 -41 83 -101 -100 -38 -116 -139 107 -178 159 88 -98 -9 53 -172 -464 -120 -284 -78 -22 -150 -216 -254 80
5672 80 112 120 -3 196 244 -240 -171 184 74 0 -70 371 177 -25 -13 -133 278 -159 262 -108 -88 -57 371 123
5696 123 -21 -182 -45 -3 -347 231 -181 156 4 -72 172 -117 121 136 147 10 38 65 -124 183 310 41
5718 41 184 -197 166 35 -167 -197 -87 127 -24 -105 165 42 111 165 99 -103 77 -171 186 -1 163 148
5740 148 -108 179 -58 58 215 21 -113 70 109 -167 78 21 247 -25 -453 -80 120 174 201 53 61 27
5762 27 -91 105 160 291 -176 42 46 -9 50 70 -326 129 -179 177 96 99 -21 111 -2 -102 -31 49 -110 87
5786H7r9j4j73L85k44J61l9r9J44J6J5L2j6j68P2k37K58P9k09LL15k18n1j32j24
5811b56J98L55p9l90q4j46L54N2K74k50k13J25j23M91m13J27J9k67K01P9P2j76
5833e0j49J67Q7j6Qk1J32l54K02l1j01J48J09m38L25m1J66O3m66L15k65M11j57
5856D4K6L0j57J89n0J01J4j51pL3%J59l61M7J97p5k6rN3j47L59m27K88n38L57
5881e1K93k03q4j44L52k71M1j6K92n1k95l1lJ62n1J47j74L63k63J18Jj06q2L35
5905B79P6j62k59J06K3j83R6K17j75j04P2K97j10k41k0k7Q0r4K38k0k81P0J60
5928C8k1Kj78J73j8J81j96J21P1l30L20l4k11M6K9j04K84N6r6k24lJ98k11M3Q3
5953A9J68Jj11J21O5L1J07m74M1J47n2j0m0K64l90J42jm4J82k18p2O6K78k02J16
$$ plain form
5786 87 -12 -26 -199 186 -58 103 64 -35 109 125 140 172 156 -12 60 -177 81 160 -49 -46 269 51 0 -132 -256
5811 -256 -58 297 218 -172 -256 -402 -48 4 278 28 -185 -60 -183 308 -105 22 41 -226 -25 54 126 -50
5833 -50 -199 -32 55 39 47 26 158 -196 6 -25 -126 22 131 -307 18 -23 143 206 -260 55 -210 201 44
5856 44 70 100 -57 132 82 183 197 46 39 72 72 231 -130 -83 114 39 13 4 57 -90 269 -158 130 -408 -51
5881 -51 242 39 -45 -189 163 -108 -67 -83 209 158 -137 -168 -171 -9 -60 87 -87 276 13 131 132 26 -56 279
5905 279 355 193 -66 40 63 -120 -24 193 18 -86 -14 283 173 -68 -88 -115 -35 -129 109 89 -192 -122 38
5928 38 17 19 -159 14 -4 177 -19 102 173 -157 163 129 -82 -36 -7 -111 173 229 133 -91 -94 104 -107 -64 19
5953 19 187 188 77 198 263 294 401 -73 -32 115 63 53 13 277 -113 29 28 -16 166 -52 -124 -58 220 18 134
5978A34m52L37m8K00J3J37j17L8k96m3q3K31r1J32q4k97j53M83j21J27j25KJ25
6001D9k42J57o5K29N6k75J50J36k57O3L8L49m54m7J66K21j18N1k59QK37k07K17
6024B03l07J23j82Q2M0n8Q4l69M31O3K3n59L85m6R0K49k18m1K3mK22j2n6o8l86
6049b88J91P6k0R1Nl4j16J32P2j12J09R8l32k8J84lk63M92n66K15P8l36L75J53
6073A73J77j10k96J96j57q4J10k14M13n16m5L17o7N2K15r1r3J7J50l9q8k13J65
6096b8J6K90j72l5j63k1L6N4J22n13N01L7l29J95p6J51k18J81K5o0l34M49rK9
6120A28RK6l01R3K32m83M14j05O8K78k19k6j70j45K71Q2J62k88j2J14j53K6l8
6143c7J73j95k1K49n50K85k21L95J19j08k72J35q4L2R6m5j10M40l31j50J45j58
$$ plain form
5978 134 -318 19 -29 171 184 321 204 242 -54 -97 -180 51 -40 92 8 -289 -442 41 -80 47 -78 -76 49
6001 49 -193 -36 -101 128 184 -91 59 195 -62 1 39 388 -66 -113 53 274 156 207 -52 -44 193 -14 203
6024 203 -104 19 -163 -81 -41 -99 -15 -384 47 110 133 -426 -41 -87 3 252 34 -7 16 12 234 222 166 98 -288
6049 -288 -97 -21 -41 50 55 21 -95 37 109 -3 106 204 -128 -156 28 25 -238 254 -312 -97 -19 -355 20 173
6073 173 350 240 -56 140 -17 -101 9 -205 208 -308 -353 -36 -103 -51 164 73 -20 -3 147 108 20 -193 -28
6096 -28 -12 278 106 71 -92 -113 -77 -23 99 -414 87 124 -205 -10 -86 65 -153 28 53 -7 -341 108 99 128
6120 128 137 163 -138 -45 187 -296 118 13 81 359 140 114 -56 -201 70 152 314 26 14 128 -25 1 -37
6143 -37 136 -59 -80 169 -381 -96 -317 78 197 89 -183 -48 -132 -100 -4 -49 -159 281 -50 -200 -55 -213
6165b13L51j32K31P7p1k19P0p1J01k93N34l52j28j23J48K37j80mJ98l43r0J45
6187a27k86L62J10P8l20J75M4l79N13k80j27M09k87j09M04J6J75m20J30J43j87
6208C7j07mo3J33j23M9K25n2m8P6l2k77J24k34M72q2k50j08J00L1J56n3j59Q2
6232a07J28K4k05L03k36l1J30k9K0R6j7j22J3k18L46j60j4j01Q2K63o3K09l24
6255a3Mm38K13K32l1J17n04N39L9k52J4K80m77L23J94k95K30k47M7r1K42j69K26
6278A83o12K99K25j98k2J42q2j72L56j32k37L65j68qK17k34L27r4l42K98m00K65
6300b4j46J98l0j63K75k08j25J16K23j31O4O9N6j47K67l30J46O2m9k62J93m31
6322c77L52K19j23j16p1J42q2N8p6P3NR2k13L4Q4j81MK35k61M13k39J28m5K74
$$ plain form
6165 -213 138 6 237 314 243 24 94 23 124 -169 365 13 -115 -238 -90 147 -33 -37 161 -182 -272 -127
6187 -127 -413 -51 59 137 -183 -8 36 -343 170 -110 -237 172 -115 -224 180 196 371 -49 81 224 37
6208 37 -70 -74 -137 -4 -127 -78 147 95 47 123 91 -186 -62 -296 176 94 -156 -264 -164 -133 23 -30 -189 -107
6232 -107 21 45 -160 143 -93 -124 6 -23 -3 93 76 -46 -33 -251 95 -65 -79 -180 -98 165 102 311 -13
6255 -13 -9 -447 -234 -2 -33 84 -420 119 158 -94 -80 200 -277 46 240 -55 175 -72 -25 -116 126 -43 183
6278 183 -429 -130 95 -103 -125 17 -65 -237 119 -13 -250 115 -53 -61 156 -78 249 155 -187 111 -289 -24
6300 -24 -170 28 -2 -165 110 -98 -223 -107 116 -15 49 118 174 27 294 -36 110 172 123 -139 54 -377
6322 -377 -25 194 71 -45 -116 26 -56 2 -74 -1 4 96 -117 -83 1 -180 -176 59 -202 211 -28 100 55 329
6346C29l96J50n5J44N3k28k49L23k10Q8l28M42J33O7L12o13lk0l1K08j9l42N09
6369B64l70J88j15K28k89M08k30j60J55j25k77N37r6m65N34l57K96l40M18k90
6389h6K2M32j64j25nK35n02L19q9P1k17J35L19m94K57j51N2j84L48j50j01K40
6411A62k12l67N21l3j59K13l28K28M1m2R8R4k60j98K82j26N2J89k20l00L07j39
6433a97L41P2l13K7j57L85j58k29L40o4j13J47N3k34O50m03j65j24N12l32j15
6454g7L83l08RK33k73l05L95J31k85J71O3k4k2J05J04r6j93L35j33j65k06L23
6476A65m78L27l64K94j42L21J56q2n38L43J11j74K73m49K26L7j7J1R4j55l36M07
6498C0j85K16m3j89K61l9K0j99Q7k36N05l68K29j87Mk14N66J31l47q9o6K01l6
$$ plain form
6346 329 -67 83 28 172 225 -3 -252 71 -139 -51 -379 63 196 263 575 -38 -41 -61 -92 116 97 -245 264
6369 264 -106 82 -33 195 -94 314 84 -76 79 -46 -323 214 118 -347 187 -170 126 -214 204 -86
6389 -86 -64 368 204 79 74 309 -193 126 37 108 -109 26 345 -149 108 -43 9 -175 173 23 -78 162
6411 162 -50 -417 104 71 -88 125 -203 25 66 24 122 216 -44 -242 40 -86 -34 155 -65 -365 -58 -197
6433 -197 144 216 -97 -70 -227 158 0 -229 111 47 -66 81 134 -100 550 147 -18 -142 370 38 -77
6454 -77 306 -2 7 240 -33 -338 57 188 -97 74 137 113 91 196 300 204 11 346 213 48 -158 165
6476 165 -313 14 -350 -56 -198 123 279 197 -341 2 113 -61 212 -237 -11 26 9 20 114 -41 -377 30
6498 30 -155 61 18 -171 90 51 71 -128 -41 -277 228 -140 89 -98 -94 -308 258 389 42 -47 -113 88 52
6521E2k8L3K20j46o7pr9o2J58q6J34m87N36l10K53k7j15j12K77o5j31K24j3n2
6545H0K03o19K71L18j39l9l75J15NM58j99k18K92j17M32j50l63R8k8j87K87J20
6567B45m16Q3K31k94L44q5k5q8j74M00j74l95K83M16m95J1%j35P6J7N8M1M18n84
6591b42K93Oj21n2p2p9L30k74L57j39J73m38K68J9j94K35j7O6k26Q1J14j97J80
6614G1k0r7J11j73K95q0J47k28L2m42O89n25J60J97kqp1J41j6l52J76Q4j35J55
6638A09m7l4R5j48L10m47L26mP8l80J18J57J68k24J11j6k13j23J30k3P2j39J18
6661fj14M9J44J34O2k49K05j40Q1k55j07K62j01K78j29l8l02K52M6j39j34K37
6683C6n0P7j47m4L04j37J02n3K41k33j34M1j34j4M55k45l53L49O2k6K09m1l99
$$ plain form
6521 52 24 57 277 131 64 57 -42 -104 54 -32 102 -385 151 -159 94 67 -48 -160 117 52 -79 145 132 80
6545 80 283 -336 -65 253 114 75 -300 -185 -180 278 79 -139 153 36 468 318 -45 53 25 -162 125 245
6567 245 -171 -88 143 -151 193 108 83 -5 -179 221 47 -348 -65 351 -144 -133 -133 -268 -192 -175 -117 -76 342 -242
6591 -242 51 57 -64 -116 -188 -267 63 -211 146 7 180 -258 10 29 -165 70 53 119 -107 -26 88 -109 71
6614 71 51 -46 65 -108 187 107 254 26 58 -384 305 -220 -60 137 135 127 56 197 181 -171 5 89 -46 109
6638 109 62 28 123 -25 285 -162 164 160 238 -142 -24 133 301 77 188 172 -41 -164 -34 -57 15 -124 -6
6661 -6 -120 -71 73 207 269 20 225 85 166 -89 -196 66 -35 243 114 76 -226 26 72 -67 -201 36
6683 36 -14 63 -84 -128 176 39 141 88 329 96 -38 3 -131 -145 310 65 -288 61 123 97 306 265 -134
6706a34K06k98J86K32k21k36MM23m0k1M6k03j0J30k84K52P6j82j29J28J01j75
6728a49J15l12K74J09l70J76lJ08L8L04k31k76N5O7L24k15J11k44k0O5l3K25j11
6751Gj16l8q0K23K44j04j03J30n7k49M74k01k3j85Nn2O7r3J34J05k60K57k20J87
6775E2q0P2M2J59k44k67K83k47L21l31L10J7j46J07rj07J98r6J40k69j78K49J32
6798A08j25r5L10k73J13P4j3J79l95L5K04L7l39O36k39l11m2N8J14n9L25q5k5
6821A92k41L23o2j55q8M2j83K26R3k68L30n4l65J73K1M6k8K23k11k9k69M00k79
6844a63K79k49K40l4O7n5k69K03l36M28J53m57N34k63j59K04j6J35k48N1j56j16
6866b27m2K49m81M96J01M0k3k01M68k56k78J13l19M25k18N7J35J98k39K36j22
$$ plain form
6706 -134 72 -226 -40 192 -29 -265 -261 162 122 101 147 -56 -66 64 -220 32 108 -74 -203 -75 26 -149
6728 -149 -34 -346 -72 37 -333 -157 -160 -52 -14 290 59 -217 -162 -95 229 14 125 -119 -139 -74 -107 118 7
6751 7 -109 -147 -227 -4 240 136 33 163 106 -143 331 130 107 -78 -73 -125 -58 -151 -17 88 -172 85 -135 52
6775 52 -28 44 86 245 1 -266 17 -230 91 -240 70 87 -59 48 39 -68 130 34 174 -95 -273 -24 108
6798 108 -17 -112 198 -75 38 112 99 278 -117 -82 122 159 -180 456 217 -94 -136 -78 36 -23 302 217 192
6821 192 -49 274 212 57 -31 11 -172 54 147 -121 209 155 -210 -37 -16 30 2 225 14 -15 -284 116 -163
6844 -163 116 -133 107 73 140 85 -184 19 -317 111 264 -193 341 78 -81 123 107 242 -6 45 -111 -227
6866 -227 -269 -20 -501 -5 96 136 113 -88 380 124 -154 -41 -360 65 -153 -96 39 237 -2 234 112
6887A12k81K66j8r4l2j27R4r5J41K62n5j90j07K31k53j31R6m0M14k30O9j02P4
6910Dj96J32j40P2K38l37j5J38L04n13M09j79N0N8q7K3l31J64K97j32K25l3P7
6933B28l18j04l7J71k98L35m9O4K0N1p9k7j0K31j95k00K44K14P4j70k11K1Jm42
6957d86O57j98J9j30N7lP8P6R7p8k54K93lj78K15k04J53j51O3j98K69k39L24j31
6981D8o2R2l44J54n2j6k8J69Om5l33J39j7lJ09M76k89j1o1jk2K77m32L14k32O5
7007i9K09j76k20K77P2K8k1j11l5J86K24j98k52O4p2j09L42K2j10M46n27j6K94
7030B18k82K96r6k07MK5j6Q3P3L9j27J69M9n9J36k24O0M6k29j08J44k89L31K8
7054F4j68j21K63l38J96M7J31j31K26j1k38l8q9J40N7j65R6K59o8K30m61O6K25
$$ plain form
6887 112 -169 97 79 -15 -47 -174 -80 -175 -34 228 173 -17 -124 107 -146 -277 -181 -221 193 -37 32 -70 4
6910 4 -192 -60 -200 -128 110 -227 -242 -104 200 -313 96 -83 -33 25 -62 -39 -370 -206 91 -41 184 151 228
6933 228 -90 -194 -231 -60 -358 -23 -72 -8 12 63 -16 -43 -53 178 -17 -217 27 241 315 145 -66 -45 -44 -486
6957 -486 171 -27 -8 -138 -81 -84 -6 70 167 89 -165 128 125 -53 162 -42 111 -40 23 -175 94 -145 179 48
6981 48 -14 78 -266 -112 -164 -180 -208 -39 -33 -78 -411 -272 -289 -292 -183 293 4 -7 -68 -69 -91 186 -246 68 -164 -99
7007 -99 110 -66 -286 -9 63 91 70 -41 -76 110 334 136 -116 -52 -124 -233 109 131 21 467 -60 -76 218
7030 218 -64 232 136 -71 -67 -42 -58 25 98 137 10 179 228 169 305 81 141 187 -42 -150 -6 -295 36 64
7054 64 -104 -225 38 -300 -104 -57 74 -57 169 158 -80 -118 -207 -67 -10 -175 -79 180 112 342 -119 -53 172
7077A72l45K62m02M46o22L58J39j10K99M4k31m2J25k2k59J25K68n05K50j63K05
7098hn6J20M4k01K55j78j5N9j46J49k22J50l6L50n23J17P5J34j29M3KJ22O8k8
7122A46k6j79Q3j36j11N7l3J54K26p4J8k48K04J14n5k34O0L0j03K1J8p5NJ02j99
7147b35J87K73p1p7J06j32J84J31n71M61j75m95L60m1o8P9nJ03k35K63J21j17
7169D6q7K15j56k8L8j31J29Mr9o3J33K09l86P6J09m45L28N3K36j65n0o2J01j65
7193a60L39K05o07K65M6l50L04J53n5K66q32K88k5J15K01k17j28K34R6K0j93K30
7215A95j41k74K64K8m2J51k82K21j38l80M82k43J39o8L04j76k63L06k30M9L23
7236B25j24m2R8j99J58j59j14j85J49J92N6Mk9J09K5j25l05K21n7J02Q5j38J22
$$ plain form
7077 172 -173 89 -313 133 -489 -131 8 -102 197 241 10 -32 93 71 -188 -63 205 -300 -50 -213 -8
7098 -8 -64 56 100 -101 154 -24 -39 20 -126 23 -199 -49 -85 265 -258 -141 -66 68 -61 -18 -16 106 174 146
7122 146 120 -59 24 -112 -223 -166 -199 -45 181 107 125 -123 81 195 140 -94 -34 -4 -107 -86 -68 -143 -138 -36 -235
7147 -235 -48 225 154 77 183 51 235 366 -205 256 81 -414 -54 -95 -163 -84 -89 14 -221 42 163 46
7169 46 -41 174 18 -10 28 -103 26 30 -69 -132 1 210 -176 -100 9 -436 -108 -55 181 16 -34 -96 5 -160
7193 -160 179 384 -223 42 88 -262 42 195 140 406 -426 -138 -163 -48 153 -64 -192 42 138 158 -35 195
7215 195 54 -220 44 72 30 181 -101 120 -18 -398 84 -159 -20 -88 216 40 -223 83 -147 -98 225
7236 225 101 59 157 -42 116 -43 -157 -342 -193 -1 55 59 30 139 164 39 -266 -45 -102 0 85 -53 69
7259F9j53P9j3K26j71k02K86J3j52J06m9j36Q9j47K9M9L03Noj92L7j3J00k19l6
7284i8j04J75J18l44K63P9M1j12j42J5j43J56m4K38q9j22J45J2J51K36k01j98
7306C2K3k14K68n77L48J86l2j46R8j04K6J3J74J31j60k91K04j11Q8J79j09j41
7328a15J43j45L06j94n0M39m07k71K36j5K46l99J32L03k15l2k17R5M3L00r0j42
7350d9j96J49L12j29l17L43K42o95N34R7k81O7N0p6j24j0n8J54k1J8N7m3r4J29
7374E9N1m0l4J01j1J16n2k93J98n9O5m7k49J30K80j96K5R8j79j25K73M0l17K15
7398D9J6q9J55K9j32K7K9r7R1r5l8J9j26q6K26J04n59L64N2o6J51J79k51J7J49
7423A18l05L54r5n5P9k09J14j9m8M0j86K51p0j36M72j65J22l05M9M4rj79r7K63
$$ plain form
7259 69 -84 -5 -18 208 37 -165 121 134 -18 88 39 -97 -8 -155 -126 -77 226 231 225 33 70 57 157 -62 -98
7284 -98 -202 -27 91 -253 10 89 130 18 -124 -109 -252 -96 -140 98 9 -113 32 44 195 431 230 32
7306 32 55 -159 109 -468 -120 66 34 -112 -14 -118 -92 -79 95 226 66 -225 -21 -132 -44 135 26 -115
7328 -115 28 -117 189 -5 -55 384 -23 -294 -58 -73 173 -226 -94 209 -6 -38 -255 -160 -117 183 93 -49
7350 -49 -245 -96 216 87 -230 113 355 -340 194 291 10 77 127 51 -73 -83 -141 13 -8 10 67 24 -70 59
7374 59 110 70 36 137 126 242 190 -103 95 36 101 54 -195 -65 215 19 44 142 -37 -162 111 151 -166 49
7398 49 65 -24 131 160 28 55 84 -13 78 -17 -55 -36 -162 -248 -22 82 -477 -113 -61 -127 24 203 -48 -31 118
7423 118 -187 167 72 17 96 -113 1 -18 -66 -26 -212 39 -31 -167 305 140 262 -43 6 50 41 -138 -235 28
7447B8K17k67O7p0k8L05m05M40l40K93l4m0o2k42M05j86L2M9j73j31J09k14J95
7470e2J45j81L07j74o1l3j07j17K49j58L31k79R2N1J27j97p3L39l22P6J71KJ55
7493B91m5o4j11j63J90l2P1r1K25l78p4M16l69L11K6l85L14%k34M66l17K49l25
7516b9P6J39j86o6Q4j90J04nK07J99n01N6j11K59J63M0k66r7J96k89N85l16j16
7539f4L9q0J35o9J02o0J83j87J9J99M6l19M14o81L63k62K25K54r6Ml92M00K0r3
7563A00j54oR6J81k11r1Q2j06J05L92k70K7k38K05k22J08K14n7k6k19J07j09J51
7586E9j07L67m40qJ60J7j26L35j82j7j15m8K54K74o47j7K71j35PM5L50n68L84
7609A13n0M0k13l3j7M77n65K62j67PL27p4l21K79m6o2K29l60K04l00K89k01L18
$$ plain form
7447 28 245 -22 45 -25 -53 252 -153 287 -53 240 206 166 104 -138 267 81 113 162 -11 -142 -33 -247 -52
7470 -52 93 -88 219 45 -16 -49 -156 -273 -24 -182 149 -130 -38 13 140 -57 -130 209 -113 -37 134 136 291
7493 291 246 182 71 -92 98 66 137 46 271 -107 -181 235 -134 177 203 -182 132 132 -102 364 47 296 -29
7516 -29 47 186 0 -66 18 -172 -68 -73 134 333 -168 -112 -223 36 199 239 -27 -124 72 -217 368 52 -64
7539 -64 -25 -105 30 -39 63 3 186 -1 18 217 263 -56 358 -323 40 -222 3 257 161 165 -227 173 193 100
7563 100 -54 -60 36 217 6 -85 -3 -109 -4 388 118 145 -93 112 -110 -2 212 155 129 -90 17 -92 59
7586 59 -48 319 -121 -129 31 48 -78 257 75 58 -57 -105 149 423 -224 -241 30 -105 -98 -53 297 -271 113
7609 113 63 103 -110 -143 -160 317 -248 14 -153 -146 181 107 -214 65 19 -43 186 -174 30 -270 19 -182 136
7632A36r5%k30J99J82j69M4l77M9J17L4K47l0j94r9J65l5Q7L2k78R1p9L44Q2k08
7657A5r9k10oK02K29j59q2M3K4K49m08p8M50k40M1k6j61K23J81k23J64j49k2K4
7681a8l32L16J88k78J33k00R6L42n90L44K7n3R0l41L80O5j68m1k26q4L09k30K56
7704a5j39M09k33q6J50o2j8k42M13j74k0l54M09k59L96k18J55j38J05k12M8J18
7726C3j8q4P1Q8J43J94m34P1J38l25K23J94k25j92J75j15L0k58M11l35J50k17
7748b82j44O03l40O2K24j75N16k99l49R1J64J16k09k8K66k24j38J61k09J79j09
7769a24J68J84k57N1R8l19L69j86J01j68R9k3k67J18M6O1j3J19l7j32n9j1L72
7792A90m77N59k49k07J5K73M7k08J2%J63Nj08Q4l8P2Ml28J09L53m42K8P1Kj99
$$ plain form
7632 136 41 41 -189 10 192 23 67 -310 -261 -144 -110 137 107 -87 -186 -21 -56 31 63 -215 -124 -203 141 223 15
7657 15 -84 -294 -300 -98 131 -28 -110 -67 -43 206 -202 -280 170 -70 -29 -55 -216 7 188 -35 129 -20 -42 -18
7681 -18 -350 -34 154 -124 9 -191 -95 247 -343 1 28 -25 65 -276 104 169 1 -40 -266 -350 -41 -271 -15
7704 -15 -154 255 22 -64 86 24 6 -236 177 3 -17 -371 38 -221 175 -43 112 -26 79 -133 -85 33
7726 33 15 -69 2 90 233 427 -7 64 202 -123 100 294 69 -123 52 -63 -33 -291 120 -215 -65 -282
7748 -282 -426 177 -163 -101 123 -52 464 165 -184 -93 71 187 -22 -50 216 -8 -146 15 -194 -15 -124
7769 -124 44 228 -29 22 120 -199 170 -16 85 -83 16 -7 -274 -156 -110 -49 -62 57 20 -112 -171 -182 190
7792 190 -287 272 23 -184 -169 104 151 -57 -45 -45 118 123 15 99 61 133 137 -191 -82 271 -171 -143 -72 -70 -269
7817b69J90K01Jj38K55j15qm33J01%O4K7J5J50N1q4l59K22K69k85K12M0k30K33
7841A10k70K78on0Q6qj68Q2J02k35KK51j68J08ln2j15L28j59l23L47M1n8k30j53
7866b63J04J00L2j43K86J44j44ro8K49k67j7j16L11o8l7j14J35j79N4j05K79l24
7889a60M72k00k64N32m54K48j23oN2R7j35j41j3N2l29L15O9M09l05l27J97J76
7911A62Jl5J5k13o0l7P7j17L31k05K71k79j37L92l83K08l10L12QP1O5q2j25l10
7935c80P9N12l7l79N78m17J92j83K47j09k37K03j28l5J6L21k25J37j74P0p9l41
7957c69L98l27K22M1j82L27n0P5k45J57J90j49j33j30M57r3m34N57l21j45K33
7978G9j72K01n6j17J01J15q9J8l98L28j55m8R1j83K22J90K18j73l32L52j55j15
$$ plain form
7817 -269 -79 122 123 -15 240 125 117 -316 -215 -215 -151 -124 -109 41 92 8 -351 -129 140 -145 67 107 -123 110
7841 110 -160 118 112 62 148 140 -28 54 156 -79 -77 174 6 114 111 59 -56 272 113 -210 137 178 120 -110 -263
7866 -263 -159 -59 -27 -170 116 260 116 107 39 288 21 4 -112 199 131 94 -20 115 -64 -10 -115 164 -160
7889 -160 312 112 -152 380 -74 174 51 45 97 194 59 -82 -95 -43 -372 -57 12 421 116 -211 -14 162
7911 162 163 128 143 -70 -130 -167 -90 -207 124 -81 190 -89 -226 166 -217 -9 -319 -7 1 72 137 55 -70 -380
7935 -380 -301 211 174 -205 373 -44 148 -35 212 103 -134 69 -59 -94 -78 243 18 155 -19 51 -28 -369
7957 -369 29 -298 -76 -35 -217 110 60 135 -110 47 237 88 -45 -175 282 189 -245 312 -9 -154 79
7978 79 -93 108 52 -65 36 151 62 80 -318 10 -145 -193 -102 -285 -63 127 345 172 -160 192 37 -78
8000g8K73k47L0k70P8L18k78J20Nj17L8K6j22K31j12K23k17K06L6j1r9J67j25
8023G5k16L71j37k23L20l27J82J57q2l85n0N0J96r7K12n30M76j34P5j0N8K86j26
8046A41j12J55R4j16l47J11n3J17o7J37j90K8n4K89N9m36N37l80R7N3J18k4Oq6
8070G7r1j13L56l49J09k82J33L54k46q0J43N0r1K34m3l56L81k37q4J47J3q2n9
8093a16J55l8j02K25R5K6n32K16K10j17n5K21J81o25L04m2K32p5j58j60M68k91
8115B2J84j32j22J91l40L38j25J9K01j93j78j07M18j62J61m33M52k29k60M48j84
8136c1L2J89j04j70K41l61M42n54J26K7J15P9J57j60L6Q4l92M53k60k06Q0O2q9
8159b04K02J68r0RK66n01J61L8J5p6j40oK39o9l90n8O35j06M6j80J36j62J22p8
$$ plain form
8000 -78 195 -52 -22 -292 -214 104 -174 -54 -49 -166 -128 -102 -224 7 -105 118 -99 107 143 132 33 200 75
8023 75 -141 230 93 -130 190 -137 45 202 120 -265 -315 -265 -69 -166 46 -484 -8 -142 -67 -77 -19 267 141
8046 141 29 184 278 162 -185 -74 -127 -10 -77 60 -130 -102 -156 133 192 -244 293 -87 10 63 181 157 163 77
8070 77 -14 -127 229 -120 -11 -293 -160 194 -52 -132 11 61 -30 204 161 -195 186 -51 -135 12 25 -57 -116
8093 -116 39 1 -101 124 219 245 -287 -71 139 22 -33 188 369 -256 48 6 238 163 5 -155 313 22
8115 22 206 74 -48 143 -197 141 16 35 236 43 -135 -242 176 14 175 -258 194 -35 -295 153 -31
8136 -31 1 190 86 -84 157 -204 238 -316 -190 -163 -48 31 188 28 64 148 -244 209 -51 -257 -177 -115 -204
8159 -204 -2 166 76 85 351 -150 11 49 64 -12 -152 -158 81 12 -378 -436 199 93 139 -41 95 -67 55 -23
8183b3k25K85m86K16l5K79n5m0
$$ plain form
8183 -23 -248 37 -449 -233 -268 11 -44 -84
8191h4
$$ Imaginary data points
##PAGE= N=2
##DATA TABLE= (X++(I..I)), XYDATA
0@%%%%%%Qj6J6j6K4l2L2m0N6o8Q0r5J15j36J57j81K09k45K84l25L70m21M78n42
30b88O11o87P70q60R63j075J195j328J476j636J811k006K219k458K725l021L355
47A766l734M167m667N256n959O812p877R251j1098J3732j7819K5066m1719J47634
61A20811L6969k84471L0415O3251M9944J01113l850k18112m7098J66704J00150
72A15826n9819o7329n5675j5420P7237J20640l8239j58370k9738J08683M3231
83D1027J4656K681j17947p8109J41409J08069o7113o0281l3487l8604R4210J16270
95A22781p1275j20607J32N3046O1882L8024o4363r5979J0330R0156N3372l3540
107D3959p3083l3613K6060O4635M9122m7700r0733J651N8496K8650K4662k3376
$$ plain form
0 0 0 0 0 0 0 0 8 -8 8 -8 16 -16 16 -24 32 -36 44 -51 64 -72 85 -96 113 -132 152 -173 197 -224 254 -288
30 -288 323 -364 406 -454 509 -566 629 -699 777 -859 952 -1054 1165 -1293 1432 -1589 1766
47 1766 -1968 2199 -2468 2788 -3171 3641 -4236 5015 -6083 7649 -10170 14896 -26823 120811
61 120811 157780 -126691 -96276 -33025 16919 118032 114182 -103930 -151028 15676 115826
72 115826 56007 -11322 -66997 -82417 -5180 115460 77221 -81149 -110887 -2204 41027
83 41027 55683 58364 -59583 -137692 3717 111786 44673 -15608 -49095 -87699 6511 122781
95 122781 51506 -69101 -68969 -15923 45959 83983 19620 -76359 -66029 24127 77499 43959
107 43959 -29124 -62737 -36677 27958 77080 29380 -61353 -59702 -1206 27444 52106 28730
119B8730r5660o222R8735K7930l1498j8554n3979j6745J00343N1505p5898n6983
131d8296O033K5225N6896L1600o7157p7486K4342Q1833L1481l7600m9643k8107
143e0879J4598P1933M1805p0995o8832L0122L8278J6801K7759m0467q2085K9427
155d2535Q4048r47l1806j8367m0545J1432Q3972J7924p1961m1573J7362L4778
167A782L8888O766n6809n4541L1204P3476J1205m5814l2204j1393J7501O2284
179D2345J5937p3995l7925M1613K7320R755R846m6974m7381M6439N6627j6611
191B6996k8030j6696k0602K4048N6912l412n6826k3103K2534K8562J9440k984
203B6839m1543l4562L4485N4181q318l6923j3998p226J7426N0270k879o2494j3887
$$ plain form
119 28730 -66930 -73152 25583 53513 22015 3461 -50518 -67263 33080 84585 8687 -48296
131 -48296 -42263 -17038 39858 71458 4301 -73185 -48843 32990 64471 26871 -22772 -50879
143 -50879 -36281 35652 77457 6462 -62370 -32248 6030 22831 50590 10123 -71962 -42535
155 -42535 41513 40566 8760 -9607 -50152 -38720 45252 63176 -8785 -50358 -32996 1782
167 1782 40670 47436 -9373 -63914 -32710 40766 51971 6157 -26047 -37440 -19939 42345
179 42345 58282 -15713 -53638 -12025 15295 25050 34896 -12078 -59459 -13020 43607 26996
191 26996 -1034 -17730 -38332 -14284 42628 39216 -17610 -40713 -18179 10383 29823 26839
203 26839 -14704 -49266 -14781 39400 31082 -5841 -19839 -27065 -9639 40631 37752 -24742 -38629
216c8629L6276J6133J0233P22m4732k5246M5514L6059j7752k2214j4738r162K4744
229b792L8374j0895m4569j1759K4611J9963Q746n609l3856k0327L6200L6632j7095
242A7624k7465p681m077K0602L7870j5312m7951r82K7919J2561Q717p309l7116
255b2600r247L8932K2577j7158j9154j0100j252K3378K4758j6735l5564q40K4395
268A390J1907L259p763k9203q287L6257K0795k0559j7458m635k986K2378K6025
281C1120k1408l4321O820K0308Q324O255r970k9123J59L3012J2846j8703j3906
294h587m957J169K0269J8432j9923k9005O856K1206N798K035q404k4919m67L2560
308A2063J0498k0141j1816k178j4J9421J6482k1455k4589R586J7726M430J668
$$ plain form
216 -38629 -2353 13780 24013 24735 -19997 -45243 271 36330 18578 -3636 -18374 -27536 -2792
229 -2792 35582 24687 -19882 -31641 -7030 12933 21679 16070 -17786 -38113 -1913 34719 17624
242 17624 -9841 -17522 -21599 -997 36873 21561 -26390 -27372 547 13108 21825 14516 -22600
255 -22600 -31847 7085 29662 12504 -6650 -16750 -18002 5376 30134 13399 -22165 -23005 1390
268 1390 13297 16556 8793 -20410 -28697 7560 28355 7796 -9662 -14297 -17283 5095 31120
281 31120 9712 -24609 -17789 2519 10843 17098 7128 -21995 -21836 11176 24022 5319 -8587
294 -8587 -13544 -12375 7894 26326 6403 -22602 -15746 5460 11258 13293 4889 -20030 -20497 12063
308 12063 22561 2420 -9396 -11574 -11588 7833 24315 2860 -21729 -12143 5583 10013 11681
321A1681j0318k0430L773K7796O864j8172j0715j232L799J6507J1287j9887k1114
334b0161J0171J6829L162k10r305j8230N613K4993L226j6994p719j093L720J6070
348A0072P625k0099j5522J1154J3124K460l68j0401j4987Q123K1973P16j5486
361a616o623k22L798J5279M811j9052j2774J1311J1367J559n71r633j2972R145
375f193J9275j936j4098m056n54M223J3934K501j8474r701J1869R618P52j450
389E710r302j1230J0385J7345l482j3072l274O22M020J2085J564j7122p768J2203
403a316P581j17j207q842q940J0273J5068m847j1676k263Q56M248J1155q15j5919
418f761m995J1538O160q69j249q193p127J0424J2653n690j0474j003J192M167
$$ plain form
321 11681 1363 -19067 -15294 12502 19366 1194 -9521 -10753 -6954 9553 20840 953 -20161
334 -20161 -9990 6839 10001 9791 486 -17744 -12131 12862 16088 -906 -8625 -9718 -5998 10072
348 10072 17697 -2402 -17924 -6770 6354 8814 8446 -1955 -16942 -8819 13154 13870 -1616
361 -1616 -8239 -8461 -4663 10616 15427 -3625 -16399 -5088 6279 7838 7267 -2366 -15338 -6193
375 -6193 13082 11146 -2952 -7008 -7562 -3339 10595 13096 -5378 -15079 -3210 6408 7160 5710
389 5710 -3592 -14822 -4437 12908 9426 -3646 -6920 -6298 -2278 9807 11371 -5751 -13519 -1316
403 -1316 6265 6148 4941 -3901 -12841 -2568 12500 7653 -4023 -6286 -5430 -1182 9973 9158 -6761
418 -6761 -11756 -218 5942 5073 3824 -4369 -11496 -1072 11581 5891 -4583 -5586 -4394 -227
432b27R446j564j5011k888J1077M915j238j588p703n424J0673J0554o626q789
446d393m49P91M552Q695l353j3064j406J0235L687j310j466p296m274J0523Q784
461A0256p315p935R85O81L954P603l769j2157J54R654K573j399j522o956k752
476g945J0424O572o706o704M33J386M281N868m384j0298Q64Q889K136k195j586
491A035n552k230R688N571p562n743J645J121L730N244m774r298K451P392J141
506C859j554j676n581m67Q496L937o393n035J217J566L440L839m078q301K397
521d334P544P26k324j316m697m54Q595L061p311l677J481J221L866L512o024n939
537f070L633N080N11j369k349m128J482O753J923n878l762K004J669K539K978
$$ plain form
432 -227 9219 7655 -7356 -10244 833 5748 4510 2922 -4781 -10205 468 11022 4396 -4393
446 -4393 -4842 -4051 501 9196 5843 -7221 -8627 1608 5295 3985 2519 -4777 -9051 1472 10256
461 10256 2941 -4994 -4009 -3328 626 8229 4460 -7697 -7543 2111 4684 3285 1763 -5193 -7945
476 -7945 2479 9051 2345 -4359 -3926 -2540 1741 7609 3225 -7073 -6209 2680 4816 2621 1035
491 1035 -4517 -6747 2941 8512 950 -4793 -3148 -2027 1703 6947 2173 -7125 -4674 2718 3859
506 3859 2305 629 -4952 -5419 3077 7014 621 -4414 -3197 -1631 1809 5648 1570 -6731 -4334
521 -4334 3210 3936 1612 296 -4401 -4855 3740 6801 -510 -4187 -2706 -1485 2381 5893 -131 -6070
537 -6070 -2437 2643 3154 1785 -564 -4692 -3210 3543 5466 -412 -4174 -2170 -501 2038 5016
552E016m505o548L144O271j124j104j163m069O68P563R31o600j820J752M51M348
568C211J553o089m026L747M703n36j707j921k582J803N158M31n042k425K956R60
584A94J607K549m963m749M410M014j777k27j404m109K540O442j347m840q25P56
600a729J529L090L01n195k392L524L699l58k604j072j513J624N057o97n441j053
616c230L126K72J477J308m745k369M594K116j613j55j630k351K409M465j451m058
632a835o41J370J661J993k11m134j913L607L028j406j767p71j308J933M268j889
648A985m681P60K570m83J821R9m500p47M472O60j438J35j833j331L238K538k405
665H60k252k46J020J344J044l99l343j087L456K584k386j176p98q79K680L140
$$ plain form
552 5016 511 -6037 -2893 3378 2254 1150 -13 -4082 -3414 4149 5080 -1520 -3340 -1588 -1137 3211
568 3211 4764 -1325 -5351 -1604 3099 2563 856 -1065 -3647 -1844 3314 3745 -1297 -3722 -766 194
584 194 1801 4350 -613 -5362 -952 3062 1285 1058 -346 -4455 -1915 4527 3180 -1660 -2485 -1729
600 -1729 -200 2890 3191 -2004 -4396 -872 2827 2469 -135 -1207 -2720 -1096 3961 3264 -2177 -3230
616 -3230 -104 168 1645 2953 -1792 -4161 433 2549 936 781 -849 -3200 -791 3674 2223 -1835
632 -1835 -2476 -1106 555 2548 2337 -1797 -3710 -103 2925 1519 -248 -1019 -2327 -394 3874 1985
648 1985 -2696 -1936 634 151 1972 2071 -2429 -3176 1296 1956 518 653 -1180 -2511 727 3265 860
665 860 -1392 -1638 -618 726 1770 1371 -1972 -3059 397 2981 595 -581 -1379 -2258 422 3562
681C562k932l127J532J089K0J766q71l791P60L606k90p90n25j445j32K361J515
698B308j539k380J75J334R44O67l43k730r59L436J326k100l17p47j077L113K122
715C233l370k236J680P49Q13J163k154k539J510K730n46o66q95q66O11J458R17
732A592j585j378N03J447PL01n71k241L95L111k82j774K99j051k53K854P90k678
750e14j269J759j68J089M69j995j534J619K164n17j021j076J76N94J122Q29k147
767d20j164J218J039j44R3l09k502J409K567j206p08K84j441J36K899q6k550l35
785a220Q92N51P63l6j528j190J580J408k27j258n14qR79Q45mk156m80K144l78
804A63K97K00r50j426J671J466j128n90J28q56N58K077r87j360J19M99P02M04
$$ plain form
681 3562 630 -2497 -965 124 144 1910 1039 -2752 -1992 1614 1324 534 9 -1436 -1568 793 2308
698 2308 769 -1611 -1436 -102 842 1509 1166 -1564 -2523 913 2239 139 -178 -925 -2002 1111 3233
715 3233 -137 -2373 -693 56 869 2032 -122 -2661 -1151 1579 1033 367 -528 -1394 -783 675 1592
732 1592 7 -1371 -868 579 586 887 316 -1925 -1530 1581 1299 -475 -176 -1227 -1480 1374 2164 -514
750 -514 -1783 -24 -192 897 1366 -629 -2163 -544 1620 1103 82 -994 -818 -224 898 1727 -420
767 -420 -1584 -366 673 529 622 313 -2189 -780 1787 581 -127 157 -1284 -1148 1751 1665 -885 -1220
785 -1220 -328 223 986 950 -578 -1768 -188 1220 993 -265 -779 -787 192 1037 1033 -1123 -1603 541 163
804 163 460 660 -290 -1716 -45 1421 293 -297 -169 -1025 -467 1610 623 -737 -618 -119 583 987
822I87m12r68q95J429R43n95j104K2K03j87J778k56j846j53J331j01r2N57j358
841g17k69J156J037j058n6l90n82Q44Q97k13j481J10Q66K97m8q0j042n28J496
860B39R53r84q94J96O8L50J569j110j369N65Q03j10J59N0j004k3Q88L45p25m13
880d47J38P2P64K33r36k90j29O17L48k12k29o56k39J301P28j313j34r7k7Q37O68
901I97j027q36K41R80r5j74p8m79j30J167j53p22K11j72o7Q50K3m95p72K54O01
922A24j8L22p14j13k69J131J83q47j25K8r4P24L42r65m77P60K91Kp7j46n41J48
944c31N61K30p74J65k07L99L69R1q07m53Q19J70j9m15M97o33L36L48L7o35pl5
966b94J3P59M7p37l02O91p6J0L8k69n83R37M06m70m93J11j43J30M71J45o92j22
$$ plain form
822 987 575 -393 -1288 141 1084 489 -615 -593 -390 -577 1201 945 -901 -1054 277 176 84 641 -717
841 -717 -986 170 1207 149 93 -297 -879 -35 862 649 -832 -722 144 441 393 313 -729 -1257 239
860 239 1192 208 -686 -490 -422 -72 1497 387 -982 -417 386 276 435 485 -519 -542 346 691 -34 -447
880 -447 -309 -237 527 760 -176 -466 -595 22 370 158 -71 -727 -966 335 1063 -250 -384 -481 -508 329 997
901 997 -30 -866 -625 355 260 86 8 -471 -601 566 413 -309 -98 -270 -337 513 536 41 -731 -477 124
922 124 106 428 -286 -399 -668 463 646 -201 -326 -298 -392 332 674 -291 -768 -8 283 285 208 62 -479 -331
944 -331 230 460 -314 -149 -356 43 412 503 -304 -757 62 232 213 -202 295 -338 -2 346 383 -252 -259 -294
966 -294 -281 478 525 -212 -514 177 101 111 149 -120 -703 234 640 170 -323 -212 -355 -225 246 391 -301 -423
988d23L97J41J88o6l83n46N85L28o9j46P9k81R2L76j56n39O6O04k73j2M05o21
1010b54j80N72O35o26j42m12L95k5K97O5o52J2N99m7j59j2m73q7R45k4k97n27
1032c97K69J60J2M59o36j56RK70M8j52J25p8r3K38K55l21l26L36j08k7L32j97
1054B2m13L60J51k40J97j17l43K23M07l6l53l3l2K49J62k10j46k47J76N12k71
1075A8k12J73j81n5M47m2m68P7N04m61K47J16k7m42M24Q3k58J00R6p2ok08J35
1098a2j25J77k41L70K5k70j82j0L78j51J87o7J97m04K52M31j39m22k53k71Q12
1119B82m35K41m96O3M41j66q0K5K02k82J67L25k8n89K2L04k58M89Rj40l44O7L76
1142A95l78K27j41j54M26N5j60j98P4N1k16J93K77m42J19K20k5j22k32K16k21
$$ plain form
988 -423 -26 115 303 237 -146 -692 -107 221 152 6 85 -196 -104 272 116 -423 -357 247 -26 -38 367 -254
1010 -254 -434 138 773 147 5 -407 -12 -37 260 325 -327 -315 284 237 78 66 -407 -494 451 427 130 -397
1032 -397 -128 32 44 503 -133 -289 -280 -10 38 -114 11 -67 -160 78 333 12 -314 22 -86 -113 219 22
1054 22 -391 -31 120 -120 77 -40 -383 -160 247 211 -142 -175 -207 42 204 -6 -152 -399 -223 289 18
1075 18 -194 -21 -202 -257 190 148 -320 -243 261 -200 47 163 136 -306 118 201 -57 43 139 67 61 -147 -12
1098 -12 -137 40 -201 169 194 -76 -258 -268 110 -41 146 79 276 -128 124 555 416 -6 -259 -530 282
1119 282 -153 88 -408 -345 96 -70 -150 -125 77 -205 -38 287 259 -330 -308 -4 -262 227 236 96 -248 -181 195
1142 195 -183 44 -97 -251 175 230 70 -128 -54 -3 -219 -26 251 -191 -72 148 123 1 -231 -15 -236
1163b36L53j40J57o52L71J84K08j06J82n87K94m08P68k49l59K15k77J29N80n53
1183a26j4O6K39J32p5l8m09J56r4O65j55k67p5j07K28j71J3k33L65K11j47J67
1205C31l47k17pN74k11q3j86J16j5J31R5l31L5J34O7l8p5N9l18M35j31J56k01
1228b7o9M29n31J47K96l91j37M75j33J70k93J04j04QK32l13M8J49j17J6L48l00
1250Gj56k27K77M1J47l53K74j78K79J85k55J68j18K1j33r9L42k26j71J13j00K87
1272A25j04L19n71L94j13j83O8L1Jj19M68m13l80L58J76J7p2K2J88m14K92K55
1294C45m07J8r6J74o6J17J14m06L54p5j54j14K40J15k84J97k42l9J20jl33P5M23
1317G5l94K72m05P37k11J85l12R4l49K05P7m7k58K06K16k4J93j11l36J31K50j12
$$ plain form
1163 -236 117 -23 134 -518 -147 37 245 139 321 -266 28 -380 388 139 -220 -5 -282 -153 427 -126
1183 -126 -140 -74 165 297 222 184 -225 -69 -163 502 347 80 5 -102 126 -45 -32 -265 100 311 164 331
1205 331 -16 -233 -240 334 123 40 -146 -30 -45 86 181 -150 -115 19 86 48 -27 32 -286 149 18 174 -27
1228 -27 -96 333 -198 -51 245 -146 -283 192 59 229 -64 40 -64 -56 176 -137 -89 60 -57 -41 307 7
1250 7 -149 -376 -99 -58 89 -264 10 -168 111 296 41 209 91 112 -21 -120 222 -4 -175 -62 -162 125
1272 125 21 340 -231 163 50 -133 -65 -34 -33 -152 316 -97 -477 -119 57 74 2 24 212 -202 90 345
1294 345 -62 -44 -140 34 -32 85 199 -207 147 72 -82 -196 44 159 -125 72 -170 -209 -89 -90 -423 -348 75
1317 75 -319 -47 -452 285 74 259 -53 41 -308 -103 -26 -73 -331 -125 91 67 260 149 -187 -56 194 82
1339H2j56N1j1K37j13O0k13j6Kk04J07L71J6l83O0j64L71q1K42j66k42K6N1J18
1363D5J66k53j4K4P8Q9o7Q1j77k25L47j62m6J85K95l85J70k41n1J05J33q2J28
1386A43j02j36K12j10L12n35j44J14L91l91L64j43N7q4O2K90k71k34N41m30K79
1407A85l15P5p5j21Q07m85J65l52R8K7l08M15j69j89L75O3j51k06N17m50j36M00
1429A70K28l50J05k38Lj44K56O5j5k33J46R8j96Rq3M05J02m63J94n46K27M09k19
1452g0q1K07J08J48J53l59k8ll79K27J97k08l9M32l32m5K95m18M30j54J14l31
1474a36J55R8M5j47J10m8j83L88n01K37K18m58O72m97q1J93N4j38p9j00lL74J40
1497C13k99J74m7k03K77j05l18K19j3J26k74N44m25j57k2J05R5K87l28L8K39m47
$$ plain form
1339 82 -74 -23 -34 203 90 150 -63 -79 -77 -281 -174 197 213 -170 -110 -274 97 16 258 92 -150 -124 -73 45
1363 45 211 -42 -56 -32 46 135 68 149 -28 -253 94 -68 -114 71 366 -19 151 -90 -141 -36 97 15 143
1386 143 41 -95 117 7 319 -216 -360 -246 145 -246 118 -25 32 -52 10 300 29 -205 336 -94 185
1407 185 -130 -55 -130 -251 556 71 236 -116 -18 9 -299 116 -53 -242 133 196 45 -161 356 -94 -230 170
1429 170 398 48 153 -85 -82 -226 30 95 80 -153 -7 91 -105 -96 -179 226 328 -135 59 -487 -260 149 -70
1452 -70 -151 56 164 312 465 106 78 75 -304 -77 120 -88 -127 305 -27 -72 223 -195 235 81 195 -136
1474 -136 19 117 162 15 125 77 -106 282 -219 18 236 -222 450 -47 -128 65 119 -19 -98 -198 -201 173 313
1497 313 14 188 141 -62 215 110 -208 11 -2 124 -150 394 -31 -188 -210 -105 -10 277 -51 -13 226 -221
1519b21M00k32%J31R6j65Rj8J52k25J99j69J64k86nK74l08N25l95Q0K1r2JJ37
1543G3Q1j20k21K76L2K5l18J67j89J57L81k39j40j08J86m27M8O68n45M42l19J83
1565I3j63j42J98k7K24O2k08p2m28L36r4P7J9P9j11L72j10j60j25K70J08m4N4
1588B08l58j43R6r7L41M7k1j96K80j33J4k35O1K59Q1r6p4K88n13J64J6k3J0m6
1612g0k77L71P3p5j83J56k10K77j70LN7L10j78p5J69om17J23M17l74R6R0QRm9
1637G5l2J9j18j47R6J50r1L45Km12K9J08K31j64k29K82J71l07o6q3M05l40K34
1660A58L0l02m8K06m0K67j75l00K21k06K74k66J93Rr8J06J24k77J06k65L55M1
1682A13j64j28K50l55M11j17Q3P3m68K23P2L3l34K65j97P1L57j25k10Q6j93L33
$$ plain form
1519 -221 179 -53 -53 78 174 9 18 0 152 -73 126 -43 121 -165 -170 104 -204 321 -74 6 27 -65 -64 73
1543 73 154 34 -187 89 121 146 -172 -5 -194 -37 344 105 -35 -143 43 -384 -336 332 -213 229 -90 93
1565 93 -70 -212 -14 -41 183 245 37 -35 -463 -127 -221 -144 -125 -46 -157 215 105 -55 -180 90 198 154 208
1588 208 -150 -293 -197 -294 47 94 73 -123 157 24 38 -197 -136 123 204 108 34 322 -191 -27 -11 -34 -24 -70
1612 -70 -347 24 97 22 -161 -5 -215 62 -108 -105 -48 262 84 9 178 172 -245 -122 295 -79 17 107 115 124 75
1637 75 43 62 -56 -203 -107 43 -48 297 299 -113 -84 24 255 91 -138 144 315 8 -58 -141 264 -76 158
1660 158 188 -114 -162 44 4 271 96 -204 17 -189 85 -181 12 21 -77 29 153 -124 -18 -283 72 113
1682 113 -51 -179 71 -284 127 10 93 166 -302 -79 -7 26 -308 -43 -240 -169 188 63 -147 -61 -254 79
1704G9j07R4j09j9K85m88L2L62j51%J06j55K8k91L11P2n5j45J63l6L0j6L68m23
1728f5J94k67L94l0k96M02n63J68K13O0l30L39p2q3l5j41J14j5P1l25L07j61J47
1751B6p1K2K84m39L62j76K5J35j53K78j71j52NP7j9L23m02J77j45M0q5j10M08
1774B39l50K82l74K46l3P2pJ22l76oJ93L05l90N8M2J06K99n65M55l49J59J53k16
1797F5j95J19J00J87l54L6r8J5K80Q2m49P8R8l03L74p1j83L4R5J45K22l69k0J01
1821a1j10j69J57J37k5J61j10n8J59l28N25l76Mkj08M4K78k27L58k14l4r5J8n9
1845h5R7r1P3O0J24k25J72J1l6j16J36k24j09QL86j61J01j42q3J04p2J92p8K4
1869F6J43k36n3L00l30J21j71L82j06k35l0J05K8q3J28Q6P5r1L4k81L57j19q3
$$ plain form
1704 79 -28 66 -43 -62 223 -265 -233 129 -22 -22 84 -71 -43 -334 -23 49 -6 -151 12 -24 6 -10 358 -65
1728 -65 129 -138 256 226 -70 332 -231 -63 150 210 -120 219 147 64 29 -112 2 -13 58 -267 40 -121 26
1751 26 -45 -23 261 -178 184 8 33 168 15 293 122 -30 -25 52 33 356 -46 131 -14 26 -59 -169 239
1774 239 -111 171 -203 43 10 82 75 197 -179 -185 8 313 -77 -19 23 129 428 -137 318 -31 128 281 65
1797 65 -130 -11 89 276 -78 -42 -140 -125 155 237 -212 -134 -36 -339 35 -36 -219 -185 -90 55 277 -92 -112 -11
1821 -11 -121 -290 -133 4 -21 140 30 -28 131 -197 328 -48 -44 -46 -154 -110 168 -59 299 85 51 -44 -26 -85
1845 -85 12 -79 -6 54 178 -47 125 136 100 -16 120 -104 -213 -205 181 20 121 -21 -104 0 -72 120 42 66
1869 66 209 -27 -80 220 -110 11 -160 222 116 -119 -149 -44 -16 -99 29 115 190 99 133 -148 209 90 7
1892GL18m44o0K10J04k60J81j45p0L02j31K88j24J64k66K0k81O5J84j76K52j65
1914b7J86k81J32J00k13j52K25M0o1K89m20J95j61K41q0J63Q2l34K8m5K20l34
1936b07Q3N3N9j2q5L77k42j30O5j86K82m1L9j18j28J09m5L2L4J04r2K54o8j08
1960B9k13N8P6R9J84r2j68l8J98K2j73L39l84K07q2j82K3J19o3K10n02N52j08
1983A11j93L10l99J76J04J23r1k79K52k18m4L76j57k98K77j81K60j93J65k4j57
2004h0%l3P7K38n73M14P3l61M98m28O0K0o5k1K82k51P5n4P3K19l88K72o9Q6r0
2029b6j9Nj07M07l41J30r8J7pk8J33l9j56r0J97j71K33J48l40L56j43J56P6l04
2053a1J01J13n79K01J73K8j6K96o13L45J25k32k00L48k73J34j68M91k34K7l2j07
$$ plain form
1892 7 325 -119 -179 31 135 -125 56 -89 -159 143 12 300 176 340 74 94 -187 -122 62 -114 138 -27
1914 -27 159 -122 10 110 -103 -255 -30 10 -51 238 -182 13 -148 93 13 176 258 -76 -48 -93 127 -207
1936 -207 -124 -71 -12 -24 -109 268 26 -104 -39 -225 57 16 55 -63 -191 -82 -127 -95 -61 43 -49 205 137 29
1960 29 -184 -126 -50 49 233 141 -27 -65 133 155 -18 321 -63 144 62 -120 -97 22 -41 169 -333 219 111
1983 111 -82 228 -171 5 109 232 141 -138 114 -104 -148 228 71 -227 50 -131 129 -64 101 77 -80
2004 -80 -80 -113 -36 202 -371 43 116 -245 253 -175 -115 -95 -160 -181 101 -150 -75 -129 -56 163 -225 47 -22 64 -26
2029 -26 -45 -40 -147 260 -81 49 -49 -32 -39 -67 66 27 -129 -219 -22 -193 40 188 -152 204 61 217 293 -11
2053 -11 90 203 -376 -175 -2 26 10 306 -307 38 163 -69 -269 79 -194 -60 -228 263 29 56 24 -83
2075h3Q6K44l76J07J2qO8n6j37L55k55J15j21l6J01j54K52J06j93l8J52j14K12
2098B39r0k63J88J55n47M54k18J51J38j27l5M8j86R2K45j30l54L20J05mj60J76
2120A97l54K10J22m64oM21j96R8J46l32K01J47J53o3j87j88k9J64J25p7Q6j51
2142B3J55m43L15Q5r2K9k69Q8m5NJ50J17k78R0pL6j2j1K10P0l42L60n9P8l80J09
2168a8n9K06J70l39j55J77J31k58K60l6K8p4m5K6j32l0j05K60K23Q8l16N0J16
2191A68j65j92l6J90j48R1K08n6Pk87K26J60k65K43j88Q4K11r9j46j39L52l95
2213a76M88k14j09j8k59L54j50j54J58j47O9K05k6P0J1k43J6M6j50K31r2J83Q3
2236A76k8j94o9lL77J20r7n89J14K69j83K60j73%p2q5K10l92N54l77L49j66j01
$$ plain form
2075 -83 3 247 -129 -22 -10 -18 50 -6 -143 212 -43 72 -49 -85 16 -138 114 220 27 -11 141 27 239
2098 239 149 -114 74 229 -318 136 -82 69 207 80 45 93 -93 -1 244 114 -240 80 185 181 21 197
2120 197 -157 53 175 -289 -295 126 -70 28 174 -158 43 190 343 280 93 -95 -124 40 165 88 174 23
2142 23 178 -265 50 135 43 72 -197 -109 -154 -149 1 118 -160 -70 -77 -41 -53 -64 146 216 -126 234 175 253 -127 -18
2168 -18 -77 129 299 -40 -195 -18 113 -145 115 79 107 33 -12 14 -118 -148 -253 7 230 318 2 52 168
2191 168 3 -189 -225 -35 -183 -92 116 60 67 -220 6 166 -99 144 -44 40 251 152 6 -133 219 -176
2213 -176 312 98 -11 -29 -288 66 -84 -238 -80 -227 -158 47 21 91 102 -141 -125 -79 -229 2 -90 93 176
2236 176 148 -46 -115 -118 259 379 282 -307 -193 76 -107 153 -20 -20 -92 -177 33 -359 195 -182 167 1 -100
2259a00N4J27j76J79j11O8P8j70K82n75M26n4J2L0r5N7j07J87J96l91J74k46L3
2282a22N19o23K97L8kp4M2j62J86l13L16j55J32j00j58O9M4J23n5K32j97R3l9
2305I1Q9j45p6k24L21j39n9k00J51L77m03K93r4%k1p3J81J57l26L79k20j6k79
2328b36K43K61l91J23j1J70k92O3J29j77J34J55l42J48j42J38K60l35K75Oj31
2349D8k54J13M1r8K04j4j68J34j60j8J55j83L11j60R3l5J22o8l73M16l8j46o4
2372a42L43k11r4N4k04OJ66L66l4k58Mj9j20J92mj61L66l03K38K5j07J46l65p6
2396a92J40K30q3l18K08j17M25k95J43k1m29L04J92K05n19K32p2k57L37j19J64
2417A58k5j7k31J34j46K98k61j1K18%j35O3N9k1j42j37K13L9k2k59J53M13l03
$$ plain form
2259 -100 -46 81 -95 84 -27 41 119 -51 231 -344 82 28 40 70 -25 32 -75 112 308 -83 91 -155 -122
2282 -122 397 -226 71 109 107 33 75 -87 99 -214 102 -53 79 -21 -179 -110 -66 57 2 234 37 130 91
2305 91 180 35 -41 -265 56 -83 -142 -342 -191 186 -217 76 -18 -18 -39 -112 69 226 -100 279 59 43 -236
2328 -236 7 268 -123 0 -11 159 -133 -70 59 -118 16 171 -171 -23 -165 -27 233 -102 173 179 48
2349 48 -206 -93 -52 -150 54 40 -128 6 -154 -172 -17 -200 111 -49 44 9 131 63 -310 106 68 -78 -142
2372 -142 201 -10 -104 -50 -254 -248 -82 284 250 -8 -4 -23 -143 49 45 -116 250 -53 185 210 103 249 -116 -192
2396 -192 -52 178 95 -223 -15 -132 293 -2 141 120 -309 -5 187 392 -127 105 33 -224 113 -6 158
2417 158 133 116 -115 19 -127 171 -90 -101 117 117 -18 45 104 83 -59 -196 17 56 34 -225 -72 341 38
2440C8L5q5j02r8L46P7l44J46K69p6l4K25n16k11M89l06o4K35J17k12K0mJ55%
2464A00l20L02j93Q9M9q2K06M2l56K65q4l87J15p0N85m46m7M14l91K22j39O1m3
2487a08N96o86R4K78l99q2K47P8M1j81j93L80L6O4l31J91K5J11k15o4K53J95m56
2510a26l6K44j17J16j16J12k20K49k29n1L64J8j52o2k47M50k80K87k67J92k22
2531i3n2J05J90q2k50L89n82M67k19K81l34M54n48L23k09J10M02l18J4k00K23
2552G1j12L02q5j26j54J44j40J94j30r1J60L34k63k10M18l36l5J10J04l08L85
2573B32k89k69L98j79J93j14N2J17l67K24j15J43n9J31j2Mk22j40M45k84P7O4
2595C0j28K5L1R3o7k16L30J09l74K91N2m20K68l7r5K1k4O7J83Kl24K36k37L36
$$ plain form
2440 38 73 -12 -114 -212 134 211 -133 13 282 206 172 397 -119 -330 159 -147 -211 24 141 -71 -51 -55 100 100
2464 100 -220 82 -111 -22 27 -55 151 193 -163 102 18 -369 -254 -324 261 -185 -232 182 -209 13 -126 -65 -108
2487 -108 488 -198 -104 174 -225 -307 -60 18 59 -122 -315 65 101 165 -166 25 50 161 -54 -118 135 330 -126
2510 -126 -162 82 -35 81 -35 77 -143 106 -123 -174 190 208 56 -6 -253 197 -83 204 -63 129 -93
2531 -93 -145 -40 150 68 -182 207 -375 92 -127 154 -180 274 -274 49 -160 -50 352 34 48 -152 71
2552 71 -41 261 176 50 -104 40 -100 94 -36 -127 33 367 104 -106 312 -24 -59 51 155 -153 232
2573 232 -57 -326 72 -107 86 -28 24 141 -226 -2 -117 26 -33 98 86 90 -132 -272 173 -111 -34 30
2595 30 -98 -73 -42 51 -16 -232 98 207 -167 124 176 -244 24 -13 -108 -87 -111 -44 139 141 -183 53 -184 152
2619A52Kj79r8Q5j22N07j73k11j6j4J5K32l33K1M28n34J05J40M2J87j69m18J33
2642b18Q5l3RJ06J01j44M87m70m80M62l7K72L54o48L61k29Q9o9O0J52l91K52j16
2665d5K08k01J24q6K19k11M5q1J20j60M6l8j0J86j22Q1L0j13j00K79q7j50R7O5
2689I6N8j13N1l85J64O4M1J15j53O9OJ64l38OM24m43K11J52k19N8l00K83l8R5
2713F8j40K43o1kl43K22O3J67K6k55K40j84l9K07k20l1Q0j0J75k25N6L4K4j07
2737a2j62M12m33K82j49L76k29j29K5M4j07J25j63Q4L3l3K02K78n74M4K94j58
2759E0rQ4j08L4J08l29J62j33J84J74O6J57l28Qq3%q1J18l04K34k05K57j4o6K52
2784B28k99j24JK34p2JK29m80J70K66k28O5j7M6l12N82m69K05O9j82r0K53k09
$$ plain form
2619 152 154 -25 -123 -38 -160 347 174 -37 -53 -67 -52 180 -153 -132 296 -238 -133 7 49 236 67 -351 -218
2642 -218 -133 -166 -157 -51 50 -94 393 -77 -557 -95 -132 140 494 -154 207 -22 67 -2 58 210 -181 71 -45
2665 -45 163 -38 86 0 219 8 53 -28 92 -68 -22 -60 -70 116 -6 75 105 -8 -108 171 84 -66 31 96
2689 96 154 41 92 -293 -129 -65 -24 91 -62 7 13 177 -161 -155 269 -174 37 189 -30 28 -272 11 -27 68
2713 68 -72 171 110 108 -235 -13 50 217 243 -12 228 44 5 212 -8 -39 41 31 206 -19 37 71 95 -12
2737 -12 -174 238 -195 87 -62 314 85 -44 -19 25 -82 43 -120 -36 -3 -36 166 444 -130 -86 208 50
2759 50 41 125 17 51 159 -170 -8 -141 43 217 283 440 112 120 37 37 -44 74 -230 4 -201 56 42 -24 228
2784 228 -71 -195 -194 40 -32 -31 198 -282 -112 154 -74 -9 -26 20 -292 290 -179 26 95 -87 -177 76 -133
2807a33q2o8K4M84m00M8Q4j53J51M8k27K17j74J48J52l26J12J9o8RJ56K20m99
2830b58J34K20o9l9J1J35l24J78k58J9L50k68M34j81P2j17N2Q8l01J3L28k00l60
2853c41N82k55m7j1N8J29j59o6J26Mk68K31R0k80K79r4J00m6j07K38l43K67k68
2876a81K19K20K9k58L26n56K15j21K58J9k44M7j66M42j56j48J22j97j12L39J46
2897B43k77r2K86n10L19P8K25J64j75l77K5N8j9k13J85K98m08K36j11J04q7L5
2919a3J88k36j76J50J99j56j21J45K27k44J85o1k6l44N88l44K09k41J89k96J81
2940Cl47L28j37J76j46L35m20J64J9K84r5j7K8J97l58o3L74o7j06j77J53m42M64
2963A50j01k0K05j67K3k63J31J02n6J08j45J24o1q6oL58k45Q9k78K71j58J60k33
$$ plain form
2807 -133 -215 -283 -259 225 -175 -127 -43 -196 -45 3 -224 -7 -181 -33 119 -207 -95 -76 -144 -135 21 241 -258
2830 -258 -124 96 27 -12 -1 134 -190 -12 -270 -251 99 -169 265 84 156 39 91 179 -122 -109 219 19 -341
2853 -341 241 -14 -61 -72 -14 115 -44 -110 16 20 -248 -17 73 -207 72 -22 78 32 -75 163 -180 87 -181
2876 -181 38 258 287 29 355 -201 14 -107 151 170 -74 -27 -193 249 93 -55 67 -130 -242 97 243
2897 243 -34 -126 160 -350 -31 47 272 436 261 -116 -91 -33 -52 -265 -80 218 -190 46 -65 39 -48 -13
2919 -13 175 -61 -237 -87 112 -44 -165 -20 207 -37 148 87 61 -283 305 -39 170 -71 118 -178 3
2940 3 -344 -16 -153 23 -123 212 -208 -44 -25 259 164 147 175 372 14 -49 325 258 152 -25 128 -314 150
2963 150 49 29 234 67 90 -173 -42 60 4 112 -33 91 30 -56 -62 296 51 140 -138 133 -25 135 -98
2986i8O2K34k89L24l20MK41j01j24j10O7k02M94k49K7K94k35J58K5m75L14O2m12
3009c09J92M8J55p5P1j64O0J60q9j14J0j32k62M51K8Nl1k95kL2J77l6L22j84k82
3034b64K67J8M0r7j00l75K69J50J70l00J82K04j0l63j03K16Kj2L84k06j73J34
3056C3J52j62j62l6J24L2J3j90Q1K3J07k12J60J15j05O3Q1q1n1j58K08J71j62
3079D4j02L76l98k22K00K9K17r8k4n8K18l84L80L9k14N3K50k41o9K37k41k29M79
3102B42j47m24L94j93K2J33m43L92J61k37J75m6l3l1j2L46j17rk58J37jJ33k74
3125i0K02l5K60k9n44j8K49L00l72m5L30l8p8j20Q6k33l7J37J02k3k71L16j74
3148a25K02j71p1K20K3p6mq5K30k31Nk36L90r3j3j44M46q0J48m84J56R1j48K27
$$ plain form
2986 -98 -36 198 -91 233 -87 -83 158 57 -67 -177 -110 -312 182 -67 -40 254 19 177 202 -273 41 103 -309
3009 -309 -117 -69 86 11 82 -82 -22 138 49 -65 -55 -187 -449 2 30 35 4 -291 -293 -261 -84 -120 202 18 -264
3034 -264 3 21 61 -36 -136 -511 -242 -92 78 -222 -40 164 154 -209 -312 -96 -94 -106 278 72 -101 33
3056 33 185 23 -139 -175 -51 -19 -6 -196 -115 -92 15 -197 -37 78 -27 36 117 36 -15 -173 35 206 44
3079 44 -58 318 -80 -302 -102 -73 144 46 22 -36 182 -202 178 217 3 56 306 65 -4 233 -8 -237 242
3102 242 95 -329 65 -128 -106 27 -416 -24 137 -100 75 29 -4 -35 -47 299 182 173 -85 52 51 184 -90
3125 -90 112 77 337 308 -236 -254 -5 295 -77 -122 208 170 92 -28 58 -175 -212 -75 27 4 -267 49 -125
3148 -125 77 -94 -165 55 78 2 -2 -87 143 -88 -83 -319 71 -22 -35 -179 267 187 335 -149 7 98 -50 177
3172A77l99L13O1l25l1K52k04J70k53K49k12L20J2N0l13j60K28j48M73l27M3N4
3194C0K1J06j44K99l71J75o0p7K03n9Lk72L30k20K1L5J24l89J81J77o1q9n1M44
3218C56l9l64J4J41j70p1n6q9K32M86k50j68nr2J08j09k8J45j41J84k1l24K67
3241Fk42K28k5k2J01j9O4l06J11J95J1l14P34p69M17R2m35J23O3n1J45j42O2j7
3265A0m02N25J30j93l46j62K69K64J0K53p20K73J80j13k05O60o97J63J37j46k91
3286d01L29pj89L9M46m20j0L94K1n6M2j19J53K8k85L09k61J36k02J68k25K9j1
3309i2K63l30J52M2J52l70M28l72J39J95k95J78n1kJ89l21j74M09k17P4M4k20
3331a79L21l73M70m03L47k30j18Q3J34k85J99Q8k40L30L4l26K49Q7k12Q0j19M9
$$ plain form
3172 177 -222 91 152 -173 -204 48 -156 14 -239 10 -202 118 130 180 -133 -293 -65 -213 260 -67 -24 30
3194 30 51 157 13 312 -59 116 56 -21 182 123 126 -146 184 -36 -15 20 144 -245 -64 113 52 -37 -88 356
3218 356 317 -47 -33 108 -62 -133 -189 -278 -46 440 190 22 17 -75 33 -76 -104 41 -100 84 63 -261 6
3241 6 -236 -8 -33 -55 46 27 91 -215 -104 91 102 -212 522 -247 170 262 -173 -50 13 -38 107 -35 27 10
3265 10 -392 133 263 70 -276 -438 -169 95 105 358 -362 -89 91 -22 -227 433 -264 -101 36 -110 -401
3286 -401 -72 -79 -268 -229 217 -203 -213 181 202 146 188 69 222 250 -35 274 13 149 -53 115 -110 -81 -92
3309 -92 171 -159 -7 35 187 -183 245 -127 12 207 -88 90 39 37 226 -95 -269 140 -77 -3 41 -179
3331 -179 142 -231 239 -164 183 -47 -165 -82 52 -233 -34 54 -186 144 178 -148 101 188 -24 56 -63 -14
3353a4R6Qk05J22M9J31k19J84M7k54k73J91K29j75j9LR9J72k68pj26M9l06L67
3377a19J87j94mL58l33J08K10k31O5j22J21L21k23k89N34l03k26L28p2j56O4j08
3399h4J74k44M5K27Q4o5j80nN8K6j09N3O5K73m04pL88n74J82M1k5l0pJ10K74j09
3425A57q2l18P4L59o7l16J52O3n7Q8k22O0M46l47K62n12L21j06P9p4J13j89j4
3448a30Q6R0J40m25N10k18j04j8R5O3n8K98k97j12M4J19l4j44N3R0K61o18L21
3471A2m0l3j15J54Lnj2j73J2K71K04j58j69k73K97L2j43J64o0J63r0N1j88J5J64
3496H3j07j15L11j69J43k69K86j38J41R9m46l8M0K88p1L07j13k27J65n10L33j51
3518a58O2j72K69PK51l44M6r2j31J02L51j96J84j01n0J20m13J45K1L81k62J06
$$ plain form
3353 -14 82 90 -115 7 56 187 -32 152 199 -55 -328 -137 92 -83 -102 -99 0 172 -96 -103 -229 -180 -486 -119
3377 -119 68 -126 -130 228 -105 3 213 -18 47 -75 46 367 144 -145 389 86 -140 188 116 -40 24 -84
3399 -84 90 -154 -109 118 202 137 -43 -48 10 36 -73 -20 45 318 -86 -93 295 -279 -97 -56 -81 -111 -118 -8 266 157
3425 157 75 -243 -169 190 123 -193 -41 22 -35 53 -169 -109 337 -10 252 -260 61 -45 34 -40 73 -116 -130
3448 -130 -44 46 186 -239 271 53 -51 -69 26 89 31 329 32 -80 -36 83 49 -95 -42 48 309 -309 12
3471 12 -28 -61 -176 -22 -19 -24 -36 -209 -197 74 278 120 -49 -322 -25 7 -136 28 -32 131 41 92 -96 -81 83
3496 83 -24 -139 172 3 146 -123 163 25 166 265 -181 -219 -179 109 38 345 232 5 170 -340 -7 -158
3518 -158 -96 -268 1 8 259 -85 -39 -131 -262 -160 191 -5 179 78 28 148 -265 -120 -99 282 20 126
3540A26q7Q1j59j98K14m9K44k28j57J30N6J38k49L06l02p4K27K5l65L18k18K6
3562a95r2M14j87p5K57j76N3J79l3O6j11j1k39L80l29L52j62k73L3K18j35k59
3584c25L49k37L58j30M75o98Q5j20N77k78k97J52J30o4j32L18m50M40J9n05J03
3605b30N08j51Q5m04j97M78l5kk3l06M35J84k25l2L7k14K96k28mm6k4O6L11m79
3629b00J66o5J5k30L74q8R1R9l88J09J01Q6j1l25M73k59J96j20K70l77l5l0K54
3652A06O1m24M3N93m14j38R7J4JRP0j77L40k52J8K47k34m1J31k24M7J6K28l2P1
3677A56l2k01J5K61m3k43J05J60qj25j02L00pk85M19l89J6Q2j0l23M85k26j66
3700a61J21j66k00L02J9P7L29j33j30k0ok21M67J43m99J80m21K11o5O48m06k09
$$ plain form
3540 126 39 120 -39 -237 -23 -72 172 -56 -213 -83 -27 111 -138 168 -134 -208 19 44 -321 -3 -221 -195
3562 -195 -287 127 -60 -135 122 -54 -1 178 145 211 100 89 -150 230 -99 253 91 -182 -149 69 -66 -325
3584 -325 24 -213 145 15 490 -208 -123 -243 334 56 -241 -89 41 -23 -155 163 -287 153 172 -333 -230
3605 -230 278 127 212 -192 -389 89 54 52 29 -277 158 342 117 85 122 -92 204 -24 -28 -74 -98 -32 279 -200
3629 -200 -34 -99 -84 -314 60 -28 63 162 -226 -117 -16 70 59 -266 207 -52 144 24 294 -83 -118 -148 106
3652 106 167 -257 -214 379 -35 -173 -76 -62 -61 -52 18 -159 181 -71 -53 194 -40 -81 50 -174 -127 -111 117 85 156
3677 156 124 -77 -62 199 156 -87 18 178 170 45 -57 243 236 -49 370 -19 -3 79 69 -254 231 5 -161
3700 -161 -40 -206 -406 -104 -85 -8 321 188 58 38 32 -189 278 421 -78 102 -319 -108 -173 475 69 -140
3722a40J05l1M54j61k17O0J69l08J45k58J94k83K08K35q0Q6j18l1Kj72K48N4j40
3745B1j2Q6q2P0m41L80J89r2O9j40k91j3L29N7p2j01L01j85m3M8l08K13J11q2
3769A2j64J00k55K73N2m5k27K17J9O7k44J49q4L4J45j07N9j23j53L73O36r72L59
3792A21N7m09J18j69L51q6L2m91L92M31l78k54K68L22n88N0L39j59J61l60J94
$$ plain form
3722 -140 -35 -66 388 227 10 70 239 -69 76 -182 12 -271 -63 172 92 178 60 29 31 -141 107 161 21
3745 21 9 95 13 83 -358 22 211 119 188 48 -243 -256 73 130 58 -43 258 73 30 78 -230 -17 94 12
3769 12 -152 -52 -307 -34 18 -27 -254 -37 -18 49 -195 -46 -130 -96 49 -58 1 -122 -275 98 734 -238 121
3792 121 178 -231 -113 -282 69 -17 15 -476 -84 347 -31 -285 -17 305 -283 -233 106 -53 108 -252 -58
$$ [...]
8191B35
##END NTUPLES=NMR FID
##END=
