##TITLE=1H_DE-63_33
 D2O
 8 sc, 
 13.8.2024
##JCAMPDX= 6.0         $$ Bruker NMR JCAMP-DX V2.0
##DATA TYPE= NMR FID
##DATA CLASS= NTUPLES
##ORIGIN= UXNMR, Bruker Analytische Messtechnik GmbH
##OWNER= root
$$ XWIN-NMR		Version 3.5
$$ Tue Aug 13 16:43:25 2024 Russian Standard Time (UT+4h)  she@DPX200
##.OBSERVE FREQUENCY= 200.1313
##.OBSERVE NUCLEUS= ^1H
##.DELAY= (6, 6)
##.ACQUISITION MODE= SIMULTANEOUS
##.ACQUISITION SCHEME= undefined
##.AVERAGES= 8
##.DIGITISER RES= 18
##SPECTROMETER/DATA SYSTEM= spect
##.PULSE SEQUENCE= zg30
##.SOLVENT NAME= DMSO
##.SHIFT REFERENCE= (INTERNAL, DMSO, 0, 15.7039)
##AUDIT TRAIL= $$ (NUMBER, WHEN, WHO, WHERE, WHAT)
$$ ##TITLE= Audit trail, XWIN-NMR		Version 3.5
$$ ##JCAMPDX= 5.01
$$ ##ORIGIN= Bruker BioSpin GmbH
$$ ##OWNER= she
$$ F:/spectra/data/she/nmr/H-F/1/audita.txt
$$ ##AUDIT TRAIL=  $$ (NUMBER, WHEN, WHO, WHERE, WHAT)
(   1,<2024-08-13 16:42:35.00 +0400>,<she>,<DPX200>,
      <created by zg, POWCHK disabled, PULCHK disabled
       configuration hash MD5:
       00 E9 B6 7A A2 85 ED C7 34 08 36 98 17 FE 4E 26
       data hash MD5: 16K
       BD 49 30 34 93 08 06 23 A4 72 2E 9C BE B4 3A F7>)
$$ ##END=
$$ 
$$ hash MD5
$$ 60 48 8E F2 08 2F 67 34 61 03 1F 24 7C FB 41 28
##$RELAX= 
##$RELAX= 
##$RELAX= 
##$RELAX= 
##$RELAX= 
##$RELAX= 
$$ Bruker specific parameters
$$ --------------------------
##$DU= <F:/spectra>
##$EXPNO= 1
##$NAME= <H-F>
##$PROCNO= 1
##$TYPE= <nmr>
##$USER= <she>
##$AMP= (0..31)
100 100 100 100 100 100 100 100 100 100 100 100 100 100 100 100 100 100 
100 100 100 100 100 100 100 100 100 100 100 100 100 100 
##$AQSEQ= 0
##$AQ_mod= 1
##$AUNM= <au_zg>
##$AUTOPOS= <>
##$BF1= 200.13
##$BF2= 200.13
##$BF3= 200.13
##$BF4= 200.13
##$BF5= 200.13
##$BF6= 200.13
##$BF7= 200.13
##$BF8= 200.13
##$BYTORDA= 1
##$CFDGTYP= 0
##$CFRGTYP= 5
##$CHEMSTR= <none>
##$CNST= (0..31)
1 1 145 1 1 1 1 1 1 1 1 1 1 1 1 1 1 1 1 1 1 1 1 1 1 1 1 1 1 1 1 1 
##$CPDPRG= <>
##$CPDPRG1= <>
##$CPDPRG2= <>
##$CPDPRG3= <>
##$CPDPRG4= <mlev>
##$CPDPRG5= <mlev>
##$CPDPRG6= <mlev>
##$CPDPRG7= <mlev>
##$CPDPRG8= <mlev>
##$CPDPRGB= <>
##$CPDPRGT= <>
##$D= (0..31)
0 1.2 0 0 0 0 0 0 0 0.06 0 0.03 0 0 0 0 0.0002 0 0 0 0 0 0 0 0 0 0 0 0 
0 0 0 
##$DATE= 1723552954
##$DBL= (0..7)
120 120 120 120 120 120 120 120 
##$DBP= (0..7)
150 150 150 150 150 150 150 150 
##$DBP07= 0
##$DBPNAM0= <>
##$DBPNAM1= <>
##$DBPNAM2= <>
##$DBPNAM3= <>
##$DBPNAM4= <>
##$DBPNAM5= <>
##$DBPNAM6= <>
##$DBPNAM7= <>
##$DBPOAL= (0..7)
0.5 0.5 0.5 0.5 0.5 0.5 0.5 0.5 
##$DBPOFFS= (0..7)
0 0 0 0 0 0 0 0 
##$DE= 6
##$DECBNUC= <off>
##$DECIM= 24
##$DECNUC= <off>
##$DECSTAT= 4
##$DIGMOD= 1
##$DIGTYP= 9
##$DL= (0..7)
0 120 120 120 120 120 120 120 
##$DP= (0..7)
150 150 150 150 150 150 150 150 
##$DP07= 0
##$DPNAME0= <>
##$DPNAME1= <>
##$DPNAME2= <>
##$DPNAME3= <>
##$DPNAME4= <>
##$DPNAME5= <>
##$DPNAME6= <>
##$DPNAME7= <>
##$DPOAL= (0..7)
0.5 0.5 0.5 0.5 0.5 0.5 0.5 0.5 
##$DPOFFS= (0..7)
0 0 0 0 0 0 0 0 
##$DQDMODE= 0
##$DR= 18
##$DS= 0
##$DSLIST= <SSSSSSSSSSSSSSS>
##$DSPFIRM= 0
$$ [...]
##$SUBNAM2= <"">
##$SUBNAM3= <"">
##$SUBNAM4= <"">
##$SUBNAM5= <"">
##$SUBNAM6= <"">
##$SUBNAM7= <"">
##$SUBNAM8= <"">
##$SUBNAM9= <"">
##$SW= 24.0689771365484
##$SWIBOX= (0..15)
0 0 2 0 0 0 0 0 0 0 0 0 0 0 0 0 
##$SW_h= 4816.95568400771
##$TD= 16384
##$TD0= 1
##$TE= 0
##$TE2= 300
##$TE3= 300
##$TEG= 300
##$TL= (0..7)
0 120 120 120 120 120 120 120 
##$TP= (0..7)
150 150 150 150 150 150 150 150 
##$TP07= 0
##$TPNAME0= <>
##$TPNAME1= <>
##$TPNAME2= <>
##$TPNAME3= <>
##$TPNAME4= <>
##$TPNAME5= <>
##$TPNAME6= <>
##$TPNAME7= <>
##$TPOAL= (0..7)
0.5 0.5 0.5 0.5 0.5 0.5 0.5 0.5 
##$TPOFFS= (0..7)
0 0 0 0 0 0 0 0 
##$TUNHIN= 0
##$TUNHOUT= 0
##$TUNXOUT= 0
##$USERA1= <user>
##$USERA2= <user>
##$USERA3= <user>
##$USERA4= <user>
##$USERA5= <user>
##$V9= 5
##$VALIST= <valist>
##$VCLIST= <CCCCCCCCCCCCCCC>
##$VD= 0
##$VDLIST= <DDDDDDDDDDDDDDD>
##$VPLIST= <PPPPPPPPPPPPPPP>
##$VTLIST= <TTTTTTTTTTTTTTT>
##$WBST= 1024
##$WBSW= 4
##$XGAIN= (0..3)
0 0 0 0 
##$XL= 0
##$YL= 0
##$YMAX_a= 465322
##$YMIN_a= -433386
##$ZGOPTNS= <>
##$ZL1= 120
##$ZL2= 120
##$ZL3= 120
##$ZL4= 120
##$ABSF1= 10
##$ABSF2= 0
##$ABSG= 5
##$ABSL= 3
##$ALPHA= 0
##$AQORDER= 0
##$ASSFAC= 0
##$ASSFACI= 0
##$ASSFACX= 0
##$ASSWID= 0
##$AUNMP= <proc_1d>
##$AZFE= 0.1
##$AZFW= 0.1
##$BCFW= 1
##$BC_mod= 2
##$BYTORDP= 1
##$COROFFS= 0
##$CY= 11.3945322036743
##$DATMOD= 1
##$DC= 2
##$DFILT= <>
##$DTYPP= 0
##$F1P= 15.6554695791079
##$F2P= 12.8336369535428
##$FCOR= 0.5
##$FTSIZE= 0
##$FT_mod= 4
##$GAMMA= 1
##$GB= 0.15
##$INTBC= 1
##$INTSCL= 1
##$ISEN= 128
##$LB= 0.24
##$LEV0= 0
##$LPBIN= 0
##$MAXI= 10000
##$MC2= 0
##$MEAN= 0
##$ME_mod= 0
##$MI= 1.114404
##$NCOEF= 0
##$NC_proc= 0
##$NLEV= 6
##$NOISF1= 3.799351
##$NOISF2= 2.8
##$NSP= 1
##$NTH_PI= 0
##$NZP= 0
##$OFFSET= 15.70392
##$PC= 1
##$PHC0= -25997.6
##$PHC1= 7.98748
##$PH_mod= 1
##$PKNL= yes
##$PPARMOD= 0
##$PSCAL= 0
##$PSIGN= 0
##$REVERSE= no
##$SF= 200.130013532006
##$SI= 16384
##$SIGF1= 3
##$SIGF2= 2
##$SINO= 400
##$SIOLD= 16384
##$SREGLST= <1H.CDCl3>
##$SSB= 0
##$STSI= 0
##$STSR= 0
##$SW_p= 3612.71676300578
##$SYMM= 0
##$S_DEV= 0
##$TDeff= 0
##$TDoff= 0
##$TI= <>
##$TILT= no
##$TM1= 0
##$TM2= 0
##$TOPLEV= 0
##$USERP1= <user>
##$USERP2= <user>
##$USERP3= <user>
##$USERP4= <user>
##$USERP5= <user>
##$WDW= 1
##$XDIM= 8192
##$YMAX_p= 0
##$YMIN_p= 0
$$ End of Bruker specific parameters
$$ ---------------------------------
##NTUPLES= NMR FID
##VAR_NAME=  TIME,          FID/REAL,        FID/IMAG
##SYMBOL=    X,             R,               I
##VAR_TYPE=  INDEPENDENT,   DEPENDENT,       DEPENDENT
##VAR_FORM=  AFFN,          ASDF,            ASDF
##VAR_DIM=   8192,          8192,            8192
##UNITS=     SECONDS,       ARBITRARY UNITS, ARBITRARY UNITS
##FACTOR=    0.0002076,     1,               1
##FIRST=     0,             0,               0
##LAST=      1.7004516,     0,               0
##MIN=       0,             -433386,         0
##MAX=       1.7004516,     465322,          0
$$ Real data points
##PAGE= N=1
##DATA TABLE= (X++(R..R)), XYDATA
$$ [...]
$$ plain form
1928 -225 18 -11 -130 -35 -82 -107 74 126 -386 -238 -187 54 -147 -228 29 31 0 13 -60 89 123 19 -156 -40
1952 -40 -4 -235 57 -122 235 197 -40 -85 -199 -153 81 114 180 -64 229 -51 53 46 -48 -185 -44 -170 -352
1975 -352 35 -44 195 17 -296 -191 0 228 -162 -163 -35 56 -137 -105 -194 -228 176 -121 165 -96 -151 -119 -65
1998 -65 146 -1 219 208 64 68 113 -1 73 -143 -161 -31 41 181 -147 -10 65 -7 -99 -105 -179 6 9 134 -63
2023 -63 35 -32 -160 160 61 -92 -191 21 144 18 -26 439 337 40 28 47 219 -213 79 -83 -193 -243 -56
2046 -56 -13 -205 -112 -165 -17 -269 -4 -144 -223 140 167 4 202 206 -92 -97 89 286 86 39 -187 -90 -32 67 17
2071 17 -34 129 45 73 151 -128 329 -15 1 181 358 -8 -91 104 -220 -77 -23 -34 -147 183 179 -115 -105 -95
2095 -95 80 -32 264 -133 318 25 115 10 148 53 -136 93 -42 23 8 247 201 30 41 170 -194 210
$$ packed form
1928b25K43k9j19R5m7k5J81N2n12J48N1K41k01q1K57Kl1J3p3J49L4j04j75J16
1952d0L6k31K92j79L57l8k37m5j14M6K34L3O6k44K93k80J04pr4j37J41j26j82
1975c52L87p9K39j78l13J05J91K28l90jJ28R1j93L2q9l4M04k97K86k61n5L2N4
1998f5K11j47K20j1j44MM5j14P4k16j8J30P2J40l28J37P5p2r2op4J85LJ25j97
2023f3R8o7j28L20r9j53r9K12J23j26m4M65j02k97j2J9J72m32K92j62j10n0J87
2046e6M3j92R3n3J48k52K65j40p9L63K7j63J98Mk98nJ86J97k00m7k26R7N8R9n0
2071A7n1J63q4K8P8k79M57l44J6J80J77l66q3J95l24J43N4j1j13L30mk94J0J0
2095i5J75j12K96l97M51k93R0j05J38r5j89K29j35O5j5K39m6j71J1J29l64M04
$$ plain form
2117 210 97 125 -224 160 -65 42 -31 -166 254 -130 133 86 50 253 -23 4 231 160 -126 -93 90 116 -161
2140 -161 -202 97 251 5 -415 173 122 107 5 -14 -416 -31 160 86 -86 -236 -79 237 -102 -138 36 -210
2162 -210 -115 -163 263 50 -535 -2 128 -143 -273 -114 39 54 204 -110 -40 -145 -71 -91 76 111 176 252 -15
2185 -15 139 97 -90 344 -123 -68 11 -57 182 104 -210 13 -118 -54 -154 192 -351 121 -1 -206 30 9 163
2208 163 -144 71 -158 107 105 -79 124 45 91 -132 -138 -27 -80 35 -171 -61 -221 100 -7 -68 -186 -224 -26
2231 -26 -20 -45 9 -97 -234 341 -37 -131 -22 59 139 -183 -183 -174 -22 -422 -30 134 -206 213 -154 -197 -193 152 -2
2256 -2 40 -187 -123 25 -116 182 21 86 59 445 300 -174 125 -165 -209 -61 38 166 -35 -44 45 301 212 4
2280 4 -66 -62 4 -309 -190 -6 143 33 -72 69 198 -24 -91 -205 201 100 -126 0 -215 144 351 2
$$ packed form
2117B10j13K8l49L84k25J07p3j35M20l84K63m7l6K03k76K7K27p1k86L3J83K6k77
2140a61m1K99J54k46m20N88n1j5j02j9m02L85J91p4j72j50J57L16l39l6J74k46
2162b10R5m8M26k13n85N33J30k71j30J59J53J5J50l14P0j05P4k0J67L5O5P6k67
2185a5J54m2j87M34m67N5P9o8K39p8l14K23j31O4j00L46n43M72j22k05K36k1J54
2208A63l07K15k29K65kj84K03p9M6k23oJ11n3J15k06J10j60L21j07o1j18l8J98
2231b6Ok5N4j06j37N75l78r4J09Q1Q0l22%RJ52m00L92J64l40M19l67m3ML45j54
2256bM2k27O4J48j41K98j61O5k7L86j45m74K99k90m4J48R9J28k01rQ9K56q9k08
2280Dp0MO6l13J19J84J49j10j05J41J29k22o7j14M06j01k26J26k15L59K07l49
$$ plain form
2302 2 39 -26 -269 -36 -269 -167 -205 179 -166 86 212 -183 -16 141 31 64 -123 -18 -373 -54 -34 130
2324 130 -27 64 93 -73 21 -31 255 -88 229 75 -124 -111 -218 -233 251 133 231 -58 46 389 134 55 81
2347 81 44 -189 167 100 -22 -212 -67 70 -333 177 266 -385 303 15 -232 216 -122 -156 139 229 176 -5
2369 -5 -315 85 103 -223 -273 -151 -49 -114 -60 -133 5 304 -22 118 -31 -166 142 -221 208 66 -219 -115
2391 -115 32 179 43 -3 109 -155 214 -62 -26 91 9 19 -27 -5 -264 -55 -258 -116 310 -58 -27 78
2413 78 -43 58 19 -1 343 -54 -283 -227 243 -86 -116 391 -102 189 64 9 17 71 69 -4 57 -72 -116 -40 41
2438 41 375 -154 -21 -194 -88 -14 -17 235 169 279 217 142 -66 -177 60 -37 -32 -26 262 -80 20 90 -171 158
2462 158 3 -114 -60 85 -13 169 208 176 -295 -65 -108 54 -63 207 -286 -95 332 409 234 25 204 248
$$ packed form
2302BL7o5k43K33k33J02l8L84l45K52J26l95J67J57j10L3j87J05l55L19K0J64
2324A30j57R1K9j66R4n2K86l43L17j54j99J3j07j5M84j18R8k89J04L43k55p9K6
2347H1l7k33L56o7j22j90J45J37m03N10Q9o51O88k88k47M48l38l4K95R0n3j81
2369el10M00J8l26n0J22J02o5N4p3J38K99l26J40j49j35L08l63M29j42k85J04
2391a15J47J47j36m6J12k64L69k76L6J17q2J0m6K2k59K09k03J42M26l68L1J05
2413G8j21J01l9k0L44l97k29N6M70l29l0N07m93K91j25n5QN4kp3O1j29m4P6Q1
2438D1L34n29J33j73J06P4lK52o6J10o2p5k08j11K37r7NOK88l42J00P0k61L29
2462A58j55j17N4J45r8J82L9l2m71K30m3J62j17K70m93J91M27P7j75k09J79M4
$$ plain form
2484 248 167 145 271 -170 -164 8 53 -153 449 -131 156 132 -4 7 22 -113 -28 -275 -111 58 273 304 -263
2507 -263 -62 -47 174 69 108 261 233 -167 -114 140 -146 116 -60 10 254 225 75 -335 154 -57 -438 -34
2529 -34 107 -228 -62 251 -169 -248 -38 -113 -166 67 -121 -92 275 -173 -124 177 156 230 125 -282 -359 54 40
2552 40 112 -113 -164 -48 123 -331 -124 -79 128 -5 270 82 -125 95 71 -148 -218 -154 -132 -60 -451 -291 131
2575 131 243 -240 169 -393 12 41 -207 192 26 -48 -1 -107 89 -175 183 194 -114 -154 103 -73 -207 -75
2597 -75 195 -106 -286 -139 8 282 81 218 -130 125 -126 288 -6 -52 134 -325 33 123 139 214 -170 -169
2619 -169 -211 33 184 245 187 -187 189 66 3 -83 -47 80 -70 486 -92 -52 -2 298 252 210 125 -375 318 86
2643 86 -114 82 -182 255 170 -313 142 -238 -62 2 27 157 301 235 170 103 -5 -144 -150 -165 -34 -76 142 73
$$ packed form
2484B48q1k2J26m41OJ72M5k06O02n80K87k4j36J1J5j35Q5k47J64J69K15L1n67
2507b63K01J5K21j05L9J53k8m00N3K54k86K62j76P0K44k9j50m10M89k11l81M04
2529c4J41l35J66L13m20p9K10p5n3K33j88K9L67m48M9L01k1P4j05m07p7M13j4
2552D0P2k25n1J16J71m54K07M5K07j33K75j88k07K20k4k19p0O4K2P2l91J60M22
2575A31J12m83M09n62M05K9k48L99j66p4M7j06J96k64L58J1l08m0K57j76j34J32
2597g5K70l01j80J47J47K74k01J37l48K55k51M14k94m6J86m59L58R0J6P5l84J
2619a69m2K44J51O1n8l74L76j23o3q6L6J27j50N56n78M0N0L00m6m2q5n00O93k32
2643H6k00J96k64M37q5m83M55l80J76O4K5J30J44o6o5o7j08j39oj5J31m2K18o9
$$ plain form
2667 73 -206 199 -94 61 36 53 -83 -198 215 -14 -188 -147 -247 124 9 -156 164 -16 161 -102 -161 91
2689 91 -151 -166 -125 270 -164 -122 -75 -35 25 22 352 -189 -229 68 116 -24 55 78 486 -151 49 -93 160 48
2713 48 -209 -13 -21 -169 56 369 -127 -254 49 -135 -165 -35 -95 87 -70 -69 18 -186 -11 -58 258 318 -51
2736 -51 -359 119 -8 132 -148 -42 -80 139 303 -56 -142 103 153 75 198 -320 -46 106 -172 97 -111 -49
2758 -49 -48 -388 219 203 -42 117 -31 64 0 -348 171 -135 -143 -5 107 -137 -188 205 47 -172 -38 174 40
2781 40 -64 -27 4 41 -370 51 -72 13 -49 100 35 211 -40 -328 -49 30 128 -155 76 86 -151 265 -64
2804 -64 65 28 -185 95 61 75 51 14 229 -17 -193 -223 80 83 -119 181 -104 72 12 -93 -79 -194 -237 35
2828 35 37 0 26 -147 3 -280 350 93 77 143 199 -69 -67 -39 12 -450 8 85 -156 -119 -291 -73 74 -68 -128
$$ packed form
2667G3k79M05k93J55k5J7j36j15M13k29j74M1j00L71j15j65L20j80J77k63n9K52
2689I1k42j5M1L95m34M2M7M0O0lL30n41m0K97M8j40P9K3M08o37K00j42K53j12
2713D8k57J96qj48K25L13m96j27L03j84l0J30o0J82j57JQ7k04J75m7L16O0l69
2736e1l08M78j27J40k80J06l8K19J64l59q6K45N0p8J23n18K74J52k78K69k08O2
2758d9Jl40O07j6k45J59j48R5o4l48N19l06qJ38J12k44n1L93j58k19J34K12j34
2781D0j04L7L1L7m11M21j23Q5o2J49o5J76k51k88K79P9R8k83K31J0k37M16l29
2804f4J29l7k13K80l4J4k4l7K15k46j76l0L03Lk02L00k85J76o0j05J4j15m3K72
2828C5Kl7K6j73J50k83O30k57j6O6N6k68KK8N1m62M58P7k41L7j72K18J47j42o0
$$ plain form
2853 -128 -61 94 -273 35 46 219 128 66 353 -60 109 217 115 173 -26 -75 -193 256 106 102 339 -170 -5
2876 -5 200 -236 3 94 269 53 92 88 -14 -185 -308 295 -243 51 97 67 59 -71 31 -209 -5 78 -276 106
2900 106 -365 -14 -167 -295 77 30 126 -162 244 40 61 -6 -44 -5 193 34 -58 -118 -227 103 -24 -70 -29
2923 -29 -202 119 120 -128 161 -79 -108 30 33 -10 -133 -159 20 71 -334 -55 142 261 -42 -34 -365 190 251 99
2947 99 38 237 231 -22 3 -19 -125 238 -20 268 -161 -141 44 105 -130 -24 18 -206 -99 -139 -93 -117 17 134
2971 134 -228 307 -175 27 -239 -25 -41 125 -102 135 -97 -96 213 79 40 -71 104 -199 38 132 -58 -175
2993 -175 119 201 124 80 2 -110 217 -59 -64 220 -41 -116 96 102 106 130 15 -139 -11 -65 31 -73 -74 83 -148
3018 -148 236 141 -127 96 197 40 108 -67 111 405 0 119 11 212 -73 -145 -95 113 -157 201 135 93
$$ packed form
2853a28O7J55l67L08J1J73r1o2K87m13J69J08j02N8j99m9j18M49j50mK37n09J65
2876eK05m36K39R1J75k16L9mj02j71j23O03n38K94M6l0qj30J02k40K04Q3l54L82
2900A06m71L51j53j28L72m7R6k88M06k04K1o7l8L9J98j59r2o0j09L30j27m6M1
2923b9j73L21Jk48K89k40k9J38Lm3j23k6J79N1m05K79J97J19l03Ql31N55O1j52
2947I9o1J99ok53K5k2j06L63k58K88m29K0J85O1k35J06M2k24J07m0M6k4J34J17
2971A34l62N35m82K02k66K14j6J66k27K37k32JL09j34l9j11J75l03K37R4j90j17
2993a75K94Q2p7m4p8j12L27k76nK84k61p5K12OMK4j15j54J28n4R6j04jJ57k31
3018a48L84r5k68K23J01j57O8j75J78K94m05J19j08K01k85p2N0K08k70L58o6m2
$$ plain form
3040 93 -34 -82 159 -13 -99 144 173 135 21 236 98 10 0 -101 11 109 -33 168 59 14 96 261 -150
3063 -150 -80 175 60 14 -74 150 -29 11 179 168 218 178 -104 119 -87 -89 26 159 -205 473 -179 231 -131
3086 -131 -277 -222 118 -4 70 -204 119 -53 91 392 35 118 72 57 42 -105 126 73 -7 117 161 359 30
3109 30 143 110 -282 78 54 55 -80 -11 68 -167 -120 -124 76 22 -9 98 271 -151 -21 -151 118 194 239 184 -191
3134 -191 135 -117 127 -11 -113 14 -264 252 -12 204 -40 -2 7 -54 -72 13 16 75 -394 86 -293 280 -113
3157 -113 21 -82 -223 -198 120 183 43 -87 -79 -35 -146 -254 118 121 -265 -66 35 -79 -288 198 -90 160
3179 160 276 -151 158 212 130 -126 -132 -46 -2 -54 41 -120 176 1 -5 151 11 -281 -124 -290 -70 -56 42 106
3203 106 -173 152 370 107 15 52 -194 -176 -203 -165 -103 -99 150 -92 -259 129 200 87 -32 187 -106 -67 -141 -161
$$ packed form
3040I3j27m8K41j72q6K43K9l8j14K15j38q8j0j01J12R8j42K01j09m5Q2J65m11
3063a50P0K55j15m6q8K24j79M0J68j1N0m0k82K23k06kJ15J33l64O78o52M10l62
3086a31j46N5L40j22P4k74L23j72J44L01l57Q3m6j5j5j47K31n3q0J24M4J98l29
3109C0J13l3l92L60k4Jj35O9P9k35M7mK00n4l1J07J73m22J30j30K69P6M5n5l75
3134a91L26k52K44j38j02J27k78N16k64K16k44L8Ro1j8Q5LN9m69M80l79N73l93
3157a13J34j03j41K5L18O3j40j30QM4j11j08L72Ll86J99J01j14k09M86k88K50
3179A60J16m27L09N4q2k56oQ6M4n2R5j61K96j75oJ56j40k92J57j66K20J4R8O4
3203A06k79L25K18k63r2L7k46J8k7L8O2MK49k42j67L88P1j13j19K19k93L9p4k0
$$ plain form
3227 -161 -206 -239 -84 -162 250 131 -35 -205 57 -81 38 365 52 158 -160 99 -252 103 292 215 184 360
3249 360 75 -179 -83 348 286 -33 338 15 39 -128 -105 -165 -14 -24 -220 -69 206 125 148 -17 179 78 -99
3272 -99 130 -43 -4 -214 -166 -1 86 -134 145 -107 143 40 96 130 -360 -234 79 30 81 40 -238 36 -101
3295 -101 -188 -158 -111 -42 -202 -86 -162 309 123 23 64 5 -140 -131 142 -90 33 108 81 31 249 202 97 -134
3319 -134 -15 -33 -34 -171 85 -67 50 225 -228 -21 174 207 -16 -310 -51 172 48 -223 109 116 -108 -79
3341 -79 -101 80 -338 -132 0 47 290 42 -238 34 -23 107 60 -61 -70 -104 -30 44 -104 -91 294 -471 -297 16
3365 16 -85 -110 120 243 -61 -11 73 -19 336 204 -84 -409 -20 365 24 82 7 -353 -276 -41 -102 -266 1
3388 1 68 -135 248 84 -73 -337 47 93 138 -171 40 -344 -194 28 107 98 193 87 61 -94 44 282 -78
$$ packed form
3227a61m5l3J55p8M12j19j66j70K62j38J19L27l13J06l18K59l51L55J89p7l1J76
3249C60k85k54R6M31o2l19L71l23K4j67K3o0J51j0j96J51K75q1K3j65J96j01j77
3272i9K29j73L9k10M8J65Q7k20K79k52K50j03N6L4m90J26L13m9N1m1k78K74j37
3295a01q7L0M7O9j60J16p6M71j86j00M1n9j45RK73k32J23P5k7n0K18m7j05k31
3319a34J19j8jj37K56j52J17J75m53K07J95L3k23k94K59K23j24k71L32Pk24K9
3341g9k2J81m18K06J32M7K43k48k80K72n7J30m7j21rl4P4P4j48J3L85p65J74L13
3365A6j01k5K30J23l04N0Q4r2L55j32k88l25L89L85l41N8p5l60P7K35o1j64K67
3388AO7k03L83j64j57k64L84M6M5l09K11l84J50K22P9rR5j06k6j55J38K38l60
$$ plain form
3411 -78 226 -122 57 -23 89 -38 306 1 -171 -26 -23 -86 180 -72 -86 -154 112 -105 16 28 -344 86 221
3434 221 140 -22 -122 -53 -70 192 158 301 -144 -103 -14 183 -55 278 -152 -121 -66 -314 45 150 -273 -161 -59
3457 -59 -98 126 -168 -322 -91 -75 -76 153 94 44 -283 61 -28 267 -171 174 39 50 31 -78 199 135 -6 251
3481 251 -352 -287 -23 113 -108 -257 207 -71 -208 -50 -100 -101 -263 -137 -159 -409 175 -18 40 -211 181 -54
3503 -54 -246 -111 8 83 15 -124 -147 -153 113 -84 87 -120 -185 -202 14 479 32 -10 -63 31 -50 60 165 8
3527 8 -145 -121 99 4 -69 -91 200 184 148 1 -29 39 -88 104 181 -93 -113 37 -44 9 83 -52 63 -10 132
3552 132 -89 -96 147 142 193 -250 -114 66 53 179 -35 -55 50 -231 279 236 21 124 64 -128 -91 -102 328 -105
3576 -105 62 163 -63 70 -262 -7 -4 77 -29 107 2 -99 220 135 44 -134 278 115 132 -223 -221 -204 181
$$ packed form
3411g8L04l48J79q0J12j27L44l05j72J45Lo3K66k52j4o8K66k17J21J2l72M30J35
3434B21q1j62j00O9j7K62l4J43m45M1Q9J97k38L33m30L1N5k48L59J05m23J12J02
3457e9l9K24k94j54K31J6jK29n9n0l27L44q9K95m38L45j35J1j9j09K77o4j41K57
3481B51o03O5K64J36k21j49M64k78j37J58n0jj62J26k2k50N84j93N8k51L92k35
3503e4j92J35J19P5o8j39k3oK66j97J71k07o5j7K16M65m47m2n3R4q1J10J05j57
3527Hj53K4K20r5p3k2K91j6l6j47l0O8j27J92P7k74k0J50q1N3P4j35J15p3J42
3552A32k21pK43nN1m43J36J80j3J26k14k0J05k81N10m3k15J03o0j92L7j1M30m33
3576a05J67J01k26J33l32K55LQ1j06J36j05j01L19q5r1j78M12j63J7l55KJ7L85
$$ plain form
3599 181 -103 66 154 149 -104 116 79 -267 158 -117 65 0 -123 -21 42 42 -159 63 91 51 187 -203 -42
3622 -42 -4 233 -77 -426 114 -7 -156 17 55 -181 24 1 -75 -27 231 -75 -72 1 -46 -96 208 150 127 -63
3646 -63 -310 -21 -327 26 179 27 0 -28 139 -1 -91 -356 -118 78 -298 -203 -282 60 -227 313 21 -70
3668 -70 40 -119 -125 0 147 -114 221 -197 283 -45 263 -85 13 90 -200 -102 44 -410 105 71 186 199 -46
3691 -46 503 -265 51 -120 158 -127 31 70 119 -194 -75 -66 -117 -254 115 -20 472 -12 37 105 -144 44 -12
3714 -12 206 75 -293 55 -97 -109 132 -134 198 -385 -59 165 34 -30 124 236 -122 -146 -164 110 -155 -194
3736 -194 30 -227 17 -64 3 -5 42 31 78 -230 -67 123 7 -19 -127 93 21 162 468 262 -134 84 11
3759 11 -229 131 -155 14 21 73 12 -91 -205 306 117 -54 48 -89 15 192 -160 -243 -264 -141 -95 61 -254
$$ packed form
3599A81k84J69Q8nk53K20l7l46M25k75J82o5j23J02O3%k01K22K8m0J36l90J61
3622d2L8K37l10l49N40j21j49J73L8k36K05k3p6M8K58l06LP3m7n0L04n8k3j90
3646f3k47K89l06L53J53j52k7k8J67j40r0k65K38J96l76R5p9L42k87N40k92r1
3668g0J10j59oJ25J47k61L35m18M80l28L08l48R8P7k90R8J46m54N15l4J15J3k45
3691d6N49p68L16j71K78k85J58L9M9l13J19Rn1j37L69j35M92m84M9O8k49J88n6
3714a2K18j31l68L48j52j2K41k66L32n83L26K24j31o4J54J12l58k4j8K74k65l9
3736a94K24k57K44q1O7qM7j1M7l08J63J90j16k6j08K20p2J41L06k06l96K18p3
3759A1k40L60k86J69PN2o1j03j14N11j89j71J02j37J04J77l52q3k1J23M6J56l15
$$ plain form
3782 -254 -313 -125 -193 15 306 -339 80 -73 128 -15 134 107 5 287 -24 -299 60 -21 -94 434 -229 -115
3804 -115 -255 94 -18 62 -242 124 86 3 138 -1 149 42 -88 130 240 135 -216 -95 -44 219 166 -193
3826 -193 72 14 -212 66 166 -150 115 -263 -224 -36 31 132 -381 -44 101 -281 -182 -164 -9 86 -144 137
3848 137 220 208 23 288 111 -211 -110 219 -222 -49 42 -194 66 117 -358 19 -74 -154 169 -179 -207 -189 213
3871 213 -129 197 -11 -26 236 -107 235 228 35 27 49 215 -151 -314 34 -20 143 6 -45 81 13 -76 18 59
3895 59 -98 -294 -332 -94 192 63 186 183 -96 -282 168 309 -218 158 20 -34 -86 -50 193 238 151 -93 -207
3918 -207 -132 305 -175 276 -16 207 491 -113 -163 72 -118 -20 127 -175 -215 108 48 51 -71 153 150 44 120
3941 120 163 136 -244 -136 -414 -160 -82 -101 -187 -95 -174 -56 -7 98 217 -9 -112 181 -185 -130 -7 -44 -46 214
$$ packed form
3782b54n9J88o8K08K91o45M19j53K01j43J49k7j02K82l11k75L59q1p3N28o63J14
3804a15j40L49j12Q0l04L66l8q3J35j39J50j07j30K18J10j05l51J21N1K63n3l59
3826a93K65n8k26K78J00l16K65l78L9J88O7J01n13L37J45l82R9J8J55R5k30K81
3848A37Q3j2j85K65j77l22J01L29m41J73R1k36K60N1m75L77r3q0L23l48k8J8M02
3871B13l42L26k08j5K62l43L42pj93qK2J66l66j63L48n4J63j37n1J26o8q9R4M1
3895E9j57j96l8K38K86j29J23lk79j86M50J41n27L76j38n4n2L6K43M5q7k44j14
3918b07P5M37m80M51k92K23K84o04n0K35j90R8J47l02m0L23o0Lj22K24lj06P6
3941A20M3k7l80J08k78K54P8j9q6R2p9J18M9J05J19k26j03K93l66N5J23l7kK60
$$ plain form
3965 214 -4 -25 99 -126 -186 73 -47 160 9 -193 189 88 8 -80 -200 34 61 10 -110 -376 441 72
3987 72 -280 -14 -41 -62 -186 4 -229 212 155 -108 -76 -121 -89 122 -160 101 102 -56 -147 15 43 160 -332 134
4011 134 -39 278 3 288 121 178 -52 -114 -96 -28 179 234 76 273 14 52 215 157 385 134 165 -131 -259
4034 -259 167 86 -196 165 -377 221 -235 70 34 100 53 116 135 225 -46 -305 -33 179 11 99 41 125 7
4057 7 -166 349 225 -272 -179 50 20 -5 69 -10 -20 199 242 81 123 99 -120 -191 17 31 -613 64 -115 102
4081 102 15 40 -223 23 -83 -148 327 -226 125 -1 -144 5 -27 117 -96 69 59 -81 -16 204 -151 53
4103 53 -78 -209 -148 157 26 335 22 -75 -76 -21 -18 -13 102 -117 153 -110 -238 46 -94 -11 7 286 -274 -91
4127 -91 -114 -108 -122 -96 127 -145 117 -29 38 -47 181 -129 -26 -102 -355 -118 -29 97 21 109 -418 124 60 106 83
$$ packed form
3965B14k18k1J24k25o0K59j20K07j51k02L82j01q0q8j20K34K7n1j20k66Q17l69
3987G2l52K66k7k1j24J90k33M41n7k63L2m5L2K11k82K61Jj58r1J62K8J17m92M66
4011A34j73L17k75K85j67N7k30o2J8O8K07N5j58J97k59L8J63n8K28k51L1k96j28
4034b59M26q1k82L61n42N98m56L05l6O6m7O3J9R0k71k59K72K12j68Q8n8Q4j18
4057Gj73N15j24m97R3K29l0k5P4p9j0K19M3j61M2k4k19p1K08J4o44O77j79K17
4081A02q7K5k63K46j06o5M75n53L51j26j43J49l2J44k13J65j0j40O5K20l55K04
4103E3j31j31O1L05j31L09l13r7jN5LNJ15k19K70k63j28K84j40Q3J8K79n60J83
4127i1k3Oj4K6K23k72K62j46O7q5K28l10J03p6k53K37Q9J26p6Q8n27N42o4M6k3
$$ plain form
4152 83 -23 -172 -68 119 -304 -58 -148 138 267 -260 -59 35 -12 -112 314 -38 142 5 229 285 25 40
4174 40 -87 -268 117 150 -11 -120 16 -78 -292 277 -154 -171 14 -100 187 40 -404 67 69 -59 -4 -34 -94
4197 -94 -21 209 112 -31 105 288 -24 329 -45 498 -4 -73 194 551 94 -328 160 -9 -252 -288 -195 198
4219 198 -80 -96 186 106 232 -85 436 37 -89 83 188 -25 13 -71 237 69 8 113 -38 -111 405 -335
4241 -335 193 -7 -110 -10 215 62 138 71 376 -211 69 -11 311 -128 -65 246 -87 -336 -13 139 -107
4262 -107 123 -144 -53 53 -232 26 -128 73 -88 9 193 24 -251 98 67 -104 -120 -208 -72 -8 98 -25
4284 -25 383 356 104 -170 116 38 38 -89 179 -83 82 -88 -333 181 102 292 86 -127 -16 36 68 124 -269
4307 -269 -449 33 93 -130 -195 -101 205 -191 330 184 -164 -72 356 367 -153 -329 -93 170 -111 -196 223 73
$$ packed form
4152H3j06j49J04J87m23K46r0K86J29n27K01R4m7j00M26l52J80j37K24N6k60J5
4174D0j27j81L85L3j61j09J36r4k14N69m31j7J85j14K87j47m44M71Kj28N5l0o0
4197i4P3K30r7j43J36J83l12L53l74N43n02o9K67L57m57m22M88j69k43l6R3L93
4219A98k78j6K82q0J26l17N21l99j26J72J05k13L8q4L08j68o1J05j51p3N16p40
4241c35N28k00j03J00K25j53P6o7L05n87K80q0L22m39O3L11l33k49L23J52k46
4262a07K30k67R1J06k85K58j54K01j61R7J84j69k75L49l1j71j6q8J36O4J06j23
4284b5M08k7k52k74K86p8%j27K68k62J65j70k45N14p9J90k06k13J11N2L2N6l93
4307b69j80M82O0k23o5R4L06l96N21j46l48R2M28J1n20j76K36K63k81q5M19j50
$$ plain form
4329 73 -181 -344 -159 149 -101 145 -50 -15 -281 48 60 -25 -26 69 -101 -52 -61 -168 -17 120 0 134 120 -212
4353 -212 -76 -135 326 -3 110 10 -197 -15 -67 -32 77 326 230 216 -106 436 -181 14 77 67 21 -245 231
4376 231 -11 -213 -83 -6 -20 297 -116 -1 -28 -165 59 -224 -98 26 -94 -1 116 -63 -71 9 -135 138
4398 138 -235 24 98 111 -9 -9 72 167 -363 -49 -225 -34 -262 95 50 71 67 -7 73 32 -248 65 231 -58
4422 -58 -4 -56 107 65 27 -86 7 128 24 153 78 53 127 -218 -256 157 59 129 -317 -153 127 -295 -351 -123
4446 -123 -132 -66 163 -190 439 -203 -114 193 161 193 -49 -145 14 151 -69 210 80 142 53 -17 -263 -140 -392
4469 -392 37 183 2 60 44 219 -202 99 -185 -166 -49 89 -123 -234 -11 45 85 -130 -187 -117 48 263
4491 263 -72 90 -10 -279 -16 -150 -179 20 -3 7 133 -85 96 -230 250 167 -70 -140 108 -211 -76 158
$$ packed form
4329G3k54j63J85L08k50K46j95L5k66L29J2q5jR5j70M9rj07J51J37j20J34j4l32
4353b12J36n9M61l29J13j00k07J82n2L5J09K49r6j4l22N42o17J95O3j0m6k66M76
4376B31k42k02J30P7j4L17m13J15k7j37K24k83J26J24j20R3J17j79qQ0j44K73
4398A38l73K59P4J3j20%Q1R5n30L14j76J91k28L57m5K1mp4Q0m1k80L13J66k89
4422e8N4n2J63m2l8j13R3J21j04J29p5k5P4l45l8M13r8P0m46J64K80m22n6K28
4446a23rO6K29l53O29o42Q9L07l2L2k42r6J59J37k20K79j30O2q9p0k46J23k52
4469c92M29J46j81N8j6J75m21L01k84J9J17J38k12j11K23N6M0k15n7P0J65K15
4491B63l35J62j00k69K63j34k9J99k3J0J26k18J81l26M80q3k37p0K48l19J35K34
$$ plain form
4513 158 143 25 -346 340 93 267 -90 144 78 92 254 -168 -121 119 -52 71 90 232 -159 158 -26 300
4535 300 110 343 -31 136 23 -342 -33 -142 -7 -83 32 144 141 94 212 -113 275 213 -159 174 127 253
4557 253 72 121 198 -149 157 -45 -44 -77 -148 -66 3 -71 205 71 -4 -170 -237 59 -166 52 -23 -67 -401 -23
4581 -23 -268 -81 -385 -84 -403 -91 202 161 108 126 -218 -41 33 -157 -123 63 231 -114 168 38 94 243
4603 243 157 -20 397 -34 -158 -154 -109 144 -9 -153 139 38 198 152 219 103 96 -117 98 115 -374 371 -51
4626 -51 -61 75 137 -86 36 141 133 -51 127 42 122 58 161 78 12 31 79 -129 75 5 202 1 49 -162 -164
4651 -164 -35 -72 154 115 -90 151 260 29 -105 -50 -256 14 -19 -140 150 -152 97 -363 -21 155 398
4672 398 -90 231 138 191 -70 118 -104 209 146 157 351 57 36 431 -41 -12 53 432 193 120 49 37 28 192
$$ packed form
4513A58j5j18l71O86k47J74l57K34o6J4J62m22M7K40j71J23J9J42l91L17j84L26
4535C00j90K33l74J67j13l65L09j09J35p6J15J12lm7J18l25L88o2l72L33m7J26
4557B53j81M9P7l47L06k02Jl3p1Q2O9p4K76j34p5j66o7K96k25K18p5m4l34L78
4581b3k45J87l04L01l19L12K93m1n3J8l44J77P4j90L4J86J68l45K82j30N6J49
4603B43q6j77M17m31j24MM5K53j53j44K92j01J60m6O7j16pk13K15J7m89P45m22
4626e1j0J36O2k23J22J05qj84J78q5Q0o4J03q3o6J9M8k08K04p0J97k01M8k11k
4651a64J29l7K26l9k05K41J09k31j34N5k06K70l3j21K90l02K49m60L42J76K43
4672C98m88L21r3N3k61J88k22L13o3J1J94k94k1L95m72K9O5L79k39p3p1j2rJ64
$$ plain form
4696 192 -49 171 159 -206 17 -127 163 -144 -166 69 -1 -90 83 -61 207 -360 62 -213 -40 -74 106 -168
4718 -168 -42 -61 37 -152 255 -99 85 -73 -158 41 64 108 -242 43 20 261 -74 102 -123 128 115 129 101
4741 101 71 55 223 -71 43 204 -251 213 115 -148 -231 360 -37 -26 -149 138 107 -65 235 80 10 23 -16
4764 -16 49 241 91 -76 -112 216 -42 -133 -66 -145 280 -110 62 284 111 -58 276 98 -31 -196 9 248
4786 248 111 -48 -225 -79 173 168 18 316 144 -28 -164 -31 -129 16 -87 131 -96 14 42 -17 -90 -74
4808 -74 243 -199 -125 122 -153 -71 -159 -270 -50 125 -47 153 -226 201 121 346 -128 424 202 123 -89 -228
4830 -228 244 67 -89 18 219 10 -16 -93 -150 -123 30 98 -23 -129 63 95 175 -34 -158 50 153 103 -65
4853 -65 71 167 159 75 -192 57 -230 -42 178 415 9 46 -141 7 25 172 239 -47 -249 -32 120 -83 -13
$$ packed form
4696A92k41K20j2l65K23j44K90l07k2K35p0q9J73j44K68n67M22k75J73l4J80k74
4718a68J26j9R8j89M07l54J84j58q5J99K3M4l50K85k3K41l35J76k25K51j3J4k8
4741A01l0j6J68k94J14J61m55M64r8k63q3N91l97J1j23K87l1j72L00j55p0J3l9
4764a6O5J92j50j67l6L28k58r1O7p9M25l90J72K22j73j69L34j78j29j65K05K39
4786B48j37j59j77J46K52nj50K98j72j72j36J33r8J45j03K18k27J10K8n9p3J6
4808g4L17m42P4K47k75Q2q8j11K20J75j72K00l79M27q0K25m74N52k22p9k12j39
4830b28M72j77j56J07K01k09k6p7n7K7J53O8j21j06J92L2Q0k09j24K08J03n0j68
4853f5J36R6qq4k67K49k87J88K20K37m06L7j87J48J8J47O7k86k02K17J52k03P0
$$ plain form
4876 -13 -122 -9 -162 -61 24 115 90 226 30 -16 55 -3 30 30 52 222 42 30 313 -295 163 216 -195 192
4900 192 -156 -24 -18 -48 59 164 -6 -249 -220 34 159 205 93 -140 -1 -324 -127 -55 269 -198 -42 -128
4922 -128 171 -126 -340 322 -62 183 165 14 -2 -1 -133 9 -298 9 286 -12 134 126 108 -25 -282 65
4944 65 -59 -158 27 215 69 -179 83 9 -338 285 -7 -162 -30 -122 -163 81 63 -135 243 -68 -7 -173
4966 -173 -10 24 206 166 141 93 -136 -123 -65 -145 -127 62 190 52 -57 -61 160 -213 171 -169 -161 520 -190 -31
4990 -31 92 53 59 -325 -169 183 -4 110 -191 -185 -137 128 -99 -152 -204 -346 318 -219 -57 201 154 -155 -411
5013 -411 -433 20 -52 -73 -70 -82 10 -172 21 -9 164 232 83 30 -74 -68 38 179 -346 88 282 109 -59 22
5037 22 -72 35 -69 -11 -91 -202 195 -154 -4 253 -119 7 -22 366 -15 97 -98 -52 -78 47 216 -160
$$ packed form
4876a3j09J13j53J01Q5R1k5J36j96m6P1n8L3%K2J70j80j2K83o08M58N3m11L87
4900A92l48J32Ol0J07J05j70k43K9K54J25M6j12k33J39l23J97P2L24m67J56q6
4922a28K99k97k14O62l84K45j8j51j6Jj32J42l07L07K77k98J46qj8j33k57L47
4944F5j24r9J85J88j46k48K62p4l47O23k92j55J32r2m1K44j8j98L78l11O1j66
4966a73J63L4J82m0k5m8k29J3N8q0J8J89J28j38j09mK21l73L84l40QO81p10J59
4990c1J23l9Ol84J56L52j87J14l01OM8K65k27n3n2j42O64n37J62K58m7l09k56
5013d11k2M53p2k1Lj2R2j82J93l0J73O8j49n3j04OJ06J41n25M34J94j73j68Q1
5037B2r4J07j04N8q0j11L97l49J50K57l72J26k9L88l81J12j95M6k6J25J69l76
$$ plain form
5059 -160 80 17 -108 -38 207 41 -216 -172 -20 339 334 -173 -135 39 127 148 71 -116 -175 45 -294 -81 -46 -125
5083 -125 300 -54 36 200 53 20 -6 391 -128 -104 53 211 -261 170 89 505 141 -91 166 -2 247 190
5105 190 -79 -120 103 196 -77 -80 48 37 -273 187 70 -105 -102 26 140 48 65 -123 -94 -120 136 -147 -51 -158
5129 -158 -135 -489 -77 -83 -49 -472 21 -107 172 242 -139 -321 260 171 91 20 221 62 172 190 43 -393 48
5152 48 -62 -42 7 51 61 -63 130 -5 7 139 -358 -71 -272 30 96 238 -209 -43 -281 159 -459 98
5174 98 -88 -56 49 80 92 -74 129 64 74 -22 -198 64 -133 -199 -27 -10 -50 -353 -66 -410 156 5 132
5197 132 194 -70 -255 167 45 -70 -173 -109 261 -178 -75 130 -250 -62 76 93 71 12 20 -80 194 -155
5219 -155 -118 242 21 -58 -154 238 0 275 33 4 -136 -267 -212 121 -96 -165 119 -28 -217 34 -186 370
$$ packed form
5059a60K40o3j25P0K45j66k57M4J52L59nn07L8J74Q8K1p7j87n9K20l39K13L5p9
5083a25M25l54R0J64j47l3k6L97n19K4J57J58m72M31q1M16l64k32K57j68K49n7
5105A90k69m1K23R3k73lJ28j1l10M60j17j75LJ28J14r2J7j88K9k6K56k83R6j07
5129a58K3l54M12oL4m23M93j28K79P0l81j82N81q9q0p1K01j59J10J8j47m36M41
5152D8j10K0M9M4J0j24J93j35J2J32m97K87k01L02O6J42m47J66k38M40o18N57
5174I8j86L2J05L1J2j66K03o5J0r6j76K62j97o6J72J7m0l03K87l44N66j51J27
5197A32O2k64j85M22j22j15j03O4L70m39J03K05l80J88J38J7k2n9Qj00K74l49
5219a55L7L60k21p9r6L92k38K75k42k9j40j31N5L33k17o9K84j47j89K51k20N56
$$ plain form
5241 370 302 -138 56 -82 199 -127 77 -9 9 -84 -105 105 366 92 -8 71 -75 -304 99 -6 174 -152
5263 -152 49 -149 80 122 -26 275 133 65 93 -133 -74 20 39 160 -61 -84 -66 113 -99 50 -167 -4 -174
5286 -174 11 -70 192 -14 47 49 40 370 234 101 -5 166 60 183 6 -82 81 53 -2 0 -159 -88 -62 160
5310 160 94 185 60 -87 231 116 185 174 -1 -188 -35 -11 303 243 -101 120 -190 40 -163 -280 -16 279
5332 279 367 -230 16 -31 245 48 255 45 -254 81 -141 104 -42 -306 -125 67 35 166 -320 278 120
5353 120 44 25 39 145 -157 260 -191 -119 213 71 235 171 158 -251 -19 184 258 -84 22 424 -62 97
5375 97 -63 -276 -186 -34 97 20 245 238 -343 38 208 97 -33 -150 -27 -114 232 50 248 33 61 20 26
5398 26 -147 55 139 145 -46 -196 362 28 -128 92 159 9 -244 206 -262 65 -245 204 -81 -11 154 46
$$ packed form
5241C70o8m40J94j38K81l26K04q6J8r3k1K10K61k74j00P9j46k29M03j05J80l26
5263a52K01j98K29M2j48L01j42o8K8k26N9R4J9J21k21k3J8J79k12J49k17J63j70
5286a74J85q1K62k06O1KrL30j36j33j06J71j06J23j77q8J63k8n5Kj59P1K6K22
5310A60o6R1j25j47L18j15O9j1j75j87J53K4L14o0l44K21l10K30k03j17K64K95
5332B79Q8n97K46m7K76j97K07k10k99L35k22K45j46k64J81J92l2J31m86N98j58
5353A20p6j9J4J06l02M17m51P2L32j42J64o4j3m09K32K03P4l42J06M02m86J59
5375I7j60k13R0J52J31p7K25pn81L81J70j11j30j17J23q7L46j82J98k15K8m1O
5398B6j73K02Q4Oj91j50N58l34j56K20O7j50k53M50m68L27l10M49k85P0J65j08
$$ plain form
5420 46 194 -188 144 -26 -360 -63 -18 -95 43 91 -365 -52 53 120 352 10 -120 -14 -59 -139 168 46
5442 46 -52 -35 10 36 -150 124 -30 64 -1 -256 17 -192 90 -165 -161 -93 -63 -227 207 189 -330 115 -180 254
5466 254 208 -7 407 65 -49 203 -45 99 57 -84 -143 -233 228 7 96 -265 21 214 -76 -130 2 93
5488 93 56 -80 -97 79 36 -175 -84 105 -124 -244 -275 -125 -45 -124 -6 -21 -96 199 -1 29 110 10 -263 -433
5512 -433 -99 -63 447 99 6 34 -25 -73 -1 -271 164 105 -159 68 308 168 37 -400 -115 262 101 -9
5534 -9 -62 209 -24 -221 -152 45 74 -73 108 -117 -332 -222 1 -167 -152 79 262 -142 -113 -82 107 -401 -142
5557 -142 -56 -6 285 -48 -31 -95 140 16 51 96 -70 34 319 -126 25 28 120 202 55 152 -274 18 49 45 -156
5582 -156 -297 85 -6 -109 40 -122 -197 289 119 -25 -222 15 79 -162 208 -66 303 55 -26 210 -217
$$ packed form
5420D6J48l82L32j70l34K97M5p7J38M8m56L13J05O7K32l42j30J06m5q0L07j22
5442D6r8J7M5K6j86K74j54R4o5k55K73k09K82k55MO8L0j64M34j8n19M45k95M34
5466B54m6k15M14l42j14K52k48J44m2j41n9r0M61k21Q9l61K86J93k90n4J32R1
5488I3l7j36j7J76m3k11R1J89k29j20l1J50Q0p9J18j5p5K95k00L0Q1j00k73j70
5512d33L34L6N10l48r3K8n9m8P2k70M35n9k64K27K40j40j31m37K85L77j61j10
5534in3K71k33j97O9J97K9j47J81k25k15J10K23j68J5K31J83m04K9L1J89n08K59
5557a42Q6N0K91l33J7o4K35j24L5M5j66J04K85m45J51LR2Q2j47R7m26K92L1mk01
5582a56j41L82r1j03J49j62p5M86j70j44j97K37O4k41L70k74L69k48q1K36m27
$$ plain form
5603 -217 -366 39 138 10 210 112 -9 284 -97 242 130 120 -210 87 197 -183 236 -35 280 150 3
5624 3 25 -40 75 -8 -224 45 115 110 -98 -37 140 8 -40 49 29 63 -436 -325 -5 126 226 76 105 -286 176
5649 176 108 160 -126 -101 -14 256 -80 -65 -12 -68 111 -215 119 -57 -97 -174 83 60 263 44 -259 78 40 -119
5673 -119 227 54 207 -252 -75 -133 -54 283 39 -202 102 -92 -182 35 50 -237 -247 402 103 -314 -321 216
5695 216 -42 -11 152 -81 34 -90 -102 -289 -113 -197 -50 63 -182 170 56 25 40 135 -264 205 25 -122
5717 -122 -116 -237 -27 87 226 162 -29 -216 79 -32 -191 -76 268 179 -278 -198 -264 59 -251 -291 -28 -24 45
5740 45 -34 27 153 -97 -290 -80 -70 -92 137 114 -275 322 -215 136 55 150 106 -124 -165 534 189 -11 -114
5763 -114 -188 -31 105 292 -89 126 -142 249 -34 106 47 54 -107 13 102 -36 362 -87 -113 -11 -22 -14 -14 -303
$$ packed form
5603b17j49M05R9j28K00r8j21K93l81L39j12j0l30K97J10l80M19k71L15j30j47
5624CK2o5J15q3k16K69P0nk08O1J77j32m8Q9k0L4m99J11L20J31J00j50K9l91M62
5649A76o8N2k86K5Q7K70l36J5N3n6J79l26L34j76m0p7K57k3K03k19l03L37l8j59
5673a19L46j73J53m59J77n8P9L37k44k41L04j94r0K17J5k87j0O49k99m17pN37
5695B16k58L1J63k33J15j24j2j87J76q4J47J13k45L52j14l1J5R5l99M69j80j47
5717a22Oj21K10J14J39o4j91j87K95j11j59J15L44q9m57Q0o6L23l10m0K63MO9
5740D5p9O1J26k50j93K10J0k2K29k3l89N97n37L51q1R5m4k30m1O99l45k00j03
5763a14p4J57J36J87l81K15k68L91k83J40n9Pj61J20Q9j38L98m49k6J02j1Q%k89
$$ plain form
5787 -303 -249 -192 160 8 -2 -102 -158 37 161 -122 43 -164 96 15 50 -130 291 112 50 236 94 210
5809 210 -345 -56 -89 182 104 119 165 -130 213 63 37 -157 97 -145 -295 10 -131 90 26 -182 218 -142
5831 -142 65 118 1 -4 -167 205 -16 -84 155 -118 -118 -116 -192 -203 -222 61 222 66 221 32 -244 64 179 42
5855 42 79 -314 61 31 -113 -33 297 -232 113 -9 -95 -220 61 227 69 112 -83 -273 92 -33 -10 -282
5877 -282 93 -37 170 74 123 54 -131 14 77 161 -82 -141 -192 158 222 -15 -12 -175 10 -234 -173 27 301 5
5901 5 -135 -149 -132 200 18 -212 160 -158 8 146 24 45 -168 -2 -29 109 175 33 -63 111 -61 109 41
5924 41 -285 19 -51 340 -199 270 -111 -61 -50 -296 148 113 -16 74 -26 116 -118 -141 20 164 -260 318
5946 318 -80 -25 -10 -238 124 -258 158 -63 -308 74 -155 -125 -163 -243 5 -188 165 107 96 103 -49 -401 227
$$ packed form
5787c03N4N7L52j52j0j00n6J95J24k83J65k07K60q1L5j80M21j79o2J86j42J16
5809B10n55K89l3K71p8J5M6k95L43j50k6j94K54k42j50L05j41K21o4k08M00l60
5831a42K07N3j17nj63L72k21o8K39k73%Kp6j1j9K83J61j56J55j89k76L08J15j37
5855D2L7l93L75l0j44Q0L30n29L45j22q6j25K81J66j58M3j95j90L65j25K3k72
5877b82L75j30K07r6M9o9j85J45O3Q4k43n9n1L50O4k37Lj63J85k44O1K00K74k96
5901Ej40j4J7L32j82k30L72l18J66J38j22K1k13J66k7J38O6j42r6J74j72J70o8
5924D1l26L04p0L91n39M69l81N0J1k46M44l5j29R0j00J42k34k3J61J44m24N78
5946C18l98N5J5k28L62l82M16k21k45L82k29L0l8q0K48j93L53n8j1Pj52l52O28
$$ plain form
5969 227 -32 0 99 159 194 -90 5 34 -145 -110 -5 -69 -39 -255 87 29 135 40 -165 -159 -209 160 62 273 122
5994 122 9 354 -161 271 -197 192 -105 56 -25 139 -35 -55 197 253 -71 -156 -69 85 -31 -3 -111 -16
6016 -16 -251 -26 -127 -119 -64 -313 176 -139 33 -93 81 -150 59 25 213 198 -114 291 -9 -102 123 -215
6038 -215 67 49 -135 -101 -382 -402 48 173 -71 -21 -186 -50 -9 -4 -70 208 -72 -60 193 -212 -202 -37 15 -278
6062 -278 -190 -66 47 -13 -138 79 -65 134 -109 53 136 78 -267 -168 89 164 155 76 -91 -225 -53 87 -134
6085 -134 103 151 68 2 -124 -198 -17 57 -170 38 -256 32 204 210 21 162 -152 142 103 -20 228 -24 96
6108 96 -149 131 -88 -200 -216 -6 -80 138 17 -9 215 -56 -341 129 -16 232 253 53 -164 332 -100 -82
6130 -82 -109 -39 203 76 -123 -145 -42 -160 27 -123 137 79 67 99 171 199 14 -217 396 230 97 174 -8
$$ packed form
5969B27k59L2R9O0L5k84R5K9j79L5J05o4L0k16L42n8J06r5k05On0L69r8K11j51
5994A22j13L45n15M32m68L89k97J61q1J64j74k0K52N6l24q5Q7J54j16K8j08R5
6016a6k35K25j01QN5k49M89l15J72j26J74k31K09l4J88j5l12M05l00r3K25l38
6038b15K82j8j84L4k81k0M50J25k44N0j65J36M1No6K78k80J2K53m05J0J65N2k93
6062b78Q8J24J13o0j25K17j44J99k43J62Q3n8l45R9K57P5rp9j67j34J72J40k21
6085a34K37M8q3o6j26p4J81P4k27K08k94K88J72Oj89J41l14K94l9j23K48k52J20
6108I6k45K80k19j12j6K10p4K18j21k6K24k71k85M70j45K48K1k00k17M96m32J8
6130h2k7P0K42j27j99k2J03j18J87j50K60n8j2L2P2K8j85k31O13j66j33P7j82
$$ plain form
6153 -8 -52 -84 -497 -13 -91 219 -90 -198 -146 219 267 -279 44 318 26 -148 78 -225 -169 -16 -195 -209 50
6176 50 53 -213 -156 273 220 96 26 -55 46 174 237 -105 -226 41 -30 153 -33 46 38 -194 -131 4 -92 54 -205
6201 -205 147 -220 21 -55 91 240 3 -81 201 235 -167 33 -251 -46 364 92 -18 -53 17 232 193 121
6223 121 26 150 -40 -35 -209 -117 18 -270 -172 -126 105 -162 -168 -33 -266 -41 -41 -65 74 85 58 -143 83 -116
6247 -116 -104 100 -156 -203 66 125 307 -140 105 68 112 -35 -268 101 -96 -9 -81 -21 -48 177 -91 406 -100
6270 -100 -129 -26 -84 -101 -50 -57 235 -45 156 104 -72 -190 -112 -109 33 -95 170 -40 36 8 84 -175 -17 -63 -121
6295 -121 66 101 4 -228 -121 -35 52 99 184 151 -74 60 -107 -149 -195 -148 21 -97 -71 -197 110 -31 56 -181
6319 -181 -256 -90 170 125 -38 -148 44 87 345 -158 -79 -50 15 15 -45 -286 6 -195 162 -113 -23 96 -82
$$ packed form
6153hm4l2m13M84p8L10l09j08N2L65M8n46L23K74k92j74K26l03N6J53j79j4K59
6176E0Lk66N7M29n3j24p0q1J01J28O3l42j21K67p1J83j86P9qk32O3J35r6J46k59
6201b05L52l67K41p6J46J49k37q4K82L4m02K00k84K05M10k72j10l5P0K15l9p2
6223A21r5J24j90Nj74R2J35k88R8M6K31k67oJ35k33K25%k4J39J1k7k01K26j99
6247a16J2K04k56m7K69N9J82m47K45l7M4j47k33L69j97Q7p2O0k7K25k68M97n06
6270a00k9J03n8j7N1pK92k80K01n2j76j18P8LJ42j28K65k10P6k8P6k59J58m6n8
6295a21J87L5r7k32J07Q6Q7M7Q5l3k25J34j67m2m6M7J69j18K6j26L07j41Q7k37
6319a81p5J66K60m5j63j10J92M3K58n03P9K9O5%o0k41K92k01L57k75R0J19j78
$$ plain form
6342 -82 -266 -129 -131 -190 181 -128 -6 -84 159 -113 31 169 76 -99 32 -26 -40 28 -110 56 237 148 67 -4
6366 -4 -87 -5 -354 4 -17 -353 -103 111 -180 136 -13 -87 -72 -12 -135 -220 -276 11 278 77 22 -140 -81 294
6390 294 -157 -14 56 -122 2 65 113 73 104 175 -84 105 -185 44 -29 -120 -182 -148 -112 -12 -111 72 19 -67 -176
6415 -176 -65 87 -128 388 -350 -12 66 -15 128 -74 25 133 202 318 24 119 24 62 -178 31 206 -153
6437 -153 215 169 -135 45 173 -2 267 46 19 -15 41 44 -58 -270 -291 77 3 56 -10 -81 155 153 9 41 -7
6462 -7 -38 -249 -274 118 -81 221 131 -268 -37 -323 -7 159 119 157 -220 141 -12 243 -11 17 138 81 267
6485 267 400 -222 40 -10 -228 150 -239 -69 -174 -40 -42 128 178 -187 -223 -115 212 -258 -191 354 93 25
6507 25 -154 103 -324 -199 -13 398 266 -184 -170 -64 145 194 131 8 -67 146 102 104 221 -37 -127 -68 84
$$ packed form
6342h2j84J37kn9L71l09J22p8K43k72J44J38r3j75J31n8j4O8j38J66J81q9q1p1
6366dq3Q2l49L58k1l36K50K14k91L16j49p4J5O0j23q5n6K87K67k01n5j62N9L75
6390B94m51J43P0j78J24O3M8m0L1P1k59J89k90K29p3r1o2L4L6J00r9J83n3q6j09
6415a76J11J52k15N16p38L38P8q1J43k02R9J08O9J16k94R5r5L8k40K09J75l59
6437a53L68m6l04J80J28j75K69k21k7l4N6Lj02k12k1L68p4N3o6p1K36kj44L2m8
6462gl1k11k5L92j99L02r0l99K31k86L16J66m0L8l77L61j53K55k54K8J21n7J86
6485B67J33o22K62n0k18L78l89J70j05J34kJ70N0l65l6J08L27m70O7N45k61o8
6507B5j79K57m27J25J86M11j32m50J4J06K09M9o3j23p5K13m4KJ17k58r0N9J52
$$ plain form
6530 84 -138 55 177 -126 -150 -286 -293 -21 -69 223 95 -62 -80 173 175 -254 376 -133 -215 79 -15 -41 70 -32
6554 -32 -116 -89 44 -79 -267 -317 236 214 -242 142 -211 -229 -281 43 -8 180 13 111 -29 -74 17 -133 16 -270
6578 -270 -238 -135 -39 38 43 -39 151 -26 -68 150 146 38 163 -25 37 98 315 -157 -70 -21 -169 230 -94 -150 109
6603 109 58 192 260 139 14 -23 -121 73 -156 -14 88 62 152 63 19 -20 38 89 -299 24 18 -25 -75 -44 -96 -260
6629 -260 66 -89 157 62 -283 -100 -112 101 -165 52 213 -22 -155 -327 19 8 156 109 -16 -214 -212 -40
6651 -40 -14 -232 135 59 63 86 259 266 -27 -104 -139 162 -255 217 57 263 -54 -156 -58 281 172 132 -6 -27
6675 -27 -187 -64 98 99 -101 -183 59 -18 -102 -43 -155 10 -220 8 -63 56 -59 31 12 -294 97 -13 48 178
6699 178 120 154 117 259 -273 193 55 -84 263 8 146 -104 -18 26 -66 -78 -32 -191 -76 -207 -170 -175 149 75
$$ packed form
6530H4k22J93J22l03k4j36pK72m8K92j28j57j8K53Km29O30n09q2K94r4k6J11j02
6554c2q4K7J33j23j88n0N53k2m56L84l53j8n2L24n1J88j67R8j40m5R1j50J49k86
6578b70L2J03R6P7Nq2J90j77m2K18mj08J25j88O2O1K17m72Q7M9j48L99l24n6K59
6603A09n1J34O8j21j25l7r8J94k29J42J02k6R0q9m4l9N8N1l88L23om3n0L1n2j64
6629b60L26j55K46r5l45J83j2K13k66K17J61k35j33j72L46j1J48m7j25j98KJ72
6651d0K6k18L67p6MK3J73Pk93p7l5L01m17M72j60K06l17j02R8L39j09m0j38k1
6675b7j60J23J62Jk00q2K42p7q4N9j12J65k30K28p1J19j15R0j9l06L91j10O1J30
6699A78n8L4l7J42n32M66j38j39L47k55J38k50Q6M4r2j2M6j59J15j31L7nL24p4
$$ plain form
6723 75 99 70 84 60 -2 252 18 -257 -118 36 -284 67 -156 -15 261 -67 36 70 156 140 -93 -35 -309
6746 -309 -84 36 -333 70 185 -64 -374 -185 -45 -54 -100 96 323 20 -90 -97 46 125 -34 -286 288 50
6768 50 -172 -5 38 72 186 28 266 -80 -309 170 -22 -229 74 90 -42 -31 6 -128 50 186 -99 -260
6790 -260 91 -247 -146 -57 32 22 68 99 72 -269 248 -142 -148 -95 -170 21 -192 -110 -347 -23 85 11 49 74 59
6815 59 4 -115 -204 -130 -130 -81 125 -189 -176 164 -206 137 133 114 401 148 -3 -31 -172 36 -39 -360 76 204
6839 204 312 -7 -84 -207 -138 -41 41 -426 -80 -97 326 -31 162 -82 -181 -189 -97 107 -2 85 124 101 -287 -153
6863 -153 -31 3 -107 152 -105 93 110 37 -163 -27 264 -144 -25 299 96 129 -301 53 -64 -288 282
6884 282 -32 -21 169 33 -137 156 41 -273 -97 -27 186 -46 367 -166 118 155 152 -166 -188 -260 -272 -123 58
$$ packed form
6723G5K4k9J4k4o2K54k34k75J39J54l20L51k23J41K76l28J03L4Q6j6k33N8k74
6746c09K25J20l69M03J15k49l10J89J40rm6J96K27l03j10pJ43P9j59k52N74k38
6768E0k22J67M3L4J14j58K38l46k29M79j92k07L03J6j32J1L7j34J78J36k85j61
6790b60L51l38J01Q9Q9j0M6L1k7l41N17l90oN3p5J91k13Q2k37L24J08p4L8K5j5
6815E9n5j19q9P4%M9K06l14J3L40l70L43mj9K87k53j51k8j41K08p5l21M36J28
6839B04J08l19p7j23O9R7Q2m67L46j7M23l57J93k44r9qR2K04j09Q7L9k3l88J34
6863a53J22L4j10K59k57J98J7p3k00J36K91m08J19L24k03L3m30L54j17k24N70
6884B82l14J1J90j36j70K93j15l14J76P0K13k32M13n33K84L7ll18k2p2j2J49J81
$$ plain form
6907 58 144 86 -98 42 -58 62 104 -167 -148 40 184 156 -113 -86 299 -23 339 -306 -53 54 -299 166
6929 166 -208 142 5 -197 93 44 -196 273 -164 118 281 -160 -116 56 16 -142 110 139 -193 -31 -75 131
6951 131 -99 320 -258 -5 141 -137 -312 -47 188 -37 -99 44 -13 -134 137 110 45 -8 -8 -63 348 -27 -66
6974 -66 61 -209 -31 -74 66 -189 61 17 23 270 7 355 -57 -343 156 -18 -86 153 -8 -92 -79 -128 140
6997 140 -79 -60 -15 -49 -8 259 -29 240 155 36 63 -34 56 -26 99 -135 8 -172 -285 118 -48 102 -58
7020 -58 -100 35 -380 70 26 126 -185 -32 196 35 199 175 63 53 -50 138 177 92 -115 56 223 242 2
7043 2 -193 8 91 79 -101 141 -183 -216 -127 -106 341 177 -81 206 351 -196 274 122 258 -89 -5 -128 157
7066 157 113 -166 111 -15 6 -64 26 101 -179 -97 -162 289 -125 -227 91 -222 89 -70 95 -194 -119 -34 -67
$$ packed form
6907E8Q6n8j84J40j00J20M2k71J9J88J44k8k69K7L85l22L62o45K53J07l53M65
6929A66l74L50j37k02K90m9k40M69m37K82J63m41M4J72m0j58K52K9l32J62m4K06
6951A31k30M19n78K53J46k78j75K65K35k25o2J43n7j21K71k7o5n3%n5M11l75l9
6974f6J27k70J78m3J40k55K50m4OK47k63L48m12k86M99j74o8K39j61q4J3m9K68
6997A40k19J9M5l4M1K67k88K69q5j19K7r7R0q2J25k34J43j80j13M03j66J50j60
7020e8m2J35m15M50m4J00l11J53K28j61J64k4j12j0j03J88L9q5k07J71J67J9k40
7043Bj95K01Q3j2j80K42l24l3Q9K1M47j64k58K87J45n47M70j52J36l47Q4j23K85
7066A57m4k79K77j26K1p0R0P5k80Q2o5M51m14j02L18l13L11j59J65k89P5Q5l3
$$ plain form
7089 -67 177 56 -120 -72 -21 250 -152 -65 -241 -184 -58 -82 111 111 72 293 -106 183 141 -47 -54 -21 -104 -72 -61
7114 -61 173 -193 -224 1 16 12 -72 -2 74 27 -76 -388 305 -109 -57 45 -85 -150 -136 -104 -23 201 236 9 -202
7139 -202 49 22 247 227 54 -153 -188 -136 -230 -70 -172 -85 -129 -219 46 243 10 -107 -40 234 -210 76 -11
7162 -11 -1 159 -62 -40 39 141 -31 238 320 16 503 -21 15 -59 -103 -191 59 87 -115 -172 102 -32 -5 -115
7186 -115 -27 222 -272 100 -10 -86 -147 0 106 111 61 -296 -11 180 -287 -41 23 126 -207 295 2 29 -236
7209 -236 -25 28 62 268 84 97 -48 192 -17 257 -8 -77 134 -202 39 -30 68 381 289 -105 -216 -146 252
7232 252 228 148 3 -7 -42 -111 300 0 -94 -289 -46 -262 -243 -2 -24 11 -45 20 -209 -175 134 63 149 32 54
7257 54 153 -175 -211 234 98 -64 117 92 8 23 -219 -493 101 -178 106 108 -58 -12 106 174 193 291 15 -179
$$ packed form
7089f7K44j21j76M8N1K71m02Q7j76N7J26k4J93%l9K21l99K89m2j88pL3q3L2J1
7114f1K34l66l1K25J5mq4P0P6m7j03l12O93m14N2J02j30o5J4L2Q1K24L5k27k11
7139b02K51k7K25k0j73k07l5N2r4J60j02Q7m4r0K65J97k33j17O7K74m44K86q7
7162a1J0J60k21K2P9J02j72K69Q2l04M87n24L6p4m4q8K50K8k02n7K74j34K7j10
7186a15Q8K49m94L72j10p6o1J47J06Nn0l57K85J91m67K46O4J03l33N02k93K7k65
7209b36K11N3L4K06j84J3j45K40k09K74k65o9K11l36K41o9R8L13r2l94j11P0L98
7232B52k4q0j45j0l5o9M11l00r4j95K43k16J9K41k2L5n6O5k29L4L09p1Q6j17K2
7257E4R9l28l6M45j36j62J81k5q4J5k42k74N94k79K84Kj66M6J18O8J9R8k76j94
$$ plain form
7281 -179 -268 10 120 -210 25 -162 26 -130 142 194 -3 -105 -160 53 -106 2 -8 37 187 58 -87 -93
7303 -93 -22 -78 -118 -273 -241 -140 76 107 -61 -34 114 189 -86 -18 159 63 -433 -285 -110 52 -75 21 -108 -107
7327 -107 132 122 191 372 338 100 27 -58 -81 273 51 6 75 -115 239 364 41 32 10 -326 -76 -185 80 -100
7351 -100 186 -7 -254 130 27 -121 -282 2 -4 -211 70 -350 -21 313 -106 43 217 393 -37 -121 64
7372 64 130 83 -72 89 24 77 -84 -57 93 7 -3 1 -135 -284 83 -182 102 -123 18 -10 -99 -72 -342 42
7396 42 100 18 -255 -197 49 -25 202 46 -358 -37 -136 -243 193 -41 -142 -209 187 -137 -606 191 -223 -33
7418 -33 70 -178 -104 118 27 104 198 38 163 120 -60 169 30 313 371 -131 175 -165 99 -156 120 317
7440 317 202 -39 61 195 0 202 1 156 154 226 117 -48 177 253 -61 88 213 310 -247 39 -93 118
$$ packed form
7281a79q9K78J10l30K35j87J88j56K72N2j97j02n5K13j59J08j0M5J50j29j45o
7303i3P1n6m0j55L2J01K16L1j68K7J48P5k75O8J77r6m96J48J75J62j27R6j29J
7327a07K39j0O9J81l4k38p3q5k3L54k22m5O9j90L54J25l23rk2l36K50j09K65j80
7351a00K86j93k47L84j03j48j61K84ok07K81m20L29L34m19J49J74J76m30q4J85
7372F4O6m7j55J61o5N3j61K7J50q6j0Mj36j49L67k65K84k25J41k8q9K7k70L84
7396D2N8q2k73N8K46p4K27j56m04L21r9j07M36k34j01o7L96l24m69P97m14J90
7418c3J03k48P4K22r1P7R4j60J25m3j80K29j39K83N8n02L06l40K64k55K76J97
7440C17j15k41J00J34j95K02k01J55kP2j09j65K25P6l14J49J25R7n57K86j32K11
$$ plain form
7462 118 51 -52 -178 -199 86 1 -88 -165 143 -45 -32 75 24 -10 10 108 -85 24 -193 -77 -108 -75 -47 -141 -131
7487 -131 84 -7 -121 443 -72 168 58 -370 -77 -149 108 41 114 -41 71 -20 122 256 -293 -59 63 -71
7509 -71 -78 349 5 37 -343 -25 -88 291 -2 -116 -129 -47 -48 -69 -70 64 -22 -85 319 -291 149 33 82 77 -207 188
7535 188 26 262 72 16 190 -264 -29 -111 -49 -49 -18 173 42 178 -199 -6 9 -194 40 120 44 -46 301
7558 301 243 -373 -319 190 -106 7 298 -257 72 193 58 20 -166 214 93 -156 61 91 -221 157 -17
7579 -17 242 -181 -246 102 191 274 -25 92 27 87 139 72 36 48 -185 -27 24 19 276 148 56 -163 205 15 28
7604 28 -6 -122 -197 -101 40 221 -62 -85 188 39 209 297 -47 -193 247 -71 188 248 -99 -72 301 -89 -278
7627 -278 -98 -259 -10 256 174 -130 228 275 228 -22 -217 -308 -197 -215 -193 -124 -171 4 310 39 225 307 41
$$ packed form
7462A18o7j03j26k1K85q5q9p7L08j88J3J07n1l4K0R8j93J09k17J16l1L3K8r4J0
7487a31K15r1j14N64n15K40j10m28K93p2K57o7P3j55J12r1J42J34n49K34J22j34
7509g1pM27l44L2l80L18o3L79k93j14j3Q2jk1jJ34q6o3M04o10M40j16M9nk84L95
7535A88j62K36j90n6J74m54K35q2O2%L1J91j31J36l77J93J5k03K34Q0p6r0L47
7558C01n8o16N4N09k96J13K91n55L29J21j35l8j86L80j21k49K17L0l12L78j74
7579a7K59m23o5L48Q9Q3k99J17o5O0N2o7l6J2k33J58N1nK57j28r2k19L68j90J3
7604B8l4j16p5R6J41J81k83k3K73j49J70Q8l44j46M40l18K59O0l47K7L73l90j89
7627b78J80j61K49K66q2l04L58M7m7k50j95r1J11j8K2O9m7J75L06k71J86Q2k66
$$ plain form
7650 41 69 83 300 -118 -207 -30 178 16 -263 228 -85 151 84 356 42 -1 -38 -80 55 194 -87 46 28
7673 28 -246 -15 0 21 -41 97 211 193 152 -46 -205 66 -235 24 144 31 -86 -95 -211 -116 -71 107 -147
7696 -147 16 165 -12 -58 -7 115 101 -92 228 -225 151 -143 -84 233 106 -172 56 77 91 -180 206 99
7718 99 114 -54 234 -37 95 325 -47 241 -111 -217 181 49 56 -65 -40 132 -350 74 -75 43 180 -138
7740 -138 -240 57 27 -246 -363 -199 11 213 133 119 30 -137 -50 -35 125 137 107 -210 -22 -144 75 88 9
7763 9 221 47 -62 -95 -78 -118 88 319 5 -152 248 313 157 -79 -118 -229 192 -219 141 -37 81 -84
7785 -84 -139 35 97 89 11 -55 -39 75 30 105 -30 88 -25 62 -53 -42 38 -2 -3 -280 414 -120 389 -211 91
7810 91 -98 -75 68 -35 159 -10 41 16 -7 122 98 -229 -248 -101 92 18 -10 1 69 101 28 126 17 -104 45
$$ packed form
7650D1K8J4K17m18q9J77K08j62k79M91l13K36o7K72l14m3l7m2J35J39k81J33j8
7673B8k74K31J5K1o2J38J14j8m1j98j59K71l01K59J20j13j17rj16R5M5J78k54
7696a47J63J49j77m6N1J22j4j93L20m53L76k94N9L17j27k78K28K1J4k71L86j07
7718I9J5j68K88k71J32K30l72K88l52j06L98j32Pj21K5J72m82M24j49J18J37l18
7740a38j02K97l0k73j17J64K10K02q0j4q9j67Q7J5J60J2l0l17J88j22K19J3p9
7763IK12j74j09l3J7m0K06K31l14j57M00O5j56k36l9j11M21m11L60j78J18j65
7785h4n5J74O2qp8o6J6J14m5P5j35J18j13Q7j15J1Q0m0jk77O94n34N09o00L02
7810I1j89K3J43j03J94j69N1k5k3J29k4l27j9J47J93p4k8J1O8L2p3R8j09j21J49
$$ plain form
7835 45 21 -265 229 -337 -49 -7 102 65 -109 75 108 -47 81 -172 12 118 18 106 42 346 -179 -71
7857 -71 70 -163 -115 -228 -145 40 12 9 -395 -161 -98 -205 6 -48 -101 -231 188 48 59 -145 -190 -127 -86 -262
7881 -262 -103 82 -34 -25 217 -32 100 -199 76 11 136 -90 79 -7 173 -143 -437 232 -66 -34 -129 50
7903 50 -107 -236 -80 83 -234 26 -280 -210 -190 66 2 38 -263 -87 -10 -32 119 223 -140 116 -35 -66 -10
7926 -10 5 247 -43 209 395 -237 12 223 -153 -191 104 89 -142 -61 241 10 -206 17 -105 6 -143 90
7948 90 45 -27 47 -40 82 54 284 111 -119 -101 -237 -242 100 -112 157 -209 -104 -144 6 251 -225 37 -147
7971 -147 -210 9 238 123 159 -63 69 274 71 201 -107 123 -222 55 -96 -10 -117 -137 -105 -73 19 60 238
7994 238 266 -13 -80 -46 -24 -34 54 64 429 43 205 -198 -81 -20 -376 57 371 6 -8 -5 146 237 -280 33
$$ packed form
7835D5k4k86M94n66K88M2J09l7j74J84L3j55J28k53J84J06j00Q8o4L04n25J08
7857g1J41k33M8j13Q3J85k8lm04K34O3j07K11n4n3j30M19j40J1k04m5O3M1j76
7881b62J59J85j16RK42k49J32k99K75o5J25k26J69q6J80l16k94O69k98L2r5J79
7903E0j57j29J56J63l17K60l06P0K0K56o4L6l01J76P7k2J51J04l63K56j51l1N6
7926a0J5K42k90K52J86o32K49K11l76l8K95j5k31Q1L02k31k16K23j22J11j49K33
7948I0m5p2P4q7J22k8K30j73k30J8j36nL42k12K69l66J05m0J50K45m76K62j84
7971a47o3K19K29j15L6k22J32K05k03J30l08K30l45K77j51Q6j07k0L2L2R2M1J78
7994B38K8k79o7L4K2j0Q8J0L65l86J62m03J17O1l56M33L14l65j4LJ51R1n17L13
$$ plain form
8018 33 195 -77 14 205 -160 -35 198 91 -365 -261 -75 187 60 160 -90 103 -275 -175 -40 48 290
8039 290 -109 -165 133 -9 -27 -175 -243 338 -175 50 -200 225 162 30 140 196 -31 -79 -156 -78 166 41 143
8062 143 -115 -74 -273 -232 -213 -26 31 94 64 179 -232 -55 -57 -19 -26 -112 105 29 83 120 52 123 264 91 91 171 286
8089 286 172 217 60 212 27 86 88 -265 133 -109 94 267 -220 73 69 -20 -72 2 -147 97 29 -143 96
8112 96 -136 209 57 -84 137 136 97 3 -165 106 273 -80 -36 -46 100 -33 -22 113 70 79 36 -28 -161 39
8136 39 -72 -173 286 47 -21 61 235 31 -221 9 36 -142 7 34 254 49 112 -62 101 179 -56 168
8158 168 286 -12 -125 -33 119 107 -110 15 -149 -226 261 49 12 15 -165 31 102 -39 10 75 52 -37 142 -325
8182 -325 70 -118 111 -135 -109 189 -23 108 325
$$ packed form
8018C3J62k72R1J91l65J25K33j07m56J04J86K62j27J00k50J93l78J00J35Q8K42
8039B90l99n6K98j42j8j48o8N81n13K25k50M25o3j32J10N6k27m8p7P8K44j25J02
8062A43k58M1j99M1J9J87N7O3l0J15m11J77kL8pq6K17p6N4L7o8P1J41j73%Q0J15
8089B86j14M5j57J52j85N9Kl53L98k42K03J73m87K93mq9n2P4j49K44o8j72K39
8112I6k32L45j52j41K21jl9r4j68K71J67l53M4j0J46j33J1J35m3Rm3o4j33K00
8136C9j11j01M59k39o8Q2J74k04k52K30K7j78J49K7K20k05O3j74J63P8k35K24
8158A68J18k98j13R2J52j2k17J25j64p7M87k12l7Lj80J96P1j41M9O5k3q9J79m67
8182c25L95j88K29k46K6K98k12J31K17
8191C25
$$ Imaginary data points
##PAGE= N=2
##DATA TABLE= (X++(I..I)), XYDATA
$$ plain form
0 0 0 0 0 -8 8 -8 8 -16 16 -25 40 -40 56 -66 80 -96 120 -136 161 -192 224 -261 304 -349 400 -461 523
27 523 -593 676 -759 854 -964 1078 -1204 1347 -1499 1664 -1852 2055 -2274 2518 -2790 3087
43 3087 -3420 3789 -4202 4672 -5206 5818 -6534 7378 -8393 9643 -11221 13289 -16132
56 -16132 20301 -27011 39615 -71416 315738 438560 -345923 -264317 -98441 14780 314433
67 314433 366898 -225910 -433386 -23809 285178 179899 32862 -126604 -246862 -111234
77 -111234 256131 278441 -103052 -279778 -95843 18890 131798 232377 -38887 -351857
87 -351857 -134927 171792 165166 90617 -55999 -270909 -126924 208517 206130 -2430 -118619
98 -118619 -163425 -42245 185482 176051 -45174 -149611 -82357 41032 135666 113534 -30680
$$ packed form
0@%%%qJ6j6J6k4L2m1O5q0R6j22J46j76K16k56K97l53M16m85N65o53P49q61R84
27E23j116J269j435J613j818K042k282K551k846L163l516L907m329M792n308N877
43C087o507P209p991Q874r878J1024j2352J3912j5771J8036k0864K4510k9421
56a6132L6433m7312O6626j11031L87154J22822p84483Q1606J65876J13221K99653
67C14433N2465n92808k07476M09577L08987j05279j47037j59466j20258J35628
77a11234L67365K2310l81493j76726J83935J14733J12908J00579k71264l12970
87c51857K16930L06719o626p4549j46616k14910J43985L35441k387k08560j16189
98a18619m4806J21180K27727r431k21225j04437O7254J23389R4634k2132j44214
$$ plain form
109 -30680 -152796 -90753 96833 149032 36621 -50237 -109632 -113818 76748 208450 20364
120 20364 -151341 -91099 -31121 44746 168235 49241 -190935 -134616 66309 99861 61062
131 61062 -404 -125641 -120063 67320 153049 31448 -92884 -90062 -23854 52692 113966 54340
143 54340 -106159 -123141 31336 102525 58759 21298 -65242 -124743 14872 148009 58260
154 58260 -54146 -63159 -59368 9826 121071 65476 -87862 -95466 -186 53321 64867 24313
166 24313 -70091 -94602 6405 90884 49143 -35516 -62032 -46350 1927 74610 61806 -48692
178 -48692 -83077 -10791 30757 41897 47223 -24033 -88507 -16370 66872 43784 2665 -22711
190 -22711 -54926 -18268 66505 59252 -22882 -52146 -23336 12581 45265 43506 -18169 -65118
$$ packed form
109c0680j22116O2043J87586N2199j12411q6858n9395m186J90566J31702j88086
120B0364j71705O0242N9978P5867J23489j18994k40176N6319K00925L3552l8799
131F1062o1466j25237N578J87383Q5729j21601j24332K822O6208P6546O1274n9626
143E4340j60499j6982J54477P1189m3766l7461q6540n9501J39615J33137q9749
154E8260j12406r013L791O9194J11245n5595j53338p604R5280N3507J1546m0554
166B4313r4404k4511J01007Q4479m1741q4659k6516J5682M8277P2683j2804j10498
178d8692l4385P2286M1548J1140N326p1256o4474P2137Q3242k3088m1119k5376
190b2711l2215L6658Q4773p253q2134k9264K8810L5917L2684j759o1675m6949
$$ plain form
202 -65118 -24109 42275 43585 7417 -20242 -44737 -29419 38539 55492 -7787 -42185 -24250
214 -24250 -9364 21161 47686 127 -54581 -27176 20161 26270 20605 -2294 -41905 -30314
226 -30314 28391 44176 4725 -24984 -26624 -11542 21944 42404 8625 -37693 -28606 11372
238 11372 25436 21403 6573 -28056 -32475 13991 36932 9320 -12428 -17519 -19320 5976 35139
251 35139 11983 -26731 -23144 -641 12184 20609 9203 -23804 -29606 4339 26170 13541 -5638
264 -5638 -17560 -20467 1284 27993 16858 -15536 -21279 -5075 7169 17836 15467 -12461 -24990
277 -24990 -678 18240 12211 2611 -9216 -18709 -2314 22138 15255 -7846 -15100 -9020 1606
290 1606 16080 15222 -8930 -21251 -5883 11038 11967 5826 -6798 -18620 -7657 14661 14538 -3016
$$ packed form
202f5118M1009O6384J310l6168k7659k4495J5318O7958J6953o3279l4398J7935
214b4250J4886L0525K6525m7559n4708K7405M7337O109n665k2899l9611J1591
226c0314N8705J5785l9451k9709j640J5082L3486K0460l3779m6318R087L9978
238A1372J4064m033j4830l4629m419M6466K2941k7612k1748n091j801K5296K9163
251C5139k3156l8714L587K2503J2825Q425j1406l3007n802L3945K1831j2629j9179
264e638j1922k907K1751K6709j1135l2394n743J6204J2244J0667k369k7928j2529
277b4990K4312J8918o029r600j1827r493J6395K4452o883k3101p254O080J0626
290A606J4474q58k4152j2321J5368J6921R29o141j2624j1822J0963K2318j23j7554
$$ plain form
304 -3016 -10649 -9367 -3825 10814 15244 -3485 -16747 -6220 5799 8657 8318 -1694 -14600 -8231
318 -8231 10761 13276 990 -6270 -8794 -5260 7895 14568 1506 -12244 -7735 1977 6878 8690
332 8690 1855 -11092 -9652 5042 10356 2984 -3425 -7275 -6818 3968 11355 2501 -8546 -7438
346 -7438 -826 4552 8364 2523 -8741 -8899 1881 7911 4847 -675 -6372 -7494 1935 9736 4213
361 4213 -4533 -5633 -2814 2136 7556 4726 -5462 -7708 464 5580 4441 1654 -3857 -6701 -11
376 -11 7926 4486 -2846 -5007 -3664 598 5698 4797 -3596 -6882 -1595 3300 3923 2413 -2568 -6463
392 -6463 -1986 4850 4369 -687 -3450 -3463 -1088 4020 4655 -1638 -5184 -2118 1709 3648 3200 -1348
408 -1348 -4893 -2299 3119 4119 1050 -2242 -3573 -1610 3161 4832 12 -3277 -2918 98 2627
$$ packed form
304c016p633J282N542J4639M430j8729j3262J0527J2019K858l39j0012j2906O369
318h231J8992K515j2286p260k524L534J3155O673j3062j3750M509R712M901J812
332H690o835j2947J440J4694N314p372o409l850M57J0786P387q854j1047J108
346g438O612N378L812n841j1264j58J0780O030l064n522n697j122R429P801n523
361D213q746j100K819M950N420k830j0188k246Q172N116j139k787n511k844O690
376a1P937l440p332k161J343M262N100r01q393l286N287M895O23j510m981l895
392f463M477O836m81n056k763j3K375N108O35o293l546L066L827J939m48m548
408a348l545K594N418J000l069l292j331J963M771J671m820l289L59L016K529
$$ plain form
423 2627 3492 -227 -4097 -2254 1632 3066 1322 -856 -3651 -2502 2127 3922 521 -2769 -2531 -918
439 -918 1706 3306 698 -3380 -2496 874 2345 1795 229 -2402 -2487 787 3400 1096 -1304 -2080 -1248
456 -1248 785 2863 1323 -2278 -2307 -123 1666 2140 560 -1810 -2306 378 2004 1805 -865 -1961
472 -1961 -1433 293 2587 1534 -1295 -2103 -745 806 2029 755 -1131 -1983 -396 1652 1697 97
488 97 -1049 -1486 -191 1983 1732 -384 -1696 -868 497 1355 1511 -615 -1949 -501 1165 1778 429
505 429 -704 -1516 -359 1513 1639 -11 -1303 -1116 -155 1192 1353 134 -1337 -1157 488 1271 913
522 913 -385 -1103 -939 693 1145 -48 -947 -1005 -337 920 1423 272 -956 -966 228 687 944 -76
540 -76 -906 -858 446 1243 558 -237 -1128 -869 665 960 455 -843 -1015 46 580 989 421 -655 -858
$$ packed form
423B627Q65l719l870J843L886J434j744k178k795J149M629J795l401l290K38J613
439i18K624J600k608m078Q84L370J471n50j566k631q5L274K613k304k400p76Q32
456a248K033K078j540l601k9K184J789M74j580k370m96K684J626j99k670j096
472a961N28J726K294j053k829q08J358J551J223j274j886q52J587K048M5j600
488I7j146m37J295K174k51k116j312Q28J365Q58J56k126j334J448J666O13j349
505D29j133q12J157J872J26j650j292J87R61J347J61j219j471J80J645P83l58
522I13j298p18J64J632M52j193q99n8O68J257N03j151j228j0J194M59K57j020
540g6q30M8J304P97o85p95q91K59J534K95n05j298j72J061N34M09n68j076k03
$$ plain form
559 -858 8 856 618 -179 -717 -517 -207 1176 755 -159 -946 -371 -237 648 168 -502 -652 -208 833 784
579 784 322 -393 -712 300 569 627 -199 -929 -243 33 761 80 -71 -701 -290 480 360 158 -629 -639 -373
600 -373 220 760 104 -680 -483 -38 530 401 8 -479 -540 157 484 418 -36 -463 -448 722 621 172 -513
621 -513 -141 -131 100 356 422 -1 -345 -91 244 365 1 -376 -392 -73 411 313 268 -268 -329 42 497 612
643 612 -138 -515 -23 297 465 143 -449 -444 -98 736 544 56 -491 -459 -100 98 419 125 -448 -402 195 118
665 118 -106 -276 -303 -176 -12 150 231 -303 -315 -158 117 336 -161 -23 -274 -219 354 310 52 -485 139 20
687 20 326 -28 64 -691 -205 -37 252 92 -454 49 -178 227 515 92 -440 -470 -39 64 103 63 -490 -234
709 -234 129 350 21 -102 4 -154 103 5 104 -283 -235 151 352 -24 -166 -513 -168 -91 578 96 -63 -11
$$ packed form
559h58Q66Q48k38p97n38K00L10J383m21r14p87N75J34Q85m80o70j50M44J041m9
579G84m62p15l19J012K69N8q26p30O86K76P28o81j51o30M11P70j20k02p87j0K66
600c73N93N40o56p84J97M45N68j29l93m87o1O97L27o6m54m27J5J170j01m49o85
621e13L72J0K31K56O6m23l44K54L35J21l64l77j6L19M84r8m5n36o1L71M55J15
643F12p50l77M92L20J68l22n92NL46Q34j92m88n47L2L59J98L21k94n73M6N97p7
665A18k24j70k7J27J64J62Q1n34j2J57K75K19m97J38k51N5N73m4k58n37O24j19
687B0L06l54R2p55M86J68K89j60n46N03k27M05K88m23n32l0M31J03L9m0n53K56
709b34L63K21l29j23J06j58K57r8R9l87M8L86K01l76j42l47L45P7O69m82j59N2
$$ plain form
731 -11 -101 271 171 -41 76 -374 185 25 320 -190 7 53 -167 -84 334 151 -352 -146 255 272 98 -349
753 -349 194 11 256 240 232 36 -307 -15 86 6 8 -310 -117 142 123 62 231 -144 -402 -77 265 76 257
776 257 -38 -21 -53 66 293 204 23 -42 12 -265 31 -88 -61 -127 -12 309 149 4 113 -62 157 282 -16
799 -16 -198 329 30 -40 94 -6 -31 109 -78 -68 -210 -88 -259 -118 151 119 50 142 -8 67 16 -33 -174 -105
823 -105 54 -68 171 -209 -319 79 -129 -58 -49 -176 -76 -31 -7 -48 298 -108 24 -226 40 297 -145 293
845 293 -99 -40 484 56 -184 65 -51 103 -93 107 -44 -305 -149 -120 -14 -317 -33 90 -179 207 160
866 160 -84 230 -108 -62 279 364 52 29 -230 29 -311 -268 192 -199 -30 -49 47 -220 -5 -48 -81 -37 272
889 272 -3 111 13 132 262 -277 20 -207 59 -194 193 -93 129 -19 -5 -147 260 -118 104 -157 119
$$ packed form
731a1r0L72j00k12J17m50N59j60K95n10J97M6k20Q3M18j83n03K06M01J7j74m47
753c49N43j83K45j6qj96l43K92J01q0Kl18J93K59j9o1J69l75k58L25L42j89J81
776B57k95J7l2J19K27q9j81o5N4k77K96j19K7o6J15L21j60j45J09j75K19J25k98
799a6j82N27k99p0J34j00k5J40j87J0j42J22j71J41K69l2o9R2j50P5n1m9j41O9
823a05J59j22K39l80j10L98k08P1Rj27J00M5K4m1L46m06J32k50K66K57m42M38
845B93l92N9N24m28k40K49j16J54j96K00j51k61J56K9J06l03K84J23k69L86m7
866A60k44L14l38M6L41Q5l12k3k59K59l40M3M60l91J69j9R6k67K15m3l3M4L09
889B72k75J14r8J19J30n39K97k27K66k53L87k86K22j48J4j42M07l78K22k61K76
$$ plain form
910 119 65 140 -137 83 119 5 75 63 92 150 -189 -239 -127 -147 -8 -114 -135 -155 -249 116 10 17 -37 -184 15
935 15 -171 88 7 139 -240 164 -7 76 152 -109 293 33 141 -198 -44 38 265 118 -23 43 130 73 330
958 330 -203 158 -196 -131 101 163 -314 29 125 13 301 120 -135 -117 360 -339 26 -183 146 -325 -59 -91
980 -91 25 104 26 -94 -35 -27 10 -264 218 -104 79 108 -172 429 251 -102 154 137 121 -145 32 -18 -102 231
1004 231 238 -178 238 -167 -67 150 39 -47 -70 14 -52 133 -91 79 92 -20 97 55 71 17 180 170 106 -111
1028 -111 135 157 -65 -16 154 57 -54 26 -189 -98 30 -207 135 276 -78 -171 408 -73 -422 -275 84 -65
1050 -65 -54 165 -82 -192 -81 129 139 2 -288 -176 217 -110 83 -187 90 307 -63 -117 -40 69 -114 -72
1072 -72 52 344 82 17 31 152 270 135 24 -201 52 1 -51 275 111 4 -63 116 279 -118 -63 -99 -9
$$ packed form
910A19n4P5k77K20L6j14P0j2K9N8l39n0J12k0J39j06k1k0r4L65j06Pn4j47J99
935A5j86K59q1J32l79M04j71Q3P6k61M02k60J08l39J54Q2K27j47j41O6Q7n7K57
958C30n33L61l54O5K32O2m77L43R6j12K88j81k55J8M77o99L65k09L29m71K66l2
980i1J16P9p8j20N9QL7k74M82l22J83K9k80O01j78l53K56j7j6k66J77n0q4L33
1004B31Pm16M16m05J00K17j11q6k3Q4o6J85k24J70J3j12J17m2J6n4J63j0o4k17
1028a11K46K2k22M9J70r7j11Q0k15R1J28k37L42J41l54r3N79m81l49J47L59j49
1050f5J1K19k47j10J11K10J0j37k90J12L93l27J93k70K77K17l70n4P7J09j83M2
1072g2J24K92k62o5J4J21J18j35j11k25K53n1n2L26j64j07o7J79J63l97N5l6R0
$$ plain form
1095 -9 -86 -17 19 -43 -147 116 -106 -395 -3 -198 456 87 -98 -407 -258 36 135 160 -223 -269 -101 -1 3 69
1119 69 -41 -184 81 33 -196 583 66 235 46 124 8 -155 259 -54 -142 167 -95 -155 -343 29 -4 107
1141 107 60 65 247 -251 151 -4 -281 -214 5 182 14 -83 59 -54 277 -270 -181 -233 13 255 61 -275
1163 -275 150 143 -232 18 20 -203 82 175 168 48 197 -201 88 -64 205 -116 -111 -228 24 -57 89 216 -149
1186 -149 12 -2 265 34 -9 56 -79 480 -216 5 -43 227 -42 343 14 13 -120 148 218 -149 230 -154
1208 -154 23 -191 -27 -74 258 -255 43 89 90 55 135 34 232 -263 119 -149 86 -203 -227 60 -286 385
1230 385 16 4 71 34 -117 56 145 212 10 -203 -174 -38 -95 181 -166 49 62 252 -129 148 75 -213 -57
1253 -57 98 144 -129 -95 -139 -203 125 -60 106 154 -176 -529 -63 -206 182 282 -119 -85 -36 196 -16 93 -52
$$ packed form
1095ip7O9L6o2j04K63k22k89L92j95O54l69j85l09J49K94R9K5l83m6J68J00MO6
1119F9j10j43K65m8k29P79n17J69j89P8j16j63M14l13q8L09k62o0j88L72l3J11
1141A07m7NJ82m98M02j55k77O7K19J77j68r7J42j13L31n47Q9n2K46K42j94l36
1163b75M25pl75K50Kk23K85R3pj20J49l98K89j52K69l21Nj17K52q1J46J27l65
1186a49J61j4K67k31m3O5j35N59o96K21m8K70k69L85l29jj33K68P0l67L79l84
1208a54J77k14J64m7L32n13K98M6Jl5Q0j01J98m95L82k68K35k89k4K87l46O71
1230C85l69j2O7l7j51J73Q9O7k02k13K9J36n7K76l47K15J3J90l81K77p3k88J56
1253e7J55M6k73L4m4o4L28j85J66M8l30l53M66j43L88J00m01L4M9K32k12J09j45
$$ plain form
1276 -52 -187 -399 117 35 187 16 83 -216 -114 -26 -90 76 137 -116 273 77 -323 107 -202 89 -253 33
1298 33 -11 73 137 474 -17 41 203 145 -133 -66 102 -163 210 2 -58 -183 151 -13 21 -23 -325 -261 -29 -17
1322 -17 116 197 53 67 -237 297 2 196 -139 -221 -20 -208 -206 -133 46 104 63 32 91 -453 -95 268 -91 -205
1346 -205 -135 74 12 91 -285 -57 197 -306 182 -73 -63 174 -145 -204 80 -247 127 247 -89 25 5 77
1368 77 -24 -122 126 -84 -195 -165 -69 -124 -277 -19 -64 57 181 80 -49 136 -17 52 83 0 145 -196 -193 101
1392 101 2 -124 -130 -100 363 317 -198 85 117 -173 81 -27 -80 -216 78 -125 59 289 79 105 -264 133 220
1415 220 53 -96 107 -24 -101 145 29 306 -232 -121 223 -108 -146 18 96 -68 222 87 -29 -132 -40
1436 -40 -109 73 -74 -190 194 -103 111 32 -199 -55 -321 79 -71 198 243 35 -219 -333 -160 46 -93
$$ packed form
1276e2j35k12N16q2J52j71O7k99J02Q8o4J66O1k53L89j96m00M30l09K91l42K86
1298C3m4Q4O4L37m91N8J62n8k78O7J68k65L73k08o0j25L34j64L4m4l02O4K32J2
1322a7J33Q1j44J4l04N34k95J94l35q2K01j88KP3J79N8m1l1N9n44L58L63l59j14
1346b05P0K09o2P9l76K28K54n03M88k55J0K37l19n9K84l27L74J20l36J14k0P2
1368G7j01r8K48k10j11L0R6n5j53K58m5J21J24j01j29J85j53O9L1q3J45l41LK94
1392A01r9j26oL0M63m6n15K83L2k90K54j08n3j36K94k03J84K30k10K6l69L97Q7
1415B20j67j49K03j31p7K46j16K77n38J11L44l31l8J64P8j64K90j35j16j03R2
1436d0o9J82j47j16L84k97K14p9k31J44k66M00j50K69M5k08k54j14J73K06j39
$$ plain form
1457 -93 253 -180 46 24 -89 -289 132 180 -4 151 -189 5 129 -22 23 -191 4 295 -236 -128 17
1478 17 157 215 -44 -145 -313 375 88 -254 2 306 76 -94 83 30 -96 -37 -80 54 -172 10 27 189
1500 189 -38 -35 111 193 71 170 -51 -135 122 60 -167 -334 171 -75 -141 29 -39 -93 216 -4 -179 -217 -238 -240
1524 -240 113 -144 -66 134 -176 -106 -129 184 2 -49 66 193 92 -144 -88 122 95 -303 -121 -379 -63 82
1546 82 239 -233 -21 -189 175 93 -20 -12 -161 -89 -275 -3 -285 77 75 -136 -192 -202 -96 62 -227 30 47
1569 47 -149 32 -66 -28 -237 -43 252 -110 -275 -35 257 -65 103 -123 44 192 121 -96 -122 211 70 81
1591 81 -17 15 -159 34 127 124 69 349 -11 -8 -132 69 -174 5 166 -22 -157 76 96 -206 83 -185 -6
1614 -6 -150 -201 142 -75 145 41 -92 260 -64 130 51 105 -113 66 -353 -125 428 55 197 -104 31 249
$$ packed form
1457i3L46m33K26k2j13k00M21M8j84J55l40J94J24j51M5k14J95K91n31J08J45
1478A7J40N8k59j01j68O88k87l42K56L04k30j70J77n3j26N9m3J34k26J82J7J62
1500A89k27LJ46Q2j22R9k21q4K57o2k27j67N05k46o6J70o8n4L09k20j75l8k1k
1524b40L53k57P8K00l10P0k3L13j82n1J15J27j01k36N6K10k7l98J82k58L16J45
1546H2J57m72K12j68L64q2j13Qj49P2j86K72k82L62kk11n6j0J06J58k89K57J7
1569D7j96J81r8L8k09J94K95l62j65K40K92l22J68k26J67J48p1k17k6L33j41J1
1591H1r8L2j74J93R3ln5K80l60Lj24K01k43J79J61j88j35K33K0l02K89k68J79
1614fj44n1L43k17K20j04j33L52l24J94p9N4k18J79m19K28N53l73J42l01J35K18
$$ plain form
1636 249 94 -28 67 161 -143 -45 -111 -11 -32 -11 -290 -121 56 127 33 181 196 -36 148 -67 167 -40 175
1659 175 212 56 143 -133 15 -19 -3 -49 -73 -125 -39 -232 81 197 24 -172 -177 119 155 -44 -236 -52 56 74
1683 74 274 -75 100 -193 -196 60 -158 -42 182 18 -89 88 178 -46 213 213 -115 49 -218 -245 -44 -37 -267
1706 -267 -120 84 228 -87 274 76 96 91 -51 239 210 34 210 -237 -145 -136 -46 -58 -31 -43 31 -6 -75 85 -231
1731 -231 442 228 65 -129 27 -137 -88 -112 197 95 33 39 23 -36 35 -132 -96 -166 -126 -45 59 180 -161 -192
1755 -192 129 26 -93 -183 -4 216 -368 124 -78 81 135 63 -51 -16 -70 -278 -134 95 184 -499 -59 79
1777 79 -313 -51 8 -128 124 320 -149 10 119 -67 -36 -166 153 229 45 -357 194 -232 86 92 128 -152
1799 -152 -125 61 -102 145 105 191 -43 84 -23 -5 36 -87 -135 -149 -67 42 139 111 -322 73 21 -41 11 222
$$ packed form
1636B49j55j22R5R4l04R8o6J00k1K1k79J69J77P1r4J48J5k32J84k15K34k07K15
1659A75L7j56Q7k76J48l4J6m6k4n2Q6j93L13J16j73j96nK96L6j99j92J84J08J8
1683G4K00l49J75k93lK56k18J16K24j64j07J77R0k24K59%l28J64k67k7K01Pk30
1706b67J47K04J44l15L61j98K0nj42K90k9j76J76m47R2RR0j2K7j2P4l7o9J60l16
1731b31O73k14j63j94J56j64M9k4L09j02o2Oj6n9P1j67L6p0M0Q1J04J21l41l1
1755a92L21j03j19r0J79K20n84M92k02J59N4p2j14L5n4k08J44K29Q9o83M40J38
1777G9l92K62N9j36K52J96m69J59J09j86L1j30L19P6j84m02N51m26L18OL6k80
1799a52K7J86j63K47m0Q6k34J27j07J8M1j23m8j4Q2J09R7k8m33L95n2o2N2K11
$$ plain form
1823 222 75 -79 127 91 -3 -154 -85 -90 87 -205 -64 -70 164 -98 228 -317 -56 -238 111 354 -18 32 -173
1846 -173 -9 181 262 -264 267 67 134 -195 306 78 -76 86 246 114 13 55 151 6 154 -85 -185
1867 -185 -114 140 181 -58 -168 92 -17 -4 229 93 -207 61 167 -82 -48 -93 112 -43 -223 338 -215 -193
1889 -193 107 306 -39 403 -74 66 -27 123 -10 -123 224 -284 -215 154 -31 -62 75 189 -19 56 -49
1910 -49 -311 291 104 465 -99 41 -110 -79 45 -151 -96 -169 114 91 -49 -329 -33 157 -123 217 -74 -53
1932 -53 35 -154 59 147 -494 -86 40 0 348 78 -41 -154 156 -172 147 -3 -50 127 74 -18 -46 -268 63
1955 63 -64 17 -83 259 -64 -38 -67 -56 -16 404 17 96 103 -39 107 56 45 -84 65 -54 -139 -46 -54 -117 110
1980 110 -116 -404 61 -273 -383 -73 -179 16 -14 -64 -292 4 53 -187 -12 151 150 -8 -58 181 -99 -31
$$ packed form
1823B22j47j54K06l6r4j51O9nJ77k92J41oK34k62L26n45K61j82L49K43l72N0k05
1846a73J64J90Q1n26N31k00O7l29N01k28j54J62J60j32j01M2R6j45J48k39j00
1867a85P1K54M1k39j10K60j09J3K33j36l00K68J06k49L4m5K05j55j80N61n53K2
1889a93L00J99l45M42m77J40r3J50j33j13L47n08O9L69j85l1J37J14k08P5j05
1910d9k62O02j87L61n64J40j51L1J24j96N5p3K83k3j40k80K96J90k80L40k91K1
1932e3Q8j89K13Q8o41M08J26m0L48k70j19j13L10l28L19j50m7J77n3r2k8k22L31
1955F3j27Q1j00L42l23K6k9J1M0M20l87P9Pj42J46n1j1j29J49j19q5R3qo3K27
1980A10k26k88M65l34j10L10j06J95l0n0k28K96M9k40J75J63jj58n0K39k80O8
$$ plain form
2002 -31 -150 -60 164 30 -55 40 -333 -42 -29 93 135 -311 109 65 -123 -236 94 62 -101 -9 136 64 -75
2025 -75 117 -247 -102 133 163 88 -281 -36 163 -27 322 53 29 56 -65 220 100 168 95 -116 107 -283
2047 -283 73 368 -451 279 129 137 104 -43 -68 331 -116 -160 -90 452 157 265 82 1 109 -98 -1 -264 -136
2070 -136 209 -186 47 12 -185 61 -57 -62 -153 -307 133 61 259 31 63 -158 67 -86 -135 83 -465 204
2092 204 -42 -30 130 17 55 -246 -188 34 78 -312 243 173 -110 38 222 -110 215 -40 43 119 84 63 198
2115 198 89 1 -124 -35 -181 257 141 -14 126 -77 -93 -79 189 42 22 -193 165 -68 -105 195 101 151 -120
2138 -120 -47 -184 341 -226 -125 29 -171 39 -20 -9 -160 109 104 79 320 -212 -79 26 45 12 -99 -33 -131
2161 -131 68 154 -50 -220 -44 161 -35 -327 -62 -15 151 -345 -55 -78 -107 -8 -89 88 -342 341 -196 -121
$$ packed form
2002c1j19R0K24j34q5R5l73K91J3J22M2m46M20m4j88j13L30l2j63R2J45p2j39
2025g5J92l64J45K35L0p5l69K45J99j90L49k69k4K7j21K85j20O8p3k11K23l90
2047b83L56K95q19P30j50Ql3j47k5L99m47m4P0N42k95J08j83q1J08k07R7k63J28
2070a36L45l95K33l5j97K46j18nr1j54M40p2J98k28L2k21K25j53m9K18n48O69
2092B04k46J2J60j13L8l01N8K22M4l90N55p0k83J48J84l32L25k55Q3P6l5k1J35
2115A98j09q8j25Q9j46M38j16j55J40k03j6J4K68j47k0k15L58k33l7L00r4N0k71
2138a20P3j37N25n67J01J54k00K10n9J1j51K69nk5K41n32J33J05J9l3j11O6r8
2161a31J99Q6k04j70J76K05j96k92K65M7J66m96K90k3k9R9q1J77m30O83n37P5
$$ plain form
2183 -121 161 -165 -99 77 -80 -241 -42 93 5 146 23 45 67 -43 -350 92 409 -66 -247 211 54
2204 54 -311 124 70 -25 -19 152 333 42 10 -248 101 -138 191 277 292 -328 -4 281 75 184 6 -149 -338
2227 -338 -108 241 -27 73 388 157 28 27 105 6 -14 42 -54 154 1 -52 -3 -82 146 222 -64 150 -106 247
2251 247 -96 186 -20 -270 189 -39 81 157 -50 184 -30 -100 -50 183 -24 174 -87 108 -25 -189 107
2272 107 -19 -125 192 36 87 -52 98 35 215 -138 30 45 -141 178 60 -139 218 -212 -206 -17 -47 -389
2294 -389 147 -91 155 7 93 36 69 -105 -226 43 64 262 -226 -259 163 -86 -83 -3 -46 74 -20 -114 401 -21
2318 -21 -102 -63 -54 -53 -127 18 -113 10 -341 -64 -62 45 -149 117 -136 -91 32 206 39 -331 -62 24 -272 69
2342 69 -9 -63 -138 169 -95 68 -168 -21 94 -14 -81 20 -80 85 373 2 -99 0 485 35 304 236
$$ packed form
2183a21K82l26O6J76j57j61J99J35q8J41j23K2K2j10l07M42L17m75j81M58j57
2204E4l65M35n4r5OJ71J81k91l2k58L49k39L29Q6J5o20L24K85k06J09j78j55j89
2227c38K30L49k68J00L15k31j29jP8r9k0N6r6K08j53n3M9p9K28P6k86K14k56L53
2251B47l43K82k06k50M59k28J20P6k07K34k14p0N0K33k07J98k61J95j33j64K96
2272A07j26j06L17j56N1j39J50o3J80l53J68J5j86L19j18j99L57m30OJ89l0l42
2294c89N36k38K46j48Q6n7L3j74j21K69K1J98m88l3M22k49LQ0m3J20r4r4N15m22
2318b1q1L9RJp4J45j31J23l51K77KJ07j94K66k53M5J23J74j67l70K69Q6k96L41
2342F9p8n4p5L07k64J63k36J47J15j08o7J01j00J65K88l71j01R9M85m50K69o8
$$ plain form
2364 236 86 86 147 -163 15 142 3 -238 25 -55 -478 103 188 17 -151 92 -51 -161 115 152 32 193
2386 193 -38 63 128 -123 90 -146 114 59 140 -172 -25 148 -66 -86 -132 -6 145 3 56 276 -74 -300
2408 -300 266 129 -228 -8 -249 -76 -237 -225 136 250 70 37 186 -50 -63 410 -97 298 66 65 -57 -153
2430 -153 33 171 117 13 26 -171 -32 -275 14 151 60 11 -43 -15 368 77 -260 -251 -107 5 -17 141 173
2453 173 -415 167 -202 98 47 -101 -210 -52 -218 26 -126 -164 -112 320 73 -220 55 21 7 -115 -190 -113
2475 -113 -258 -313 93 143 -34 101 -135 -97 207 -60 -27 -147 98 21 60 58 -180 49 493 -304 -124 130 -140
2498 -140 62 35 174 453 -113 0 -55 -507 -92 246 -215 133 -8 31 113 59 89 18 9 -180 19 39 -88
2521 -88 26 -214 101 23 -161 -116 18 176 49 -180 -29 -34 68 25 8 -284 -113 195 -265 67 233 -249
$$ packed form
2364B36j50%O1l10J78J27j39k41K63q0m23N81Q5j71j68K43j43j10K76L7j20J61
2386A93k31J01O5k51K13k36K60n5Q1l12J47J73k14k0m6J26J51j42N3K20l50k26
2408c00N66j37l57K20k41J73j61J2L61J14j80l3J49k36j3M73n07L95k32jj22r6
2430a53J86J38n4j04J3j97J39k43K89J37r1m9n4K8L83k91l37RJ44J12k2J58L2
2453A73n88N82l69L00n1j48j09J58j66K44j52l8N2M32k47k93K75l4j4j22p5P7
2475a13j45n5M06N0j77J35k36L8L04k67L3j20K45p7L9kk38K29M44p97J80K54k70
2498a40K02k7J39K79n66J13n5m52M15L38m61L48j41L9Q2n4L0p1rj89J99K0j27
2521h8J14k40L15p8j84M5J34J58j27k29J51nJ02m3j7k92J71L08m60L32J66m82
$$ plain form
2543 -249 110 63 144 88 -253 -133 64 -88 112 48 152 236 -259 -75 64 129 101 274 -112 -11 59 -26 -189
2566 -189 231 -83 127 82 153 -116 226 186 -76 -119 -451 93 -98 133 -269 -219 166 -330 -378 -188 91 -334
2588 -334 26 44 92 -129 -24 -38 313 191 282 43 109 -108 162 -39 -64 -12 -144 -123 132 -22 253 233 61
2611 61 -301 -182 165 1 229 399 200 -300 -78 -214 -27 29 -82 176 171 -172 -11 -83 -189 90 74 298
2633 298 99 -93 113 -89 246 -191 -66 110 110 -3 -32 178 -103 -122 25 -207 255 -135 -46 64 -4 -256
2655 -256 -105 79 -89 222 388 220 44 -218 108 -191 109 68 -40 136 -102 -9 90 111 179 126 -133 -9
2677 -9 -205 68 -282 53 -96 -38 -202 -320 105 12 17 -64 341 163 50 214 -82 -222 100 41 -186 -28 180
2700 180 -30 -175 -180 118 141 -221 -267 219 48 -88 -106 159 248 -216 -69 391 100 0 -68 -159 -11 83 59
$$ packed form
2543b49L59m7Q1n6l41J20J97j52K00o4J04Q4m95J84J39O5k8J73l86J01P0q5j63
2566a89M20l14K10m5P1k69L42m0k62m3l32N44j91K31m02N0L85m96m8J90K79m25
2588c34L60J8M8k21J05j4L51j22R1k39O6k17K70k01k5N2j32K1K55j54K75k0j72
2611F1l62J19L47j64K28J70j99n00K22j36J87N6j11K58nl43J61p2j06K79j6K24
2633B98j99j92K06k02L35m37J25J76%j13k9K10k81j9J47k32M62l90Q9J10o8k52
2655b56J51J84j68L11J66j68j76k62L26k99L00m1j08J76k38R3R9K1O8n3k59J24
2677ij96K73l50L35j49N8j64j18M25r3Nq1M05j78j13J64k96j40L22n9k27J58K08
2700A80k10j45nK98K3l62m6M86j71j36j8K65Q9m64J47M60k91j00o8r1J48R4k4
$$ plain form
2723 59 308 40 -20 -339 -4 -101 -28 53 -57 -8 292 160 -166 25 -133 56 -32 -4 39 -154 -84 -50 -126 237
2747 237 25 -264 -90 -272 56 -160 125 107 177 -218 -290 -105 -185 108 64 -34 -202 -78 276 93 -370 95
2769 95 -52 -86 -80 -57 155 -8 218 -10 168 59 58 -32 -102 63 -213 232 -206 -120 212 130 -16 251 33 -21
2793 -21 351 -194 -410 -209 -175 129 5 -31 77 -8 23 99 -1 94 78 331 -71 89 201 46 -81 225 156
2816 156 -131 -63 -135 -101 -170 17 47 13 -7 -155 -96 23 -39 -72 140 -50 68 -101 167 1 31 54 229 -279
2840 -279 323 250 -15 -118 -118 7 -73 -160 -246 302 -58 212 -39 40 143 -62 63 -35 -127 -87 140 -118 -77 -140
2864 -140 -115 -6 -85 -56 2 14 47 52 157 261 70 282 122 156 -400 -316 83 -131 -237 -78 353 -84 -304
2887 -304 -66 169 10 -81 -99 565 -93 76 292 287 -202 39 48 402 82 60 -7 100 -214 92 -56 -103 -191
$$ packed form
2723E9K49k68o0l19L35r7P3Q1j10M9L00j32l26J91j58J89q8K8M3j93P0L4p6L63
2747B37k12k89J74j82L28k16K85j8P0l95p2J85q0K93m4r8j68J24L54j83m63M65
2769I5j47l4OK3K12j63K26k28J78j09jr0p0J65k76M45m38Q6L32q2j46K67k18n4
2793b1L72n45k16K01L4L04j24l6J08q5L1P6j00R5j6K53m02J60J12j55j27L06o9
2816A56k87O8p2L4o9J87L0l4k0j48N9J19o2l3K12j90J18j69K68j66L0K3J75n08
2840b79O02p3k65j03%J25q0q7q6N48l60K70k51P9J03k05J25r8r2M0K27k58M1o3
2864a40K5J09p9K9N8J2L3NJ05J04j91K12j60L4n56Q4L99k14j06J59M31m37k20
2887c04K38K35j59r1j8O64o58J69K16nm89K41RL54l20k2o7J07l14L06j48m7q8
$$ plain form
2910 -191 21 11 -208 73 -194 55 -140 -106 84 -190 -1 268 -201 -116 -234 -73 -49 300 93 160 408 -26
2932 -26 -148 182 -326 167 162 -89 49 49 75 -20 199 151 -144 -51 -403 -43 -196 -29 47 37 -84 -1 104 -115
2956 -115 34 99 -54 120 96 -82 -205 205 -230 26 92 -102 193 91 39 -100 -181 -102 -76 -92 136 92 52
2979 52 -12 -218 96 221 -5 -1 -83 230 -210 67 50 -173 33 -16 114 73 -4 137 124 53 -210 -26 -133 -2
3003 -2 -62 -90 102 -56 102 29 -26 126 -194 17 -81 33 187 -45 362 -128 78 -72 152 -63 -28 -1 -138
3026 -138 141 -206 -325 101 -27 -88 -30 -115 152 41 205 119 164 310 -39 116 -119 -130 -28 -147 -233 8
3048 8 191 52 -70 -95 -71 -114 -293 103 80 127 44 205 -40 64 186 183 -193 113 -200 -80 -17 38 137 20
3072 20 169 -1 179 50 -134 39 -110 -270 331 0 -466 140 -259 -100 -111 -376 -135 30 -27 153 -207
$$ packed form
2910a91K12j0k19K81k67K49j95L4J90k74J89K69m69Q5j18J61K4L49k07O7K48m34
2932b6j22L30n08M93nk51J38%K6r5K19m8k95R3l52L60j53J67P6j0j21Q3J05k19
2956a15J49O5j53J74k4j78j23M10m35K56O6j94K95j02n2j39q1P9K6j6K28m4m0
2979E2o4k06L14J25k26Mq2L13m40K77j7k23K06m9J30m1p7J41j3p1k63J84j07J31
3003bo0k8J92j58J58p3n5J52l20K11r8J14J54k32M07m90K06j50K24k15L5K7j37
3026a38K79l47j19M26j28o1N8q5K67j11J64q6M5J46l49J55k35j1J02j19q6K41
3048HJ83j39j22k5K4m3j79L96k3M7q3J61k45J04J22ll76L06l13J20O3N5R9j17
3072B0J49j70J80j29j84J73j49j60O01l31m66O06l99J59j1k65K41J65n7J80l60
$$ plain form
3093 -207 164 195 -216 115 32 -148 312 168 26 -271 245 -89 21 30 -132 215 -185 120 493 59 -623
3114 -623 74 288 42 -79 185 148 -249 147 -49 77 -176 36 -192 247 -162 148 127 167 120 230 -68
3135 -68 101 99 -105 60 -260 -18 -102 -47 163 103 -79 285 -159 -52 227 -86 -157 -111 6 20 -39 -116 182 174
3159 174 99 114 212 -446 188 -35 91 40 43 105 -86 181 153 -234 274 -121 123 -134 -29 -2 168 71 92 70
3183 70 -130 333 -181 83 110 155 184 -103 -306 -275 192 272 -18 -168 -228 -137 50 269 -22 -200 -157 119 -88
3206 -88 -29 -229 115 -215 118 -125 37 1 91 103 49 -5 87 184 27 70 380 84 -264 9 212 -90 -298
3229 -298 -44 77 -14 -12 -5 -24 42 -21 214 175 111 31 335 264 -36 50 83 7 -86 -150 77 17 -60 -31 -17 13 313
3256 313 -29 -136 -248 -125 11 -84 -174 -39 -149 154 -301 -117 -64 -116 -22 380 159 -93 203 -203 61 -403
$$ packed form
3093b07L71L1m11L31q3j80M60j44j42k97N16l34J10Rj62L47m00L05L73m34o82
3114f23O97K14k46j21K64l7l97L96j96J26k53K12k28M39m09L10k1M0m7J10k98
3135f8J69kk04J65l20K42q4N5K10o0j82L64m44J07K79l13p1M6J17J4n9p7K98q
3159A74p5J5R8o58O34k23J26n1LO2j91K67k8l87N08l95K44k57J05K7J70r7K1k2
3183G0k00M63n14K64K7M5K9k87k03L1M67Q0k90j50o0R1J87K19k91j78M3K76k07
3206h8N9k00L44l30L33k43J62l6R0J2n4n4R2R7j57M3L10k96l48K73K03l02k08
3229b98K54J21r1KPj9O6o3K35l9o4q0L04p1l00Q6L3p6r3o4K27o0p7K9J4L0L00
3256C13l42j07j12J23J36r5r0J35j10L03m55J84N3n2R4M02k21k52K96m06K64m64
$$ plain form
3278 -403 -144 -154 214 244 103 -62 82 -20 -122 -243 -101 254 -154 -81 18 -292 -126 -77 -218 -285 -129 -205
3300 -205 -21 123 -202 291 246 -74 -163 -78 133 98 7 -155 -140 -204 118 42 55 -36 6 -193 -95 -139 116 65 12
3325 12 -15 1 -108 -85 209 45 4 315 214 -239 23 241 -262 75 -201 58 -269 -126 92 309 131 93
3347 93 369 10 -190 224 -230 159 -82 -198 -198 74 -135 -35 -173 -5 252 31 142 144 73 102 191 115 209
3370 209 -70 197 70 -43 235 -134 78 -207 1 103 123 -97 -336 -114 -39 62 -325 181 109 -249 -229
3391 -229 -186 -254 -264 -225 -160 -88 230 -48 -21 184 168 193 -103 57 -191 60 56 203 -7 -53 -22 345 86 -131
3415 -131 -301 -60 -102 -245 -313 68 140 179 -212 -161 102 -207 333 85 -139 30 -168 -343 -262 -280 -350 -46 -299
3438 -299 144 -126 -139 207 -13 -11 150 119 -198 -67 13 -252 -232 -134 -260 197 21 18 46 64 -129 -204 59 97
$$ packed form
3278d03K59j0L68L0j41j65J44j02j02j21J42L55m08P3R9l10J66M9j41o7J56p6
3300b05J84J44l25M93m5l20q9Q5K11l5r1j62J5o4L22p6J3r1M2j99R8m4K55n1n3
3325A2k7J6j09K3K94j64m1L11j01m53K62K18n03L37k76K59l27J43K18K17j78l8
3347I3K76l59k00M14m54L89k41j16%K72k09J00j38J68K57k21J11Kp1K9Q9p6R4
3370B09k79K67j27j13K78l69K12k85K08J02K0k20k39K22P5J01l87N06p2l58K0
3391b29M3o8j0L9O5P2L18k78K7K05j6K5k96J60k48K51mJ47k10m6L1L67k59k17
3415a31j70K41m2j43o8L81P2L9l91N1K63l09N40k48k24J69j98j75Q1j8p0L04k53
3438b99M43k70j3L46k20KJ61l1l17J31Q0k65K0R8j26M57j76lK8J8j93p5K63L8
$$ plain form
3462 97 78 275 40 -80 -90 -173 34 38 -34 -111 217 216 -191 -2 242 247 313 314 -216 372 140 31 4 17 81 -187
3488 -187 -61 -194 -129 -102 -133 106 70 -73 37 0 -159 13 180 -209 54 104 -281 14 -84 73 -19 -264 226
3511 226 -82 67 -35 65 -150 24 211 43 27 -294 114 -313 -357 -139 -23 29 375 218 185 110 210 -59
3533 -59 -32 213 -302 75 -168 -52 157 222 -159 88 -113 -32 -127 -24 -104 -256 -200 -116 113 23 -108 56 -58
3556 -58 354 158 -84 285 -93 52 -177 19 55 368 143 200 -79 -33 30 -328 -165 25 -109 -329 -178 111
3578 111 79 -49 -94 -248 -302 -413 -140 30 118 -16 -146 -70 294 143 -160 -46 -20 -81 61 74 -52 -218 26
3601 26 -272 -76 -19 -215 -11 -39 -40 79 -170 -43 241 -92 -144 205 -46 -208 -72 -100 43 148 134 -26 155
3624 155 260 61 60 54 65 -14 5 -111 -103 -205 373 99 159 -123 68 -101 126 -172 -155 -20 -52 292 -15 -152
$$ packed form
3462I7j9J97k35j20j0q3K07Mp2p7L28jm07J89K44NO6Jn30N88k32j09k7J3O4k68
3488a87J26j33O5K7l1K39l6j43J10l7j59J72J67l89K63N0l85K95r8J57r2k45M90
3511B26l08J49j02J00k15J74J87j68j6l21M08m27m4K18J16N2L46j57l3p5J00k69
3533e9K7K45n15L77k43J16K09O5l81K47k01Q1r5J03q0j52N6Q4K29r0j31J64j14
3556e8M12j96k42L69l78J45k29J96L6L13k25N7k79M6O3l58J63J90j34k20J51K89
3578A11l2j28m5j54n4j11K73J70Q8j34j30P6L64j51l03J14K6o1J42J3j26j66K44
3601B6k98J96N7j96K04k8jJ19k49J27K84l33n2L49k51j62J36k8J43J05j4j60J81
3624A55J05j99joJ1p9J9j16Qj02N78k74O0k82J91j69K27k98J7J35l2L44l07j37
$$ plain form
3648 -152 234 -81 110 370 97 -3 51 -41 -288 -112 -98 114 54 -38 -113 -12 -139 126 87 117 29 35 292 194
3672 194 7 -180 -16 124 -334 -56 80 106 -244 14 -2 -56 -148 -145 63 -19 444 -68 4 136 311 30 127
3695 127 24 246 -78 3 -45 -172 -183 0 32 292 92 62 249 -31 -100 -193 -94 149 -191 82 -204 219 35
3718 35 90 -128 -168 57 -93 -56 -80 285 7 -83 70 -145 -165 -67 48 33 337 139 24 129 -217 138 200
3741 200 -71 214 121 148 136 48 -33 -80 281 429 -94 258 -198 39 184 3 -221 -363 -48 -67 -279 -119
3763 -119 131 205 -153 30 17 28 182 282 -55 -386 328 29 -29 51 -164 -25 -169 225 352 267 42 146
3785 146 -121 -256 166 397 -290 155 49 -88 177 -209 228 -44 184 -230 259 -76 -92 -10 -10 -65 66 227
3807 227 247 -279 -113 -18 -155 -181 -90 45 -50 -137 241 -167 53 41 116 163 320 315 18 -134 189 53 61 337
$$ packed form
3648a52L86l15J91K60k73j00N4r2k47J76J4K12o0r2p5J01j27K65l9L0q8OK57r8
3672A94j87j87J64J40m58K78J36K6l50K58j6n4r2LK08q2M63n12P2J32J75k81R7
3695A27j03K22l24Q1m8j27j1J83L2K60k00l0J87k80o9r3R9K43l40K73k86M23j84
3718C5N5k18m0K25j50L7k4L65k78r0J53k15k0R8J15j5L04j98j15J05l46L55O2
3741B00k71K85r3K7j2q8q1m7L61J48n23L52m56K37J45j81k24j42L15j9k12J60
3763a19K50P4l58J83j3J1J54J00l37l31P14k99n8Q0k15J39j44L94J27q5k25J04
3785A46k67j35M22K31o87M45j06j37K65l86M37k72K28m14M89l35j6Q2%n5J31J61
3807B27K0n26J66R5j37k6R1J35r5q7L78m08K20j2P5M7J57nk97j52L23j36QK76
$$ plain form
3831 337 11 167 147 -4 -182 -192 -43 207 39 -18 80 41 -66 -59 14 -33 -12 35 213 -72 148 174 -167 102
3855 102 -143 -38 132 -121 -45 -94 -64 -32 118 232 -4 117 20 -23 169 152 -54 -121 537 -106 85 -240 185
3878 185 -6 3 418 -194 -13 26 -25 -200 44 -238 -105 246 -324 -24 -307 -78 -338 74 133 -66 320 25
3900 25 65 -55 84 190 170 325 102 115 423 -125 -66 -83 -119 74 35 -138 -3 141 205 -98 -109 89 -342
3923 -342 203 -25 -138 -95 -37 -91 -205 -224 194 154 -194 -151 -22 -53 -15 -281 14 -3 -375 50 34 -218 87
3946 87 -137 -34 35 -81 45 -117 -21 -249 -178 -153 157 36 -148 103 -45 -136 -185 16 28 -87 -82 351 -167
3969 -167 243 -31 180 -18 183 -73 -91 0 -42 127 -215 147 -10 75 214 63 -17 4 -64 226 108 61 342
3992 342 149 69 360 -47 41 -35 70 48 311 -230 3 -165 -145 -7 289 -227 -20 -24 140 119 -47 -70 -126
$$ packed form
3831C37l26J56k0j51j78j0J49K50j68n7R8l9j07PP3m7K1M7J78k85K20K6l41K69
3855A02k45J05J70k53P6m9L0L2J50J14k36J21r7m3J92j7k06o7O58o43J91l25M25
3878A85j91RM15o12J81L9n1j75K44k82J33L51n70L00k83K29k60M12N9j99L86k95
3900B5M0j20J39J06k0J55k23J3L08n48N9j7l6J93l9j73J35J44O4l03j1J98m31
3923c42N45k28j13M3N8n4j14j9M18m0l48M3J29l1L8k66K95j7l72M25j6k52L05
3946H7k24J03O9j16J26j62R6k28P1K5L10j21j84K51j48r1m9K01J2j15NM33n18
3969a67M10k74K11j98K01k56j8R1m2J69l42L62j57Q5J39j51q0K1o8K90j18m7K81
3992C42j93q0K91m07Q8p6J05k2K63n41K33j68K0J38K96n16K07mJ64k1j66k3n6
$$ plain form
4015 -126 97 -134 130 -249 25 314 -57 59 180 20 -57 8 -47 106 -167 57 55 -228 84 92 135 -297 26
4038 26 193 279 -86 -468 113 405 -284 31 104 150 -250 91 24 192 -255 -131 112 17 -428 36 -122 -348
4060 -348 54 59 -269 101 9 -68 66 -337 194 -79 -183 -18 93 -25 -29 -346 -125 -327 -46 117 -109 -287
4082 -287 162 16 -162 -13 135 30 -145 88 297 -139 -280 -115 162 77 -21 164 -1 231 -283 -217 46
4103 46 -289 -126 82 91 -76 -119 299 53 -76 210 -4 1 120 139 273 -188 -85 1 34 54 -205 -190 129 79
4127 79 4 206 -16 -241 -282 -186 17 -22 111 137 -117 -10 -148 33 -127 -39 -44 -47 -267 141 186 -134 -151 -67 20
4152 20 298 94 119 95 143 -25 278 2 -37 175 -125 92 -184 256 36 -212 -220 71 51 2 135 -309 8
4175 8 -265 -133 -90 65 76 -93 1 -111 31 60 -20 -142 -239 70 211 360 -135 -2 -47 -251 -81 -26 53 25
$$ packed form
4015a26K23k31K64l79K74K89l71J16J21j60p7O5n5J53k73K24kk83L12QM3m32L23
4038B6J67Q6l65l82N81K92o89L15P3M6m00L41o7J68m47J24K43r5m45M64j58k26
4060c48M02Nl28L70r2p7J34m03N31k73j04J65J11j18ml17K21k02K81J63k26j78
4082b87M49j46j78J49J48j05j75K33K09m36j41J65K77q5r8J85j65K32n14O6K63
4103D6l35J63K08Rj67m3M18k46j29K86k14NJ19J9J34m61J03Q6L3K0k59J5L19n0
4127G9p5K02k22k25m1R6K03l9J33K6k54J07j38J81j60Q8nlk20M08M5l20j7Q4Q7
4152B0K78k04K5k4M8j68L03k76l9K12l00K17k76M40k20k48qK91k0m9J33m44L17
4175Hk73J32M3J55J1j69R4j12J42K9q0j22r7L09J41J49m95J33m5k04J70N5P9k8
$$ plain form
4199 25 -226 88 140 42 113 -160 -131 -265 -84 170 -16 -169 9 -42 -77 149 38 -69 69 -175 -200 68 -69
4222 -69 96 220 -245 62 33 -7 28 0 -5 -257 119 107 -162 -307 3 -92 -200 -26 100 18 -64 41 -131 -178
4246 -178 37 62 -24 -12 -68 -69 78 301 -360 -299 162 135 -295 -112 -12 -72 -116 -39 -14 84 23 276 -83 -36 0
4271 0 -81 -108 -238 247 54 -168 -239 -103 -82 -23 -141 -79 18 91 56 -148 73 60 80 88 7 431 195 -220 -104
4296 -104 2 117 -136 -98 -51 28 189 96 -157 115 34 -183 45 -4 133 222 88 151 -100 -14 -170 93 -327
4319 -327 -272 140 -335 -132 -32 150 -62 -212 -16 21 175 -72 268 226 -76 -274 -61 -37 65 117 -112 63
4341 63 -274 175 165 -233 -129 36 135 115 18 -81 139 183 86 -75 -108 138 -67 -80 74 -16 -45 138 -189 7
4365 7 55 -13 328 -92 -321 -99 61 -96 -260 -167 -66 -54 -104 83 318 -124 212 -80 -125 -184 -77 -232 281
$$ packed form
4199B5k51L14N2r8P1k73K9j34J81K54j86j53J78n1l5K26j11j07J38k44k5K68j37
4222f9J65J24m65L07k9m0L5k8nk52L76j2k69j45L10r5j08J74J26q2q2J05j72m7
4246a78K15K5q6J2n6jJ47K23o61O1M61k7m30J83J00o0m4P7K5R8o1K53l59M7L6
4271@q1k7j30M85j93k22p1J36K1N9j18O2R7P3l5k04K21j3K0Qq1M24k36m15J16
4296a04J06J15k53L8M7P9J61r3k53K72q1k17K28m9J37Q9j34O3k51Q6j56K63m20
4319c27N5M12m75K03J00J82k12j50J96L7J54k47L40m2l02j98K13K4J02N2k29J75
4341F3l37M49j0l98J04J65R9k0r7r9K20M4r7j61l3K46k05j3J54r0k9J83l27J96
4365GM8o8L41m20k29K22J60j57j64R3J01J2n0J87K35m42L36k92m5n9J07j55N13
$$ plain form
4388 281 -100 -163 330 -152 121 -292 -37 411 -396 -153 101 86 151 55 -93 113 259 40 -213 -236 192 -79
4410 -79 66 159 136 87 11 18 -169 -272 71 -272 47 -131 -195 100 -14 -54 -163 -24 203 1 60 -166 -442
4433 -442 -79 -39 -141 78 3 -209 45 185 -75 170 220 122 120 323 57 -10 -28 -111 -411 29 -52 -32 137 309
4457 309 52 273 -315 127 149 34 109 -147 -176 -73 -3 -259 -103 -151 16 18 -198 -228 -143 184 -11 -291 -84
4480 -84 -17 -174 -104 -128 140 129 -252 276 77 1 34 159 190 133 72 -180 6 155 -242 -218 -299 -67 -115 249
4504 249 -14 102 -48 156 -161 -151 -164 375 -101 -29 -50 169 36 259 119 173 209 -86 62 4 146 69 -2
4527 -2 131 -87 -121 48 25 -66 -79 56 135 -167 57 191 -98 -196 -79 -16 349 33 47 72 28 -157 413 165
4551 165 -32 156 -14 233 -45 17 -127 -160 -199 321 -108 -240 89 -119 -103 35 -30 33 297 181 -305 -25
$$ packed form
4388B81l81o3M93m82K73m13K55M48q07K43K54j5O5r6j48K06J46k19k53k3M28k71
4410g9J45R3k3m9p6Pj87j03L43l43L19j78o4K95j14m0j09J39K27k02N9k26k76
4433d42L63M0j02K19p5k12K54J40k60K45N0r8kK03k66o7j8q3l00M40q1K0J69J72
4457C09k57K21n88M42K2j15P5k56k9J03P0k56J56m8J67Kk16l0Q5L27j95k80K07
4480h4O7j57P0k4K68j1l81N28j99p6L3J25L1n7o1k52J86J49l97K4q1K32m8L64
4504B49k63J16j50K04l17J0j3N39m76P2k1K19j33K23j40N4L6k95J48n8J42p7p1
4527bJ33k18l4J69k3r1j3J35P9l02K24J34k89r8J17O3L65l16J4K5m4j85N70k48
4551A65j97J88j70K47k78O2j44l3l9N20m29j32L29k08J6J38o5O3K64j16m86K80
$$ plain form
4573 -25 -50 249 -49 62 -271 -120 -91 -178 -334 -45 -50 271 -67 100 24 50 -125 4 188 88 50 -26 108
4596 108 -56 -15 74 -302 45 -142 -9 34 -184 -274 38 145 -334 10 69 38 -150 159 123 -32 318 55
4618 55 168 -141 110 -197 192 -21 -195 -162 -39 105 166 -395 187 247 -84 -101 139 -172 -158 -74 -69 223 -143
4641 -143 2 143 -391 -188 1 -165 36 96 32 -15 353 392 -294 -153 329 -93 -115 -52 -221 5 -198 139
4663 139 135 -3 -52 302 -91 -104 -116 -16 264 -83 -114 89 -13 -1 -41 291 17 215 116 -45 -49 168 -313 -240
4687 -240 -77 56 12 -175 168 -26 31 -169 -391 -12 340 -69 -27 -88 160 -179 -289 93 73 -87 -202 -258
4709 -258 55 101 -33 -100 -135 -420 -191 -183 -44 -21 -305 -22 -233 74 -147 53 -306 57 165 -109 -319 144
4731 144 -88 -9 90 100 -111 -43 133 -289 -6 92 43 -36 127 273 37 -117 175 210 -116 247 -50 41 -100
$$ packed form
4573b5k5K99k98J11l33J51K9q7j56K89nL21l38J67p6K6j75J29J84j00l8p6J34
4596A08j64M1Q9l76L47j87J33M3k18r0L12J07m79L44N9l1j88L09l6j55L50k63
4618E5J13l09K51l07L89k13j74L3J23J44O1n61N82O0l31j7K40l11J4Q4NK92l66
4641a43J45J41n34K03J89j66K01O0o4m7L68L9o86J41M82m22k2O3j69K26k03L37
4663A39mj38m9L54l93j3j2J00K80l47l1K03j02J2m0L32k74J98r9j61mK17m81P3
4687b40J63J33m4j87L43j94N7k00k22L79L52m09M2o1K48l39j10L82k0j60j15n6
4709b58L13M6j34o7l5k85K29QJ39K3k84K83k11L07k21K00l59L63J08k74k10M63
4731A44k32P9R9J0k11O8J76m22K83R8m9p9J63J46k36j54K92L5l26L63k97R1j41
$$ plain form
4754 -100 1 -15 60 -144 88 24 -77 -21 -316 196 67 -133 -76 -105 5 54 168 -41 -7 -36 -38 -257 -6 118
4778 118 18 -142 -46 93 24 -49 -257 -90 -272 161 -87 121 142 48 98 13 -116 287 -268 -119 -64 -216 282
4801 282 65 294 -13 -40 -75 341 21 319 93 -302 142 25 -51 -284 -81 -139 -66 -4 155 189 261 156 -379
4824 -379 -62 -224 183 -28 -182 -95 -72 214 -81 129 -102 -78 25 5 -143 -32 -65 153 112 -136 77 199
4846 199 -70 59 246 -288 -403 55 -30 104 88 100 -165 50 207 107 76 -150 90 -206 -2 180 89 -202
4868 -202 8 79 64 114 -205 121 -50 -1 6 199 21 87 -161 0 121 -50 -226 -267 -265 -263 -169 -37 134 -112
4892 -112 -178 -4 116 124 -22 158 -139 -132 196 134 110 -273 -93 480 150 -308 -32 -12 224 46 -278 35 -199
4915 -199 51 97 -14 -13 -119 -79 -24 -93 16 -56 -33 138 128 187 -246 34 251 -109 66 1 -104 190 -84 96
$$ packed form
4754a00J01j6P5k04K32o4j01N6k95N12j29k00N7k9J10M9J14k09L4k9kk19K51J24
4778A18j00j60R6J39o9p3k08J67j82M33k48K08K1r4N0q5j29M03n55J49N5j52M98
4801B82k17K29l07k7l5M16l20K98k26l95M44j17p6k33K03n8P3O2J59L4P2j05n35
4824c79L17j62M07k11j54Q7K3K86k95K10k31K4J03k0j48J11l3K18m1k48K13J22
4846A99k69J29J87n34j15M58q5J34j6J2k65K15J57j00l1k26K40k96K04J82r1k91
4868b02K10P1j5N0l19L26j71M9PJ93j78O6k48J61J21j71j76m1KKR4J32J71k46
4892a12o6J74J20Qj46J80k97PL28o2k4l83J80N73l30m58K76K0K36j78l24L13k34
4915a99K50M6j11Jj06M0N5o9J09p2K3J71j0N9m33K80K17l60J75o5j05K94k74J80
$$ plain form
4939 96 203 -37 404 69 28 -153 131 -36 -196 -362 116 65 -2 -101 0 -187 -56 -45 114 -241 326 -50
4961 -50 199 82 140 -237 -168 345 63 -29 178 39 151 -4 80 -32 -148 124 -5 -254 -113 -96 57 -61
4983 -61 64 70 61 -255 -83 -195 11 -106 -104 -181 -25 76 -94 2 -282 -248 -88 22 -25 170 83 215 25 -52
5007 -52 89 -201 -156 -201 84 -50 327 243 -557 118 -225 129 -1 -343 75 127 163 -35 129 -130 -335 -413
5029 -413 99 31 203 -208 17 333 -6 31 117 -40 -72 -1 179 177 7 -9 166 133 387 29 -106 31 -228
5052 -228 63 287 -10 -286 -92 -162 -99 -57 84 110 124 -96 111 -131 243 -257 -54 -225 -163 1 123 -67
5074 -67 159 244 263 -24 -245 -118 -49 -175 -71 -40 39 22 120 -197 -236 55 234 -15 70 376 -174 -129 248 95
5098 95 -80 19 -30 102 -113 -76 -45 -44 -133 80 -73 -96 -48 -235 -139 -329 141 -92 -160 193 -332 -231 250 -293
$$ packed form
4939I6J07k40M41l35m1j81K84j67j60j66M78n1o7r9J01j87J31J1J59l55N67l76
4961e0K49j17N8l77O9N13k82r2K07j39J12j55Q4j12j16K72j29k49J41J7J53j18
4983f1J25Orl16J72j12K06j17Kp7J56J01j70R6k84L4J60J10m7J95q7J32j90p7
5007e2J41k90M5m5K85j34L77q4q00O75l43L54j30l42M18N2L6j98J64k59k05p8
5029d13N12o8J72m11K25L16l39L7Q6j57l2P1J80kj70j6J75l3K54l58j35J37k59
5052b28K91K24k97k76J94p0O3M2J41K6J4k20K07k42L74n00K03j71O2J64J22j90
5074f7K26Q5J9k87k21J27O9j26J04L1P9j7R8l17l9K91J79k49Q5L06n50M5L77j53
5098I5j75R9m9J32k15L7L1Jq9K13j53k3M8j87R6j90M70k33o8L53n25J01M81n43
$$ plain form
5122 -293 229 -202 -13 -6 11 65 56 -50 8 154 -55 -4 -69 15 -87 109 311 -82 -138 326 127 153 145 81 -239
5147 -239 292 35 196 -16 31 438 265 61 -75 156 181 -80 80 -52 -192 128 -324 58 220 206 -135
5168 -135 92 -53 -101 -179 -167 7 6 -219 18 -69 -239 -279 192 236 207 -155 -137 -267 107 56 94 289 -34 -88
5192 -88 4 167 119 138 -5 -301 -233 128 -126 -105 -93 -133 200 248 129 269 27 -215 255 121 85 -42 91
5215 91 -111 297 47 -106 -234 -1 191 -18 71 -168 -274 543 -272 -44 -182 -91 102 150 -61 -160 21 -240
5237 -240 -248 25 102 32 57 -80 -76 178 -179 -81 204 -111 111 111 -175 -55 -112 107 -158 -9 -30 -52 -129 82 -171
5262 -171 -101 -65 -68 -64 -182 -40 -117 -36 -118 -106 -95 -191 -202 -255 -73 -11 -34 42 -4 202 129 20 -221 114 25 -10 -67
5289 -67 47 -79 156 161 21 -53 -275 -359 69 -330 67 196 -110 88 82 -199 -267 8 164 -52 -166 98 -142
$$ packed form
5122b93N22m31J89PJ7N4rj06N8J46k09N1o5Q4j02J96K02l93n6M64j99K6qo4l20
5147b39N31k57J61k12M7M07j73k04j36K31K5k61J60j32j40L20m52L82J62j4l41
5168a35K27j45m8p8J2J74jk25K37q7j70m0M71M4k9l62J8j30L74n1L8J95l23n4
5192h8R2J63m8J9j43k96O8L61k54K1J2m0L33M8j19J40k42k42M70j34l6j27J33
5215I1k02M08k50j53j28K33J92k09Q9k39j06Q17q15K28j38R1J93M8k11r9J81k61
5237b40qK73P7p0K5j37MK54l57R8K85l15K22%k86J20n7K19k65J49k1k2p7K11k53
5262a71P0L6lMj18J42p7Q1q2J2J1r6j1n3J82O2k3P6m6K06p3j09k41L35q9l5n7
5289f7J14j26K35Nj40p4k22q4M28l99L97J29l06J98ok81o8K75J56k16j14K64k40
$$ plain form
5312 -142 259 12 126 -4 292 -32 -9 134 -93 125 -173 -169 35 -50 108 -201 -147 -194 378 70 52 59 1
5335 1 159 -357 -21 -187 -13 84 91 228 32 -69 -213 -286 48 25 -99 -212 75 -49 178 109 241 -17 -13
5358 -13 -81 42 137 -200 -13 -125 87 425 262 43 -318 -306 5 14 -121 167 29 -180 67 -129 -78 -18 236
5381 236 -155 55 50 48 -107 32 283 -68 -115 33 -146 171 -75 43 195 217 -330 100 28 76 -98 -107 30
5404 30 256 -144 -121 5 117 -424 80 311 55 -139 -216 43 195 101 36 119 -169 -50 32 -49 -235 143 116
5427 116 37 -48 55 84 253 146 -248 127 230 118 -86 34 90 -200 -45 1 109 -48 36 -77 -49 -234
5449 -234 -44 -114 328 344 -87 -33 81 -84 64 -66 -265 52 72 -39 -151 -119 110 13 317 -146 -3 -63
5471 -63 -606 -79 -109 -161 43 228 -7 102 -152 -50 258 313 306 -241 -150 -41 -163 -95 135 -47 -284 -244 53
$$ packed form
5312a42M01k47J14j30K96l24K3J43k27K18k98MK04q5J58l09N4m7N72l08j8Pn8
5335AJ58n16L36j66J74R7PJ37j96j01j44p3L34k3j24j13K87j24K27o9J32k58M
5358a3o8J23R5l37J87j12K12L38j63k19l61J2L11Rj35K88j38k09K47j96N1O0K54
5381B36l91K10nkj55J39K51l51m7J48j79L17k46J18J52K2n47M30p2M8j74rJ37
5404C0K26m00K3J26J12n41N04K31k56j94p7K59J52r4o5Q3k88J19Q2q1j86L78k7
5427A16p9q5J03K9J69j07l94L75J03j12k04J20N6k90J55M6J08j57Q4j13K8j85
5449b34J90p0M42J6m31N4J14j65J48j30j99L17K0j11j12L2K29r7L04m63J43o0
5471f3n43N27l0n2K04J85k35J09k54J02L08N5pn47R1J09j22O8K30j82k37M0K97
$$ plain form
5494 53 140 246 -248 -64 157 83 141 -37 -30 -123 -170 121 150 -210 72 -253 137 -49 -292 -22 -313 -63 97
5517 97 71 4 -38 42 -154 68 62 -83 -173 -42 273 256 -60 122 25 -2 9 -10 113 -47 148 12 172 97 -196
5542 -196 -6 143 -62 -100 28 74 -119 67 -25 82 -357 201 -56 -29 -59 -247 97 20 -60 -35 300 129 -206
5565 -206 97 143 93 -113 42 111 76 -141 -65 -140 -114 288 94 -70 56 61 207 259 113 -155 -43 46 -396 252
5589 252 26 -207 -46 -117 -242 36 6 14 -10 119 91 -128 64 -118 -82 -208 5 -31 -53 -109 196 -176 2
5612 2 -118 155 108 -239 262 -7 40 -93 449 108 55 131 -33 39 33 288 -10 136 -93 -172 102 101 61 100 -275
5637 -275 121 -287 -4 156 -9 220 227 359 -94 180 47 120 11 -129 -122 63 174 -185 -140 -257 -193 -17
5659 -17 -90 359 193 -219 33 -164 118 196 70 14 -38 -74 -202 -159 -56 63 -98 -263 186 258 169 -374 107
$$ packed form
5494E3Q7J06m94J84K21p4N8j78Pr3m7K91K9l60K82l25L90j86k43K70k91K50J60
5517I7k6o7m2Q0j96K22oj45r0J31L15j7l16J82r7k7J1j9J23j60J95j36J60p5k93
5542a96J90J49k05l8J28M6j93J86r2J07m39N58k57K7l0j88L44p7q0K5L35j71l35
5565b06L03M6n0k06J55O9l5k17P6p5K6M02j94j64J26NJ46N2j46k68J12Q9m42O48
5589B52k26k33J61p1j25K78l0Qk4J29k8k19J92j82L6j26K13l6k2n6L05l72J78
5612Bj20K73m7l47N01k69M7j33N42l41n3P6j64P2oK55k98J46k29p9K74jm0L9l75
5637b75L96m08K83J60j65K29PJ32m53K74j33P3j09j40PJ85J11l59M5j17O4J76
5659a7p3M49j66m12K52j97K82P8j26n6n2l6j28M3J03J19j61j65M49P2q9n43M81
$$ plain form
5682 107 62 -41 -73 187 -166 51 -104 -116 -18 -205 -23 -41 320 58 -81 -81 -51 45 141 -101 238 -12 -140
5705 -140 191 -77 -5 -34 131 -38 -24 315 87 294 138 -209 101 261 32 -121 -24 34 -51 220 206 3
5727 3 33 53 289 62 -24 151 51 -158 -139 191 141 80 -152 -108 15 -11 -44 -315 227 -175 119 -154 203 14
5751 14 64 114 78 65 -437 65 -246 -84 -165 7 -108 -138 49 177 -254 -128 -21 237 89 161 48 11 -35
5774 -35 -42 7 -307 121 252 157 -97 -198 175 -50 17 358 -7 -297 -110 -43 -374 -99 109 -52 -130 194 -279
5797 -279 122 106 -7 40 215 -81 -138 142 -72 -112 -190 96 29 54 3 228 -49 -154 -167 93 -6 56 -257 -43
5821 -43 244 -105 -223 -16 163 11 -135 -155 66 -131 257 -137 -101 338 331 227 9 -443 244 33 379 64
5843 64 157 -148 6 6 -66 -85 95 -21 -46 144 65 -225 164 -7 -19 -201 126 -21 372 -286 106 -33 -6
$$ packed form
5682A07m5j03l2K60l53K17j55j2R8j87J82j8L61k62j39%L0R6R6k42L39k50j28
5705a40L31k68P2k9J65j69J4L39k28K07j56l47L10J60k29j53R7N8q5K71j4k03
5727CL0K0K36k27q6J75j00k09J9L30n0o1k32M4J23k6l3k71N42m02K94k73L57j89
5751A4N0N0l6j3n02N02l11J62q1J72j15l0J87J28m31J26J07K58j48P2j13l7m6
5774c5pM9l14M28J31r5k54j01L73k25O7L41l65k90J87O7l31K75K08j61p8L24m73
5797b79M01j6j13M7J75k96n7K80k14m0p8K86o7K5n1K25k77j05j3K60r9O2l13K14
5821d3K87l49j18K07J79j52j46k0K21j97L88l94L6M39pj04k18m52O87k11L46l15
5843F4R3l05J54%p2j9J80j16k5J90p9k90L89j71j2j82L27j47L93o58L92j39K7
$$ plain form
5866 -6 -7 -200 83 209 35 17 122 95 -114 -150 86 21 -321 45 169 217 8 -493 -170 -98 -166 20 230 -116
5890 -116 -155 61 117 -306 -104 -82 -81 209 167 129 18 -247 -107 125 -71 -4 162 84 -341 334 41 82 34 304
5914 304 -15 -130 4 71 197 37 72 -156 -89 -119 22 -117 53 -99 -87 105 -322 38 45 -201 -110 -106 -94 170
5938 170 94 -217 -133 148 46 211 -42 227 -229 139 -123 -134 403 180 14 -113 272 151 212 -9 -95 127
5960 127 -326 -106 -1 112 -159 -206 309 118 164 -59 -9 -78 227 94 -110 -216 64 -21 -180 366 226 -251
5982 -251 -171 -174 76 -128 -147 59 -237 133 80 -84 -62 117 61 -20 -25 -35 164 -124 -86 -78 442 115 -70 133 -25
6007 -25 -38 -124 356 -200 89 -51 192 -284 -71 -170 85 -56 82 -155 162 -25 -14 28 -106 95 94 46 -117
6030 -117 -140 -130 -1 255 105 -144 -231 423 -69 104 -169 -46 -8 100 160 -93 -121 148 153 -93 103 -7 12
$$ packed form
5866fjj93K83J26j74j8J05k7k09l6K36o5l42L66J24M8k09n01L23P2o8J86K10l46
5890a16l9K16N6m23K02K2JK90m2l8j11k65J40K32j96O7J66p8m25O75k93M1m8K70
5914C04l19j15J34O7J26j60L5k28O7l0J41j39J70j52J2J92m27L60Pk46R1MJ2K64
5938A70p6l11Q4K81j02J65k53K69m56L68k62j1N37k23j66j27L85j21O1k21q6K22
5960A27m53K20J05J13k71m7N15j91M6k23N0o9L05j33k04j06K80q5j59N46j40m77
5982b51Q0lK50k04j9K06k96L70n3j64K2J79n6q1nj0J99k88L8QN20l27j85K03j58
6007b5j3q6M80n56K89j40K43m76K13r9K55j41J38k37L17j87J1M2j34K01jm8j63
6030a17k3J0J29K56j50k49q7O54m92J73k73J23L8J08O0k53k8K69Nk46J96j10J9
$$ plain form
6053 12 45 -31 -112 40 356 -81 -36 -53 -118 389 -152 -141 14 102 308 -27 63 -96 217 117 151 27 195 150
6077 150 240 -185 245 118 128 264 27 -149 74 109 283 19 316 132 0 55 -124 161 -104 -165 -35 292
6099 292 171 143 131 -97 23 128 -146 39 -1 175 59 -221 130 168 -119 -31 203 194 -71 -160 -80 158 20
6122 20 33 -210 102 -68 -40 -97 77 271 6 264 -37 -187 57 230 -141 -59 -1 -11 -20 249 -72 -12 214
6145 214 35 46 52 278 37 19 524 43 98 -22 33 174 -88 24 -171 16 409 50 17 -107 179 78
6167 78 105 -189 -159 -43 -215 76 -126 299 -152 66 138 263 199 -140 88 -15 -163 86 -131 203 -27 123
6189 123 -6 319 -78 -235 154 193 -121 -244 -5 -305 204 99 -105 38 -58 38 51 -76 214 296 92 7
6211 7 -79 -160 66 189 129 -142 177 334 34 59 73 -131 -213 -57 164 -192 52 -107 -133 146 -22 22 -105
$$ packed form
6053A2L3p6q1J52L16m37M5j7o5N07n41J1J55Q8K06l35R0j59L13j00L4j24J68m5
6077A50R0m25M30j27J0J36k37j76K23L5J74k64K97j84j32N5j79K85k65o1J30L27
6099B92j21k8j2k28J20J05k74J85m0J76j16k80L51L8k87Q8K34rk65q9Q0K38j38
6122B0J3k43L12j70K8n7J74J94k65K58l01j50K44J73l71Q2N8j0rK69l21O0K26
6145B14j79J1OK26k41j8N05m81N5j20N5J41k62J12j95J87L93l59l3j24K86j01
6167G8K7k94L0J16j72K91k02M25m51K18P2J25o4l39K28j03j48K49k17L34k30J50
6189A23j29L25l97j57L89L9l14j23K39l00N09j05k04J43r6R6J3j27K90Q2k04q5
6211Gq6q1K26J23o0k71L19J57l00K5J4k04q2J56K21l56K44j59k6K79j68M4j27
$$ plain form
6234 -105 160 239 -223 229 -137 193 -62 -209 -36 41 173 116 156 -16 145 -4 72 56 53 -98 64 286 -38
$$ packed form
6234a05K65P9m62M52l66L30k55j47J73P7J32n7M0j72J61j49P6j6lj51J62K22l24
$$ [...]
8191c9
##END NTUPLES=NMR FID
##END=
