##TITLE=1H_DE-63_32
 D2O
 8 sc, 
 13.8.2024
##JCAMPDX= 6.0         $$ Bruker NMR JCAMP-DX V2.0
##DATA TYPE= NMR FID
##DATA CLASS= NTUPLES
##ORIGIN= UXNMR, Bruker Analytische Messtechnik GmbH
##OWNER= root
$$ XWIN-NMR		Version 3.5
$$ Tue Aug 13 16:52:07 2024 Russian Standard Time (UT+4h)  she@DPX200
##.OBSERVE FREQUENCY= 200.1313
##.OBSERVE NUCLEUS= ^1H
##.DELAY= (6, 6)
##.ACQUISITION MODE= SIMULTANEOUS
##.ACQUISITION SCHEME= undefined
##.AVERAGES= 8
##.DIGITISER RES= 18
##SPECTROMETER/DATA SYSTEM= spect
##.PULSE SEQUENCE= zg30
##.SOLVENT NAME= DMSO
##.SHIFT REFERENCE= (INTERNAL, DMSO, 0, 15.7039)
##AUDIT TRAIL= $$ (NUMBER, WHEN, WHO, WHERE, WHAT)
$$ ##TITLE= Audit trail, XWIN-NMR		Version 3.5
$$ ##JCAMPDX= 5.01
$$ ##ORIGIN= Bruker BioSpin GmbH
$$ ##OWNER= she
$$ F:/spectra/data/she/nmr/H-F/1/audita.txt
$$ ##AUDIT TRAIL=  $$ (NUMBER, WHEN, WHO, WHERE, WHAT)
(   1,<2024-08-13 16:51:12.17 +0400>,<she>,<DPX200>,
      <created by zg, POWCHK disabled, PULCHK disabled
       configuration hash MD5:
       00 E9 B6 7A A2 85 ED C7 34 08 36 98 17 FE 4E 26
       data hash MD5: 16K
       B4 14 0C AC 6D D6 CC ED 71 65 D5 1A 71 B7 C4 93>)
$$ ##END=
$$ 
$$ hash MD5
$$ 53 EC CF 15 86 EC DF 4F 78 2B 5B FA 3C F2 4E A2
##$RELAX= 
##$RELAX= 
##$RELAX= 
##$RELAX= 
##$RELAX= 
##$RELAX= 
$$ Bruker specific parameters
$$ --------------------------
##$DU= <F:/spectra>
##$EXPNO= 1
##$NAME= <H-F>
##$PROCNO= 1
##$TYPE= <nmr>
##$USER= <she>
##$AMP= (0..31)
100 100 100 100 100 100 100 100 100 100 100 100 100 100 100 100 100 100 
100 100 100 100 100 100 100 100 100 100 100 100 100 100 
##$AQSEQ= 0
##$AQ_mod= 1
##$AUNM= <au_zg>
##$AUTOPOS= <>
##$BF1= 200.13
##$BF2= 200.13
##$BF3= 200.13
##$BF4= 200.13
##$BF5= 200.13
##$BF6= 200.13
##$BF7= 200.13
##$BF8= 200.13
##$BYTORDA= 1
##$CFDGTYP= 0
##$CFRGTYP= 5
##$CHEMSTR= <none>
##$CNST= (0..31)
1 1 145 1 1 1 1 1 1 1 1 1 1 1 1 1 1 1 1 1 1 1 1 1 1 1 1 1 1 1 1 1 
##$CPDPRG= <>
##$CPDPRG1= <>
##$CPDPRG2= <>
##$CPDPRG3= <>
##$CPDPRG4= <mlev>
##$CPDPRG5= <mlev>
##$CPDPRG6= <mlev>
##$CPDPRG7= <mlev>
##$CPDPRG8= <mlev>
##$CPDPRGB= <>
##$CPDPRGT= <>
##$D= (0..31)
0 1.2 0 0 0 0 0 0 0 0.06 0 0.03 0 0 0 0 0.0002 0 0 0 0 0 0 0 0 0 0 0 0 
0 0 0 
##$DATE= 1723553471
##$DBL= (0..7)
120 120 120 120 120 120 120 120 
##$DBP= (0..7)
150 150 150 150 150 150 150 150 
##$DBP07= 0
##$DBPNAM0= <>
##$DBPNAM1= <>
##$DBPNAM2= <>
##$DBPNAM3= <>
##$DBPNAM4= <>
##$DBPNAM5= <>
##$DBPNAM6= <>
##$DBPNAM7= <>
##$DBPOAL= (0..7)
0.5 0.5 0.5 0.5 0.5 0.5 0.5 0.5 
##$DBPOFFS= (0..7)
0 0 0 0 0 0 0 0 
##$DE= 6
##$DECBNUC= <off>
##$DECIM= 24
##$DECNUC= <off>
##$DECSTAT= 4
##$DIGMOD= 1
##$DIGTYP= 9
##$DL= (0..7)
0 120 120 120 120 120 120 120 
##$DP= (0..7)
150 150 150 150 150 150 150 150 
##$DP07= 0
##$DPNAME0= <>
##$DPNAME1= <>
##$DPNAME2= <>
##$DPNAME3= <>
##$DPNAME4= <>
##$DPNAME5= <>
##$DPNAME6= <>
##$DPNAME7= <>
##$DPOAL= (0..7)
0.5 0.5 0.5 0.5 0.5 0.5 0.5 0.5 
##$DPOFFS= (0..7)
0 0 0 0 0 0 0 0 
##$DQDMODE= 0
##$DR= 18
##$DS= 0
##$DSLIST= <SSSSSSSSSSSSSSS>
##$DSPFIRM= 0
$$ [...]
##$SUBNAM2= <"">
##$SUBNAM3= <"">
##$SUBNAM4= <"">
##$SUBNAM5= <"">
##$SUBNAM6= <"">
##$SUBNAM7= <"">
##$SUBNAM8= <"">
##$SUBNAM9= <"">
##$SW= 24.0689771365484
##$SWIBOX= (0..15)
0 0 2 0 0 0 0 0 0 0 0 0 0 0 0 0 
##$SW_h= 4816.95568400771
##$TD= 16384
##$TD0= 1
##$TE= 0
##$TE2= 300
##$TE3= 300
##$TEG= 300
##$TL= (0..7)
0 120 120 120 120 120 120 120 
##$TP= (0..7)
150 150 150 150 150 150 150 150 
##$TP07= 0
##$TPNAME0= <>
##$TPNAME1= <>
##$TPNAME2= <>
##$TPNAME3= <>
##$TPNAME4= <>
##$TPNAME5= <>
##$TPNAME6= <>
##$TPNAME7= <>
##$TPOAL= (0..7)
0.5 0.5 0.5 0.5 0.5 0.5 0.5 0.5 
##$TPOFFS= (0..7)
0 0 0 0 0 0 0 0 
##$TUNHIN= 0
##$TUNHOUT= 0
##$TUNXOUT= 0
##$USERA1= <user>
##$USERA2= <user>
##$USERA3= <user>
##$USERA4= <user>
##$USERA5= <user>
##$V9= 5
##$VALIST= <valist>
##$VCLIST= <CCCCCCCCCCCCCCC>
##$VD= 0
##$VDLIST= <DDDDDDDDDDDDDDD>
##$VPLIST= <PPPPPPPPPPPPPPP>
##$VTLIST= <TTTTTTTTTTTTTTT>
##$WBST= 1024
##$WBSW= 4
##$XGAIN= (0..3)
0 0 0 0 
##$XL= 0
##$YL= 0
##$YMAX_a= 151409
##$YMIN_a= -134005
##$ZGOPTNS= <>
##$ZL1= 120
##$ZL2= 120
##$ZL3= 120
##$ZL4= 120
##$ABSF1= 10
##$ABSF2= 0
##$ABSG= 5
##$ABSL= 3
##$ALPHA= 0
##$AQORDER= 0
##$ASSFAC= 0
##$ASSFACI= 0
##$ASSFACX= 0
##$ASSWID= 0
##$AUNMP= <proc_1d>
##$AZFE= 0.1
##$AZFW= 0.1
##$BCFW= 1
##$BC_mod= 2
##$BYTORDP= 1
##$COROFFS= 0
##$CY= 11.3945322036743
##$DATMOD= 1
##$DC= 2
##$DFILT= <>
##$DTYPP= 0
##$F1P= 15.6554695791079
##$F2P= 12.8336369535428
##$FCOR= 0.5
##$FTSIZE= 0
##$FT_mod= 4
##$GAMMA= 1
##$GB= 0.15
##$INTBC= 1
##$INTSCL= 1
##$ISEN= 128
##$LB= 0.24
##$LEV0= 0
##$LPBIN= 0
##$MAXI= 10000
##$MC2= 0
##$MEAN= 0
##$ME_mod= 0
##$MI= 1.114404
##$NCOEF= 0
##$NC_proc= 0
##$NLEV= 6
##$NOISF1= 3.799351
##$NOISF2= 2.8
##$NSP= 1
##$NTH_PI= 0
##$NZP= 0
##$OFFSET= 15.70392
##$PC= 1
##$PHC0= -25998.28
##$PHC1= 7.98748
##$PH_mod= 1
##$PKNL= yes
##$PPARMOD= 0
##$PSCAL= 0
##$PSIGN= 0
##$REVERSE= no
##$SF= 200.130013532006
##$SI= 16384
##$SIGF1= 3
##$SIGF2= 2
##$SINO= 400
##$SIOLD= 16384
##$SREGLST= <1H.CDCl3>
##$SSB= 0
##$STSI= 0
##$STSR= 0
##$SW_p= 3612.71676300578
##$SYMM= 0
##$S_DEV= 0
##$TDeff= 0
##$TDoff= 0
##$TI= <>
##$TILT= no
##$TM1= 0
##$TM2= 0
##$TOPLEV= 0
##$USERP1= <user>
##$USERP2= <user>
##$USERP3= <user>
##$USERP4= <user>
##$USERP5= <user>
##$WDW= 1
##$XDIM= 8192
##$YMAX_p= 0
##$YMIN_p= 0
$$ End of Bruker specific parameters
$$ ---------------------------------
##NTUPLES= NMR FID
##VAR_NAME=  TIME,          FID/REAL,        FID/IMAG
##SYMBOL=    X,             R,               I
##VAR_TYPE=  INDEPENDENT,   DEPENDENT,       DEPENDENT
##VAR_FORM=  AFFN,          ASDF,            ASDF
##VAR_DIM=   8192,          8192,            8192
##UNITS=     SECONDS,       ARBITRARY UNITS, ARBITRARY UNITS
##FACTOR=    0.0002076,     1,               1
##FIRST=     0,             0,               0
##LAST=      1.7004516,     0,               0
##MIN=       0,             -134005,         0
##MAX=       1.7004516,     151409,          0
$$ Real data points
##PAGE= N=1
##DATA TABLE= (X++(R..R)), XYDATA
$$ [...]
1902b23M13j9m52J74m22L86R8L04q5j90j13J89K88Ql96N7j7J66K34k52k34q1q1
1925b48K79K67k40k62j22N24K00n99Lj92J55N88j89L3k39j82L06K3j50j9k54L17
1947aK61j55J2k14k13K34N18Km45n9K39n19J40K84p6j08k76M92l5J54l5o48K21
1970b27R0K76K86k29m08L63n7J22k0l40l35N02m4o3K29k43L61j71J43j87r3j99
1992b44L55k60L63l15k33L53j40J38J99k71O5m97M37K23J31n38J34l1J87J88j85
2013E9j18m6M67j93L09k95m36P1L15N15n03j16k60J06K25K49l34k41J10L4J66
2034H4R8k82j49K06N9J22L3m71K66j52K72J70m87J75l65L01J98J18j55M0k86K73
2056F8J40o8k4m76K20R2K89k32k26J56j52N30n61P7N3J55n4N3m2l60L73p7J16
$$ plain form
1902 -223 190 171 -281 -107 -529 -143 -45 259 174 -16 -129 60 348 356 -40 17 0 166 400 148 -86 -167 -248
1925 -248 31 298 58 -204 -326 198 398 -201 -198 -390 -235 353 164 197 -42 -224 82 105 -45 -64 -318 -1
1947 -1 260 105 117 -97 -310 -76 442 444 -1 -60 179 -340 -200 84 8 -100 -376 116 81 235 200 -448 -227
1970 -227 -137 139 425 196 -212 151 94 216 196 -144 -479 23 -21 -84 145 -98 263 92 235 48 -45 -244
1992 -244 111 -149 214 -101 -334 19 -121 17 216 -55 10 -487 -50 173 304 -234 -100 -131 56 244 59
2013 59 -59 -105 362 169 478 183 -253 -182 133 648 145 29 -231 -125 100 349 15 -226 -116 -82 84
2034 84 182 -100 -249 -43 16 138 171 -300 -34 -186 86 256 -231 -56 -421 -120 78 196 41 81 -205 68
2056 68 208 140 116 -360 -140 -48 241 9 -217 -61 -213 317 -244 -167 -114 41 -13 40 -2 -362 11 -66 50
2079E0K5P9k64p2O1N08k01k67o2L65k47K9j25L55o44J14K84N7J12l29L30j83J94
2102A69L5l25N6m48L17K27M9j86j03J30n5M73o4n79K41R9j13O4J80j01j88m9L88
2125B17J94k49l40j68L57J45Nl15R5j9K72J49l02J56r3k16L26j39n6q9k27L99
2147A02J93k51j18O5m4KK15n8k53j22J72K70J86m4m21j71N51k73L48j92l15L7
2169a21J32k21K05k39J46p4M20j86J12n00K66l6K54lj70k4J76k9r0j73J14K53
2191B12k51o1K16j56q1j7K6K37k35J30k45K95j84J54K3J87l86m4J76O8l3m5l34
2214c48M98k75M60k03l94M27J73k01j60M0j77O2P2J52j08J77l93R1N5L89m26J79
2236I0l91J75L76j84L6l71R0J69M17n03J12j9k14L83j90J48j79L3J76j98J89k28
$$ plain form
2079 50 75 154 -110 -182 -121 387 186 -81 -143 222 -25 4 -121 234 -410 -296 -12 45 157 -172 158 -25 169
2102 169 204 -121 -65 -513 -196 31 80 -106 -209 -79 -134 339 275 -304 -63 36 -77 -13 167 66 -122 -171 217
2125 217 411 162 -178 -346 11 156 161 -154 -59 -78 194 343 41 197 104 -112 214 75 19 -70 -297 102
2147 102 295 44 -74 -9 -53 -51 164 106 -147 -269 -97 173 359 315 -106 -277 274 1 349 157 -158 -121
2169 -121 11 -210 -5 -244 -98 -172 248 62 174 -326 -60 -96 158 155 -15 -39 137 108 18 -155 -41 212
2191 212 -39 -100 116 -40 -121 -138 -112 125 -110 20 -225 70 -114 40 63 250 -136 -180 -4 64 31 -14 -348
2214 -348 150 -125 335 132 -262 165 338 137 -23 17 -160 -98 -26 126 18 195 -198 -107 -52 337 -89 90
2236 90 -301 -126 250 66 102 -269 -179 -10 407 -96 16 -3 -217 166 -24 124 -55 -22 154 -44 145 -83
2258h3o1j9Q7J89j46R6J32k08k47L61rl63K24j24n1j50K66M2Q4P0k26K73J32m04
2282a35J22J46k55n6K57j41L68k2k20j58j22J50q5R5nj20R9J13Kj15l8j45L09
2305D4j9P0r3j99K14j44K41m8k19J28L3o6K36Rj18k17k36L64N5o2Rj61J04j3K81
2330A93j97r9j0j4N43k21J63n26M78l50K10R4k19j95p0J06J20r3l17O56l17J99
2352A34j12j0q5j0R8L4p1L5p5j43L32k44q5K43j51J79q2K76l08L34l54l60L46
2375g9K2K32n92N78N5j47o6j01j31J53k6j51M67l29q0M12k57L84l64J48j8k14
2397a04L08r3J47n40K72j7N9O3m6q0o5k18M78k93K70k51q1L32j29j31Q0J56Rj8
2421A08k50K72k78J1K51ok3Q7j92J65L05k27m0l43k56K87j74M18j10P5n5m4j12
$$ plain form
2258 -83 -144 -163 -76 113 -33 63 195 -13 -260 101 92 -271 -47 -171 -222 -372 -106 -64 20 90 -136 137 269 -135
2282 -135 -13 133 -122 -178 79 -62 306 284 64 -94 -216 -66 -151 -56 -61 -181 -82 31 33 -82 -120 -265 44
2305 44 25 95 2 -197 17 -127 114 66 -153 -25 8 -58 178 187 69 -148 -384 -20 35 -27 -18 -179 -75 -88 193
2330 193 -4 -103 -113 -127 416 195 358 -168 310 -40 170 264 45 -150 -220 -114 6 -87 -404 252 -65 134
2352 134 22 12 -73 -83 15 49 -22 13 -62 -205 127 -117 -202 41 -110 69 -13 263 -45 289 -65 -425 -79
2375 -79 -57 175 -417 161 216 69 3 -98 -229 -76 -102 -253 214 -115 -195 217 -40 344 -20 128 110 -104
2397 -104 204 111 258 -282 -10 -27 32 95 49 -31 -96 -314 164 -129 141 -110 -191 141 12 -119 -39 117 126 108
2421 108 -142 130 -148 -137 114 108 85 172 -20 145 450 223 183 -160 -416 -129 -303 115 5 80 25 -19 -131
2444a31L44j33j13Q7K14j20k52r4M0K71L96l20k91J57j2j32k0K%Q1K91k94j2J83
2468A42l29k28N13J64j80pK21l71K74K4m04k0N04l04O6J8L29k21l30q9L39l29
2490b18P6L53k24p9Q8K0j77K6l3L33j71k55P7J18o7J59K02j01k45K38L6j5k78
2513a37k86N41l6JJ07r1k35j28L33k97K92J17j94K9J36k30L5K85n77K49p1L08
2535A51K2l30m3J62J6O5k34N5N10l29k12L97l35k36K56J55k8%j22r2K41l3k44
2558b08K83K1k49q3K09N8K83k26k83K30r3j11R5%Q0k9%K95n46L82j20P2k43N9
2582a24J20J52k54J18J20k52M28m98L09k9j19r2j43N10k39L8j11k2n7J61k62J14
2604a32K79Jr1J05j75j32J71k74k06N40lJ3j64n9j1J49j97j52J89R1J40J14j80
$$ plain form
2444 -131 213 80 -33 54 268 148 -104 -198 -158 113 509 189 -102 55 43 -89 -109 -107 -107 -26 265 -29 -41 142
2468 142 -187 -415 98 262 82 75 296 -75 199 223 -181 -201 303 -1 65 83 412 191 -139 -228 111 -218
2490 -218 -142 211 -13 -92 -4 16 -161 -135 -168 165 -6 -261 -184 -66 -133 26 228 127 -118 120 156 141 -137
2513 -137 -423 118 82 83 190 99 -136 -264 69 -228 64 181 -13 16 152 -78 -43 242 -335 -86 -157 151
2535 151 173 -157 -200 -38 -22 43 -191 -136 374 45 -167 230 -105 -341 -85 70 42 42 -80 -172 69 36 -208
2558 -208 75 96 -153 -236 -27 31 314 88 -195 35 -58 -169 -74 -74 6 -23 -23 272 -274 108 -12 60 -183 -124
2582 -124 -4 148 -106 12 132 -120 308 -190 119 90 -29 -121 -264 246 7 45 -66 -88 -145 16 -246 -132
2604 -132 147 148 57 162 -13 -145 26 -248 -454 86 83 96 -68 -127 -138 11 -186 -338 -149 -58 82 196 16
2627A6j18r5L12K79j99j36k1k70L43j24K07k75J08j16l09N14j34o3l05N44K77
2648D35k64j19j89K39o2k9J00k19j08J16r9L25k8J73o03K79n4K16k20j16K77j25
2670g5J45J67m37J66k72K91j41J17j13l1L93q2j63j89o3LK71m5J02K9k6j28J98
2693A17P4m58L49k82K80m1j7r3q8j0p8K25N1L36n17J97O5j63J97k70M0K43k18
2716f1K41j93q4J28K97m38L13l83K03j24Q4L12m17K74m25J78J86k0j0j00P6K12
2738B49J57m80J82k40j19N46n9k58l09L68j87M87m36J52j67Q0K3L6L78l91mJ1
2760A9l49J29L05n5j60m6J23R5p5J41m82L68J29l51L07j56j08J01J00J95j95k71
2782b36J3K8M34k59J28m04J96K35j63j11J14J64k28r9K38l9r7L61l06j05J62k20
$$ plain form
2627 16 -102 -197 115 394 195 59 38 -232 111 -13 194 -81 27 -89 -398 116 -18 -81 -386 158 435
2648 435 171 52 -137 102 40 11 111 -108 -216 -100 -199 126 98 271 -332 -53 -107 109 -111 -227 50 -75
2670 -75 70 237 -200 -34 -306 -15 -156 -39 -152 -183 210 128 -35 -224 -287 -284 -13 -58 44 73 47 -81 117
2693 117 191 -267 82 -200 80 39 22 -71 -159 -169 -247 -22 29 365 -152 45 110 -53 144 -126 -86 157 -61
2716 -61 180 -13 -97 31 328 -110 203 -180 23 -101 -17 295 -122 152 -273 -95 91 71 61 -39 37 249
2738 249 406 -74 108 -132 -251 295 236 -22 -331 37 -150 337 -99 53 -114 -34 -11 25 403 12 8 19
2760 19 -330 -201 104 49 -111 -157 -34 61 -14 127 -355 13 142 -209 98 -58 -166 -65 35 230 35 -236
2782 -236 -223 -195 239 -20 108 -296 -100 135 -28 -139 -25 139 -89 -188 50 11 -86 275 -31 -136 26 -194
2804a94L03n6J40q1R1k99K71k18L65k1o25J50L09j67j0P0l43j21J50Q6q6p6Q0
2827b82K79R6k04K22j43j03p9L50k5k68k3J3M01l16K47l10J66J57l36J52m5J85
2849A34m66M61n6q9J9o4R6K28l86l9J25j27L35k06L0J82l27J0K87j49o5K8J26
2872H7m23K31M46k01n4m4o0k6r1J85m5k89L17J14k65K86J36n21J66n2J08j70q9
2895b54K78j24J97j8J04m6m5k47J35r0K37j67q8J3K92J6m43N7K37r0k75M01j72
2918i2j46K03P8J16l2k58Q7J05k1r4K20k32oQN7q3l31N61k16n3m3L85o5j85R0
2943E3j90J29k21J77m1K63l19L90k10OP2l00J18j39m5M6L16j16L8K03l49K15M7
2966A43j55o7K82j26k65l2K58r8Q8j78L34l38J85J66l55L55p1j75M9k0J8Om0n1
$$ plain form
2804 -194 109 53 193 112 203 -96 175 -43 322 301 -324 -174 135 -32 -42 28 -315 -436 -286 -200 -286 -362 -282
2827 -282 -3 93 -111 111 -32 -135 -214 136 111 -157 -180 -167 234 -82 165 -145 21 178 -158 -6 -51 134
2849 134 -332 129 73 -16 3 -61 35 263 -123 -162 -37 -164 171 -35 -5 177 -150 -140 147 -2 -67 -39 87
2872 87 -336 -105 341 140 86 42 -18 -44 -135 50 5 -284 33 147 -118 168 304 -217 -51 -103 5 -165 -254
2895 -254 24 -100 97 79 183 137 92 -155 -20 -110 127 -40 -128 -115 177 193 -250 -193 44 -46 -321 80 -92
2918 -92 -238 -35 43 159 127 -131 -44 61 40 -54 166 -66 -72 -64 -7 -90 -421 140 -76 -129 -172 213 148 -37 53
2943 53 -137 -8 -229 -52 -93 170 -149 241 31 37 109 -191 -73 -212 -257 -211 105 -11 27 230 -119 96 143
2966 143 -12 -79 203 77 -188 -220 38 -60 28 -150 184 -154 31 197 -158 197 126 -49 0 -20 -2 4 -36 -87
2990h7Np1K29j96L54m46L02k68K88k22J28o0j4O6j5j56O4r4j85L30Ln5M6l02P0
3015b86J55j3L40k34K2j26J24MJ91j7j18o4K8j15l5lL06j00l87L73R9r3N2r6r5
3040h8J96j07k09K62k67K57m7J10k55K03K83j85l47L32k05r5J68R9q1M8l53N77
3062B96k99K55j98j91L30l15J14j02j74J29l5L47j42j08Q3m9m0j01J92K18l74
3083a64m4L38o4L16m78K92l79J22K46o44K53Q5J08M2j0k59M37l32K93j76J93k31
3105e6j52j4K27Q8l18K53j0j27K91j29j15J0j89L01mj99K90k41k0K24q7r6k03
3128b76J09M5J43K4j16L3j04nJ72o3J05p5JJ7q0J63oJ85k78J76k02j00K26m7j64
3153a17n8L32l60J59j49N6J63N7N8j51o2Q8J11n5n67M56J43k37OP6L23j61J13
$$ plain form
2990 -87 -82 -153 76 -120 234 -212 90 -178 110 -112 16 -44 -58 8 -7 -163 -99 -193 -378 -48 -45 -100 -54 -356 -286
3015 -286 -131 -144 196 -38 -16 -142 -18 -14 177 160 42 -22 6 -109 -144 -147 159 59 -328 45 144 51 103 7 -88
3040 -88 108 1 -208 54 -213 44 -3 107 -148 55 338 153 -194 138 -67 -162 6 105 24 72 -281 296
3062 296 -3 252 54 -137 193 -122 -8 -110 -284 -155 -190 157 15 -93 -10 -59 -99 -200 -8 210 -164
3083 -164 -208 130 66 382 -96 196 -183 -61 185 -459 -206 -121 -13 29 19 -240 197 -135 158 -18 175 -56
3105 -56 -208 -222 5 93 -225 28 18 -109 182 53 -62 -52 -241 60 56 -143 147 -94 -114 110 23 -73 -276
3128 -276 -167 -122 21 45 -71 -38 -142 -147 25 -38 67 -8 -7 10 -70 93 87 272 -6 170 -32 -132 94 47 -117
3153 -117 -175 157 -203 -44 -193 -137 26 83 141 -10 -72 16 127 72 -495 -39 104 -133 -127 -51 272 111 224
3176B24j81p0J18m40J80L36K45m63K2j6K8J96n6j45j92J74r7K16n7k33J94J27
3198A10J91k92K01k71K50J59l07p6K0n5%M0J1l21K25J84l69O2L53j74J17k39K46
3221F5l61J32M84l16M27j99l92j1K15r2j08J21N6J14J09j94l87K73P4J39q9l19
3243b59N09l30K80J02j21kj04r5j04M07j82P8l06K21l9k49J61J55J2l86J73j79
3265b58K15K31p1j93j78K85L6j86J1l9K63l44J48m0L33r2n5j53K79k04L0k0p2
3288g4Jp8o3J39Q6L15l58K14j40l51L68j89P4O8l0q8N2M19m01j24J88R0k32j30
3312b44L37J15j55l45R6M06l02q8K79j8j01j2R0j51m4L25j16j72j5PQ8k37L18
3335F1L75n70L31k27J94j27j71rK35n3l78P64k10j14K0R4k28j07J88r1n4k80K91
$$ plain form
3176 224 43 -27 91 -349 -169 167 412 -51 -29 -45 -17 179 123 -22 -214 -40 -137 79 22 -211 -17 110
3198 110 301 9 210 -61 189 348 41 -35 -15 -70 -70 -30 -19 -340 -115 69 -300 -238 115 -59 58 -181 65
3221 65 -296 -164 320 4 431 232 -160 -171 44 -48 -156 -35 21 135 244 50 -337 -64 10 149 60 -259
3243 -259 250 -80 200 302 181 179 75 -20 -124 283 101 179 -127 94 55 -194 -33 122 134 -252 -79 -258
3265 -258 -43 188 117 -76 -254 31 67 -119 -108 -147 116 -228 -80 -120 213 121 66 -87 192 -12 18 -2 -74
3288 -74 -73 -151 -214 -75 11 326 -32 182 42 -309 59 -130 -56 12 -18 -106 -54 365 -36 -160 28 118 -114 -244
3312 -244 93 208 53 -292 -196 210 -92 -180 99 81 -20 -32 58 -93 -137 188 72 -100 -115 -108 -20 -257 61
3335 61 436 -134 197 -30 164 37 -134 -143 92 39 -339 425 215 101 121 215 -13 -120 68 -23 -77 -357 -66
3358f6l2m5J41J06l9o7j17K99m19K30Q6K0l93O86m21q5Op8L57k21M6K20o0j37
3382A7k60K5J79Q7r1J51k91j74K06k93J87M7j24J17M58m22M00m57O63l41k96K72
3404F0k52J95l6j36L3K13l29K92l05Q7L90P6j07l87M25p7M8k16r8l6M79j54k75
3427a10R0K13o72N69k34j71N73l58K18k13L19m64J06J31K07j70j67k02L31k50
3447b54K10Mk8J86j78LK67l59K03l07L24l34M64q1j12K38l46j46j7J26L40L6l26
3470h7j19L57j70r4M43m58J08m6K71k2j92k66P7qo8J62L37n0l39M6K88l4j22J8
3494C2N1j65J97j03ON0q9j98J30K8Q4J7k0k03K57J27l59J93r2K08K1j45j6k24
3518b13K50k53R2K34l10K56k00J40K17k42J00K02K9l13l15M97j39p7J08m24N79
$$ plain form
3358 -66 -98 -143 -2 104 65 -2 -119 180 -239 -9 77 97 -296 390 -31 -116 -110 -188 169 -52 -6 214 154 17
3382 17 -243 -218 -39 48 -43 108 -183 -357 -151 -444 -257 -210 -334 -217 241 -181 219 -238 425 84 -212 60
3404 60 -192 3 -33 -169 -136 77 -252 40 -265 -178 212 288 181 -206 219 142 190 -26 -124 -160 319 165 -110
3427 -110 -20 193 -479 90 -144 -315 258 -100 118 -95 224 -240 -134 -3 204 34 -133 -335 -4 -254
3447 -254 -44 -40 -68 118 -60 -57 210 -149 54 -253 71 -263 201 120 8 246 -100 -246 -263 -137 203 239 -87
3470 -87 -206 151 -19 -113 330 -128 -20 -66 205 183 -9 -275 -198 -206 -274 -112 225 175 -164 -118 170 136 14 32
3494 32 83 -82 115 12 18 68 -21 -219 -89 -61 23 40 20 -183 74 201 -158 35 -57 151 172 27 11 -213
3518 -213 37 -216 -124 110 -200 56 -144 -4 213 -29 71 273 302 -11 -326 171 32 -45 63 -361 218
3539B18k49J3K0n1J20K0O8n73K22J79J09j6K8j40k4Mj35K29J73k00P5m0O6q3j8
3564A5l3J41K1m78J56k9K96k91r9J56K32j33J36q7j36J72r0J78j54K54o1L8k91
3587h7J58r8R4L3m84L50K42l0q5j09K50k72J24mK1j13Rm1M41k78l45N58l84K70
3611B20j61P6j76Q8N2l49K23K95j15j71N8j24j40K31j99M40k47k06K1R9qM18m79
3634a54Q7j10K08L43p24M7P50m28P0l8K0K3J71k10k23K88l0j75K27k46k4J0J52
3657C4J15j13k74J15M11m41K43o0l1m3P1j36N4J84k40n7J86P9j86j95L79J93k21
3680F7o8k22M37k16K8q1j20J38r6j0L28m11K01Q1O4J9j15j33j3J02q0Ol3j87K25
3705h9K30j17j59K54k27N02k87j13j99J95m8k1J76k43J53l17N16k32k25L40k7
$$ plain form
3539 218 -31 -18 2 -49 71 91 159 -414 -192 -13 96 80 108 -32 -56 -52 -187 42 215 15 90 50 116 33 15
3564 15 -18 123 144 -334 -178 -207 89 -202 -301 -145 87 -46 90 3 -133 39 -51 127 -27 227 166 204 -87
3587 -87 71 -27 67 100 -384 -34 208 178 93 -16 234 -38 86 82 103 -10 -1 -42 399 121 -224 334 -50 220
3611 220 59 135 -41 47 99 -250 -27 268 153 -18 40 -84 -224 7 -192 248 1 -205 -184 -85 -93 325 -154
3634 -154 -67 -177 31 374 -350 -303 447 19 89 51 71 94 265 55 -168 120 90 -85 142 -104 -128 -118 34
3657 34 149 36 -238 -123 288 -153 90 30 -1 -44 27 -109 -55 129 -111 -168 18 97 -89 -284 95 288 67
3680 67 -1 -223 214 -2 26 -55 -175 -37 -133 -143 185 -226 -25 56 120 139 24 -109 -122 -20 -100 -94 -127 -314 -89
3705 -89 141 24 -135 119 -108 394 107 -6 -205 -10 -58 -79 97 -146 7 -310 206 -26 -251 89 62
3726F2j59R3R5l16Q0J59q7M60l37j72O9p1K46l59O21l61N5k29K13J44k05J10k16
3749a05MJ88j72K05l93N7L70m7m24L19O2p2J5P8l7l9Oj1jj45K37k54J76l37J74
3774a46J83l1p1L13m63L97l52L33Ok96j99L34j21M5K3p0K35k45J00j14J87j94
3796a46O4Q1K02k65o3J12j48O0Q1J85j8j31J63l03K70k70l6J91n7J97l17K39K04
3819B95k44J88k90J07n00M14O7o0j61N7K47j35J54K4j68m5Q1%K1j22kJ3J83j51
3843b7K28l93K59k75k3M01m22L4Q7M38k8j55j35K21l96K2L29j75o5J58k57K82
3865A08k53L9M0N7q7K74q2l22m3K34k03L13j79O8l1j06Q2M12k18p0q7j67M25m73
3889b69L64Qj69J59k47K62k10Q9Qj72J64J42m56K69K45l39j59L59r0k48K03K78
$$ plain form
3726 62 -97 -4 91 -225 -145 14 -73 387 50 -122 -53 -124 122 -237 384 23 78 -151 62 206 1 111 -105
3749 -105 -101 87 -85 120 -273 -216 154 107 -317 2 64 -8 7 85 48 9 15 4 3 -142 95 -159 17 -320 -146
3774 -146 37 6 -65 248 -215 182 -170 163 169 -127 -326 8 -113 -68 -45 -115 120 -125 -25 -139 48 -146
3796 -146 -82 -1 201 -64 -127 -15 -163 -103 -22 163 145 14 177 -126 144 -126 -162 29 -28 169 -148 91 295
3819 295 51 239 -51 56 -444 -30 37 -23 -184 -127 120 -15 139 163 -5 -50 31 31 52 -70 -72 -59 124 -27
3843 -27 201 -192 67 -208 -231 170 -252 -218 -131 307 279 124 -11 210 -186 -164 165 -10 -75 83 -174 108
3865 108 -145 -106 -66 -9 -96 178 96 -226 -269 -35 -238 75 -104 -36 -67 -173 -91 321 103 33 -54 -221 204 -269
3889 -269 95 103 -66 93 -154 108 -102 -13 -5 -177 -13 129 -327 -58 187 -152 -311 48 -42 -290 -87 191
3911A91o16L68J01n0k29K89N3o0k37N42n33K61QK6L5j02M96q96N54n41K86K79
3933B25k7l38J83J3J57j56j45k52M06k42J11j84K4L10K54p68K73j0k20L35J11
3954F0m7j44J65K23j30k99k2O2K49mn5k53K28J48o4l44J35j47L85k94l00M00L39
3977B91m86J13J95K01p0m22J29k52M24l48L71l54M19j05l19P3J4K99k24Q9j8O
3999B6m6L5Jj53N2J53J71j19j9P3l53m2K70k8j2q3J19P3k6k35J52j44k66J83J85
4024c3Q4p3j63L74j16k48J37J40j1J03j85k8j4J92J04J13n75j70L79p4j65K68
4046C9J80l86K1J90L2j74j85P3q7K17J49j69L19l27P7R6j26Q5j6J9n3O3n7k55
4070b75J95J42k33l9P4L44j07l4K65j58k91j6L00m32N72n25K7J55LK99k27n7J80
$$ plain form
3911 191 -425 -57 44 -6 -235 54 107 47 -190 352 -181 80 88 114 149 47 543 -353 201 -340 -54 225
3933 225 198 -140 43 56 213 57 -88 -340 66 -176 -65 -249 -225 85 339 -429 -156 -166 -386 -51 60
3954 60 13 -131 34 257 127 -172 -194 -132 117 113 58 -195 33 181 117 -227 -92 -239 146 -148 -448 -48 291
3977 291 -195 -82 113 314 244 -178 -49 -301 123 -225 146 -208 211 106 -213 -140 -126 173 -51 38 20 26
3999 26 -20 15 16 -137 -85 68 239 120 101 174 -179 -221 49 21 9 -74 45 118 92 -143 9 -135 -401 -218 -33
4024 -33 51 -22 -185 189 73 -175 -38 102 91 194 9 -19 -33 159 263 376 -199 -369 10 -64 -229 39
4046 39 219 -167 -146 44 76 -98 -283 -210 -297 -80 69 -100 219 -108 -31 65 -61 24 8 27 -26 37 -20 -275
4070 -275 -80 62 -171 -210 -136 208 101 67 332 174 -117 -133 167 -265 307 -218 -191 -36 -33 266 39 -18 162
4093A62j00j41L4K13oJ73j78k77K83n67K80L60k94k74J25R7JJ0J79l3o1J87j68
4116EJ59m09M93Q8l25r8J86k73L6M12m01J08l5n9J22p7j26J59J13r0j9m8L09j39
4140I1o6k3j12K78j83L18m11j04L40l7j06j3mL17k68K86k86K87k47k51NJ45J36
4163I2j06l22K75J05j74K02o8j3j1rl20K65J43L40m34K12k46J00J14k33K6Q6n4
4186c0O1q0J90k73K14j7K3q1J13L1m34L44r8J19R2j17k74M65l13N8j0j05J08K57
4210B43m85L40j91J4M29n00k3J2J97j13k24K84L8m5J3K01J5m06L49k4j46j04J77
4233E1J43m29L05j01k46K53P1k84l6J50KK29k29J93N4Nj31n1rK95j76L4r0j2L93
4258C84j45k35J09o39P61k76P3J89m99K10r9L1L66j50kl06J77k22L60n03Q2L23
$$ plain form
4093 162 62 -79 -45 168 162 335 157 -120 163 -404 -124 236 -58 -332 -207 -110 -109 -99 80 47 -14 173 5
4116 5 164 -245 248 336 11 -87 99 -174 -138 274 -127 -19 -54 -113 9 -68 -194 -35 78 -12 -31 -79 230 91
4140 91 25 2 -110 168 -15 303 -108 -212 128 91 -15 -28 -32 285 17 303 17 304 57 -194 -189 -44 92
4163 92 -14 -336 -61 44 -130 72 4 -9 -20 -29 -349 -84 59 399 -35 177 -69 31 145 -88 -62 24 -30
4186 -30 31 -49 141 -132 82 65 88 7 120 151 -283 61 -37 82 174 57 -217 248 -65 -7 -17 -122 -14 243
4210 243 -242 98 -93 -79 350 -150 -173 -161 36 -77 -301 -17 21 -24 -11 190 205 -201 148 124 -22 -126 51
4233 51 194 -235 70 -31 -277 -24 47 -237 -273 -123 -121 108 -121 72 126 131 0 -51 -60 235 59 93 3 -9 384
4258 384 239 4 113 -526 235 -41 32 221 -278 -68 -167 -136 230 80 78 -228 -51 -273 87 -416 -334 -11
4280a1J83k65oMJ14kN5j30m5m3L47k29n3kJ65J49l69J50n4n0K1l15M23J31p7j85
4306i4K3r2J75J25j07l5j51k81N45m7K4k17j13K71p2r8M1P2K02k50J75K9k13L57
4330B69l64O5K51M0k15O7l0k07L2n5K39j36j25J24L0M9j48mJ13K81k35j09M0k89
4354c17J11N13j51l5J5j07j3K91l87Rn2J64J69m74K60k6o9K46m0rj57J8L24j58
4378A25k52L28k57J83J8k0j29K26k66k2J88j46J89k04O2n4J12l37J89j08K55k84
4400b04J96q3j99L59k17K10R6o9j59o2L86k38Qm6j01J13M0J02M1k54J75K92k10
4423A76j88O2J77l5l23J63j38N75l53K3N0k67j51J78q0N1KM8K06j41K65j33j63
4446DK8q8R7p7J63q8M0m9lj02k63M31j15R3O1j04n9o2J64r3J57Q0K7%m71P4M3
$$ plain form
4280 -11 172 -93 -99 -95 19 17 72 -58 -103 -146 201 -28 -81 -83 82 231 -138 12 -42 -92 -71 -386 37 168 91 -94
4306 -94 -71 -163 12 137 30 -5 -156 -437 108 61 85 -132 -245 26 -46 -144 -103 -31 171 -79 96 125 -88 269
4330 269 -95 -30 221 261 46 113 83 -124 -92 -147 92 -44 -169 -45 -15 34 -114 -118 -5 276 41 -68 -28 -317
4354 -317 -206 307 156 121 136 29 16 307 -80 -71 -123 41 210 -264 -4 -30 -99 147 107 98 -59 -41 283 125
4378 125 -127 201 -56 127 145 125 -4 222 -44 -66 122 -24 165 -39 23 -31 81 -256 -67 -175 80 -204
4400 -204 -8 -91 -290 69 -148 62 158 89 -70 -132 254 16 24 -22 -123 -10 30 132 173 -81 94 386 176
4423 176 -12 50 227 192 -131 32 -106 469 116 139 189 -78 -229 -51 -131 -80 -78 -30 176 35 300 167 4
4446 4 32 -56 41 -36 127 39 79 30 27 -75 -338 93 -22 71 132 28 -31 -93 71 -22 135 215 242 242 -229 -155 -112
4473a12J70l56J66K0L5K17j53J85Jl38J40m2j30K37kL1J76k10j22n5k57M73j37
4496f3L09m55M0M00l07J28k76M04q1l23L30r9j37J74MJ6J14J53k70J55N2k03N3
4519A18j03J54k16M1m6J50J08l10p8K18K05J05k28k68K89q8j95K50l9l2j59K50
4541A26K14m78J80p7K53l51K80l24K62k64j2O2jJ69k07K46k37M71j60p5k46Q9
4563h0Q6o7k4q2J84j39L18l13J81l9P6J7j69L1M6m4j79K95k67j75K09J40O1l49
4587b83L38J45j43r4K45k05J11Mj27L33k22o3k34m0K14J81rk36r2n6K68l86K1
4610c30K33j62K86L1QK85q12J90K55r7k7K84j54l36J62K74R9l21J77k10K94l33
4632b04K90P2Q0k25J10n7j28P3j02J01M06k33l58J26j22J99J69n1j78N9L4K08
$$ plain form
4473 -112 58 -298 -132 -112 -77 140 -13 172 173 -165 -25 -67 -197 40 38 69 245 35 -87 -142 -399 74 -63
4496 -63 246 -209 -169 231 -76 52 -224 180 99 -224 106 7 -130 44 48 64 178 331 61 216 268 65 118
4519 118 15 169 -47 -6 -52 98 206 -104 -182 36 241 346 118 -150 139 51 -144 106 67 35 -124 126
4541 126 340 -138 42 -35 218 -133 147 -177 85 -179 -191 -129 -130 39 -168 78 -159 312 152 77 -169 -80
4563 -80 6 -61 -85 -167 17 -122 196 -117 64 25 101 118 -51 -20 26 -18 -197 98 -169 -344 -135 5 66 -283
4587 -283 55 200 57 -37 208 3 114 118 -9 324 102 39 -195 -235 -21 160 151 -85 -177 -233 35 -351 -330
4610 -330 -97 -259 27 58 66 351 -461 -271 -16 -113 -140 144 -10 -346 -184 90 189 -132 45 -165 129 -204
4632 -204 86 158 238 13 123 66 -62 11 -91 10 416 183 -175 -49 -171 28 197 146 -32 27 61 269
4654B69k46K1K9L8l56M96k68K39j92K43ll83J25m9p8j7P3k01L0L70k79J05K16
4677A82k05N7j10m4L08m2j35j49M5K01m5M0j07j37K53O6M2l3k81J33j2Q8k24J59
4701E0r4Q4l66M97j12j87j2j57J69L93m48K96M5j19m3K68j07l77L62k66J59N6
4723I1K8r2j49L39q4J5k48J62n2k29J35K8L7k19K25j30J56k18K71j74lN7J11J5
4747G2J31j05l21K76j4K26l29K48k44j93K87L21k24j16j1K78j80j69N7K56l9j29
4769G8N0K44l07Pj31j54J32k4J16j21K7p4K72j16P2m1j89J07j01J53j57M5l21
4792d33N96o7p4k30K03M31k79k62r3L10ML8j01j47J40j51K15k4j7N9o1J52m43
4815b34M02j83j65K32j42L22k17Q0k80L89k76Op5K62J95k17r3L1L5j25L13p0L2
$$ plain form
4654 269 23 44 73 111 -245 251 -17 222 30 273 270 -113 12 -37 -115 -132 -59 -260 -230 140 -139 -34 182
4677 182 -23 34 -76 -120 188 146 11 -138 -93 108 63 103 -4 -141 112 178 220 187 -94 39 27 115 -109 50
4701 50 -44 40 -326 171 59 -128 -140 -297 -128 265 -183 113 158 39 -4 264 157 -220 142 -124 35 91
4723 91 119 27 -122 217 133 148 -100 62 10 -219 -84 -56 -19 -238 -13 -143 13 -205 66 -108 -111 -54 57 72
4747 72 203 98 -223 53 39 265 -64 184 -60 -253 34 355 131 15 4 282 102 -67 -10 246 207 78
4769 78 128 372 65 72 -59 -213 -81 -105 11 -110 -83 -157 115 -1 71 30 -159 -52 -153 0 -157 -112 -433
4792 -433 163 96 22 -208 -5 426 147 -115 -208 102 106 144 43 -104 36 -115 100 76 59 118 57 209 -234
4815 -234 168 -15 -180 52 -90 232 15 95 -185 204 -72 -66 -141 121 316 99 6 37 72 -53 260 190 222
4838B22j92Ml58L75L14l72j44K41p2o4J20q6j06K69k85j94O18J02n71J4L09l40
4860a96M22k89j5J42M5J17n25K61J7R3j28J8K67j76k43K09j19J89n4l02L23J03
4882A59l17K31No1L0l14P1M71k05K0j84J72J11j9o3m2p1j84o2N42l70nnl51J37
4907c04J52K27K0K4k41K18R1k3n6Q8j78l51N17L7N0l49M9j16J16R2k43L49j14
4930E5j94J27P6j23j20K60j00J2M23l04j94K07rq2q9K46k86K59k03o9j52L56l01
4953b05l1K76P4J34j75j06L82l27j95L37k52P1r9r6J26k0R4j2K26j79j34K00m1
4976D8j7L9j44J95k40O1L1J27J87n05J62J69l2j56m4K56k19K11j65J20O2j23K52
4999B75k93J25l21M14l97L21j55k3j32K83N4j02j88L04k78J0p5K07k44J19l37
$$ plain form
4838 222 30 34 -324 51 365 -7 -151 90 18 -46 74 -12 -118 151 -134 -328 290 392 -179 -165 144 -196
4860 -196 226 -63 -78 64 109 226 -299 -38 -21 72 -56 -38 229 53 -190 19 -100 89 35 -267 56 159
4882 159 -158 73 78 17 47 -267 -196 275 70 90 -94 78 189 170 107 65 -6 -190 -252 290 -80 -85 -90 -441 -304
4907 -304 -152 75 95 119 -122 96 187 164 108 196 18 -333 184 221 271 -78 -29 -145 -29 63 -180 169 55
4930 55 -139 -12 64 -59 -179 81 -19 -7 416 112 -82 125 116 34 -55 191 -95 164 -39 -108 -260 96 -205
4953 -205 -236 40 114 248 73 -33 349 22 -173 164 -88 -17 -116 -212 -86 -106 -12 -24 202 23 -111 89 48
4976 48 31 70 -74 121 -119 -58 -27 100 287 -218 -56 113 81 -75 -119 137 -82 129 -36 84 146 23 275
4999 275 -18 107 -214 200 -197 124 -31 -54 -186 97 151 49 -139 165 -113 -103 -178 29 -215 -96 -433
5020d33L67J51M4O5j53K11o37L89LL15l83j15M3K78n7K21m64L14k76J33qk05K61
5043F4N6j61j31lJ49L44l63k9O8J29j4k50J99J1j65P8p5k90P73k99q0l5J76m15
5067b63P0L26K9j29M22l97k96J12k24M9K90J35m16K50J2K33J03l58j30M3J07R
5089b3p8J48k40M46l28O8M7O0r6k3K8j11K1J39J68l20K25k67J94j29K15j04l0
5112A0J11p9J20J3j49L2O8l31J11O2j05K11j03l0R0k55N09m98M46j06j97K29J39
5135B98l38P4KJ47m80K48J75o0j34p5J46J59j68j04L03j97M5l03J51N6J80j27
5157bj67J86k27K50L12m71K55p7l47K04N0J20k2j47J66j85m0l1J73j10K41%j59
5180b8L36r7k38K39m31J17J42R7j40N3l35L12Q3j89L09k76m94N74J90l45jK02
$$ plain form
5020 -433 -66 85 129 194 41 252 -385 4 7 322 -61 -176 -133 145 88 309 -155 159 -117 16 8 -197 64
5043 64 120 -41 -172 -175 -26 318 -45 -74 -6 123 109 -141 58 69 -96 -18 -93 -383 390 91 11 -24 152 -263
5067 -263 -193 133 162 33 455 58 -238 -126 -350 -301 -11 124 -292 -42 -30 203 306 -52 -182 -139 -32 -23
5089 -23 -101 47 -193 253 -75 -7 40 100 4 -19 9 -102 -81 58 226 -94 131 -136 58 -71 144 40 10
5112 10 121 42 162 175 26 58 126 -205 -94 -32 -137 74 -29 -59 31 -224 285 -213 233 127 -70 159 298
5135 298 -40 34 36 183 -297 -49 126 66 -68 -143 3 162 -6 -110 193 -4 41 -262 -111 -55 125 -2
5157 -2 -169 17 -210 40 352 -119 136 59 -288 -84 -34 86 64 -83 83 -102 -142 -173 0 -110 131 131 -28
5180 -28 308 211 -27 212 -219 -102 40 137 -3 50 -285 27 110 -79 230 -46 -540 34 224 -121 -122 80
5202H0q2J15j06K09j16j28L73n06L04j10Q5r6k40R4J0j9l5M12q7j13K67k23L33
5225D21m98O3J80Mk01J4K2K9J8l40N00j90N2j8L2j39r9k1L78l12RJ45M1j28k1
5250e9J63j85j68N8L02k94J4K30j19L05LJ90m87K4J14o7J8j76n7K04q9L8J55J33
5274B50l41J47k91M27m23J33K14n1rm9R4l24Q0J35J83j5j79K4j23Q6R7j10J03
5297E8k4k33j1R2J25l43L25J81k08K62j8k76Q2j8J5K2j09J60m7k12L98k01oJ60
5321A74j14JJ38k98L47k15%J38n04K06K61j56L5N1p9J92R0l36j69K57J35OO1k59
5345c8Q9n18L36J59K5L0j15q0M24m63K54j82J79l26J04J08r3K03j93K6j13J78
5367fk71K16M7l5K42%j83K21k79K1qL9J05k73l0J76J40k23J40l01q7M74OJ09k60
$$ plain form
5202 80 -2 113 7 216 100 -28 345 -161 143 33 118 22 -218 -124 -114 -133 -168 244 157 44 311 88 421
5225 421 -77 -14 166 170 -31 -17 5 34 52 -288 212 22 74 56 88 -51 -150 -171 207 -105 -96 49 90 -38 -59
5250 -59 104 -81 -249 -191 111 -183 -169 61 -58 247 250 440 -47 -23 91 24 42 -134 -191 13 -76 -38 117 250
5274 250 -91 56 -235 192 -231 -98 116 65 56 7 101 -223 -143 -8 175 160 -19 5 -118 -32 65 -45 58
5297 58 34 -199 -210 -118 7 -336 -11 170 -38 224 206 -70 12 -6 9 31 -78 82 35 -177 221 20 14 174
5321 174 60 61 199 -99 248 33 33 171 -333 -127 134 -22 13 64 -15 177 267 -69 -238 19 154 160 221 -38
5345 -38 51 -467 -131 28 53 83 -32 -112 312 -151 103 -79 100 -226 -122 -14 -107 96 -97 -71 -184 -6
5367 -6 -277 -61 -14 -49 193 193 10 231 -48 -27 -35 4 109 -164 -194 -18 122 -101 39 -262 -349 125 131 240 -20
5392b0j40j30N79k18q5M4j63M03j94L24l92l27K18p3K3O5o3L4N4K33m2k07k03
5415b80Q1J64P7n4k23L77j35J38p8k74J06K67n56P00j41O7l63p0L51j28M5j16
5437d5L06l99K41j90m6M76k84P2l20K53j08R2K19l15l3J23J40l99P6j64J63K62
5459A20l42L22j95J12j72m1j20L53j3m7j0j55J15K42M9m23J71o0N7M6K21o8j62
5482@l77L84k27J95k31l4M00p1l54K44J44o3r0M06l78l7L6L04k96J52j75j86M89
5505B35m51J93N5k43M27l56K04q5q7L07k26K27p4j00k10k8K75l23K9J61PQ0L2
5528D9j56J87k38m1P3p0M74l34k35L15m3j17J52j78L53j34P9j76k69K90P2k82
5550b29J48j34J58k42J71L32j07Lj24OJ42k32J30k35L31p5O3n09K96J39m7j88
$$ plain form
5392 -20 -160 -290 289 71 -14 30 -133 270 76 400 8 -319 -101 -174 -151 -86 -149 -115 -61 172 130 -77 -280
5415 -280 -199 -35 42 -12 -235 142 7 145 67 -207 -101 166 -390 310 169 236 -127 -197 154 26 71 -45
5437 -45 261 -138 103 -87 -133 343 59 131 -189 64 -44 48 267 -48 -81 42 182 -217 -141 -305 -142 120
5459 120 -222 100 -95 17 -155 -196 -316 37 24 -23 -33 -188 -73 169 218 -205 -34 -94 -37 9 230 162 0
5482 0 -377 7 -220 -25 -256 -290 110 39 -315 -71 73 10 -80 326 -52 -89 -53 251 -45 107 -68 -254 235
5505 235 -216 -23 32 -211 216 -140 64 -21 -108 199 -27 200 126 26 -184 -212 63 -260 -231 -70 -63 17 49
5528 49 -107 80 -158 -199 -126 -196 278 -56 -291 24 -19 -136 16 -162 191 57 136 -40 -309 -19 53 -229
5550 -229 -81 -215 -57 -299 -128 204 97 100 -24 -18 124 -108 22 -213 118 43 106 -403 -107 32 -15 -203
5572b03J00L34j43k10L25J27n41J23k6M33n30J51J65k23j4J25P7k87K77Q8k87
5593a39J09N4j23K37j13J25k98Mj50M44n3j28L20k69j60J09K70j36l0R5j04k6
5615C8j20Q6Q8m8R0k30P1K91r2k17J00M3k60J00K9R9l9Q1K39j82k72M4j95J29
5639a27K01k67K23j93K36l09K77R5k12j03L46k95O2j41L66j54j93M81l43J92O3
5660B05j91J43j5j67l08O48j87M7j62r6j86J26L82k76n3n2J79n0R8P1L7k73K57
5683A77k12L14k94L52M8Mk63M4J29j14k87K47k26n1L83q2j25L2j49L35k39l57
5705c34L60J69j25K87l79j14q7M8N6l06K79J8K77O1j20j37m4j3l3J90J66m59K20
5728b0P8l4K61Oj73l20K00j05L38l54R4J89m69L83O1k58j1K80k04J99Q1l89k91
$$ plain form
5572 -203 -103 231 88 -122 203 330 -211 -88 -114 319 -211 -60 105 -118 -132 -7 70 -217 60 148 -139
5593 -139 -30 24 -99 138 25 150 -148 -144 -294 150 97 -31 289 20 -140 -31 239 103 73 168 64 38
5615 38 -82 4 92 44 134 -96 -25 266 174 -43 57 100 -160 -60 -31 68 29 110 349 167 -105 -61 -256 -127
5639 -127 74 -193 30 -163 73 -236 41 136 -76 -179 167 -128 -66 -207 159 5 -188 293 -50 142 205
5660 205 14 157 142 -25 -333 315 128 175 13 -83 -269 -143 239 -37 -90 -142 37 -13 85 156 193 -80 177
5683 177 -35 279 -15 337 385 389 126 170 299 185 -102 145 -81 -132 251 169 44 76 -73 262 23 -334
5705 -334 26 195 70 357 -22 -136 -223 -175 -119 -425 -146 -128 149 210 90 -47 -91 -104 -137 53 219 -240 -20
5728 -20 58 24 285 291 118 -202 -2 -107 231 -123 -29 160 -309 74 135 -123 -134 146 -58 141 222 -167 -458
5751d58O83j15j68K77k38N7r0J04M96m80M9l11RK25K84l70l67N19k12J15j3k9
5773c3L3L67l58Qm2M3k7n0K04l65M24j08J9k38J03j49k25P18l21J57k04L68M4
5796C68l98K25j25n3oj29J5j82K53k67L10j56L5K67l3k95L62j19n8K8L37P2o01
5819a50K88p9j03K15J54r6l0q2K2J51k39J32k47K8J17k00l1J58r9J87L7l67M05
5842A71lk43l14K28Q4j51L61Q8k46j46Q9J23K39k91j01J69l64J41K34J9J7j18
5864a4j84M9K8K5q7r9K97pk95N92l29J03K50m71k9JJ51j68O09p10M32j80K4J19
5888A07k47j18K95p9L7l30J97K98k17K47n44J72K48k4o4J14j01j35L89k96%J04
5910E3k94L45r7R3K6j31L8J26k09K28m26K03m4J53K10l13k8K87nj43K3l8p8Q8
$$ plain form
5751 -458 225 110 -58 219 -19 38 -52 52 548 68 117 -194 -185 40 324 -46 -413 106 -106 9 -4 -33
5773 -33 0 367 9 17 -25 18 -9 -59 145 -220 204 96 115 -123 -20 -169 -394 324 3 160 -44 324 368
5796 368 -30 195 70 17 11 -118 -103 -285 -32 -299 11 -145 -110 157 124 -171 191 72 14 42 379 451 -150
5819 -150 138 59 -44 171 325 229 199 117 139 290 51 183 -64 -36 81 -119 -150 8 -91 96 133 -234 171
5842 171 168 -75 -389 -161 -77 -228 133 221 -25 -171 -82 41 280 -11 -112 57 -307 -166 68 87 104 -14
5864 -14 -198 -149 -121 -96 -183 -282 15 8 -287 305 -24 79 329 -142 -171 -170 -19 -187 422 -288 144 -36 -12 107
5888 107 -140 -258 37 -42 -5 -335 -138 160 -57 190 -354 -182 66 42 -22 92 -9 -144 245 -51 -51 53
5910 53 -241 104 7 100 126 -5 33 159 -50 178 -248 -45 -89 64 274 -39 -67 220 215 72 95 57 -21 67
5934F7j12K12l35j23L75m18J98P2K27m53J99M13j46Ql02Q1K43k20N4j67P6K25
5956A74m18L9K50N1m33M67k1r7J50k58J31j5l18K35J01N0N0r8J46k44J67j11O6
5979F4j66j12K72p5k42Q3P0K24j04J6l8j78M2m0J26K8J36k65L34k96l3RJ23k55
6003b77L61n0J51j79K51m77N6L62k78L1L09k17j22J57J36n31J83j1J71o7K81l37
6025i7J22k26J44J39j57J57K17n15L0J17O2j21j10J11j29M48k84pJ19J42j93O0
6047B9j2K33j43l4o4J37l12J7q9K66k5M3L1L7q9k25L13j6L65m50n1j5r1J85rK16
6073B47n02j2L09j11l02M14j5l47L22j03K1j40K27P1j93JJ88k20P1K46j23o%K70
6097C13n23J32K04j74nO2L77m03k0K02N3n97J73l9p7L87K12m80K29n3kL07m50
$$ plain form
5934 67 -45 167 -168 -291 84 -334 -136 -64 163 -290 -91 322 176 184 -118 -37 206 -14 40 -127 -51 174
5956 174 -244 -205 45 96 -337 130 109 12 162 -96 35 20 -298 -63 38 88 138 40 186 -58 109 -2 64
5979 64 -102 -214 58 -17 -259 -176 -106 118 14 30 -8 -186 -144 -184 -58 -30 106 -159 175 -121 -154 -145 -22 -277
6003 -277 84 34 185 6 257 -220 -164 198 -80 -49 260 43 -79 78 214 -317 -134 -145 26 -41 240 -97
6025 -97 25 -201 -57 82 -75 82 299 -216 -186 -69 -7 -128 -238 -127 -256 192 -92 -99 20 162 -31 29
6047 29 17 250 107 73 9 146 -166 -149 -238 28 3 46 77 114 25 -200 113 97 462 12 -39 -54 -145 40 31 247
6073 247 -255 -267 42 -69 -371 43 28 -319 3 -100 -79 -219 8 79 -114 -113 75 -145 -74 172 49 43 43 313
6097 313 -210 -78 126 -48 -53 9 386 -17 -37 165 218 -379 -206 -245 -322 65 277 -203 26 -27 -29 278 -172
6120a72J89K21k70J99m8j46k30J84P7q9J44m7k80K32J37J77l75qN4N1J95l27p4
6143b06L8J04J81oj52o0NJ62k34K76n31M26l03L06L3j4l29K47P6j04J67M7k94
6166a65m7O7K81p7j88J36nJ88l7j21r3J06N4R9k55N3J15j24l7j54J12K21l3L41
6190D37k22j97J35j89J58M2r3J98m44J77J80Rj11NJ80j57N0k85L57l30J40j35
6212i5J16L0k00J71k75J35J73Qr1r9l5J49Q1j62J81O4j5l43M20k01Jj91K35R3
6236A50k97K62r9K32r0k51M2j03l8R0J10Q3J4k88L27p3pj57K5J06j1j56J79j81
6260a31K55K4l16N96l87J74p7J7j05N4j63J08J13k54M02k22J03l7j72m6K90l09
6282h3LJ04j68K96p0J16n33J45n7K59R0j61rO5k01j79O34p7k61K06j14J2J38l35
$$ plain form
6120 -172 17 238 -32 167 119 -27 -257 -73 4 -85 59 12 -268 -36 101 278 -97 -105 -51 0 195 -132 -206
6143 -206 -168 -64 117 111 -41 -101 -96 66 -168 108 -423 3 -300 6 39 25 -304 -57 19 -85 82 129 -165
6166 -165 -212 -145 136 59 -129 7 2 190 153 32 -61 45 99 198 -57 -4 111 -13 -50 -204 -92 129 96 437
6190 437 215 18 153 -36 122 164 71 269 -175 2 182 191 80 85 265 108 158 -127 230 -100 40 -95
6212 -95 21 51 -149 22 -253 -118 55 63 -28 -127 -162 -13 68 -94 87 151 136 -207 213 12 13 -178 57 150
6236 150 -147 115 16 248 158 -93 -51 -154 -192 -102 8 91 105 -183 144 71 64 -93 -68 38 27 -129 50 -131
6260 -131 124 148 -168 428 41 215 138 155 50 104 -59 49 162 -92 310 88 191 154 -18 -64 226 -83
6282 -83 -80 24 -144 152 82 198 -335 -190 -247 12 102 -59 -68 -3 -204 -383 251 174 -87 119 5 17 155 -180
6306a80j4L27k04j04J10K6k12K14J34j29j67O79m03o2j52M79l55j23O6K54K53
6327D37n47J87j72L93l49KL9l2K92o5j53J48k32l31M30m4J8J09O8m86M28m31J67
6350a24L4J47p4O6M8p7k58J15R9q1O8k4j55j55K30K68j82L61n96K42J21L79l99
6373E3l69K24J22J22j88qO3j54J37o4P0rk04J26J37K00o32M27N7j56K24j92L17
6396C03l39L3K78l26J02O3O7k02K41k11J87j0k3k71K99k5k91R4N3Q7m52K79K33
6419A69n1l8k30K73q4K64m58n1qL54j60Q0j2k03Rk92O86j25R3J65n48J34j12P6
6443f9m7K78j71p6L39K3k76m4k73J92L28k09%J0k28N63l50K39l48j8J67J8k58
6466b10R3J24k2N0j36K78J73p56L35p9L94l98R9J93J7K15oj51l45J56J17k78J15
$$ plain form
6306 -180 -194 133 -71 -175 -65 -39 -251 -37 97 -32 -199 480 77 15 -137 342 -13 -136 -70 184 437
6327 437 -110 77 -95 298 -51 -49 -10 -42 250 185 32 180 -52 -383 47 3 21 130 198 -288 140 -291 -124
6350 -124 -90 57 -17 49 97 20 -238 -123 -24 -105 -37 -61 -216 -371 -141 127 -55 306 -290 -48 73 452 53
6373 53 -316 -92 30 152 -36 -44 19 -135 2 -62 8 -1 -205 -79 58 258 -374 53 110 -46 178 -14 303
6396 303 -36 -3 275 -51 51 114 181 -21 220 9 196 186 163 -108 191 166 -125 -31 22 109 -343 -64 169
6419 169 118 80 -150 123 39 303 -155 -206 -214 140 -20 60 48 -155 -146 -438 248 123 216 381 -167 -33 -145 -69
6443 -69 -116 162 -9 -85 254 277 1 -43 -316 -124 204 -5 -5 5 -223 340 -10 229 -119 -137 30 48 -210
6466 -210 -117 7 -15 35 -101 177 350 -406 -71 -150 244 -154 -55 138 155 370 364 213 -132 24 141 -137 -22
6489b2j01j21M86m39O6L49l89L57j51L6o4J48Nk90K51r4k25J74k92K91K3j91N61
6512C68k35n5L5o3M6j29K93k49l60L02k6Q7m7M42l94q3k67L95j92K50k39J0K24
6535A13j29J00j70J36j13K07qj74M4l8LQ5o6p0K32k06j51K66j52q2J11k00J40
6558a22J79j09p8K6l3J57n4J36j80K71j84K57l13J05O0j36L5J16k90K73q7j6k21
6581b08J85k17L81r8j00r5J32Q0j51J33P2j1j58K73l14R3J9k03J00K27m2j6j23
6604d1K45l65K39K96l63J9j38O2q1K02k65j22M00n1l4Mq3j66RL10m1O3j49mj69
6629b23J63K26l21k86M97j07j34L4K13m03M60j07N0k02K08p6o0O4j04L8L95l30
6651ej32o5L96j78j50j15M3L87m21J21K47j78K78l82K35k3L45k56k64n1k0J39
$$ plain form
6489 -22 -123 -244 242 -197 -131 218 -171 186 35 71 7 155 160 -130 121 27 -198 -24 -316 -25 -2 -193 368
6512 368 133 78 113 50 96 -33 260 11 -349 -47 -73 14 -33 409 15 -68 -335 60 -132 118 -121 -111 113
6535 113 -16 84 -86 50 -63 144 136 -38 6 -32 -29 56 -10 -80 152 -54 -205 61 -91 -173 -62 -262 -122
6558 -122 57 -52 -130 -104 -137 20 -34 102 -78 193 9 266 -47 58 118 -18 17 133 -157 116 29 13 -208
6581 -208 -23 -240 141 43 -57 -152 -20 60 -91 42 114 103 -55 218 -96 -3 16 -187 -87 140 98 82 -41
6604 -41 204 -161 78 374 11 30 -108 -46 -127 75 -190 -312 88 37 3 7 -76 -242 -233 77 36 99 -50 -54 -223
6629 -223 -60 166 -155 -441 56 -51 -185 -151 62 -341 119 12 62 -140 68 -8 -68 -4 -108 -70 325 -5
6651 -5 -137 -202 194 16 -134 -249 -206 181 -240 -119 128 -50 228 -154 81 58 403 147 -117 -168 -188 -49
6673d9L8J93J01o96N11j24P6P9m27M57N7k43R1R9p7q8m03L51R5p0p6j00N13n0
6697B58l63Q3k72n1J03K47o0JJ21j53J33l6j73K94k1o78P73k09k8L46m93j92K95
6720g5k10K1L53k20p5L29j00j37N2N4J23J01l29j63j05L67JJO7k03J0o8J92P4
6744F0j74K49l70M53j08J34j07l85R2K41m4J30m71J11M15m48L89j49j5j83K26
6765D6k20L67j72K17m49J05L07n49N04K8j81J89Rk95J71q9K31k65K33l39K52r3
6787Gj11J78m9O1j36J05Q8j49o7j2j62J91K57Q7n02K32J56k8Q7k23J65K67m30
6810A2k7j32M12k73O3j0lm9J84K32p51L22m0R4M3l5O4P1m1j62l03R5O0R4j92L37
6836F5J11j8N4j74K6j37r7Q5J87j54K14j78j83j23M01l29M20l19J70j9J78q5j59
$$ plain form
6673 -49 -11 182 283 -413 98 -26 50 129 -298 159 216 -27 64 163 86 -2 -405 -54 41 -29 -105 -205 308 258
6697 258 -105 -22 -294 -345 -242 5 -55 -54 67 -86 47 11 -162 132 111 -567 206 -3 -31 315 -178 -370 -75
6720 -75 -285 -264 89 -131 -206 123 23 -114 -62 -8 115 216 -113 -276 -381 -14 -13 -12 55 -148 -138 -206 -14 60
6744 60 -114 135 -235 218 110 244 137 -248 -156 85 41 171 -300 -189 226 -222 167 18 3 -180 46
6765 46 -174 193 21 238 -211 -106 201 -348 156 184 3 192 201 -94 77 -12 219 -46 187 -152 100 7
6787 7 -104 74 25 86 -50 55 143 -6 -73 -85 -247 -56 201 288 -214 18 174 146 233 10 175 442 12
6810 12 -15 -147 265 -8 55 45 42 -7 177 409 -342 -20 -60 34 77 42 106 177 136 -26 -329 -234 -174 -80 -272 65
6836 65 176 158 212 38 64 -73 -170 -85 102 -52 162 -16 -199 -322 79 -250 170 -149 21 2 180 95 -64
6859f4PK30k62Jr6J69L77k64k04J31M9k68K88j28K81k73K06j78J15k62QJ00L94
6882C57k93O7j59j18O2K4J41j55J97j21l80M54j20k16K84k94J91L22m68L71k12
6903f6J68l10K7J44Q0N1j03M5l55K54K13l57L21k62L01j66K75Nl29o1J53j82J36
6926a8l5l07M58j7k23L05k26O7l8J33l19O1J89j32J56l14M21l20R4J26k09K58
6948A10k6O7j21K01k89M09m12n2K1J67j35q0q7K45K7J46m75J63k0J57j05r1M28
6971B48l21j50J32R5K04r8O3k21L49k30k12K87j32L32p8o8l15K17j44RK3Rj78
6994a79K81K0q6j39j65K99J57j22p7o2J73Q9j77M8J93q4l88P8J17J53j63K9j0
7017a5J33k20N9L36k50o6pK41q4J2l06L72p8mO7k46N5j88K50JK40j25q3ql74K44
$$ plain form
6859 -64 -57 173 -89 -88 -184 -15 362 98 -106 25 74 -194 94 -34 247 -26 180 2 117 -145 -137 -37 357
6882 357 64 131 -28 -146 -84 -60 81 -74 123 2 -378 76 -44 -260 24 -270 -79 243 -225 146 -66
6903 -66 102 -208 -181 -37 43 94 -9 36 -319 -65 148 -209 112 -150 151 -15 260 265 -64 -125 28 -154 -18
6926 -18 -53 -360 98 81 -142 163 -63 4 -34 99 -220 -159 30 -102 54 -260 161 -159 -65 61 -148 110
6948 110 84 151 30 231 -58 351 -61 -113 -92 75 -60 -140 -227 18 45 191 -284 -121 -141 16 -89 -180 248
6971 248 -73 -223 -91 4 208 110 173 -48 301 71 -141 146 14 346 268 200 -115 102 -42 -33 -10 -1 -179
6994 -179 102 122 36 -103 -268 31 188 66 -11 -73 100 189 12 60 253 169 -219 -141 -24 129 -34 -5 -15
7017 -15 118 -102 -43 293 43 -23 -30 211 127 139 -167 205 127 123 190 -56 -1 -189 61 62 302 177 94 86 -288 -44
7043d4J94n3j70m1Q5j60K00N8J10k57M7K37j83J31j50j09m7N3M29k75K3K6Q8m81
7067b89J90L94k70K13k99J49p9j21j58L71r7k34QJ33K89n54K97rM2JK65q4p0J04
7091A92l67J16p1l8R6lN54l36j50j44N3j1J04M0j12p7R8L18j08l26l0L83M9k25
7115EL69n06K21l14L18n3k49J7J10J62r7k69R9L25o6K92l53q5j5MJ84j96K36k62
7139a23k04j49M44r5L7K13n78O06o3j77q5L9L14k25J11P1k07K02k82O6L16p8k4
7162A29j71Q9m53N04r4j62K28j67K13o7L6n6j42K8J82J47n40L37J06k43O8L33
7184C05q0j57j76K16k64K07J04l24K18P3m0l2l2j46n0K50M2J32j17K05o31L71
7206G4j57nR2O2K18j7k6l38J64L6k09K03j57j24R9J76k04J10l5m7J63P7q1n2K5
$$ plain form
7043 -44 150 97 -73 -114 -29 -189 11 69 179 -78 -31 206 23 154 4 -105 -152 -99 330 55 78 104 192 -289
7067 -289 -99 295 25 238 -61 88 9 -112 -270 101 4 -230 -222 -89 200 -354 -57 -66 -24 -23 242 158 88 192
7091 192 -175 -59 -130 -168 -72 -75 479 143 -7 -151 -98 -109 -5 35 -77 -154 -56 262 154 -172 -202 181 230 5
7115 5 374 -132 89 -225 93 40 -209 -192 -82 80 -17 -286 -187 138 72 364 11 -74 -89 -85 99 -97 139 -123
7139 -123 -327 -476 -32 -127 -90 123 -455 151 88 -89 -174 -135 179 -46 65 136 -71 131 -151 -85 231 153 129
7162 129 -42 47 -406 98 4 -158 70 -97 116 49 85 29 -113 -85 97 244 -296 41 147 -96 -28 305
7184 305 225 68 -108 108 -156 51 155 -169 49 122 82 50 18 -128 -178 72 114 246 129 334 -297 74
7206 74 -83 -88 4 66 284 267 241 -97 67 103 -106 97 -60 -184 -85 91 -113 -3 -38 -85 78 155 74 22 47
7231D7o3J48l61L92n72M91r8P8Q2j30K81l53qJ60K67l26K82l51K3N8P3j59J56
7254A17K24l90j26Q6K59q7k38N3L79j81j05j78K28K82k51K03p7j14k93M67k30
7275B8M1J55J11l72j7j34J46J08m0o5j69J13K77k55k45K79n0K15j89j06j95L13
7297e1j69M17o3k71M03k94J72k78p3J18oK43J67j18J13n10M79l12J9j86J80OJ7
7320CK65k49o2k57M13kk61K02j93K11K3J68k92L61k95k06M3K14k27J28j51L90
7342B26j63J13k37R6j94L79m3p8L2k56L93n51J69Q4l8pqk85K66O1P6m51L98L0
7366A2r2R5j81J04O5k42m3M20j06m4k8k87M49J01m10M04j1j68j25L2k1R3K5j3
7390B9N4k90R0L6J20J07j76K25j84J55n54L58N5m37M65k26L27j08o8K70l11J83
$$ plain form
7231 47 -16 132 -229 163 -409 82 -16 62 144 14 295 -58 -66 94 361 35 317 -34 -11 47 120 -39 117
7254 117 341 -49 -175 -89 170 83 -155 -102 277 96 -9 -187 41 323 72 275 198 84 -209 258 28
7275 28 69 224 335 -37 -54 -188 -42 66 26 -39 -208 -95 182 -73 -318 -39 -89 126 -63 -169 -364 -51
7297 -51 -220 197 134 -137 266 -28 144 -134 -207 -89 -95 148 315 197 310 -200 279 -33 -14 -200 -20 -14 3
7320 3 268 19 -43 -300 113 111 -150 52 -141 70 93 261 -31 330 35 -171 -128 86 -141 -13 -164 226
7342 226 63 176 -61 35 -159 220 177 99 131 -125 268 -283 -114 -30 -68 -75 -83 -368 -102 -41 35 -416 -18 12
7366 12 -80 15 -166 -62 3 -239 -282 138 32 -12 -40 -327 122 223 -187 217 206 38 -87 -55 -76 17 42 29
7390 29 83 -207 -117 -81 39 146 -30 195 11 166 -388 -30 25 -412 53 -173 154 46 -22 248 -63 120
7412A20j06J59r2J02n97M02R1O6j70J6N1j46j19K50K09l29J81k3N3R2j78o5j16
7435a49J94k11K79k41j7r9N26m56L07j61k2j54j35K95K41l87L88k13n4J91j31
7456iO0l74L66M2K8j28r6J94j56J4L63m3n10L35j91L90j83j66l8J40j19P7J17
7479A13J9m92L90K36m67p2m6K88J20o8J28q9j6q2j12K73P7l64M26k31l39L41j7
7502A6m0k25L00n1K93m68J28n8K94k54J18K0r2j28o7J6J15M5N5R7j23o8m7J64
7526D0P6j57p8m5L28m32L66j02l1Qj9k79N03J5M5M0l89M59k90l32J37K33j55R9
7550D0O4p2M2J96r3l70K05J99j38K5j36K50k50j15K86K4l96K40r8j02K72Q0l53
7573b00M07k80j83K9K49j64J52M3k45O7r9L36l8j47j80K2P9L78l22K93j95J08
$$ plain form
7412 120 14 173 81 183 -414 -12 79 145 -25 -9 42 -104 -223 27 236 -93 88 65 118 210 32 -33 -149
7435 -149 45 -166 113 -128 -145 -244 282 -174 133 -28 -50 -204 -339 -44 197 -190 198 -15 -69 122 -9
7456 -9 51 -323 43 85 113 -15 -111 83 -73 -59 304 261 -249 86 -105 285 102 -64 -102 38 -81 -4 113
7479 113 132 -360 30 266 -201 -273 -319 -31 89 21 149 60 44 -38 -150 123 200 -164 262 31 -308 33 16
7502 16 -24 -249 51 0 293 -175 -47 -105 189 -65 53 73 -19 -147 -214 -198 -83 -38 17 114 -9 -77 -124 40
7526 40 116 -41 -119 -164 164 -268 98 -4 -35 -27 -46 -325 178 193 238 278 -111 348 58 -274 -137 96 -59 40
7550 40 104 32 74 270 177 -193 12 211 73 98 -38 212 -38 -153 133 157 -239 1 -97 -199 73 153 -200
7573 -200 207 -73 -256 -227 22 -142 10 53 -192 -125 -224 112 74 -73 -253 -231 -152 226 -96 197 2 110
7595A10j15j58L48m13p9L03J18Q1j34l17m3J15K85j09m22R2L25j33L35l48L12
7616A53r4k70L9J11J1O2J30k30o3K62j47L17n81K12k0J88J43l33O5q1J61P9o0
7639E4l53M88k34n7o8J22k8J13j46N06m12L47m67K97qj52J40m39K82j27k43M34
7661D9k11K50L5o6k38L57j15k19K33j35J5K21j4n5l9o9O7J72l36K65j6j36j55
7684a40K11P7j39Q4l0P7k65J88l41k8M84k30j28Q9O6M2j63L24j66N9N3j63K33
7707A94k36J33L4pj33j04K77N8K1j63QK4k56K46K16l85J68j80K53N3j49K4j78
7730h2j4K62l50L85r9k04l8N3J04o3k40L79M6M1J83m12o7J22j42O0r4K37k07m0
7754a80rJ73k5j16J4P7N6j36j32J09j9L38j39L3j20r4J88J91k93k28N28m57J39
$$ plain form
7595 110 -5 -163 185 -228 -307 -4 114 195 61 -256 -299 -184 101 -8 -430 -338 -13 -146 189 -159 153
7616 153 59 -211 -172 -61 -50 12 142 -88 -151 111 -36 281 -300 -88 -108 80 223 -110 -45 -126 35 114 54
7639 54 -299 189 -45 -102 -170 -48 -76 37 -109 397 -15 332 -135 162 154 2 142 -297 -15 -142 -385 49
7661 49 -162 88 123 57 -181 176 61 -158 75 -60 -45 176 162 107 68 -1 66 238 -98 167 151 15 -140
7684 -140 71 148 9 93 63 140 -125 63 -278 -306 178 -52 -180 -91 -25 17 -146 178 12 71 124 -39 194
7707 194 -42 91 125 118 -15 -119 158 216 237 74 82 106 -150 96 312 -73 95 -85 168 221 72 96 -82
7730 -82 -96 166 -184 201 102 -102 -140 -87 17 -46 -286 93 139 180 363 -49 -116 6 -136 -76 -170 67 -140 -180
7754 -180 -189 -16 -41 -157 -143 -66 -10 -146 -278 -169 -188 150 11 44 -76 -170 18 209 -84 -312 216 -241 -102
7777a02o4O2n0K02M4k70L02l5j01M1m1J13lk5n3K3M4K50k45j10j84J89k73J88
7801i8L42l57R4j94L99m28M66j49j20L7n1j9j22J56r0J55k3L4L2L34l74J44j44
7824B4l04K46n2j99L37Q3l63k0k10L57K64l00J06K32q4k59k98N38K52k14j58Q9
7846F7l6k33J3N9j93K41o9J67J6k1j9l02P8L26k13J4j38L74J13j97l40K85k8o5
7870a01J69M3j33r9j91L24j11j61Q8J92k09OJ36J70l88M73J63l26p2k04L73k45
7892a03k20J41L04j25J83j86J51k87K01l6j31j23n8M79m6k50M7q7K05M9N0k16
7914e8m10L17L70j76J04J62k04l05L95j7m14L36r5jj0K93n26J73k60LN03j39j93
7937a52M28j36Lm4q8K3j18Q9pO9K24m02J39j40J14r8P1K63q5j91l00K88K56R0
$$ plain form
7777 -102 -166 -104 -154 48 92 -178 124 89 -12 29 -12 101 98 73 20 43 87 337 92 -18 -202 -13 -286 -98
7801 -98 244 -113 -19 -213 186 -242 224 75 -45 -8 -59 -78 -200 -44 -134 21 -2 32 64 398 24 168 24
7824 24 -280 -34 -86 -285 52 135 -228 -248 -458 -101 163 -137 -31 201 117 -142 -440 98 350 136 -22 67
7846 67 31 -202 -189 -130 -323 -82 -151 16 32 11 -8 -310 -232 94 -119 -105 -243 131 244 47 -293 -8 -36 -101
7870 -101 68 111 -22 -121 -312 12 -99 -260 -172 20 -189 -183 -47 123 -265 208 371 45 -27 -231 142 -103
7892 -103 -323 -182 122 -3 180 -6 145 -142 59 23 -108 -231 -289 190 144 -106 -59 -146 59 108 158 -58
7914 -58 -468 -151 219 43 147 309 105 -200 195 178 -236 100 5 4 -6 287 -239 -66 -326 -323 180 41 -152
7937 -152 276 140 143 99 11 34 -84 5 -2 67 291 -111 28 -112 2 -96 -25 238 153 -38 -338 -50 206 296
7961B96l98K52k72L95l36rK62m79K54O7J24l54m3p9N66n00j25L43q9J24p4OJ74
7984A05n2j04J32J39k96L56k5l70J35r7L35p3l6j92Q2J45m31J17J08J4L86l67
8006A1J27O3k05j66J57j93L09j8M7k60J24l14K6K21J35k71K21j07M32m20m1N1
8028g1j88K08K05o1R3l02O7J05j22j41K0M26l73J76J03M8j39J23l53O50k13l54
8050i3K5O7J30J20k56J30nl96M58Mj81k12J37P4L20j37k49m6J75l27J08L58o8
8073A36j60Q9Ok25J21k8J09L1k6j35k35L13J41j67J96k58J6k1N3o9K86k33J38
8096G8k08J38k21L78k18j8o3j2L8j02J78Q2o0L20j63k77o7J70j59Qr0L46J02J69
8120C49m27J14K76k2l0j32k93K60q3R0l90K69j94M4L10k30O4P5m05N02m6l20K80
$$ plain form
7961 296 -102 150 -122 273 -63 -72 190 -289 -35 32 156 -198 -241 -320 246 -254 -379 -36 -125 -1 -75 -69 105
7984 105 53 -51 81 220 -76 280 255 -115 20 -77 258 185 149 -43 39 184 -247 -130 -22 -8 378 11
8006 11 138 201 -4 -170 -13 -206 103 85 132 -128 -4 -318 -292 -71 64 -207 14 -93 339 -81 -122 -71
8028 -71 -259 -51 154 93 186 -116 -49 56 -66 -207 -187 239 -134 42 145 193 54 177 -176 474 261 -93
8050 -93 -68 -1 129 249 -7 123 118 -278 180 184 3 -209 -72 2 322 185 -64 -110 65 -262 -154 204 136
8073 136 -24 65 71 -154 -33 -61 48 79 53 -82 -317 -4 137 -30 166 -92 -76 -97 -44 -113 173 -60 78
8096 78 -130 8 -213 165 -53 -71 -134 -146 -108 -210 -32 50 -10 310 147 -130 -197 -27 -186 -178 -268 78 180 349
8120 349 -78 36 312 290 260 128 -165 95 12 102 -288 -19 -213 -169 141 -89 -25 50 -355 147 101 -219 61
8143F1k36L33k15j59K03j45o7M72j81r2J71K82k82p9l9l09J46L35n5m9J37o5k42
8166g5J6j94P7L62r1l92M3J3K94K15J5l63j86N01p08L95J25j47N63k71l69M84
8188C07k81J33k57
$$ plain form
8143 61 -175 158 -57 -216 -13 -158 -225 247 66 -26 145 427 145 66 27 -282 -136 199 144 95 232 167 -75
8166 -75 -59 -253 -176 186 95 -297 -254 -241 53 268 283 -80 -266 235 -473 -78 47 -100 463 192 -177 307
8188 307 26 159 -98
8191i8
$$ Imaginary data points
##PAGE= N=2
##DATA TABLE= (X++(I..I)), XYDATA
0@%%%%%%%qJ6j6J7k5L2m0M8n6P2q8J04j20J36j58J83k09K40k80L21l61M11m67
30b48N26n92O64p44Q31r25J029j144J272j410J563j732J917k119K345k602K892
47A523l219L590m021M528n132N869o790P974r565J1842j5375K1649l6129J28442
61A05186M6223k39788K895M3662O3426R8487p013j87097n3183J16882R4881j6215
73F8346n8797p1731k0191N9000J01931j269j23574o4712P2531N9661K8338J1596
85F1129r6396r8738R2886J23180j3154n1848n6068o0003P1623J30009j6779j02473
97a6632m3539J0429O6221P5116l3010r7141k6728N1272O5102J6824n5905o3798
109e1789n048N2076O6687l165q3422m4180K7728M0625N3580J1229r7249o4294
$$ plain form
0 0 0 0 0 0 0 0 0 -8 8 -8 9 -16 16 -24 24 -32 40 -48 56 -64 72 -86 97 -112 128 -152 169 -192 219 -248
30 -248 278 -314 350 -394 437 -488 541 -603 669 -741 822 -910 1007 -1112 1233 -1369 1523
47 1523 -1696 1894 -2127 2401 -2731 3138 -3652 4322 -5243 6599 -8776 12873 -23256 105186
61 105186 151409 -88379 -85484 -41822 21604 120091 113078 -74019 -127202 -10320 84561 68346
73 68346 9549 -62182 -82373 -23373 78558 77289 -46285 -110997 -38466 21195 49533 61129
85 61129 -35267 -134005 -41119 82061 68907 17059 -39009 -99012 -27389 102620 85841 -16632
97 -16632 -60171 -49742 16479 91595 58585 -38556 -65284 -14012 51090 67914 12009 -51789
109 -51789 -56837 -4761 61926 58761 -24661 -68841 -41113 -488 53092 64321 -32928 -97222
121i7222O6127O3542J2793k80p0149p2782O7925J01520j2811n8290m0420j9052
133e9099N2545Q1436j2492q7848m3878M2268O7944K1579l4519n7552l7729M1268
145b6077Q9969M307p8494l7018O623K1800O7871K3917q9986n7654M6492M4474
157A6224K2057Q047o1937o1394M8774P7263J82m4667m1925j3976M3605O1497j350
170E2400o9091m7882L3418O2260J7735k2978m6412m1960L5334Q0188J144o1151
182f995k5705k896J8697O1587J3272p3324l7832L3326L2698K2698L334n3118m4101
195e8359L7578N9481O531l5981m0303j3140L2672N3321R284n8303m9086K3798
207c2507M9000K0062n660m1313m8588K6648O9571M571l9181k4432j6594J4889
$$ plain form
121 -97222 -31095 32447 45240 44960 -25189 -97971 -30046 71474 58663 373 -40047 -59099
133 -59099 -6554 74882 62390 -25458 -69336 -27068 40876 62455 27936 -29616 -67345 -26077
145 -26077 63892 68199 -10295 -47313 -40690 -18890 48981 72898 -17088 -74742 -28250 16224
157 16224 38281 46328 -15609 -77003 -28229 49034 49216 4549 -37376 -51352 -7747 53750 52400
170 52400 -16691 -64573 -31155 31105 48840 25862 -20550 -62510 -27176 53012 54156 -6995
182 -6995 -32700 -35596 -16899 44688 57960 -15364 -53196 -19870 12828 35526 38860 -14258 -58359
195 -58359 -20781 38700 45231 9250 -31053 -44193 -11521 41800 51084 -7219 -56305 -32507
207 -32507 16493 36555 30895 -10418 -59006 -32358 37213 41784 2603 -21829 -38423 -23534
219b3534N9516J2725n6179l1866J6887K5605K8471O366m3926l9008K2912M9107
231B7076J3358k5515l3022j6204J8566M6947J5840m6133m2099J5513L1844K0327
243B6498N196l6515m4714K2554N3362M134k4948k1489k0612J4679N0682R352m4279
256f100k7481J0031K3628K6409N061l6329l4822J8138M4192J2143k1021k5650
268a1801j7828J2618M5061J6700m1770l4740J0124K2951K2192J1311l4404m2808
280d2394J7243M4066Q779j5517k2292k3888J0036M4637J3824l3949k8395K731
292b5119J9216K4772R347k7935l4851J0374L8088J3898j3649k0570k0142O912
304a9659L9835J7378l0788k8145K322J5551K2869J2811k8222l4192J0197L2249
$$ plain form
219 -23534 35982 48707 -7472 -39338 -22451 3154 31625 37991 -5935 -44943 -22031 27076
231 27076 40434 14919 -18103 -34307 -15741 31206 47046 913 -41186 -25673 6171 26498
243 26498 31694 -4821 -49535 -26981 26381 30515 5567 -15922 -36534 -21855 28827 38179 -6100
256 -6100 -33581 -23550 78 26487 31548 -4781 -39603 -21465 22727 34870 13849 -11801
268 -11801 -29629 -17011 28050 44750 2980 -31760 -21636 1315 23507 34818 414 -42394
280 -42394 -25151 18915 27694 12177 -10115 -34003 -23967 20670 34494 545 -27850 -25119
292 -25119 -5903 18869 28216 281 -34570 -24196 13892 27790 14141 -6429 -26571 -19659
304 -19659 20176 37554 6766 -21379 -19057 -3506 19363 32174 3952 -30240 -20043 12206
316A2206J0803p903k0140k2675Q553L6034J1541k5878k3780n13J4206K3142J0101
329B5697k6697l0899J0595L1043J0962o763j8823k2150O384L7985J3797k5801
341E330k2131j370J0711K3920J3669k4868l1532Q600K7186J0898l977j6744k3320
354b3628M247L4423J3434k2798k1843l034R546K2197J3880k2220l0903N113K5733
367D147J2485j920j5086k3254K016L1281J5131j7944j8685m879O663K0711J4325
380B4991j9628k6132M555K1439J1087p44j4353k0904K680K8950J2354j6886j8145
393a0736n089N772K1079J3538j9325k5822L622J8892J1062J383j3168k1331J489
406a8634K7284J2069j5165j5774n159M946J9588J3245j7949k4464L790J8638J0700
$$ plain form
316 12206 23009 15106 -5034 -27709 -19156 16878 28419 2541 -21239 -21752 -7546 15596 25697
329 25697 -1000 -31899 -21304 9739 20701 13938 -4885 -27035 -20651 17334 31131 5330
341 5330 -16801 -18171 -7460 16460 30129 5261 -26271 -17671 9515 20413 16436 -308 -23628
354 -23628 -19381 15042 28476 5678 -16165 -19199 -9653 12544 26424 4204 -26699 -21586 4147
367 4147 16632 14712 -374 -23628 -21612 9669 24800 6856 -11829 -16708 -10045 10666 24991
380 24991 5363 -20769 -16214 5225 16312 15568 1215 -19689 -17009 11941 24295 7409 -10736
393 -10736 -15825 -10053 11026 24564 5239 -20583 -16961 1931 12993 14376 1208 -20123 -18634
406 -18634 8650 20719 5554 -10220 -15379 -10433 9155 22400 4451 -20013 -16223 2415 13115
419A3115K285j2392k2286R52K6884J3124j3007j5782p447K779J9358J5385j5293
432G675k3672Q78J5352J0050M192r999k0906p38K3373J1579j0428j3435p882K454
446a1507J8348J3481j3932k1642p7J3543J1237M878r997j9542k001K1394J2121
459A6304q058j2116q088M16J6481J3704j2486j8761J47J1477R464N151r463j8882
473a4710K68J9943J0284p196j2322r016J419J7548J2593j1740j8950j820J0878
486b821J0666O367q927j9000k153J8421J1080o380r707r038q75J6142J3236j0880
500F131j7138j261Q365J0302P924q795j8751j541J7218J0879l316j0078j0787
513a0848r87J5495J3033q003j6530l328P670Q771P567o020j7590k974J5719Q856
$$ plain form
419 13115 15400 3008 -19278 -18326 8558 21682 8675 -7107 -14554 -11775 7583 22968 7675
432 7675 -15997 -15119 233 10283 14475 4476 -16430 -17168 6205 17784 7356 -6079 -13961 -11507
446 -11507 6841 20322 6390 -15252 -15329 -1786 9451 14329 4332 -15210 -17211 4183 16304
459 16304 8246 -3870 -11958 -11542 4939 18643 6157 -12604 -12457 -980 8484 13635 4172 -14710
473 -14710 -14442 5501 15785 8589 -3733 -12749 -11330 6218 18811 7071 -11879 -13699 -2821
486 -2821 7845 14212 5285 -13715 -15868 2553 13633 7253 -2454 -11492 -12367 3775 17011 6131
500 6131 -11007 -12268 -3903 6399 14323 5528 -13223 -14764 2454 13333 10017 -61 -10848
513 -10848 -11835 3660 16693 8690 -7840 -11168 -3498 5273 12840 6820 -10770 -13744 1975 10831
527A0831m259p046r056k786J5122J1998r548j3788k104N078R838Q109p201j6294
541a1106k303J3217J0553j256q624r611j712J2865J2768o569j5156k552O310P736
555D560P790n443j6748k200J4601P373k847n812j0315k679J4362J0679p466j1627
569e772m078K992R809Q516o015j4062m191J0489J0403K93o746r533l607J1115
583c87J3003n280j2582k935L606O823R375m020j6032j882J1540N862P30m244j1083
598g506k912J2156Q737m299q843m940J618P705P500l361j1937m895Q372Q766O7
613F228m131q047n090J0106J2051m883j0724k430J351O816J0046m842j4085j527
627i161Q989N818K299m692j0264j884R946Q124k523q597n666K487O693O649j570
$$ plain form
527 10831 6572 -474 -9530 -12316 2806 14804 5256 -8532 -10636 -5558 4280 12389 5188 -11106
541 -11106 -13409 -192 10361 9105 481 -9130 -10842 2023 14791 8222 -6934 -9486 -3176 4560
555 4560 12350 6907 -9841 -12041 2560 9933 7086 1274 -9041 -11720 2642 13321 5855 -5772
569 -5772 -9850 -6858 2951 11467 5452 -8610 -12801 -2312 8091 8384 1638 -7895 -11502 -387
583 -387 12616 7336 -5246 -8181 -4575 2248 11623 7603 -8429 -10311 1229 7091 7821 3577 -7506
598 -7506 -10418 1738 10475 6176 -2667 -7607 -5989 1716 9216 5855 -6082 -10977 -2605 6161 6228
613 6228 2097 -5950 -11040 -934 11117 6234 -4490 -6920 -5569 1247 11293 6451 -7634 -9161
627 -9161 -172 5646 7945 3253 -7011 -8895 1051 9175 6652 -1945 -7611 -5124 1569 8218 6648
642F648j0922n665P515P475J171k556q888n953R818J0630l556p489l808j889P320
657a49J0574m703j1628k044N291O267M263m103r491k623P859P668r18p139m949
672e825Q00N163O917k95j0285m183N902N189J820r0r109n663Q844Q336k433n147
688e9m676k813P682R024l805r721k673L544O740L865m049q059k880O591Q013q73
704E851p255l647K88L925P540l97r721l502N393L553K765P45r193m991Q119O171
720E644p72l208n556l176O603Q206k092p765m184K349O213L894k579o781m104
735g308M759Q076m40n186l452j303K963P938p91q458k027L345K223M114P43q225
751c029l911N632M877R11j929n842k831N510O546n54n990m659J609N505L217r61
$$ plain form
642 6648 -4274 -9939 -2424 5051 6222 3666 -5222 -11175 -1357 9273 5717 -1772 -5580 -7469 -149
657 -149 10425 5722 -5906 -7950 -2659 3608 7871 3768 -5723 -8346 -487 7181 6263 -876 -5825
672 -5825 -5025 138 7055 6760 -3525 -7708 -1806 3383 5203 5113 -3996 -9659 -815 7521 5088 -59
688 -59 -4735 -7548 134 9158 5353 -4368 -7041 -3497 3243 7108 3059 -5000 -7880 -1289 6724 5851
704 5851 -1404 -5051 -4763 -838 6702 6305 -3416 -6918 -1525 2028 4793 5538 -3655 -8646 -527 5644
720 5644 4872 1664 -3892 -7068 -465 7741 5649 -2116 -6300 -3951 2262 6156 3577 -3204 -7308
735 -7308 -2549 5527 5087 -99 -3551 -4854 -1891 6047 5256 -3202 -5229 -1884 339 4453 5196 -3029
751 -3029 -6940 -1308 3569 4480 2551 -3291 -6122 -612 5934 5380 -610 -5269 -3660 1845 5062 4101
767D101o190m913M610P285l85m076l167k836L442Q077j309p298j838J691K443
782c63N466m19p472l167L959M507J952j933n309k949M010O405N77n129m990J197
798c658M374L813O36o459n165M267O023O8k405l500l779L737P476j385n583j417
814b957j20K121N215m03n901k814K818L704K286j412m580k286K462N262J198m800
830b07l525R10K642L554J153n553m125L513M471M73j360l548l628M069N673q31
846C681l963k327p94K581M682l72m699l036J839M168J544j219l729k640J795N485
862B996J377m384k810p0J603M172J751n519l749K415L588J978l86l979l348K587
878a778M805N61k803k457j590K663L948M42m154k968J063L513J295m71k754k930
$$ plain form
767 4101 -2089 -7002 -2392 4893 4508 432 -2735 -5571 -2129 5948 4639 -2659 -4497 -2806 -363
782 -363 5103 4684 -2788 -5955 -1996 2511 4463 2530 -2779 -5728 -1718 4687 5264 135 -4855 -3658
798 -3658 716 4529 5165 -1294 -6459 -2192 3831 3899 1494 -2006 -5785 -2048 5428 4043 -1540 -2957
814 -2957 -3077 -956 4259 3856 -2045 -4859 -2041 1663 3949 2537 -2043 -4329 -1867 3395 4593 -207
830 -207 -3732 -2822 -180 3374 4527 -1026 -5151 -1638 2833 3306 1946 -1602 -5230 -1161 4512 3681
846 3681 -282 -2609 -3403 -822 3860 3488 -1211 -4247 -2408 1760 3304 2085 -1644 -4284 -2489 2996
862 2996 4373 -11 -2821 -2891 -1288 2884 4635 -884 -4633 -2218 1370 3348 2962 -1017 -4365 -1778
878 -1778 3027 3588 785 -1672 -3262 -599 3349 3791 -363 -3331 -2268 1245 2540 2069 -685 -3615
894c615J396M809P54l441j938p41J329L993J158m668k723J844K444J797M00l600
910h02k974K021M364O74k764k394j238K367L477M58l400k794J042L122J145j6
926B288k511l677J871M302M15j994k075j615J618L895J071l943k630M30K549K388
942B382J54l068k713J701L376J192k034k262j340J230L643J076l275k924J309
957a553J816J718M25k321l124J116L872M05j178k267j194P70L380J077k881k053
973a992K22J739J888J25k116k843Q96L548P81j708j635j454J325K891J116k843
989f0k160L76J705J652R13k447k805J093L155N77q74j903j525R79L108J198k748
1006B34k043r6J861K012J05j878k775P79K842J093j167j872j027m1L472J241k692
$$ plain form
894 -3615 -2219 2590 3344 -97 -2035 -2776 -1447 2546 3704 -964 -3687 -1843 601 2398 2798 -802
910 -802 -3776 -1755 2609 3283 519 -1875 -3113 -746 2731 3189 -211 -3005 -1963 1159 2304 2288
926 2288 -223 -3900 -2029 2273 2688 694 -1381 -2996 -1378 2517 3588 -355 -2985 -2555 -6 2382
942 2382 2536 -532 -3245 -1544 1832 3024 990 -1272 -2612 -1382 2261 3337 62 -2862 -1553
957 -1553 263 1981 2406 85 -3039 -1923 1949 2354 1176 -1091 -2285 -1515 1865 2942 61 -1992
973 -1992 -1770 -31 1857 1982 -134 -2977 -2081 1467 2248 540 -1095 -2549 -1224 1667 2783 -60
989 -60 -2220 -1844 -139 1513 2426 -21 -2826 -1733 1422 1999 1125 -778 -2303 -1324 1784 2982 234
1006 234 -1809 -1905 -44 1968 2073 195 -2580 -1801 1041 2134 967 -905 -1932 -1973 1499 2740 48
1023D8j854m08J894J563J173k267k581P86K350J004m65j565k081J005K443J248
1039B293k048j674j27J188K039M12j869k292P27K117O09j40j448j803O92K628
1055A304P80j793j573l69J057J705J076k210k210M01K653O31j33j688j803O51
1071a521K658J084k006j603k9P70J478J114j693k202M65K110Q07k90j206j441
1087a505j91K772Q86j436j354o23P17J729R39j083k528J68J854J007M9j560j776
1104a935O85J773J255j269j506k53R1K044J076j741j844K78J431J212J60j309
1120A48j792N64K203P67j463j153n67Q09J360N47j009j718j82J772Q30k86j148
1137c18j082Q3J899M49m29j402n96M67J349J173j273j658oJ076J377J38j054j338
$$ plain form
1023 48 -1806 -2214 -320 1243 2416 149 -2432 -1646 704 1708 1243 -322 -2403 -1398 1045 2293
1039 2293 245 -1429 -1556 -368 1671 2083 214 -2078 -1351 766 1375 1235 -213 -2016 -1324 1304
1055 1304 2084 291 -1282 -1651 -594 1111 2187 -23 -2233 -1832 821 1452 1319 -369 -2172 -1521
1071 -1521 1137 2221 215 -1388 -1417 -647 831 1945 252 -1950 -1485 625 1432 1142 -64 -1505
1087 -1505 -1696 1076 1962 526 -828 -1451 -734 995 1934 851 -1677 -1509 345 1352 1401 -159 -1935
1104 -1935 -1250 523 1778 509 -997 -1250 -1159 885 1961 220 -1624 -1346 85 1297 1457 148
1120 148 -1644 -1080 1123 1890 427 -726 -1293 -484 876 1423 414 -1304 -1486 286 1116 830 -318
1137 -318 -1400 -1317 582 1031 602 -800 -1396 -929 420 1593 320 -1338 -1344 -268 1109 1247 193 -1145
1155a145k17K130N85p91j322n34M62J331R12j220j715M45R17J046K63j020j674
1172a547K92J534J099n66j369p76M94J431J246j545j713L06R99R87J31r84j114
1189a095k40J711J058o81q40j122K31J898M13p82j480m01J178R81N09j018j397
1206a077R9J401R50q16o86p60OJ677Q60j239j021l07N96P94R04j421j321L99J341
1225C79O86k98j119n85J5J450J103j127j426R1M05J025L46n42j573j46J888M98
1243A070k75p43j123M75J196N14q14j004m2K05J272M86q75j248n2J145P34m08
1261E13q10p49rJ437P22m68j330J3N72M43N29o51j043k42J321Q13m27m59j016
1280h41m6J614K24q33o52m10P15P62P85r24j149k34J103J071k58q52p96j12J070
$$ plain form
1155 -1145 -1362 768 1353 562 -760 -1294 -832 499 1411 191 -1524 -1079 -162 884 1147 127 -1547
1172 -1547 -1255 279 1378 812 -557 -1333 -839 592 1838 293 -1420 -1114 -115 872 1003 19 -1095
1189 -1095 -1335 376 1434 753 -87 -1209 -978 920 1333 551 -929 -1330 -152 829 1338 320 -1077
1206 -1077 -978 423 1373 557 -129 -889 -883 794 1654 415 -606 -913 -317 477 1381 -40 -1361 -962 379
1225 379 1065 767 -352 -937 -922 528 1631 504 -922 -831 -426 599 945 403 -1170 -1316 572 1070
1243 1070 795 52 -1071 -596 600 1114 300 -704 -746 -541 731 1217 342 -906 -958 187 921 513
1261 513 -297 -1046 -1055 382 1104 636 -694 -681 -109 334 863 212 -831 -1073 248 1061 634 175 -841
1280 -841 -887 727 951 118 -534 -944 -229 533 1318 394 -755 -989 114 1185 927 75 -721 -833 237
1299B37R61o78j291n0N24M90N95l26j005m29P16P62K86q32q24N5Q77J064p38q82
1319d88l27L22R19O52p77j123j28O23J304k33p46p92L11N51Q91l50r77m20L65
1338d23N58Q70q24j115O49L47N00J61q06p15K0P46Q80k00q82j92j48Q54K85l42
1358B23p77m00P49Q62J69n40n90m82O95J097q08k85m95k60R44P62j99j523K39
1377f19P66L10K35n37p11l37P66J024k82o58n26L89K57P90n21n44r52Q00Q22p0
1397D02l0q53l74Q70Q51m87l55k40l13N79Q01m25o92o55P84M77L90o09r53K89
1417e43M14Q10j96m96q41M82L34Q12j14j009m14R23l7L52o6j135MQ71M87k61l10
1438F7p54n8Q69O75o73l25k33J52N73M23l11o53m09M64R76k65n65j17n29P25Q42
$$ plain form
1299 237 1198 520 -771 -821 -297 193 788 462 -543 -972 -256 506 792 -40 -864 -809 68 1132 394 -488
1319 -488 -815 -493 426 1078 301 -822 -950 -327 977 744 -2 -794 -483 68 959 609 -368 -788 -423
1338 -423 135 1005 181 -934 -285 62 562 723 -83 -798 -778 -32 848 648 -234 -426 -574 280 565 223
1358 223 -554 -954 -205 657 826 286 -304 -786 -91 1006 198 -87 -582 -842 102 864 665 -858 -619
1377 -619 147 457 692 155 -556 -893 -127 897 615 -43 -569 -180 77 867 346 -198 -1150 -350 472 402
1397 402 372 -481 -855 15 866 379 24 -216 -529 50 851 426 -266 -921 -137 340 730 121 -832 -543
1417 -543 -129 681 485 -11 -852 -370 -36 776 662 -347 -761 162 125 477 411 -724 -720 151 638 377 67
1438 67 -687 -745 124 799 126 -199 -432 -280 293 716 405 -248 -657 -193 783 518 -47 -164 -693 32 874
1459H74m30q50j60K36O61N84n01r76k4M94N31r2j27m84l99O31M50j09p20j41J
1480e51Q13M57l83p08k25M66P93k80l87j07k22L35O40j17o39k36K71K16M52l5
1500E53r40l01O09M74l00Q1p97J38R13M6oq08n3p2M67M19l84k91m22O60K79J04
1522C69m92m21L7K09N03R9m00k68L0L85K43K40o61n04L82N08J33j16j043N48J57
1543f2Q33k61r61QK0P67L02l85p42j85M45P41l26L7l40m55P12L78J9m44m43n7
1565c99J41P28l94m66j28J77Q82K17m27o55q8M14N34j70j74o49j60M88L59L0p07
1586d47j77M41O88k65j22q8n35N88L29l00o00K84J79Q8K92K8n53k40J41M3M00
1607A74j07p9n74K50P56N2n52j27k14L61K32K79q74k40P14L13J01l25m08l01N64
$$ plain form
1459 874 444 -406 -566 -330 331 915 414 -562 -586 -92 439 347 220 -264 -663 -32 418 309 -411 -552 -551
1480 -551 262 719 336 -372 -597 -131 662 382 -5 -112 -334 1 641 524 -115 -351 -80 136 588 553
1500 553 -387 -688 -79 395 95 176 -621 -483 430 476 470 -338 -391 -463 4 423 39 -252 -674 -14 265 369
1522 369 -123 -544 -507 -298 205 304 -96 -364 -334 51 294 534 -127 -631 -249 259 392 276 -767 -219 -62
1543 -62 771 510 -451 -443 -423 344 646 261 -481 -666 -221 520 194 231 -109 -564 148 526 545 101 -342 -399
1565 -399 -258 470 76 -390 -518 -341 541 758 331 -324 -412 2 536 366 192 -457 -617 -129 230 260 -447
1586 -447 -624 -183 505 240 118 30 -505 83 412 112 -488 -204 -25 63 355 383 -170 -410 -269 -226 174
1607 174 67 -12 -586 -336 420 472 -80 -207 -421 -60 172 451 -423 -663 51 364 465 140 -268 -569 -5
1628eL91n2k04l48l26L59O35M9n72r26O68N46J04o9k65l78M87J94O9l27n99J57
1650d12J69N12j8n15k15M64j06K39J49l39o93P54K80j07j91q8j13O6L25K41o51
1671b49n49M82J27M30j29j67q1r6L24J52j39m82l5K85L35K2j23m52L56J08L29
1692D48K2q03L1j14O01j51M2k20l05K99N17K9o81j41l7M72K71j68K6n52M01L05
1714B92o1j44q4k83Q8O51j99O9o75j71L87M11L1m13j37pO86j20j89k05j78K04
1736d7N63k02l35m27J36L1J83M86m95k46K18K20K11P5l89j31q3J64L24k40j95
1757a79p2j07O00L32p85j1r9O61k04m27K72j77J81L13O1m65j00j55M61K20M4n85
1779b21r5N5M16K78j82m31J33p7J64J21o3j03l5j22P36l67m3j36l82L04L84m8
$$ plain form
1628 -5 386 334 130 -218 -544 -185 450 499 -73 -999 -331 215 319 250 -15 -393 94 288 357 30 -569 -412
1650 -412 -243 269 251 -264 -479 -15 -121 118 267 -72 -765 -11 269 162 -29 -117 -230 -164 161 402 -249
1671 -249 -798 -316 -189 241 112 -55 -136 -232 92 244 105 -377 -412 -127 208 230 107 -345 11 119 448
1692 448 470 -333 -302 -416 185 34 76 -144 -449 -150 367 396 -285 -426 -463 9 280 112 138 -414 -13 292
1714 292 231 87 3 -280 -192 459 260 329 -346 -517 -130 281 312 -101 -238 -245 441 321 132 -73 -251 -47
1736 -47 516 314 -21 -448 -312 -281 -98 388 -107 -353 -135 85 296 371 -18 -149 -232 -68 256 16 -179
1757 -179 -251 -358 242 574 -211 -222 -321 340 136 -291 -19 -196 -15 298 359 -106 -206 -361 100 320 364 -221
1779 -221 -316 -261 155 433 251 -180 -47 -124 40 161 98 -5 -40 -162 574 207 164 28 -354 -50 334 286
1801B86j97o56L06L61Q4m64J88j94J40N94k78o1o86L97K2M08K74m96n22K24M22
1822A52pK1k91K38j07j2J19k41m0j0K62R3m9k93k52K66K56j1j14jk18O7K58K70
1846C56j33n83J74M04j56n4k06j24L68k0LK72n45L98k94M35j28j10m35J47L95
1867A64k28M30k62k32J39J17K85l81k86n6J76q1Q32m99j33j72K53k8M7J23k17
1888il33P6M39j17k35K3k25Q17K49p19j23MK22K04k32q4p5n5M00R6j49j78k25
1911b29K86L1R8m22p5J31j43J18M70m29n6j16L92L8j41N7n69N06K25J95pm15p3
1934a28Q2K39r5J75l08r9J12K37r3j89k95K32J75K9j70J05j35J90J07P2k55l55
1956c67L59J54j27J07L3l81J6J28K80J6q7l21L01Q6l18Q0j52J06J17J51R7k05
$$ plain form
1801 286 89 -567 -261 100 184 -280 -92 -286 -146 448 170 109 -577 -180 -158 250 524 28 -494 -270 152
1822 152 145 166 -125 113 6 -6 113 -128 -168 -178 84 177 128 -165 -417 -151 105 94 -20 -21 -239 -172 86 356
1846 356 223 -360 -186 218 62 8 -198 -322 46 26 29 301 -244 154 -140 295 167 57 -378 -231 164
1867 164 -64 366 104 -128 11 128 413 32 -254 -310 -134 -215 617 118 -15 -187 66 38 85 208 -9
1888 -9 -342 -266 173 56 -179 -156 -381 436 685 -34 -157 -153 69 273 41 -43 -118 -173 227 323 174 -4 -229
1911 -229 57 88 186 -236 -311 -180 -323 -205 265 -164 -220 -336 56 94 -47 10 -559 -53 172 367 360 -55 -128
1934 -128 -46 193 98 273 -35 -134 -22 215 122 -67 -362 -130 45 74 -96 9 -126 64 171 243 -12 -367
1956 -367 -8 146 19 126 159 -222 -206 -78 202 218 131 -190 111 197 -121 -41 -193 -87 30 181 278 73
1978G3j79j16N21J32l79l01P2N4K23J16R6n47L80l1l02K55m4m87J06J7Q56j95
2000C20o30j92K71K57J54k8o30O12j07Q4J16k77K6j7N2K32j21l73L12j15k50N77
2022B73j74j21l6j91N86r3k46j74j02M88m9l9q3k84J59L13j01k13r3M2Q2Q2R0
2045A16ol61Q6K41n6K07J0m01pQ4n8L94n53J80k5L92k64J87k55k37Q9K28M0J64
2069A95k60j62K56j11K38k85J6L69k18j56N1j7L69r0P9k46l0j03l7m2K36J31k72
2092h9K00j47M8M33m24q9m32K11L83l7Q1m43n9O14m5l51k52j49M23L76j09o3j29
2115d9k47Q7L64M4p0k85J73k84N58j79N8j51j55N7K11k59j8K66k96O06k26l88
2137a83J27k17L02K0M9j19j48R4J09J05Kl71J92j32K60j86L4Q0j36L02k85L22
$$ plain form
1978 73 -106 -222 299 431 52 -249 -177 -123 100 216 312 -235 145 114 -188 67 23 -464 -358 -341 515 320
2000 320 -310 -502 -231 26 180 152 -478 134 27 111 227 -50 -24 -41 11 243 122 -251 61 -54 -304 273
2022 273 99 -22 -58 -249 337 244 -2 -176 -278 210 161 122 39 -245 -86 227 126 -87 -180 -138 -56 26 116
2045 116 110 -251 -165 76 20 227 237 -164 -171 -87 -145 249 -304 -124 -149 243 -21 166 -89 -326 -237 -9 31 195
2069 195 -65 -227 29 -82 156 -129 -113 256 38 -118 -67 -84 285 195 274 28 -2 -105 -142 -184 52 183 -89
2092 -89 111 -36 12 445 21 -68 -500 -289 94 57 138 -305 -364 250 205 -146 -398 -547 -124 252 143 80 -49
2115 -49 -296 -209 155 199 129 -156 17 -267 291 112 170 19 -136 -79 132 -127 -145 121 -175 431 205 -183
2137 -183 -56 -273 29 49 98 -21 -169 -75 34 139 141 -230 -38 -170 90 -96 -62 18 -118 184 -101 221
2159B21k59j04l0l9J66J6J14l55L38K9Q9l95j64J65K47N1j53M33l67k31M35j29
2181G8K4k44K89j26j25J88K5j56Mm5K49m5k96N9m9N4J96j13N2j22k5L72k91Q0
2205C3Jk69L41k69J41O3k76J26J11J03j95j92L61n4J44K38m33k82J17J29l3P8
2227a7k79L43j88j9L24J75n78K76J0j54J13K12k61n7n1N97k95m26K78l03L84o7
2249A7J58l84L04k63r0L47j74J10m72M53N6Np4k86M34j84J95l92L86m7n05P19
2271C13l04J08m69J48J87p8J86M3l42K28l1M1K25j71k14L6jLL21o50M11j27M39
2294C02k30N6n2l9j21K55L02p92J24J08N89l22j50o4o5L77l73K35J1q1j96J85
2316E9n6n9K80m16J33J01J45j7j81O5q7M9Q9k66K5J86R7JL4J66l99J01lL66l83
$$ plain form
2159 221 -38 -142 -172 -211 -45 -29 85 -270 68 97 186 -209 -373 -208 39 90 -63 370 3 -228 207 78
2181 78 102 -142 147 21 -104 84 109 -47 -43 -88 161 116 -180 -121 -170 -116 80 -33 19 -103 -128 244 -47 33
2205 33 34 -235 106 -163 -22 41 -235 -109 2 105 -90 -282 79 25 169 407 -26 -308 -191 -62 -95 -17
2227 -17 -296 47 -141 -160 164 339 -239 37 47 -107 6 218 -43 -100 -151 446 151 -275 3 -300 84 17
2249 17 175 -209 95 -168 -258 89 -85 25 -447 6 62 67 -7 -293 141 -43 152 -240 146 99 -406 313
2271 313 9 117 -352 -204 -17 -95 91 134 -208 20 -11 30 255 84 -130 -94 -95 -92 229 -421 -10 -137 302
2294 302 72 128 76 37 -84 171 473 -319 -195 -87 502 180 30 -34 -99 278 -95 140 151 70 -126 59
2316 59 3 -56 224 -192 -59 42 187 170 -11 54 -33 16 105 -161 -136 50 147 148 182 348 -51 50 47 413 30
2341C0J75n0l86M68k08j3l52K32M39l61J26k16J48k08K05J05k25K17m76L60j68
2362a58K03p1j49p5K66K41m01j25K77k29O1M08l03R3O6j76k14K29K24m6k84J68
2384EQ3q1J05Qj79Q6j68K18n6N0j1J98M1m22J1J40k02R6M73m83K51q8j60J12j1
2409A6j65J27l7MK05k14j41L26Q6k43j90K52j33K61n51K34Q8p9J01k8K13J05J
2432B38k02q5r3O3J09k6l49L08k84O35l65k25J03J80R8Qn27O2K53M4K31k45J29
2455F0r3O9j99K66j38K03k93j1J23K05l20K21j83K01j93l8K73l29P6N5L81k51
2477H5J45k44p0L04j16J11J13l68l44L45K46l18j63L96J38l97J29J86R5k76J02
2498I9M6l62K23p9NR4j37j9j10J06J28p2L75l07l5j66L10k13L00q8L9q6Q2J78
$$ plain form
2341 30 205 155 -231 237 29 16 -336 -104 335 -26 100 -116 32 -176 29 134 -91 126 -350 10 -158
2362 -158 45 -26 -175 -250 16 257 -144 -269 8 -221 -160 248 -55 38 104 -72 -286 -57 167 121 -163 5
2384 5 88 7 112 120 -59 27 -141 77 21 71 60 258 299 -123 -112 28 -174 -78 395 -88 163 75 -85 27 16
2409 16 -149 -22 -59 -55 150 -64 -205 121 207 -36 -226 26 -107 154 -397 -163 -75 -154 -53 -81 132 237 238
2432 238 36 -49 -142 -79 30 4 -345 -37 -321 314 -51 -276 -173 7 105 113 -414 -352 -99 -55 176 -69 60
2455 60 -33 36 -163 103 -35 168 -125 -136 -13 192 -128 93 -90 111 -82 -120 153 -176 -100 -45 336 85
2477 85 230 -14 -84 220 104 215 328 -40 -384 -39 207 -111 -274 122 260 -137 -8 178 273 -3 99
2498 99 145 -217 6 -73 -68 26 -111 -130 -240 -134 -6 -78 297 -10 -45 -211 99 -114 186 98 137 51 133 311
2522C11l72j42j23K15M21m6j96k55L08k06NJ96j48oM3j13J86o1l6j6j56K26O1
2545I6LJ96k01Mp2k01J36j35N42j66n23L20q1J78j98p4J56K16m45J46L99p3J04
2568C27l68J45Q3m3k29K09j41o3L03k98J90k2l02K77j17J25J38j78k78J55J39
2589E2j31K32l25L6J77j66J29j23p8K11q4P6j27q1K36l6J54L9k04m10M31k15R3
2612a14J51k99J51MJ31j23P9K53m60K33kK19k71p3O8j21J55P7j83J59K5j63N0
2635e4p0N8j4J41J12j1k12J95l37K68n4P4QM5j4k47L91l09k15K25J5j50K34K18
2659B97l70K14j7o5J01j74j49K91n44L57J25P8j76J52k33o9J40L1J28k86J63j25
2681a31O5J27K98k21l54P9L45l80J23L02l90L47m1m22o9K57K17k47O1J10k65L24
$$ plain form
2522 311 -61 -203 -326 -111 310 264 68 -187 121 -85 -80 116 -32 -38 5 -108 78 17 -19 -35 -191 35 96
2545 96 99 295 94 98 26 -175 -39 -174 368 202 -321 -1 -82 96 -102 -176 -20 196 -249 -103 296 223 327
2568 327 -41 104 187 144 -85 124 -17 -80 223 -75 115 93 -209 68 -49 76 214 36 -242 -87 52
2589 52 -79 153 -172 -136 41 -125 4 -119 -197 14 -70 6 -121 -202 34 -2 152 191 -13 -423 8 -207 -114
2612 -114 37 -262 -111 -107 24 -99 -20 233 -227 6 4 223 -48 -121 -53 -174 -19 58 -125 34 59 -104 -54
2635 -54 -124 -66 -80 61 173 162 -50 145 -192 76 22 96 104 149 135 -112 279 -30 -245 -20 -5 -155 79 297
2659 297 -73 141 124 59 160 -14 -163 128 -416 -59 66 144 -32 120 -113 -182 -42 -11 117 -169 -6 -131
2681 -131 -66 61 359 138 -216 -137 208 -172 -49 253 -137 210 169 -253 -322 -65 152 -95 -34 76 -189 135
2703A35k65qo4j85M24J71M1o3o9m05K90k51J96P5J33k63J79j22j35N30n15K4J10
2726c7J85R5l11o4OL84r1j3n7q2l15L0K84m1P0q3O5J24K72q1o84K75J62K5k89
2751a71J50K7J77j03J8k2O4j35J72k14R0j64k84N78J41j43j71j93K20k8L5l20
2773b76m5K27J93L12n11P6J26k32K90o9jkl74L86J39j10k02J1q2K50O8k27K0J59
2797A26m8j59k0K61N0q9L3l59K08o7k61K93K4RJ93j61N5k3k8P3n5j29k36R7J71
2822d2MJ79M0j32l04M9l1L88kq7j1j85J9K99q2K4Q4k34J2J71m74Q4K26Kj10J45
2848C2k1j45R4k0j62K58k55K03L3m8J59j31j32J81J04j69J97J43o29N92n29L75
2870A30k2mk13K28j01j46P8j28J95P0j92J39o3L10l78L72j95k33M26j32k83P4
$$ plain form
2703 135 -130 -138 -202 -387 37 208 249 186 117 -288 2 -249 -53 22 155 -108 71 -51 -186 344 -171 -147 -37
2726 -37 148 243 -68 -132 -126 258 167 154 97 15 -300 -270 14 -27 43 -40 25 149 421 340 -344 -69 93 118 -171
2751 -171 -21 6 183 80 98 76 140 5 177 -37 53 -111 -395 183 324 181 10 -183 37 9 44 -276
2773 -276 -321 -94 99 411 -100 -24 102 -130 160 91 90 88 -286 100 239 129 -73 -62 -144 106 174 -53 -33 126
2797 126 78 -81 -101 160 210 121 154 -205 3 -64 -325 -32 -8 1 194 33 88 65 37 110 55 -74 -310 -213 -42
2822 -42 -38 141 181 49 -255 -206 -237 151 149 62 51 -134 -115 184 102 126 210 -24 -12 159 -315 -231 -5 -3 -113 32
2848 32 11 -134 -40 -60 -222 36 -219 -16 17 -31 128 -3 -135 46 150 -19 178 321 -308 284 -245 130
2870 130 108 104 -109 119 18 -128 -50 -178 17 87 -105 34 -29 281 -97 275 80 -153 273 141 -142 -68
2892f8R7K9j89J36K02k88J14k27q7L79J60l13J35j48R5M94l10j42J35l64K46j01
2914a5J46l47K84RR0l27R6P5K61l23R1K84o55N69k82K6J04j34n4N7QK96k86N6
2938B9l07M22L19p31K5L24P9l98L36k08m7K99j08O8O1r1P8k75J87p0J01J0j22
2961a9O2M1R9m33L09k41J38J1J24j64J84O7J8j95L7N6j48K65p0l16O4K84j22k15
2985a64J90J60r0J8k15q5J95n8M7j66P0Q6q2j23L91N3l42q7R8M1J11pL00k71k68
3010a98K45j6K5O4j02K4n1J19j43pJ68p3k9L9k70J84j95K66kl38L44J21n2j96
3034g3Qm5p8R8O7o1J99K2k04J38j74k00K26m2J85mk67J60K4j68J79l0N73m66J04
3059A71l27J81j4J88j32M1j63N2K71m09J31Q2qj63r1K56J83k44j28OJ35k01K01
$$ plain form
2892 -68 29 58 -131 5 207 -81 33 -194 -281 98 258 -55 80 -68 27 521 211 69 204 -160 86 -15
2914 -15 131 -216 68 77 167 -160 -64 11 272 -51 40 324 -331 238 -44 -18 86 -48 -102 -45 -37 259 -27 29
2938 29 -278 144 463 -268 -243 81 160 -238 98 -110 -157 142 34 102 163 72 150 -125 62 -8 93 103 -19
2961 -19 43 84 183 -250 59 -182 -44 -33 91 -73 111 178 196 1 38 94 -54 211 141 -175 -111 173 51 -164
2985 -164 26 186 96 114 -101 -186 9 -49 -2 -168 -98 -12 -94 -217 174 227 -115 -202 -104 -63 48 41 341 70 -198
3010 -198 47 31 56 120 18 42 -9 110 -33 -40 128 55 26 65 -205 -21 -216 50 48 -290 54 175 123 -73
3034 -73 -65 -110 -188 -90 -23 -84 115 137 -67 71 -103 -303 -77 -119 66 62 -205 -45 -21 -189 -10 -40 533 67 171
3059 171 -156 25 11 199 67 108 -55 -3 268 -141 -10 72 64 -99 -190 66 249 5 -123 -117 18 -183 18
3082A8j08L43l94k3K8q0J75k40L86k45J54k41J2K84N6j00m1j77J29p2N4j8j12
3105b12J98m8J56j17K17l22J33J69j64k04K14O6j8j3o0L83o49N09j94k2J48n0
3127A20m02L91j49j14R1o3K02r4j63q6M07J5k28o6j03P3J25J5J73J28k86R5n5
3150B6J2N5m3j51J45Q8m4m19K66O7L07m01J7L18J33l55k9K1Q0O8l27J85j13k8
3174a22o8J96l6J67j04r8J2M7Q1J99J8k87N6l70N4l3K44j6j32l3K71r2K30j79
3198Eo7L6k65K28J7OR0j70J44q7K23M6j34jJ4K34j62k37l74N91j27J5j73M6k0
3223a22K14j34K4j60J55R8j6j47J25j33R6N3J19O3l45K47m41J06j93O05ONk89
3246f4L2k93L58L42k03m12K37Q4k98M37n12K07J04P7J58j32m26K98j24j58K93
$$ plain form
3082 18 -90 253 -141 -164 -136 -216 -41 -281 105 -140 14 -227 -215 69 125 25 -16 -193 -64 -136 -82 -100 -212
3105 -212 -14 -62 94 -23 194 -128 5 174 10 -194 20 86 68 55 -5 378 -271 238 44 22 170 120
3127 120 -282 109 -40 -154 -63 -126 76 -18 -181 -267 140 155 -73 -139 -242 -169 -44 -29 144 272 -14 81 26
3150 26 38 93 50 -101 44 132 88 -331 -65 2 309 -92 -75 243 376 21 -8 13 93 161 -166 19 -94 -122
3174 -122 -190 6 -30 137 33 -65 -53 -6 75 274 292 5 61 -309 -255 -288 -44 -60 -192 -225 46 -46 184 5
3198 5 -62 -26 -291 -63 -46 -40 50 -120 24 -63 160 206 72 71 85 319 157 -80 -454 137 10 25 -148 -102 -122
3223 -122 92 -42 -18 -178 -23 75 59 -88 37 -96 0 53 172 235 -110 137 -304 -198 -391 214 220 225 -64
3246 -64 -32 -325 33 375 172 -240 -3 81 -217 220 -292 -85 19 96 254 122 -304 -6 -130 -288 5
3267EO5k82q8K87M2O5j98J60R0l23K66J3j85Kj34k56M78J28l45K85j28K30k90
3290a13L39q0k55O6J87N5p3j06j00J92J9l9j60J07l2k02K87l19Q6M4o8J29K0m0
3314e6L59j87r1n6ROK9m8r9kJ06j1qj42J43J81j91J2J45k19O3JJ85l42k2K88k71
3341b18K37J35k0j26J05j15P0J6k94L82p5j76J79L7j17m13M19J07j46J81j48J50
3363A70K52m24KRJ6o3j39K78Q7N7k89J13j68L6q5J84J1O6l41L39j64j30J60m1
3387f4j89J21K55j46J64K5k18Q2o4Rj7M71l36q2j25j04N2L43q8j08J23K3N7l43
3411a59K34lK20k52n5l9j6k9J08L74k13l36L67k86L24k32j48J5q6K10L93l80j4
3434ck50m4N18j9r5K05m08J76K69m97J34K04n5L5k8P9Q4l32J33J54k22K90k58
$$ plain form
3267 5 70 -212 -300 -13 29 94 -104 56 146 -177 89 102 -83 -81 -215 -471 7 135 -210 75 -53 177 -113
3290 -113 226 146 -109 -43 144 199 126 20 -80 112 131 92 -68 39 7 -195 92 -227 -141 -97 -165 -36 -16 -56
3314 -56 303 116 25 -31 -22 -16 13 -35 -134 -136 -30 -41 -49 -191 -48 133 -58 -46 99 -120 -57 -56 129 -213 -235 53 -218
3341 -218 19 154 134 8 113 -2 68 84 -210 172 97 -79 100 137 20 -393 26 133 -13 168 20 170
3363 170 422 -2 0 9 25 -38 -177 101 188 245 -44 69 -99 -63 -148 36 47 113 -228 111 -53 -183 -23 -64
3387 -64 -253 -132 123 -23 141 166 -52 30 -34 -25 -42 429 93 11 -114 -218 -166 177 89 -19 104 127 184 -159
3411 -159 75 72 292 40 -15 -54 -70 -99 9 383 170 -166 201 -85 239 7 -141 -126 -212 -2 391 11 -3
3434 -3 -253 -297 221 202 107 312 -96 80 349 -148 -14 190 135 170 142 221 305 -27 106 260 38 328 70
3457G0j65L42k27k37K50K19m10O3P2J2n9N6m4J55j79n8R2M1P8r8j21K35l54L49
3481H2Qj02J18n1K3n8J00K0j20j13J33j62K34k74j30L24j61L10n2k09K29l20J63
3504hR3K09n62K68L23k14l63K72J1k50j0J41K69l16j09L40r2r1j04L51j49J18
3526A27P6k29j69K03O7k85M86l07p0J14l19L61M2j3J18k17k19J16K62j16p8q8
3548a38L28l05Q7j14J55l43L89j85K93m40L73j37O0q0j37J87J43L0k21K31l86
3569b10L17j90J10j56K92q8q2k52L79l19L29k69j63L37j11K86j18k06K11K18j70
3590A45l52J92J6k83K93P7j66J02l22J93K39k7J42m65J37J61j96K75k54M8J50
3611A05j91n0k9o8M80j2k44k12K26J25o4p4J49k63k5J62j20L31k15r6J67k27p
$$ plain form
3457 70 -95 247 20 -217 33 252 -158 -95 -23 -11 -70 -14 -58 97 -82 -140 -48 -7 71 -27 -148 87 -267 82
3481 82 90 -12 106 55 78 20 120 140 20 -93 40 -122 112 -162 -292 32 -129 181 129 -80 149 -171 -8
3504 -8 85 294 -268 0 323 109 -254 18 29 -221 -231 -90 179 -137 -246 94 2 -89 -193 158 9 127
3526 127 203 -26 -195 8 75 -210 276 -31 -101 13 -306 55 97 84 202 -15 -234 -118 144 28 -50 -138
3548 -138 190 -115 -28 -142 13 -330 59 -126 167 -273 100 -37 23 -57 -194 -7 136 166 -55 176 -210
3569 -210 107 -83 27 -129 163 75 -7 -259 120 -199 130 -139 -302 35 -76 210 92 -114 97 315 145
3590 145 -207 -15 1 -282 11 88 -78 24 -298 -105 134 107 249 -216 -79 82 -114 161 -93 -45 105
3611 105 -86 -136 -165 -233 247 235 -9 -221 5 130 66 -8 141 -122 -147 15 -105 226 11 -85 82 -145 -152
3634a52M4L22k15L15k66j70K26k19K06N7J9l56J99j26j81q6K69o8K80j3j08l4
3656e7N3j67J30K41k29O0k9L52l09K34j70R2P4k92K6r5L14k30J1n6j91J69K5M29
3680C85m45J14J87k30K48j56m2K73l82J71j3Mj10K12l18J16l24K22R9K14l65K09
3702F9j47P0M2J06k74j50p2K60p6K54J11j18j82J68K04l66O8n8o7K81p4j73m0
3725a64J40O3k07K41l19K56j51M87k32k32L11k11P2N5q3j17K0K43k00k20K96J94
3747B42l55L9Q4L77k76m17O92k12k45J87q3l76M29J13m60L09K09m45L10M8k55
3768h5j16K30j24J49K40n13J3K12o8m6mQ1M7j4K48l84J21p1L4K30kk15M04m23
3792e6K10l27m9L02m10L98j66J38k73n1J30M12l97mL93k77P2k86M83l7m7j96L78
$$ plain form
3634 -152 -108 214 -1 314 48 -122 104 -115 91 148 167 -189 10 -116 -297 -383 -114 -182 98 85 -23 -57
3656 -57 -4 -171 -41 200 -29 31 2 354 45 279 109 201 275 -17 9 -86 228 -2 9 -47 -238 -69 -44 385
3680 385 -60 54 241 11 259 103 61 334 -48 123 110 114 4 216 -102 14 -310 -88 11 225 -140 69
3702 69 -78 -8 34 140 -134 -284 -356 -96 -172 82 193 75 -107 61 265 -101 -33 -91 -158 123 49 -124 -164
3725 -164 -24 39 -168 73 -246 10 -141 346 114 -118 193 -18 54 109 26 -91 -71 172 -28 -248 48 242
3747 242 -113 -74 10 387 111 -306 386 174 -71 116 33 -343 86 199 -261 48 257 -188 122 170 -85
3768 -85 -201 29 -95 54 294 -219 -206 6 -62 -108 -112 -31 16 2 250 -134 -13 -84 -50 180 178 -37 367 -56
3792 -56 154 -173 -222 80 -330 68 -98 40 -233 -284 -154 258 -139 -143 250 -27 45 -241 242 205 158 -38 340
3815C40n67K24l9q6L35k16q2J82o1p9K60k77J43k15K01K6j54J66m02K61l84L01
3837a23K12J65k25J6P4l24J90M0O5k70K95k20L0l5r8L29j56J41j42j38J83l52
3859c43N22J00l7m63K68l2l92L39K9J9K5j56j38L16L1j20L1K2n6O8J02q2j46j4
3883a07L3K30p3j11p4K58k20L15j58Rl41K74j60J13J00O1j83l17L92K5j08K01
3905A59k82o6M88j95l46M83j91M24l29l43J14J21n4l9n4j98L55l1q1J52j98M5
3927f6k23J55j21N69k60r8J56RJ29o9j67J84n69J56K77j48L53j3k12M3l14P0K91
3950A32m65M27Lj34Q6J07l76J50L1k2J31K33r4k7j70K01k73JK45k94J69m0n2J96
3974A65n3J8o0j56j60J95p4JJ65j40J30k56J1J58j41L76j74j59L74j89j62K59
$$ plain form
3815 340 -227 -3 -42 -128 207 -9 -91 91 30 -49 211 -66 77 -138 63 89 -65 101 -301 -40 -424 -123
3837 -123 89 254 29 45 119 -205 -15 25 90 -180 115 -105 -75 -110 -208 121 -35 106 -36 -174 9 -343
3859 -343 179 279 242 -221 47 15 -377 -38 -9 10 35 -121 -259 57 88 -32 -1 21 -35 33 135 53 -93 -107
3883 -107 -74 156 83 -28 -102 156 -64 251 93 102 -239 35 -125 -12 88 149 -34 -351 41 66 -42 159
3905 159 -123 -189 299 104 -242 241 50 474 145 -198 -84 37 -17 -56 -110 -308 47 16 -65 87 -111 -66
3927 -66 -289 -134 -255 314 54 -44 112 121 250 181 14 198 -371 -215 62 -86 267 254 42 85 -229 -159 132
3950 132 -333 94 97 -37 49 156 -220 -70 -39 -61 70 303 209 182 12 213 -60 -59 186 -108 61 21 -31 165
3974 165 112 130 70 -86 -246 -51 -125 -124 41 -99 31 -225 -214 -56 -197 179 5 -154 220 31 -131 128
3996A28J94m95K87N0k83o5N6J70j14J43K36n58j37M82m5K83o53J68M27m49J20
4017e5r5N11j82j58J20k26mJ97M3j70K86l15O6q3m5P9j37M5k4j48J35J69N8q5
4041a8j75K42K7Pj83K07L0PM2k11L73j13j80j28K06l34J87j87L91M3k41P7j74
4064a05J5L00k47K44k05k52M53p9k66j06L34O7O6k44l8M6K49j2P0m63L76j40j85
4087a22J85J81k16J63j67J18j64K3J69k79n2N2O5j30R2j33P6K97j51r8o6K62k15
4110a10J31j27K1k1r1K19k61K05K41j83o8p2K45m2n5L15n21N7L50j42J68j74k57
4133a72L10k31K40j71k40N24k74J24R0k45J43j00o4L0J60j29Q3n9K23n21L36J7
4155G4k69O0N9K50k87J22j16K66n2r6l42L17k63J26j06L42p4o9k99Q3K74j41K15
$$ plain form
3996 128 322 -173 114 164 -119 -184 -128 42 -72 71 307 -251 -388 94 49 332 -321 -153 274 -175 -55
4017 -55 -150 361 179 21 141 -85 -89 108 151 -19 267 -48 18 -65 -110 -31 -168 -123 -147 -295 -160 9 67 -18
4041 -18 -193 49 76 83 -100 107 137 144 186 -25 348 235 55 -73 133 -201 -14 -201 190 233 -8 69 -105
4064 -105 -90 210 -37 207 2 -250 203 124 -142 -248 86 153 219 -25 -63 -17 232 220 290 -173 203 63 -122
4087 -122 63 244 28 191 24 142 -22 1 170 -109 -161 -109 -44 -174 -82 -215 -139 158 7 -91 -157 105 -110
4110 -110 21 -106 -85 -106 -197 22 -239 -34 207 24 -44 -116 129 87 32 347 -174 -117 233 91 259 85 -172
4133 -172 138 -93 147 -24 -264 260 -14 110 200 -45 98 -2 -66 -36 124 -5 78 19 242 -279 57 74
4155 74 -195 -135 -76 174 -113 9 -107 159 107 11 -331 -14 -277 -151 -257 85 11 -58 -357 -274 0 -141 74
4178G4k35M10l47K87q8j0K48k36J69o64L5K98K43j15J06P2j91j00K8Q2J63o0l53
4201a84N00k44j50K96l18K77j19n8M5p8%N4k33M7L71j74n0O5j59j48L48J2M3m88
4225c45L05L9k60K49j21M38j73j96J45k9o5J97j91Q2j63K57j95K10p5lj89L3P6
4248B6J5L7R1l2k29l3J76k91L38J59l79K63J24k14k50P2L9K04J60m16j1K03j20
4271f8K39o0k49K06k72K18k63L99l06N3M6r8n3J92ok83K59J92l71M72l41j75K20
4294d9J08k84Q1P6J7K93n00L03k17K71P1j40M0m1J76k61K15j99j26J41k23K89
4316D1r3L28j71m62M88K18j0k78j95L1J25R0K07l58J71l15J05j45K74k22K51J03
4338A83j39J0J47K6J06l65OK36j37k35J34k0r6L65m1k89j68L95k9J70n56J60M8
$$ plain form
4178 74 -161 249 -98 189 101 91 339 103 272 -392 -357 -59 184 69 175 247 56 -44 -16 66 229 169 -184
4201 -184 316 72 -78 218 -100 177 58 0 45 -33 -33 21 -212 -165 206 32 -18 47 -112 -260 88 100 143 -345
4225 -345 -40 -1 -261 -12 -133 305 132 -64 81 52 -13 184 -7 75 -88 169 -26 184 109 106 -83 -50 26
4248 26 41 78 169 137 -92 -125 51 -240 98 257 -122 141 265 51 -199 -127 -88 116 276 -140 -151 52 -68
4271 -68 171 111 -138 68 -204 14 -249 150 -156 -103 -57 -155 -208 -16 -22 -305 -46 146 -225 247 -94 -269 -49
4294 -49 59 -225 -144 -68 -51 242 -258 45 -172 99 170 30 70 29 205 -56 159 -40 -166 -25 -248 41
4316 41 -52 276 105 -357 131 349 339 61 -134 -103 22 112 319 -39 132 -183 -78 -223 51 -171 80 183
4338 183 44 54 201 227 333 -32 -26 210 73 -162 -28 -48 -144 221 180 -109 -277 118 89 259 -297 -137 -89
4361h9J21J71r5p9J03j11O0l88O31n14J22l9m4J77J5l42n1L69L68m03J04r2p4
4384h0Lp2K55q9k4j12K76k59n2j03L38k29J06K47l9l28QK44j96k32J52J48j79
4407b17L73k26K78k39l32K65J02K66j35K72p01Q8M66k45j53L80k96JK31Kl9k39
4429i8J06L0RJ60j89k77m2K06r8J11O3J53N8k92RJ14m3k99N88k05p2j28K42m8
4453E8N0n7j27P1k13j4N23m20K12j65J18L41j81j00k10M3K17Q5m71L58K2l98K49
4476ik88K26j06O6J08j67R6k04J10J24k55j17L08J08k7K17k25k8J35O0o6j14J45
4499I7n7k63N14m96K6P3L92m12M90l00J38r5j84J07K45k73n43M84J60l09L86l46
4521a66K14L4j89J80Pmk34K67k26L81l36q8J64j5r8K04k08J52N7Ok01O5J32J03
$$ plain form
4361 -89 32 203 108 29 132 21 81 -307 324 -190 -68 -107 -151 26 41 -301 -352 17 385 -18 86 -6 -80
4384 -80 -77 -149 106 17 -7 -119 157 -102 -154 -257 81 -148 -42 205 166 -162 -154 90 -106 -338 -186 -38 -217
4407 -217 156 -70 208 -31 -363 -98 4 270 135 407 -294 -206 260 15 -138 242 -54 -53 178 180 141 -98
4429 -98 8 38 47 207 18 -259 -301 -95 -193 -82 -19 134 192 -100 -91 23 -20 -319 269 64 -8 -136 106 58
4453 58 108 51 -76 -5 -218 -232 291 -129 83 -82 36 377 196 96 -114 -71 146 231 -240 118 140 -258 -9
4476 -9 -297 -71 -177 -111 -3 -170 -74 -278 -168 -44 -299 -416 -108 0 -27 190 -35 -63 72 132 66 -48 97
4499 97 40 -223 291 -205 -179 -106 286 -126 364 64 202 107 -77 30 275 2 -541 -57 103 -206 180 -166
4521 -166 48 82 -107 73 80 76 -158 109 -117 264 -72 -160 4 -11 -109 95 -113 39 96 102 -99 -34 98 201
4545B01k0N3k41N7l47K63Mj62o2L17l4J19j49Rq7J27j71K5L09l00k8Q5J41r5k9
4570a5K27l75L70q5m9P4j28M4K2j37J83j1j22J58j33q7k73N52m04L75j74k56J7
4593b27J30J2J62p2J16j24l7J2m1n5R2r8J23J6j00L2L37m49LK04J84k81k40L16
4617A5K5n47N95J06k77l6J69Q2O1k75Rr1J51m18K54M6%K4L26l57K49L11m96R3
4641A9J44l43J05P0K58l04r8K35j76J28q2j13R9nJ46j14nN3k31K82k2k70J78J96
4665A50J06j47o29P37l25K61l12J72l6J20k19R7N1K81m85K66k32L01m06J62O5
4686b2p7L71l37N5L17k98q3N9k79J63l3K93k57q5K62k37L4L69m77K67J8j38p7
4709a92K07m2K70l03p7O4K0o4K7M16m68J86N2j11R3r6K53m1k36M5J44j23j05J34
$$ plain form
4545 201 181 234 -7 50 -297 -34 -30 -192 -254 63 29 148 -1 8 -79 48 -123 -98 211 -89 -117 -32 109 14 -15
4570 -15 212 -163 207 122 73 147 19 63 85 -52 131 120 -2 156 23 -64 -337 215 -189 186 12 -244 -227
4593 -227 -97 -85 77 5 121 -3 -40 -28 -69 -124 -32 -130 -7 9 -91 -59 278 -171 -168 36 220 -61 -301 15
4617 15 40 -507 88 194 -83 -119 50 132 193 -82 -73 -164 -13 -431 -177 -131 -131 -107 219 -138 111 422 -74 19
4641 19 163 -180 -75 -5 253 -51 -149 86 -90 38 -44 -157 -58 -63 83 -31 -36 17 -214 68 46 -224 -46 150
4665 150 256 109 -520 217 -108 153 -159 13 -23 97 -122 -25 26 307 -178 88 -144 157 -249 -87 -22
4686 -22 -99 272 -65 -10 307 9 -74 -15 -294 -131 -164 129 -128 -213 49 -188 -154 215 -262 5 23 -115 -192
4709 -192 15 -27 243 -60 -137 -73 -53 -117 -90 326 -142 44 96 -15 78 -18 235 194 -42 3 147 24 -81 53
4733E3l65L03l20K66j98M03k10j4J7L31m05K11L8p5m6J87O5l10j7J33J60l65n2
4756b10M53m02M4J01Q6j57O6J12K91j68l38J82J93mk25j07P0M8l30J06L63k77
4778a03q9K33J26k43O3K48l23JJ64J25p5J0j66M1P7n8O7j37J40k66l2RL95p4j82
4803d9P3j08J15M4K10m88K93k52N4Q6j85N1k8K48m6k13M72l45j4m0k6K03J29j14
4827G0K28m53j59O00m25J1P1j39M78k85N8j00J43m87K55K05j70Q8m6L37l47k97
4849c64K03Q6N4n2K5K6J86m14L82n9j0j25q0%J62j63o3M53n03J63J70k11m1K03
4873B8j09K93k16j61J46l2L1M9J2k07n5K00k4J00J20m49K62K16j89R3k28J2j41
4896b49L95j60K33l02k47M05K9K59q7J36j95l66J66K42m94k1J30K35Oj42Ko4L0
$$ plain form
4733 53 -312 -9 -329 -63 -261 142 -68 -82 -65 266 -139 72 110 35 -11 176 241 -69 -86 47 207 -158 -210
4756 -210 243 -159 -115 -14 72 -85 -19 93 384 216 -122 60 253 249 24 -83 -13 35 -295 -189 174 -103
4778 -103 -192 41 167 -76 -13 235 -88 -87 77 202 127 137 -29 12 89 31 98 -39 101 -165 -197 -188 207 133 -49
4803 -49 24 -84 31 75 285 -203 90 -162 -108 -22 -207 -156 -184 64 18 -195 277 -68 -82 -122 -148 55 184 70
4827 70 298 -155 -314 286 -139 -128 -57 -196 282 -3 55 -45 98 -389 -134 71 -99 -11 -57 280 -67 -364
4849 -364 -161 -75 -21 -73 -48 -22 164 -250 132 73 63 -62 -142 -142 20 -143 -206 247 -256 -93 77 -134 -175 28
4873 28 -81 212 -4 -165 -19 -51 -20 29 41 -166 -221 -21 -45 55 175 -274 -12 204 15 108 -120 -108 -249
4896 -249 146 -14 219 -83 -330 75 104 363 276 412 217 -149 17 259 -235 -256 -126 109 115 -27 -25 -89 -59
4919e9k4M56j93O5k3p9p7N7R0k03r2J99k23LJ07j5n8jK19j4k46j04R4N2N3J32
4945A16J72n52K36o3J2J29k6K07l44J85j68L9K1O9l5J86j69jp0Q7j61k5M13l59
4969a01M70l54p6J68N6n2k19K64j40o0J01J08k68q2K22L09j13o0Q3j82K46l56
4991c6J46j80K0o3K63j73q3R4K02L5k14j16l6N17k85j76J96j40j70K63J6r6j0
5014b6j52K38l61M03k27m3J15J99j76j1P7kJ10l80K70j00M77m78K22l94N0K50
5036F1j39n7L21m18N7M91m58K76j48p9L70n54P7o4L64Q7J1k10j36q4k01N17l08
5059b24J19J61M2j12M6K5o4L0N7k17K03n3P4kk87K37J91j84k45K41P8L3l34Q0
5083a05K35o5j53k46K27K96p7P7l63n4J19j09r1K83O2J31p0n7N7O7k97L83m2l29
$$ plain form
4919 -59 -83 373 180 245 222 143 66 123 213 10 -82 117 -106 -103 4 -11 -69 -70 149 135 -111 -215 -121 -69 -16 116
4945 116 288 -264 -28 -91 -79 50 24 231 -113 72 -96 -57 -36 33 -2 184 15 14 -56 31 -130 -155 258 -101
4969 -101 369 15 -61 107 163 111 -108 156 16 -44 57 165 -103 -185 37 346 233 173 256 74 320 -36
4991 -36 110 -70 -50 -113 150 -23 -106 -12 190 225 11 -105 -141 376 91 -85 111 -29 -199 64 80 -16 -26
5014 -26 -178 60 -301 102 -125 -168 -53 146 -30 -41 36 34 144 -236 34 -66 411 -67 155 -239 -189 61
5036 61 -78 -135 186 -232 -175 316 -142 134 -14 -93 277 -277 -200 -264 100 187 198 -12 -148 -232 -433 84 -224
5059 -224 -105 56 98 -14 32 57 -7 23 80 -137 66 13 87 85 -202 35 226 42 -203 38 116 149 -185 -105
5083 -105 130 65 -88 -334 -107 189 112 189 -174 -228 -109 -218 -309 -26 36 167 97 40 97 164 -133 250 208 -121
5107a21R7j72J93j16R1Q1k01l0Q6k0k2P6j0k88K58L60l83J11l01K86J19l14K57
5130C7M1K05k45K6Ml5j37K11j04Q6Q2j15r4j4p9L26l55K04J34j61J74k93j91J38
5154a55L6%K21k60n2K17mj04J70oM1j44L17l97L0k5M43n35L56l30K14L38k90L35
5178D16p2n32L16j07j32M21j79j12j54n8J26J63j39K37J56j76k70L49k98m5p6
5199a66L25K77m97l4J11M1L16k68m40P47n4m44K7K01j34L7k74J59j95M78l05j3
5221a05J94o7k91PK73K9p8k09Q3O2L1k6n4K67k04J4J17k56K59K06m71J06K23l46
5245b36L34NJ1q6l08J32K43Llo23N43M6j39j72M25l10J88j64J07O3K66m32J32
5268B5K45k93J58j59P9j1m7n5J65r7j72K15j09j70L54j19m2o6J58j39M6j58P4
$$ plain form
5107 -121 -24 -196 -3 -119 -28 53 -148 -178 -92 -112 -134 -58 -68 -356 -98 262 -121 -10 -311 -25 94 -220 37
5130 37 78 283 38 64 68 33 -104 107 3 89 171 56 -38 -52 -131 195 -160 44 178 17 191 -102 -293 -155
5154 -155 -119 -119 102 -158 -210 7 3 -101 69 63 104 -40 277 -120 -90 -115 328 -207 149 -181 33 371 81 416
5178 416 344 -188 128 21 -111 310 131 19 -135 -193 -67 96 -43 194 350 174 -96 253 -45 -90 -166
5199 -166 159 436 -61 -95 16 57 373 105 -335 412 358 -86 -59 142 8 45 -229 -70 -265 213 -92 -105
5221 -105 89 22 -269 -262 11 40 -38 -247 -164 -102 -71 -97 -151 116 -88 -74 43 -213 46 252 -219 -113 110 -236
5245 -236 98 103 114 28 -280 -148 95 98 95 -528 15 61 -78 -250 175 -135 53 -111 -4 59 325 -107 25
5268 25 270 -23 135 -24 55 44 -3 -58 107 10 -162 53 -56 -226 128 9 -33 -99 59 -80 -34 -192 -118
5291a18j7J73k7p0j47ML59k34kJ68P0k24O9j46L32j46j57K00l45Q9N6L29k28J52
5315A40q4k33n8M17j33J38j25nr9J18m3l4L46l69Kj8j22M8L2J56J43k67k24K35
5339c9J24k38N2J22J2R6j77J04M9n4j10m5K32j77Q7Q4m0r5J59k16K47k62k67N19
5363A67k07J14l13K57P7q5J41o8m7Q4k15K24k63K13n7k46M61k91J06o6R2j1j49
5386h2j19L64J59k97o1r2m3K04k67K33J76j34k81L97j93Q4J71j73O6q2J07j82
5408d5p9K96j34rL4p6L27m00M33k62k8k81J5J19lJ97l89K24L2p8J34K40j47J0
5432A30j77r1J70p0k5m7K24J86m69K93l88J87L84n02N71o94J27K33l59M5M81k19
5454a0j0n7kM0L49l87J34K1m1k45j60N83k81j25K94k01J75j80m9L3K91l23J71
$$ plain form
5291 -118 -135 38 11 -59 -206 -202 157 -77 -79 89 159 -65 4 -142 190 44 -113 87 -258 -169 -113 216 -12 140
5315 140 56 -177 -235 182 49 187 62 57 -42 76 33 -1 345 -24 -22 -40 -162 -114 -82 74 217 -50 -274 -39
5339 -39 85 -153 -101 21 33 129 -48 56 105 51 -59 -104 128 -49 38 122 82 -13 146 -70 177 -85 -352 167
5363 167 -40 74 -239 18 95 10 151 83 36 120 -95 129 -134 79 22 -224 237 -54 52 -14 78 67 -82
5386 -82 -201 163 322 25 -36 -128 -171 33 -234 -1 175 41 -240 157 -36 48 219 46 112 30 137 -45
5408 -45 -124 172 38 29 63 -13 314 -86 347 85 57 -224 -209 -90 -93 104 -285 -61 -29 -107 27 267 120 130
5432 130 -47 -138 32 -38 -63 -110 114 300 -169 124 -264 -77 307 -195 376 -318 -191 42 -317 -272 209 -10
5454 -10 -20 -77 -79 -39 310 -77 57 78 37 -208 -368 215 -66 -191 103 -98 77 -103 -152 -119 172 -151 20
5477B0L1Q6j4J0J0m38N74l20o0M5O1J1p4l99O8L47K88r2n3N8l31K69J04j78l27
5502c04K40P4o8m3L16rk74p6K16l5j49n2k3O1K8O8p4M2O4N1Rj0l64N76j24r5k99
5529b54M38k92K58k1j17j00J50K45n41K15J02k27M80l59q3O8J23r0k04O2J26J72
5551A51j35J94k00l1M3J67m24K47J0n7J79rj73j4q8M21m89M75m70j2L70o7j92
5574a04P4J5j32J88l4O4L9l52O4L16j71J01m51O26m59J33O8J39J15m60K08J15
5596A02k43J76j95K67j32K51k8mk6k05o3K13J5j53k52J13J13j47N34k63r4J01
5618H0j88K05P5M9J11m55Q2R0j02M75n14P9N9m53L57J0J24o3j5R4j10m70P28k54
5642fj27L86o5j05J21k67M4j61J22K23k47K64k79o0k35O31k88j59L17k85M74m20
$$ plain form
5477 20 51 137 123 133 143 -295 279 -41 -101 -56 5 16 -58 -457 -389 -42 246 154 101 159 -172 97 201 23 -304
5502 -304 -64 10 -58 -101 215 206 -68 -144 72 37 -112 -164 -187 -126 -98 -30 -104 -62 2 53 62 52 -312 264 140 45 -254
5529 -254 184 -108 150 129 12 -88 62 307 -234 -19 83 -144 336 -23 -106 -38 85 -5 -209 -147 -21 151
5551 151 16 210 10 -21 22 189 -235 12 22 -35 144 135 -38 -52 -140 281 -208 267 -203 -215 155 88 -104
5574 -104 -30 -15 -147 41 7 71 110 -242 -178 138 -33 68 -383 243 -216 -83 -15 124 239 -221 -13 102
5596 102 -141 35 -160 107 -25 226 198 194 168 -37 -100 113 128 -25 -277 -164 -51 -198 336 73 -21 80
5618 80 -108 97 172 221 332 -123 -41 49 -53 422 -92 -13 46 -407 -50 -40 84 21 6 100 -10 -480 248 -6
5642 -6 -133 253 188 83 204 -63 -19 -180 -58 165 -82 182 -97 -157 -392 239 -49 -208 109 -176 298 -122
5664a22P5J86j34J66o6L2m19L44P4l83M35r4j01K4j06P1K4K07n8m5j45R9l10M58
5688B12n6N2j76l66N56l40N26k2o5n54L73o6j81J66N0k23n9J20J57j73k3J48l8
5711A8P0j04J89k92j60K22M1R4l3j03K33m08L87l12O55q92M40r0n9J62J26l9Q7
5734B32k29o3J0r1J86J44l04l4P4j74L82L5j8k79J15j34R5Q8Q0j05J21l63L95
5757A63nj5n4o9j2jp2K90k22L1k9m7Q5r8K30o8r0j2j37K34j44k22J53k9m9o1K86
5784C6R4m3k26J25J98k81p1J81R0n08L22J84k0k0l51Q5L20j03L54o15L09P6r1
5807D5M06l66j95R7J80k70j21J52J82M8j31j84L17k45M36k03o4J1N2l20N77n81
$$ plain form
5664 -122 -47 139 5 171 105 137 -282 62 136 -247 188 94 -7 17 -89 -18 6 213 155 110 -35 64 -246 212
5688 212 156 208 32 -334 222 -118 408 386 321 -233 140 74 -107 59 109 -114 -173 -53 104 -69 -92 56 18
5711 18 88 -16 173 -119 -279 -57 -16 78 45 -58 175 -233 154 -158 497 -395 45 -45 -104 58 184 145 232
5734 232 3 -60 -50 -141 45 189 -115 -149 -75 -249 133 168 150 -129 -14 -148 -53 35 115 10 131 -232 163
5757 163 158 143 89 20 8 7 -65 225 3 34 5 -42 43 -55 175 107 17 5 -132 102 -42 -264 -111 -140 -189 -250 36
5784 36 130 87 -139 -14 184 -97 -168 13 103 -405 -83 101 81 61 -290 -205 115 12 366 -249 60 136 45
5807 45 451 85 -110 -13 167 -103 -224 -72 110 158 27 -157 160 -85 351 148 84 95 147 -173 404 -177
$$ [...]
8191E2
##END NTUPLES=NMR FID
##END=
