##TITLE=1H_DE-63_2_oil
 D2O
 8 sc, 
 6.8.2024
##JCAMPDX= 6.0         $$ Bruker NMR JCAMP-DX V2.0
##DATA TYPE= NMR FID
##DATA CLASS= NTUPLES
##ORIGIN= UXNMR, Bruker Analytische Messtechnik GmbH
##OWNER= root
$$ XWIN-NMR		Version 3.5
$$ Tue Aug  6 14:08:55 2024 Russian Standard Time (UT+4h)  she@DPX200
##.OBSERVE FREQUENCY= 200.1313
##.OBSERVE NUCLEUS= ^1H
##.DELAY= (6, 6)
##.ACQUISITION MODE= SIMULTANEOUS
##.ACQUISITION SCHEME= undefined
##.AVERAGES= 8
##.DIGITISER RES= 18
##SPECTROMETER/DATA SYSTEM= spect
##.PULSE SEQUENCE= zg30
##.SOLVENT NAME= Acetone
##.SHIFT REFERENCE= (INTERNAL, Acetone, 0, 15.7039)
##AUDIT TRAIL= $$ (NUMBER, WHEN, WHO, WHERE, WHAT)
$$ ##TITLE= Audit trail, XWIN-NMR		Version 3.5
$$ ##JCAMPDX= 5.01
$$ ##ORIGIN= Bruker BioSpin GmbH
$$ ##OWNER= she
$$ F:/spectra/data/she/nmr/H-F/1/audita.txt
$$ ##AUDIT TRAIL=  $$ (NUMBER, WHEN, WHO, WHERE, WHAT)
(   1,<2024-08-06 14:07:52.73 +0400>,<she>,<DPX200>,
      <created by zg, POWCHK disabled, PULCHK disabled
       configuration hash MD5:
       00 E9 B6 7A A2 85 ED C7 34 08 36 98 17 FE 4E 26
       data hash MD5: 16K
       9C 34 EC 71 95 06 E6 2C 91 83 90 61 0B 98 49 BB>)
$$ ##END=
$$ 
$$ hash MD5
$$ A4 F5 5D 21 B0 2C 41 5E 87 BA A7 ED 64 E2 6F F5
##$RELAX= 
##$RELAX= 
##$RELAX= 
##$RELAX= 
##$RELAX= 
##$RELAX= 
$$ Bruker specific parameters
$$ --------------------------
##$DU= <F:/spectra>
##$EXPNO= 1
##$NAME= <H-F>
##$PROCNO= 1
##$TYPE= <nmr>
##$USER= <she>
##$AMP= (0..31)
100 100 100 100 100 100 100 100 100 100 100 100 100 100 100 100 100 100 
100 100 100 100 100 100 100 100 100 100 100 100 100 100 
##$AQSEQ= 0
##$AQ_mod= 1
##$AUNM= <au_zg>
##$AUTOPOS= <>
##$BF1= 200.13
##$BF2= 200.13
##$BF3= 200.13
##$BF4= 200.13
##$BF5= 200.13
##$BF6= 200.13
##$BF7= 200.13
##$BF8= 200.13
##$BYTORDA= 1
##$CFDGTYP= 0
##$CFRGTYP= 5
##$CHEMSTR= <none>
##$CNST= (0..31)
1 1 145 1 1 1 1 1 1 1 1 1 1 1 1 1 1 1 1 1 1 1 1 1 1 1 1 1 1 1 1 1 
##$CPDPRG= <>
##$CPDPRG1= <>
##$CPDPRG2= <>
##$CPDPRG3= <>
##$CPDPRG4= <mlev>
##$CPDPRG5= <mlev>
##$CPDPRG6= <mlev>
##$CPDPRG7= <mlev>
##$CPDPRG8= <mlev>
##$CPDPRGB= <>
##$CPDPRGT= <>
##$D= (0..31)
0 1.2 0 0 0 0 0 0 0 0.06 0 0.03 0 0 0 0 0.0002 0 0 0 0 0 0 0 0 0 0 0 0 
0 0 0 
##$DATE= 1722938872
##$DBL= (0..7)
120 120 120 120 120 120 120 120 
##$DBP= (0..7)
150 150 150 150 150 150 150 150 
##$DBP07= 0
##$DBPNAM0= <>
##$DBPNAM1= <>
##$DBPNAM2= <>
##$DBPNAM3= <>
##$DBPNAM4= <>
##$DBPNAM5= <>
##$DBPNAM6= <>
##$DBPNAM7= <>
##$DBPOAL= (0..7)
0.5 0.5 0.5 0.5 0.5 0.5 0.5 0.5 
##$DBPOFFS= (0..7)
0 0 0 0 0 0 0 0 
##$DE= 6
##$DECBNUC= <off>
##$DECIM= 24
##$DECNUC= <off>
##$DECSTAT= 4
##$DIGMOD= 1
##$DIGTYP= 9
##$DL= (0..7)
0 120 120 120 120 120 120 120 
##$DP= (0..7)
150 150 150 150 150 150 150 150 
##$DP07= 0
##$DPNAME0= <>
##$DPNAME1= <>
##$DPNAME2= <>
##$DPNAME3= <>
##$DPNAME4= <>
##$DPNAME5= <>
##$DPNAME6= <>
##$DPNAME7= <>
##$DPOAL= (0..7)
0.5 0.5 0.5 0.5 0.5 0.5 0.5 0.5 
##$DPOFFS= (0..7)
0 0 0 0 0 0 0 0 
##$DQDMODE= 0
##$DR= 18
##$DS= 0
##$DSLIST= <SSSSSSSSSSSSSSS>
$$ [...]
##$SUBNAM2= <"">
##$SUBNAM3= <"">
##$SUBNAM4= <"">
##$SUBNAM5= <"">
##$SUBNAM6= <"">
##$SUBNAM7= <"">
##$SUBNAM8= <"">
##$SUBNAM9= <"">
##$SW= 24.0689771365484
##$SWIBOX= (0..15)
0 0 2 0 0 0 0 0 0 0 0 0 0 0 0 0 
##$SW_h= 4816.95568400771
##$TD= 16384
##$TD0= 1
##$TE= 0
##$TE2= 300
##$TE3= 300
##$TEG= 300
##$TL= (0..7)
0 120 120 120 120 120 120 120 
##$TP= (0..7)
150 150 150 150 150 150 150 150 
##$TP07= 0
##$TPNAME0= <>
##$TPNAME1= <>
##$TPNAME2= <>
##$TPNAME3= <>
##$TPNAME4= <>
##$TPNAME5= <>
##$TPNAME6= <>
##$TPNAME7= <>
##$TPOAL= (0..7)
0.5 0.5 0.5 0.5 0.5 0.5 0.5 0.5 
##$TPOFFS= (0..7)
0 0 0 0 0 0 0 0 
##$TUNHIN= 0
##$TUNHOUT= 0
##$TUNXOUT= 0
##$USERA1= <user>
##$USERA2= <user>
##$USERA3= <user>
##$USERA4= <user>
##$USERA5= <user>
##$V9= 5
##$VALIST= <valist>
##$VCLIST= <CCCCCCCCCCCCCCC>
##$VD= 0
##$VDLIST= <DDDDDDDDDDDDDDD>
##$VPLIST= <PPPPPPPPPPPPPPP>
##$VTLIST= <TTTTTTTTTTTTTTT>
##$WBST= 1024
##$WBSW= 4
##$XGAIN= (0..3)
0 0 0 0 
##$XL= 0
##$YL= 0
##$YMAX_a= 160329
##$YMIN_a= -166363
##$ZGOPTNS= <>
##$ZL1= 120
##$ZL2= 120
##$ZL3= 120
##$ZL4= 120
##$ABSF1= 10
##$ABSF2= 0
##$ABSG= 5
##$ABSL= 3
##$ALPHA= 0
##$AQORDER= 0
##$ASSFAC= 0
##$ASSFACI= 0
##$ASSFACX= 0
##$ASSWID= 0
##$AUNMP= <proc_1d>
##$AZFE= 0.1
##$AZFW= 0.1
##$BCFW= 1
##$BC_mod= 2
##$BYTORDP= 1
##$COROFFS= 0
##$CY= 11.3945322036743
##$DATMOD= 1
##$DC= 2
##$DFILT= <>
##$DTYPP= 0
##$F1P= 15.6554695791079
##$F2P= 12.8336369535428
##$FCOR= 0.5
##$FTSIZE= 0
##$FT_mod= 4
##$GAMMA= 1
##$GB= 0.15
##$INTBC= 1
##$INTSCL= 1
##$ISEN= 128
##$LB= 0.24
##$LEV0= 0
##$LPBIN= 0
##$MAXI= 10000
##$MC2= 0
##$MEAN= 0
##$ME_mod= 0
##$MI= 1.114404
##$NCOEF= 0
##$NC_proc= 0
##$NLEV= 6
##$NOISF1= 3.799351
##$NOISF2= 2.8
##$NSP= 1
##$NTH_PI= 0
##$NZP= 0
##$OFFSET= 15.70392
##$PC= 1
##$PHC0= -25639.71
##$PHC1= 10.58749
##$PH_mod= 1
##$PKNL= yes
##$PPARMOD= 0
##$PSCAL= 0
##$PSIGN= 0
##$REVERSE= no
##$SF= 200.130013532006
##$SI= 16384
##$SIGF1= 3
##$SIGF2= 2
##$SINO= 400
##$SIOLD= 16384
##$SREGLST= <1H.CDCl3>
##$SSB= 0
##$STSI= 0
##$STSR= 0
##$SW_p= 3612.71676300578
##$SYMM= 0
##$S_DEV= 0
##$TDeff= 0
##$TDoff= 0
##$TI= <>
##$TILT= no
##$TM1= 0
##$TM2= 0
##$TOPLEV= 0
##$USERP1= <user>
##$USERP2= <user>
##$USERP3= <user>
##$USERP4= <user>
##$USERP5= <user>
##$WDW= 1
##$XDIM= 8192
##$YMAX_p= 0
##$YMIN_p= 0
$$ End of Bruker specific parameters
$$ ---------------------------------
##NTUPLES= NMR FID
##VAR_NAME=  TIME,          FID/REAL,        FID/IMAG
##SYMBOL=    X,             R,               I
##VAR_TYPE=  INDEPENDENT,   DEPENDENT,       DEPENDENT
##VAR_FORM=  AFFN,          ASDF,            ASDF
##VAR_DIM=   8192,          8192,            8192
##UNITS=     SECONDS,       ARBITRARY UNITS, ARBITRARY UNITS
##FACTOR=    0.0002076,     1,               1
##FIRST=     0,             0,               0
##LAST=      1.7004516,     0,               0
##MIN=       0,             -166363,         0
##MAX=       1.7004516,     160329,          0
$$ Real data points
##PAGE= N=1
##DATA TABLE= (X++(R..R)), XYDATA
0 0 0 0 0 0 0 0 0 0 0 0 0 8 -8 8 -8 8 -9 16 -16 20 -24 30 -32 38 -45 49 -57 67 -75 85 -96 109 -121 137
34 137 -153 169 -189 211 -231 259 -287 318 -352 389 -429 477 -531 590 -655 732 -822 928 -1054
53 -1054 1210 -1405 1655 -1999 2489 -3243 4527 -12255 139499 139200 -42337 -108925 -86000 38650
67 38650 160329 66586 -144316 -123402 60663 127212 50914 -59111 -129565 -37324 135187
78 135187 114142 -77437 -137702 -28004 82498 106178 9923 -132610 -100025 81010 134798
89 134798 13934 -94485 -95433 12099 128250 79716 -84054 -118756 2442 101471 82583
100 82583 -31024 -120967 -52706 93212 104353 -21871 -105459 -66755 44296 113081 35229
111 35229 -104006 -98385 37028 105858 50146 -51553 -105589 -26052 108004 92648 -47852
122 -47852 -101588 -31175 59283 94906 15097 -106576 -81408 60418 101734 13437 -73107 -83764
134 -83764 497 104915 69785 -73336 -105840 972 85168 71202 -15853 -101725 -58973
145 -58973 80289 105284 -13352 -90279 -55164 30589 95202 45498 -83921 -96758 27950
156 27950 94635 39089 -46991 -88381 -28223 87441 86129 -42546 -101114 -26627 61396 80283
168 80283 11582 -88743 -76404 51671 103273 14466 -71501 -68299 4558 86709 64742 -58149
180 -58149 -98417 60 79304 55116 -20957 -83166 -49713 64288 91138 -14214 -86480 -45337
192 -45337 35101 78799 34877 -68959 -84713 23424 90389 35836 -46021 -71436 -20092 70107
204 70107 76083 -30178 -90124 -23321 56367 62715 4891 -70120 -65394 38269 88138 10629
216 10629 -66554 -55980 8440 69704 53464 -45506 -85125 -1489 73225 49194 -20172 -66761
228 -66761 -40179 50563 80376 -5653 -76485 -40396 32336 63427 26197 -54517 -73341 14040
240 14040 78715 30338 -45343 -60515 -13591 57077 64220 -23255 -80134 -21808 54542 57036
252 57036 2047 -58160 -54148 31301 78669 14151 -60098 -50009 10135 57853 42857 -36974
264 -36974 -74536 -5464 65049 41665 -23153 -57631 -32051 41319 69976 -3449 -69441 -34896
276 -34896 34327 55911 21283 -43901 -62476 10898 71830 28550 -42308 -51851 -8968 46117
288 46117 53433 -17772 -71508 -22007 49839 47121 -4248 -49459 -43957 24010 68873 14588 -56247
301 -56247 -44301 15740 51738 34736 -28858 -64238 -7159 60463 40124 -24291 -51010 -24415
313 -24415 33658 58240 -280 -62582 -34826 32146 49526 13080 -39538 -51761 8218 63173
325 63173 27915 -40054 -47723 -2531 43720 45753 -13841 -61752 -21386 46491 45739 -6323 -45141
338 -45141 -37232 19813 58740 13953 -51302 -41386 15364 45255 26655 -25996 -55299 -7025
350 -7025 54587 37200 -24547 -46220 -17266 31857 51155 959 -55749 -32038 31810 46116
362 46116 9155 -35775 -44976 5096 55269 25603 -38101 -44373 50 38164 36773 -12691 -54663
375 -54663 -19531 43679 42080 -9257 -40806 -29152 18946 53337 14812 -47314 -39425 17425
387 17425 43148 21208 -23636 -48741 -8593 49068 35102 -24630 -44163 -13440 28689 42445
399 42445 1231 -49574 -30733 31258 44549 4752 -33066 -36640 5810 50016 26338 -35830
411 -35830 -43614 3044 37513 31015 -12120 -48136 -20611 39029 40575 -10502 -40123 -24331 17615
424 17615 44387 13425 -42435 -37326 17662 41813 16866 -23269 -41577 -6456 45263 33949
436 33949 -23861 -42254 -9688 28352 37567 1046 -45315 -30029 28500 42033 2186 -32726
448 -32726 -31914 5153 43949 24943 -32919 -40994 4880 36467 25575 -11800 -41933 -18821 37075
461 37075 40148 -11172 -39543 -19637 17906 39805 13005 -38238 -37697 16031 41126 13418 -23718
474 -23718 -35644 -7080 38203 33149 -21476 -41733 -6761 29062 31344 -494 -38338 -27896
486 -27896 25740 42319 1125 -33609 -27035 7046 38359 22865 -29114 -41055 4027 36273
498 36273 22599 -13191 -37136 -16910 30982 37884 -9397 -38085 -17415 19029 34681 10871
510 10871 -33142 -34156 14890 40443 12292 -24170 -31702 -4298 34734 30653 -19054 -40883 -7146
523 -7146 28455 28556 -1229 -35102 -26603 22336 39863 1620 -32194 -24366 7995 34386 20945
536 20945 -25370 -37719 4052 35704 20347 -13852 -33006 -14705 28136 35966 -8175 -38275
548 -38275 -15858 19273 30758 9053 -29461 -33139 11921 38856 11176 -24163 -28562 -2871
560 -2871 30073 28616 -15658 -38592 -6232 29137 26041 -3515 -30946 -23389 19541 38139 2278
573 2278 -32653 -23050 9467 30486 17874 -22121 -36357 1477 34558 19153 -15027 -29516
585 -29516 -12500 24499 33228 -5888 -35927 -14871 20120 28263 6891 -26248 -29519 10255 36686
598 36686 11232 -24396 -27084 -967 27372 25226 -13787 -36706 -7587 28012 24137 -4498 -27303
611 -27303 -20661 16293 35209 3801 -30590 -21090 10383 27859 15342 -19080 -32822 946
623 946 32608 18059 -15621 -27508 -10378 21416 30062 -4943 -33982 -15301 19922 26322 4882
636 4882 -23054 -26438 7652 34606 11842 -24081 -24491 1482 24529 22028 -11247 -33605 -7690
649 -7690 27624 22410 -6864 -25338 -17645 14237 32186 4088 -29667 -20323 11496 25641 12626
662 12626 -16891 -29009 -606 30523 18206 -15480 -25232 -6868 19224 26142 -2835 -30838
674 -30838 -15181 19644 24825 1896 -21281 -22303 6243 30494 12141 -22952 -23740 2213 22906
687 22906 18622 -9943 -29563 -8112 24523 22263 -6537 -23905 -14568 13200 27665 4610 -25774
700 -25774 -19742 10676 24353 10142 -15991 -25658 -1285 27480 17084 -14469 -23925 -6499 18012
713 18012 23971 -2450 -28145 -14026 18128 23896 1722 -19536 -20521 5915 28230 11168 -20978
726 -20978 -21943 3008 21032 16234 -9014 -27082 -8233 22987 20913 -7580 -22378 -11832 11408
739 11408 25201 5248 -24982 -19080 11534 22708 8023 -14254 -22948 -1915 25714 16704 -14675
752 -14675 -23014 -3807 16956 19925 -2285 -25636 -14185 17351 22936 -602 -19153 -16498 5552
765 5552 24288 11204 -19408 -21860 4527 20733 12816 -8635 -23110 -7995 21135 20087 -7762
778 -7762 -21359 -9884 11590 21529 4320 -22257 -18118 10713 21824 6514 -14012 -19981 -1045
791 -1045 22330 15933 -13142 -22189 -2441 16394 17135 -2375 -21604 -13220 15492 21645 -541
804 -541 -18375 -14059 5017 21735 10384 -17539 -20793 3488 19266 11421 -8342 -20700 -7452
817 -7452 18594 19394 -6727 -20880 -8564 11478 18703 4091 -19396 -17275 9659 21340 5295
830 5295 -14350 -16952 -706 19591 15271 -12082 -21473 -2058 16263 14921 -2588 -20054 -12419
843 -12419 14270 20894 -830 -17981 -12828 5961 19331 9667 -15408 -19653 3565 19143 10230
856 10230 -8928 -17995 -6453 16430 18323 -6525 -20411 -7375 11598 17042 3538 -17858 -16533
869 -16533 8945 20753 4565 -14091 -15163 -167 17622 14455 -10742 -20356 -1683 16064 13190
882 13190 -3190 -17379 -11553 12090 19976 -529 -18009 -11102 6196 16885 8632 -13494 -18833
895 -18833 2859 19320 9170 -9357 -16697 -5427 14820 17409 -5335 -19763 -7312 11835
907 11835 15510 2089 -15551 -15092 7270 19768 4853 -14381 -13901 975 16037 12632 -9239
920 -9239 -19562 -2157 15562 12738 -3811 -16175 -9985 10697 18908 -110 -17403 -10643 6729
933 6729 15840 7411 -12180 -17569 2175 18203 8828 -9780 -15007 -4546 13410 15729 -4297
946 -4297 -18706 -6657 11839 14436 1464 -13996 -13664 6387 19315 4565 -13995 -13025 1662
959 1662 14150 11666 -7939 -18686 -2714 15904 11933 -4630 -14370 -9103 9355 17759 946
972 946 -16890 -10507 7286 14716 5961 -10803 -15990 1201 17843 8917 -9964 -14645 -3308 12327
986 12327 14545 -3266 -18215 -7092 11839 13756 285 -13088 -12633 5295 18281 5411 -13529
999 -13529 -12780 2095 13598 10390 -6902 -17254 -3245 14901 11533 -5221 -14122 -7571 8642
1012 8642 16081 902 -16026 -10467 7475 14080 4974 -10208 -14703 792 16338 8997 -9604
1025 -9604 -13831 -2102 11152 12694 -2680 -16683 -7359 11536 13592 -368 -12193 -10675 4313
1038 4313 16193 5658 -12680 -12695 2203 13094 8823 -6067 -15365 -3527 13667 11686 -4737
1051 -4737 -13185 -6595 7695 14703 2005 -14547 -10719 6547 13105 4949 -9051 -13324 -120
1064 -120 15304 9008 -8573 -13357 -2247 10174 12231 -1873 -15403 -8028 10410 13143 -132
1077 -132 -11518 -10269 3360 15404 6301 -11734 -12542 2571 12720 8320 -5349 -14459 -4278
1090 -4278 12943 12145 -4699 -13108 -6153 7424 13649 2161 -13671 -11001 6444 13328 4074 -8779
1104 -8779 -12405 -450 13812 9466 -8408 -13296 -1673 10530 10699 -1805 -14226 -7879 9895
1117 9895 12925 -568 -11209 -8835 3583 13634 5994 -10904 -12437 2661 12176 6910 -5531
1130 -5531 -12787 -4107 11748 11394 -4535 -12349 -5210 6941 11931 2535 -12117 -10834 5864 12832
1144 12832 3043 -8255 -10741 -401 12214 9097 -7375 -12780 -1281 9750 9302 -1507 -11831
1157 -11831 -7505 8721 12611 -180 -10672 -7756 3298 12014 6006 -9253 -11934 2138 11491
1170 11491 6390 -4753 -11546 -4335 10117 11082 -3116 -11929 -5005 6351 10573 2669 -10889 -10322
1184 -10322 5217 12542 3291 -7746 -10084 -789 10914 8915 -6052 -12149 -1742 9322 8444
1197 8444 -1310 -11046 -7436 7485 12111 348 -10183 -7524 2948 10992 5794 -8360 -11668 1322
1211 1322 11165 5735 -4946 -10491 -3913 9134 10593 -2976 -11377 -4679 6488 9711 1906 -9431
1225 -9431 -9421 4402 11757 3153 -7743 -9007 -42 9650 8033 -5365 -11710 -1592 9062 7880
1239 7880 -1795 -9736 -6651 6426 11343 302 -9756 -6952 3168 9582 4961 -7169 -10658 1036
1253 1036 10280 5527 -4695 -9053 -3359 7976 9761 -2229 -11035 -4338 6416 8660 1565 -8019
1267 -8019 -8471 3187 11062 3182 -7519 -7956 -7 8493 7539 -4608 -11046 -1767 9000 7034 -1885
1282 -1885 -8275 -6172 5313 10507 987 -9617 -6243 3733 8790 4320 -6297 -10123 225 10132
1296 10132 5460 -4891 -8277 -2972 6527 8890 -1613 -10321 -4165 6269 8054 1132 -7381 -7536
1310 -7536 2870 10269 3418 -7305 -7374 783 7852 6575 -3946 -10012 -2454 8038 6768 -2264
1324 -2264 -7865 -5013 4356 9653 1253 -8887 -6176 3574 7856 3572 -5512 -9326 -126 9513 5272
1339 5272 -4768 -7626 -2235 6334 7802 -1191 -9546 -4187 5883 7521 603 -6877 -6748 2000 9228
1354 9228 3811 -6915 -7402 1059 6792 5433 -3099 -8985 -2416 7813 6838 -2312 -6930 -4252 4206
1369 4206 8632 1418 -7985 -5970 3397 7624 3201 -5079 -7825 -205 8496 5576 -4722 -7638 -1687
1384 -1687 5813 6678 -1006 -8462 -4497 5797 7376 408 -6320 -5799 1618 8652 3497 -6485 -6579 965
1400 965 6872 4873 -2396 -8206 -2667 6885 6597 -2131 -7043 -3982 3880 7809 1281 -7501 -6217
1415 -6217 3561 7267 2404 -4756 -6980 -372 7821 5275 -4431 -7367 -1299 5169 6315 -360 -7680
1430 -7680 -4626 5027 7043 -140 -5900 -4960 1757 7508 3697 -5759 -7090 884 6191 4558 -2725
1445 -2725 -7179 -2508 5995 6670 -2022 -6909 -3356 3298 6732 1764 -6792 -6309 3092 7179 2118
1460 2118 -4548 -6442 -431 7173 5243 -4002 -7314 -1261 5186 5874 -268 -6958 -4546 4504 7052
1475 7052 146 -5978 -4857 1640 6973 3609 -5557 -6874 926 6338 3722 -2712 -7008 -2829 5981
1490 5981 6461 -2031 -6936 -3177 3531 6333 1349 -5777 -6036 2561 6896 2297 -4441 -5645 -363
1505 -363 6189 5172 -3482 -6862 -1329 5186 5190 -467 -6337 -4542 4125 7251 234 -5994 -4460 1812
1521 1812 6468 3556 -4504 -6611 207 6269 3832 -2462 -5846 -2298 5328 6176 -1466 -6636 -2839
1536 -2839 3557 5745 1067 -5420 -5711 2050 6922 2117 -4400 -5156 -541 5787 5002 -2767 -6757 -1653
1552 -1653 4729 4642 -298 -6012 -4320 3629 6900 802 -5885 -4389 1542 5585 3241 -3986 -6442
1567 -6442 342 6213 3766 -2514 -5747 -2663 4506 5931 -678 -6262 -3064 3501 5489 1570 -4869
1582 -4869 -5822 1594 6643 2626 -4029 -5020 -591 4756 4967 -2357 -6477 -1477 4785 4589 -544 -5078
1598 -5078 -3922 2682 6309 1101 -5549 -4297 1415 5135 3233 -3527 -6051 -340 6021 3690 -2469
1613 -2469 -5441 -1942 3872 5600 -581 -6463 -3047 3293 5006 1546 -4404 -5101 964 6437 2451
1628 2451 -4287 -5046 -443 4520 4459 -1929 -6383 -1787 4578 4670 -453 -4869 -3919 2785 5916 963
1644 963 -4907 -4257 1278 4997 2799 -2920 -5743 -657 5711 4018 -2146 -4840 -2292 3451 5161
1659 5161 43 -5986 -3355 2875 4922 1282 -3923 -4947 1016 5963 2796 -4049 -4915 -401 4072
1674 4072 4109 -1263 -5707 -2420 4294 4718 -434 -4353 -3831 1801 5891 1564 -4873 -4344 904 4525
1690 4525 2848 -2846 -5473 -864 4858 3872 -2167 -4394 -1910 3101 4801 375 -5105 -3506 2718
1705 2718 4587 1221 -3272 -4290 425 5316 3089 -3163 -4696 -109 3877 4081 -967 -5536 -2470
1720 -2470 3863 4684 -281 -4263 -3223 1425 4834 1832 -4478 -4173 1131 4366 2886 -2126 -4681
1735 -4681 -1302 4126 3664 -1727 -4359 -1781 2602 4278 464 -4768 -3255 2535 4528 1297 -3112
1750 -3112 -3910 -83 4483 3324 -2830 -4721 -187 3722 3389 -502 -4538 -2689 3395 4494 -208
1765 -208 -3700 -2897 1575 4341 1850 -3476 -4314 966 4109 2229 -1806 -4438 -1346 3994 3965 -1972
1781 -1972 -4331 -2036 2363 3665 256 -4190 -3246 2211 4594 1335 -2881 -3859 -124 4083 2795
1796 2795 -2481 -4641 -400 3280 3423 -685 -4347 -2598 2745 4518 61 -3865 -2525 1217 3815
1811 3815 1897 -3153 -4275 869 4235 2334 -1776 -3563 -1179 2921 4086 -1216 -3819 -1737 2475
1826 2475 3731 846 -3674 -3624 1346 4244 1064 -2799 -3358 -36 3526 2750 -1832 -4229 -574 3030
1842 3030 3012 -482 -3664 -2161 2373 4265 114 -3855 -2666 1214 3765 2009 -2722 -3672 38 3868
1858 3868 2348 -1874 -3358 -1420 2722 3548 -602 -3870 -1618 2240 3032 687 -3059 -3263 1663 4018
1874 4018 1176 -2547 -3151 431 3419 2586 -1908 -3889 -747 3366 3079 -652 -3194 -2109 2099 3987
1890 3987 222 -3549 -2393 1131 3189 1616 -2059 -3864 -66 3738 2011 -2015 -3558 -1296 2569
1905 2569 3701 -736 -3730 -1732 2082 3054 274 -2639 -3157 933 3797 1472 -2686 -3041 -165 2913
1921 2913 2715 -1494 -3628 -882 3231 2729 -410 -3284 -2045 1901 3431 339 -3434 -2460 1218 3205
1937 3205 1214 -2066 -3281 69 3538 2075 -1687 -3009 -963 2574 2728 -374 -3765 -1649 2313
1952 2313 2987 412 -2810 -2780 678 3693 1646 -2655 -2886 21 3079 2541 -1495 -3732 -1172 2840
1968 2840 2679 -863 -3236 -1874 1694 3561 498 -3214 -2635 1529 2968 1396 -1886 -3436 -183
1983 -183 3236 2103 -1361 -3185 -724 2244 2899 -399 -3347 -1947 2081 2962 300 -2382 -2776 547
1999 547 3582 1600 -2384 -2847 132 2847 2293 -1167 -3413 -850 2591 2991 -526 -3158 -1870 1509
2015 1509 3538 590 -2851 -2580 1010 2783 1592 -1834 -3090 -582 3054 2192 -1689 -3055 -740
2030 -740 2223 2558 -63 -3578 -2097 2170 3164 521 -2759 -2554 552 3298 1677 -2209 -3078 -91
2046 -91 2654 2207 -781 -3124 -1104 2791 2661 -612 -2873 -2022 1520 3113 951 -2755 -2578 842
2062 842 3188 1330 -1966 -3113 -351 2894 2392 -1386 -3229 -1069 2129 2758 123 -3207 -2028 1687
2078 1687 3345 432 -2541 -2301 304 3354 1780 -1989 -3249 -182 2636 2288 -1033 -2846 -1292
2093 -1292 2333 3316 -425 -3007 -2062 1283 3178 1119 -2693 -2924 846 3082 1219 -1721 -2784 -489
2109 -489 2690 2582 -920 -3155 -1012 2140 2337 -105 -2728 -2225 1452 3177 556 -2270 -2409 431
2125 431 2865 1823 -1704 -2988 -208 2590 2221 -1075 -3030 -1746 2090 3159 -251 -3174 -1874
2140 -1874 1328 3089 931 -2616 -2877 672 3025 1525 -1930 -2932 -668 2731 2458 -1067 -3309
2155 -3309 -1221 1915 2779 164 -2866 -2228 1619 3376 436 -2584 -2103 484 2818 2052 -1585 -3208
2171 -3208 -536 2532 1904 -884 -2692 -1701 1986 2807 -27 -2811 -2020 1357 2839 1228 -2315 -2772
2187 -2772 250 2852 1594 -1557 -2763 -976 2189 2732 -558 -3085 -1020 2028 2767 357 -2675
2202 -2675 -2297 1243 3096 851 -2279 -2422 662 2657 1793 -1008 -2871 -603 2618 1852 -840 -2634
2218 -2634 -1572 1664 2692 188 -2654 -1908 1043 3055 1124 -1793 -3064 190 2706 1794 -1152
2233 -1152 -2793 -565 2025 2275 -540 -2865 -1322 1756 2512 423 -2317 -2145 886 3115 937 -2198
2249 -2198 -2450 337 2537 1840 -983 -2790 -754 2538 2306 -621 -2686 -1537 1744 2926 312 -2727
2265 -2727 -2065 849 2825 1381 -1744 -2956 37 2874 1668 -1359 -2655 -655 1889 2586 -651
2280 -651 -2702 -1607 1462 2563 495 -1990 -2177 795 3065 1172 -1809 -2066 82 2219 1578 -1061
2296 -1061 -2649 -754 2231 2077 -236 -2479 -1657 1535 2670 729 -2201 -2032 821 2612 796 -1774
2312 -1774 -2567 2 2705 1850 -1508 -2607 -529 1664 2288 -219 -2702 -1577 1372 2369 347 -2201
2328 -2201 -1788 513 2691 1202 -1844 -2108 179 2016 1645 -1171 -2460 -806 2110 1954 -307 -2395
2344 -2395 -1335 1331 2180 637 -2319 -2204 1163 2176 1171 -1393 -2232 -297 2330 1791 -1024 -2442
2360 -2442 -553 1954 2053 -168 -2542 -1491 1235 2219 389 -1921 -1741 599 2337 1267 -1842 -2250
2376 -2250 111 2067 1461 -943 -2396 -743 2004 1968 -372 -2284 -1027 1212 2222 431 -2308 -1946
2392 -1946 852 2412 1288 -1370 -2397 -496 2222 1727 -1070 -2445 -456 1448 1975 -91 -2156
2407 -2156 -1317 1146 2618 -48 -1959 -1725 321 2068 906 -1725 -2371 -24 2160 1139 -850 -2210
2423 -2210 -635 2020 1874 -483 -2140 -1385 1212 2269 660 -1823 -2071 847 2321 873 -1536 -1932
2439 -1932 -165 2097 1765 -956 -2187 -490 1774 1633 -234 -2076 -1241 1448 2303 173 -1879 -1750
2455 -1750 603 2255 891 -1257 -2431 208 2035 1496 -617 -2458 -477 1712 1978 -507 -2344
2470 -2344 -1443 1344 1829 453 -1854 -2008 712 2047 950 -1422 -1932 -162 2040 1610 -868 -2213
2486 -2213 -637 1801 2049 -504 -2086 -1527 1179 2169 377 -1821 -1610 672 2054 1078 -1493 -2074
2502 -2074 -398 1838 1605 -1106 -2124 -638 1589 2221 -246 -2112 -1422 1288 2267 277 -1799 -1878
2518 -1878 425 2263 995 -1481 -1876 -116 1779 1528 -611 -2390 -535 1469 1990 -371 -1995 -1024
2534 -1024 1261 2237 247 -2030 -1347 490 1953 764 -1443 -2220 -8 2202 1734 -885 -2116 -912
2550 -912 1732 2022 -196 -2200 -1277 1364 2227 320 -2103 -1991 228 2566 998 -1303 -1649 -162
2566 -162 1853 1784 -1102 -2121 -982 1839 1815 -231 -2297 -1385 1143 2093 361 -2229 -1938 420 2039
2583 2039 913 -1032 -1933 -163 1976 1339 -686 -2289 -793 1580 1905 108 -2156 -1474 1380 2235
2599 2235 362 -1627 -1837 484 2273 1342 -1350 -1924 -93 1833 1645 -799 -2245 -750 1714 1922
2615 1922 -3 -1919 -1524 1058 1858 192 -1896 -2033 712 2424 1005 -1259 -2307 -374 1950 1577
2631 1577 -1084 -2171 -828 1662 2159 -223 -1974 -1527 992 1967 237 -1599 -1690 500 2419 1129
2647 1129 -1533 -1949 -191 1710 1561 -764 -2080 -486 1539 1945 -77 -2165 -1386 966 1975 287
2663 287 -1687 -2034 717 2160 818 -931 -2125 -174 2122 1516 -663 -1922 -733 1469 1899 -137
2679 -137 -2219 -1497 896 2270 429 -2012 -1472 510 2238 1103 -1260 -1765 -80 1606 1296 -824
2695 -824 -2149 -594 1477 2166 -403 -2026 -1156 1079 2093 622 -1761 -1972 515 2278 808 -1373
2711 -1373 -2271 150 1902 1719 -661 -2161 -189 1458 2179 68 -1908 -1392 1115 2266 309 -1774
2727 -1774 -1591 308 2208 1114 -1626 -1863 -367 1696 1121 -851 -1983 -1130 1506 2153 -369 -2221
2743 -2221 -1190 731 1735 674 -1750 -1628 468 2231 985 -1238 -2230 -171 1621 1534 -463 -1977
2759 -1977 -744 1619 1979 73 -1763 -1471 981 1877 640 -1679 -1749 284 1625 1063 -1149 -2018 -311
2776 -311 1724 1306 -714 -2039 -853 1573 1844 130 -1862 -1289 899 1902 648 -1497 -1956 370
2792 370 1910 1012 -1048 -1848 -469 1599 1651 -627 -2213 -411 1674 1778 -35 -1926 -1469 1066 1934
2809 1934 454 -1470 -1506 398 1745 886 -1464 -2103 146 1552 1581 -996 -1880 -743 1346 1720 -56
2826 -56 -1756 -1386 889 1721 555 -1554 -1697 584 1965 787 -1000 -1787 -105 1656 1622 -684 -2008
2843 -2008 -744 1472 1829 -83 -1625 -1134 1098 2020 601 -1435 -1715 77 1915 1191 -1029 -1895
2859 -1895 -321 2066 1295 -511 -1744 -956 1351 1749 -30 -1961 -1311 847 2055 483 -1323 -1676
2875 -1676 137 1883 791 -759 -1494 -69 1461 1570 -577 -1728 -603 1582 1505 -50 -1598 -1395
2891 -1395 849 1584 647 -1409 -1528 336 1953 924 -827 -1854 -57 1711 1172 -841 -1624 -749
2907 -749 1138 1814 57 -1736 -1396 969 1667 284 -1216 -1343 160 1746 783 -1243 -1580 -229 1397
2924 1397 1505 -522 -1584 -808 1627 1630 111 -1748 -921 765 1857 473 -1562 -1294 378 2005 957
2941 957 -1111 -1521 -260 1860 1359 -792 -1721 -568 1189 1613 -181 -1938 -1382 855 1631 218 -1414
2958 -1414 -1371 209 1605 719 -1186 -1827 -186 1340 1521 -414 -1570 -746 1238 1421 -217 -1612 -1214
2975 -1214 592 1712 334 -1321 -1100 386 1414 761 -1136 -1700 -269 1684 1572 -742 -1737 -498
2991 -498 1076 1380 139 -1685 -1066 639 1576 319 -1267 -1223 195 1882 761 -1146 -1540 53 1474
3008 1474 1016 -428 -1775 -603 1075 1504 -223 -1625 -1090 1000 1568 622 -1914 -1402 360 1468
3024 1468 576 -1059 -1552 -158 1528 1087 -684 -1638 -172 1310 1340 46 -1387 -1056 891 1765 262
3041 262 -1226 -1370 342 1424 688 -1179 -1663 337 1376 1356 -626 -1495 -540 1505 1471 -226 -1575
3058 -1575 -815 606 1677 629 -1411 -1386 563 1736 1037 -618 -1564 -200 1464 1100 -516 -1661
3074 -1661 -309 1133 1635 -282 -1335 -843 765 1471 431 -1389 -1443 372 1411 910 -1008 -1183 -226
3091 -226 1245 901 -486 -1574 -675 1119 1280 -260 -1573 -994 974 1661 349 -1126 -1073 530 1923
3108 1923 936 -1014 -1574 154 1845 1380 -821 -1665 -447 1085 1133 -345 -1479 -1108 873 1696 94
3125 94 -1116 -951 643 1514 535 -1050 -1165 -77 1626 1015 -583 -1578 -553 1176 1648 -490 -1668
3142 -1668 -925 709 1537 122 -1258 -1458 238 1953 892 -1013 -1717 -223 1371 1427 -383 -1608
3158 -1608 -621 1182 1369 31 -1592 -873 951 1570 371 -1435 -1280 350 1656 814 -1063 -1235 -248
3175 -248 1297 1004 -700 -1471 -309 1212 1822 -144 -1737 -958 706 1651 281 -1477 -1331 540 1576
3192 1576 916 -1071 -1438 47 1386 1436 -585 -1601 -341 1032 1343 43 -1039 -908 623 1524 548
3209 548 -1255 -1132 23 1529 843 -985 -1528 -149 1356 1105 -733 -1506 -436 950 1764 -228 -1452
3226 -1452 -804 765 1575 100 -1152 -894 295 1180 460 -1034 -1510 -211 1568 1169 -702 -1650 -643
3243 -643 1321 1384 -144 -1525 -902 839 1411 89 -1197 -1298 312 1448 849 -857 -1579 -331 1432
3260 1432 904 -444 -1083 -750 1003 1478 -32 -1479 -806 907 1177 617 -1011 -999 298 1396 626
3277 626 -943 -1209 -419 1277 1080 -564 -1509 -548 1023 1560 -403 -1345 -1002 726 1394 464 -1152 -1100
3295 -1100 263 1241 737 -821 -1283 -317 1157 991 -725 -1284 -478 937 1374 -51 -1541 -985 622
3312 622 1163 449 -1160 -1295 383 1506 728 -975 -1268 58 1314 922 -526 -1576 -440 1129 1279
3329 1279 -107 -1538 -524 254 1257 338 -1212 -1266 -185 1205 1209 -939 -1220 -80 907 703 -409
3346 -409 -1265 -429 1019 1324 -141 -1336 -894 655 1400 339 -1143 -1116 232 1385 561 -1000 -1134
3363 -1134 -267 1181 1042 -378 -1266 -573 1464 1353 -114 -1405 -1090 1309 1336 198 -908 -1048 420
3380 420 1359 332 -770 -992 -179 943 1296 -817 -1447 -542 648 1185 177 -1314 -947 729 1157
3397 1157 156 -1111 -1056 274 1379 755 -715 -946 -250 1316 862 -667 -1302 -692 1259 1303 -248
3414 -248 -1285 -748 770 1329 141 -1167 -1037 332 1056 548 -758 -1303 -215 1195 865 -514 -1123
3431 -1123 -204 716 1100 -230 -794 -1124 493 1357 232 -1407 -746 12 999 593 -772 -1263 95 1141
3449 1141 861 -270 -1204 -200 716 922 -167 -1413 -527 609 1082 308 -920 -676 489 1125 610
3466 610 -410 -1292 -89 817 617 -399 -1161 -316 736 1020 -196 -1264 -657 440 981 196 -915
3483 -915 -876 368 1159 405 -919 -1198 40 1171 770 -518 -1073 -624 749 927 -263 -1374 -699 240
3501 240 1288 -92 -857 -1017 118 1220 463 -639 -1201 38 1208 678 -577 -978 -479 763 932
3518 932 60 -1292 -561 714 1150 198 -872 -897 285 686 596 -771 -1115 17 1006 657 -564 -1150
3536 -1150 -370 1159 1050 -510 -1450 -525 591 1046 172 -896 -852 328 759 534 -543 -1063 -69 1035
3554 1035 739 -309 -1009 -302 1105 1187 -73 -868 -446 650 943 103 -942 -878 308 959 301 -644
3572 -644 -861 -279 956 923 -361 -1266 -262 532 983 -171 -1258 -605 653 1154 329 -1039 -890 409
3590 409 1158 684 -943 -1056 -13 990 684 -537 -977 -93 1105 788 -395 -955 -593 364 935 264
3608 264 -953 -691 417 934 398 -797 -998 49 1199 510 -655 -1067 -595 941 809 -151 -1071 -826
3626 -826 795 1056 -1 -452 -875 199 1145 478 -968 -1126 263 647 607 -639 -1209 -318 916 616
3644 616 -484 -1084 -528 666 886 209 -1125 -773 348 959 280 -681 -628 128 939 503 -795 -746 -202
3663 -202 1083 693 -338 -840 -529 436 856 -47 -804 -814 309 976 324 -609 -1022 35 1106 907 -566
3682 -566 -1193 -190 568 861 -235 -1229 -569 387 1004 242 -894 -889 -46 728 560 -648 -760 70 882
3701 882 585 -572 -914 -385 499 952 60 -956 -540 796 883 -106 -697 -815 623 868 467 -570 -1151
3720 -1151 -6 819 662 -155 -1170 -321 925 1099 243 -682 -645 721 751 8 -658 -785 681 1081 426
3739 426 -805 -534 27 942 779 -538 -687 -85 769 884 -167 -880 -595 443 736 190 -943 -454
3757 -454 308 854 601 -844 -632 73 1142 459 -341 -724 -341 1045 429 -225 -794 -555 576 1203 147
3776 147 -714 -861 331 692 536 -497 -984 122 810 906 -420 -1116 -99 931 903 76 -1444 -151
3794 -151 653 843 296 -615 -461 186 1023 496 -660 -807 57 770 435 -211 -779 -71 1075 474 -19
3813 -19 -684 -146 595 838 350 -736 -766 266 700 281 -500 -859 26 910 995 -320 -680 -278 479 550
3833 550 -64 -597 -422 456 848 113 -715 -588 155 1020 362 -520 -518 -267 970 487 -346 -741 -200 674
3853 674 636 -221 -919 -313 518 810 -5 -589 -765 490 877 653 -361 -727 95 752 602 -375 -700 -343
3873 -343 477 704 -211 -614 -476 497 937 -165 -619 -485 122 670 360 -685 -297 -2 693 439 -272
3892 -272 -896 -372 505 719 -49 -716 -64 426 618 18 -664 -479 35 284 228 -294 -679 -96 656 313
3912 313 -453 -720 -174 638 530 -69 -295 -313 288 738 159 -818 -483 5 447 63 -513 -470 -114 775 482
3933 482 -483 -695 -274 450 735 -59 -590 -205 297 818 55 -667 -590 432 407 33 -309 -850 56 725
3953 725 562 -322 -947 -289 373 714 51 -705 -459 448 1121 174 -639 -612 54 702 385 -350 -520 22
3973 22 785 212 -266 -992 56 492 774 -363 -532 -582 428 702 97 -565 -353 152 640 360 -824
3992 -824 -689 -220 840 365 -361 -611 -250 474 291 -346 -926 -285 605 655 140 -854 -622 8 806 144
4012 144 -275 -731 0 499 522 -348 -299 -50 430 331 -244 -389 -294 526 485 46 -497 -390 318 711 85 -149
4034 -149 -1041 -138 695 424 3 -714 -169 467 719 60 -792 -127 796 599 373 -519 -410 305 665 302
4054 302 -297 -739 18 653 383 -238 -569 93 779 247 -91 -905 -530 447 645 166 -544 -305 50 598
4074 598 146 -626 -904 240 701 299 -312 -747 -310 354 566 -60 -549 -293 327 211 -162 -265 -771 423
4094 423 824 -50 -176 -436 -27 463 334 -482 -811 -292 776 485 -28 -266 -152 53 505 -130 -681 -324
4114 -324 205 715 297 -164 -431 98 495 289 -274 -509 -35 685 503 -452 -274 -383 331 495 433 -662
4134 -662 -401 37 497 35 -860 -351 -85 744 72 -474 -719 97 129 288 -182 -559 -299 434 621 165
4154 165 -529 -226 -23 497 449 -333 -427 8 667 482 -471 -404 -297 714 296 -429 -152 -132 401 704 193
4175 193 -541 -296 93 551 225 -453 -394 333 652 286 -272 -738 28 405 177 31 -351 -277 398 357 -131
4196 -131 -337 -188 185 754 368 -184 -656 -13 817 548 -326 -381 -77 177 368 -20 -755 -249 568 559 42
4217 42 -626 -376 223 683 246 -519 -777 -30 379 319 112 -594 -307 498 513 5 -233 -263 432 770 274
4238 274 -571 -515 142 275 101 -530 -569 -157 146 534 -286 -661 -26 516 518 -13 -751 -186 30 397 175
4259 175 -374 -552 364 671 18 -326 -539 52 549 490 -169 -417 -386 341 569 -126 -391 -159 603 221 -157
4280 -157 -384 -508 -71 608 461 -258 -698 4 493 220 -227 -556 0 350 709 -288 -645 -259 328 720
4300 720 235 -679 -411 236 482 -125 -200 -394 300 339 566 24 -609 -74 426 289 38 -593 -144 93 694
4321 694 101 -550 -604 24 515 295 -254 -503 -232 294 392 -519 -314 -38 470 522 27 -547 -304 283 700
4342 700 141 -411 -391 -89 740 411 -396 -391 -286 605 141 -307 -574 -244 270 694 -18 -549 -412 330 561
4363 561 146 -515 -370 154 643 411 -187 -78 46 334 343 -114 -935 -22 140 408 154 -653 -376 68 749
4384 749 45 -171 -205 325 676 161 -259 -785 -205 207 478 -146 -283 -88 264 474 -53 -373 -332 338 478
4405 478 225 -436 -400 -31 452 546 -304 -670 239 242 163 -169 -450 83 473 388 172 -314 -454 123 381 59
4427 59 -538 -441 -45 167 624 -34 -407 174 394 358 -78 -562 -158 417 320 -31 -255 -271 478 276 144 -261
4449 -261 -455 -66 565 53 -243 -441 -334 338 427 -263 -234 59 155 378 -82 -335 -238 378 320 131 -474 -365
4471 -365 15 332 328 -181 -256 92 284 330 -364 -290 -1 302 5 -92 -475 31 264 249 122 -480 -246 162
4493 162 192 143 -388 -538 -25 316 206 -142 -315 -77 97 195 162 -117 38 52 453 152 -226 -326 293 258
4515 258 347 -288 -389 72 742 285 -225 -268 169 377 252 -262 -386 -260 437 405 -31 -651 -83 -349 645
4536 645 -256 -87 -331 205 265 201 316 -244 -276 156 353 141 -100 -348 129 156 9 -531 -45 168 331
4557 331 -6 33 -514 69 505 415 -315 -83 -257 277 410 -417 -236 -9 171 466 82 -335 -206 -56 212
4578 212 223 -288 -400 -201 362 264 -219 -616 -390 465 371 260 -207 -179 -102 248 152 -379 -66 225 203 360
4600 360 262 -478 -77 181 335 -197 -131 -8 198 3 78 5 -313 285 225 138 -324 -70 444 390 -117 -363
4622 -363 -231 -32 401 268 -192 -239 110 321 262 -128 -150 -171 48 477 -11 -374 -150 112 287 23 -92
4643 -92 -481 -34 91 502 -192 -245 -269 -42 233 -50 -232 -294 212 321 -148 -131 -76 32 705 289 -147 -247
4665 -247 -83 2 129 -153 9 -14 274 384 -193 -316 -227 38 38 -49 -361 3 -189 62 -85 -297 -220 -192 115
4688 115 23 -140 -279 -317 551 218 -59 -134 -286 107 145 163 -315 -277 249 271 385 4 -109 -99 174 49 -133
4711 -133 -328 96 37 226 -18 -196 -544 -17 502 571 -290 -352 42 252 197 222 -176 -156 349 -94 -165 104
4733 104 -219 204 342 -104 -136 -307 372 504 75 -95 -95 48 375 168 13 -213 -108 349 331 -206 -405
4754 -405 -144 186 394 14 17 -172 24 342 14 -512 -289 308 170 265 -22 -211 119 52 38 -121 -366 92
4776 92 229 145 36 -366 -16 455 228 33 151 -187 17 127 139 -464 -405 221 222 50 -424 -197 -101 -50 119
4799 119 -306 -295 -171 -36 331 77 -424 -133 200 241 298 -156 -246 -43 121 157 165 -179 -104 249 330 -188 -394
4822 -394 -466 231 306 66 11 -69 -19 328 51 -185 -84 60 589 232 -122 -434 -52 246 253 213 -268 -20 131
4845 131 5 44 -314 -187 -262 255 -11 88 -376 -13 247 291 -186 -422 100 281 340 107 -210 -211 7 174
4867 174 329 -174 -173 -174 51 263 119 -141 23 46 229 -27 -138 -90 217 34 -169 -400 -280 32 371 17
4889 17 -209 -323 324 292 42 51 -285 242 460 161 -47 -397 125 274 -29 73 -432 -329 -57 353 -44
4910 -44 -308 -372 322 62 213 103 -499 -97 158 215 -372 -188 -58 298 143 234 -490 -37 -38 227 195 -285
4932 -285 -26 -58 425 -86 -233 -296 -17 25 508 -196 -386 -55 76 287 145 -684 -373 399 360 84 -484
4953 -484 -135 69 244 -170 108 -244 151 253 238 100 -362 76 348 423 293 -369 -157 -93 79 149 -86
4974 -86 -396 -181 344 97 -36 -357 208 29 196 -276 -311 -385 286 223 -190 -119 -393 -38 123 -65 -336 -125
4996 -125 283 418 60 151 -121 150 226 40 175 77 -28 27 711 -61 -260 -94 164 165 276 -222 -123 -17
5018 -17 272 394 26 -48 -53 73 128 -77 -29 -144 -13 349 30 80 -171 89 405 254 -217 36 19 294 257
5041 257 -126 -257 -102 102 76 -176 -151 -87 333 281 -49 -231 -35 -41 232 171 -101 -144 204 311 237 -136 -368
5064 -368 341 587 552 -44 -197 -234 344 351 -131 -193 -258 -17 302 201 -111 178 39 496 254 67 -75 -127
5086 -127 129 127 33 -216 -342 134 315 356 -324 -303 -48 62 291 -125 -162 -98 162 277 -407 -348 294 263 226
5109 226 -4 -351 7 309 377 14 -27 35 117 281 309 -164 -359 -46 383 136 3 30 -295 18 347 -1
5131 -1 -276 -21 516 -111 142 -120 12 -219 439 221 -213 18 -194 141 156 4 -130 161 15 216 47
5152 47 -143 -326 389 190 -148 -443 -172 32 224 41 -132 -138 -42 51 207 51 115 -287 172 240 -37 -442
5174 -442 -290 45 173 111 -247 28 98 300 -11 99 -28 160 63 404 62 -317 94 -44 152 -143 -40
5195 -40 -117 225 425 246 -185 -160 -37 124 212 -191 -190 -40 327 442 -94 -360 247 24 390 -296 -95 -312
5217 -312 115 321 126 -10 -83 99 401 207 -267 -300 -185 96 322 -100 -63 53 350 207 -6 -174 -311
5238 -311 23 348 78 -140 -302 84 66 -54 34 -326 -137 488 126 3 -253 -10 -170 260 239 -398 -203
5259 -203 204 115 38 -82 -450 -115 387 161 -392 -529 61 306 261 -6 -296 -106 2 214 -35 -20 91
5280 91 -126 56 322 13 127 40 67 65 -139 119 -167 358 75 143 -211 5 -52 -3 222 -312 -225 34 320
5303 320 256 15 -368 -46 340 -30 95 -248 21 533 328 122 -3 -107 242 199 -182 -103 -159 158 223 -158
5325 -158 -281 -43 -159 -36 235 -231 -33 -230 4 250 -274 -403 152 -290 -7 -84 -1 -2 196 284 306 -217
5347 -217 -226 -166 324 5 -154 -246 -11 110 39 298 -233 -251 46 281 -49 -119 -263 101 407 -25 -247 -194 182
5370 182 3 113 -23 -13 20 473 162 72 -335 146 320 377 23 -334 139 52 375 -78 -190 -376 260 290
5392 290 55 -282 -26 -75 -1 495 -46 51 -40 -51 215 -116 -467 -380 101 304 40 -192 -221 -293 15 -106 -140
5415 -140 -388 -168 152 -100 -379 -278 -8 229 217 39 -237 -98 -308 222 -63 -75 -192 -26 -34 131 -95
5436 -95 -200 -103 294 332 -403 -138 -18 125 201 -353 -289 -384 228 197 -97 -86 -383 103 161 -5 53 -314 -184
5459 -184 214 -3 -1 57 -291 -65 171 -62 -383 150 96 333 144 -180 -284 -359 13 170 181 -231 -70 96
5481 96 424 64 -151 -109 22 203 -15 -161 -162 309 467 167 -35 -280 113 410 249 -222 -96 -132 155 240
5503 240 192 -98 15 458 475 146 -81 172 60 162 150 -91 -121 305 353 174 239 -141 -164 430 -19 17 62
5526 62 -201 58 279 -95 -258 -194 194 492 -174 -59 -171 256 143 -203 -106 75 199 -31 365 27 -311
5547 -311 -176 313 270 222 -15 -337 42 -20 -46 -24 -41 47 -292 241 -231 -70 -20 179 271 5 -224 -263 336
5570 336 159 52 -71 -362 122 259 179 -205 -322 -279 139 -36 -353 -47 48 283 122 -186 -119 71 -119
5591 -119 165 -51 -163 223 134 242 18 -301 24 -134 41 -76 -76 -513 -2 210 111 -19 -198 -160 188 316
5613 316 98 -171 -229 131 152 20 33 35 3 46 184 139 95 134 140 188 91 -434 -123 427 42 -118 84 265 103
5638 103 470 -106 -64 -306 44 279 160 -127 -124 -98 336 213 -342 -91 114 -195 94 260 -339 7 -1 335
5660 335 122 -185 -217 -23 72 234 115 31 -56 -49 170 -31 -262 -98 99 16 5 -475 -31 17 275 133 -110
5683 -110 -17 126 116 196 -450 -224 -231 99 89 -274 -308 -104 92 -112 120 -259 -78 92 344 -9 -144 -69 70
5706 70 227 175 -268 74 255 -34 -35 78 -381 -265 -34 395 146 65 -69 52 431 190 -465 -381 -100 428
5728 428 405 -85 -326 -424 340 185 296 -190 130 49 288 203 -277 -244 236 188 90 -162 17 -153 241 61
5750 61 -38 -129 233 457 203 -200 -80 -16 48 604 -273 -71 0 56 273 153 -102 -77 234 216 -145 225 -181
5773 -181 16 253 39 230 -26 -146 -97 63 -31 -124 -375 -39 260 246 -71 -318 35 256 103 -53 -117 -146
5795 -146 192 165 -299 -235 -108 309 348 147 22 -324 272 -46 16 -59 -181 -15 -145 -20 27 -222 -27 36
5817 36 369 18 -254 -103 -56 -101 -87 -359 -202 199 506 -239 -7 104 92 248 12 -166 -340 -219 132 299
5839 299 110 136 24 176 142 -99 -395 -27 28 73 201 -433 -81 5 585 188 -299 -105 82 54 -154 -249
5861 -249 -196 -42 -115 34 -247 -428 -281 334 250 17 -502 -321 1 168 118 -268 -395 -465 -13 232 145 -253
5883 -253 -353 92 304 -26 -454 -182 24 116 -44 -22 -422 -130 437 387 -43 -45 26 -16 92 57 21 296 135
5906 135 233 110 120 127 -64 82 -119 -158 49 66 205 468 -164 83 71 -9 62 -167 -292 -76 120 201 -138
5929 -138 -127 -250 382 508 -136 -234 -127 -148 123 130 -52 -184 202 347 189 250 -238 -176 260 307 -73 -219 -196
5952 -196 192 91 248 -34 -58 272 121 26 -306 -147 112 -98 131 -4 -181 -127 132 357 282 -176 -50
5973 -50 255 96 67 -280 -134 -163 263 -181 -173 -160 -31 215 52 57 -326 -312 185 250 -43 -204 -389 -82 32
5996 32 -207 -202 -235 365 170 -90 -240 -302 -119 225 129 -70 -41 -402 -11 284 168 -330 -233 -8 330 -135 -381
6019 -381 -99 -145 98 169 -140 -175 -327 85 223 18 -98 -123 33 48 114 -325 -211 102 147 -2 220 -114
6041 -114 -1 35 -28 12 -101 -81 317 218 -35 -100 -222 5 240 -61 -90 -112 -39 93 218 255 -256 -44 223
6064 223 -182 -59 -3 -2 273 -18 -143 -331 62 140 -182 44 131 86 170 -237 81 -246 38 110 33 -91 -201
6087 -201 -433 269 -15 -56 235 -279 -164 289 341 29 -221 -208 131 249 -86 -88 6 53 -279 95 -116 -198 -26
6110 -26 3 37 -106 -119 -178 125 -11 -72 -76 -43 154 -72 367 99 -161 510 344 54 -31 3 -28 225 180 -132
6134 -132 -33 -95 526 220 109 -77 -121 203 285 282 -149 -201 12 223 96 -32 -222 128 100 -133 192 -36 114
6157 114 226 11 139 -307 -58 394 238 137 -249 -187 -147 169 143 -50 125 -39 199 85 66 -62 165
6178 165 247 13 75 -255 18 85 325 429 -259 -40 78 79 -11 23 -182 241 130 54 107 -130 -198 43 -19 -248
6202 -248 123 -91 -109 182 73 -204 22 79 166 32 -190 1 -245 130 229 220 -198 99 116 168 -34 -155 57
6225 57 143 276 255 -174 66 -1 210 -94 139 -155 -39 318 191 -122 -63 -129 -155 332 -103 -48 127 205 161
6248 161 -81 -309 -524 -143 172 103 -111 -329 -93 203 176 50 137 -17 316 403 -46 -314 -98 372 -88
6269 -88 172 -216 23 -234 315 122 -291 15 27 222 90 -123 28 53 67 -71 74 -31 -94 115 31 -278
6291 -278 -417 71 113 366 -175 -233 50 179 19 60 68 -6 3 183 77 -335 -25 -92 -22 140 228 -375 148 201
6315 201 176 -24 112 -55 -114 295 6 129 -358 36 47 133 -9 -184 -163 209 -38 -128 -301 -99 116 12
6337 12 -141 -257 135 180 209 15 -158 -174 78 152 290 41 131 -196 194 148 35 -55 -265 97 -241 -182 2
6360 2 -83 124 179 24 -349 -213 -33 -84 72 34 -16 -42 355 339 -55 46 -15 -159 -158 39 -75 -398 -26 314
6384 314 -44 -23 -136 126 301 240 75 51 -70 186 409 313 -305 -227 -70 379 120 -112 -266 -36 172 42
6406 42 143 -74 113 276 213 -145 81 -78 -122 -76 74 -72 24 186 16 -185 -241 -321 -187 -2 221 -224
6428 -224 48 21 256 -69 -424 -286 14 62 426 332 -228 -92 391 5 1 -163 -289 18 315 351 -234 -329
6450 -329 -108 -53 386 -38 -25 -67 214 -34 123 -236 -197 -41 13 98 21 136 60 38 42 203 84 62 321 334
6474 334 146 -17 -21 -50 -4 89 -161 -202 145 66 84 81 -433 301 -158 144 95 -375 23 172 324 149 -27 -115
6498 -115 27 190 -99 -48 46 -103 299 145 -410 -116 27 203 91 -330 -105 -70 354 45 170 -78 -187
6519 -187 95 186 170 -290 -189 -1 291 144 -118 -13 123 96 325 -184 -239 166 313 21 -186 -71 -234
6540 -234 169 117 -33 -255 -260 208 -3 182 -120 -281 -77 210 202 -279 -111 -63 -76 266 59 -276 -258 172 371
6563 371 12 32 -63 40 -5 91 -389 -371 140 81 108 -79 -127 -38 166 -61 225 -191 -424 -103 273 -33 -28 181
6587 181 21 227 -8 -220 -62 -5 265 114 -138 -128 -4 -38 -4 182 -107 201 146 121 190 -164 -304 -83
6609 -83 78 427 17 -182 114 125 -152 19 -58 -239 16 149 357 66 -194 222 -28 -131 -118 -121 -51 145
6631 145 500 42 -307 136 76 -21 -101 39 -2 118 279 -37 -92 -249 -98 49 151 -342 173 292 91 -52
6653 -52 -141 -148 505 356 205 -296 -216 -45 208 177 -125 -29 -25 -143 427 -224 -197 -332 -315 -83 69 28 -295 8
6677 8 285 99 5 63 -367 -20 175 -153 28 -151 367 101 -55 -17 -278 45 -143 -15 -163 -70 8 57 73
6700 73 72 -118 -323 37 166 -24 354 -74 -170 126 31 -135 17 161 -1 187 154 -142 -72 -232 239 -107
6722 -107 -106 -96 346 165 286 -153 37 145 526 83 -15 -652 -472 181 228 25 108 -38 15 -73 -56 41 -134
6745 -134 -22 102 -48 -116 102 -64 26 -26 -199 -361 89 -70 -249 153 143 -151 94 331 39 -76 -64 -30
6767 -30 -81 72 -232 -260 -11 3 -27 5 79 114 66 377 -99 -63 351 -86 253 30 68 -40 356 0 -159 -247
6791 -247 -74 172 103 -168 -52 -56 -42 -279 224 -187 -58 -207 85 -69 -155 71 132 245 359 -3 -72 183
6813 183 221 61 -79 76 -68 -15 70 1 -218 49 87 75 11 126 -135 -106 169 352 -156 -121 30 23 333 -65
6837 -65 -252 -38 46 283 -198 -106 -58 -189 113 -145 -321 158 107 -205 182 -65 -80 26 -24 241 81 45 70
6860 70 357 187 -214 24 100 -72 338 46 -331 236 201 86 249 -52 -74 -100 -76 129 259 -319 -138 -174
6882 -174 -90 261 -56 -150 73 209 313 -109 -367 98 128 47 289 -343 -89 25 108 152 -177 -10 141 267
6904 267 -208 -253 -58 14 34 145 -131 -45 -239 36 138 -73 -208 -309 285 239 200 -238 -185 279 119 -88
6926 -88 14 79 -20 94 125 -184 -458 -114 126 74 93 93 36 -47 381 36 -172 99 228 300 104 81 -162 25
6950 25 269 31 -180 -223 -128 166 196 -146 -172 113 -16 24 -328 -250 -179 -320 151 154 202 -186 -15 150 -55 128
6974 128 -183 -158 262 75 50 -172 101 25 36 119 -199 -539 170 248 123 21 -244 82 -133 -201 208 -247
6996 -247 115 247 89 168 111 0 275 -17 -66 250 -113 391 10 -204 -251 -534 346 143 -22 61 -127 136
7018 136 -67 274 -18 -170 -211 201 256 -19 -55 87 206 223 -152 -279 -186 -79 336 331 12 -257 -225 199 55
7041 55 12 42 154 0 -19 71 113 107 -81 328 282 -159 -44 -317 243 290 39 -371 33 166 458 112 -37
7064 -37 -53 79 -18 -67 -8 -169 395 212 -149 -212 -141 118 471 229 -36 12 -140 -9 -110 -20 -449 76 -86
7087 -86 144 91 198 -26 116 327 -73 76 -19 -390 169 209 53 -382 -10 -84 7 -147 -196 237 -95 -119 147
7110 147 44 -136 -99 -53 -112 113 -149 14 143 366 -102 -170 44 -121 198 89 -2 -200 125 50 -61 168
7132 168 -65 -51 -25 133 -31 -284 -189 1 -117 -179 336 81 -121 -45 74 -253 -167 37 60 39 102 -23 -14 241
7156 241 138 -58 -126 4 88 -229 233 -193 30 -33 -24 389 -402 -70 9 184 46 -22 107 -67 165 71 99
7179 99 27 -254 3 313 -31 -117 -25 -100 99 -95 27 -481 -6 358 101 -210 103 258 77 140 -155 -98
7201 -98 155 528 405 213 19 -13 -17 -1 55 50 171 311 379 -96 -71 -50 33 405 182 -14 -42 -37 -296 39 69
7226 69 -26 47 168 239 175 39 74 -82 241 127 -112 67 -99 81 13 16 -42 65 167 116 -277 -241 -230 -100
7250 -100 -111 108 95 71 -78 182 127 102 -65 115 138 517 -184 -327 -355 9 347 -74 180 -64 -73 164 18
7273 18 -191 70 -242 83 110 -223 48 -38 -238 12 -189 -79 217 417 401 80 -103 -250 -185 117 42 -134
7295 -134 37 168 391 -106 -160 28 -40 -70 170 -229 32 12 -2 101 -446 191 -128 236 230 341 -101 -281
7317 -281 72 227 -152 -87 -120 58 459 -158 -218 -215 -102 62 139 -168 61 -9 243 189 -61 86 -107 190 -93
7340 -93 -134 90 28 165 193 -138 15 -249 -89 308 132 101 -271 -73 36 71 195 106 54 365 80 16 -386
7363 -386 -126 -215 265 253 -97 101 201 -162 9 72 -138 124 -16 290 237 -59 -174 -251 -196 179 34 -3
7385 -3 57 287 -61 -133 88 -273 84 -265 -333 -9 -35 -228 247 -150 -538 -225 22 73 74 -87 -95 67 353 13
7409 13 -238 137 -124 264 -4 174 -30 164 174 26 -121 145 -249 142 2 -370 -282 72 -36 -384 47
7430 47 -119 -167 56 -103 42 229 -140 19 -26 116 -126 83 -280 113 -150 407 -78 3 69 13 304 163
7452 163 82 -20 180 -77 -217 -243 3 79 14 -164 -80 -184 44 481 -156 64 -74 -83 272 108 236 -22
7474 -22 153 336 341 -12 -207 164 -18 1 -26 -269 -256 91 276 87 -36 10 5 281 74 62 -164 120 96 186
7498 186 57 303 -173 325 49 -162 -142 -147 3 65 40 -47 99 -214 159 150 -86 -268 -20 -155 -95 -81 -235
7521 -235 -40 133 -20 95 -172 -25 61 -12 6 193 -284 144 -79 201 -164 -129 -222 372 -39 12 -98 90
7543 90 -86 118 -205 -329 -75 -160 122 -105 171 -132 -2 -148 87 64 229 260 -207 119 20 -215 -152 -43
7565 -43 42 130 -56 76 29 120 101 -85 -54 36 274 3 -109 -54 89 444 86 -48 -421 207 41 322 201
7588 201 -146 118 -491 250 -166 -237 -70 3 168 109 -139 -231 -304 -61 77 -13 -43 -92 173 65 -50 -207 -34
7611 -34 294 58 176 -280 -133 -129 -15 139 -183 -57 83 428 17 -71 -128 -120 26 16 -95 -32 41 -249 41
7634 41 -43 57 231 -93 -233 63 -110 190 -39 -1 -73 -217 -126 105 20 121 -159 7 391 262 -72 -83
7656 -83 -212 -24 1 135 84 372 -129 167 168 -72 -140 -162 -168 70 390 239 98 -202 -126 212 29 344 -22
7679 -22 -122 152 -145 96 -122 -49 138 172 -258 -225 -43 -60 35 70 -155 -341 -137 -53 -72 68 -129 -79 172
7702 172 -50 49 -112 103 -172 -204 85 -232 29 64 78 -74 -39 121 62 111 206 325 -246 267 -223 45 -14
7725 -14 -84 -158 -18 301 276 147 -129 -271 -34 -108 -102 -104 -182 -100 -33 -43 -66 -63 29 73 -238 -56 -293 -462 354 76
7751 76 41 26 -128 -25 166 -67 -73 -119 50 -37 134 -484 145 300 143 -33 -188 17 -74 244 -108 13 -177
7774 -177 -277 254 139 76 -152 -210 -33 -78 -160 -240 89 125 103 -304 -170 21 -354 -143 33 -94 -282 247
7796 247 62 105 -49 -200 86 137 210 -290 219 -304 263 106 -79 162 -297 662 68 -180 8 -30 72
7817 72 117 -16 -314 -307 -239 230 76 119 81 -76 406 -216 6 -152 91 -65 175 -88 133 -196 -85 368
7839 368 17 -34 96 -123 -3 250 -38 -73 46 -109 8 54 66 -76 -49 -134 30 -97 75 46 188 -198
7861 -198 -83 -174 189 90 38 -55 -9 175 304 -22 37 -97 -140 80 394 -221 -87 -85 39 123 -117 -163 -71 -268
7885 -268 224 276 -129 113 -275 -47 17 -163 -42 300 -80 223 360 -8 -54 37 72 -285 132 -231 -23 -176
7907 -176 82 -144 98 400 29 201 -19 87 -11 97 209 168 -129 46 325 185 54 -123 -196 -42 539
7928 539 139 -195 140 67 339 274 -72 -208 191 -16 214 -157 -122 -96 45 161 -158 -124 -114 59 326 69
7950 69 10 137 -33 364 5 -1 3 -81 -94 288 -8 -70 19 209 -107 158 38 -190 -387 330 239 -109 357 -267
7974 -267 -162 79 -14 -143 -41 155 371 124 -136 -72 38 18 65 33 -152 80 107 -19 24 -153 -299 75
7996 75 43 -165 -168 293 147 -1 -15 -318 -164 180 430 59 -58 -147 262 356 462 -119 -32 -52 -121 -8 -157
8019 -157 41 -218 191 -310 254 249 -188 285 28 -152 42 -249 -206 -76 -277 -157 36 -378 10 89 181 32
8041 32 163 -14 136 163 -294 -66 -114 128 -6 123 -183 148 76 -160 -375 -8 -85 38 219 -311 -190 -61
8063 -61 -31 398 112 -377 -113 336 17 335 -3 -262 -143 315 -17 -330 -72 -118 62 48 -468 -61 -210
8084 -210 146 415 -43 -148 -354 -5 116 67 -165 -160 49 142 217 -65 86 263 75 311 -108 -1 0 -3 -108
8107 -108 345 -320 -30 -51 158 -184 -183 -106 18 -54 305 260 78 -212 195 7 -122 45 -166 100 264 -242
8129 -242 -76 -21 223 -255 -328 -112 -236 -98 -86 47 1 -217 -94 150 223 -128 -219 -246 88 -216 -107 -146 134
8152 134 84 -297 -25 53 -209 -208 -2 79 42 -47 75 123 125 113 -243 -115 -51 -3 -62 121 225 109 -20 149 66
8177 66 -119 -43 58 -35 -183 101 97 -29 66 -3 -43 -253 -26 -39
8191c9
$$ Imaginary data points
##PAGE= N=2
##DATA TABLE= (X++(I..I)), XYDATA
0 0 0 0 0 0 0 0 0 -8 8 -8 8 -16 16 -24 24 -32 35 -40 48 -58 72 -80 93 -107 123 -139 162 -184 208 -235 266
31 266 -296 331 -371 411 -459 515 -569 632 -702 775 -858 952 -1052 1166 -1294 1438 -1601
48 -1601 1792 -2011 2270 -2583 2968 -3451 4086 -4962 6243 -8306 12195 -22074 102248 137785
62 137785 -110351 -121667 -29967 85640 129633 19198 -166363 -99859 105797 134810 -7998
73 -7998 -100004 -101132 11149 139139 80452 -116215 -135077 25197 119296 72745 -37448 -128220
85 -128220 -57406 116608 128478 -34494 -121046 -58002 58005 121156 37490 -114474 -107094
96 -107094 44801 116526 42044 -72141 -110943 -13418 113388 83025 -62491 -112926 -23909
107 -23909 81065 97592 -4057 -115653 -70728 76714 111218 8634 -83630 -83035 14178
118 14178 115127 64664 -83874 -105236 7834 85373 66990 -24498 -109397 -53212 88487
129 88487 97442 -25695 -94173 -52040 39868 101998 37442 -94757 -93282 40916 103658 38971
141 38971 -53450 -92230 -22586 98222 88509 -50390 -105009 -23576 64024 80306 7268 -96822
153 -96822 -76919 59224 101946 5848 -76095 -68890 10136 94579 61831 -68890 -99747 9046
165 9046 88225 58441 -26274 -90379 -46873 75444 96681 -19579 -94013 -45435 40410 82632
177 82632 31743 -77863 -88221 30434 94966 29063 -53861 -74350 -15494 79359 75550 -42034
189 -42034 -94695 -16001 65937 67415 527 -78749 -63534 49986 94303 6839 -73348 -58249
201 -58249 13326 75269 51495 -54104 -89859 2877 77786 46006 -27962 -71665 -38186 58306
213 58306 82626 -14574 -82490 -35457 40753 68349 24614 -61564 -73979 24244 85580 27610
225 27610 -49894 -62703 -11009 62700 64352 -30442 -84666 -19447 57763 55330 -3867 -63561
237 -63561 -53578 36735 81269 8887 -66211 -48286 17717 63873 42699 -42356 -77070 1242
249 1242 72751 42345 -27944 -62019 -30771 47210 71076 -9399 -74909 -34597 36867 57609
261 57609 17490 -51344 -63179 16715 74485 25636 -46799 -52749 -3893 53702 55166 -23122
273 -23122 -74322 -16723 56209 49119 -6671 -53814 -45483 28988 71739 8968 -61506 -44061
285 -44061 17280 52474 33116 -34610 -67371 -2006 64841 37557 -28596 -51632 -21012 39803
297 39803 60943 -4588 -66780 -31169 38859 51629 10405 -43526 -53672 10846 66563 25067
309 25067 -46173 -49406 -735 45442 44063 -18727 -64766 -18631 50885 45635 -10113 -47193 -34265
322 -34265 26324 62438 11343 -54982 -40583 20125 49143 25899 -31386 -58284 -4524 57910
334 57910 35660 -28751 -49292 -17110 34096 51236 -2893 -59345 -29940 35622 46822 6440
346 6440 -37925 -43898 10803 59637 24110 -41996 -44605 3919 41949 36963 -16962 -57631 -18098
359 -18098 46707 41718 -12615 -44530 -29338 21600 53767 10869 -50169 -38003 20427 44432
371 44432 20099 -26664 -48609 -3659 53143 33231 -28484 -44424 -10623 32182 43894 -2683
383 -2683 -54325 -29482 34009 43878 1986 -36244 -37884 7686 52233 24004 -39466 -42630 6429
396 6429 39001 30126 -14005 -49254 -16846 43653 40527 -14102 -41705 -21818 21209 46736 10922
409 10922 -46253 -37827 19799 43392 14494 -26641 -42785 -4906 46667 32716 -26442 -43134
421 -43134 -7475 31340 37336 -1937 -46700 -27049 32128 42604 -250 -35028 -31073 8929
433 8929 46382 21744 -36886 -41481 7234 38269 25015 -14946 -44614 -16816 39567 38887 -13891
446 -13891 -39913 -18280 20229 40597 10642 -41135 -35237 20623 41900 11022 -25852 -36369
458 -36369 -3822 42352 31881 -25941 -42926 -4662 30825 31613 -3124 -42081 -27437 29159
470 29159 42414 -1616 -35014 -26325 9431 39805 21807 -31346 -40019 7845 38152 20842
482 20842 -15782 -37443 -14598 34421 37621 -13109 -40718 -15701 21541 35141 8030 -36215
494 -36215 -34340 17333 41179 10207 -26616 -32142 -1837 36605 29418 -21491 -40556 -4077 31056
507 31056 28121 -4248 -36606 -23772 25916 40074 -1505 -34747 -23659 10878 35924 18454
519 18454 -28830 -38580 6215 37139 19156 -16305 -34362 -13279 30763 35628 -11077 -38267
531 -38267 -13694 21577 31432 6837 -31919 -31401 15767 39089 8909 -26855 -28694 -789 32437
544 32437 27032 -19687 -40103 -4373 30790 25209 -5515 -32229 -22514 22253 38783 -115 -33607
557 -33607 -21122 11555 31555 16480 -24858 -35945 5128 36610 17419 -17443 -30674 -10690
569 -10690 27123 32467 -9431 -38286 -13689 22338 28688 4689 -28175 -28851 12992 38363 9506
582 9506 -26562 -25682 1763 29374 24647 -16226 -36886 -4931 30150 23222 -7249 -29522 -19590
595 -19590 19400 35474 468 -32750 -20502 12416 29318 13986 -21874 -33174 3583 34975
607 34975 17479 -17500 -27478 -7800 23622 30015 -6790 -35265 -13033 22045 25907 2223 -25535
620 -25535 -26191 10881 35450 9079 -26289 -24487 2499 26371 21636 -14345 -34425 -5570 29085
633 29085 22689 -8002 -26413 -16609 16697 32917 2171 -31425 -20004 13355 26446 10945
645 10945 -18941 -30121 1532 33151 16095 -18626 -25834 -5444 21285 26649 -5233 -32797
657 -32797 -12941 21554 24810 904 -22718 -21928 8985 31930 10174 -24244 -23438 4448 23902
670 23902 17335 -11785 -30804 -6890 27268 21591 -9477 -24844 -13240 14840 28437 3031
682 3031 -28554 -18805 13452 25339 9122 -17579 -25874 1291 29028 15984 -16342 -24746 -4605
695 -4605 20003 22576 -4627 -28977 -13202 19520 23524 -339 -21449 -19341 7654 28804 10116
708 10116 -22346 -22138 4770 22646 16534 -10801 -27796 -6383 24852 20176 -8592 -23189 -11927
721 -11927 14023 26232 2826 -26400 -17986 12967 23339 7113 -16300 -23513 244 27335
733 27335 15828 -16454 -23306 -2356 18107 20158 -3443 -26723 -12937 19472 22566 -1963 -20159
746 -20159 -16840 6764 26401 9869 -21757 -21290 5769 21374 12612 -10329 -24212 -6463 23111
759 23111 19848 -9562 -22243 -8468 13471 22207 2905 -23450 -17397 12669 22701 4826 -15641
772 -15641 -19583 294 23408 15234 -15119 -22351 -1508 17577 16547 -3978 -23576 -12373 17484
785 17484 21390 -2450 -19454 -14068 7153 22521 8980 -18699 -20459 5722 20924 10353 -9836
798 -9836 -21031 -6063 19880 19069 -8934 -21584 -7222 12245 19344 2928 -20798 -16753 11290
811 11290 21584 3952 -15166 -17270 795 21186 14361 -14114 -21327 -1106 17293 14717 -4199
824 -4199 -20517 -11487 15333 21030 -2066 -19199 -12033 7293 19603 8498 -17197 -19317 5594
837 5594 20253 9191 -9981 -18860 -5417 18581 17801 -7909 -20755 -6428 12757 17240 1997
850 1997 -18864 -15530 10142 20837 3743 -15124 -15301 1069 18880 13290 -12405 -20798 -603
863 -603 17112 13009 -4146 -18202 -10697 13858 19821 -2082 -18716 -10338 7497 17842 7688
876 7688 -15244 -18442 4515 19799 7963 -10594 -16775 -4566 15890 16473 -6856 -20523 -5767
889 -5767 12918 15210 849 -16235 -14687 8791 20212 3560 -15182 -13480 1902 16496 12105
902 12105 -11113 -19883 -875 17015 12230 -5323 -16781 -9345 12355 18726 -1419 -18301 -10300
915 -10300 8132 15939 6334 -13377 -17306 3476 19347 8111 -10767 -15298 -3301 14709 15461
928 15461 -6038 -19429 -6169 13352 14256 61 -15233 -13631 7866 19403 3513 -14887 -12950
941 -12950 2825 15216 11022 -9433 -18423 -1197 16648 11147 -5339 -14891 -8332 10796 17589
954 17589 -996 -17727 -9363 8410 14963 5645 -12034 -16357 2488 18624 7494 -10865 -14356
967 -14356 -2490 13251 14559 -4688 -18387 -6281 13104 13614 -499 -13771 -12136 6613 18050
980 18050 4131 -14903 -12637 3383 14798 9677 -8496 -17495 -2028 15779 11336 -6015 -14675
993 -14675 -6931 9783 16003 75 -17259 -9632 8626 14408 4272 -11237 -14441 2279 17598
1006 17598 8044 -10811 -13885 -1544 12106 13047 -3827 -17343 -6043 12730 13231 -1221 -12567
1019 -12567 -10466 5685 17015 4550 -14166 -11821 4279 13497 8409 -7611 -15580 -2461 14847
1032 14847 11149 -6542 -13479 -5926 8668 14474 740 -15524 -9877 8244 13460 3438 -10446
1045 -10446 -12730 938 15694 8135 -9941 -13476 -877 11278 11281 -2987 -15570 -6454 11368
1058 11368 12734 -1060 -11955 -9949 4693 15416 4806 -12659 -12215 3650 12523 7793 -6483
1071 -6483 -14823 -3281 13736 11304 -5467 -13189 -5326 8255 13570 1399 -14464 -10310 7750
1084 7750 13684 2784 -9456 -12374 663 14568 8781 -9640 -13624 -654 10962 10624 -2681
1097 -2681 -14511 -7340 10993 12883 -1519 -12068 -8516 4629 14206 5136 -12386 -12272 3842
1110 3842 12504 6887 -6538 -13538 -3262 12745 11045 -5478 -13100 -4640 7842 12101 1295
1123 1295 -13104 -9671 7212 13434 2249 -9481 -10852 683 13263 8615 -8725 -13001 -550
1136 -550 10245 9270 -2679 -12930 -6798 9706 12135 -1417 -11066 -7325 4245 12246 5008 -10417
1150 -10417 -11794 3198 12089 5775 -5776 -11472 -3548 11267 10596 -4527 -12398 -4073 7649 10674
1164 10674 1351 -11576 -9630 6154 12839 2426 -8852 -9642 393 11554 8088 -7413 -12279
1177 -12279 -975 10075 8202 -2126 -11389 -6606 8326 12012 -874 -10828 -7257 4017 11301
1190 11301 5138 -9359 -11477 2685 11633 5668 -5669 -10672 -3370 9921 10349 -3932 -11977 -4029
1204 -4029 7140 9637 1538 -10362 -9477 5168 12111 2412 -8700 -8962 734 10200 7790 -6543
1218 -6543 -12181 -1074 9794 7847 -2390 -10314 -6008 7113 11598 -520 -10733 -6332 3894
1231 3894 9978 4864 -8089 -10740 2268 11101 5087 -5530 -9107 -2859 8522 9533 -3403 -11202
1245 -11202 -3907 7032 8680 1097 -8912 -8249 4608 11357 2606 -8101 -7873 674 9116 7224
1259 7224 -5225 -11188 -1349 9296 6757 -2716 -8981 -5537 6198 10735 -129 -10624 -5891 3937
1273 3937 8585 3736 -6965 -9682 1212 10840 5049 -5451 -8559 -1913 7476 8756 -2353 -10810
1287 -10810 -3547 7101 8080 509 -7933 -7537 3568 10952 2553 -8154 -7428 1438 8142 6275 -4458
1302 -4458 -10391 -1075 8759 6748 -2611 -8270 -4643 5240 9985 177 -9264 -5814 4110 8141 3327
1317 3327 -6358 -8693 647 9619 5215 -5594 -7942 -1601 6686 7903 -1745 -9778 -4320 6289
1331 6289 7345 95 -7243 -7010 3060 9590 3234 -7453 -7355 1516 7681 5323 -3820 -9110 -1686
1346 -1686 8257 6232 -2743 -7558 -3986 4869 8736 632 -8799 -5851 4327 7480 2427 -5354 -7997
1361 -7997 257 8909 5075 -5367 -7200 -1125 5902 7096 -1390 -8966 -4124 6492 7550 -341
1375 -341 -6888 -5704 2888 8848 2937 -7084 -6943 1367 7023 4529 -3240 -8351 -1948 7602 6501
1390 6501 -2834 -7314 -3434 4506 7783 841 -8109 -5553 4101 7355 1644 -4787 -6825 298 8301
1405 8301 4853 -5270 -7323 -631 5864 5954 -1410 -7953 -3812 5897 7192 -546 -6562 -4804 1945
1420 1945 7920 2773 -6463 -6714 1651 6609 4179 -3101 -7626 -2283 6950 6033 -2539 -6787 -2733
1435 -2733 3965 7307 982 -7157 -5764 3703 7231 1791 -5035 -6553 -30 7459 4863 -4722 -7127
1450 -7127 -778 5549 5693 -949 -7455 -3950 5541 7028 -474 -6144 -4528 1742 7090 2833 -5790
1465 -5790 -6202 1793 6634 3590 -2859 -6690 -2004 6142 6172 -2389 -7151 -2787 4000 6170 874 -6647
1481 -6647 -5670 3116 7267 1417 -5122 -5756 -53 6712 4945 -4100 -6898 -672 5426 5013 -1192 -6533
1497 -6533 -3867 4896 7054 -343 -6038 -4339 2200 6503 2987 -5260 -6583 1223 6698 3340 -3279
1512 -3279 -6141 -1884 5427 6133 -1988 -6808 -2721 4189 5997 971 -6302 -5553 3068 7201 1901
1527 1901 -5010 -5380 -104 5953 4829 -3497 -6851 -664 5348 4528 -1208 -6129 -3815 3845 6773
1542 6773 126 -6074 -4260 1991 6118 3058 -4297 -6136 967 6327 3519 -3123 -5767 -1788 5037
1557 5037 6063 -1719 -6585 -2244 3791 5337 1276 -5389 -5233 2145 6553 2030 -4653 -4878 84
1572 84 5437 4512 -2437 -6789 -1207 5277 4520 -1084 -5433 -3654 3689 6667 360 -5842 -4185 2215
1588 2215 5605 2655 -4030 -6299 425 5944 3497 -2839 -5195 -2089 4670 5735 -1168 -6352 -2684
1603 -2684 3695 5167 793 -4876 -5164 1819 6493 1998 -4340 -5277 71 4981 4336 -2677 -6305 -1658
1619 -1658 4943 4385 -1099 -4936 -3355 3200 6307 493 -5407 -4124 1947 4836 2896 -3869 -5803
1634 -5803 -137 5769 3427 -2773 -5333 -1845 3786 5145 -620 -5969 -2697 3683 5180 956 -4202
1649 -4202 -4903 1211 5946 2501 -4140 -4798 -131 4433 3919 -1849 -5853 -1692 4454 4601 -1261 -4647
1665 -4647 -3133 2592 5700 768 -5091 -3970 1828 4777 2494 -3230 -5513 -594 5474 3843 -2539
1680 -2539 -4942 -1780 3801 4746 176 -5715 -2960 3154 4667 703 -3888 -4414 588 5769 2658
1695 2658 -3878 -4852 33 4213 3726 -1414 -5174 -2002 4216 4319 -529 -4372 -2908 2176 5245 1303
1711 1303 -4648 -4180 1492 4644 2486 -2695 -5026 -948 4526 3930 -2370 -4253 -1584 3130 4226
1726 4226 74 -4915 -3092 2804 4582 1171 -3543 -4195 417 4842 2791 -3217 -4648 103 3990
1741 3990 3351 -1152 -5078 -2289 3681 4299 -685 -4220 -2781 1898 4637 1627 -3954 -4264 1406 4431
1757 4431 2439 -2517 -4382 -1128 4238 3795 -1697 -4815 -1576 2767 4111 309 -4452 -3242 2513
1772 2513 4648 587 -3244 -3703 200 4297 3119 -2582 -4181 -317 3753 3240 -998 -4236 -2438
1787 -2438 3478 4407 -405 -3662 -2832 1476 4245 1695 -3487 -4006 1157 4235 1924 -2241 -3791 -1240
1803 -1240 3800 3643 -1815 -4228 -1360 2709 3421 205 -3877 -3032 2214 4471 623 -3309 -3282 -60
1819 -60 3573 2748 -2896 -4375 -244 3301 2956 -744 -3744 -2272 2560 3899 -225 -4105 -2265 1560
1835 1560 3603 1745 -2997 -3663 486 4149 2188 -2144 -3286 -1064 3223 3463 -1361 -4153 -1298
1850 -1298 2551 3260 386 -3201 -3083 1690 4256 1036 -2955 -2897 133 3230 2615 -2086 -4213 -810
1866 -810 3223 2530 -846 -3467 -2033 2322 3839 137 -3804 -2318 1443 3263 1472 -2717 -3521 575
1882 575 3838 1752 -1683 -3047 -771 2776 3175 -791 -4019 -1488 2367 2992 330 -2873 -2845 1255
1898 1255 4101 941 -2924 -2938 201 3158 2312 -1534 -3658 -595 3314 2859 -878 -3192 -1564 2248
1914 2248 3686 254 -3569 -2343 1485 3168 1061 -2109 -3469 248 3504 1738 -1808 -3338 -572
1929 -572 2498 3164 -1007 -3591 -1717 2538 2967 114 -2641 -2886 1012 3629 1024 -2844 -2823 288
1945 288 2804 2581 -1378 -3627 -729 3331 2798 -734 -2997 -1849 1471 3358 129 -3514 -2385 1542
1961 1542 3060 1212 -2355 -2957 445 3345 1740 -1954 -2724 -795 2795 2859 -594 -3574 -1697 2412
1977 2412 3020 104 -2809 -2662 888 3922 1461 -2687 -2884 576 2765 2118 -1209 -3139 -729 2585
1993 2585 2678 -994 -3107 -1671 1684 3313 505 -3071 -2490 1387 3134 1048 -1835 -3171 -55 3051
2009 3051 2190 -2117 -3223 -476 2420 2964 -640 -3534 -1859 2166 3155 114 -2733 -2242 675 3044
2025 3044 1479 -2438 -2871 610 3168 2132 -1157 -3103 -1044 2889 2518 -948 -3128 -1529 1513
2040 1513 3232 738 -2802 -2551 1127 3141 1088 -2011 -2851 -22 3291 2659 -1803 -3078 -526 2433
2056 2433 2610 -137 -3176 -2061 2304 3381 12 -2694 -2500 608 3541 1803 -2550 -3013 252 3080
2072 3080 2051 -1227 -3403 -1100 2558 2714 -868 -2974 -1639 1378 3126 873 -3020 -2753 1123
2087 1123 3023 1052 -2096 -2872 -295 3136 2089 -1444 -2827 -437 2248 2468 -466 -2704 -2170 1859
2103 1859 3337 638 -2826 -2220 508 3155 1680 -2246 -2904 109 2757 1863 -958 -3044 -1087 2586
2119 2586 2553 -332 -2928 -1782 1365 2963 751 -2496 -2692 862 3274 1123 -1759 -2681 -180 3218
2135 3218 2418 -1084 -3200 -791 2228 2855 -47 -2911 -2132 1682 3313 446 -2586 -2308 384 2929
2151 2929 1528 -2066 -2956 -192 2757 1951 -1147 -2557 -1391 2400 3043 -144 -2653 -1502 1010 2646
2167 2646 805 -2393 -2641 764 3222 1390 -1644 -2795 -586 2574 2665 -1162 -2973 -1192 1958 2456
2183 2456 47 -2554 -2227 1433 3128 613 -2419 -2409 497 2679 1554 -1710 -3167 -333 2789 1981
2199 1981 -1107 -2627 -1014 1855 2758 -200 -2820 -1823 1290 2956 913 -2071 -2849 464 2823 1550
2215 1550 -1998 -2633 -540 2500 2302 -686 -2804 -1098 2089 2381 238 -2678 -2113 880 3381 694
2231 694 -2217 -2275 448 2544 1680 -1383 -2871 -512 2383 2095 -676 -2665 -1393 1715 2540 -67
2247 -67 -2607 -2082 1159 2687 1136 -1975 -2363 -84 2752 1354 -1478 -2484 -672 2008 2192 -684
2263 -684 -2913 -1312 1521 2520 49 -2234 -2071 1112 2713 887 -2266 -2236 161 2523 1609 -1404
2279 -1404 -2934 -546 2327 1848 -651 -2825 -1110 1353 2505 173 -2428 -1750 958 2761 853
2294 853 -1824 -2116 236 2815 1645 -1552 -2719 -495 2004 2286 -201 -2616 -1342 1752 2304 -150
2310 -150 -2409 -1910 983 2772 1243 -2000 -2297 338 2569 1904 -1185 -2483 -628 2357 2101 -528
2326 -528 -2510 -834 1366 2191 457 -2536 -1760 930 2544 841 -1614 -2183 -50 2529 1624 -1382
2342 -1382 -2559 -396 1803 2112 -396 -2408 -1443 1638 2710 -91 -1932 -1592 587 2619 819 -2145
2358 -2145 -2339 311 2467 1836 -1303 -2585 -782 1886 2253 -663 -2215 -806 1516 2235 325 -2222
2374 -2222 -1814 1134 2312 657 -1513 -2121 27 2207 1717 -1319 -2351 -320 2075 1535 -478 -2316
2390 -2316 -1277 1470 2363 112 -2235 -1750 919 2603 1056 -1603 -1995 509 2333 1461 -910 -2159
2406 -2159 -966 1893 2010 -629 -2251 -1172 1266 2086 640 -1941 -2155 919 2481 663 -1481 -1840
2422 -1840 -7 2428 1652 -1162 -2389 -290 1831 1982 -360 -2300 -1188 1560 2262 -183 -2266 -1506
2438 -1506 636 2112 677 -1628 -2261 544 2236 1269 -1090 -2175 -535 1791 2282 -520 -2209 -1018
2454 -1018 1491 2040 152 -1909 -1821 700 2334 486 -1741 -1766 396 1857 1468 -1178 -2130 -537 2063
2471 2063 1983 -193 -2144 -880 1250 2536 189 -2181 -1513 984 2128 912 -1480 -1921 57 2295
2487 2295 1211 -1241 -2138 -392 1711 2066 -646 -2376 -1220 1095 2207 278 -1905 -1483 566 2126
2503 2126 742 -2016 -2061 13 1932 1461 -1198 -2515 -477 2074 1834 -538 -1987 -1319 1489 2283
2519 2283 149 -2240 -1629 664 2066 1183 -1696 -1847 95 1980 1305 -1010 -2207 -365 1712 1783
2535 1783 -520 -2403 -1055 1181 2315 364 -2054 -1897 404 2341 712 -1510 -1950 66 2132
2550 2132 1685 -816 -2106 -465 2001 1628 -246 -1862 -838 1337 1996 383 -1991 -1605 952 2295
2566 2295 877 -1556 -2113 260 2302 1627 -1379 -2192 -345 1641 1859 -249 -2559 -1142 1558 1887
2582 1887 159 -1551 -1734 546 2590 830 -1634 -1920 521 2141 1326 -1014 -2442 -497 1754 1747
2598 1747 -572 -1863 -1282 1112 2110 32 -2059 -1804 1087 1988 793 -1172 -2472 -231 1851 1561
2614 1561 -1506 -1988 -761 1606 1728 -221 -2148 -1269 1262 1995 258 -1730 -1694 709 2236 1100
2630 1100 -1482 -1716 -9 1964 1382 -805 -2040 -446 1753 1794 -329 -1972 -1149 1159 2043 394
2646 394 -1925 -1811 884 2327 844 -1456 -2031 -141 1722 1449 -1166 -2052 -689 1602 1866 -330
2662 -330 -2038 -1382 1161 2249 174 -2047 -1674 525 2159 947 -1632 -2150 39 2075 1382 -801
2678 -801 -2266 -779 1709 1746 -505 -2091 -1159 980 2062 423 -1746 -1772 483 2129 982 -1302
2694 -1302 -1675 -227 2029 1332 -1427 -2143 -483 1639 1566 -219 -2037 -1447 1102 2079 222 -1650 -1550
2711 -1550 467 1937 953 -1472 -2146 217 2127 1340 -567 -2007 -754 1853 1829 -93 -1858 -1266
2727 -1266 1139 1969 732 -1732 -1730 614 2264 978 -1121 -1931 -131 2027 1589 -847 -2085 -536
2743 -536 1384 1661 -116 -1949 -1185 1125 2082 224 -1721 -1573 258 2051 936 -1321 -1860 -48
2759 -48 1899 1281 -783 -1819 -495 1336 1943 -257 -2022 -1364 1308 1818 420 -1695 -1385 689 2152
2776 2152 1206 -1364 -1817 49 1706 1466 -595 -2239 -762 1611 1538 -346 -2070 -1323 904 2068
2792 2068 176 -1736 -1458 301 1882 1036 -1144 -1967 -144 1780 1232 -726 -1819 -837 1447 1790
2808 1790 -56 -1993 -1113 732 1693 312 -1436 -1513 389 2158 851 -1485 -1657 285 1933 1393
2824 1393 -688 -1783 -651 1351 1577 -330 -1874 -1299 1333 2127 658 -1547 -1414 669 1870 915
2840 915 -1370 -1964 120 1760 1176 -787 -1911 -639 1313 1404 -249 -2167 -1162 1234 1706 527
2856 527 -1843 -1524 517 1788 817 -1118 -1791 -197 1843 1293 -691 -1491 -336 1272 1685 -199 -1781
2873 -1781 -921 918 1798 534 -1430 -1461 129 2040 954 -906 -1663 -137 1780 1090 -810 -1468 -684
2890 -684 1479 1811 31 -1934 -1027 819 1592 394 -967 -1287 472 1824 813 -1210 -1749 161
2906 161 1493 1351 -712 -1937 -219 1458 1575 -390 -1727 -955 1132 1850 421 -1297 -1338 668 1875
2923 1875 792 -1151 -1434 -79 1538 1639 -788 -1691 -371 1424 1637 -356 -1604 -760 790 1874
2939 1874 179 -1358 -1278 555 1683 1105 -1414 -1420 157 1457 1230 -667 -1862 -615 1394 1281 -403
2956 -403 -1550 -757 782 1626 211 -1398 -1424 475 1665 1079 -1275 -1319 -60 1570 929 -1086 -1675
2973 -1675 -831 1498 1537 -244 -1780 -956 832 1419 -173 -1430 -1276 551 1800 663 -1255 -1426 163
2990 163 1701 1161 -537 -1766 -540 1491 1286 -233 -1479 -951 908 1728 258 -1318 -1540 537
3006 537 1710 383 -1066 -1421 -28 1413 743 -850 -1564 -324 985 1288 -381 -1524 -850 1240
3022 1240 1734 98 -1469 -1207 427 2107 791 -1212 -1638 220 1675 1134 -687 -1688 -376 1461
3038 1461 1539 -221 -1389 -906 1040 1648 424 -1334 -1229 853 1950 604 -958 -1513 -3 1591
3054 1591 992 -1079 -1881 -243 1157 1141 -71 -1656 -684 1318 1415 226 -1195 -964 682 1788 952
3071 952 -1315 -1594 156 1354 608 -583 -1662 -518 1057 1435 -100 -1625 -1022 764 1532 407
3087 407 -1527 -1115 578 1657 491 -1119 -1366 -64 1715 1358 -749 -1485 -403 1226 1383 -320
3103 -320 -1787 -1084 758 1382 -104 -1487 -1259 364 1485 677 -1332 -1472 316 1543 1240 -689 -1216
3120 -1216 -440 1472 1544 57 -1775 -701 1137 1376 435 -1350 -1269 643 1674 538 -1074 -1512 38
3137 38 1532 1249 -898 -1894 -397 1526 1402 -737 -1432 -573 839 1388 347 -1531 -673 597 1878
3154 1878 658 -1079 -1438 -190 1582 698 -707 -1656 -789 1225 1433 -327 -1624 -760 1070 1480 459
3171 459 -1698 -1452 551 1565 812 -1018 -1407 183 1432 944 -463 -1851 -353 1522 1364 -243
3187 -243 -1610 -919 699 1566 239 -1482 -1162 661 1554 898 -957 -1436 -124 1545 1086 -190 -1416
3204 -1416 -411 1468 1351 -457 -1396 -990 824 1146 256 -1059 -1127 476 1506 589 -840 -1374 246
3221 246 1099 912 -625 -1542 -472 1085 1125 -127 -1531 -759 985 1673 -186 -1401 -1382 345 1513
3238 1513 705 -887 -1652 138 1197 1017 -720 -1704 -235 1165 807 -90 -1631 -714 1028 1450 18
3255 18 -1278 -1042 16 1676 771 -1117 -1459 -99 1461 1176 -611 -1365 -343 1035 1222 -304 -1281
3272 -1281 -622 717 1548 317 -1530 -1087 426 1524 403 -1043 -1202 72 1413 903 -917 -1612
3288 -1612 -312 983 1141 -157 -1435 -624 799 1296 175 -981 -1057 467 1467 630 -1011 -1214 125
3305 125 1243 1080 -458 -1681 -389 1090 1261 24 -1382 -581 599 1499 162 -1135 -1169 531 1373
3322 1373 566 -1044 -1165 -43 1521 1136 -434 -1353 -330 1123 1529 -147 -1484 -557 746 1700 175
3339 175 -943 -1181 340 1561 656 -1059 -1167 -180 948 934 -640 -1700 -314 975 1334 -295 -1481
3356 -1481 -633 350 1335 196 -1309 -1037 331 1065 781 -974 -1143 -6 1377 905 -680 -1436 -110
3373 -110 828 1158 -117 -1342 -653 858 1511 -50 -1038 -913 427 1118 688 -790 -1278 -88 1585
3390 1585 661 -279 -1330 -552 673 1072 27 -1117 -587 868 1374 -27 -1040 -1098 303 1353 300
3407 300 -730 -1088 202 1347 809 -860 -1108 -224 1054 1115 -138 -1305 -776 642 1372 -21 -1257
3424 -1257 -817 -20 1260 643 -624 -1180 -271 1095 737 -238 -1167 -357 1292 1054 -269 -1065 -843 382
3442 382 1075 84 -1033 -902 -76 1228 647 -1106 -1000 -163 1145 631 -590 -1271 -394 948 940 -117
3460 -117 -1217 -776 814 969 -22 -902 -1042 312 1442 730 -858 -1049 13 1348 354 -121 -1368
3477 -1368 -599 1085 1101 -188 -1165 -541 696 1040 -194 -1051 -1064 605 1084 228 -913 -1114 218 821
3495 821 652 -712 -1214 -284 1078 661 -270 -963 -376 668 1151 -125 -790 -668 334 1056 369 -800
3513 -800 -811 186 1133 554 -588 -1342 -504 929 810 -444 -1246 -730 675 768 49 -794 -899 241 974
3532 974 174 -674 -819 -130 671 720 -396 -1140 -366 866 944 -396 -1024 -724 556 1149 -128 -1182 -859
3551 -859 270 1157 214 -820 -1196 321 1007 856 -680 -560 -139 888 603 75 -832 -515 665 943
3569 943 -51 -1006 -942 108 1336 510 -1097 -1173 1 1140 681 -556 -881 -329 940 918 -225 -934
3587 -934 -508 715 619 124 -774 -553 488 1069 573 -811 -1065 -113 896 935 -439 -1054 -38 702 855
3606 855 -234 -1079 -592 354 1173 -78 -948 -872 533 885 382 -792 -615 120 714 522 -624 -958 -400
3625 -400 941 950 -92 -875 -403 527 990 -63 -1006 -961 833 1143 301 -636 -937 1 1183 547 -534
3644 -534 -1409 -414 1038 580 -424 -1148 -737 660 821 -234 -756 -454 307 820 291 -805 -955 38
3662 38 1043 537 -373 -889 -242 480 792 -133 -962 -493 691 1113 71 -893 -845 475 767 254 -820
3681 -820 -1297 21 815 499 -301 -955 -389 850 931 36 -1145 -574 498 837 -105 -921 -709 328 1104
3700 1104 603 -663 -801 105 884 723 -404 -695 -525 756 814 -146 -699 -260 577 764 109 -840 -658
3719 -658 458 976 332 -477 -667 -140 800 607 -376 -1060 -96 708 999 -349 -951 -503 812 962 -136
3738 -136 -757 -843 633 902 350 -686 -711 31 984 616 -383 -549 -153 717 606 -10 -820 -551 575 1065
3758 1065 -87 -702 -550 606 840 222 -560 -886 194 1048 386 -557 -780 -104 791 714 -136 -741 -253
3777 -253 485 860 136 -650 -653 40 510 281 -648 -674 142 706 430 -233 -746 81 932 640 -53 -786 -630
3798 -630 786 857 344 -1048 -538 287 1057 162 -848 -548 181 997 536 -201 -945 -147 518 710 -489
3817 -489 -789 -610 914 871 -162 -752 -508 286 508 324 -948 -1032 26 824 490 -452 -920 -195 804
3836 804 656 -330 -736 -741 307 723 309 -713 -446 47 907 361 -715 -576 -111 769 552 -378 -605 -196
3856 -196 720 608 -29 -877 -675 618 933 -114 -765 -413 38 874 195 -585 -943 -36 1073 410 -328
3875 -328 -943 -244 594 657 -74 -693 -423 457 960 149 -762 -482 121 837 132 -602 -614 -138 717 809 -313
3896 -313 -910 -66 550 661 -47 -902 -218 321 800 -42 -912 -533 446 720 303 -658 -714 -168 529 593 -325
3917 -325 -795 -326 644 876 -347 -867 -223 483 599 -149 -568 -726 263 632 228 -698 -406 171 740 374
3937 374 -524 -792 -82 644 355 -71 -740 -334 165 727 236 -515 -391 136 796 111 -314 -657 250 466
3957 466 263 -198 -593 119 567 605 207 -622 -288 421 450 130 -417 -307 270 835 127 -514 -373 172 687
3978 687 152 -325 -648 -261 488 733 -68 -452 -458 803 821 36 -559 -565 477 938 377 -354 -616 330 890
3999 890 144 -420 -615 -413 433 460 6 -677 -306 477 735 -24 -534 -431 535 683 350 -872 -469 56
4019 56 426 437 -565 -448 -275 857 517 -235 -576 -518 374 623 108 -494 -523 540 515 483 -494 -733 81
4040 81 746 501 -101 -554 64 524 516 77 -446 -626 665 870 69 -389 -240 524 426 353 -480 -675 -165
4061 -165 898 331 -428 -714 -112 505 730 11 -590 -246 290 372 320 -423 -358 100 458 218 -386 -641 89
4082 89 513 436 -371 -479 -228 580 436 -204 -415 -324 674 556 167 -645 -442 354 665 525 -506 -736 42
4103 42 690 69 -603 -601 -195 608 234 -30 -593 -364 640 689 18 -284 -681 206 660 438 -418 -568 94
4124 94 293 665 -349 -676 -197 279 436 63 -612 -155 461 536 216 -406 -294 219 600 312 -507 -484 84
4145 84 386 608 -479 -296 -267 99 520 -188 -249 -37 119 383 -180 -577 -782 62 692 0 -496 -579 90
4166 90 449 625 -251 -509 164 894 551 -173 -1029 -238 318 475 -179 -549 -472 304 405 191 -466 -674 -52
4187 -52 559 463 -332 -499 -222 224 571 -168 -466 -102 412 552 -105 -541 -322 322 536 -32 -234 -515 306
4208 306 505 202 -80 -611 166 556 585 -217 -371 -283 307 576 190 -808 -137 39 336 268 -154 -679 43
4229 43 369 217 -325 -534 -349 462 494 -29 -398 -542 198 497 334 -647 -271 444 700 -90 -56 -318 -125
4250 -125 403 493 -273 -598 -76 300 409 -84 -395 -222 200 449 -254 -513 -180 499 353 199 -386 -656
4270 -656 205 253 323 -545 -614 -349 513 404 -195 -442 -337 247 634 -152 -194 -152 180 515 -206 -532 -253 314
4292 314 553 266 -231 -498 -140 511 550 -229 -325 -295 -124 510 149 -230 -381 429 472 154 -465 -384 62 243
4314 243 442 62 -202 94 349 223 -121 -460 -534 300 221 -53 -442 -695 100 -199 365 -229 -587 205 534
4335 534 293 -11 -541 -65 327 604 -27 -447 -427 389 657 258 -565 -236 184 567 -267 -587 -262 -98
4355 -98 364 315 -163 -503 -32 245 550 -176 -567 -455 377 148 -28 -469 -314 -155 618 463 -381 -655 -286
4376 -286 399 279 19 -147 -365 448 235 -94 -394 -179 352 670 -162 -241 -384 -332 549 160 -452 -223 249
4397 249 619 228 -111 -591 -163 191 478 -147 -432 -245 109 506 99 -230 -222 19 260 81 -77 -520 -115
4418 -115 265 468 -379 -385 -187 198 578 -8 -303 -232 356 72 -249 -387 -328 132 -2 128 -490 -428 235 156
4440 156 350 -217 -318 -84 373 197 -326 -463 -334 268 192 168 -415 -172 114 646 286 -334 -289 -77 201
4461 201 6 -146 -382 -324 164 439 -31 -200 -119 170 217 189 121 -111 -86 787 261 -502 -240 55 625 -149
4483 -149 -421 -352 14 340 465 -7 -172 -364 334 466 164 -343 -162 27 305 -19 -205 -281 32 551 423
4504 423 -351 -464 91 489 41 -181 -538 -415 137 39 169 -301 -345 -104 210 114 -41 -248 -10 372 283
4525 283 -344 -394 -187 351 417 139 -307 103 17 393 -74 -533 -29 76 286 399 -194 -332 -101 281 294
4546 294 -312 -546 -129 236 282 34 18 -154 177 487 9 -468 -208 27 341 19 -374 -340 229 386 77
4567 77 18 -51 130 217 -55 -324 -248 -142 7 416 -56 -310 -487 158 70 211 -13 -381 13 546 277 -163
4589 -163 83 -96 188 409 63 -319 -134 167 680 167 -643 -17 107 288 215 -145 -385 -181 168 199 81
4610 81 -269 -22 390 322 -117 -48 -13 135 283 -96 -132 -261 106 28 108 -71 -252 -169 378 250 -356 37 -216
4633 -216 -105 205 -187 -243 -269 195 39 387 -422 -60 -16 494 377 -550 -321 203 426 456 -138 -320 -54
4654 -54 363 -110 -207 -433 -89 207 405 135 -247 -172 296 104 152 -252 -365 -71 288 43 -220 -287 -158 307
4676 307 127 -401 -84 -69 138 316 -138 -308 -345 112 529 62 -255 -61 -129 209 344 70 -392 -461 56
4697 56 320 -60 78 -215 70 348 158 -329 -414 60 113 188 -273 -231 -109 300 354 -325 -293 -258 531 372 -59
4720 -59 -328 -133 385 242 247 -97 -274 190 105 118 -353 -246 72 251 128 -134 -364 -296 280 607 -215 -230
4742 -230 -292 456 179 -117 -127 64 257 136 351 -176 -343 54 163 294 -87 -121 -235 23 450 -1 -304
4763 -304 -9 -57 129 256 -301 -38 -39 2 176 17 -137 -51 184 219 -213 -339 93 -31 496 -249 -407 -261
4785 -261 317 555 176 -257 -217 209 230 194 -183 -179 129 67 19 -126 -421 65 90 218 -81 -289 141 197 370
4808 370 9 -270 -195 121 147 399 -313 -660 248 276 249 31 -26 -110 497 -38 -125 -176 -257 169 372 -35 -528
4831 -528 -11 180 224 428 -66 -148 70 12 197 75 -588 165 394 247 40 -698 -546 559 431 118 -353
4852 -353 -277 -70 218 198 -25 34 133 198 50 -81 -134 172 183 251 -142 -476 -125 54 245 -26 -146 -530 179
4875 179 441 241 -12 -310 67 388 247 -8 -190 -435 256 71 -112 -339 -46 -33 -22 -41 -175 42 6
4896 6 -30 213 18 -51 -223 402 136 -371 -537 38 33 406 -318 -432 188 256 444 341 94 -357 -429 29 44
4919 44 -247 -202 -521 111 510 -276 -203 -212 34 144 -29 -314 -125 306 -52 -17 -125 -299 106 -55 7 -135
4941 -135 -343 32 112 -16 -110 -118 -137 -3 501 44 88 -465 -53 254 11 -259 -389 130 145 168 -141 -104 30
4964 30 184 313 -174 -309 -145 34 224 -159 -340 -156 158 80 139 -161 -137 118 -37 -163 -171 -123 73 353
4986 353 395 -106 -185 -174 81 187 -50 -51 -332 152 55 -43 -218 -149 180 341 106 -427 -105 59 70 74 -248 60
5010 60 -157 20 255 279 -548 92 145 210 405 -237 -241 26 349 58 53 -110 2 224 302 -20 -166 40 265
5033 265 55 -9 -296 -229 68 130 2 -168 -48 71 44 282 -261 -330 -19 186 294 -229 -416 -35 121 457
5055 457 57 -109 -225 -102 160 207 -398 -90 70 172 137 -332 -17 -131 214 188 152 -355 -131 488 267
5076 267 160 -252 -179 22 407 112 -174 -68 50 68 400 105 -39 -195 -158 131 173 -277 78 271 197 243
5098 243 -202 24 32 25 120 -213 -389 -96 193 166 -175 -209 -188 345 10 -144 -156 -240 -15 41 157 -337 -87 15
5122 15 11 -87 -141 -95 -148 340 113 -124 -458 -420 451 345 -103 -349 -221 73 63 -43 -139 -226 51 209 -68 -367
5146 -367 -409 -162 261 321 -163 106 -29 87 -191 -100 -389 -462 -34 14 213 -94 -28 192 287 -8 -358 -304 76
5169 76 185 115 142 -176 -52 38 439 -109 -217 45 227 242 257 -136 -289 110 247 -129 -457 -253 -185 267
5191 267 -21 -212 -329 -151 25 301 -32 -39 -43 167 132 141 -190 -476 50 127 83 -474 -273 -21 331 -55 -172
5214 -172 -253 -107 71 129 7 -177 -37 -30 -20 -163 -335 79 53 190 528 -205 -193 149 167 106 51 -151 51
5237 51 23 292 55 -134 -73 99 576 -280 -413 -215 -207 317 55 -48 -70 -140 107 173 -158 -183 -159 291 -11
5260 -11 -94 -114 -314 193 398 -98 -315 21 -129 314 12 -144 -193 70 302 268 -128 24 -142 -102 72 -235
5282 -235 -178 -155 268 8 -135 -337 -408 -44 34 291 -65 33 37 458 312 -250 -105 -30 -41 0 7 -221 -67 -143
5306 -143 92 97 134 -78 187 441 -98 -132 -296 91 138 184 -44 -145 -231 -108 380 -241 -41 -156 187 479
5328 479 -172 -136 -157 -56 153 58 -58 -6 -13 -13 331 -263 -128 -146 349 463 -212 -29 -319 -4 -33 100 -3
5351 -3 -150 -162 49 219 -73 -78 -136 -143 264 -197 -546 -57 83 141 -247 -207 16 -4 127 176 -415 19 26 39 347
5376 347 -25 -320 -283 269 224 -2 -210 -147 236 165 149 -307 -83 53 352 110 -262 -471 116 65 176 46
5398 46 -155 -155 378 203 45 -211 318 246 57 172 -491 -98 -186 419 -202 39 -291 67 26 130 -100 -371
5420 -371 75 162 -24 128 -228 -55 230 168 -39 -153 52 306 306 126 184 -58 152 278 8 272 -113 241
5442 241 331 304 110 -339 -302 -142 642 -38 170 109 35 123 -5 73 -111 201 117 169 -372 34 -174 290 -71
5465 -71 128 -154 209 -262 123 -318 -329 -269 63 222 -12 49 -145 -113 385 186 70 -50 -199 255 63 195
5487 195 -243 13 484 37 124 -39 -362 309 42 -63 195 -135 -41 117 1 -476 -304 5 -35 317 -296
5508 -296 -187 -135 178 -231 323 -313 -81 21 145 -45 -55 -249 -349 278 -98 -225 -27 112 127 184 -131
5529 -131 60 87 -44 -8 31 -90 -174 19 108 121 -162 -324 -21 450 -90 -182 -324 -39 129 99 -19 -274 -132
5552 -132 252 376 200 -162 -118 96 362 143 10 294 -132 245 102 -61 -122 101 196 191 93 -86 -117 106
5574 106 -48 348 -361 -60 439 203 2 -176 -140 157 236 225 -82 -424 -93 399 277 -189 1 -366 337
5595 337 -130 -57 -374 -177 -69 295 47 15 -164 -117 153 -72 31 -306 130 -204 307 -39 24 4 12 342
5617 342 -221 -32 -196 144 142 -86 -188 35 -113 43 225 -174 -365 225 46 168 5 -208 -185 247 339
5638 339 -119 -86 118 352 32 -21 -464 -65 -83 18 -112 63 -174 -158 -9 116 -106 -161 -156 138 126 67 -139
5661 -139 -435 -87 253 329 -37 -172 -129 392 109 -43 -179 -286 269 -17 -217 -144 -71 -70 104 106 64 -100 304
5684 304 101 311 -45 -133 244 172 76 -98 -123 -7 222 -332 23 -180 -291 219 49 136 -239 1 -88 265
5706 265 -173 -108 -119 -96 -31 90 -12 -142 14 293 160 -3 -186 -84 31 257 -187 -194 55 88 449 -386
5728 -386 -290 7 167 176 225 -147 -274 -116 199 97 78 -268 -322 335 149 -71 68 -22 72 331 201 -272 -205
5751 -205 151 210 -111 -158 -12 -16 278 77 -114 -137 21 32 127 20 -142 23 -378 70 100 -1 106 -71 28
5774 28 -64 254 -218 78 459 50 50 -254 -218 75 -116 5 93 -336 -92 241 -42 -221 -270 98 510 2
5796 2 34 -256 -120 -26 -44 -3 -312 21 139 313 64 -64 -119 71 6 39 -282 -333 -84 193 293 -327 -324 -4
5820 -4 79 313 -19 -123 -166 331 175 -16 -78 -90 46 49 104 -152 33 153 118 56 -310 -174 245 -161 -114 -209
5844 -209 -119 92 282 263 70 -330 -12 201 78 155 -205 -299 284 420 4 -155 -310 265 294 -231 -185 -45
5866 -45 157 338 176 -38 -210 -47 -106 210 206 -375 -164 -128 37 126 -227 -554 -143 263 124 -83 -229 -332
5888 -332 128 16 184 -6 -257 -240 183 115 -474 -33 240 324 -1 83 -167 -136 -173 -25 40 -199 143 381
5910 381 126 208 -19 17 149 -181 -126 64 -451 -89 63 -12 -127 -343 -223 228 355 -114 -342 -156 114
5931 114 355 -10 -179 -332 83 264 -29 -114 -204 -115 -32 123 -227 -129 -95 135 142 -359 -39 -80 242 505 23
5954 23 -289 -177 -80 245 133 -272 -164 96 440 -3 -293 -34 -48 108 139 -265 -22 -144 101 64 -227 -109
5976 -109 -153 146 247 -82 -242 -262 62 133 320 53 -273 102 437 332 102 -198 174 138 331 -201 -421
5997 -421 -220 305 147 58 -136 104 -302 -26 87 -58 -37 -293 313 130 7 80 -363 140 -300 34 -32
6018 -32 151 225 12 131 -170 -174 17 195 32 219 -329 -54 202 41 2 -180 105 -66 292 -34 -291 -110
6040 -110 230 339 -149 194 -76 237 -17 155 99 -276 -300 123 203 31 -183 -324 133 -181 212 -115 91
6061 91 50 53 172 -123 -44 136 -73 -43 -115 -358 1 164 17 -214 -32 -30 327 42 274 -179 -154 104 27 58
6085 58 0 -336 -104 235 158 -218 -246 -102 269 -65 -345 131 -335 -163 43 -227 -193 -57 369 324 167 -35
6107 -35 -212 -12 -69 -11 -68 -275 178 249 -111 -105 -35 -4 276 13 -54 83 -152 72 27 151 -242 -70 -53 197
6131 197 -35 -156 -315 -117 228 -161 119 -100 -20 156 105 -231 -230 -402 250 129 -107 -68 -124 -14 255 -98
6153 -98 -318 289 -335 170 219 -47 218 -258 301 184 -218 -192 44 198 446 180 -267 -235 -23 -181 -4
6174 -4 -395 -122 -253 321 87 1 -128 66 121 4 38 -484 118 121 3 217 -235 -362 229 228 71 -106 -314
6197 -314 114 27 93 -123 -380 -298 28 200 -323 -105 -175 -217 145 50 -148 -241 132 313 136 -263 -266 298 354
6220 354 -12 -301 -55 -259 133 147 -35 178 138 202 134 200 -236 68 233 -81 99 -108 -293 35 553 -74
6242 -74 9 189 -400 122 123 -183 -100 -275 -11 -17 60 -388 -516 49 131 10 212 25 224 74 -106 258 118
6265 118 102 182 27 -148 -150 -211 309 200 -83 -515 188 -265 409 171 -209 -9 -341 50 292 16 -60 -121
6287 -121 400 -62 -273 67 1 72 148 110 -539 -224 89 -96 -80 -187 -105 167 207 350 -40 106 -72 -21 140
6310 140 232 -231 -104 -176 14 42 -130 -104 128 316 58 -185 -186 -130 241 124 142 193 -73 422 -237 153 -92
6333 -92 55 179 85 348 -50 -145 254 459 236 184 -421 -28 262 -84 -329 -152 -210 -3 496 -131 -156 -211
6355 -211 364 112 168 -1 -71 -174 -180 -137 -256 -275 68 262 -115 -245 -1 117 194 -220 -13 -53 123 75 275
6378 275 24 -171 -120 -46 169 220 -17 -45 85 -34 328 -197 -229 250 152 79 -120 -273 -111 -61 334 -13 130
6401 130 -36 -23 148 122 -212 -70 -116 321 127 -28 -95 -174 496 143 -4 -346 17 205 164 67 -207 -98
6423 -98 59 7 49 -43 -180 -4 258 374 6 -141 57 379 211 -85 -284 82 -206 -22 -71 -324 270 -237
6445 -237 195 -8 -162 -265 -48 99 249 -96 -163 92 -81 16 -188 -177 -312 346 -53 -11 193 -135 22
6466 22 382 -38 -158 41 -262 193 55 182 -24 -114 127 87 -222 -293 23 94 100 6 -75 -230 -19 52 -182
6489 -182 -267 -129 196 107 -151 155 180 -9 385 193 -37 -392 41 238 199 -87 42 -104 156 193 80 -448
6511 -448 -295 217 196 190 159 -176 4 131 -26 -48 -172 88 58 361 -67 -207 -97 45 190 101 -266 -209 -23
6534 -23 100 -149 -176 -90 102 0 -118 -125 -242 -126 76 607 49 -207 -50 179 126 160 -265 151 -89 64
6556 64 -37 -101 -130 -133 -162 245 -127 72 -85 -87 482 -133 -25 8 159 225 259 41 -2 -309 283 -141 5 -55
6580 -55 -39 99 -47 -242 -232 -488 18 174 -274 -422 -46 168 4 40 -92 -29 372 159 -94 -180 -380 126
6602 126 119 -8 89 -92 -22 393 157 -206 -503 -302 11 55 95 223 173 32 266 -130 -67 -466 45 -66 196
6625 196 -102 -158 100 -36 84 -115 213 69 33 231 46 -131 73 -237 87 271 -102 160 -164 -29 223
6646 223 -200 -103 71 117 217 197 -109 -140 26 157 29 194 -197 -80 238 74 -105 -348 96 103 166 128 -151
6669 -151 -182 78 71 -73 -187 -189 117 12 105 -182 -150 11 118 252 2 -107 193 388 1 134 -199 -111 15
6692 15 304 -7 -131 251 88 114 -122 5 -89 -237 120 61 -36 -128 4 396 -147 -225 191 -7 -14 45 142 77
6716 77 -23 -4 25 -37 268 -272 -21 -143 64 -75 -165 -26 -4 -175 -23 -180 -183 42 -59 216 -99 -289 -92
6739 -92 286 -162 -202 -79 -56 97 -143 -132 86 191 -223 183 -51 81 -75 253 85 -143 -57 -58 26 -9 21
6762 21 -169 -66 221 154 -9 -111 -237 27 268 4 21 -169 -177 528 -35 -114 68 -173 46 -66 -247 -183
6784 -183 -72 230 62 -79 -360 -318 28 156 101 37 -78 157 51 32 61 -410 -275 -43 323 264 -38 71
6806 71 -116 -46 136 -235 -184 -94 -45 84 -271 -215 -193 47 -14 225 38 -404 69 175 -135 -245 -215 -71 146
6829 146 -20 -299 -197 233 -206 -108 -148 -250 -128 75 -101 -166 -44 91 106 -41 -26 -60 8 2 16 185 -130
6852 -130 -90 -132 -61 271 79 -60 130 -70 275 110 -69 -302 240 202 74 147 145 32 -299 34 -198 2
6874 2 -166 61 21 -68 -223 -67 -223 250 43 -123 -45 431 248 102 -217 -314 232 -248 217 -104 -43 108
6896 108 258 258 -2 -321 0 -13 -115 -26 -202 -168 84 61 -72 -6 -66 160 -293 184 -129 21 -32 188 -30
6919 -30 -219 78 -116 30 116 -51 99 108 -179 -2 -49 -190 45 -52 95 79 208 -321 -146 456 -48 -91 -436
6942 -436 392 -88 18 -168 -223 -115 7 267 -168 232 -318 -9 112 246 -32 -427 129 305 39 130 208
6963 208 239 -89 35 41 140 169 -141 161 91 -31 -108 200 214 -41 -177 -219 1 60 67 -197 -209 -330 198 483
6987 483 83 -104 363 -138 22 -59 72 -287 -66 60 53 -208 24 -15 205 297 120 -190 -175 -9 167 46
7009 46 132 -150 25 166 130 328 -276 2 -63 129 -144 -253 -187 126 449 118 -20 102 59 -65 -237 -56
7031 -56 213 -25 137 -52 93 5 12 -12 -149 -159 -73 -9 260 -31 -208 168 -37 -221 32 -28 -139 -255 -6
7054 -6 -76 -235 343 -66 45 159 -48 -220 -79 -51 204 -141 196 -69 431 52 187 136 -80 -37 51 213
7076 213 22 -107 99 337 34 77 -225 -474 15 -107 -173 320 -171 -83 80 -151 -68 -26 193 325 101 89
7098 89 -171 -163 -3 234 70 -354 44 -174 32 251 -339 11 -192 221 237 -10 -107 -233 32 -32 90 -175
7120 -175 -405 -145 210 88 101 -71 315 -109 191 18 -266 -215 152 -314 69 -190 -26 83 -73 298 -74
7141 -74 -97 82 38 80 38 332 266 105 113 -165 139 21 196 11 -27 89 200 28 128 58 -96 65 -159
7164 -159 462 -303 30 -414 -23 60 132 -31 -148 305 75 -134 -391 100 -73 -177 264 70 -27 -152 -105
7185 -105 435 -117 27 -114 -174 -104 304 203 -183 171 126 21 94 -177 -25 -92 5 -109 -74 -90 -113 166 261
7208 261 -50 -98 -9 92 -55 -280 -106 -6 -316 -86 -26 -42 -529 -16 150 411 -115 -273 -274 -141 -99 -281
7230 -281 -99 -178 150 152 59 -138 -42 28 -170 229 -65 55 186 65 23 -280 204 -92 185 51 -73 -47 -72
7253 -72 94 384 -19 -81 -117 -158 267 30 83 -354 183 116 155 15 -116 205 327 127 58 27 39 -93 -43 137
7277 137 -415 -234 42 271 226 -228 111 125 -223 266 93 25 121 108 -53 74 128 102 -84 -145 48 -217 14
7300 14 16 57 37 -12 -47 160 -165 43 -48 81 133 -176 -38 -289 -230 41 -45 33 114 127 -179 -28 76 145 -249
7325 -249 145 -49 243 -42 128 -266 -34 -71 53 154 -50 -206 45 -5 46 -164 -149 30 238 111 162 -13
7347 -13 -117 10 -198 -59 -154 48 -103 30 67 -145 -221 38 76 -19 144 -250 -7 3 39 218 -142 233 78
7370 78 50 127 8 191 198 -79 6 -109 -20 237 -238 -96 -70 -273 37 -112 120 -227 36 39 384 80 -166
7393 -166 -283 -152 61 -249 -6 -184 -121 -32 320 43 1 -43 29 381 -73 -185 161 300 282 78 -74 -255
7415 -255 -65 142 250 72 -152 7 17 16 292 -89 160 -21 334 157 304 290 -53 212 211 -330 11 144
7437 144 -232 -23 1 268 -151 272 51 -102 100 -110 33 -131 -150 -168 112 118 98 154 -159 221 45 172
7459 172 132 -172 61 -113 102 39 -223 65 -458 -120 216 -187 -141 17 302 162 40 38 -39 -203 92 113
7481 113 96 -150 -101 209 -61 -82 -165 44 -57 28 -48 57 50 197 -53 162 -261 -351 71 270 200 60 -119
7504 -119 88 -205 -29 -66 13 -26 -91 -1 151 -228 -250 110 243 67 -61 -177 -104 54 -37 44 -166 109 -21
7527 -21 136 -63 292 -105 -130 399 -126 -115 91 -176 121 -155 48 -7 45 107 324 -101 -155 -117 219 175 -105
7550 -105 58 -30 -180 161 389 -235 -215 -311 -114 -93 -245 -172 236 43 130 9 -150 -31 126 -80 -12 5 -270
7573 -270 82 -228 126 31 -223 -184 37 214 -59 134 9 101 297 29 78 -32 60 131 -83 70 -120 174
7595 174 1 140 301 42 101 257 40 -227 199 -221 128 278 -195 -60 -51 1 259 66 99 -191 6 263
7617 263 21 -102 -26 -12 -45 -84 -11 -208 -125 93 -111 -82 -363 42 131 62 267 -84 -173 -56 128 -87 -21 -296
7641 -296 233 -27 -25 -81 -107 -1 107 90 -38 -284 -21 154 240 -64 -433 158 271 -243 -122 88 -89 -152
7663 -152 184 20 -108 -62 -195 95 193 175 -143 88 189 156 20 -75 -30 -194 3 -11 13 102 33 227 313 -313
7687 -313 32 -3 45 186 75 -167 -71 325 169 -129 -492 20 -18 -172 24 -269 -75 29 -194 -247 179 -205
7709 -205 25 -68 218 -118 149 89 133 234 -120 -80 183 -228 186 -93 -272 -153 132 317 163 -7 37 100
7731 100 150 50 -279 54 -124 192 181 152 14 -136 91 291 -39 -315 57 -115 310 136 38 -269 362
7752 362 435 290 -47 32 227 28 218 -93 -244 -55 -47 -88 46 -119 181 -133 204 212 -30 -311 -275 163 76
7775 76 -157 -177 -226 105 -82 143 -191 -76 81 15 -74 91 -72 -238 -112 51 -76 300 -46 86 306 -209
7797 -209 154 77 77 199 -102 -64 -89 -34 365 -67 95 -17 -10 207 -66 -162 127 -22 -27 -145 -60 -374 -144 168
7821 168 131 92 -154 -202 88 25 255 -6 -177 -92 418 117 -7 -127 -279 -45 41 -301 42 99 139 384 -305
7844 -305 -1 -391 57 318 106 -198 -232 165 125 342 -169 -128 27 -40 -127 -30 -309 209 132 -1 -58 116 -28
7867 -28 73 61 -191 206 -52 -202 224 50 348 48 217 155 46 -205 -83 20 225 293 122 -86 -93 -232
7889 -232 182 239 -371 -320 124 162 -322 134 -11 -146 -170 419 40 -267 -273 -5 266 57 -88 -155 -138 312 69
7912 69 -52 58 -236 50 21 -130 -15 96 144 199 385 -54 -113 -18 297 -43 -94 -271 255 292 272 214 -5
7935 -5 235 -85 -74 -81 158 23 148 275 -148 -10 -73 44 134 -36 82 15 79 438 409 9 143 -67 184
7958 184 134 -68 285 -171 -13 -193 137 -102 199 -184 201 41 -246 -50 -189 73 -189 -365 -196 143
7978 143 -56 164 45 -74 -257 283 370 -109 -286 -37 328 156 78 67 -78 15 -73 17 -213 62 47 155
8000 155 287 -203 -108 -158 9 123 154 -411 -97 -12 16 -157 192 -331 184 105 126 -70 -214 -276 156 -166 -80
8023 -80 150 -226 239 166 108 25 213 85 28 172 13 -208 96 -16 -99 -254 -71 214 292 -78 -2 34 -151
8046 -151 -11 406 77 -102 -149 1 237 104 43 -284 178 -14 -44 -90 45 25 139 193 91 -242 -107 68
8068 68 -205 91 -125 14 142 340 17 259 39 -32 263 212 249 6 -114 -67 189 121 127 -123 -121 197 -113
8091 -113 109 -218 227 20 -208 80 -103 -34 68 230 -174 69 114 184 232 -205 -33 -338 199 -296 -149
8112 -149 -187 -109 214 116 -53 -106 -182 36 -107 -30 9 -68 -17 98 36 174 -466 -165 148 -14 0 -169 -143 -38
8136 -38 94 166 190 -210 116 324 90 -73 79 1 208 -43 20 -54 -121 162 219 170 174 -101 227 209 214 5 204
8161 204 288 14 -62 129 -87 -175 152 196 101 263 -161 -15 -284 144 70 -77 13 183 -4 -218 -64 329
8183 329 357 241 -219 -34 179 245 47 -215
8191b15
##END NTUPLES=NMR FID
##END=
