##TITLE=1H_DE-63_24_oil
 D2O
 8 sc, 
 8.8.2024
##JCAMPDX= 6.0         $$ Bruker NMR JCAMP-DX V2.0
##DATA TYPE= NMR FID
##DATA CLASS= NTUPLES
##ORIGIN= UXNMR, Bruker Analytische Messtechnik GmbH
##OWNER= root
$$ XWIN-NMR		Version 3.5
$$ Thu Aug  8 15:31:08 2024 Russian Standard Time (UT+4h)  she@DPX200
##.OBSERVE FREQUENCY= 200.1313
##.OBSERVE NUCLEUS= ^1H
##.DELAY= (6, 6)
##.ACQUISITION MODE= SIMULTANEOUS
##.ACQUISITION SCHEME= undefined
##.AVERAGES= 8
##.DIGITISER RES= 18
##SPECTROMETER/DATA SYSTEM= spect
##.PULSE SEQUENCE= zg30
##.SOLVENT NAME= Acetone
##.SHIFT REFERENCE= (INTERNAL, Acetone, 0, 15.7039)
##AUDIT TRAIL= $$ (NUMBER, WHEN, WHO, WHERE, WHAT)
$$ ##TITLE= Audit trail, XWIN-NMR		Version 3.5
$$ ##JCAMPDX= 5.01
$$ ##ORIGIN= Bruker BioSpin GmbH
$$ ##OWNER= she
$$ F:/spectra/data/she/nmr/H-F/1/audita.txt
$$ ##AUDIT TRAIL=  $$ (NUMBER, WHEN, WHO, WHERE, WHAT)
(   1,<2024-08-08 15:29:43.51 +0400>,<she>,<DPX200>,
      <created by zg, POWCHK disabled, PULCHK disabled
       configuration hash MD5:
       00 E9 B6 7A A2 85 ED C7 34 08 36 98 17 FE 4E 26
       data hash MD5: 16K
       0E BE 83 77 13 2F 77 42 FA 9C C1 D4 39 83 57 51>)
$$ ##END=
$$ 
$$ hash MD5
$$ F8 7B 74 9E B7 0A B9 54 12 2E 4E DB 86 73 74 80
##$RELAX= 
##$RELAX= 
##$RELAX= 
##$RELAX= 
##$RELAX= 
##$RELAX= 
$$ Bruker specific parameters
$$ --------------------------
##$DU= <F:/spectra>
##$EXPNO= 1
##$NAME= <H-F>
##$PROCNO= 1
##$TYPE= <nmr>
##$USER= <she>
##$AMP= (0..31)
100 100 100 100 100 100 100 100 100 100 100 100 100 100 100 100 100 100 
100 100 100 100 100 100 100 100 100 100 100 100 100 100 
##$AQSEQ= 0
##$AQ_mod= 1
##$AUNM= <au_zg>
##$AUTOPOS= <>
##$BF1= 200.13
##$BF2= 200.13
##$BF3= 200.13
##$BF4= 200.13
##$BF5= 200.13
##$BF6= 200.13
##$BF7= 200.13
##$BF8= 200.13
##$BYTORDA= 1
##$CFDGTYP= 0
##$CFRGTYP= 5
##$CHEMSTR= <none>
##$CNST= (0..31)
1 1 145 1 1 1 1 1 1 1 1 1 1 1 1 1 1 1 1 1 1 1 1 1 1 1 1 1 1 1 1 1 
##$CPDPRG= <>
##$CPDPRG1= <>
##$CPDPRG2= <>
##$CPDPRG3= <>
##$CPDPRG4= <mlev>
##$CPDPRG5= <mlev>
##$CPDPRG6= <mlev>
##$CPDPRG7= <mlev>
##$CPDPRG8= <mlev>
##$CPDPRGB= <>
##$CPDPRGT= <>
##$D= (0..31)
0 1.2 0 0 0 0 0 0 0 0.06 0 0.03 0 0 0 0 0.0002 0 0 0 0 0 0 0 0 0 0 0 0 
0 0 0 
##$DATE= 1723116583
##$DBL= (0..7)
120 120 120 120 120 120 120 120 
##$DBP= (0..7)
150 150 150 150 150 150 150 150 
##$DBP07= 0
##$DBPNAM0= <>
##$DBPNAM1= <>
##$DBPNAM2= <>
##$DBPNAM3= <>
##$DBPNAM4= <>
##$DBPNAM5= <>
##$DBPNAM6= <>
##$DBPNAM7= <>
##$DBPOAL= (0..7)
0.5 0.5 0.5 0.5 0.5 0.5 0.5 0.5 
##$DBPOFFS= (0..7)
0 0 0 0 0 0 0 0 
##$DE= 6
##$DECBNUC= <off>
##$DECIM= 24
##$DECNUC= <off>
##$DECSTAT= 4
##$DIGMOD= 1
##$DIGTYP= 9
##$DL= (0..7)
0 120 120 120 120 120 120 120 
##$DP= (0..7)
150 150 150 150 150 150 150 150 
##$DP07= 0
##$DPNAME0= <>
##$DPNAME1= <>
##$DPNAME2= <>
##$DPNAME3= <>
##$DPNAME4= <>
##$DPNAME5= <>
##$DPNAME6= <>
##$DPNAME7= <>
##$DPOAL= (0..7)
0.5 0.5 0.5 0.5 0.5 0.5 0.5 0.5 
##$DPOFFS= (0..7)
0 0 0 0 0 0 0 0 
##$DQDMODE= 0
##$DR= 18
##$DS= 0
##$DSLIST= <SSSSSSSSSSSSSSS>
$$ [...]
##$SUBNAM2= <"">
##$SUBNAM3= <"">
##$SUBNAM4= <"">
##$SUBNAM5= <"">
##$SUBNAM6= <"">
##$SUBNAM7= <"">
##$SUBNAM8= <"">
##$SUBNAM9= <"">
##$SW= 24.0689771365484
##$SWIBOX= (0..15)
0 0 2 0 0 0 0 0 0 0 0 0 0 0 0 0 
##$SW_h= 4816.95568400771
##$TD= 16384
##$TD0= 1
##$TE= 0
##$TE2= 300
##$TE3= 300
##$TEG= 300
##$TL= (0..7)
0 120 120 120 120 120 120 120 
##$TP= (0..7)
150 150 150 150 150 150 150 150 
##$TP07= 0
##$TPNAME0= <>
##$TPNAME1= <>
##$TPNAME2= <>
##$TPNAME3= <>
##$TPNAME4= <>
##$TPNAME5= <>
##$TPNAME6= <>
##$TPNAME7= <>
##$TPOAL= (0..7)
0.5 0.5 0.5 0.5 0.5 0.5 0.5 0.5 
##$TPOFFS= (0..7)
0 0 0 0 0 0 0 0 
##$TUNHIN= 0
##$TUNHOUT= 0
##$TUNXOUT= 0
##$USERA1= <user>
##$USERA2= <user>
##$USERA3= <user>
##$USERA4= <user>
##$USERA5= <user>
##$V9= 5
##$VALIST= <valist>
##$VCLIST= <CCCCCCCCCCCCCCC>
##$VD= 0
##$VDLIST= <DDDDDDDDDDDDDDD>
##$VPLIST= <PPPPPPPPPPPPPPP>
##$VTLIST= <TTTTTTTTTTTTTTT>
##$WBST= 1024
##$WBSW= 4
##$XGAIN= (0..3)
0 0 0 0 
##$XL= 0
##$YL= 0
##$YMAX_a= 94174
##$YMIN_a= -80521
##$ZGOPTNS= <>
##$ZL1= 120
##$ZL2= 120
##$ZL3= 120
##$ZL4= 120
##$ABSF1= 10
##$ABSF2= 0
##$ABSG= 5
##$ABSL= 3
##$ALPHA= 0
##$AQORDER= 0
##$ASSFAC= 0
##$ASSFACI= 0
##$ASSFACX= 0
##$ASSWID= 0
##$AUNMP= <proc_1d>
##$AZFE= 0.1
##$AZFW= 0.1
##$BCFW= 1
##$BC_mod= 2
##$BYTORDP= 1
##$COROFFS= 0
##$CY= 11.3945322036743
##$DATMOD= 1
##$DC= 2
##$DFILT= <>
##$DTYPP= 0
##$F1P= 15.6554695791079
##$F2P= 12.8336369535428
##$FCOR= 0.5
##$FTSIZE= 0
##$FT_mod= 4
##$GAMMA= 1
##$GB= 0.15
##$INTBC= 1
##$INTSCL= 1
##$ISEN= 128
##$LB= 0.24
##$LEV0= 0
##$LPBIN= 0
##$MAXI= 10000
##$MC2= 0
##$MEAN= 0
##$ME_mod= 0
##$MI= 1.114404
##$NCOEF= 0
##$NC_proc= 0
##$NLEV= 6
##$NOISF1= 3.799351
##$NOISF2= 2.8
##$NSP= 1
##$NTH_PI= 0
##$NZP= 0
##$OFFSET= 15.70392
##$PC= 1
##$PHC0= -25642.31
##$PHC1= 12.38749
##$PH_mod= 1
##$PKNL= yes
##$PPARMOD= 0
##$PSCAL= 0
##$PSIGN= 0
##$REVERSE= no
##$SF= 200.130013532006
##$SI= 16384
##$SIGF1= 3
##$SIGF2= 2
##$SINO= 400
##$SIOLD= 16384
##$SREGLST= <1H.CDCl3>
##$SSB= 0
##$STSI= 0
##$STSR= 0
##$SW_p= 3612.71676300578
##$SYMM= 0
##$S_DEV= 0
##$TDeff= 0
##$TDoff= 0
##$TI= <>
##$TILT= no
##$TM1= 0
##$TM2= 0
##$TOPLEV= 0
##$USERP1= <user>
##$USERP2= <user>
##$USERP3= <user>
##$USERP4= <user>
##$USERP5= <user>
##$WDW= 1
##$XDIM= 8192
##$YMAX_p= 0
##$YMIN_p= 0
$$ End of Bruker specific parameters
$$ ---------------------------------
##NTUPLES= NMR FID
##VAR_NAME=  TIME,          FID/REAL,        FID/IMAG
##SYMBOL=    X,             R,               I
##VAR_TYPE=  INDEPENDENT,   DEPENDENT,       DEPENDENT
##VAR_FORM=  AFFN,          ASDF,            ASDF
##VAR_DIM=   8192,          8192,            8192
##UNITS=     SECONDS,       ARBITRARY UNITS, ARBITRARY UNITS
##FACTOR=    0.0002076,     1,               1
##FIRST=     0,             0,               0
##LAST=      1.7004516,     0,               0
##MIN=       0,             -80521,          0
##MAX=       1.7004516,     94174,           0
$$ Real data points
##PAGE= N=1
##DATA TABLE= (X++(R..R)), XYDATA
$$ [...]
1449A37Q0n9k7n86K61J03K87J68n59J23k81K45K88J79k92k76j72L00L18j08m3
1470H6m81J56K00K93J30k09m31j56J74L03R0J39l29k01J67J04J76l64o4j20J60
1491a77K60J99k02ol33M2K95L95j67l05k4j19pM34j58r8k15j22K76J41J70l59
1513h0k64J03J57L39O3k05q8k75K93J96J20j85l77j40J68L41K33k85k81n0j15
1534c32O05M7l9l49j01J10J07K09Jj59l05pJ99M05p0m29k10k2K97L65k69k09k35
1557c91K04O7K84Q8k81k82J79J35J25K09k25l92J71J98J69j7m1k18k32K05L34
1578B89j04P4n76J51P5K13L20k71k23j41K28r1L00j53j86O8q7K19QK45l77l0%
1601d9l6L16p1k12k2j54K26L02r4k21j96O5L10Q9j18J5k48r5K43O7m6qj71k07
$$ plain form
1449 137 217 158 131 -455 -194 -91 196 364 -195 -72 -353 -108 180 359 67 -209 -381 -81 237 129 86
1470 86 -395 -239 -39 254 384 175 -256 -412 -238 65 155 294 -35 -236 -69 35 211 -153 -217 -337 -177
1491 -177 83 282 80 74 -259 -217 78 473 306 1 -23 -142 -149 285 127 29 -186 -308 -32 109 279 -80
1513 -80 -344 -241 -84 255 318 113 25 -250 43 239 359 174 -203 -343 -175 166 399 114 -167 -217 -332
1534 -332 273 320 281 -68 -169 -59 48 257 258 99 -206 -213 -14 391 321 -108 -318 -340 -43 322 53 -156 -391
1557 -391 -187 -120 164 252 -29 -311 -132 3 128 337 112 -280 -109 89 258 241 200 -18 -250 -45 289
1578 289 185 259 -317 -166 -91 122 442 171 -52 -193 35 -56 244 91 -95 -27 -114 105 113 358 -19 -49 -49
1601 -49 -85 231 160 -52 -74 -228 -2 300 206 -15 -211 -146 164 253 135 150 -98 -193 50 117 71 63 -108 -315
1625c15K37K97p1j84p1j01N0K04R4K8l56P3M6J54Q0Jl96M4J62P0J26K8k02j38
1649a40N8K6J72j48l1m9j16K20J11j55N9k29J28M8J67N6p0k85K5J51L9K00r0l28
1673a81j79K07J64p9N9K7j51K5K51j4O6l89L3J06J09J58O0k74r6P4M7M0L6o1j22
1698h4J58J39q1M2k98r7O1J43k3K62j44k17J80j25J14J09j25k83J72M0R4j69J20
1721a2L9lj8J21p9j21p9J74M2o3J39j95m7p1J03K54M4l13J57KJ13k19J21j49J31
1746G1R0k99K55K0k56J9K6M3q4J72O8k5j72J95j70J65J47l10Q6j08K00j04J8j78
1770a31J12k11J14L15o4l07m1J24J24l1K3o8m0m5J13J75p6J15k25R3k25K15J3
1793G2J2k7n4j99J36J42J4k18R0j40K01J02k8o2k74K28J46j6o8p2j48K27J23M3
$$ plain form
1625 -315 -78 219 148 -36 -107 -208 -158 46 140 168 -188 -115 -69 85 165 166 -230 -186 -24 46 172 200 -2 -140
1649 -140 -82 -56 116 -32 -63 -112 -228 -8 103 -52 7 -222 -94 -46 121 177 107 -178 -153 -2 37 237 147 -181
1673 -181 -360 -153 11 -68 -9 18 -133 -108 143 129 195 -194 -161 -55 54 212 272 -2 -98 -24 23 63 99 38 -84
1698 -84 74 213 132 174 -124 -221 -160 -17 -40 222 78 -139 41 -84 30 139 14 -269 -97 -57 37 -132 -12
1721 -12 27 24 6 127 48 -73 -152 22 64 1 140 -55 -102 -173 -70 184 228 -85 72 74 187 -32 89 -60 71
1746 71 161 -138 117 137 -119 -100 -74 -31 -115 57 125 100 -72 123 -47 118 265 -45 41 -67 133 29 47 -131
1770 -131 -19 -230 -116 199 135 -172 -213 -89 35 4 27 -41 -81 -126 -13 162 86 201 -24 69 -156 59 72
1793 72 84 57 3 -196 -60 82 96 -122 -32 -172 29 131 103 41 -233 -5 141 125 57 -15 -163 64 187 230
1817B30q0k23Q1n6J44L8j51k3o1l7J11J09O2r5j49j2Q6J93j65R5j01j14q7L25
1841A20j91J95r8j65l3K03J07q5k54P0PK25L0o6N6J19j78j30J73l1N4j52j12J79
1865D3K33j23k8j24J22j78L73k13j76Q3j53J94n3j94L8J73jl7J43Q3j79j23P3
1888b4K3Q0M2k00r5J2j5J05R5J56j88j02J01M2J61p4j48j62K14l4K0Q3j37j32
1912a77J86j20RJ76r7j13pN0J46L3j36q2K97j28M3P8j95j78K02K1j1L98m71j2
1936h8n4J35R4j41R5Oj56o5K57M0Kj83o3p1L77j46o5L8l5J17Q5J25k59n2j42L0
1962a19J15J35j63J44nk70J88o6K0J46k83K6kK62j52J84m4k23j7J46km9q9j4M8
1987h4K56J4j21n9O5j29Q8J88k88p6J13J21j43K02m1k48N0L6r9J02L9q8K6J20
$$ plain form
1817 230 150 -73 8 -48 96 134 -17 -40 -101 -138 -27 82 144 49 -100 -112 -26 167 2 97 -4 -118 -205 120
1841 120 -71 124 26 -139 -172 31 138 53 -201 -131 -124 101 131 65 121 240 62 -68 105 74 128 -24 -136 43
1865 43 276 153 125 1 123 -55 318 105 -71 12 -141 53 0 -194 -156 17 16 -21 122 205 26 -97 -24
1888 -24 -1 79 121 -79 -174 -162 -177 -72 23 179 -9 -111 -10 32 193 119 -29 -191 23 -11 9 92 -45 -177
1912 -177 9 -111 -102 74 -23 -136 -143 -93 53 86 -50 -132 165 37 80 158 -37 -215 -13 8 -3 395 -76 -88
1936 -88 -142 -7 87 -54 41 47 -109 -174 83 123 125 -58 -121 -192 185 39 -26 12 -23 94 179 304 45 -7 -149 -119
1962 -119 -4 131 -32 112 107 -163 25 -41 -21 125 -158 -132 -134 128 -24 160 116 -107 -124 22 20 -29 -118 -132 -84
1987 -84 172 186 65 6 71 -58 30 218 -70 -146 -33 88 -55 147 106 -142 -92 -56 -155 -53 -14 -102 -76 44
2011D4m5J68j92J40n9n6M1O8l1j01J42j53J46q6j05J98k52O2k5K04j4k74K37r1
2035c4J55o0k0o4j31J16rk5L69k45rj22O2M5j02j75K24Q7k57K81r4J07r5k1j41
2060a58K58Qj21k0m5LJ60k03J02N7K6Pk39J68Q8m7j56J15J1N6n2o1k3K52j59Q6
2086A13rj07J90k83O7N2O2J65k92p9J53L9j56J74n0q7R9O1O9k45O8j9J27j74R2
2111C0J48k15J20q4r8K32k8k35J01Oj13K24Oj25N9j12K05j69L0n7J8L0j11J88
2135E0J56l34P2P3m5p5L5Q4r6j07J83j7j40K58q7M7P4j67J09j45j3o1J08RJ38
2160A09P5j22N1j5qJ64k62nj88l7L20P0m0k86K75j17l9N9k93K81j12L9J13n4o
2185b8M5q4J46r1lL0R1o1q0l1mL29k73L6J6l1R6j17K3qm9P8%n8Q2K0M6k19R4Q
$$ plain form
2011 44 -1 167 -25 115 56 0 41 109 78 -23 119 -34 112 26 -79 119 -133 -71 -96 108 94 -180 57 -34
2035 -34 121 61 41 -23 -154 -38 -47 -72 297 52 43 -79 -17 28 -74 -249 -25 62 -195 86 -8 99 4 -17 -158
2060 -158 100 108 -13 -33 -78 -75 85 -118 -16 41 67 74 -165 3 91 44 -112 3 14 70 18 -43 -66 186 27 113
2086 113 104 -3 187 -96 -29 23 85 250 -42 -121 32 71 -85 89 39 -48 51 112 181 -64 4 -15 112 -62 30
2111 30 178 -37 83 -1 -99 133 105 -130 -29 -23 -136 88 94 -31 28 -84 121 -48 -18 -75 -57 -27 -138 50
2135 50 206 -128 -56 17 -28 -103 -68 16 -80 -187 -4 -21 -161 97 10 57 131 -36 73 -72 -85 -146 -38 -29 109
2160 109 184 62 113 98 90 254 -8 -13 -201 -238 82 152 112 -174 101 -16 -55 4 -289 -8 -120 -81 32 -22 -28
2185 -28 17 -67 79 -12 -15 15 106 45 -35 -66 -70 259 -14 22 38 7 103 -14 9 1 -48 30 30 -28 54 74 120 -99 -5 3
2215CQ0j07pmj71K55q7oL4O3J21k75K25j33L0j20J3N0K19k41j4J85l03K12Q1j70
2241f7J35k15p0K58j63J43m1o0j17K26j1pj55J30M3m5J03n5N0j68Q1J52k16j07
2265a76K16J04j73R0L8jj58O6L3J01q8K6nk66O5NJ97j34K2P2Q0nK0k47J13j3j05
2292a23J45J0j12K74l2j22m1J57J15k74J70N2k21J6N5P2m4k65K6L4K38J20k68
2315a8j24J64j7m2J66m0m8O2j00j40j34L13K41j83j70o2J43J73l72J39O9K2J57
2338A99l62J59L3o6q3L3j0K9ll2J62n3j8N9j28j1J61j35J12Q3k43J70p3J87N6
2363B26k04Jp2K80k92l7J55k08J00K12j37K1Kl8r3O9K7J4k16j18J25K20j11J5
2387e9J63j5q4J9K6Q0k6n7r7J54p3n1N1j13J63m3O6l4r5l2J58k52K75j37J08j41
$$ plain form
2215 3 83 -24 -31 -35 -206 49 -38 -44 -10 53 174 -101 124 -9 21 -99 -86 -36 183 -58 -72 113 -190 22 103 -67
2241 -67 68 -147 -217 41 -122 21 -20 -80 -197 29 18 11 -144 -14 29 -16 87 32 82 -86 -5 147 -69 -176
2265 -176 40 144 -29 61 99 98 -60 6 39 140 52 78 73 -193 -128 -123 74 -60 -38 34 114 109 129 -118 -5 -18 -123
2292 -123 22 32 -80 194 162 40 -1 156 271 -3 167 219 -2 14 69 141 97 -168 -142 -108 130 250 -18
2315 -18 -142 22 5 -37 129 89 41 103 3 -137 -271 42 283 100 -70 -132 11 184 -188 -49 20 42 199
2338 199 -163 -4 29 -37 -120 -87 -97 -68 -71 -103 59 6 -12 47 -81 -92 69 -66 46 129 -114 56 -17 170 226
2363 226 22 23 -49 231 -61 -98 57 -151 -51 161 24 45 47 9 -84 -15 12 26 -190 -308 -183 37 -74 -59
2387 -59 104 89 5 24 50 130 104 47 -50 104 31 -20 31 -82 81 38 104 70 -25 -57 101 -151 124 -13 95 -46
2413d6J24j96P9p5R3j73K06P0j1k18l3L81j24j01j22N1J33J9j52J42j98J72n9
2436c8J37p7J46j88J53M0r5j0J24p9L8o3RO3k71K08j20m4R6op0n3M9p3L13k44
2462e5J4p0J9K15q6o0J15j91j9J27J42j36j04J8Q5rJ91m4Mk09J69p9J10l6k0K9
2488A20q1P0j59L29j81m9n5N7Q7k33J35j51P0R0J48k41K4kj65J99j64M0J23L2
2512D3M7j77N2K53o7l1k21L8K53k25lK37l54K72p7r9J02Q9n9l1nJ0q2R1p6K07
2538A87j46p3K50m9j2k00o9K21J58k36o7J35j88k1K09kj07L4P0l1j0LO4j70j32
2563a82J86P2j24PJ02K7j73J81j35K6o1J87k90J50K5J10k32J56r3J15l6K8pj16
2587g7J94r9K23l84R2J42j70J6O2N2N1j13j5L03l01J47k92J50n6K00Lj21o6J51
$$ plain form
2413 -46 78 -118 -39 -114 -21 -194 12 82 71 -147 -180 201 77 -24 -146 -95 38 57 -95 47 -151 21 -38
2436 -38 99 22 168 -20 133 173 78 68 192 113 151 88 97 160 -111 97 -23 -67 29 23 -47 -100 -51 -124 189 -55
2462 -55 -41 -111 -92 123 37 -23 92 -99 -118 9 151 15 -89 -71 14 5 196 152 156 -53 116 37 147 111 91 120
2488 120 39 109 -50 279 98 49 -6 51 138 -95 40 -111 -41 49 197 -44 -20 -22 -187 12 -152 -112 11 43
2512 43 90 -87 -35 218 151 120 -101 -63 190 -35 -38 199 -155 117 40 -59 43 132 73 42 37 47 -35 56 -20 187
2538 187 41 -32 218 169 157 -43 -112 109 267 31 -36 99 -89 -110 99 97 -10 24 94 63 53 56 120 -50 -182
2563 -182 4 76 -48 -41 61 88 -85 96 -39 -13 -74 113 -177 -27 -2 108 -124 32 -61 54 18 46 39 -77
2587 -77 117 18 241 -143 -51 91 -79 -63 -1 51 102 -11 -26 277 -24 123 -169 -19 -75 125 128 7 -59 92
2611I2j11q1J53m0Kj06L5K00j09r3Q1n6J11n4R9j7k29J36j44L07j62j14J16P3
2635H9j63pK70k08m0k0K73k03m3J46k71L58k68J41O6k4j9r7J70j04j92J88j2O7
2659I7r3j45K49k8p%mQ9j17N2p8J8n0Q8j52l4J72P4l9j57P5j49Q3J05q2QK2k1
2687b4LN5J27q3j43k6P0J77q8o1j21Q1J06k40R5n5J39K2p0l1J04N0L9N1j61j26
2713a10p1L03J30k57k33K08l9J84k24n0K43r8K0q3o3J34n1q9K39j35L1O6k4J8
2737D9j23N2L6k2J52j01p1p8J29j14J17j04Q0q6M3k9J87j43J10J35k51J38Nl3
2761G8j13P8j27l4K69j23J1o4M9o7K17j67Q2j38J19J1j86l7J29j09K23k7j56l6
2785a18R1J9O5j62oJ25L5R0k37p4K61j1j08J00N3q9p7j3Q7j28Q0p2J56J10j52
$$ plain form
2611 92 -19 -100 53 13 15 -91 -56 144 35 -58 23 -33 78 24 123 106 -123 13 -131 176 14 -100 16 89
2635 89 -74 -81 189 -19 -59 -79 194 -9 -52 94 -177 181 -87 54 120 96 77 -20 150 46 -146 42 30 97
2659 97 4 -141 108 80 73 73 69 158 41 93 15 33 -17 71 -81 -115 57 131 92 -65 10 -139 -56 49 -33 -25 -3 -24
2687 -24 -21 34 161 78 -65 -91 -21 156 68 7 -114 -33 73 -167 -72 -127 12 34 -36 -67 37 87 126 177 16 -110
2713 -110 -181 122 252 -5 -238 -30 -69 115 -109 -159 84 -14 6 -77 -140 -6 -57 -146 93 -42 -11 55 31 49
2737 49 -74 -22 14 -8 144 43 -28 -106 23 -91 26 -78 2 -84 -41 -70 117 -26 84 219 -32 106 111 78
2761 78 -35 43 -84 -118 151 28 39 -25 24 -43 174 7 89 -49 70 81 -105 -142 -13 -122 101 74 -82 -118
2785 -118 -27 -8 57 -105 -111 14 49 139 -98 -172 89 78 -30 70 123 34 -43 -56 31 -97 -17 -89 67 177 25
2810B5N1nJ64n1j15j34J43O3O5j47j56n1J13J4R8p5j20P4J18Lj51j04L21l13J23
2835d7j3K09k45r7K09n1L5l15K05P8J09j30J15j32J50j89K13m1j41J2oM9N6j75
2859a42J09nJ2j05J01j37J56O3q1O9j90J38l0R0P0l1k94L20j49m8K8j70J28K31
2883A33j78n9J83k23J08J81j9k20K12j4k12L43k93PJ70j44q8K19l3q6J33j28K2
2906A4n4J8n0OR9p9j4J70k67j4K63j15lR9j31J69m4k08K16m3j51J43k48J94K4
2931fQ3kl3r2M4R6j58J06j50J97k98K31J00Kr4j48N4R6kk10N8R0r5R4R1o8q1K25
2959A30k37P4j03J77O6j66j3k4P5j59K37k13J05O7M2mq6m2J03j22q5K79j33o6
2983i8J38K6l16K37k3j0J4M7J77j52N9Mn6O7j82J20n8j72K75j14m5K16k41q8N3
$$ plain form
2810 25 76 71 235 184 69 -65 78 141 206 59 -97 -148 -35 -21 77 2 -118 -44 74 77 -74 -178 143 -170 -47
2835 -47 -60 149 -96 -193 16 -35 0 -315 -110 -32 77 -53 62 -70 80 -109 104 63 -78 -66 -72 -23 33 -142
2859 -142 -33 -38 -26 -131 -30 -167 -11 52 -29 40 -150 -12 -42 48 118 87 -207 113 -36 -84 -56 -226 -98 133
2883 133 -45 -104 79 -144 -36 145 126 -94 118 104 -108 235 -58 -51 119 -25 -113 106 73 -13 120 -8 14
2906 14 -40 -22 -72 -66 33 -46 -60 110 -157 -171 92 -23 -26 73 -58 111 67 -141 75 32 -119 24 -224 -30 -6
2931 -6 77 75 42 -50 -6 90 -68 38 -112 85 -213 18 118 120 26 -122 -68 28 26 -184 -126 -36 -131 -37 54 -14 -95 130
2959 130 -107 -33 -136 41 107 -59 -72 -96 -21 -180 57 -156 -51 16 58 54 -32 -74 29 -93 -178 101 -32 -98
2983 -98 40 66 -250 -13 -36 -46 -32 15 192 40 99 103 47 114 -68 52 -6 -178 97 -17 -62 154 -87 -175 -122
3008a22j42m9L75o9o6J06j05R0J27k40K6J58k23K69j14M1P3k13p3J16N4p7J4K16
3032A72j99j55J34J52j3K4l28L32l2n7M9n4N1j04L3j32K37j69N4j31J28j2q2j39
3056b41J41NK17l37J45J53j88K14Jj7K6k40J57J22k85MJ50m9p4j99L08K08l09
3079h8NK33r7Oo1J09k35K19j04J50o0Km4k2O2j54J19m9J5N1l6j1K10l58R6J00
3105E8l9k6M6Q4j41m3LK86k12J36OL5O2j39k8m7mo4R6N8Qo2M7j42R5j75Pm8M5
3134i8J30l4K09l19L25k92n2K62j71O1O5p7K9J48k21J11m2j20O2J45n8j97J59
3157B5k51O6J62N6k18J04O9j02P0N8o0J37k00J90l0j50J28j0j00n3J58p1lj79
3181b04J86j3J28j76j6J20k3J18k51Q0O7k03L49j63Jk05J13M0K26l47j1Q0J1M0
$$ plain form
3008 -122 -264 -313 62 -7 -73 33 -72 18 145 -95 -69 89 -134 135 21 62 135 -78 -151 -35 19 -58 -44 172
3032 172 -27 -182 -48 104 91 115 -213 119 87 30 79 25 76 -28 5 -127 110 -59 -5 -136 -8 -20 -102 -241
3056 -241 -100 -95 122 -215 -70 83 -105 109 110 93 119 -121 36 158 -127 -123 27 -22 -96 -295 13 221 -88
3079 -88 -83 150 53 59 -2 107 -128 91 -13 137 77 79 35 13 75 -79 40 -9 6 57 21 10 220 -138 -42 58
3105 58 19 -7 39 123 -18 -61 -58 228 16 152 158 193 255 116 88 41 37 -27 69 127 135 73 120 -22 73 -102 -95 -143 -98
3134 -98 32 -2 207 -112 213 -79 -131 131 -40 21 86 9 38 186 -35 76 34 -86 -24 121 63 -134 25
3157 25 -226 -160 2 58 -160 -56 13 -89 -19 39 -21 116 -84 106 76 -74 54 44 -56 -109 49 -22 -25 -204
3181 -204 -18 -31 97 -79 -95 25 2 120 -131 -51 16 -187 162 -1 0 -205 -92 -52 174 -173 -184 -104 -93 -53
3205e3J00P0m6n2j06l8K07K1j69J0O6j40M2L87l03L9j93K80L9k40J18J93k45l
3229a6l2J9J34j46lR8j18J1J15N0l4j45P1q7M8j72J15o1m7L40j49M7j73R7R5M9
3255A06j73k7J76J3j39k4R7l9J6J4jk1J39j04N6j5J2N2k3j81J40k2k52k5K86R5
3281A56r6n7m0J91k33J84m8k51J98k7j7l6K9n7K25j76J23r7K3j00K53j44j26Q5
3305c8M1J47k72J17j1k6pjO4K07k13j15K4J6J85k67L04r9j23O3r4J5K45j97J02
3330F7k1k43O8J53q4J03o7J11k03J93K1l4r9P4j08J19J30l40J60l3J54j61J54
3353A14p6q7R7j7j8j38J2Q8o8J28Qo5J00r5J9ML7J5m7j9r2m7L19j79O0o7J9Q1
3381H6j98K27q2j27K3j33L18k69J48R6L4r5n6m6K30r1J8j29P0n6j17K52k96L04
$$ plain form
3205 -53 47 117 71 19 -87 -125 82 103 -66 -56 10 -130 -88 299 -4 35 -158 122 161 -79 39 232 -13 -16
3229 -16 -48 -29 105 -41 -44 54 -64 -53 62 112 78 -67 4 -83 -35 -207 -92 -153 -200 140 -9 38 -135 -38 57 106
3255 106 -67 -94 82 95 -44 -68 29 -10 6 20 19 -2 137 33 89 74 86 138 115 -66 74 52 -200 -225 61 156
3281 156 60 3 -37 154 -79 105 57 -194 4 -23 -40 -76 -47 -104 121 -55 68 -29 -6 -106 147 3 -123 -38
3305 -38 3 150 -122 -5 -16 -42 -49 -50 14 221 8 -107 -83 -67 118 -149 155 56 -67 -4 -98 -83 162 -35 67
3330 67 46 -197 -129 24 -60 43 -24 87 -116 77 98 64 -35 39 -69 50 180 -160 0 -33 121 -40 114
3353 114 38 -49 48 31 13 -125 -113 -25 -93 35 43 -22 78 -17 2 6 43 58 11 -8 -100 -147 172 -7 53 -14 5 86
3381 86 -112 115 33 -94 -71 -204 114 -155 -7 89 123 28 -28 -74 156 65 83 -46 24 -32 -149 103 -193 111
3405A11k81L20j91Q5k98R0J58j15j11L23k2j95J59L6m2Pp3M8J3M4l7n2Q8j34J66
3430I7k12M5k2J25j97K21O5k74L59j93J53K7l04J50j8j7kj34L1K00ml01L28k50
3454a27R9o1J9L25j3j04l6k24J3J99j08k9P9J77k03Kj15j6O5Q9J7J7L4j43MK47
3480B07j71R5q7LO7r3Q8j7L4Nk6j64Jj49J26K09l19O0K03j45nJ3N2N5l1q6P5J53
3508A53j10j48J29L9L1m6J1JO6q6j50J0J6Q2J02k09K24n7P7r0q6L4r4J41r7OP3
3535B2j47o8J96j9M8R8k41R4n6P7J03j20J36k20J20p7K5o6J51j44J90M7j23K8
3559E4l0J63j38q3Q1k40L67l82K73k06K23j74n7K31J30k40j23K37j16J13j87O7
3581c7J4M7P3j08o5J02J28l13J72J75j84Q1j57L9K5j46K10j6l4J5j1J87j33n4
$$ plain form
3405 111 -170 150 -41 44 -254 -164 -6 -121 -232 91 69 -126 33 69 27 34 -39 9 22 66 29 -23 65 -69 97
3430 97 -115 -70 -92 33 -164 57 122 -152 207 14 167 194 -110 40 22 5 3 -131 -100 100 96 -205 123 -127
3454 -127 -28 -89 -70 255 242 138 102 -122 -109 90 -18 -47 32 209 6 8 -107 -123 -58 31 48 65 99 -44 -40 207
3480 207 36 131 44 47 114 21 109 92 126 131 105 -59 -58 -207 -81 128 -191 -131 72 -73 -78 -65 -13 42 11 -75 0 153
3508 153 43 -105 24 63 94 48 59 60 126 40 -110 -100 -84 -2 100 -109 115 58 135 45 -41 -7 -101 40 -57 -51 22
3535 22 -125 -193 3 -16 32 130 -111 -17 -73 4 107 -13 123 -97 23 -54 -29 -95 56 -88 102 149 26 54
3559 54 24 187 49 -34 47 -193 174 -208 65 -141 82 -92 -149 82 212 -28 -151 86 -30 83 -104 -37
3581 -37 -23 24 97 -11 -76 26 154 -159 13 188 4 85 -72 -33 -8 -154 56 40 6 21 10 197 64 10
3605A0p0J18N7j07j6o2J4rM3P5n1n5K3M1n6J01j51P8j04K24j41k1OP7K6Rk23J62
3633bJ24M0j32m9O5K4j98J28m6N9m0O5p2K7%jO4J05j03P8j94j09J1K03Kk1p5N1
3661Dj58l2J58J13q4J28O6j29O7j81O5oK6J22j60j26J37P6m1r2J55q8q0JNJ01
3687D7k36J81q8J98j84Q3J02l7j10Q6j88N3R8N8L2r1O1P8j44P8Lj24M0q7J38N
3713E2m9M2j34k7N8L3J96j31P0k47J96j11O3km7M6n2J89j48O8j41J99q7k5j84
3738a73K23j97J77J5M7p2K2j75J56P5j83J68k53K36m3J1j93J15O4L6n1j69n2M52
3762B36k00l6j1r5Q4Nk6j44K74j4k83J66K45k61K66k19j54K91l5kn2r0O4j13L12
3787B08k59Ln3J89M5j62k4O9N0Q6n2j27J73j74M5N4j1j52J41j16K35r4l45L25
$$ plain form
3605 10 -60 58 115 8 -8 -70 -56 -65 -22 53 2 -53 -30 11 -45 56 -95 -17 -121 103 -38 -59 -53 24 50 59 -164 -2
3633 -2 122 162 30 -19 46 70 -128 0 -46 13 -27 38 -34 -7 -7 -8 56 161 58 136 -58 -167 -156 47 49 28 -47 4
3661 4 -154 -186 -28 85 1 129 195 66 133 -48 17 11 37 159 -1 -127 10 86 45 -47 108 20 -60 -59 -54 47
3687 47 -189 -8 -96 102 -82 1 103 66 -44 42 -146 -93 5 63 95 4 65 143 -1 77 80 -44 -4 -91 47 52
3713 52 3 45 -89 -116 -58 -25 171 40 110 -137 59 -52 11 9 -38 8 -44 145 -3 65 -76 123 36 11 -173
3738 -173 50 -147 30 45 92 20 42 -133 23 98 -85 83 -170 66 23 34 -159 -44 20 56 5 -164 -216 236
3762 236 36 0 -11 -106 -22 -17 -43 -187 87 73 -210 -44 201 -60 206 -13 -167 124 89 87 35 -55 9 -104 208
3787 208 -51 -48 -101 88 133 -29 -53 16 66 152 100 -27 146 -28 17 71 60 -92 49 -67 168 74 -271 54
3811E4j9O5Q1r1K1k65P5p4K6R4p8K15J9p3J4J03j73J9K03k99J33l9J03j76J34
3836G2j02k3J6j70J18J42j0r3P2P5j20r1J67jj8q6j2K26Pp9N5m36L33j31J6M7
3862b6l2L7O8j12m1P0K00n4j88o0J63j69M3N5N1n4n2K4J7N6j33K21p1j7o6RK04
3889A43j68K1j30o3J56J25j40J64k9k22K93l6j46J34k51R5j49J22J24j39J56j55
3911i5L0K1j75K14m3k1K15j99j02K98j37ol7O2k97L42j61J33k7j20J42n8O1j01
3935f1M6P6q4j38J51P9N6k5n5oJ3k03L28k03n4L9Qj1J12j28j6J2Q5j59J56ln3
3962c8M7j16J93j06R4l87K81Mq1J62p9j18K53j4j4N8j99J0k7K14n4Jq0j4o5J07
3988C2O6Q7j09k1o2j19P4N1L1j38K36j85k06K81N6p2r3j8Q5O6R6q0j28N9j26l5
$$ plain form
3811 54 35 100 181 90 111 -154 -79 -153 -127 -33 -111 104 123 50 64 167 -6 13 216 -83 50 11 114 -62 72
3836 72 -30 -53 -37 -207 -89 53 43 -50 22 97 -23 -114 53 52 34 -52 -64 162 169 90 145 -291 42 -89 -73 -26
3862 -26 -58 -21 47 -65 -106 -36 164 110 -78 -138 25 -144 -101 -46 5 -49 -101 -77 -60 -4 -137 84 13 -4 -70 -61 143
3889 143 -25 -4 -134 -197 -41 84 -56 108 79 -143 150 114 -32 102 -149 -54 -203 -81 43 -96 60 -95
3911 -95 -65 -44 -219 -5 -48 -69 146 -53 -155 143 6 0 -37 25 -272 70 -91 42 15 -105 37 -21 40 -61
3935 -61 -15 61 -23 -161 -10 69 125 100 45 39 52 -151 177 -26 -80 -41 -33 -44 68 -60 -76 -64 21 -138 18 15 -38
3962 -38 9 -107 86 -20 74 -313 -32 -28 -109 53 -26 -144 109 95 81 139 -60 -50 -77 137 83 84 4 -10 -75 32
3988 32 98 185 76 55 -7 -126 -52 -1 30 -108 128 -57 -263 18 74 2 -91 -109 -24 42 138 58 -70 -11 -137 -172
4014a72J67m3Q7j13P7N7j54J51j49j05K44N8J66k25O3k43J78j35l3K01J5L4L7
4037A63k93L8J76j19n5J05q8Q5M4J73j58j39R7Lk2N9j37oK24j46J06n3j87J99
4061F9j23O5j28J5P9j2K7J19o4l0P2k06J65J54p8j90J10n6J72j77J21j58l8J02
4085A0r1j20J77m7j58K72R6j55N4k1P9Oj58J68k81J65Q6k03J78j53J12J63j83
4108dl4M8m8K90k37l6j00M2O7m1Qo0OJ06oO2j04p3P2L2J45k16n9J24Q8J6j47J67
4136A08j10r1J59k52P4Q8J64k88O0n7K03J53r5j24P9j29J49k36Q5J01J55j52Q5
4159A29j31M2j44J01J60l08J04pL5N4j34j2J36P2R1k00k16J35J31M3o1j72L03
4182A51j17O4r1m3j83J44J87q3j28O9L27k98j56J34j27mQ7j40J06M3J38k05K59
$$ plain form
4014 -172 -5 -48 39 -74 3 60 -94 57 -92 -197 47 105 271 46 109 -134 44 -91 -124 77 92 126 163
4037 163 -130 -92 84 -35 -90 15 -73 12 56 229 71 -68 29 32 10 69 -68 -74 150 4 110 57 -130 69
4061 69 -54 11 -117 -102 -23 -35 -8 111 47 17 89 -117 48 202 124 -66 44 -12 160 -17 104 -54 -92 10
4085 10 -81 -201 -24 -71 -229 43 139 -16 38 17 96 102 -56 112 -169 -4 82 -121 57 -96 16 179 -4
4108 -4 -38 10 -38 252 15 -21 -121 -79 -12 -53 -45 -105 -99 7 1 63 -41 -114 -42 -10 135 -81 -140 -16 72 88 -59 108
4136 108 -2 -93 66 -186 -112 -24 140 -148 -88 -145 58 211 116 -8 71 -58 91 -145 -60 41 196 44 129
4159 129 -2 40 -104 -3 157 -151 -47 -54 -19 35 -99 -111 25 97 188 -12 -228 -93 38 81 20 -152 151
4182 151 34 98 7 -36 -219 -75 112 29 -99 -30 297 -1 -157 -23 -150 -154 -67 -207 -101 -58 80 -125 134
4205A34j23O2j74K06p6r2J84j15N1J69j90N1o0j35Q6J42k28J72l9L9k08K97k27
4228g4Q8Rl13K58K89k99p6J02Q0k23m7K14M2j0K07j10j47J19o6l7K45l05P8p1
4252d7J15J17j87J15j25l4m1O7r2P5J41J5q1q5j34K02J5l2k0J12Nj52N7j37P8
4277e3Q7n1j18J43j58N7Mk24L54j32J0JJ38l11J63J48J19l10K9k8J91j83L6J59
4301G1k22J45j6j65M00j67J1j55R0M0O1m6k75K47O7np6j59J36j11K47j03k6nJ54
4326A38j17n9M16m02J21k7j0n2j78R8J3k0J81l26j6L48o7m8J19j37J85p7m4K0
4350E9j22j8J0M1l9j3K18k76R4P4NJ5k8k68K97o2R6Jo2j23r5J56p5J88k48J12
4376f3J39K0n3p9J56q5J2j6Oq5j67K27k31K81j21J85n6j00O1j4n9k8K6l4J21j25
$$ plain form
4205 134 11 73 -101 105 29 -63 121 6 57 226 36 87 27 -108 -22 120 -108 64 25 64 -144 153 -74
4228 -74 14 23 -290 -32 257 -42 -118 -16 64 -159 -206 8 50 40 247 137 -10 109 43 6 251 -54 24 -47
4252 -47 68 185 -2 113 -12 -46 -87 -20 -112 -37 104 119 38 -47 -181 21 36 4 -16 96 101 -51 6 -131 -53
4277 -53 34 -17 -135 8 -150 -93 -89 -313 41 -91 -81 -80 58 -253 -90 58 177 -133 -104 -132 59 -124 -88 71
4301 71 -151 -6 -22 -187 213 46 57 -98 -8 32 93 47 -228 19 86 81 5 -154 -18 -129 118 15 -11 -16 138
4326 138 21 -38 378 -24 97 70 60 8 -170 -72 -59 -79 102 -224 -240 108 41 -7 112 -25 160 83 39 59
4350 59 -63 -81 -71 -30 -69 -82 136 -140 -46 28 33 48 20 -248 49 -13 83 84 22 -101 -196 -40 -115 73 -175 -63
4376 -63 76 96 43 -36 120 35 47 31 37 -48 -215 12 -219 62 -59 126 70 -30 31 17 -42 -70 -44 -78 43 -82
4402h2j08K22j01M7j4j23O6l2J05k7J58o4j44K47j03l0k1m4J39j03M2%LR2k33
4427a08m5J83j4R0j3j80L87k61qO1j14n2o2j0J29K09j39l1ORr2j4n9R4J64j01
4453B9j01OJ8J12j66Q7j47J41j41K67o2L9j29K21r1r5JK3M8j04J25J2j56J13L1
4478H1P9J2j03r1N2LJ8j40K6J60r7m2r6K31Qj69q1K81L8k68J44J17k35J70k22
4503a24K06%o3M7J07k20J15RO5k08R2J3j35L09l68K51j90N9K14k72N1K33l30J38
4527ao8K06p6k8J23j45Q1j60J92j44J14Q4l40J86P4k31J44j23J39J31j56k9Q6
4550E9l5N0L9j3j93J28J39m78M13j22K6M5p6r1J22j04Jj9RK42j76m2J52j17J8
4575b3L7l3p1R5o8J59j28J5J9k15J87j60j4K18J66k41K06j66L0J2j6J56n8j40
$$ plain form
4402 -82 -190 32 -69 -22 -36 -159 -93 -125 -20 -47 111 47 -97 150 47 17 -4 -48 91 -12 30 30 33 125 -108
4427 -108 -153 30 16 106 93 -87 300 39 31 92 -22 -74 -136 -146 -17 192 53 22 28 37 -55 -69 -128 -34 130 29
4453 29 -72 -66 -48 64 -102 -15 -162 -21 -162 105 43 82 -47 174 83 -12 -11 12 60 -44 81 93 -63 50 81
4478 81 160 172 69 -22 30 33 51 -89 -63 97 0 -42 -138 93 101 -68 -149 132 170 -98 46 163 -72 98 -124
4503 -124 82 82 19 66 173 -47 68 77 142 -66 26 39 -96 213 -155 96 -94 -35 179 -93 -42 191 -139 -1
4527 -1 -69 137 61 33 156 11 92 -68 124 -20 94 178 -162 24 98 -133 11 -112 27 158 2 -27 59
4550 59 24 74 113 100 -93 35 174 -304 109 -13 13 58 -18 -109 13 -91 -90 -109 -100 142 -34 -76 76 -41 -23
4575 -23 14 -19 -90 5 -63 96 -32 -17 2 -213 -26 -186 -200 18 184 -57 149 -17 13 25 9 165 107 -33
4599c3J6j0l2J60r4J24n1J4K40l58J20j39P2L7m0J3k33J0O5n2K75j48N0k04K84
4624H6k84L82j72J80m0j99r8J65M3J12j65m4O7j7j08K71l00N5N1n4O4L8r5j77
4648b39K17Q3q7M2j51Q0P7Pj54K41j9j41K05k11J55j9L7o4l2R7j22j21m1J16O6
4673B2l2q8J98l4M3j51O1J37j75J08r6k6j56J36j03J11K5J0R3K2j18J36j98N2
4697b3J87k59K41j24o7K34j66L1J52k05L9M8l0j47J56J43k32Q2l2J01k07KN4p5
4721i7J35K2k4L0k15K05j18O1j93J09O4KnJ20o0j54K34j17j45N3O1r3O4j61J79
4746d3l9p7Q3J06J05j41q4P1j11J68n7J12q7P3p2J61j61n9o8k6K69j54OJ30n2
4771E3nj24J43k0RPj92J79j41j33K07J16j10j05J15J71j97k29L29M7k51K15rJ3
$$ plain form
4599 -33 -17 -27 -59 101 7 131 80 94 334 -24 96 -43 29 66 26 39 -194 -184 -119 -171 104 -44 6 -198 86
4624 86 -198 184 12 192 152 -47 -145 20 63 175 10 -34 33 16 -92 179 -121 -66 -15 -69 -5 33 -62 -239
4648 -239 -22 61 -26 16 -135 -55 22 29 -125 116 97 -44 161 -50 105 86 123 59 27 124 2 -119 -160 -44 22
4673 22 -10 -98 100 66 109 -42 19 156 -19 89 -7 -33 -189 -53 -156 -45 -20 -10 83 105 -13 123 -75 -23
4697 -23 164 -95 146 22 -45 189 23 54 206 1 40 88 58 -89 67 210 -22 60 28 129 -78 -76 -22 -97
4721 -97 38 60 36 66 -149 56 -62 -1 -194 -85 -21 -19 -24 96 36 -118 116 -1 -146 -93 -32 -125 -61 -222 -43
4746 -43 -82 -159 -76 30 135 -6 -90 -19 -130 38 -19 93 6 79 7 168 7 -52 -120 -146 123 -31 -25 105 53
4771 53 48 -76 67 47 56 63 -129 50 -91 -224 -17 99 -11 -116 -1 170 -27 -256 73 120 -131 84 75 88
4795H8j7k47L30q3j46J66j95J89L4K5n8j10J19j92K10j41p2jK07J17j53o1J7K05
4819B31l42P3j00O4O7N7n3J54j29j29J50k34L79k67J13j45K4J87l2m9N1km7Q4
4843A05o8j63R1J33K3j33K52l10O9o1J52j01j32J31j71K73k69K09J9l3k17K99
4865I8j61M9P6qJ05j02J34k42K02o2q3L7r7J01n3JK15p4j01K7q1N6J4k88J72L3
4891c2J87q3k81K05L7n1J6R9q4j03J23K00j40m1j17L6N4m6J00j02J37j1L2m7l5
4916E3%o4j34J10j51k8K38L9k1j49J21j35J46J61j40j88K38j62K14J6j22j61k28
4939c47M58j33j43K10k9j40J90l5K1j8j13P9m5kK40j52j18jJ69m1k06J3J04J19
4963H0n2n6l0J48l8M3L1j07M4j33o1J15r2K71k14J69r0Q3n9J3m5r1k1K43j26m9
$$ plain form
4795 88 71 -176 154 71 -75 91 -104 85 119 144 86 -24 95 -97 113 -28 -100 -101 106 223 70 9 26 231
4819 231 -111 -38 -138 -74 -7 50 -3 151 22 -107 43 -191 188 -79 34 -111 -87 100 68 19 70 68 21 105
4843 105 37 -126 -35 98 121 -12 240 -70 -1 -62 90 -11 -143 -12 -183 90 -179 30 49 16 -201 98
4865 98 -63 -14 62 54 159 57 191 -51 151 89 6 43 -54 47 -6 -5 210 136 35 62 -19 37 51 -237 -65 -32
4891 -32 155 72 -209 -4 33 -18 -2 97 13 -90 33 233 93 52 -65 -29 25 -21 79 -23 114 103 135 88 53
4916 53 53 -11 -145 -35 -186 -214 24 63 42 -107 14 -121 25 186 46 -142 96 -66 148 164 42 -119 -347
4939 -347 111 -22 -165 45 16 -124 66 31 52 34 -79 0 -45 -47 193 41 -77 -78 91 50 -156 -143 -39 80
4963 80 28 -28 -58 90 52 95 126 19 63 -70 -131 -16 -108 163 -51 118 28 111 52 65 20 -71 -92 151 25 -24
4989b4O8Jo0r7N2O7M9o0J17k66J17K16j80j25J2m4J56J13j04j68J6k5K54j23%
5014c8J5J35j89J70j63M8J0j22J64j4J41j49P5j49J34j55J57q7L0o7M0j7J50k72
5038a53K3J71Jk2L5q9l8k0N7K4qm5J62j30N9j41J18R8n7o2j33K36q7j07J4P1j4
5065c7K07j05j57N5m1J25j93J20m5J48q9j53K03l26K69J00j5j61K9J68L8j24N2
5088F8j92N9J84j76Q7n9N9n3j69L88k31J56j0p4j5Q4q2l9q4K16j58j7R8p9M7O5
5114G3o0O1j36N7K09q2Oj46n7O3P2q9j3J18j26J12j26K1J40j51l0M2j0J48l0n
5140F1k6n0P8p7mm5J69K3j97n7L23l53K43j84J16o7N0k45j35M31j81K54k65K63
5164A25j61J2j90K25M3K42n55K83l5J41k33Q8K6P7l01K19R8jm6r5J99L0j84m4
$$ plain form
4989 -24 44 45 -15 -112 -60 7 56 -4 113 -153 -36 180 0 -125 -113 -157 -1 112 8 -160 -144 -169 85 -38 -38
5014 -38 -23 112 -77 93 -70 -22 -12 -134 30 16 157 8 83 -66 68 -87 70 -17 13 -54 -14 -31 119 -153
5038 -153 -130 41 42 20 55 -34 -72 -92 -35 -11 -19 -64 98 -32 27 -114 4 102 45 -17 -150 86 -1 -108 -94 -23 -37
5065 -37 170 65 -92 -37 -78 47 -146 -26 -71 77 -12 -165 38 -288 -19 81 66 -95 -66 102 140 16 68
5088 68 -124 -65 119 -57 30 -29 30 -23 -192 196 -35 121 111 37 22 106 24 -15 -99 117 -41 -58 40 -39 8 73
5114 73 13 74 -62 -5 204 122 128 -18 -75 -12 60 -29 -42 76 -50 62 -64 -43 97 -54 -84 -42 -52 96 66 61
5140 61 35 -15 63 -14 -18 -63 106 129 -68 -125 198 -155 88 -96 20 -47 3 -242 -377 54 -127 127 -138 125
5164 125 -36 -24 -214 11 54 296 -259 24 -11 130 -103 -15 11 88 -213 6 104 103 57 -38 161 191 7 -37
5188c7P2P0lr7J10q5j59J06o9J23p5l14M28%l2o1qj32J49m6P8n0Q6j34J26j37
5214i1K51k6j39k7L1Q9j28Q9J80k69j11Q6Q6pj00P4L7J46j04j09j5k6J64k17J58
5239B2R4l67R8J05K9n4O8P7q1l8R0K1j1m5p9N7P9n1j02J14K7j5J20j20r9K45k46
5266f2Q9j08J08N9n1LQ5q3j3K0j16K34j22r8M9N4j8r0m0J45j23J08O5j20M9K5
5292D9l3P9j19J22l18K47J73m1p8j20J9J5O1N1j57m3P8M3j4p2J08k9l20L24K20
5317B45j81R0j46J49j55o7N4J69j25k05J91P9j99K47r1n2o9j16K63L5j74J62j51
5340d7j95K34m9J26j25P6o6k11J84m3K97k45P7O1RL0j13J9K1j10j22K64p0n0j71
5365b19J28l0J51r8L9J38k51K28j87J56p3J24j77rK95k77K24k51K54l69N5L77
$$ plain form
5188 -37 35 105 102 5 115 30 -129 -23 -92 31 -44 -358 70 70 38 -23 -31 -163 -14 -60 18 -32 54 -80 46 -91
5214 -91 160 134 -5 -32 -1 88 -40 49 229 -40 -151 -65 21 14 -86 -12 25 171 67 -42 -57 -83 81 -136 22
5239 22 116 -251 -153 -48 -19 -73 -5 72 -9 -47 43 64 53 8 -71 -14 65 14 -88 26 53 38 158 38 -61 184 -62
5266 -62 27 -81 27 86 35 38 123 40 27 47 -69 165 43 -55 -6 48 30 -60 -100 45 -78 30 95 -25 24 49
5292 49 16 95 -24 98 -220 27 200 159 81 -39 -20 -5 56 107 -50 -93 -15 28 14 -58 50 21 -299 25 245
5317 245 64 154 8 157 2 -65 -11 158 33 -172 19 98 -101 146 55 3 -66 -182 81 116 -58 104 -47
5340 -47 -242 -8 -57 69 -56 20 -46 -257 -73 -116 181 -64 13 74 83 113 0 19 40 -70 -192 72 2 -48 -219
5365 -219 -91 -121 30 -68 -29 109 -142 86 -101 55 -18 106 -71 -80 215 -62 162 -89 165 -204 -149 228
5387B28k05j4o6L1PR7mK3p8P3j60J41j43R5Q3j09j5j43L55l21Mm3J29k04K04j68
5413b03R1J38r1O8j50J03Q0J64r9q6RJ63l70K48J4k0j01K48k84K37j05M5k41P5
5437f7J31k28K37o5j6q4J05J29j63K3j26Pn1J97J76j98j12J06j90J97J34j14n3
5460b5l8JM0q5K53j06j90J74J1j6J03j55J6R0j58K89j81N5k80K13J32j58KO2M7
5485I6Po7%n4O5k8J30q1j13m8J84J30k18Q4j85K3L2P9n5nl5K21J9j57P3pj54M1
5513b3K9m5r9P6qN5J75k19P2L0O4o0mL5J65j81q6R6j63l2J16j03Q3n2j19J81j33
5540a50R0OL4p9k7O3m9L8%q2J85J41j00j37k8R8J01n1n5J22l86K11K02j40j69
5565a62J17p9J29P7j03J26l58L58n9j51K67qj9l8j07m8J21R8M2k05J47o1k5j14
$$ plain form
5387 228 23 9 -57 -26 -19 78 74 97 19 92 -68 73 -70 25 108 -1 -16 -159 196 -125 -121 -164 -35 -239 -35 -203
5413 -203 -112 26 -65 3 -147 -44 36 200 101 15 24 187 -183 65 79 59 -42 206 -78 159 54 99 -142 -67
5437 -67 64 -164 73 8 -8 -92 13 142 -21 2 -124 -117 -168 29 205 7 -105 1 -189 8 142 28 -25
5460 -25 -63 -62 -22 -107 146 40 -150 24 35 19 122 -33 -17 73 -85 204 23 78 -202 11 143 -15 -13 49 96
5485 96 103 36 36 -18 47 19 149 68 -45 -93 91 221 3 87 -98 -75 -43 36 -19 -24 -59 162 181 24 97 90 -64 -23
5513 -23 6 -39 -138 -62 -70 -15 160 -59 13 43 107 47 43 78 243 62 -24 72 -91 -123 -7 -110 -27 -79 -198 -17 -150
5540 -150 -60 -54 -20 -99 -126 -63 -112 -74 -74 -156 29 170 70 -67 -95 3 104 53 -2 120 -266 -55 147 7 -162
5565 -162 -45 -124 5 82 -21 105 -253 105 46 -105 162 154 135 97 -10 -58 63 161 203 -2 145 84 59 -55
5589e5rK26k14Mr0P6j6J8r1J47j4J30M2j18J25o4M5j83K5J8qo0P7m9J07j43Q3
5616Il9K01j51j8j06j18QK25qJ20j78K68k30oM6r6J02L4k7j03n6J42L9r3j32O9
5642i8j58K09J24O4j84J09k2j34LJ06N4j31J11o3K07j91O4j20N0K08k8j06q6p0
5666h2qj87K07J40J35N3l32L4On9K39M7l95L23kK8j26p9k0P1Kj14J42m6o6J08
5692A9n7M3j26J06L5K31k08r1L5l4J20j90J94m5m1kJ16n4p5j05J87l40K42l9%
5717g9qo4mL26j62o2O1j08K33m9Q6j39J1J29r4j10J27o3j31Q8R2j99J42q4pJ23
5743E5k7O0J9k36J78Q5m72K86J6j7J63j21j36P7K3M5p4K92k13m7K04O0k92K27
5767A55J1l23J37N6qj40O8K1j06K51j35K0K1R2l34J52R2L8l9q3K5o0J80j13Q1
$$ plain form
5589 -55 -64 162 -52 -48 -138 -62 -78 -60 -151 -4 -18 112 154 36 161 97 142 -41 -16 2 -6 -66 11 -38 69 -74 9
5616 9 -30 171 20 2 -104 -222 -214 11 3 123 -55 213 -17 -23 23 -73 29 63 36 -67 -123 19 58 -35 -167 -98
5642 -98 -256 -47 77 141 -43 66 44 -90 -87 19 73 -58 53 -10 197 6 70 -50 0 208 180 74 -12 -82
5666 -82 -90 -277 -70 70 205 258 -74 -40 -34 -93 146 193 -202 121 119 147 21 -58 -78 -7 -5 -119 23 -23 -89 19
5692 19 -38 5 -121 -15 20 251 43 -48 -13 -47 73 -117 77 32 -9 -11 105 51 -24 -129 58 -282 -40 -79 -79
5717 -79 -87 -151 -155 171 9 -53 8 -100 133 84 170 31 42 171 77 -33 94 31 -100 -12 80 -119 23 -61 -68 55
5743 55 28 88 107 -129 49 134 -338 -52 -36 -53 110 -11 -147 -70 -47 -2 -76 216 3 -44 160 220 -72 155
5767 155 166 -157 -20 36 28 -112 -44 -23 -129 122 -13 7 28 120 -214 -62 30 68 29 -54 -29 -89 91 -22 59
5792E9M0j64J6n8J46R0j75J49J00o4k23J66n2j04pJ08j74K01n1J85k03KQ3p2j41
5817a43K06L0k54J93J3Nj46J5r4L51l46K10J0j32J22K0j32R0ol5N7k0l2j0K2l0
5843c6O1l88M88l4j33M8j04J09o9P1pj09J79m7k9N3q5Q4L5j90j12J62m4J15j52
5868a34J09J37k30L96l73qJ01J46q7N4j66K2M7N4Q7o1j77K48j94J7k2M0Q9q5m1
5893c1K7O6l5J86k04j17N2Qj03K55j80J92j49m2J60J60l89J50N9k22j13K74r0
5916h6q8J69j8p0j7K49Lr5L4l8j34o0J39n4J24q2N2q8K35j42J33L0k15J08p6J81
5942A94l8j46J0j5R9j72K73j22k39L1K01l5J12J8j71k5j02L0J27j85J19m3K23
5965A44q3qm1J7p9p1J12J23p7j56J1K13l07R1K03j45r1J88j3j39J48J20L6k00
$$ plain form
5792 59 99 -65 -49 -107 39 129 -46 103 203 139 -84 82 30 -74 -81 27 -147 54 3 188 -15 -13 70 -2 -143
5817 -143 63 93 -161 32 45 50 -96 -81 -175 176 -170 40 50 -82 40 60 -72 18 12 -23 34 14 -18 -28 -6 -36
5843 -36 25 -363 125 91 -42 6 -98 11 -58 13 6 -103 76 29 0 53 -32 52 87 -103 -215 -53 -97 18 -134
5868 -134 -25 112 -118 278 -95 -103 -2 144 57 111 -55 -33 14 68 155 94 -83 165 -29 -12 -34 6 95 10 -31
5893 -31 -4 62 27 213 9 -108 -56 -48 -151 104 -76 116 -33 -75 85 245 -144 6 65 -157 -270 4 -86
5916 -86 -174 -5 -23 -93 -110 139 142 47 81 43 -91 -151 -12 -66 58 -24 28 -60 175 33 166 196 -19 89 13 194
5942 194 156 10 20 5 104 -68 205 83 -156 -125 76 41 153 171 0 -25 -127 -97 30 -155 -36 -79 144
5965 144 61 53 12 29 -50 -121 -9 114 37 -119 -108 105 -202 -111 92 -53 -144 44 31 -108 40 160 196 -4
5989doR7l4oMj76J62jj40J61k74J86pqJ08J55k22J02o1Q6j27l9l3L7k8Q3j20L6
6017f9R0r3L8l7J83j27P5Mm5j14J4j97L00p2j90K84p6J25m1r8j8J37k7P5j25J3
6043Ik6K68j34j23J55k28K1J95j34J04p1j46J84j41J36o0oPl3J5P7j67J69j00
6067b9l2O7L7m8j37K66r4k58L57r9j30K8J6l5LO3J45%l10L78k48L6r2J27l03K54
6093c8m4nJ39M1j97N1J65p9k7K5o1N7%j34K43k09P1q5N2j11P3J89k46K75k07l8
6119a00J18j44J57j28J33J49j55k6j75L19j47k40K43m3j07K45N4j43L9L8j39j1
6141f3M2l2O6N4j92J03oR8k46L50r8M7j16j43J99j25K06j12L3r2L1P0j04J82k91
6166a39M5J45m2n5J8mM1K7K4j76J66N7m2j15J7j2m9K38k16o5J25p9p2J75Q3P9
$$ plain form
5989 -4 -10 87 53 47 51 -125 37 36 -104 57 -217 -31 -38 -46 62 217 -5 97 36 122 -5 -44 -77 -40 -68 15 -105 -69
6017 -69 21 -72 -34 -71 112 -15 60 64 19 -95 -81 -278 22 -50 -240 44 -32 93 52 -46 -64 73 46 121 -4 9
6043 9 -17 251 117 -6 149 -79 -58 137 3 107 36 -110 74 -67 69 9 3 10 -23 -8 69 -98 71 -29
6067 -29 -61 6 43 -5 -142 124 30 -228 129 30 -100 -72 -56 -91 -88 -25 120 120 -190 188 -60 -24 -116 11 -292 -38
6093 -38 -82 -87 52 93 -104 -53 112 33 6 31 -30 27 27 -107 136 -73 -2 -87 -35 -146 -73 116 -130 145 -62 -100
6119 -100 18 -126 31 -97 36 185 30 4 -171 148 1 -239 4 -39 -146 99 153 10 49 87 -52 -63
6141 -63 -21 -53 13 67 -125 -22 -28 70 -176 174 76 123 7 -136 63 -62 144 32 65 -27 4 74 -30 152 -139
6166 -139 -94 51 9 -46 -28 -32 9 36 60 -116 50 107 65 -50 -33 -45 -94 144 -72 -137 -12 -91 -163 12 95 174
6192A74j37p3P2m0J33j42K77n5k03R0K14l63O2J7m2j20K98j82P4q1P5L8j32K5
6216b1j25K30j33o8M6Q2k6J08j32J66j79O4j9j84K06O7l6r4R7j04j22J4k6O1J10
6241a8k9L8j81k7J29J1Q5m5o5J28l4j12j6Q1P2J26K8L8j38N4j62M4k2o7J73k05
6267a14J4r4K20OMJ70k77j88M21r2M7k38R1M7K4q4n8K32j36J7J60j17j00Q7l96
6292c54L72LM4K7j55J26j53J65j20L2J19j78K25k41JJ72k72J82P9k4P9l04Q6J08
6316A9j82J54O5j88J86K1j02j12J07j08RJ09J99j88P6k98J50K08o2n1L4m4j16
6339a14J36K2M1J6j2N9j20m9m5L0p2M7R7n2O6JN6lj15j6p5M1J99k19N6nL1Lj26
6368a22K07R9k35k43K01J07L5K53k86k57R3j8J42N4j03nL2J22k31K44o8l9j30
$$ plain form
6192 174 37 -36 36 -4 129 -13 264 209 6 96 310 -53 9 26 -16 -136 162 -20 54 -27 48 86 -46 -21
6216 -21 -146 84 -49 -117 -71 11 -15 93 -39 127 -52 12 -7 -191 15 82 46 -48 49 -55 -177 -163 -189 -128 -18
6241 -18 -47 -9 -190 -217 -88 -77 8 -37 -102 26 -8 -120 -136 -55 17 143 171 209 71 125 -37 7 -15 -82 91 -114
6267 -114 -100 -194 26 32 36 206 -71 -259 162 70 117 -121 -30 17 41 -43 -101 131 -5 12 172 55 -45 42 -354
6292 -354 18 21 65 92 -63 63 -90 75 -45 -13 106 -72 153 -88 -87 85 -187 -5 74 50 129 -175 -89 19
6316 19 -163 -9 56 -132 54 75 -27 -139 -32 -140 -131 -22 177 -11 65 -233 -83 125 63 12 46 2 -114
6339 -114 22 44 85 101 89 148 28 -21 -66 -36 -108 -61 36 -16 50 51 107 104 -11 -27 -102 -61 138 -81 -25 -30 1 4 -122
6368 -122 85 184 -51 -294 -93 14 49 302 16 -241 -148 -166 -24 30 -73 -78 -46 76 -155 89 21 -18 -148
6391a48O7J89k02J70j25J55j41j3J32m5L6p6J28j71K21j98n3K8l4N4pK57j07j47
6415c0J03r4o6J50j90K32j08ro8K09j13Nj97K70r9N4N0k29L9r9n3K45P2o3j31
6440a20RJ50n6n0m5K36M7k21j02J01O4K1qK0k6r2j6J68k07J27rp0n8J21k8k9P8
6467Eq4J64j60nO2O7r8k1L3J00J6j73O6Q1p4J21q2j76K73M8r9j68Q2J0k3o1R6
6494@%r5J51r5J21l6o8L5l8l05M34j97L7k0J13j36O2J22l54L16P1%j53L2Q7o9
6520A5j7M5Q7k68P7n9R9K25l1k73m6L40k06l6K07k04K5J5j51J79N7Q%J66k17M4
6546H1k42J96r6l8J9M9K8q3J8J38l9K9o6Q3O1k80m4K71k28K10j17Q6M9k20J52
6571A7Q4j67J80j60j87K52j43K52j67k34L67j29nR8q3J89j56n0J52j38j4O0r0
$$ plain form
6391 -148 -81 108 -94 76 -49 106 -35 -48 84 39 75 -1 127 -44 177 -21 -74 -46 -80 -26 -33 224 117 -30
6415 -30 73 -21 -87 63 -127 105 -3 -12 -80 129 16 21 -176 94 -5 49 99 -130 -91 -190 -243 2 74 11 -120
6440 -120 -111 39 -17 -67 -112 124 171 -50 -152 -51 13 34 26 46 20 -72 -88 80 -127 0 -9 -79 -137 -16 -44 -73 5
6467 5 -79 85 -75 -80 -18 49 -49 -70 -37 63 79 -94 -28 53 -21 100 18 -158 115 163 64 -104 -22 -12 -35 -96 0
6494 0 0 -95 56 -39 82 46 -22 13 -25 -330 104 -93 -56 -76 37 -99 -37 85 -269 47 118 118 -35 -3 84 15
6520 15 -2 43 130 -138 -61 -120 -21 204 173 -100 -146 194 -12 -48 159 -45 -20 -5 -156 23 80 88 88 254 37 81
6546 81 -161 35 -61 -99 -80 -31 -3 -86 -68 70 31 60 -6 77 138 -142 -186 85 -143 67 -50 36 85 -135 17
6571 17 101 -66 114 -46 -233 19 -124 128 -39 -273 94 -35 -40 58 -25 164 8 -42 110 -28 -42 18 -72
6594g2M4J08j09N1k5j01J29j54K52K6j99j9J80q0n1L5l9k6J68j48Q8j75N1M1J15
6619I0Nr9k0j14J36K9j37JK72q0M8p7j44l7J33O5n0J08j89n4l7J84Qj9o8J13N0
6646A17mp1J52k98J36l2p0K6N6l8p1J3j20J68r3J43j29J07P9ro1j38J69j40J26
6671A8K13j84L4j30M0q6J71o0N7J06m1k41O6k8R1J09j3j81J05j17K06j11J7n2
6695a1R3p5n1K93l51M5Q6p1L3j01K06Oj02P4l9j40J02J48q8n7r1J15N3J53j67
6720F3q3k60L72j94p9K35p9o2J16j33J37l6L4Q4k03J64r0pJn9n3J51j09K03j03
6745A0Q2L4j04J06j92J63p2k10L62k20N0oo1Q6j63L48j54j49nJ56o0j7j65J81
6769@k09K59j12J9k6j33K22r9J23l2N7l2Rj15N0N6o4j23J92k4pn2L2R8m7n3K2
$$ plain form
6594 -72 -28 80 -29 22 -3 -104 25 -129 123 149 -50 -69 111 31 -20 15 -24 -50 118 -30 58 -117 -66 -25 90
6619 90 95 -4 -24 -138 -2 27 -110 -109 163 83 131 54 -90 -127 6 71 21 129 -60 -114 -151 33 41 22 -46 67 117
6646 117 113 42 194 -104 32 0 -70 -44 12 -26 -97 -84 -204 -36 -129 14 -115 -8 71 62 1 -137 32 -108 18
6671 18 231 47 81 -49 -9 -95 76 16 73 179 138 -103 -37 -65 26 135 122 -59 46 -71 135 24 41 -11
6695 -11 82 7 -44 249 -102 -57 29 -42 -9 -110 96 102 0 74 35 -105 -3 145 57 0 -91 24 77 230 63
6720 63 -20 -280 92 -102 -181 54 -25 -87 29 -104 33 -3 31 115 -88 76 -14 -21 -20 -79 -132 19 -90 113 10
6745 10 92 126 22 128 -64 99 27 -183 179 -41 9 3 -58 28 -135 213 59 -90 -95 61 1 -16 -181 0
6769 0 -209 50 -62 -43 -69 -202 20 -79 44 12 69 37 46 -69 -19 37 -27 -150 42 18 11 -41 -9 89 42 -11 11
6796A1J37pn4l00K10J09j77K63j27M5j56J33L1j53o3P1J32k09K55k15N4j4j89
6819b13L14j63LL7K49k40j84K58j1q3J09k01P0qL21l12M6J12j81J82r7j04j1Q4
6843b3J49j45J8L1k1l2O8m9P7J4N8j07l8K7n8nM7o1J05LOP5l00N4R5J01m2j23
6871g6J48r4Q5O4k83K07j62J59K24k73J78j47k8O4j79J55p6Q1J9l07J55J30p6
6894c2l1jP5O7n3J11k57J18pQ6j26j1o0J11j5m6j6k62M95l43J63M5k31K37j65
6919a48K43k56K11O3k1K8j2k8k2Kk98J73O0N4k0j00J45K8j49J25NlQ6k38M7O7
6945D2j75M56n23K90k49K4P3j45K56J0jl6j12J27j1k0q5J08k44J97j5O5j3j11
6969i2q9J51K64k01nq1j35O8K44j41K41k30Np8n5J47j41J66J26j68m1Jj33J59
$$ plain form
6796 11 148 141 87 -213 -3 106 -71 192 65 110 -46 87 118 -35 -98 -27 105 -104 151 -64 -10 -24 -213
6819 -213 101 -62 -59 -22 227 -13 -197 61 50 -33 76 -125 -55 -63 258 -54 -8 104 -77 105 8 -96 -107 -23
6843 -23 126 -19 -1 30 9 -23 45 -4 73 87 145 38 0 27 -31 -36 11 -50 55 58 64 139 -161 -107 -12 89 47 -76
6871 -76 72 -22 63 127 -156 51 -111 48 272 -1 177 30 2 66 -113 42 -34 47 66 -241 -86 44 -32
6894 -32 -63 -64 11 78 25 136 -121 -3 -10 76 -50 -61 -121 -10 -25 -71 -87 -349 146 -197 -34 11 -220 17 -148
6919 -148 95 -161 50 113 92 120 108 80 58 60 -238 -65 -5 49 29 -71 74 102 -47 78 83 80 166 -72 -25 42
6945 42 -133 323 -200 90 -159 -135 -62 -207 49 59 58 22 -90 37 26 6 -79 29 -215 -18 -33 32 19 -92
6969 -92 -181 -30 234 33 28 -53 -188 -120 124 -17 224 -6 -1 -79 -134 13 -128 38 164 -4 -45 -44 -177 -18
6993a8m9J81Q4r3n4j41J32n1L9n2m3m4J71qk3p4j1J11m4k79K97j80J20K01j82
7018a0j20J57q2O4N2m6l5J5L3q4K89l11J03o1P1j9p1J1l4Pj6pk8L4J00l5k34R6
7046a61M6L3k4J04J16n5J8M3j41nJ1P0j50N4N1n3j16O3J5J19J49k26Q4l5K40j76
7072G4j0r3N8K20k98J87l33J10L23k32M6q3N1KO1m5j79K90j15o0Q8N4k84j4K79
7097I7j39J41o6n3L20k79j53k9J82r9N2O8n8Q4o7O1j08P6M0n5Qj36M4J42m8j16
7123i1P5M0j10Q1J77k55K5J1kJ70k05L33k34j05J1J5KJ40j76J06N3j44J0L8J54
7148A19J3j39J46o7n9J11j10K0k06J55q4R7J1O7j05L8J39j51N7J56j35J02l58
7171a83R6J67k09J36j77M7J22ON1k20J10k8M9R1m6n6O7n4p9K69j00k60K06q9L6
$$ plain form
6993 -18 -67 114 198 105 51 -90 42 -9 30 -22 -65 -109 62 54 31 -43 -54 57 13 -266 31 -149 -29 172 -10
7018 -10 -130 27 -55 9 61 15 -20 -5 28 -56 233 -78 25 -36 35 16 -55 -44 -78 -71 -87 -94 -122 -88 12 -23 -257 -161
7046 -161 -115 -82 -106 -2 114 59 77 120 -21 -26 -15 55 -95 -41 10 -43 -159 -96 -81 38 187 -39 45 10 250 74
7072 74 64 -29 29 249 -49 138 -195 -85 238 6 52 -31 20 22 83 38 -141 149 34 -26 62 116 -168 -182 97
7097 97 -42 99 33 -20 300 21 -132 -161 21 -78 -26 42 -16 68 1 62 -46 30 70 15 23 -113 -69 73 25 -91
7123 -91 -16 24 -86 -5 172 -83 -58 -47 -49 121 -84 249 15 -90 -79 -64 -62 78 -98 8 61 -83 -73 -35 119
7148 119 132 -7 139 72 13 124 14 34 -172 -17 -101 -4 7 74 -31 7 146 -5 52 208 73 175 -183
7171 -183 -87 80 -129 7 -170 -123 -1 5 56 -164 -54 -82 -33 58 12 -44 23 -31 -110 159 59 -201 5 -84 -48
7196d8k1k1J44j10J42l9K7p6J95j70oN7J6j98K28j29K47m09P1N2J37P3j89J72
7220A45n1k15mK12L4M8r3oK33j43j93L13l33j39J73k9n9o5J52K57l96J51q8N6
7244d0NL98k88p7j78O4K99j39j42P3%J97J3j00M7q7j7n6J00N4k74K4J40n6O3j10
7270h7l9L2P1M7r5J2K3qJ11k1j30J57L3r2l4J04j11R9j74K18j36P9n7l3J03m9
7296B3k01J86J00k11J33j2j15N0j78K34j14K09j03pJ15q7j82L74j54m3r3M1K45
7319B10k67J85L7k86K65j92j29K46r4J17j6K8j52MonJ50r9M4p0J16j26J20R5j61
7344A4M7J3k69J19m1jrJ01o4K33k59J77m8KR3j95j37K14j56Q3O4j74K16Km3o1
7370g9J85o9j14J5K7K51l44J19J88k74j4j4K64q5j47l2j3J72L8p7P4J42n0j73
$$ plain form
7196 -48 -69 -90 54 -56 86 47 74 -2 193 23 17 74 90 -108 120 -9 238 -171 -100 -48 89 162 -27 145
7220 145 94 -121 -125 87 121 169 76 70 303 160 -33 280 -53 -192 -19 -48 -107 -172 -20 237 -159 -8 -96 -40
7244 -40 -35 363 75 -2 -180 -116 183 44 -98 -25 -25 172 185 85 132 45 28 -28 72 126 -148 -124 16 -40 23 -87
7270 -87 -126 -94 -23 24 -71 -59 -36 -44 67 46 -84 73 106 14 -20 84 -27 72 -102 116 -20 59 2 -31 72 23
7296 23 -178 8 108 -103 30 18 -97 -47 -225 9 -105 104 1 -6 109 22 -160 214 60 17 -76 -35 210
7319 210 -57 128 165 -121 144 -48 -177 69 -25 92 76 104 -48 -44 -50 -55 95 -4 40 -30 86 -40 80 175 14
7344 14 61 74 -195 -76 -117 -118 -127 -26 -90 143 -116 61 13 15 108 -87 -224 -10 -166 -83 -19 -193 23 25 -18 -79
7370 -79 106 37 -77 -62 -35 216 -128 -9 179 -95 -109 -123 141 56 -91 -123 -136 36 74 -3 71 213 163 -10
7394a0j54K02j10J38q6m9J4m8K5J13k6kj4k46M83l02K59k26K07N8l79M4P9QP5
7419E3j3j12J29j70J47Nj01j3o7l0J22N6m2N6Q9j56J15o3QJ6K0o7p4J01K06l45
7445a30K35j62j1J47J3K36m77N4J86j57O2J5m2J13j91L00l74J40K8K6k1p4P6p
7469a5Oo8R7l6P6NR0k56RM7J87k06j7Q2j51Q6l7K09j26j3p3R1K53l09R6j33K51
7496A45k07J52j29Q2q5k9j7ok2K3Oq1L51k70K14j48R8j83o1J70K4m8o5K02j08
7521HO2p9O8j43K57k29Q2j6J8K0r0J12J30j27n6J07j58K9k1J71j08j68J35j05
7545a01J93j02p6j9J95j2n2J4o8L5o1J23k10K25J35l62K38o9j4j35J20L1r5q3
7569a50J91k08J33J5L2k69J71M5P7K1Jk77J44r7P7K3j4R6j76P8j7J07j71J03J5
$$ plain form
7394 -10 -164 38 -72 66 -20 -69 -55 -103 -78 35 9 7 -7 -253 230 -72 187 -39 168 226 -153 -109 -30 -22 53
7419 53 40 -72 57 -113 34 39 -62 -75 -142 -172 -50 6 -36 20 109 -47 68 5 13 29 49 -18 -92 9 215 -130
7445 -130 105 -57 -68 79 92 328 -149 -95 91 -66 -4 11 -31 82 -109 191 -183 -43 -15 11 -10 -84 -8 -15
7469 -15 -9 -77 20 -16 60 65 155 -101 -92 -45 142 -64 -81 1 -150 -64 -101 108 -18 -31 -104 -13 240 -69 27 -106 145
7496 145 -62 90 -39 43 -42 -71 -88 -94 -116 -93 -87 -168 183 -87 127 -21 77 -106 -167 3 27 -21 -86 116 8
7521 8 70 -9 59 -84 173 -56 26 10 28 48 -42 70 200 73 17 124 -34 -5 -26 145 37 -131 4 -101
7545 -101 92 -10 -86 -105 90 78 26 40 -28 7 -54 69 -141 84 219 -143 95 26 12 -123 -3 28 -67 -150
7569 -150 41 -167 -34 -19 13 -256 -85 -40 37 58 59 -218 -74 -171 -94 -71 -85 11 -165 -87 -104 3 -168 -65 -50
7594e0K4J56L3l09J52J04j6j12K53l10M8j2K7R5N4n7p7%j9N5r0M9KJ80j43k0q6
7621f9M1R8J5j65Q2l9k72J13Q3K40j96jL5J02q0p7J78l0j13K4P1k7L1j24j0O0
7647c0l6J80j31o8J99j00q3K00J57j28n8k7k33Q5lP9k5Nj20J15n9N9J10n2ON9
7673A01n6N6j42j04J86J14k89J49m3J5j29j7J63j22J81j27k5RJ12pJ22j51M6k18
7697a76K40o9j07J62J1j41J42j02M1O5j54J50r9P9Q7p6k6n5k0j37K80k31%J8J18
7722@l0M4j29J80m4j52J98k98K22q2J53k53K33n4K3p0jk2j6J77Kj21%P3n7M2j78
7749a60K94M5r6r8J49j92j31J31K00q8l9m5J1L0J6P3k24L05j00k57P6P4j07Q5
7773d8J2r9K84j64K21l03O3L9L8oM0m0Nk5Q8m1j01N3q2O2J06k37M05k60q0K06
$$ plain form
7594 -50 -26 130 163 -146 6 110 94 -18 235 -75 -27 -39 -12 83 137 80 3 3 -16 39 -51 -2 0 180 37 17 -69
7621 -69 -28 70 85 -80 2 -37 -309 -196 -113 127 -69 -70 -35 67 -13 -90 88 58 -55 -31 40 13 44 -80 -90 -30
7647 -30 -66 114 -17 -85 114 14 -69 131 288 160 102 75 -158 -73 -76 3 -22 -17 -137 -22 -81 -22 88 36 42 101
7673 101 45 101 -41 -145 41 155 -134 15 -28 -13 -142 -159 4 -118 63 -64 -89 -80 32 25 147 -4 42 -176
7697 -176 64 -5 -112 50 61 -80 62 -40 1 66 -88 62 -37 42 129 53 27 -28 -48 -185 95 -136 -136 -118 0
7722 0 -30 14 -115 65 21 -131 67 -231 -9 -91 62 -191 42 -12 11 -59 -60 -82 -98 79 81 -40 -40 33 -24 18 -160
7749 -160 134 179 83 -15 134 -58 -189 -58 142 54 15 -30 -19 11 27 100 -124 181 81 -176 -100 -26 -133 -48
7773 -48 -36 -135 149 -15 206 -97 -34 5 43 37 77 37 42 17 105 64 -37 16 -66 -4 102 -135 270 10 -70 136
7799A36r7L6K1j35J02M5o8j77J37j50K53j06k6o4K12j49J3M8p2M3R7j09J02oO
7824I2q8Q9r0q1OQ5k3M6k34L85p2j82M2J15o1J0m0P4j34J82k5k0j14L4Jr8J53
7851E2L5L9k58J26q1k7m4K38k48L62k46m0K37k51K50j72n1O4Pr3M2J45N8n3l10
7876b19K38k1j9J10q8k8j44L45jk27Q5j00mJ35Jj97K79j95q0J74j65M3M0J35j17
7901b0O0J45j96m4J91p4j21M1K11l43J32Q1M9J64l02J71j95J45k12J92q7PN1L6
7925H2N0j37J3Q7k46J77Qj35J88p4l1Q1lj0p6j34K30j22j77J14J11j5j80K71r5
7950b3O1N6j72J47n3m1K9P2j67p0K06j93K22L4l1M3j33j89JK72q1K27m40J65L06
7975B48m09J59r2J11k01J03K70k67P8l3j26K35n9j9p6R7k29J86Oj03Q4L5K4np9
$$ plain form
7799 136 39 75 96 -39 63 108 40 -137 0 -150 103 -3 -29 -93 119 -30 -17 31 -41 2 99 -10 92 86 92
7824 92 4 93 3 -78 -72 13 -10 36 -198 187 115 -67 -25 90 29 39 -1 73 -61 121 96 76 -38 -4 -3 -101 52
7851 52 87 126 -132 -6 -87 -114 -158 80 -168 194 -52 -92 145 -106 144 -28 -79 -15 -8 -101 -59 86 144 91 -219
7876 -219 19 -2 -21 89 1 -27 -171 174 173 -54 31 -69 -73 62 63 -134 145 -50 -130 44 -121 -78 -38 97 -20
7901 -20 40 185 -11 -55 136 62 -59 -18 193 -150 -18 63 112 276 -26 145 -50 95 -117 75 -12 -5 46 82
7925 82 132 -5 8 95 -151 26 34 -101 87 13 -18 63 60 50 -26 -160 70 -52 -229 -115 -4 -19 -199 72 -23
7950 -23 38 94 -78 69 16 -25 4 76 -91 -161 45 -148 74 108 77 120 -13 -202 -201 71 -10 217 -223 -58 248
7975 248 -161 -2 -94 17 -184 -81 189 -78 0 -33 -159 76 17 -2 -78 19 -210 -24 -18 -121 -37 -2 22 17 -62
8000f2j1Q0j38N7O9k8J58j62mJ69j76K9M5L0Pr3J6j2O7q8q4J00J90o6n2k0k19
8027a98J83q2Q5o4J36L7q5j38J18MK20k73p6l1J29J8k2K34m0j86O0l8pq2Q9JL0
8054B2n9K3n0J54k20J41K54l10Q0j38m5J61o8j04J63lJ29j27P6K3k4j01j09Q3
8078d9N6n8j26K47j91m1J93J19j85p1K92j39O9j22J09m7n4O3l0KJ0k13J52lP0
8103E3l6k37J35K89k76M0M5J76k55J17p8J07M3j63J00k5J5L8m1j18O3p4j13J54
8127d1K10j86Rq2J53j12KJ36j35J07J5k86K07K0k26K40M5m2j36p0P6j5j91K90
8151a2j60K25o3J42k47J43j37K62l02K29o8q9R3j45J41j21K3J06J23n5j56K8P8
8174C8o6L0j6ol6J11p8o4L5K11p0lO2n9r9J39k59
$$ plain form
8000 -62 -73 7 -131 -74 -5 -33 125 -37 -41 128 -48 -19 26 56 63 -30 -14 -26 41 -47 -131 -31 159 93 41 21 -198
8027 -198 -15 -97 -12 -76 60 97 12 -126 -8 -4 216 -57 -133 -164 -35 -17 -39 195 155 -31 29 -9 -16 -98 -9 -8 22
8054 22 -37 -14 -64 90 -130 11 265 -45 35 -103 -148 13 -55 -159 4 1 130 3 79 102 78 -23 -132 -49
8078 -49 7 -51 -177 70 -121 -162 31 150 -35 -106 186 47 116 -6 103 56 2 65 35 37 47 -166 -14 -17 53
8103 53 17 -220 -85 204 -72 -32 13 189 -66 51 -27 80 123 -40 60 35 50 88 47 -71 -8 -82 -195 -41
8127 -41 169 -17 -8 -90 63 -49 -47 89 -46 61 76 -210 -3 17 -209 31 76 34 -102 -172 -96 -111 -302 -12
8151 -12 -172 53 -10 132 -115 28 -109 153 -149 80 12 -77 16 -129 12 -109 -86 20 143 88 -68 -40 38
8174 38 -28 2 -14 -20 -56 55 -23 -87 -52 159 89 86 148 89 -10 129 -130
8191a30
$$ Imaginary data points
##PAGE= N=2
##DATA TABLE= (X++(I..I)), XYDATA
0@%%%%%%%%%pJ4j4J4k1K8k8L5m2M9o3P1p9R4j09J28j47J67j90K13k41K73l08L46
33A83l87M32m83N39n97O61p36Q16r02R99j107J226j359J508j676J872k099K362
51A252k678L062l540M158m992O181q026J1315j8951O8529L0882j30992k0357K6350
65c7807L6540M5751M0083o9461r5627J0627R3205L6672j8955l1036m3341l5346
77f8695M9116Q5363M275p4010m4963M686K6896M7462L7365l8353p6201j7381M9119
90a5321M7601J8136j9167n4511l9872L0253O3544K3115k8338m5647l2303J3821
102c8689N8339L8093k8316n4231k3692J5257M1578M1112o691n9083m0313K2972
114c3664M6050K5018j742l2237m7886n011N3700M1781j4435l5090k4540j0888
$$ plain form
0 0 0 0 0 0 0 0 0 0 0 -7 7 -7 7 -14 14 -14 21 -21 28 -35 36 -43 51 -58 70 -77 90 -100 113 -128 145 -163 183
33 183 -204 228 -255 284 -313 348 -388 428 -474 525 -582 644 -715 793 -883 989 -1110 1252
51 1252 -1426 1636 -1904 2254 -2738 3443 -4583 6732 -12219 56310 87192 -43800 -64157 -37807
65 -37807 -1267 44484 84567 15106 -80521 -69894 23311 59983 41028 9992 -33349 -68695
77 -68695 -19579 65784 70059 -3951 -48914 -44228 -17332 30130 67495 29142 -47059 -64440 -15321
90 -15321 32280 50416 31249 -23262 -63134 -32881 30663 53778 25440 -20207 -52510 -38689
102 -38689 19650 57743 29427 -24804 -48496 -33239 8339 49451 42760 -16323 -56636 -33664
114 -33664 12386 37404 35662 3425 -44461 -49472 4228 46009 31574 -3516 -28056 -38944
126c8944K3503N1291J2749m6413m1176M924K6927K8914K0133j9738n3030j9959
138e0819L9136M2857N794j9897l2365k8596J4931N3991K4527l1847l9810j1963
150c4061J1249L2578L4038j1605n1503k5209K5112L4819J7504m187l2407l7740
162d1412Q206M7857K6069j6716k9714k2551l702L0236M0179k493m2403k7191Q697
175b4938K3564K5994J1096k7448m1862j776L6955K6886j228j8601k8978j6728
187c7064K4932M1970N184l0767k6265n964J3477L1029K0588k1563l9941q689K4080
200h993K4650J1276q031l1297k4062J7776L7063J1307j7064k2200j6743K604L0666
213F952K6594j3572l3330j3468R720J9793K1209J914k9387k7819R268K9260J5073
$$ plain form
126 -38944 -15441 35850 48599 2186 -38990 -34066 -7139 21775 41908 22170 -30860 -50819
138 -50819 -11683 31174 36968 17071 -15294 -43890 -28959 25032 49559 17712 -22098 -34061
150 -34061 -22812 9766 43804 32199 -19304 -44513 -19401 15418 32922 28735 -3672 -41412
162 -41412 -33206 14651 40720 24004 -5710 -28261 -31963 -1727 38452 35959 -6444 -33635 -24938
175 -24938 -1374 24620 35716 8268 -33594 -35370 1585 28471 27243 8642 -20336 -37064
187 -37064 -12132 29838 35022 4255 -22010 -27974 -14497 16532 37120 15557 -24384 -33073 -8993
200 -8993 15657 26933 18902 -12395 -36457 -18681 18382 29689 12625 -9575 -26318 -23714 6952
213 6952 33546 19974 -13356 -26824 -17104 2689 23898 25812 -3575 -31394 -22126 7134 22207
226B2207l143j6938k4582o052K7691K8325m986k4781j6904k580J4483K6754R341
239B8835k4593k7771Q34J9746J7893P796j1235k8149j2051K1771K6450K553j4646
252G433j7855j2871Q577K8829J4385j8133k4929o133R415J7969J7178n501k8413
265a0049j6351J4330K2391R068m648j6736k0030K445K6892J6948j0527j9237j1477
278a6981oJ5938K2139J91k4916j7641N863J6392J3499M621j4504k3308k959K1348
292c24J7817j798j2418j5348q063J2627K3557M967j8148j7212k200R291J6885
305I633J1377j1398k3442p030J4806J6216O183n676j7494j4183Q944K2590Q124
318A8650j0609j4259r164K258J7330J5824p049k0799r338P289J2834J1461J216
$$ plain form
226 22207 19064 2126 -22456 -28508 -817 27508 22522 -2259 -19163 -21743 -7260 19494 28835
239 28835 4242 -23529 -22695 -2949 14944 22740 11505 -16644 -28695 -6924 19526 22079 7433
252 7433 -10422 -23293 -14716 14113 28498 10365 -14564 -20697 -11282 6687 23865 18364 -10049
265 -10049 -26400 -12070 10321 19389 14741 -1995 -22025 -19580 7312 24260 13733 -5504 -16981
278 -16981 -16987 -1049 21090 21281 -3635 -21276 -15413 979 14478 19099 4595 -18713 -21672 -324
292 -324 17493 15695 3277 -12071 -20134 -7507 16050 21017 2869 -14343 -16543 -7252 9633
305 9633 21010 9612 -13830 -20860 -6054 10162 16345 10669 -6825 -21008 -12064 10526 18650
318 18650 8041 -6218 -15382 -13124 4206 20030 12981 -7818 -17156 -9867 2967 14428 15644
331A5644j6796j7800M305J9334J0487l498j0552j3745m492J5476J8850j960j6830
344a577j0975K10Q596J4844O510j3992j8297l15J4118J1233L049o856j5886q556
358a7894J2095J8243K446j0916j1359o449M544J6390J0335r927j6825m320P194
371f443J0625R281k666j6124j1218P846J5522N554m073j0248j1278N22J6067J2132
385A5499n749j3667p182Q03R338J3016J716j4515j2800L166J1331Q108K098q152
399C010j3534l283J2952J2539j057r148q873m442O797J4567M466j1007j2382j363
413a0758O778R705O857n515j4696n807R084J1221L162l869r493q807L808J4165
427E835O749o926j0587m548J885R556J0056k845j3410p533N041Q802O612N03q999
$$ plain form
331 15644 -1152 -18952 -14647 4687 15174 11676 1124 -12621 -17113 -1637 17213 15253 -1577
344 -1577 -12552 -12342 -3746 11098 17608 3616 -14681 -14996 -878 10355 13404 6548 -9338 -17894
358 -17894 -5799 12444 14890 3974 -7385 -13834 -9290 7100 17435 7508 -9317 -13637 -6443
371 -6443 4182 13463 10797 -5327 -16545 -8699 6823 12377 8304 -1944 -13222 -12700 3367 15499
385 15499 9750 -3917 -11099 -10296 -958 12058 13774 -741 -13541 -10375 956 9064 11162 3010
399 3010 -10524 -13807 -855 11684 10627 1479 -7394 -11836 -5039 9528 13994 2987 -9395 -10758
413 -10758 -3980 5725 12582 7067 -7629 -13436 -4352 6869 10031 6162 -3331 -12138 -8330 5835
427 5835 12584 5658 -4929 -9477 -7592 1964 12020 9175 -4235 -11768 -6727 2075 8687 9190 191
442A91j1246R88J2188P947k590p401p726k655Q525J1507L57j0703q059O53O145
457a879Q209M279p440j2005j424Q970P941J633m433r070n616O334J1434K922p023
472B832p558l608K671R350O621n021j0569l819M886P262M913j275r291p406L883
487f129R921M350k788o803o307k27R219Q210k733q897m748P81N660P536J345q293
503I7q408J364P592N500N96m756q078k536P703Q267m25o115n559k248L843Q510
519E347L676o683q212r18M484N716M057k842q782m409N532P722J726k828n655
534b069n121J907Q712M745m239o983l175J816N559N758q35q209n194K836O130
549A638L879k34n168o775M9P444N502j429n437m440q87M596P266O57o736n604
$$ plain form
442 191 -11055 -10067 2121 10068 7478 77 -7649 -10304 -1779 9728 10085 -618 -8677 -8024 -1879
457 -1879 6330 10609 3169 -8836 -10260 -1290 6651 8284 3851 -5219 -10835 -4501 6933 9855 2832
472 2832 -4726 -8334 -5663 3687 10308 5287 -5282 -9101 -4215 3047 7960 6685 -2606 -10012 -6129
487 -6129 3792 8142 5354 -1449 -7756 -7983 1236 9446 6713 -2184 -6932 -6151 -491 7045 8390 97
503 97 -8311 -6947 645 6145 6741 1985 -6093 -8629 -926 7341 6916 801 -4758 -7006 -3163 5347
519 5347 9023 2340 -5872 -6790 -2306 3410 7467 4625 -4157 -8566 -3034 4688 6414 3586 -2069
534 -2069 -7190 -5283 3429 8174 3935 -3048 -6223 -4407 1152 6910 6075 -2134 -7328 -4492 1638
549 1638 5517 5283 115 -6660 -6611 833 6335 4906 -531 -4971 -5858 -1262 6004 6661 -75 -5679
565e679N67M094M882K373l928p730j410N745N466Q54l086n322l482L409P633K189
581F575m925n099j839J893N542M403k770p255k604L500M744K822r05n312n237
596f467K186O694L277k303m520l470q1N203N571j274o162l672J373L790M130J126
612E401m857n907N80N369L852k29l000m914j680M374N745P1m362l785j157K522
628a977N177K320l690n454j368L406M218K185k063n522k794K991N631J497k220
643B337l904l041Q82N595L450k724m841k158J548L619L967n17n614l588J951M266
659A228K632m91l263m369k63N053L889j264l603k830n29K791M775Q45m443l996
675c838M73K820L088J632k478m987j583L992M295J89k446l113k343K048N012J881
$$ plain form
565 -5679 -5112 -1018 3864 6237 2309 -5421 -6831 -1086 4380 5234 2148 -3174 -6656 -3247 4386 6575
581 6575 1650 -3449 -5288 -3395 2147 6550 3780 -3475 -6079 -2579 2165 4987 4082 -1230 -6467
596 -6467 -4281 2413 5690 3387 -1133 -4603 -4684 519 6090 4816 -1346 -5018 -3645 145 4275 5401
612 5401 544 -5363 -4783 586 4438 4209 1209 -3705 -5385 -1011 4734 4805 443 -3342 -4499 -1977
628 -1977 3200 5520 1830 -3624 -4992 -1586 2632 4817 2754 -2768 -5562 -2571 3060 4557 2337
643 2337 -1567 -4608 -3726 1869 5319 2595 -2246 -4404 -2856 763 4730 4213 -1401 -4989 -3038 1228
659 1228 3860 3369 106 -4263 -4526 527 4416 3152 -451 -3281 -3810 -1019 3756 4601 158 -3838
675 -3838 -3365 -545 2543 4175 1697 -3290 -4873 -881 3414 3603 1157 -1956 -4299 -2251 2761 4642
691D642l014m060j113J539L514K593j571m335k487K196L777J715r45l319l100
706c968J104M318K460j537l304k270K20K961L789l20l980l032P03K904K673O04
722C325k972l615j92L576K727J38k147l308j145K677L903M88k894k950p99J846
738a342L314J974k353m082r33K292K938J205j148l413k129J910L815J310j841
753A517k542k117Q04L386K443j180l704j669Q95K679K185Q0l384k696P93L021
769E11K152m31k161k741l99L060K947m90k437k187k86J767K898P85k708k916m0
786b676K208K268P97j573k932j063K248K971K85j684k382j171J292K796J606j752
802A238k783q58J242J994J690p13k980j649J360K320J252k98k239k215L62L105
$$ plain form
691 4642 1628 -2432 -3545 -2006 1508 4101 2530 -1805 -4292 -2096 1681 3396 2451 -868 -3968
706 -3968 -2864 1454 3914 2377 -927 -3197 -2977 -16 3773 3453 -527 -3559 -2856 48 2721 3325
722 3325 353 -3262 -3454 122 2849 2987 840 -2468 -3613 -936 2967 3455 561 -2389 -3188 -1342
738 -1342 1972 3946 1593 -2489 -3422 -1130 1808 3013 1865 -1548 -3677 -1767 2048 3358 1517
753 1517 -1025 -3142 -2338 1048 3491 2311 -1393 -3062 -2167 512 2697 2777 -607 -3303 -2510 511
769 511 2663 2232 71 -2670 -3069 -9 2938 2448 11 -2176 -2462 -695 2203 2988 280 -2636 -2676
786 -2676 -468 1800 2597 1024 -1908 -2971 -723 2248 2533 849 -1533 -2704 -1412 1384 2990 1238
802 1238 -1545 -2403 -1161 833 2523 1810 -1170 -2819 -1459 861 2113 1815 -424 -2639 -2277 828
818H28J732q79k231j550K3J901K642r6k699k001M82J736K006N22k085k499l24
835b492K321K135Nj515k181m85J575K539N22j865k202k59J087J937J231j309k514
852a470q36J626J836Q08o99j800j921J104K435J121j008k152r84M48K112J810
868B430q92k332j230P40J827J314k42j772j953L61K091J556n06j509j506m13J922
885a14J934J31j967j489j94J266J872N92j681k048n6J539J243O54q43j999r73
902b133J390J979N83j364j372q07O07J952J295j229j983n85P07J541R86k70j963
919f66j177P25J881P67m20j382j341P5J724J620o20j583j130J60J141J647oj380
937C5j687K07J386J245M24j218j495n26J363J542K15j135j471l16Q71J770N07
$$ plain form
818 828 2560 1681 -550 -2100 -2077 -176 2466 2370 -329 -2330 -1848 -112 1894 2416 331 -2168 -2492
835 -2492 -171 1964 1969 454 -1727 -2212 -637 1902 2424 559 -1643 -1902 -815 1122 2353 1044 -1470
852 -1470 -2306 -680 1156 1964 1265 -535 -2456 -1352 1083 2204 1196 -956 -1940 -1492 620 2430
868 2430 1538 -794 -2024 -1284 543 1857 1615 -157 -2110 -1749 342 1898 1392 -117 -1623 -2036 -114
885 -114 1820 1951 -16 -1505 -1699 -433 1439 2031 350 -1698 -1754 -215 1028 1682 839 -1160 -2133
902 -2133 -743 1236 1819 455 -917 -1724 -1117 835 2130 901 -1082 -1667 -960 581 1567 1297 -666
919 -666 -1843 -1118 763 1530 1110 -272 -1613 -1538 186 1806 1186 -397 -1527 -1367 -226 1421 1415 35
937 35 -1652 -1445 -59 1186 1610 392 -1103 -1629 -266 1276 1491 356 -1115 -1431 -560 1210 1717
954A717j215j731%O83J521N82p94j655o55J267R04O25l31j376j144N63J824P67
972A552p34j365p77M05J166J309l68j420j289O65J216Q63k62r41j357J16J371
989A50J109l20j095r44k46R67J618L8j430q11j09N96J262P47j244j272l72R62
1007c94J256K71m64j512o86P46J772M05q23j192m69L15J306Q48o85j374p46J013
1025d13J005M75k59j077j102O06J269O71m60r70p92N2R93J094p8j365p64L15N66
1044b34J005N55j419r20j3R85J055N8p68j374k06J165Q03K75o54j207k89P30J042
1063E89M58o42j119j84N20R67L46k24j247n50N24J084O89p37p58p08L32J117O44
1082A101m64j004o97L67R85P85l03j038o67K31P15P53J83j013r04j08J216Q67
$$ plain form
954 1717 502 -1229 -1229 -546 975 1557 763 -892 -1547 -280 624 1249 918 -458 -1602 -1039 785 1552
972 1552 818 -547 -1324 -919 247 1556 1188 -232 -1521 -856 360 1223 961 20 -1337 -1221 150
989 150 1259 939 -156 -1100 -1346 -379 1239 1277 -153 -964 -1073 -477 785 1532 288 -984 -1356 -394
1007 -394 862 1133 669 -843 -1529 -783 989 1394 571 -621 -1090 -775 531 1379 694 -680 -1426 -413
1025 -413 592 1067 808 -269 -1371 -765 504 1175 715 -255 -1047 -995 -2 1092 1014 -351 -1115 -800 -234
1044 -234 771 1326 -93 -1013 -1026 -41 1014 1072 304 -1070 -1276 -111 692 967 313 -894 -1183 -453 589
1063 589 1047 405 -714 -898 -378 589 935 711 -536 -1086 -562 522 1211 474 -284 -992 -660 457 1101
1082 1101 637 -367 -1064 -697 288 1073 770 -268 -935 -704 11 764 947 -66 -970 -1078 138 1005
1100A005q6q40p12k84O89J027k9p42p24k75N99R19L60o52r13l10O69R34R1l58
1120C68j026j91K20J221M46p30q62m6q7R93P93n40r26m98K56Q69N88j57r76o32
1140i17K54R33O48m23o10m71k5J043M80j01r78n80K11M57P87J33q84q91K12N89
1160a33P57l2m95o88k24P83O37Ln47n05j73M75N39L46o72o32j80N17N44N69n48
1181C41r96j99M63Q08K97l55p94m31L46O58O27l99o91k03q6P03P40m32n59o79
1201h41L44O45N25j32p45l22mO23N73j03p40m54O6L43Q93j56m81o29l2L71O69
1222D13N7k19p25k04N49N86K21l56p80l20M32Q05K65l09p69l79M24M56N27j57
1242E17q13m23N51N24K70j58o11l48J25N34K86j97m93k21K5O77J55J37p84k38
$$ plain form
1100 1005 919 79 -633 -917 -228 799 770 28 -696 -971 -372 547 907 255 -658 -968 -299 635 726 368
1120 368 -658 -849 -629 592 1038 308 -554 -600 -687 306 1099 559 -367 -865 -609 260 848 691 -285 -917
1140 -917 -663 270 918 495 -115 -586 -611 432 912 811 -167 -747 -536 -79 708 841 -43 -934 -722 -133
1160 -133 624 592 97 -591 -815 -32 605 608 61 -444 -617 -142 397 743 71 -561 -741 -224 320 889 341
1181 341 -655 -854 -391 417 714 359 -435 -866 -520 138 765 366 -325 -528 -614 89 829 397 -162 -841
1201 -841 -497 148 673 541 -204 -526 -530 93 666 563 -177 -631 -565 -222 671 515 34 -595 -627 -256 413
1222 413 470 251 -474 -678 -129 457 678 322 -458 -778 -346 459 724 415 -354 -733 -309 147 674 517
1242 517 -296 -719 -168 356 626 468 -143 -491 -366 168 454 257 -236 -457 -432 245 400 537 -247 -485
1262d85M8M02M43P4o17l15j1M30M62K49o55m21k95O00O75o9n31l26k21L17N87
1283C41N2j02o46j11J30M96L21j85n96k52L74M67L08k53o09m22M53L33L12jp89
1304c79j56J59L99O22m76l38k51J55N16k8J29k17m61j90M86N92j41m87l48M6L74
1325FL37J21l33m87j44L26M96J55m43m44J61K11K44K76p5p80j57K46O08J23l58
1346H9l82j21J46M41M00k29n73j23k9N14L13j65l40m42Q9P39J51l31j30l93k4
1367d00M95L22P8o08j92J4K83M20J33m98l66r1L87K50J86m14l04j77K73N68Q4
1388D43m48j70l03M66L72J74l90m01j40K65L63P5j26k30l25K6N70L50k45n82k41
1409d97K96K70K91Lm13k61J34L17J64k4n43j26n2M72L06k92J88o43j36N98M98
$$ plain form
1262 -485 -437 -35 408 482 -135 -450 -461 -31 431 680 25 -396 -691 -91 584 515 -16 -342 -563 -246 341
1283 341 393 291 -355 -466 -336 160 481 296 -300 -552 -178 289 597 344 -265 -687 -234 99 411 410 -379
1304 -379 -535 -376 23 645 169 -169 -420 -265 251 223 352 135 -326 -516 -30 562 421 -66 -414 -368 6
1325 6 343 464 131 -356 -500 -174 322 477 34 -410 -249 -38 206 482 407 -373 -530 -284 324 447 89
1346 89 -293 -414 -268 173 573 344 -229 -352 -381 133 446 281 -59 -501 -412 327 478 147 17 -376 -400
1367 -400 95 417 495 -113 -305 -291 -8 412 545 47 -319 -410 -23 227 413 -1 -305 -482 -209 359 443
1388 443 -5 -175 -478 -12 360 534 144 -257 -397 -132 231 306 180 -50 -375 -349 221 571 326 -256 -497
1409 -497 -201 69 360 363 -50 -311 -177 140 304 280 -263 -389 -441 31 337 45 233 -410 -546 52 550
1430E50k23l79j20j61M13L35p5l11m13O0J88M03K4k28j17k99J93L37K04l76k81
1451b76j37L24K85K14j11m19k80J59J92N74r2n13q0O1K30M24r9m97l17j0M35K64
1473C31j2l36p8k03L91L44j80l89j29j63K64N15p8j64q9n88N65K47Q3j78k71j90
1495c08J83L50l7n5k43j17R9L40m7L7k72k03J97J93K32p4l64j83J16K43K32j63
1517A56j85k67O7K66J69M8l28q8kJ97N0K45k87k90Q9R3K59Q8j94l04n3Q7N40j39
1541B17j65l66J7%M30Qm9l72JO6L94L8m5k90o0J32O9L33j45k45k70L0K47J94J45
1566C14n87J64k0P7K29j12l9j95k52L60L45r6k86J88j37rM24j21j63j89j50M55
1588B00o9Q1o5l81J54j59L27J03j60j39M2j9R4J84k25K9l78K93L63j50J5k46m6
$$ plain form
1430 550 327 -52 -172 -333 80 415 340 29 -384 -324 -136 267 291 63 -54 -353 -160 177 381 5 -276
1451 -276 -413 -89 196 410 299 -120 -400 -241 -49 525 433 -80 -160 -99 131 555 456 -41 -358 -368 67 331
1473 331 319 -17 -95 -298 93 437 257 -132 -261 -424 -160 355 277 113 24 -564 1 248 331 153 -118 -308
1495 -308 -125 225 188 133 -110 -227 -128 212 165 202 -70 -273 -76 117 349 275 -89 -272 -156 87 319 156
1517 156 -29 -296 -229 37 206 254 -74 -162 -164 33 83 328 41 -249 -160 -67 192 280 86 -218 -271 -184 356 217
1541 217 52 -314 -297 -297 133 141 92 -280 -279 -213 181 219 174 -116 -176 -44 25 358 213 -32 -302 -272 -25 169 314
1566 314 -273 -109 -129 -52 177 65 26 -169 -421 -61 284 188 -98 90 -47 -56 368 247 84 -105 -255 200
1588 200 131 212 147 -234 -80 -239 88 191 31 -108 -66 -85 9 193 -32 -3 -381 -88 275 125 140 -106 -152
1611a52K23m4K2LN0l46J73J87m4j24K16l02lJ88L1O1j70lq6K43k0Kj38j31K3K88
1637A47Q7j54j9k01L9M8M5N7k08r7L4Q0J63Q4J6%k58Q3J79N8j15j09k19Q5K69
1662I4q6J34q8k11K45Q3O2r7l1l82L23q1k1J88n4k37q9L71j74J48P9l11M0J9K49
1687A73o8j1k47K8Rl0N21l99o9K2J26R4Nl09K48j36j08M20j0j74m20M75j47Q7
1711H0K14k39n8n2Q5L2m9K02l41N3j0P9J48k62R4p8J49l0J86j20j3l61K07K62
1735A78m3r9p2j93M1J80J6P5j23j14J20k3J28Q5j80j40J35q6J92j3J49l91J36
1758d2k9K94k5j24j93j19J77Q8Q2Q0j76j09K24j05J38k26J35l09J83J64j13J4
1780IQ4p4n4N6K01Mk42k28J70O7R0lj35j65J25J8K26Lj6j97j61L76q6O3j84M4
$$ plain form
1611 -152 71 27 49 52 102 -244 -71 116 72 -52 164 -138 -141 47 78 139 -31 -34 -120 123 103 105 -33 -164 -141 147
1637 147 234 80 61 -140 -101 -53 -8 49 -159 -256 -222 -142 21 105 121 121 -137 -54 125 183 68 -41 -260 -175 94
1662 94 8 142 54 -157 88 171 233 136 105 -277 46 -35 -56 132 78 -159 -248 123 -51 97 176 -135 -95 -76 173
1687 173 105 94 -153 -125 -116 -146 375 -24 -93 -71 55 149 154 -155 93 -43 -151 269 259 85 -335 140 -7 80
1711 80 294 55 -3 -55 30 62 13 215 -126 -73 -83 -4 144 -118 -24 -102 47 17 203 83 70 -291 -84 178
1735 178 135 36 -36 -229 -188 -8 8 83 -40 -154 -34 -57 71 156 -24 -164 -29 -115 77 64 213 -178 -42
1758 -42 -71 223 198 74 -119 -238 -61 27 109 189 13 -96 128 23 161 -65 70 -239 -56 108 -5 9
1780 9 93 19 -35 21 222 226 -16 -244 -74 -7 83 80 -55 -220 -95 -77 149 152 136 -61 -222 154 68 131 -53 -9
1806in0J45N7j03M2r2P7o9L2j27K0P1l8q3J01K7j71J47K6k2J70Q3q5k60J5pO5
1833c8J75ol33L2J39J94kj63k23J58n3J79N3j06k58L52n4k41K09Q0O5J1k31J29
1857F8N3j15M1j54Q5N9N8J16j85n6Mm1J55op4j38pK05k01M37l40P6j17J49J43
1882B15p8K6k66J98k24K99j07j54J47j40J59j83m0L30l42J09ko8J11K58l39j60
1904b51J90Q4J11j05j01L0k10K50M4J28j93j38J28K9omQ9k02k0J39J27J48k63
1927DMk26R5K24m4m4q7j2o1K14k9J03j61j29l1K43q2J04j49j07N4j05J35J02%
1952A5N1r2l8K26k51O6R3j53O2P2mp4J41r0k07N3L40j32j55j39K2J78K79j02k71
1977a10n1O2J19J02K7l60J10Q2K13J23l61r0k6J56n4J4j01q9J05q1L38Q7p7k24
$$ plain form
1806 -9 -59 86 143 40 82 -10 67 -2 30 -97 -77 -6 -44 -127 -26 1 -170 -23 3 -19 151 234 149 -111 -96 -103 -38
1833 -38 137 131 -202 -170 -31 163 161 -2 -225 -67 -120 59 112 6 -252 100 46 -195 14 94 159 170 -61 68
1857 68 121 6 47 -107 -22 37 95 211 26 -30 -26 -67 88 82 8 -130 -137 68 -133 304 -36 40 -77 72 215
1882 215 137 163 -103 95 -129 170 63 -91 56 -84 75 -108 -148 182 -160 -51 -53 -121 -10 248 -91 -251
1904 -251 -61 23 134 29 -72 -42 -252 -2 42 170 -23 -161 -33 -4 -10 -14 75 -127 -147 -8 119 267 4
1927 4 8 -218 -123 101 57 13 -74 -86 -147 67 38 141 -20 -149 -180 63 -19 85 -64 -171 -117 -222 -87 15 15
1952 15 66 -26 -64 162 -89 -23 70 -83 -21 51 47 -27 114 24 -183 -130 210 78 -77 -216 -194 -16 263 161 -110
1977 -110 -161 -99 20 122 149 -211 -101 -19 194 317 -44 -134 -160 -4 -58 -44 -145 -234 -129 -210 128 215 138 -86
2001h6j61J61J07j6j7J80j43j60L8K95r9k63J6O0o0K70j79L8q0J31l2j5J85j84
2025a4L8j60KJ57p0J2K8j50L2K40P8m9j19%J37k44O0o7K05k66J4K25R3l7j33j7
2051eR0j57N3J64l54J86K9k5N5P9k5m28K53K03L8k8q4l5J30k11J20n2r7R0J02
2076I1k33J97l7j52%N7j13N9J36K4O5m0j55M2R4J10j49j55j15M44k04N1k96k3
2100c02L30R0r3k79M29k78Q7n5K16l6j02MJL4J8j51J41q3j16Q4J43J06j1j23j45
2125i1R4K4Q4j49J40j65o0l1K79M9j32j64M3M8Q8k32K58j03N7Q2o2Q5k02k1L6
2150d5J09l8R7l2j86j61K16l0J66j9kk00J52LR2j26O8k14K01R9j32Mj9k2R9j25
2176d5J11M1k6j30n8J5J80j08j5pJ27K5j75J24m5R4j44O2K9K38m01l5p8J81j48
$$ plain form
2001 -86 -247 -86 21 5 -12 168 25 -135 -97 198 99 -164 -148 -88 -148 122 -57 -19 -99 32 0 -15 170 -14
2025 -14 24 -136 -134 23 -47 -35 -7 -157 -125 115 193 144 25 25 162 -82 -22 -89 116 -150 -136 89 182 145 12 -5
2051 -5 85 -72 -19 145 -209 -23 6 -19 36 115 90 -338 -85 118 156 128 44 9 139 -72 48 -4 -101 -11 91
2076 91 -142 55 18 -134 -134 -77 -190 -131 5 29 94 54 -101 -59 35 145 -4 -159 -274 170 -34 17 -279 -302
2100 -302 28 118 25 -254 175 -103 -16 -71 145 109 7 11 12 46 64 -87 54 -29 -145 -61 82 188 177 54 -91
2125 -91 3 27 111 -38 102 -63 -123 -154 125 174 42 -122 -79 -31 57 -175 83 -20 37 119 57 142 -60 -81 -45
2150 -45 64 26 123 91 -95 -256 -40 -70 96 77 75 -125 27 30 122 -4 64 -150 51 150 18 22 3 -19 80 -45
2176 -45 66 107 81 -49 -107 -92 88 -20 -35 -42 85 110 -65 59 14 108 -36 26 55 293 -108 -143 -221 -40 -188
2201a88K50L2j68p9J50J12k2r4j2q3J5J06L0J35k92K44k71J73k2J1L5j94J09R9
2225G6J32l53R6l3K4n7R5J40q3J1j79K37Q1j22L4l69M46r6m3J96m10K13o2K00
2249A74M8k21M5l1j05O3J65J09j49p9p5K11q0k51J66P1p8Nj2M5k23J9J68j62J21
2274e6o6N7O3M8j14K0Q1p5J51L7j92l7Q2J09k03j49L25k58J21kJ32j75K74N1j57
2299F7p2J16j30J03j73m4J32K7j92R3J75l5qJ50j33p0Lo2Q4k2N6o0j3l8O3J63
2325A80j44M9j64K05j62J20j45j02K18J16k97J03j4K3n2q9J07J48j24q1J60j12
2347e7J05j38lK50j43o7J71J11j80j36O9mJ6r9J96k73O6J92m5k2j9P9m9l2k7K05
2373A66k56J21j02P0L7J39m32K89n9J6J49j71J9j37J16J06n0K4M5j66J55j40J44
$$ plain form
2201 -188 62 94 -74 -153 -3 109 87 -7 -19 -102 -87 19 49 184 -108 136 -135 38 16 27 62 -132 -23 76
2225 76 208 -145 -49 -82 -58 -115 -20 120 37 48 -131 106 187 65 99 -270 176 80 37 233 -177 36 -26 174
2249 174 222 1 46 15 -90 -27 138 247 98 19 -56 155 75 -176 -10 61 -17 -12 -24 21 -202 -183 -15 -177 -56
2274 -56 -122 -65 -2 46 -68 -48 33 -42 109 146 -46 -83 -1 108 -95 -244 81 -177 -56 -58 74 -101 173 224 67
2299 67 -5 111 -19 84 -89 -133 -1 26 -166 -73 102 67 59 209 76 6 9 -53 31 9 65 5 -8 -46 17 180
2325 180 36 85 -79 126 -36 84 -61 -163 55 171 -126 -23 -37 -14 -66 -155 -48 100 -24 -105 55 -57
2347 -57 48 -90 -93 157 14 -53 118 229 49 -87 -18 -22 -6 -105 91 -182 -116 76 31 9 -10 69 20 -12 -39 166
2373 166 -90 31 -71 -1 36 175 -257 32 -27 -11 138 -33 -14 -151 -35 71 21 45 90 -76 79 -61 83
2396H3j27Q1j21r8J69m0K37j26M6k27J9o7K59p8j17R8J66j41m7K13j67P8p9k1
2420gJ2J13k07M8J03j9ol0L2L4j86j5J39m5J38j81J14r2q4J65m8Q3%j82P4J46
2446I9M2J1k90j7P4N4P9j16J24j34%J18o8N5l2j3j00K69k61Q2j05q6O9N4J66J2
2472H6r4mk10L30j40l0J92j64K25l06P0J14j64J39j19K3p0J96p8k4J18p3j1K0
2496B6Lj74o4J47K93Kj99J64k84l8pJ61J27j79j9L6j05R9J32j73n8L30j92J00
2520A28j27Qm4J09MPO4l16J09k6K70j85J01j57K4l4m5L4J12K9q6O5lM0l3j22K51
2547A77l39K02n5N5j7k48J17M7m7N5J07k3o4PJ15r6r1p4Q8J77n7j89J86m6J46
2572A33j2k20k5K54j73L1j8q5J33k0J39k24L21k73J3J12J25k68p9K98j25m0j64
$$ plain form
2396 83 -44 37 -84 -182 -13 -53 184 58 104 -123 -104 -171 88 10 -107 -9 157 16 -31 182 15 93 14 -7
2420 -7 5 118 -89 -41 62 43 37 7 39 73 -113 -128 11 -34 104 -77 37 -55 -139 26 -22 61 61 -121 -47 99
2446 99 141 152 -138 -155 -81 -27 52 -64 60 -74 -74 44 -24 31 -1 -14 -114 155 -106 -24 -129 -215 -146 -92 74 86
2472 86 -8 -12 -222 108 -32 -62 130 -34 191 -115 -45 69 -95 44 -75 -52 -122 74 -4 -28 90 17 6 26
2496 26 29 -145 -209 -62 231 233 34 198 -86 -124 -131 30 157 -22 -41 -5 -110 -11 121 -52 -110 220 28 128
2520 128 1 9 -35 74 78 85 149 -167 -58 -84 186 1 102 -55 -31 -65 -110 -76 36 65 -21 44 41 81 48 -74 177
2547 177 -162 40 -15 40 23 -225 -108 -61 -108 -53 54 31 -33 -26 89 -7 -98 -172 -84 93 36 -153 33 -13 133
2572 133 121 -99 -124 130 -43 -12 -30 -115 18 -2 137 -87 234 -39 -26 86 211 -57 -136 162 37 -3 -167
2595a67J70K9k94J95n0K0q0K57j22lo9K5J70j87OJ39j67J46k3J05j80K6j2R7j51
2620a20K13j29J75k93N3J20k54J24P4n5O6P6j4m6j09J01q5J63N3j87o9j1K71j25
2644hl6j6O1o0R8R0q7P2k34J9J43k6j02K29k30Q0l1k8J62l44J63P3j6m7l0l0K62
2671A27j47PkO3qo3K28j78K5j20K94j32k30N9J37q6J21q5n8O8J32m8j33q2N6J33
2697G8j49J02q3lJ46m9l8j90k6K06L0j03J13l1r2L50k04j85J47n3j11R8N2J70
2721A75r0j27J71J2M3J6m0k75J74M6q9l7j94R1J53n7j94K39Rj29K48o1j39R3J42
2746A80j31q0r5J16P0j81J71j67j8J2R6Q6j04r3J05m5O0J3r7J41k07K84M0J0j64
2771BK0j39J67p4m3j20K8L00j66J33k17P0QO0q5J85j27p3j24J89j20K44N9l9k99
$$ plain form
2595 -167 3 32 -262 -67 -117 -97 -177 80 -42 -45 -114 -89 81 -106 -100 39 -128 18 -5 100 -80 -54 -66 31 -120
2620 -120 93 -36 139 -154 -101 19 -235 -111 -37 -92 -26 50 36 -10 -119 -18 -103 60 113 -74 -143 -154 117 -8
2644 -8 -44 -60 1 -59 39 129 42 114 -120 -101 42 16 -86 143 -87 -7 -38 -66 96 -248 -85 -12 -28 -75 -105 -135 127
2671 127 -20 -13 -15 48 40 -23 205 27 52 -68 226 94 -136 -77 60 -26 95 10 -48 20 152 104 -29 -111 -55 78
2697 78 -71 31 -52 -55 91 42 4 -186 -212 -6 24 -79 34 3 -89 261 57 -128 19 -34 -145 -47 5 175
2721 175 85 -42 129 141 184 200 160 -115 59 105 16 -21 -215 -124 29 -28 -222 17 26 -103 145 84 -55 38 180
2746 180 49 -31 -126 -10 60 -121 50 -117 -135 -123 -27 59 -45 -138 -33 -78 -18 -5 -102 39 -168 116 156 166 2
2771 2 22 -117 50 -24 -67 -187 -159 141 -25 108 -109 -39 -31 29 -56 129 2 -71 -195 -6 -126 118 177 138 -161
2796a61J75J39k05j61K72j49l8m3M7K94j34N0K7k20J60j72O0k5r9K37N3j37q1
2819a11o4J94J24j59J80j94O4k2o8oO0p1K2K05j63p2o1J28J12p0l2j71J46L6k25
2844b18K55Ol2J6L2l6m3J24Q4j63j60J88r9J75p4k37K90j71Q7N6k1r3J04n9L7
2869D8j66o3J09J3pQ3j6j54J80j58P3L9jo7K26p6Mk10J72R2J1r3r9J20nk46r2
2896b83K78P1j0j25P5Q5j37J65r4n5j26J40J86L4k97P2j11L00j41j08rJ59j3j7
2920C9O2j97K0J32j37R4j31J43q5o6J32n7J38j15pN2K7j06l5QJ72k13J49p9m0
2945a00J00j21J18J7o5%K80l14Q3J78k35M1k2K17k53j22L23j77j39J68nO9j8j50
2969a27R5M1M0o9M0J78qj5k63L2L9p3J22p3J71p3p8o3r0J11qR2j2P6j2j10p8l0
$$ plain form
2796 -161 14 153 -52 -213 59 -90 -128 -171 -124 170 36 86 113 -107 53 -119 -59 -84 -183 54 107 -30 -111
2819 -111 -175 19 143 -16 164 -30 34 12 -56 -62 -2 -73 -51 154 -9 -81 -142 -14 98 28 -4 -175 -29 7 -218
2844 -218 37 43 11 27 59 23 -20 104 188 25 -135 53 -46 129 55 -182 108 -63 24 80 59 -34 70 11 48
2869 48 -118 -181 -72 -59 -66 17 1 -153 27 -131 -58 -19 -20 -87 139 63 67 -143 29 121 132 39 -60 60 55 -191 -283
2896 -283 -5 66 56 -69 6 91 -46 119 25 -30 -156 -16 170 204 -93 -21 -132 168 27 -81 -90 69 56 39
2920 39 101 -96 -76 56 -81 13 -118 25 -60 -126 6 -51 87 -28 -35 17 44 -62 -97 -89 83 -130 19 -60 -100
2945 -100 0 -121 -3 14 -51 -51 229 -85 -2 176 -59 -18 -40 177 -76 -198 125 -52 -191 -23 -28 41 23 -127
2969 -127 -32 9 49 -20 20 198 190 175 -88 -56 -17 -90 32 -41 130 57 -21 -84 -174 -63 -71 21 9 85 73 -37 -115 -145
2997a45J38l0j74J17J43oJ22k10M1n6n9Qk5R9K0o7J65k48M04k49j07K57k15J63
3021H6k01O2J46j48j04K2K42r9k3n0QR7r3q5J52Q4j30kJ09k34m7K46j1j85K25
3046F7j14J83k18l2L4L3m9p0J85j30L9K84k05n1J3rP5J31j79o2R1j03J32P9j6
3071A08j24R1j62O7k37K57J5l5J56k62K31r1m1J4M1j76K44r1jK9pJ35l78M98k22
3096E9q9K5q1J68N6k70J83j9J2l6L0J95j96r7K2nQ3j14Q1L5k9Q4j97L02j96jr4
3123h9J17K54k71J05P0j89j63J66n2L5q2J28o6r8J32M5K8J53l31J26J8n7j54j9
3147a94K43q8K37j69QPj75P1O8o2Rj7N1o2J18K4k15K28p8J01j74J01j86K13j02
3172d3L4o7m1K5p7P5J74j74j00K71j9j87R0J38q5q7J10J01j39k9m3K51k91J65
$$ plain form
2997 -145 -7 -37 -211 -94 49 43 165 -45 -4 -60 -119 -111 -136 -37 -17 -84 81 -167 237 -12 -119 138 -77 86
3021 86 -115 -53 93 -55 -159 -137 105 6 -17 -67 -59 38 -55 -140 12 96 -34 -36 73 -161 -208 38 27 -158 67
3046 67 -47 136 -82 -114 -80 -47 -96 -166 19 -111 -72 212 7 -44 -31 -40 35 166 -13 -75 16 -87 45 124 108
3071 108 -16 75 -87 -20 -257 0 15 -20 136 -126 105 14 -27 -13 28 -148 96 5 4 33 26 161 -217 281 59
3096 59 -30 -5 -86 82 138 -132 51 32 44 8 38 233 37 -60 -38 -43 40 -74 7 42 13 97 -100 202 6 5 -89
3123 -89 28 282 11 116 186 -3 -166 0 -52 -17 -99 29 -37 -135 -3 42 70 223 -108 18 36 -21 -175 -194
3147 -194 49 -39 198 29 37 44 -131 -60 8 -54 -45 -62 -11 -73 45 69 -146 82 4 105 -69 32 -154 59 -43
3172 -43 -9 -76 -117 -92 -169 -94 80 -94 -194 77 58 -129 -39 99 14 -73 37 138 -1 -30 -73 178 -113 52
3196E2j38JJ00J56k39J37P0k25J08N7k40J82p3K6k8J07o4m3K11k02K88j54k84
3219a95K19J30k74K0J19m6m9NK00k54J29p9p1K11J46k69k8J6o1P8J12k5N7j10
3243a9j20L17k35o2K80m9K15m17K88j03l04K54J41kk82J65K7j61J05k30M43k81
3265c0J08n7n4k6L9Lo9J28j01J02j79J28K08j76J78P0Ml52J8J09L7k49J00J9l4
3290g6j5K10j34m6J77J88k30r1K5k0J07p2k2m2J43P7l41K64J05k51lj72K26l5
3314b8M5K3j14J70k37K02N7K5k06J51Lj39q2J67J40k10K33k47J56l04K67n1Qj1
3338A8Pj12m2J95j85P6J07J01l0Mp2q0N2o0K24k03Q0k17J78L0r0j91K56j26N6
3363b4q5L7J33j41P9J53m7j79J09l6o1j4K03o3l4j94K86j12oL0j21N3P7J14k47
$$ plain form
3196 52 -86 -85 15 171 -68 69 139 -86 22 79 -161 21 -52 -26 -54 53 -11 -54 157 -45 243 89 -195
3219 -195 24 154 -120 -100 19 -27 -76 -71 129 -125 4 -75 -146 65 211 -58 -86 -70 -131 -53 59 34 91 -19
3243 -19 -139 178 -57 -119 161 112 327 -90 198 95 -209 45 186 184 -98 67 94 -67 38 -192 251 -30
3265 -30 78 21 -33 -59 -20 -17 -86 42 -59 43 -136 -8 200 24 202 272 276 -76 -58 51 88 -161 -61 -42 -76
3290 -76 -91 119 -15 -61 116 304 74 -17 8 -12 95 23 1 -41 102 179 -162 102 207 -44 -47 -219 7 -28
3314 -28 17 40 -74 96 -141 61 118 143 -63 88 91 -48 -130 37 177 -33 200 -47 109 -195 72 21 29 18
3338 18 25 -87 -129 66 -119 -43 64 165 135 139 67 -13 39 -21 203 0 80 -137 41 71 -19 -210 46 -80 -24
3363 -24 -109 -72 61 -80 -1 152 105 -74 35 -1 -62 -76 127 64 30 -164 122 10 4 34 -87 -34 43 157 -90
3388i0O2O7j02KJ64j83K3NR7j55O5RJ69J4j28K8p8K77j50k54J42J98k32N9Q1J14
3414B04k03J21k00L38l20m6J74l18J40L03jm6l7j34p0p4K76l53L15k1O7k27N0
3437f2N3mJ78r4r9J2K02j56j46j9J59J03j51J36K5k5j85N8J3J8j17J01P9j66J60
3462G3o5m0R8J01k83K82k71Q1no9J83m3K5j38Lj25K6J92J15r1m8j2n0J27k98K63
3488C1o1r2K51k43J76m6r7J46R1q9Kj91k0K45o1K9No3o5J55j96O6R8o1N7n9r4
3515h6J22n4j30K60k96J02K75l8j26q4nJ98j26o6j42N6K32n0j2j0m7n5L32j32
3539A18j87k1J56l5j96J47k9J00J37p8j07j46j1Q0m9m9J51M3k14J48k3Q0N8j41
3563f8J67j9j11P7j23J21j06J7J19j00NJ40J15k11n5J5J04j63J46M9k93J03j29
$$ plain form
3388 -90 -28 39 -63 -61 103 -80 -57 -52 45 -110 -45 -36 133 147 19 47 -31 246 96 -158 -16 182 -50 9 90 204
3414 204 1 122 -78 260 -60 -106 68 -250 -110 193 192 146 109 -25 -95 -169 107 -246 69 48 115 -112 -62
3437 -62 -9 -13 165 71 -28 -16 186 30 -116 -135 24 127 -24 112 137 112 -73 -15 -2 16 -101 0 79 -87 73
3462 73 8 -32 66 167 -116 166 -105 -24 -29 -98 85 42 67 -71 -68 -193 -167 25 140 49 1 -11 -61 66 -232 31
3488 31 -30 -122 129 -114 62 16 -81 65 156 67 69 -122 -142 103 42 71 76 13 -52 103 -93 -27 71 10 67 8 -86
3515 -86 36 -18 -148 112 -184 -82 193 155 29 -55 -60 138 12 -54 -196 -140 92 42 30 20 -27 -82 250 118
3539 118 -69 -90 66 31 -165 -18 -47 53 190 112 5 -141 -152 -72 -121 -170 -19 24 -190 -42 -65 15 73 -68
3563 -68 99 80 -31 46 -77 44 -62 -45 74 -26 -21 119 234 23 -32 -17 87 -76 70 119 -174 -71 -200
3586b00O3N0J4J03j1j30J26l9R1N7k00J35j1L6o0k15K36ML5j62l4R0jJ06p2j6
3612eo8Q1J55j04l9o3J25j58R1K2p5J50r3q6Q2p8R8p2K67k19k12Q8J85M4j24R7
3638H9j06L6p1J42k43K7J29K03k64r7K33j2ro0j70N0K18m4J94k52o9M9k8L1L3
3663INO7jj48j7R9J56k0j69J8j84J60PJ8K16k76K56j45NP2j57q8P5P7j9k9l2j66
3691b11L18r6l9K7k0j4K61k86L4M3j14J75j71O1l4J6K09j22j34L2N4Q5o3M8j28
3716f9J51o4l8pN5o1P5O2r3J31j46R2p6J5O4m9j73J06J43k85K89l1K7p4p0J23
3742I7r2j10K23k34J54Oj21J71j2j27J2j41K90J7j17j09K19k42M0K25o2j28O1
3765B0k3k72R4K83Ln0j67K91k2j30j15P7J2j2l6J34j71R9j53J8J12J14l20J99
$$ plain form
3586 -200 -137 -87 -73 30 19 -111 15 -24 67 124 -76 59 48 84 24 -191 45 49 84 -78 -112 -22 -23 83 11 -5
3612 -5 -73 8 163 59 20 -43 82 -76 15 37 -38 112 19 -67 15 -63 35 -37 230 11 -201 -113 72 116 -8 89
3638 89 -17 19 -52 90 -153 -126 3 206 -58 -155 78 66 57 -3 -173 -123 95 51 245 -7 -76 -27 -55 -24 9
3663 9 14 81 80 -68 -85 14 170 150 -19 -1 -185 -25 -18 0 216 -60 196 51 56 128 -29 -117 -42 35 16 -13 -45 -211
3691 -211 107 11 -28 -1 -21 -35 226 -60 -26 17 -97 78 -93 -32 -66 -50 159 37 -97 -65 -11 74 11 59 -69
3716 -69 82 18 -20 -27 28 -33 42 104 11 142 -4 88 12 27 91 42 -131 -25 118 -167 122 91 118 44 -26 97
3742 97 5 -105 118 -116 38 44 -77 94 82 -45 -33 -174 116 133 16 -93 126 -116 -76 149 87 -41 20
3765 20 -3 -275 -181 102 105 55 -112 179 157 27 -88 -11 1 -11 -47 87 -84 15 -138 -120 -8 106 -214 -15
3789a5N9J2p6J79j58p2K18j05j71K75o1n6k95K66N8p0n6R7N2o7J9nJ56r1j53N0
3815a0Lk34M91j0j04j33P7P3k34lp9L75l76k4N21l91O7M6j68L73l04r9K61j23
3839ek35J87j12K75r4O3m6J7j49J84k6m6q0J38n4R3k17L9J42k2L0NP4l67kJ23
3865h5K62j80K0j53L2j14J97Q8q2J55k05J82k35J23l3K66k40k5q1j3k7K07n1j8
3889a0j56K39M1k45K84j05j77J11n5J8J92l44J05R9j22K17k48J32R4j38J08J5
3911E5J10k39k1K39p2J44j70K7j01%l6p8N3J62o3P4j03n4NO2N2J0j36K4M3j37
3937a50Pn1L13l1l3J13k83P8N4K8j7R2j69P0j2KJ60j65L3j47K70j25M8n9n0l3
3963e7J74j44M5K9j39K60r8J6j54J66j53J38l3l3n3J53o8j67J37J99k7r9j02K2
$$ plain form
3789 -15 44 56 -20 159 1 -71 147 42 -129 146 85 29 -266 0 58 -12 -68 29 81 14 33 28 184 93 -60 -10
3815 -10 -7 -241 250 240 136 3 80 153 -81 -84 -163 212 -164 -188 333 -58 9 55 -113 260 -44 -143 118 -5
3839 -5 -240 -53 -165 110 16 79 33 50 -99 85 59 13 -67 71 17 110 -107 -68 74 52 82 87 161 -206 -208 -85
3865 -85 177 -3 17 -136 -104 -218 -21 67 -15 140 -65 117 -118 5 -28 238 -2 -27 -108 -121 -148 59 8 -10
3889 -10 -166 73 114 -131 153 48 -129 -18 -73 -55 137 -207 -102 -3 -125 92 -156 -24 70 -68 40 55
3911 55 165 -74 -95 144 72 216 46 73 -28 -28 -64 -142 -89 73 10 84 -19 -73 -68 -6 46 56 -80 -56 -13 -150
3937 -150 -143 -194 119 88 55 168 -115 -37 17 45 28 120 -49 21 9 11 171 6 39 -108 162 37 85 26 -24 -57
3963 -57 117 -27 18 47 -92 168 70 86 -68 98 -55 83 50 17 -36 117 49 -118 19 218 191 92 -10 12
3987A2j38J09l1K67l41m1K7L5o1K58k53L5N3k6L2J00j10J30qn4J5nN7p1nm0J00
4014D6J66K9l45K32k5L6j51O8j53J83j54J45O5j31M7j2j22Q5m1J32k57M2K42m9
4038G8j02J8j32K29P0k52j24K04Q3K9j34j68M06j45m8J33k2o1p0MN2l51K19J83
4062I9j41J49j66J7J08m4j02M1PJ08%j79R3P9j7j09O6J17j32o0p9J9O6R0P8o8
4088D0l8n4L4K53l29l6K5K96j22O2k77O5J51j14J6N4Kr4o4J15p6J07Q4j09R3j38
4114e4q7K2K07l5q4R6j38J04R8o9l7j7m3N1j90K37j30p2J66r1J57k01K20qj28
4139b6J79k11M0p8K65j22p0L23k97m8J48J37j61m0O8k02L5O7J07K2o9k2j9M6j05
4164c3O2rj27J57lJ81k63L2J03j69J8P0k31J94k6J46k27k6J77J3J0R8l8L0j49
$$ plain form
3987 12 -126 -17 -48 219 -122 -163 -136 -101 -162 96 -157 -122 -69 -95 -63 37 -73 57 49 -5 10 5 62 -9 -14 -54 46
4014 46 212 241 -104 128 103 139 -12 56 -97 86 -68 77 142 11 58 46 -76 9 -32 100 -157 -115 127 78
4038 78 -24 -6 -138 91 161 -91 -215 -11 72 101 -33 -201 205 60 12 145 123 62 -8 -4 48 -303 -84 99
4062 99 -42 107 -59 -42 66 22 -80 -39 -32 76 76 -103 -10 69 52 -57 9 126 -6 -66 -145 -126 -60 30 108 40
4088 40 2 -52 -18 235 -94 -130 -105 191 69 131 -146 -81 70 -44 -28 26 28 -66 -130 -15 -91 16 100 -9 84 -54
4114 -54 -141 -119 88 53 -31 65 -73 31 129 60 23 6 -37 14 -176 61 -69 -141 25 -66 91 -110 110 102 -26
4139 -26 153 -58 -18 -96 169 47 -23 300 3 -45 103 240 79 39 107 -95 -60 7 114 136 67 45 26 72 -33
4164 -33 29 20 -107 50 47 228 -35 -3 100 -69 -51 19 -212 -18 -44 102 -125 -151 26 39 49 147 109 139 -10
4189a0k4K1j86J26J7L4K7k36K55N4k34K51k08R9J44r9J68n77N30j10Kk4j95K19
4213D4j6K8m9r6J75m6L4l04J99Q5k3N8p6J75k71J67j68J79L7l22J82r1J54j66
4237a11J13P4j91M1J7KJ77l20M05o3j40r2R0O5j0p0k7K4n4P1q4j67J73J22j55
4262a10K17p6k35J81k6J15p0q1J55k58M20j91O1%q1J2n1Q3O5l6p2l3J07j22j14
4287a40J9J1N6OO0N1j78M9J16rN2Q7l93l2L59m1j42k6R9l5k6K0jm8J64l0j85J83
4315D6J26p9j26j07Q3K74l11N6J37p1RJ78r2j76J56J83j74k17J23j62P1r3J07
4338e9J29q0L8N1J2j37M2L5Rr0N4j12K61n4k66L67q1J24j73k16K68q2Q0k86J51
4363a5M5m8l7k0M7L4J21j19J59Pj46O4o7J8p1M0j10J05L2k79L02k53K36M4o2p8
$$ plain form
4189 -10 -34 -13 -199 -73 -56 -22 5 -231 24 78 -156 95 -113 -14 130 31 199 -378 152 42 44 20 -175 44
4213 44 28 56 7 -89 86 40 74 -230 -31 54 31 89 13 188 -83 84 -84 95 132 -190 -8 -99 55 -111
4237 -111 2 76 -115 -74 -57 -55 122 -198 207 144 4 -88 2 67 57 -13 -40 -16 -70 1 -83 -250 -77 45 -110
4262 -110 107 31 -204 -23 -49 66 -4 -85 70 -188 232 41 102 102 21 33 -18 65 130 94 22 -11 96 -26 -140
4287 -140 -121 -110 -54 -48 12 63 -115 -66 50 41 93 180 -213 -245 114 73 -69 -95 4 -31 -57 -37 -38 -86 78 48 -137 46
4315 46 172 93 -33 -140 -57 217 -94 -38 99 28 37 215 123 -53 103 286 112 -105 18 -144 -73 -166 -59
4338 -59 70 -10 28 79 91 -46 -4 31 40 -50 4 -108 153 99 -167 200 119 243 70 -146 122 40 120 -166 -15
4363 -15 30 -18 -55 -75 -28 6 127 8 167 174 28 92 25 43 -28 12 -98 7 39 -240 62 -191 45 89 27 -51
4389e1J63n5k38Q8J48k07K12rP2j47j61K58j04M5p2P2p4k3J07oP7m1pM1k3j07
4415d2P9K2J35k33j3J79j25J03rj43M0p9M7Q4k77K29O8m7r9J01M8j09r3L25k67
4440g6j17J35J53m1k98L02M8j56k7J4J35N7j41k9J00j52P9N5j52m0O7P2j15K18
4464I1q7r6J23r8J38j62J06j16R2R4j48Q0Q0ok09K2J61J23l36K32N7j79l1P0l3
4489c2K6j31P8K1n5J05J12k75J46J06j88mK08q2o0M4j1J1J87k44Q7j2m0P5k70
4514a98L59k18N4M7l9J13r2n3%Q9N6N4j69R9Lk51J03j7J25O2j59q5n8K76j17L5
4540A9j34J93j09JN0O9M1j93j26K32n2N9J32j97l4O9kj3Q0j31J14O9p0j56j08
4565a97K84j43PJ64o4kj47J30j56k1j4J37m1m7J46J5m1J19k07J44K1j18J12j0
$$ plain form
4389 -51 112 57 -181 -93 55 -152 60 51 123 -24 -185 73 -31 14 -58 14 -60 -83 24 18 95 54 47 88 65 -42
4415 -42 37 59 194 -39 -52 127 2 105 96 -47 -7 -86 -39 45 -232 -3 65 18 -81 20 68 -41 -134 191 -76
4440 -76 -193 -58 95 54 -244 58 106 -50 -77 -63 72 129 -12 -41 59 -93 -14 41 -111 -151 -84 -12 -127 91
4464 91 4 -92 31 -67 71 -91 15 -101 -9 85 -63 17 97 91 -118 -96 65 188 -148 84 141 -38 -69 1 -32
4489 -32 -6 -137 -59 -38 -93 12 124 -151 -5 101 -87 -91 117 35 -25 19 8 19 206 -38 49 37 -3 72 -198
4514 -198 161 -57 -3 44 5 118 26 -27 -27 62 118 172 3 102 105 -146 -43 -60 65 127 -32 -117 -175 101 -16 19
4540 19 -115 78 -31 -30 20 89 130 -63 -189 43 -9 50 182 -15 -49 20 18 5 85 -46 68 137 67 -89 -197
4565 -197 87 -56 -49 115 51 49 -98 32 -124 -145 -159 -22 -63 -110 36 51 10 129 -78 66 87 -31 81 71
4589G1J74l34J20J0j64L79j89R5j99K7J23J0j49O4K9q8R1j89J30n6R1j12l4O6
4613c4J22J10J3k32j53J83J34k38J96l27R2K9r9R5lJ10J02m1j34J39j14N3K5O1
4637H9j25J09nl3j11J00J26k56J19J47q6r2j15J92j43N7M0J03m5m4R6k58R8R2
4661E5r4J15Oj87K84l87K46L9k22J75m9J02r5J16J35j89o0L29l41p6p1J67k41
4684b43J75r0K84n8j17K5J51k98L33r6kK7j27O8M1j18L3J59j28O6jm4r4j1J96
4709A31L0k31OkJ48j75P3k6Q5N0r1k39K56O0j32O3K0Q4j14J84m9j26O1j7q8J36
4735I7j05m3P6K0j1O4n9n2N9k26J72n2qK6J74k75M3P5J17j92J30q3n3J33lJ13
4761A37j50J01k23P4j2n0J47O9j27O2r1k9J61J64m44O1J29m4Q7Q4j22q9R9j28
$$ plain form
4589 71 245 -89 31 41 -123 256 67 162 -37 -10 113 123 -26 38 67 -21 70 -119 11 -45 46 -66 -100 -34
4613 -34 88 198 211 -21 -174 9 143 -95 101 -226 -134 -105 -204 -109 -112 -2 100 59 -75 64 -50 3 28 89
4637 89 -36 73 68 35 -76 24 150 -106 13 160 74 -18 -133 59 -84 -27 13 116 71 27 123 -135 -37 55
4661 55 -39 76 82 -105 179 -208 38 77 -145 30 -19 83 -12 104 239 50 -10 319 -22 -98 -169 -2 -243
4684 -243 -68 -158 126 68 -49 -24 127 -171 162 66 64 91 -36 32 73 -45 -12 147 19 85 84 40 -54 -65 131
4709 131 161 -70 -64 -66 82 -93 -20 -46 39 89 -2 -241 15 75 -57 6 26 110 -4 180 131 5 66 49 -39 97
4735 97 -8 -51 25 45 34 98 39 -13 46 -180 -8 -60 -68 -42 132 -143 -100 -25 92 -100 30 -53 -106 27 24 137
4761 137 -13 88 -135 -61 -73 -123 24 93 -34 28 -63 -92 69 233 -211 -150 -21 -65 22 106 -16 -105 -6 -134
4785a34L32j39j30Nl8Q2M4m0Jo1J54j84j0J42opK9j0j11J58jL2j41M4r3L9M6j42
4813a39L49k77J13n7L6n2r0OR8j41J49J76l25R8P2P0J21l9Kl01O9J35l0NN9r5
4839A2J35k27j4J92k40K31j77M1J28Q6l57J38J55l00J62J31n6%J01j59L2j33j9
4862a38nO9m3J3P3n7n9J33j6r2j0K32K7rq2j36K93l25J47o0k2J18o5k54K74j26
4888a20L96j91j3K0k18K30j42J04O7P6j10j77P5PJN9K1j56p6p2J60M1Q6j06L3
4913eM1qP5O0j23R8j63j35N6K16j05j82L78l94K52j90O1P3J31m0k12K59O1j92
4937A2Q0j27J47l3m4r5J94Q2j80o1R6L1l2O8j42J49L1K1k64OK3R2J5q0j11k29
4963c51K16p9J61K4jJ0O5k5J11p7K4r2K9N9k1j82J37o2J54p7k4J09n1R4j48Ko8
$$ plain form
4785 -134 198 59 -71 -66 -104 -22 22 -18 -17 -78 76 -108 -118 24 18 11 40 30 -81 77 76 108 -33 11 -82 -43 3 -139
4813 -139 210 -67 46 -11 25 -27 -117 -111 -13 -154 -5 171 -154 -56 16 86 207 168 170 -131 -62 73 43 48 107 12
4839 12 147 -80 -94 98 -142 89 -88 -47 81 167 -190 -52 103 -197 -35 96 40 40 141 -18 14 -119 -138
4862 -138 -143 -74 -117 -104 -31 -88 -147 -14 -30 -122 -132 100 127 118 36 -100 193 -132 15 -45 -67 51 -14 -268 6 -120
4888 -120 276 85 72 92 -126 104 -38 66 133 209 99 -78 -3 4 5 64 85 -71 -147 -219 -59 -18 68 -38 -5
4913 -5 36 28 103 163 40 138 -25 -160 -104 112 7 -175 203 -191 61 -129 -68 5 136 96 -116 143 204 12
4937 12 92 -35 112 79 35 -60 134 216 36 -25 71 102 70 138 -4 145 176 197 -67 -61 -38 54 69 -11 -122 -351
4963 -351 -135 -214 -53 -29 -30 -20 45 20 131 54 78 -14 15 74 53 -129 8 -54 100 23 -1 108 57 151 3 5 -63
4990f3P6j31J33J29o2p7k9J07r9j98L60L4j53Qn3p9m6L04j30o8K0J04n2J8k21
5015a68J28L9o9K42q8N2j90J38j61L06k14p0K6l3NJ01r6J4p1R7l8J10j57R7l4
5040c4n0L3J2L4K1P4L3j84j2QQ8k03Q6K04q3Q1q6p4r0J60l1r0N6J30j94J11p5
5067g5J87n4k8j15N3J93k16k5J6P4O8P9K3j92R8R5l03J45j43Q0R3K6J57k33N8
5092F1p5pL4mL3K6k6k6N1K4j3n7nj63k2K92j69P9q0q9J07m6L1K7Q4r3M7J50j73
5121bR7J0k22K77o7j20r6K03p0O8p5j36L05N4j53l6j60J28O0p6j31N0R6j21R5
5146b2J1l6M4o0Q7j35J06J01n3J16k97K66M0k26J38m9m6J83k95M1m9J91Mj59n0
5171a49K42k34N7K01j31j74J07N6J15k12K10K7l21J95mR3Qj35m5J28j0o8PJ41
$$ plain form
4990 -63 13 -118 15 144 82 5 -24 83 -16 -214 146 180 27 35 -18 -97 -143 161 31 -37 -17 87 35 53 -168
5015 -168 -40 -1 -70 172 84 136 -54 84 -77 229 15 -55 -29 -62 -57 44 -52 -38 -109 -12 -50 60 -97 0 -34
5040 -34 -84 -51 -39 -5 16 90 123 -61 -73 -65 23 -180 -94 110 27 108 22 -52 -142 18 -13 -103 -47 83 -111 0 -75
5067 -75 112 58 30 -85 -32 161 -55 -80 -64 10 78 157 180 -12 86 181 -122 23 -120 -40 53 79 236 3 61
5092 61 -14 -21 13 9 42 68 42 16 67 91 78 21 16 -147 -169 123 -46 33 -47 -136 -29 -75 -44 -17 67 -26 21 171 -2
5121 -2 95 105 -117 160 93 -27 -123 80 10 78 3 -133 172 226 73 37 -123 5 65 -11 -142 -92 4 -117 -22
5146 -22 -11 -47 -3 -63 24 -111 -5 96 43 159 -138 128 168 -58 80 31 -15 168 -127 -86 -135 56 60 -99 -149
5171 -149 93 -141 -84 117 -14 -188 -81 -25 90 -122 88 115 -206 -11 -15 78 86 -49 -94 34 24 -44 -37 104
5195A04k10J82k3pK8k05J81Q6k80K32j07J4m5j58J92j2l4J93J9k71J44n9N2k2
5219fJ67j2k55J18N2j04P0m5r4L4J24j53j48L11RR7k06q9J52O1k75K24j68K1K84
5244A69k19KJ54j11j16LR8p0N3J15L0k21K99k35K02j81J29r6J37k15n6K04M4r8
5268B1j09k0J47L2k66K04K6M5L0j75J03Pr0L2k2Q2R8j04q4J59O5n9k0k3J0k28
5294a39P1J95l37K82K2n3j00J5J39j92K79l38K04Jj70J5O9J56j28j94L83o7J69
5317B82j16m0l04Q9n8K03m1K8Q2k01Q8J36k13K84j60J24j41j85L3M5M7m0O4p3
5341f7j27J19K69l86J35M9jl0j4L4r9J12L5M1j09J12j39j62J38n0K04M1q9k14
5365a98J97q0K14k95L89k56Q6k42K02N4rp8l8J43Pj03l3j5K4M8k3k1K07j23r0
$$ plain form
5195 104 -106 76 53 46 74 -131 50 136 -144 88 -19 -5 -50 -208 -16 -28 -62 131 150 -121 23 -36 16 -6
5219 -6 161 149 -106 12 64 -40 30 -15 -109 -75 49 -104 -252 59 68 165 -41 -130 22 83 -192 32 -136 -115 169
5244 169 -50 -48 106 -5 -121 -118 -20 -90 -37 78 108 -113 186 -49 153 -28 101 5 142 -73 -129 75 119 21
5268 21 -88 -108 39 71 -195 9 35 80 110 -65 38 45 -45 -13 -35 47 145 41 -43 116 181 122 102 79 89 -139
5294 -139 -68 127 -210 72 94 41 -59 -44 95 -97 182 -156 48 49 -121 -106 -37 119 -9 -203 180 113 282
5317 282 166 126 -178 -89 -147 56 15 43 125 -76 12 148 -65 219 59 183 42 -143 -110 -65 -18 -58 6 -67
5341 -67 -194 -75 194 -192 -57 -8 -9 -39 -53 -19 -118 -6 29 70 -39 73 -66 -228 -90 -140 64 105 16 -198
5365 -198 -1 -81 133 -162 227 -29 57 -185 17 71 62 -16 -54 89 96 -7 -40 -55 -31 17 -6 -27 180 57 -33
5390c3Oj84K29J43p4m9q0J26j12j76J21m3J11K31l85R5J57l4Q1k02J40k49M2K10
5414G1N9m3m0p1N1p8J49jm6k1k03N0R3j27J72j43M47l75M2n6p2K07N9k34N0R6
5440C6J97m18K64q6J10j7j6N1k9j28j43L9m8K88k26%RJ46k3N9J65j74J3j47J4
5465f4J69n3m2P9j24J6P3o3j54J51J24k52n6M18m4q3m7j89J14J21q1K0rj23K07
5490A08Jm0M8k26P2K31l42J20N9m5J36K5j42N4n5O4m1R2lj60j0M7J43Oj56J33
5516A19j16l1J42j60j50K67J1q9J46j77m3O3J28l03K14J77k45j02K2R6J04j28
5538e5J4J98j25m7j3J28k10J92r6j0J08nm9j65K91k72J19J06J06l00L19j32j30
5561b8K0k6K7J15j38N2p2qP7o0mR9M8o4j59Q2L1L2L1j8q9p4J0J44O3J09j84k3
$$ plain form
5390 -33 -27 -211 18 161 87 38 -42 84 -28 -204 -83 -126 -15 216 -169 -74 83 49 130 -72 68 -181 -139 71
5414 71 130 87 47 -24 27 -51 98 97 51 30 -173 -123 -30 -157 15 -128 319 -56 -14 -70 -142 65 124 -110 -60 36
5440 36 233 -185 79 -7 103 86 70 121 92 -36 -179 -140 -188 100 -126 -126 -117 29 6 65 230 56 69 -78 -64
5465 -64 105 52 10 89 -35 -19 54 -9 -163 -12 112 -140 -196 222 178 95 48 -141 -27 94 13 33 24 -99 108
5490 108 109 69 117 -109 -37 194 -148 -28 31 -14 122 147 5 59 4 68 27 119 116 -44 -54 -7 136 142 -14 119
5516 119 3 -28 114 -46 -196 71 82 -7 139 -38 -81 -18 110 -193 21 198 -47 -149 -127 -31 73 -55
5538 -55 -41 157 32 -15 -28 100 -110 82 -14 -24 84 79 30 -135 156 -116 3 109 215 -85 234 102 -28
5561 -28 -8 -34 -7 108 -30 22 -50 -58 19 -41 -45 54 102 38 -121 -39 -8 24 55 37 -52 -126 -116 28 91 200 16 -7
5589gN1qm1m1L7O1j16J37l02K04qR1l8j17J61k2n6L8r9J01j51P4m5l8P2L7J07
5616H2j08J22N1k07K13k83J93q1O4J1j5K2j22K09j43q1N7j7l7j17M98j88j50k9
5640e6p0J41pJ40j57K0J58J8l6j42k36M37l00J78j21J5J42Qp4l4P6j4l9j36Q6
5665co4N1J85j63k09L18j51J8J97m67L65L7K9o6k50J38O5q0o2J28j39J04j57J25
5689e1J37J3j06n3J68OM0k37N2r1J50Ok49K07p2K09j56R9M8j74J8R8j49l3J64
5714D4nl2J49j93N3J46j16J01q3j24j10K00K6K5nj78K82k47L9L5k01J60J3J16
5738I5k63K01K3r5P5k35J90J53n5j23J59J6k82K28r9J59o4Ml2r3J73j74J71Rk95
5763a54P1J37j23N0j9J41M9k04P7qj32J32o0Mo0J88p0J18j47O3j71J10o2K68k12
$$ plain form
5589 -7 44 36 -5 -46 -9 52 -64 73 -229 -25 -33 58 20 -97 64 42 -14 24 -75 26 -125 -51 -96 -134 -62 -25 82
5616 82 -26 96 147 -60 153 -130 63 -18 46 57 42 64 -58 151 8 -73 -16 -33 -70 -187 311 123 -27 -56
5640 -56 -126 15 8 148 -9 11 169 187 151 9 -227 210 -90 88 -33 -18 124 132 58 24 100 86 47 -89 -3
5665 -3 -67 -16 169 6 -203 115 -36 -18 179 -288 77 114 143 77 -173 -35 30 -50 -112 16 -123 -19 -176 -51
5689 -51 86 99 -7 -60 108 114 154 -83 -31 -122 28 34 -215 -8 -80 129 -27 72 120 -54 -36 62 -87 -120 44
5714 44 39 7 156 -37 16 162 46 147 64 -60 -170 30 56 81 76 -102 180 -67 -28 7 -194 -34 -21 95
5738 95 -168 33 56 -39 36 -199 -9 144 89 -34 125 141 -141 87 -12 147 83 87 55 -38 135 -39 132 141 -154
5763 -154 -83 54 -69 -19 -38 103 152 -52 25 17 -115 17 -43 -39 -99 89 19 137 -10 53 -118 -8 -70 198 -14
5788a4k53L65j50n9o5J56M3r1k7P3M1q1p0J31O6jn8j52J89j03P5J08j02k7kJ36
5814A28j36k06J13K33k7p8p2j01K10p1n7j1j4K5L0j05J11O5L1j54RJ43KL8k25
5839a19J56j91K7K50qj72k7K06L4oj50k34L46l7j82J29k9n7K04k54K84k62M1J32
5863H1q4n8L2J12j01J37K1n8r0m8k5J76j10R7j10J65l11J25K18k26k5N6N3J1Q0
5888A18k16J86k01J09J72j95q9K28O6k34J22k56L72p0j43K45k47L3M9L0j36K7
5910c0L5J31m7j91p0J30N3P7q6l6q1K0K04j72o0m4N32m84J22Lk08L50j67J97j26
5935E2N4k88K99o6j49J43j20R6n7l4M1O2j69J41r0J23j1K4O2p3j32J51p0l9J51
5960A01l9l3j74K36lq0k11K98j79J16j10r5J98K5q7J27j42Q8K6k71J93pJ38k26
$$ plain form
5788 -14 -267 98 -52 -111 -176 -20 23 -68 -95 -22 19 -62 -132 -1 65 64 6 -146 43 -60 15 123 21 -6 -8 128
5814 128 -8 -214 -101 132 105 27 -45 -146 64 -7 -64 -75 -89 -64 -34 -139 -28 37 68 -86 -77 66 68 106 -119
5839 -119 37 -154 -127 123 115 -57 -84 122 156 150 0 -234 112 75 -107 22 -7 -64 140 -114 170 -92 -51 81
5863 81 -3 -61 -29 83 -18 119 140 82 -8 -56 -81 95 -15 82 -28 137 -174 -49 169 -57 -82 -26 27 38 118
5888 118 -98 88 -113 -4 168 -27 -116 112 178 -56 66 -190 182 112 -31 214 -33 0 49 79 -57 -30
5910 -30 5 136 89 -102 -172 -42 11 88 2 -34 -115 -95 109 -63 -123 -167 365 -119 3 6 -202 148 -19 178 52
5935 52 106 -182 117 51 -98 45 -75 21 -36 -70 -29 33 -136 5 -85 38 27 51 113 40 -92 59 -11 -50 101
5960 101 62 29 -145 91 88 8 -203 95 -84 32 -78 -173 25 50 -37 90 -52 36 62 -209 -16 -23 115 -111
5984a11J05j46L09j18k42J64N4n9J00n7K7r4J42j13P4K6j6J25k17j59Q1K01n3
6007B3Qq2J35k7N2j16J18j59L2J44k38l4J63%o5J07j1M9M0j20j43J56k8k6R2J1
6033H1Pj69r2J67J18m9j18O1KRp9J02O8r7m3MMM7j94J77j25J23O9r6R6j34J83
6060A22P0k7j88O5o8J62j16L6k73J69n6J73j41J15N4l66K76K0oJN6j89m4K03j18
6085g0p2J50k7J4k08J26r2L17k46J48k5K7j30K0J5J40j13p8K20qj84M8R8Nj34
6110e9J99o7L7j51K65k70j47J32Q7l8J86k33p0J0K44M1j92k0M2j30R5K40j85K3
6134C9n4J3n8j57L20Q9j77j57J06P4n3k7Q1j32K60j93l4J22L4j8J0M5k98K70j29
6159b4m3J42K2q1o3Q6n6m4J6Q7j06m1J19m2J33J93j74k23R1k6R4k26K50j00K12
$$ plain form
5984 -111 -6 -152 157 39 -203 -39 15 -44 56 -1 26 -68 74 -39 35 61 45 170 -47 -206 -125 76 23
6007 23 31 -51 84 57 109 -7 111 -48 -16 128 -110 -144 19 19 -46 61 50 99 139 19 -124 32 4 -22 70 81
6033 81 88 -81 -173 -6 112 63 -55 6 8 17 -62 40 108 11 -32 -28 -24 23 -171 6 -119 4 73 -23 73 -61 122
6060 122 192 165 -23 42 -26 136 20 56 -217 -48 -104 69 -72 43 97 -269 7 27 21 22 78 -111 -155 48 -70
6085 -70 -142 8 -19 -5 -213 -87 -179 138 -108 40 15 42 -88 -68 -53 87 -26 -104 116 108 -76 -28 70 75 -59
6110 -59 140 73 110 -41 224 -46 -193 -61 26 -12 174 -59 -129 -119 125 166 -26 -46 -4 -134 -39 201 16 39
6134 39 -15 -2 -60 -217 103 192 15 -142 -36 38 -15 -42 39 -93 167 -26 -60 62 96 78 88 133 -165 105 -24
6159 -24 -67 75 97 16 -47 39 -17 -61 -45 42 -64 -105 14 -28 105 298 124 -99 -8 -34 60 -166 84 -16 196
6184A96K3l65J17j00K83k17J5P1j43J95No7K2r0R5q6N9R7k22J73m4j66%J77p1
6209d3L8P6K8j52NJ73l41L62k08M2Q6P8j47q8J35n7J5K0q8K40j27j23J33j64J52
6234D5r7R5m2K0J57j96k01M9KK70Rj13R4o3j64J84q0LJ59k78j5oJ65R0J40k96
6260f9K13k30J71L3p4O3k23J40m3K1k8K07l16J24M4p1P4q0J05jl8r4J17O1k10
6285a04K5J45r6r2O2K21q1Qj46J85q3j7L4j3j4P8J73k24r4j28K02p4J59k53J43
$$ plain form
6184 196 219 -146 -29 -129 154 -63 -48 23 -120 75 80 13 35 -55 40 -46 13 110 -112 61 17 -149 -149 28 -43
6209 -43 -5 71 99 -53 -48 125 -216 146 -62 -20 66 144 -3 -91 44 -13 2 22 -66 174 47 -76 57 -107 45
6234 45 -52 43 1 21 178 -18 -219 -170 -168 102 111 -2 92 29 -135 49 -31 -28 131 -147 -162 -168 -3 87 227 -69
6260 -69 144 -86 85 118 44 107 -116 24 -19 2 -26 181 -135 -11 33 -38 36 -44 61 60 22 -72 45 106 -104
6285 -104 -79 66 -30 -122 -60 161 80 88 -58 127 44 27 61 48 34 112 285 61 -33 -161 41 -33 126 -127 16
$$ [...]
8191a68
##END NTUPLES=NMR FID
##END=
