##TITLE=1H_DE-63_23_oil
 D2O
 8 sc, 
 8.8.2024
##JCAMPDX= 6.0         $$ Bruker NMR JCAMP-DX V2.0
##DATA TYPE= NMR FID
##DATA CLASS= NTUPLES
##ORIGIN= UXNMR, Bruker Analytische Messtechnik GmbH
##OWNER= root
$$ XWIN-NMR		Version 3.5
$$ Thu Aug  8 14:13:26 2024 Russian Standard Time (UT+4h)  she@DPX200
##.OBSERVE FREQUENCY= 200.1313
##.OBSERVE NUCLEUS= ^1H
##.DELAY= (6, 6)
##.ACQUISITION MODE= SIMULTANEOUS
##.ACQUISITION SCHEME= undefined
##.AVERAGES= 8
##.DIGITISER RES= 18
##SPECTROMETER/DATA SYSTEM= spect
##.PULSE SEQUENCE= zg30
##.SOLVENT NAME= Acetone
##.SHIFT REFERENCE= (INTERNAL, Acetone, 0, 15.7039)
##AUDIT TRAIL= $$ (NUMBER, WHEN, WHO, WHERE, WHAT)
$$ ##TITLE= Audit trail, XWIN-NMR		Version 3.5
$$ ##JCAMPDX= 5.01
$$ ##ORIGIN= Bruker BioSpin GmbH
$$ ##OWNER= she
$$ F:/spectra/data/she/nmr/H-F/1/audita.txt
$$ ##AUDIT TRAIL=  $$ (NUMBER, WHEN, WHO, WHERE, WHAT)
(   1,<2024-08-08 14:12:05.28 +0400>,<she>,<DPX200>,
      <created by zg, POWCHK disabled, PULCHK disabled
       configuration hash MD5:
       00 E9 B6 7A A2 85 ED C7 34 08 36 98 17 FE 4E 26
       data hash MD5: 16K
       0C 68 7E EB 3D C4 42 64 A8 5C C7 96 F6 57 52 6F>)
$$ ##END=
$$ 
$$ hash MD5
$$ 0A CD 8A 7D 69 00 50 80 92 DB 31 56 9A BF A0 75
##$RELAX= 
##$RELAX= 
##$RELAX= 
##$RELAX= 
##$RELAX= 
##$RELAX= 
$$ Bruker specific parameters
$$ --------------------------
##$DU= <F:/spectra>
##$EXPNO= 1
##$NAME= <H-F>
##$PROCNO= 1
##$TYPE= <nmr>
##$USER= <she>
##$AMP= (0..31)
100 100 100 100 100 100 100 100 100 100 100 100 100 100 100 100 100 100 
100 100 100 100 100 100 100 100 100 100 100 100 100 100 
##$AQSEQ= 0
##$AQ_mod= 1
##$AUNM= <au_zg>
##$AUTOPOS= <>
##$BF1= 200.13
##$BF2= 200.13
##$BF3= 200.13
##$BF4= 200.13
##$BF5= 200.13
##$BF6= 200.13
##$BF7= 200.13
##$BF8= 200.13
##$BYTORDA= 1
##$CFDGTYP= 0
##$CFRGTYP= 5
##$CHEMSTR= <none>
##$CNST= (0..31)
1 1 145 1 1 1 1 1 1 1 1 1 1 1 1 1 1 1 1 1 1 1 1 1 1 1 1 1 1 1 1 1 
##$CPDPRG= <>
##$CPDPRG1= <>
##$CPDPRG2= <>
##$CPDPRG3= <>
##$CPDPRG4= <mlev>
##$CPDPRG5= <mlev>
##$CPDPRG6= <mlev>
##$CPDPRG7= <mlev>
##$CPDPRG8= <mlev>
##$CPDPRGB= <>
##$CPDPRGT= <>
##$D= (0..31)
0 1.2 0 0 0 0 0 0 0 0.06 0 0.03 0 0 0 0 0.0002 0 0 0 0 0 0 0 0 0 0 0 0 
0 0 0 
##$DATE= 1723111924
##$DBL= (0..7)
120 120 120 120 120 120 120 120 
##$DBP= (0..7)
150 150 150 150 150 150 150 150 
##$DBP07= 0
##$DBPNAM0= <>
##$DBPNAM1= <>
##$DBPNAM2= <>
##$DBPNAM3= <>
##$DBPNAM4= <>
##$DBPNAM5= <>
##$DBPNAM6= <>
##$DBPNAM7= <>
##$DBPOAL= (0..7)
0.5 0.5 0.5 0.5 0.5 0.5 0.5 0.5 
##$DBPOFFS= (0..7)
0 0 0 0 0 0 0 0 
##$DE= 6
##$DECBNUC= <off>
##$DECIM= 24
##$DECNUC= <off>
##$DECSTAT= 4
##$DIGMOD= 1
##$DIGTYP= 9
##$DL= (0..7)
0 120 120 120 120 120 120 120 
##$DP= (0..7)
150 150 150 150 150 150 150 150 
##$DP07= 0
##$DPNAME0= <>
##$DPNAME1= <>
##$DPNAME2= <>
##$DPNAME3= <>
##$DPNAME4= <>
##$DPNAME5= <>
##$DPNAME6= <>
##$DPNAME7= <>
##$DPOAL= (0..7)
0.5 0.5 0.5 0.5 0.5 0.5 0.5 0.5 
##$DPOFFS= (0..7)
0 0 0 0 0 0 0 0 
##$DQDMODE= 0
##$DR= 18
##$DS= 0
##$DSLIST= <SSSSSSSSSSSSSSS>
$$ [...]
##$SUBNAM2= <"">
##$SUBNAM3= <"">
##$SUBNAM4= <"">
##$SUBNAM5= <"">
##$SUBNAM6= <"">
##$SUBNAM7= <"">
##$SUBNAM8= <"">
##$SUBNAM9= <"">
##$SW= 24.0689771365484
##$SWIBOX= (0..15)
0 0 2 0 0 0 0 0 0 0 0 0 0 0 0 0 
##$SW_h= 4816.95568400771
##$TD= 16384
##$TD0= 1
##$TE= 0
##$TE2= 300
##$TE3= 300
##$TEG= 300
##$TL= (0..7)
0 120 120 120 120 120 120 120 
##$TP= (0..7)
150 150 150 150 150 150 150 150 
##$TP07= 0
##$TPNAME0= <>
##$TPNAME1= <>
##$TPNAME2= <>
##$TPNAME3= <>
##$TPNAME4= <>
##$TPNAME5= <>
##$TPNAME6= <>
##$TPNAME7= <>
##$TPOAL= (0..7)
0.5 0.5 0.5 0.5 0.5 0.5 0.5 0.5 
##$TPOFFS= (0..7)
0 0 0 0 0 0 0 0 
##$TUNHIN= 0
##$TUNHOUT= 0
##$TUNXOUT= 0
##$USERA1= <user>
##$USERA2= <user>
##$USERA3= <user>
##$USERA4= <user>
##$USERA5= <user>
##$V9= 5
##$VALIST= <valist>
##$VCLIST= <CCCCCCCCCCCCCCC>
##$VD= 0
##$VDLIST= <DDDDDDDDDDDDDDD>
##$VPLIST= <PPPPPPPPPPPPPPP>
##$VTLIST= <TTTTTTTTTTTTTTT>
##$WBST= 1024
##$WBSW= 4
##$XGAIN= (0..3)
0 0 0 0 
##$XL= 0
##$YL= 0
##$YMAX_a= 102341
##$YMIN_a= -107252
##$ZGOPTNS= <>
##$ZL1= 120
##$ZL2= 120
##$ZL3= 120
##$ZL4= 120
##$ABSF1= 10
##$ABSF2= 0
##$ABSG= 5
##$ABSL= 3
##$ALPHA= 0
##$AQORDER= 0
##$ASSFAC= 0
##$ASSFACI= 0
##$ASSFACX= 0
##$ASSWID= 0
##$AUNMP= <proc_1d>
##$AZFE= 0.1
##$AZFW= 0.1
##$BCFW= 1
##$BC_mod= 2
##$BYTORDP= 1
##$COROFFS= 0
##$CY= 11.3945322036743
##$DATMOD= 1
##$DC= 2
##$DFILT= <>
##$DTYPP= 0
##$F1P= 15.6554695791079
##$F2P= 12.8336369535428
##$FCOR= 0.5
##$FTSIZE= 0
##$FT_mod= 4
##$GAMMA= 1
##$GB= 0.15
##$INTBC= 1
##$INTSCL= 1
##$ISEN= 128
##$LB= 0.24
##$LEV0= 0
##$LPBIN= 0
##$MAXI= 10000
##$MC2= 0
##$MEAN= 0
##$ME_mod= 0
##$MI= 1.114404
##$NCOEF= 0
##$NC_proc= 0
##$NLEV= 6
##$NOISF1= 3.799351
##$NOISF2= 2.8
##$NSP= 1
##$NTH_PI= 0
##$NZP= 0
##$OFFSET= 15.70392
##$PC= 1
##$PHC0= -25641.84
##$PHC1= 12.38749
##$PH_mod= 1
##$PKNL= yes
##$PPARMOD= 0
##$PSCAL= 0
##$PSIGN= 0
##$REVERSE= no
##$SF= 200.130013532006
##$SI= 16384
##$SIGF1= 3
##$SIGF2= 2
##$SINO= 400
##$SIOLD= 16384
##$SREGLST= <1H.CDCl3>
##$SSB= 0
##$STSI= 0
##$STSR= 0
##$SW_p= 3612.71676300578
##$SYMM= 0
##$S_DEV= 0
##$TDeff= 0
##$TDoff= 0
##$TI= <>
##$TILT= no
##$TM1= 0
##$TM2= 0
##$TOPLEV= 0
##$USERP1= <user>
##$USERP2= <user>
##$USERP3= <user>
##$USERP4= <user>
##$USERP5= <user>
##$WDW= 1
##$XDIM= 8192
##$YMAX_p= 0
##$YMIN_p= 0
$$ End of Bruker specific parameters
$$ ---------------------------------
##NTUPLES= NMR FID
##VAR_NAME=  TIME,          FID/REAL,        FID/IMAG
##SYMBOL=    X,             R,               I
##VAR_TYPE=  INDEPENDENT,   DEPENDENT,       DEPENDENT
##VAR_FORM=  AFFN,          ASDF,            ASDF
##VAR_DIM=   8192,          8192,            8192
##UNITS=     SECONDS,       ARBITRARY UNITS, ARBITRARY UNITS
##FACTOR=    0.0002076,     1,               1
##FIRST=     0,             0,               0
##LAST=      1.7004516,     0,               0
##MIN=       0,             -107252,         0
##MAX=       1.7004516,     102341,          0
$$ Real data points
##PAGE= N=1
##DATA TABLE= (X++(R..R)), XYDATA
0 0 0 0 0 0 0 0 0 0 0 0 0 0 0 6 -8 8 -8 8 -12 16 -16 21 -24 24 -32 34 -40 47 -52 58 -67 75 -85 95 -105 118
36 118 -130 146 -162 180 -199 222 -246 270 -301 333 -368 408 -456 510 -571 642 -728 835 -966
55 -966 1134 -1358 1670 -2127 2799 -6185 102341 77263 -42626 -45371 -41653 4849 100336 54977
69 54977 -95799 -69569 54684 62878 14179 -18120 -68864 -32977 82396 65171 -62229 -75387
81 -75387 -1262 37513 49967 10121 -78018 -59077 55225 73911 -1325 -45906 -45855 2661 72533
94 72533 47506 -48285 -58724 7371 47032 40493 -10058 -64878 -29426 52314 46629 -19785 -46984
107 -46984 -32159 14246 60071 19398 -62412 -46931 27956 46140 23396 -14656 -56983 -20092
119 -20092 64942 49570 -30630 -43114 -12698 16666 49810 20283 -59211 -46551 35551 44598
131 44598 772 -24740 -41561 -13802 55557 41834 -43785 -51998 6668 34019 34869 5245 -54420
144 -54420 -39381 47436 56618 -10391 -38692 -27244 2715 50829 35149 -46287 -53322 17257
156 17257 41950 17579 -12349 -45124 -25853 46413 47831 -26326 -47903 -9481 21851 39619
168 39619 16110 -47716 -44761 31527 51598 3454 -28067 -33256 -8087 46222 40979 -32763 -49978
181 -49978 3721 32929 25597 27 -42164 -33500 34599 46727 -11679 -38342 -19682 7637
193 7637 38327 25648 -37207 -45622 16157 42023 14751 -13789 -34044 -18874 37219 43882 -17845
206 -17845 -42238 -8027 19438 29387 12755 -35142 -39201 20442 41670 1447 -25840 -25691 -6819
219 -6819 33048 33189 -24324 -42381 2266 30135 22048 815 -30997 -27594 26382 43045 -4178
232 -4178 -31932 -16714 6297 28996 22013 -26752 -40309 7919 33988 11031 -13800 -27963
244 -27963 -16882 26376 36378 -12963 -36970 -7394 19245 25591 11837 -26172 -32196 16417
256 16417 39168 5251 -21981 -20786 -4962 25525 28408 -17934 -38758 -1441 25136 15939 -2728
269 -2728 -25243 -24668 18377 36592 -2889 -30056 -13488 8726 24387 20014 -18224 -33941 5837
282 5837 33068 12573 -11960 -21598 -13795 18955 30543 -7696 -33295 -10029 15581 18640 6497
295 6497 -20577 -27274 9402 32031 6366 -19952 -17687 -1158 22344 24499 -11268 -31058 -2520
308 -2520 23744 17204 -1552 -21119 -20493 13149 29985 -562 -25549 -14221 5097 18414 14933
321 14933 -15577 -28768 3203 27151 10205 -10644 -17433 -9815 17173 28089 -4814 -28596
333 -28596 -7817 15919 17350 6541 -16292 -25026 5899 28648 5812 -19087 -15976 -2314 15051
346 15051 19650 -8097 -27981 -3900 21342 13978 -3095 -15650 -14995 10666 27223 1954 -23044
359 -23044 -12250 7832 16801 12328 -11645 -25596 -358 23889 10568 -10625 -16288 -9296 11667
372 11667 22232 -2085 -24107 -8576 13480 14519 4541 -12702 -18985 4990 24988 6687 -16396
385 -16396 -13615 143 14005 16781 -6502 -24916 -5307 18625 13297 -3732 -14645 -14036 6818
398 6818 22886 3441 -20156 -11874 6682 13809 9625 -8480 -20444 -882 21548 10582 -10311
411 -10311 -14069 -5544 10824 19057 -1134 -21894 -9210 12871 14147 2709 -11764 -17148 2158
424 2158 21208 7579 -14672 -13551 141 11604 13767 -3851 -20051 -5198 16289 12366 -3626
437 -3626 -12353 -10022 6578 19546 3520 -17746 -11343 6832 13326 7724 -7978 -18437 -2187
450 -2187 18150 9971 -9107 -13320 -5428 8380 15918 174 -17811 -8416 10938 12603 1922
463 1922 -9383 -12877 2293 18276 6989 -13149 -11990 1227 11042 11351 -4171 -18149 -5708
476 -5708 14093 11392 -3868 -11692 -9431 4787 16413 4012 -15168 -10512 6054 11806 6667
489 6667 -5988 -14671 -1906 15960 9442 -8240 -11475 -3482 7612 13442 -53 -16578 -8560
502 -8560 9902 11175 786 -9063 -12133 875 15857 7332 -11407 -10962 1201 9739 9754 -1841
516 -1841 -14480 -5387 12733 10668 -3556 -10004 -7009 4007 13575 3666 -14010 -10566 5541 10513
530 10513 4553 -5978 -12890 -2696 13728 9635 -7285 -11015 -2651 7116 11512 1353 -13236
543 -13236 -7799 8894 11197 565 -8233 -9638 669 13166 6316 -10339 -11143 1080 8897 7659
557 7659 -2780 -13126 -5206 10974 10334 -3015 -9478 -6053 4410 12589 4301 -11292 -9522 5102
571 5102 10149 4187 -5405 -11189 -2544 11598 8278 -6994 -10501 -2483 6113 9631 839 -12105
585 -12105 -7501 7989 10618 753 -7419 -7987 846 11657 6697 -8527 -9882 1358 8374 6527
599 6527 -2269 -10995 -5116 9067 9823 -3064 -9418 -5072 4071 9851 3496 -9522 -8934 4460 9902
614 9902 3661 -5137 -9269 -2075 10033 8149 -5252 -9789 -2076 6230 8306 378 -10293 -6888
628 -6888 6573 9531 526 -7258 -7430 961 10385 5780 -7762 -9401 1218 7826 6116 -2037 -9943
643 -9943 -4595 8638 8953 -2783 -8134 -4227 3277 9172 3355 -8966 -8324 4478 8623 2567 -4644
658 -4644 -8064 -2459 8877 7745 -5527 -9385 -1313 5818 6770 774 -8630 -6858 5815 9459 -220
673 -220 -6932 -5598 904 8314 5656 -6274 -9039 1066 7846 4534 -2550 -7769 -4253 6374 8352
688 8352 -1890 -8466 -4064 3769 7331 2459 -7040 -7615 2848 8380 3221 -4742 -6984 -1371 7490
703 7490 6850 -3443 -8108 -2028 5699 6498 156 -7689 -5927 4599 8047 566 -6503 -5880 1011
718 1011 7543 4839 -5613 -8063 681 7253 5140 -1792 -7383 -3877 6156 7904 -1544 -7355 -3628
733 -3628 3093 6983 2528 -6469 -7387 2585 7611 2499 -4442 -6496 -1506 6732 6396 -3491 -8026 -1426
749 -1426 5483 5864 438 -6731 -5304 4278 7766 770 -5860 -4976 960 6423 4226 -4808 -7599 287
765 287 6506 4034 -2309 -6440 -3328 5297 7127 -1309 -6999 -2983 3491 6058 2312 -5493 -6340 2320
781 2320 7257 2573 -4098 -5784 -1274 5620 5339 -2942 -7258 -1831 4748 5155 -186 -5689 -4642 3320
797 3320 6938 920 -5388 -4525 1307 5790 3810 -3991 -6716 40 5989 3931 -2171 -6043 -3114
812 -3114 4416 6161 -1057 -6325 -3398 2844 5433 1825 -4858 -5512 1500 6497 2418 -3725 -5053
827 -5053 -704 5202 5105 -2329 -6624 -1838 4553 4738 96 -5461 -4665 2829 6244 846 -5121 -4319
843 -4319 892 5224 3537 -3480 -6129 -142 5477 3795 -1993 -5256 -2462 4133 5836 -654 -5723
858 -5723 -3173 2796 5122 1549 -4426 -5123 1291 5763 2330 -3537 -4745 -778 4516 4365 -1909 -6088
874 -6088 -2019 4302 4476 -33 -4742 -3788 2368 5690 1167 -4843 -4130 1102 4933 3297 -3069 -5614
890 -5614 -340 4922 3584 -1863 -4770 -2158 3387 5012 -406 -5221 -2961 2534 4720 1457 -3729
905 -3729 -4709 919 5373 2183 -3118 -4483 -488 4232 4041 -1673 -5283 -1757 3732 4254 -362 -4347
921 -4347 -3429 2261 5296 1106 -4205 -3837 950 4626 2635 -2778 -4894 -426 4566 3343 -1805 -4352
937 -4352 -2044 3286 4629 -174 -4623 -2766 2326 4377 1321 -3646 -4285 839 4828 2052 -3033
952 -3033 -4191 -542 3761 3868 -1503 -4966 -1615 3395 4125 -87 -3811 -2968 1984 4780 1038 -3957
968 -3957 -3691 948 4129 2461 -2356 -4859 -421 4081 3206 -1648 -3976 -1906 2962 4346 -27 -4136
984 -4136 -2644 2113 4104 1033 -3145 -3824 618 4434 2449 -2605 -3976 -598 3469 3394 -1259 -4399
1000 -4399 -1762 2978 3558 -330 -3652 -2520 1775 4166 1476 -3122 -3153 832 3776 2175 -2044 -3948
1016 -3948 -450 3710 3001 -1320 -3878 -1731 2523 3903 -256 -3937 -2454 1680 3701 971 -2828
1031 -2828 -3389 558 3927 2071 -2090 -3416 -449 3295 3145 -972 -3750 -1679 2711 3536 -25 -3388
1047 -3388 -2592 1479 3664 1094 -3144 -3263 475 3490 2131 -2006 -3635 -556 3224 2902 -1071 -3524
1063 -3524 -1647 2529 3606 -82 -3516 -2537 1495 3603 1041 -2727 -3369 449 3548 2035 -2113
1078 -2113 -3371 -708 2878 3051 -940 -3690 -1422 2686 3340 101 -3208 -2600 1398 3700 1118 -2698
1094 -2698 -2941 695 3134 1962 -1902 -3623 -477 3067 2540 -1049 -3322 -1609 2119 3310 110
1109 110 -3350 -2302 1598 3356 911 -2595 -3021 349 3245 2143 -1877 -2773 -696 2881 2593 -835
1125 -835 -3342 -1499 2246 2931 -11 -2907 -2209 1246 3249 954 -2511 -2721 572 2929 1859 -1461
1141 -1461 -3267 -564 2723 2371 -998 -2995 -1548 1796 3033 230 -2878 -2169 1156 2984 993
1156 993 -2048 -2726 189 2949 1720 -1604 -2671 -610 2370 2515 -666 -3060 -1755 1961 2614 218
1172 218 -2718 -2175 1025 3173 1025 -2308 -2503 293 2709 1832 -1513 -2936 -528 2570 2181 -728
1188 -728 -2725 -1470 1647 2986 319 -2629 -2053 1017 2746 877 -2080 -2525 271 2695 1635 -1451
1204 -1451 -2515 -550 2152 2304 -613 -2806 -1183 1923 2467 206 -2450 -2051 703 2756 1066 -1916
1220 -1916 -2428 382 2387 1599 -1303 -2821 -738 2205 2008 -683 -2298 -1409 1460 2489 288 -2332
1236 -2332 -1839 968 2456 1001 -1637 -2546 96 2541 1540 -1285 -2518 -544 1944 2160 -327 -2398
1252 -2398 -1318 1528 2221 234 -2165 -1968 719 2633 901 -2002 -2211 167 2130 1452 -1047 -2366
1268 -2366 -628 1943 2111 -380 -2073 -1216 1398 2228 327 -2128 -1672 862 2258 850 -1628 -2144
1284 -2144 -90 2152 1456 -1181 -2267 -434 1753 2256 -160 -2232 -1091 1439 2110 321 -1693 -1757
1300 -1757 760 2555 874 -1847 -2037 300 1949 1472 -926 -2351 -630 1936 1798 -356 -2055 -1133
1316 -1133 1086 2078 174 -2025 -1665 596 2267 713 -1281 -2063 59 2145 1527 -831 -2007 -621
1332 -621 1350 1833 -285 -2194 -1121 1217 1862 379 -1624 -1717 630 2183 1071 -1399 -1770 70
1348 70 1854 1278 -1069 -2013 -731 1566 1664 -288 -1908 -1094 1051 2021 376 -1841 -1698 788 1976
1365 1976 882 -1297 -1896 -221 1876 1335 -843 -1837 -416 1306 1525 -120 -1929 -997 974 1886
1381 1886 169 -1541 -1481 210 1946 1269 -1208 -1729 -148 1727 1160 -613 -2024 -609 1635 1514
1397 1514 -391 -1735 -883 823 1900 358 -1538 -1319 705 1632 822 -934 -1688 -176 1660 1195
1413 1195 -965 -1665 -430 1151 1575 -75 -1676 -943 859 1363 -2 -1133 -1398 367 1638 946
1429 946 -1205 -1680 -104 1457 1195 -735 -1642 -801 1199 1343 -279 -1367 -874 620 1755 488 -1612
1446 -1612 -1446 584 1444 739 -951 -1537 -125 1467 1097 -641 -1639 -457 991 1383 -35 -1667 -1075
1463 -1075 668 1644 222 -1189 -1151 329 1606 690 -1038 -1495 99 1343 1118 -506 -1596 -704 1326
1480 1326 1419 -115 -1239 -679 496 1562 616 -1185 -1111 446 1575 541 -755 -1102 -11 1438 1097
1497 1097 -670 -1459 -594 853 1234 -55 -1306 -1033 680 1427 319 -1192 -1102 212 1395 907 -910
1514 -910 -1316 -107 1145 975 -440 -1410 -683 969 1301 -150 -1272 -640 499 1193 233 -996 -1284
1531 -1284 435 1263 612 -845 -1088 -87 1048 1119 -567 -1430 -460 851 1167 245 -1311 -975 536
1548 536 1239 292 -1105 -1109 66 1195 975 -984 -1345 10 1157 827 -297 -1306 -621 1034 1206 -174
1566 -174 -1184 -510 518 1259 430 -982 -911 200 1229 679 -636 -1142 -264 1026 809 -436 -1332 -390
1584 -390 548 928 -39 -1040 -778 589 1244 334 -1065 -876 236 1285 787 -605 -1250 -163 932
1601 932 919 -302 -963 -428 731 1186 56 -1137 -686 473 1184 462 -1029 -991 126 1046 489 -510
1619 -510 -917 -289 955 894 -402 -1209 -495 715 995 63 -925 -870 657 1091 293 -843 -832 124 721
1638 721 773 -473 -1199 -69 741 789 -224 -993 -557 667 1048 -60 -1063 -810 387 983 151 -798
1656 -798 -961 161 951 572 -481 -897 -246 948 793 -293 -954 -386 724 768 29 -909 -851 454 1071
1675 1071 207 -733 -819 53 942 544 -437 -1012 -2 719 822 -188 -935 -746 601 762 -4 -960 -517
1694 -517 352 835 455 -650 -726 112 852 424 -661 -919 -272 756 847 -282 -965 -396 804 936 214
1713 214 -740 -697 323 1041 270 -568 -781 -122 667 680 -523 -919 -130 871 571 -256 -1065 -539 468
1732 468 1014 80 -802 -438 372 754 316 -468 -928 152 874 391 -406 -923 -168 730 895 -368 -888
1751 -888 -561 678 574 103 -717 -567 475 902 336 -534 -773 205 751 525 -219 -1079 -84 852 491
1770 491 -304 -770 -289 413 1045 -52 -696 -366 325 968 267 -708 -815 138 848 386 -457 -711 -200 494
1790 494 626 54 -919 -325 334 624 32 -559 -563 380 1033 369 -700 -450 94 578 327 -308 -722 -113
1810 -113 666 637 -292 -552 -431 445 826 71 -896 -472 445 552 254 -393 -711 -80 764 383 -536 -800
1830 -800 -165 513 675 1 -926 -337 495 772 17 -581 -547 198 672 253 -432 -649 137 595 589 -218 -831
1851 -831 -208 573 391 -280 -538 -237 221 740 148 -672 -381 264 489 365 -510 -807 -113 552 498 -640
1871 -640 -787 -152 228 609 -217 -663 -193 562 450 87 -528 -514 163 556 430 -455 -381 -142 528 444 -205
1892 -205 -727 -266 608 460 -262 -619 -182 152 727 155 -758 -380 408 617 -105 -384 -555 -272 778 349
1912 349 -437 -432 -90 382 398 -142 -537 -482 370 570 122 -522 -486 35 503 324 -605 -558 15 445 379 -306
1934 -306 -587 -416 380 370 -181 -702 -287 324 606 249 -662 -410 202 507 260 -193 -681 -31 438 354 -444
1955 -444 -659 -175 341 535 -70 -605 -385 412 606 17 -559 -506 155 300 443 -426 -642 102 382 471 -168
1976 -168 -495 -337 311 516 -100 -509 -354 192 670 276 -483 -524 230 566 190 -321 -453 -223 494 377
1996 377 -231 -560 -106 492 254 -265 -619 -513 311 601 52 -473 -643 92 471 418 -308 -532 10 398
2016 398 301 -68 -668 -250 238 454 -92 -566 -295 344 560 150 -485 -608 23 580 310 -395 -572 -186
2036 -186 584 558 -235 -709 -163 436 462 94 -515 -335 91 601 110 -473 -348 121 322 324 -289 -470 46
2057 46 373 369 -254 -438 -259 98 730 42 -540 -355 416 256 188 -248 -421 76 485 218 -170 -334 -57
2078 -57 446 435 -202 -632 -187 68 441 152 -330 -365 126 459 132 -339 -479 -18 426 245 -231 -538 8
2099 8 562 288 -87 -445 -328 157 480 -36 -384 -94 165 345 216 -445 -469 -14 426 128 -386 -581 -365
2120 -365 214 475 -4 -482 -194 347 486 101 -414 -448 93 495 159 -234 -466 -70 504 226 -131 -572
2140 -572 -206 480 230 -55 -488 27 168 597 2 -688 -378 178 320 269 -173 -455 -138 489 425 -268 -560
2161 -560 -302 359 489 -176 -393 -254 335 354 69 -379 -437 56 351 324 -331 -280 -292 403 232 -144 -610 -185
2183 -185 348 482 39 -485 -304 103 324 265 -253 -316 150 292 197 -235 -435 -71 411 339 -374 -282 -216 231
2205 231 410 53 -478 -181 385 322 -159 -307 -248 118 435 301 -302 -502 -48 482 142 -222 -339 -149 170
2226 170 205 157 -354 -270 183 505 44 -232 -285 116 207 314 -208 -442 -4 431 233 -157 -247 -78 191 494
2248 494 46 -573 -366 79 454 168 -238 -418 30 331 147 -103 -383 -147 241 469 -60 -436 -254 220
2268 220 613 -127 -407 -243 132 408 184 -112 -390 123 332 288 -67 -327 -130 239 417 -102 -277 -198 104
2289 104 402 27 -346 -179 253 453 246 -88 -451 -117 390 144 -138 -368 -54 244 318 -66 -342 -268 361
2310 361 301 53 -194 -122 185 341 65 -255 -168 -118 340 300 -194 -350 -89 111 261 55 -512 -117 111 152
2332 152 144 -570 -403 31 205 18 -120 -261 176 225 278 -314 -245 57 328 349 -84 -282 -111 215 294 -24
2354 -24 -440 -529 54 243 95 -218 -351 -88 209 241 -231 -316 -129 188 128 -96 -275 -189 111 243 30 -197
2376 -197 -153 111 401 66 8 -330 245 386 280 -72 -294 76 275 372 152 -255 -142 160 257 163 -112 -239
2398 -239 36 255 241 -169 -247 -85 113 289 55 -35 -118 273 -35 54 -497 -131 34 147 192 -116 -213 18
2420 18 269 84 -195 -97 -34 103 212 -214 -225 160 91 59 185 -31 -280 295 402 -124 -101 -186 36 123 228
2443 228 -191 -344 -164 396 51 28 -113 -174 115 43 106 -384 -100 -17 342 18 -100 -129 68 325 -70 -101
2465 -101 -72 -38 151 215 -144 -260 20 303 135 -123 -88 -104 131 339 207 -148 -124 -41 97 402 -128 -100 17
2488 17 165 240 -27 -105 -5 191 276 -22 -175 -253 191 152 -35 -40 -132 131 260 261 -150 -147 -47 175 73 -49
2512 -49 -71 -170 123 200 -66 -171 -85 31 177 -44 -68 -114 180 218 192 -124 -165 -73 189 211 -68 -283 -40 212
2536 212 125 29 -90 -299 40 0 24 -144 -92 180 191 202 -279 -253 -14 225 109 -309 -176 55 192 145 -73
2559 -73 -50 -35 344 215 153 -113 -53 140 234 18 -86 -211 68 292 179 -274 -93 39 241 121 -134 -183
2581 -183 -116 249 227 -130 -343 -110 146 315 38 -117 -60 -162 271 -4 6 -138 -60 11 292 -79 -225 -93
2603 -93 165 143 -134 -211 -134 310 64 45 -303 -222 -117 120 152 -83 -100 -150 54 177 104 -131 -72 136 185 -37
2627 -37 5 -236 117 139 27 9 -113 -89 184 196 -18 -216 -132 -66 105 183 -161 -162 136 93 120 0 18 75 282
2652 282 47 -71 -161 -89 204 31 -20 -92 19 100 245 21 -188 -106 -66 141 9 14 -234 19 34 -23 -86 -170
2676 -170 53 121 56 -48 -141 -107 229 122 78 -227 -188 3 75 -78 -88 -198 -98 35 162 -99 9 -75 40
2699 40 252 -253 -58 -61 55 29 -142 -175 -89 235 237 -16 -95 -36 41 251 62 28 -152 93 109 -55 -58 -164 -44
2724 -44 58 70 -71 -174 -15 -137 184 137 -62 -251 232 201 25 -102 -200 -53 102 53 -140 -43 -31 105 84
2747 84 -88 -169 -163 -82 314 33 -61 36 10 339 -185 -163 -188 -76 -67 123 -95 75 -190 149 101 32 -24 -28 136 275
2773 275 28 -203 -133 23 262 95 41 -152 28 123 -78 61 -222 -96 100 -65 -65 -99 -55 -3 33 10 -141
2796 -141 -285 55 289 295 -269 27 70 123 146 -206 -148 113 83 157 17 -204 -188 -12 -7 145 -209 16 -89 -79
2820 -79 61 -44 -135 -6 -42 80 57 -75 -161 -124 186 126 -155 -243 46 238 -69 -59 -345 -117 -32 -43 -42 -17 -24
2845 -24 137 227 -152 -114 -51 51 195 -117 -202 -75 -162 76 194 -173 -168 16 240 60 -119 -115 41 67 273 -39
2869 -39 -361 -96 -92 59 19 -82 -192 -101 -139 79 -200 -59 -59 43 186 22 -34 36 96 99 -169 -88 -98 180 56
2894 56 -82 83 38 -64 302 95 -25 -45 -116 229 -277 -160 -191 -39 86 -60 -109 -57 -65 179 -28 45 -80
2917 -80 -152 -88 86 53 -156 -207 -207 167 12 39 -203 51 342 226 -124 -158 -61 129 112 80 5 -246 63 293
2941 293 76 25 -119 -44 164 31 -163 -59 -16 -15 21 42 -56 65 194 21 135 -144 -329 -21 117 -25 -49
2964 -49 -208 -27 -22 89 31 6 -132 80 144 73 130 31 -99 92 78 -51 -260 -140 95 143 -75 -341 -4 24
2988 24 29 76 -275 -79 154 129 156 -250 -159 -60 -54 -28 43 -70 -46 158 51 -92 -74 200 94 -79 -248 -194 -25
3013 -25 278 43 -44 -170 -28 56 308 -23 -12 -112 -9 94 105 -66 -94 -106 34 245 -215 -204 49 59 4
3036 4 -52 -196 -172 98 88 -70 -34 57 50 111 -166 148 1 -119 247 214 61 -77 -114 127 88 136 -131 -147 265
3061 265 -186 -85 4 -67 37 -103 77 -102 -72 -98 82 164 7 29 42 58 11 46 -114 -197 -8 113 91 -9
3085 -9 -80 93 8 151 -202 -26 -370 170 170 -112 -64 -108 168 149 60 -46 -118 -72 58 166 -176 -167 -18 -14 -62 26
3111 26 -78 101 150 151 75 -237 -53 63 217 -17 -161 -60 123 4 183 -172 -121 -16 80 109 -281 16 71
3134 71 101 145 99 -198 -16 -121 235 33 -75 -308 36 194 132 216 -152 -144 -101 204 54 -238 26 157 161 -147
3158 -147 -128 -147 75 92 93 -33 -134 98 361 -22 -132 -132 -80 183 49 57 -63 -57 98 37 193 -98 -103 192 150
3183 150 -120 -70 -28 136 107 61 -59 -13 -39 57 151 -210 -163 28 44 -12 1 -69 -97 -48 281 -117 119 -200 -142
3208 -142 9 4 28 -194 -23 112 18 -53 -183 -50 18 77 -181 -131 50 -61 147 5 5 -208 58 117 -16 5
3232 5 -67 69 173 85 100 -77 -30 -183 130 -19 -11 -19 -51 171 -72 -226 -204 -192 203 16 36 -238 22 84 -91
3257 -91 18 -241 -137 243 140 -8 -60 -57 66 -56 60 -53 -113 -12 86 87 35 -50 -88 76 220 33 -217 -25
3281 -25 7 14 -176 -25 -52 -30 96 95 -59 -129 56 45 15 -120 -6 -18 -17 71 -28 -275 -174 13 14 -20 92 -132
3307 -132 -78 139 128 -93 -27 -124 -47 -77 18 7 -183 101 -9 -187 -150 -46 -53 97 43 -9 -210 121 18 192
3331 192 -3 -41 39 239 198 29 142 -12 94 5 32 -52 -149 56 67 118 -147 -156 -212 82 -50 -150 -80 20
3355 20 98 190 59 -25 92 73 -132 -111 -90 85 12 -1 -41 77 -277 -8 37 67 156 -17 -100 111 85 34 71 73
3381 73 158 36 18 111 10 104 231 -152 -27 -12 107 77 26 7 -132 40 116 47 -74 -33 -51 -24 114 -23 -116
3406 -116 -26 55 -6 -36 -171 -94 -26 201 -58 -96 -70 -36 139 38 36 -254 77 43 178 -110 -119 -6 -2 62 0 53
3432 53 -109 -108 15 7 -56 -65 -81 100 204 -214 -138 -17 173 195 -94 71 -126 61 84 64 -142 -31 -92 204 202
3457 202 -22 14 9 107 94 -116 -67 -215 73 -7 46 15 -92 85 94 67 -4 63 -37 -21 -121 -164 -150 7 50 102
3483 102 25 -92 61 207 115 143 -142 -74 -66 39 -10 -174 -146 100 140 124 -11 -75 235 152 245 -121 -49 -171 132
3508 132 161 -108 -15 24 79 21 -14 -175 -23 165 95 -34 -56 -51 -25 -52 247 66 -17 172 27 33 135 -181 -10
3533 -10 62 21 115 -142 -72 35 -46 44 149 46 154 54 69 174 -113 43 108 170 -34 90 236 -27 117
3556 117 113 -146 -82 67 167 -158 -17 -17 138 62 -66 -85 -116 -182 74 93 96 -9 -4 279 106 84 80 -67 -31 -67
3582 -67 43 -174 -187 -21 -23 -43 157 -43 49 -20 161 170 7 -148 116 43 -256 4 72 251 208 -35 101 70
3606 70 96 77 41 -40 -151 -23 -15 210 -14 -122 160 171 6 -28 44 146 -79 -130 -15 92 -187 -98 88 22
3630 22 -7 194 169 -35 122 -24 142 -77 150 159 64 -10 -53 -97 54 38 159 -82 58 133 108 -128 -159 -84 -53
3655 -53 -59 43 -135 -32 87 174 40 -174 26 175 28 -157 -85 -248 -50 -154 85 -130 -45 -168 -7 97
3677 97 51 -25 34 257 47 70 109 123 170 167 -64 -145 -4 18 235 35 77 -131 -44 64 -3 103 142 31 20 -68
3703 -68 -3 -83 68 149 124 -48 -11 13 -56 54 75 -27 37 14 40 39 2 8 -100 -134 106 -195 -188 49 126 73 14 -165
3731 -165 -132 -188 -31 256 -95 -103 -87 29 163 -13 -123 -71 -65 -21 90 -304 -132 -72 119 168 6 -6 -191 16
3755 16 -4 26 -40 60 -26 140 167 53 -169 -50 134 -155 28 -165 -91 128 142 40 -71 -1 204 140 -7
3778 -7 -73 -149 4 348 -18 -8 -50 -139 213 -177 -269 -142 133 61 18 96 -77 -130 173 100 -16 37 36 -144 144
3803 144 78 -182 -75 -141 250 63 -52 67 9 108 67 -87 53 28 -108 -11 -248 -160 -1 137 173 178 -1 -14
3827 -14 97 98 71 -152 -298 -91 6 -48 -73 69 4 55 59 92 44 41 -45 83 52 -166 -51 76 105 -54 31 45 -187
3854 -187 151 230 -25 27 -122 58 32 -191 -22 5 -238 -224 -28 77 -26 -101 195 115 -13 -90 16 21 -112
3877 -112 -63 35 -39 244 74 113 -11 137 -66 -128 144 70 28 -92 42 -15 -74 106 7 -158 -7 100 -97
3900 -97 55 -90 -115 -96 -80 -57 246 50 265 75 -152 67 34 32 43 -247 75 277 -1 64 86 -44 60 30
3924 30 122 9 -145 46 -16 -58 65 142 -68 -52 34 97 -124 170 -38 -17 104 -80 -157 96 68 68 -74 -90 -30
3949 -30 96 19 91 -52 48 -70 66 37 -166 54 -126 74 129 -68 114 21 -125 -74 -93 -134 -49 271 -128
3972 -128 -99 -49 -117 -92 45 77 -132 60 1 149 38 -174 -101 121 75 -59 111 -48 73 -121 -13 -62 -123
3995 -123 -82 202 5 17 -85 63 -75 188 -24 -81 -118 -34 -12 9 -93 -38 -55 -127 209 126 -110 -13 -4 163 132
4020 132 -194 145 159 -14 -195 -45 -91 2 -83 125 29 -280 102 138 11 -145 -50 35 187 -22 57 24 -3 -148
4044 -148 166 -1 86 94 132 0 -230 -10 -110 -78 16 233 -17 -21 -63 -47 -37 217 13 -69 45 17 68 -129 85
4069 85 127 0 89 -110 -98 66 16 31 -58 4 92 124 30 -36 57 129 199 -53 70 -72 -70 54 77 -17 -145 -124 14
4096 14 0 -58 241 -52 -8 98 24 40 -54 -3 211 30 91 -59 279 -64 30 137 54 45 35 101 109 -75 -137 -119
4122 -119 167 276 136 79 -162 -192 168 -178 -46 -283 29 38 0 -68 -226 16 165 4 51 99 34 19 20 -56
4146 -56 61 -96 -106 32 88 91 -26 -64 -64 -16 87 42 20 -49 0 50 75 46 -95 92 -171 -137 66 -35 -125 136
4172 136 -145 -170 -10 -86 -21 -77 126 64 183 85 -76 140 185 -35 -125 -38 -110 126 78 184 -13 -61 8 77 -7
4197 -7 55 -85 -156 107 -91 24 -39 37 72 -22 136 142 29 -382 37 -94 0 -165 -48 -16 -29 -239 -38 -5 -128
4222 -128 -49 83 -45 225 -12 -34 66 80 -63 -83 145 -125 110 -48 -48 -34 48 -21 -30 39 62 -126 33 46 34
4247 34 -8 -58 -102 -5 -58 -21 152 86 -42 113 -117 -199 78 15 27 -82 -68 -132 -67 -32 7 -31 -174 143 -162 32
4273 32 -178 -126 20 132 -42 -8 -128 -125 166 -14 28 165 8 15 -17 108 -85 -40 19 -47 -39 15 121 163 -245
4298 -245 156 86 2 3 67 -130 -108 88 -58 -27 5 -94 -67 63 4 136 55 -182 123 17 -53 -167 -19 11 96
4323 96 -42 -83 -20 114 126 -31 -86 -61 -129 13 -128 -89 58 95 -7 -9 27 -84 136 110 -212 96 225 -31
4347 -31 71 141 -114 -98 -16 -51 132 -240 58 144 40 -91 -96 184 -155 110 105 -221 -8 170 -13 188 28
4370 28 26 -40 -30 19 -105 11 -49 -34 4 84 66 -127 -94 -81 86 53 142 94 14 34 -19 -25 -115 101 42 -27 180 40
4398 40 96 -20 -40 58 -5 223 84 -74 41 -54 22 109 131 54 18 -142 -18 -71 44 159 -113 47 105 -37
4422 -37 -50 65 -11 38 37 -38 -78 31 53 112 -99 58 27 -105 -129 139 -71 -227 114 -69 -6 87 -132 -223 1
4447 1 72 -214 -234 33 -39 11 25 30 -31 167 -154 -105 -30 -21 54 -3 43 -38 24 87 145 57 -31 78 31 69 81 -65 -100
4476 -100 113 22 13 91 -189 -8 -104 -40 96 -77 -139 -21 110 -49 -14 196 -3 -122 -108 90 -179 10 -142
4499 -142 -74 -131 -5 -19 -155 176 173 -118 36 12 55 73 -57 17 -11 82 -70 45 31 93 -16 -117 25 -70 -62
4524 -62 -82 146 80 33 -63 -165 -76 147 -14 20 -64 14 102 12 -103 129 -113 113 166 -105 -75 -118 82 -89 10
4549 10 82 -163 13 -64 -30 91 54 -138 -55 -66 -6 -105 -2 -91 135 63 65 -45 47 -44 -196 -103 191 75 169 -136
4575 -136 -181 39 -7 38 -82 0 11 17 153 54 105 -125 -22 124 86 142 -36 39 -57 -86 -51 -129 -20 59 104 -6
4601 -6 110 -155 9 -12 127 237 -57 -65 119 5 144 -11 3 -16 -103 -62 23 57 -117 38 9 30 -131 -57 139
4626 139 21 3 67 -123 171 157 121 40 69 -14 -190 53 97 -52 -160 -44 80 -41 -60 87 201 57 -78
4649 -78 133 41 34 -5 33 -148 -94 -47 113 31 174 -148 -20 16 22 93 69 -83 80 50 -28 -6 -116 -95 12 117
4675 117 -130 7 5 47 99 112 -86 -23 -175 168 85 -110 -26 134 272 179 61 -40 125 -20 28 163 94 -139
4699 -139 284 -9 40 -37 -57 -52 -15 93 46 -14 -150 64 -58 70 -46 -73 89 114 -135 18 -190 -132 3 64
4723 64 133 -34 5 -37 46 -133 14 200 94 72 -169 -128 -151 -78 123 69 28 -141 156 142 33 -251 -29 49
4747 49 81 79 183 13 29 22 57 -40 136 97 156 -77 28 -195 -53 29 -74 202 16 166 -67 -19 -116 44 145
4772 145 26 42 45 -196 148 -31 53 -140 68 111 85 73 -167 8 26 -128 -144 161 -64 -120 -115 -25 -59 133 -123
4797 -123 -82 -16 -52 36 -74 -75 -39 12 4 14 139 -68 2 104 36 46 -69 213 -59 17 55 -11 -27 52 160 -106
4823 -106 -207 -15 -60 259 92 -20 -86 -6 -24 1 -212 -116 -27 14 96 216 -113 -2 -77 -253 -103 34 -46 -123
4847 -123 200 5 -136 88 103 -211 -49 84 -29 -32 -130 16 205 -36 -51 58 111 174 -16 152 121 62 -81
4870 -81 37 -49 -133 204 -56 67 -90 -71 -179 36 -89 -22 15 -90 -44 76 170 -130 214 73 -54 60 -13
4893 -13 64 -51 2 79 -190 50 -16 146 1 -107 -28 -216 -108 -60 -16 127 92 95 46 -39 -4 84 -27 -186 -122
4918 -122 -58 40 25 124 -32 80 142 134 36 52 -31 -189 45 -101 -63 109 105 65 50 40 78 -33 99 56 94 -53
4944 -53 -203 -31 158 -147 94 79 -125 188 -159 34 30 -116 -49 132 -62 -195 -96 105 -141 73 86 -65
4966 -65 -58 13 227 0 -75 -127 -45 -18 135 -52 88 0 31 171 47 -36 -65 7 265 28 81 -52 22 214 -48
4991 -48 -33 -35 85 14 99 100 18 -9 38 -109 -147 -19 -106 -126 27 -9 20 76 46 212 80 -54 -197 165 -57 -80
5017 -80 -140 -214 38 72 -30 85 12 -114 -20 251 165 144 23 -82 90 -130 32 -197 17 164 38 -12 -194
5040 -194 -67 10 47 82 -145 -53 -56 69 -41 72 -39 -52 1 -8 38 21 -42 -112 115 -56 -58 128 104 101 152 11 -232
5067 -232 -118 77 -45 -124 -4 -97 41 78 -60 -5 -37 240 -6 -2 -134 -24 76 -28 27 -128 82 -54 -225
5090 -225 45 -49 30 -198 -97 -37 -86 35 112 -93 15 -39 -117 -255 233 133 -62 51 99 -128 39 -35 -47
5113 -47 -52 151 74 -3 -103 -29 -13 -171 -75 -121 -112 -54 -18 127 116 -304 40 147 170 -15 98 -89 27 132 -144
5138 -144 -53 -46 -69 110 -50 -18 -138 70 15 -94 111 117 -158 231 -15 106 -100 -133 -2 -37 57 -64 45 -124
5162 -124 198 35 -243 140 162 188 193 -30 -63 -84 -215 309 225 10 18 -23 150 102 -218 12 -75 -9 -34 75 37
5187 37 -18 105 -18 -71 -85 -13 79 20 -10 -64 -202 -9 -64 -165 -227 -222 22 57 51 -13 -52 -158 -113 186 133 -32 0
5214 0 -54 -100 26 -121 -213 215 72 55 65 -33 -40 87 57 -11 -65 -80 -96 59 -24 -166 -7 2 2 22 -95 143 -157
5241 -157 29 195 -31 191 40 -45 11 -43 31 94 -126 160 -34 -38 161 -40 67 200 -28 -199 277 44
5263 44 33 142 -113 -12 -3 157 -150 19 -42 50 -83 116 -84 231 -6 -15 39 -65 192 -110 -66 1 -106 -174
5287 -174 55 -74 3 -74 -230 -85 -73 67 -68 85 44 72 42 -153 119 -245 87 3 -96 19 49 167 -11
5310 -11 48 50 -27 -28 224 -1 60 -110 -49 -27 58 -1 15 -116 -65 51 -3 44 -54 125 -9 23 19 15 56 189 -300 -19
5338 -19 -65 41 185 -107 -184 -37 5 90 52 -1 -126 46 -1 0 65 -63 54 -15 -82 79 35 -105 -65 -65 14 -77
5364 -77 -65 75 27 -118 164 155 97 13 -12 177 60 35 -75 87 -51 116 -96 -76 -114 105 -79 221 -57 31
5388 31 110 -60 -55 -105 24 -109 -104 -34 65 97 120 -63 -5 85 -214 -40 -133 30 -68 -22 85 58 30 -3 1 168 21
5415 21 -40 -172 -21 85 66 -41 -158 34 -56 320 59 -4 -69 54 168 -38 -154 -39 72 117 59 52 -4 -91
5439 -91 -36 112 60 27 -79 19 119 34 -130 -196 178 33 80 44 -191 32 -150 9 27 92 40 105 -111 -3
5463 -3 164 -103 -115 28 70 94 20 -192 -4 143 71 62 34 47 16 79 -14 -68 77 -78 -95 119 31 140 -83 -131
5489 -131 17 207 129 75 65 -78 -51 -41 -73 60 -109 272 -10 15 -89 138 -124 123 -91 88 -59 13 -139
5512 -139 -39 -66 77 -45 -51 -137 -96 38 80 71 -5 12 -231 -121 -63 125 -174 -183 -64 -62 -15 117 -13 130 -144
5537 -144 -118 185 32 94 13 -41 -25 -104 -210 -186 69 -39 37 -116 194 -91 -113 84 -54 -51 140 18 97 62
5561 62 172 -53 -125 71 -125 40 -129 -40 -105 43 75 211 81 -33 -13 64 -114 7 132 7 -4 -68 97
5584 97 116 27 -8 -9 -46 -87 5 -87 -99 -56 -25 85 -108 -43 -78 -192 -46 57 167 -73 -117 -59 33 43 -44 83 22
5611 22 -33 -68 -33 -45 20 55 -108 -168 144 -58 71 148 110 111 -82 16 29 45 -2 130 -175 -78 46 -38 289 -32
5637 -32 29 85 -67 45 -1 111 -28 19 112 42 53 -63 -18 -114 -38 -23 185 116 -147 -28 -66 271 24 154 30
5662 30 -93 57 34 111 -67 -231 81 -254 -56 -23 206 -129 -225 -65 27 -16 -66 -149 -212 -314 135 -13 -235
5685 -235 -19 1 70 -142 -42 -9 -42 159 -127 42 -40 -56 -15 -30 128 123 108 50 -48 -112 79 -121 -74 -9 88 -51
5711 -51 56 -291 -80 38 36 -175 70 120 158 -32 -49 -75 -4 -41 66 7 -20 63 -90 48 -127 -36 -6 8 -20
5736 -20 -200 -115 75 185 168 144 -160 -153 202 -20 4 222 -88 -80 -42 85 29 -17 -6 -113 -85 -196 44 -241 -46
5761 -46 151 73 -280 -23 -103 2 -109 178 87 -29 53 -33 95 -85 114 -32 -29 -20 -50 1 57 111 66 84 -287
5786 -287 110 -77 -3 69 -34 18 -243 -96 -60 10 144 118 81 16 -81 -185 45 -87 272 -155 -37 346 48
5809 48 9 -88 15 -139 -163 219 82 -66 119 -24 -111 -31 -14 -103 -160 -32 160 19 -48 -18 -58 -33 193 -105
5833 -105 -2 -28 76 -7 -28 60 147 -14 -167 198 82 -6 41 -139 -3 63 -86 25 -95 -49 46 -22 -16 43 26
5858 26 -124 -43 77 -31 21 -135 132 109 -68 252 18 191 49 113 -3 125 53 -82 -85 18 -4 -11 160 -45
5882 -45 33 31 -28 -36 89 -232 139 8 43 -67 -70 104 -20 -73 113 59 -57 74 -26 -168 157 -8 123 -149
5906 -149 -54 -49 6 1 -186 -61 78 -44 95 -134 -19 130 188 106 1 116 98 137 -35 -49 15 -59 75 76 -4
5931 -4 -60 17 56 20 -45 -6 -82 156 137 -25 -97 25 -24 -36 47 -46 68 171 -58 -110 133 -79 -131 23 20 -58 62
5958 62 -33 -3 -86 -222 -20 -87 -113 107 -94 8 93 -112 -21 -32 -101 -11 -187 52 81 18 -241 -96 -20 54 -20
5983 -20 91 -151 -47 38 5 -248 -45 -214 -6 -9 -54 -7 57 71 -94 35 -51 -81 12 165 -23 99 136 78 22
6008 22 102 30 -120 -44 -78 -139 106 -53 -54 -190 -70 111 66 -123 302 21 -99 -153 119 -4 -6 -116 35 15
6032 15 60 132 118 -40 -12 -48 81 -204 4 135 -191 -48 -57 57 -4 -208 148 101 -93 -31 -9 1 -118 -146 19
6057 19 119 58 61 31 -102 -30 41 -17 -233 -35 12 -32 4 -22 -96 45 14 122 -87 -93 25 70 69 74 -89 120 -17
6084 -17 -31 -11 -8 -58 -102 101 31 19 -85 -87 -75 -53 -28 248 -21 15 -68 44 62 109 -27 0 97 -134 -33 16 16 -124
6112 -124 -34 46 54 -14 114 153 73 70 -33 124 64 -104 -40 70 91 -70 -25 -23 -146 84 -46 90 93 -97 -69 -105
6138 -105 -71 21 -116 90 20 135 -94 -217 -42 137 -88 -15 13 -84 37 -110 133 150 221 -84 -46 -276 36
6161 36 91 66 -93 12 -5 94 -149 -37 -12 -16 -4 -1 40 -201 -153 67 -178 8 -105 -72 69 -3 224 -81 -62
6186 -62 39 -172 77 4 55 155 -24 14 89 -15 -5 -149 25 -44 -43 28 140 -36 33 -224 219 54 73 13
6210 13 164 185 -126 -80 81 -31 175 -128 111 -222 -71 56 -85 185 47 95 243 -7 -195 -121 131 166
6232 166 -54 -54 137 -129 -101 -14 102 -36 -141 -152 63 118 78 24 -76 122 -6 -43 148 -19 -107 -21 -22 6 -12
6257 -12 103 -96 27 -34 -195 96 3 -26 -6 96 132 -23 -163 -104 -84 95 -173 -167 116 -177 -52 -25 -72 156
6281 156 -97 -112 29 186 -35 -110 -130 119 92 36 7 -82 132 72 123 -9 -110 -37 45 -129 -46 -109 -227 -141 -33
6306 -33 -165 21 -3 -4 55 -76 -161 227 2 4 -30 -50 77 -76 80 -81 -36 -2 -137 189 -57 144 45 -102
6330 -102 37 -79 141 -107 38 -10 11 -39 145 12 -37 -11 28 185 -32 78 -52 -48 -36 -21 -94 -46 205 -47
6354 -47 103 4 -14 -26 -117 102 -34 -27 56 130 154 30 -108 -10 -44 -113 79 -18 48 -37 -22 -37 66 95 -59 152
6380 152 -88 -1 30 -71 -45 -16 -62 -46 114 -63 -62 51 27 29 89 -48 30 152 -82 -103 16 102 -38 -118 121
6405 121 48 115 107 -51 -10 -64 37 149 73 -17 155 -21 219 51 -92 -27 -265 135 244 89 -105 45 33
6428 33 132 69 36 -16 -198 80 67 -215 65 27 149 -181 -74 99 58 64 -43 -125 -127 40 11 81 199 -102 28
6453 28 188 -50 -109 -1 -93 -203 232 -82 36 62 -124 20 -93 7 80 -6 33 84 -131 56 79 -108 69
6476 69 -121 53 53 64 136 -20 -3 182 -1 133 -2 -64 34 -98 33 191 -33 59 74 -190 3 -270 115
6499 115 -93 -49 2 -11 103 -51 30 113 161 -27 162 -197 -29 67 -56 -64 162 132 30 0 -34 -186 -39 -118
6523 -118 6 28 123 59 77 8 320 68 -123 39 -68 157 -142 -182 -185 -9 -119 -41 -42 171 16 214 -51 82
6547 82 212 -1 -5 -188 44 10 -121 35 -89 -141 124 -64 29 -62 -76 -102 -38 98 -41 -139 197 -28 -3 -47
6571 -47 -44 50 66 -106 28 -86 40 33 149 -104 -64 -85 -136 120 9 25 224 -10 -125 127 -41 -86 -79 193 80
6596 80 51 -87 37 196 19 -121 -45 63 -17 -209 -35 70 133 -18 -88 -120 -41 -98 -108 -195 38 -42 7 -122
6620 -122 -109 231 55 171 20 -65 -26 55 -34 -7 -29 -49 -95 32 -54 -1 187 126 -33 -57 -213 -118 -46 -40 39 8
6646 8 -188 53 86 54 -84 15 187 41 65 -133 -33 25 3 -54 -38 236 -106 152 50 114 54 -68 142 143 109
6671 109 -121 43 -10 39 92 -146 -81 26 61 -21 -126 28 172 -168 -79 63 108 63 -7 56 -74 -225 -27 -89
6695 -89 18 -39 85 63 -22 54 154 -96 97 -25 202 -34 147 16 -108 42 47 32 109 -48 -120 -289 -188
6718 -188 26 3 -7 -4 40 -48 71 -40 -69 -98 -145 -198 109 -26 -38 31 107 -154 -51 -51 80 80 53 -67 125 -74
6744 -74 29 -60 -49 159 43 143 -21 25 4 -136 -103 101 -195 -34 27 235 -31 -159 -35 -414 -16 -46 -92
6767 -92 -80 -42 -50 -16 27 35 -128 -78 70 47 23 -128 -191 -270 -185 -257 28 -216 -21 -85 -147 -48 -125 80 -24 -20 -105 35
6795 35 63 170 -38 119 -98 -212 -47 -183 -54 74 108 18 17 118 136 -68 -128 8 -49 143 114 9 -76 98
6819 98 69 -134 75 -22 150 75 176 11 -115 -164 155 -123 -97 71 4 -3 -45 -12 11 -30 -26 17 25 -16 74 -126 -110
6846 -110 147 16 -38 -161 41 -76 70 92 208 -98 48 23 12 -14 9 -96 -10 88 43 123 -61 -90 -116 -27
6870 -27 -96 -25 58 8 58 -41 -27 37 -160 -24 57 -58 -44 70 99 -84 108 1 154 243 -64 48 85 226 70
6895 70 -31 56 16 30 88 -95 60 -189 -30 13 -47 147 -83 -23 -67 -135 32 -142 -17 42 95 24 -66 -216 -167
6920 -167 -21 -2 219 -215 62 -32 -24 188 32 88 -100 -5 -22 0 -111 -176 212 322 -110 -250 29 21 54 9
6944 9 104 -46 -154 65 -261 -6 -9 111 158 48 32 87 170 32 -86 146 -130 20 -118 125 -82 -57 -180
6967 -180 -68 342 60 -47 -23 83 52 163 107 121 -22 -185 -303 134 -124 -152 -61 -78 -68 107 5 63 79
6990 79 -70 -82 111 156 -158 -61 -104 95 -120 205 29 103 34 40 -38 132 -30 -46 242 9 191 -73 -271 -13
7014 -13 -148 133 197 80 115 -67 90 -91 34 -30 -48 -108 34 -32 83 172 135 128 -143 25 -46 126 -73 -211
7038 -211 10 98 -164 -85 0 28 37 -31 58 38 8 -26 15 -53 30 -9 -98 86 60 76 7 -48 -100 135 59 185 78
7065 78 -30 174 263 174 11 -12 -66 -137 -6 83 -53 61 44 -24 15 35 77 125 -12 -27 125 -15 34 27 -61 -83
7091 -83 -1 -133 -52 -46 41 -24 88 -103 105 222 -127 34 -56 -35 75 -109 -31 -38 2 154 -26 5 -15 14 -181
7116 -181 -14 144 -121 43 95 41 -238 -46 97 -90 53 50 -71 -116 -73 136 48 165 -101 -198 -81 -61 -11
7139 -11 29 -53 124 -94 -37 -103 14 45 17 -1 -28 -22 -18 35 -21 5 57 97 35 -115 151 -177 -108 34 -2 -3 -44 8
7167 8 95 14 102 -110 107 46 -37 48 -14 -73 -38 -96 106 33 -39 -56 -107 -137 -5 197 38 57 232 97 -176 -185 84
7194 84 47 -62 -112 -29 -86 -30 67 -56 93 47 19 -30 -5 -50 -46 120 -149 86 -175 -217 30 -180 -1 -119 74
7219 74 -97 36 -87 -103 -7 -100 -149 221 -195 -179 116 -72 158 -235 0 -21 -27 30 57 9 27 101 200 259 177 9
7245 9 -30 163 -162 -103 47 116 152 116 28 -8 -21 -89 -61 86 -47 -18 26 80 -48 -108 0 48 -126 -75 -84 -98 -12
7272 -12 44 -32 -64 -233 -35 107 -91 -102 -47 -33 -59 129 89 190 -30 -119 -147 -8 69 49 -187 53 -148 -68 -82
7297 -82 149 40 1 -130 16 -26 -11 -221 161 -44 -224 -107 -19 157 -26 -166 20 45 -1 14 103 -120 -205
7320 -205 -125 -75 -7 77 -76 -147 10 67 195 80 67 31 -87 -104 -13 45 -63 -81 -46 -168 35 -53 30 -213 -9
7345 -9 -140 172 195 -110 60 60 15 171 -12 -49 -16 -230 65 11 44 -4 -56 56 4 -93 -134 18 59 8 68 -68
7371 -68 163 53 17 -9 93 -78 207 84 7 -16 11 20 -163 -88 -36 -34 192 -26 6 103 -156 40 103 176 -129
7396 -129 -24 -12 119 -29 -17 83 -191 132 65 -45 120 83 -31 10 96 14 -64 59 -76 -83 -82 180 -4 -119
7420 -119 26 27 -63 26 -20 -10 -54 -34 -40 138 -9 67 8 -88 36 52 -29 141 50 114 -40 71 -19 41 -109 -118 3
7447 3 73 -127 -100 227 -35 4 -281 -99 40 93 65 37 40 -4 -6 -9 -39 -37 -95 -133 -47 -153 23 -70 -49 -43 163 -99
7475 -99 -23 -31 4 -220 -34 6 -103 -58 89 -119 132 159 -77 66 265 -138 -147 56 -83 -139 21 -123 -61 152
7499 152 41 -177 -47 237 -209 -36 -86 53 4 -19 -170 -2 -163 -190 -28 83 -151 -86 -90 -30 142 25 -164
7522 -164 -61 178 83 106 -63 -82 -208 -42 37 4 78 -82 30 41 141 -33 -73 26 196 -216 81 168 -206
7545 -206 68 175 -23 183 59 5 -108 67 30 111 -65 146 -148 172 -32 -87 -107 99 11 -132 65 -17
7567 -17 -72 -62 111 -52 148 65 -233 10 24 -70 -84 87 404 58 22 56 -232 130 22 48 1 153 36 -92
7591 -92 -47 39 0 -220 -155 -184 -75 -15 -48 -82 -98 -82 -135 145 70 131 -9 46 90 52 137 51 -153 -269 -24 205
7617 205 92 66 103 -169 -83 -13 -126 -13 15 76 48 147 103 -7 -72 -117 53 12 86 26 6 -45 141 10 16 64
7643 64 -47 71 34 101 -149 133 -42 -91 -116 -56 -33 -136 -110 -64 -20 -105 -228 97 70 -35 97 120 17 11 -71
7668 -71 81 -51 -86 -69 132 35 -6 -106 -113 -58 -186 99 156 103 19 153 -91 -83 -108 -53 43 -28 55 -1 33 -68 114
7695 114 -163 32 13 -54 -48 -143 -163 89 100 -89 9 144 25 -9 189 74 67 178 -43 49 -66 94 50 -42 42
7720 42 -1 25 -165 77 165 -77 118 -102 43 31 -69 64 60 13 129 -68 -52 3 -17 2 -49 -52 -183 -90 65
7745 65 -56 159 67 -92 64 -8 -27 -72 33 161 3 43 -13 -39 -66 -23 51 18 107 2 92 -131 164 49 16
7770 16 -74 40 -314 27 -71 -60 -28 19 176 71 15 5 -83 -67 -116 9 -32 -74 -164 -46 -90 75 88 -16 -161
7795 -161 -43 -236 29 17 16 14 86 60 97 30 53 156 -122 93 47 98 89 -40 -204 57 85 64 -92 110 -8
7820 -8 135 151 87 115 -107 -167 -46 -47 81 143 151 -58 47 -19 -105 -117 124 161 25 -80 134 132 -144 -103 39 -74
7846 -74 -91 -94 -47 -129 -76 41 -233 -159 -22 -104 148 70 -169 112 19 69 21 83 -188 -174 96 -61 -19 -38 -10 89
7872 89 60 18 73 0 8 75 79 -295 -113 13 52 -37 -27 -98 -66 21 13 13 144 16 -150 -11 -97 29 56 119 -282 -77
7900 -77 -110 -279 -45 -189 223 87 93 -32 111 -141 -53 -114 12 -26 -124 37 168 185 -230 115 99 25 -43 9
7924 9 -80 60 56 -151 92 -77 -67 -69 91 91 15 104 -229 -80 -140 103 66 -22 10 -82 9 -2 52 -49 -32 -86 86
7951 86 100 121 -221 -15 -45 -175 -10 48 -32 -3 36 122 23 -109 -87 -56 124 -169 39 212 -50 52 55 -60 13
7976 13 -34 -23 78 56 -117 201 -25 8 112 43 -58 -130 -70 23 -103 -97 -122 -50 -21 -75 1 -100 -10 -7 -89 -98 78
8003 78 107 -23 112 205 -70 -30 -163 103 -93 -40 138 -12 -94 98 -45 29 -136 95 44 -78 -253 -127 -51
8026 -51 -148 -103 53 135 128 -105 -116 127 10 -208 -33 -20 14 -130 102 -10 3 103 -96 -30 -20 81 70 -162
8050 -162 218 -50 11 -223 178 74 132 -88 -17 -186 72 -130 -28 -183 139 89 0 101 -34 -56 217 112
8072 112 10 -61 -57 14 80 91 -87 -25 -66 -190 -48 181 -155 -134 -95 -62 23 -108 -36 174 26 -39 -162 -209 53
8097 53 -102 -84 151 -4 142 70 83 -63 87 -44 -36 112 -118 -133 250 -41 50 -7 -77 -118 10 -48 54 33
8121 33 53 -11 -9 -17 -165 19 -111 74 90 -12 -41 60 45 -182 -68 -215 -14 61 -14 81 135 -33 -50 -66 -241
8146 -241 -251 -4 81 208 125 -58 -35 -107 13 26 -56 117 159 9 -6 -268 5 -84 31 -83 -99 52 32 -240
8170 -240 -75 34 -148 -50 -73 22 -27 98 -175 -85 227 262 2 -16 -90 -36 121 138 -4 5 -8
8191h
$$ Imaginary data points
##PAGE= N=2
##DATA TABLE= (X++(I..I)), XYDATA
0 0 0 0 0 0 0 0 0 0 8 -8 8 -8 8 -16 16 -24 24 -32 34 -41 49 -57 66 -79 89 -103 115 -131 148 -170 192 -212
32 -212 242 -268 298 -333 372 -413 454 -507 560 -622 688 -760 843 -935 1040 -1158 1296 -1454
50 -1454 1642 -1867 2145 -2495 2954 -3583 4507 -5991 8771 -15772 70762 86408 -84993 -56671
64 -56671 -3233 32839 74963 29924 -107252 -65303 76714 70111 -24322 -44670 -48656 -9658
76 -9658 77804 51042 -79433 -75097 31661 61056 28335 -12488 -67668 -34601 74152 74332
88 74332 -28134 -62211 -23068 27010 64864 24849 -65455 -58520 27979 54987 15900 -32066
100 -32066 -58826 -12864 60675 39569 -39592 -50581 -6347 33607 50319 4243 -64332 -34006
112 -34006 50425 52144 -855 -31679 -42262 -2231 66056 38090 -51469 -50988 8275 30890 32511
125 32511 981 -60085 -37191 49622 48152 -19185 -37571 -22847 6343 52640 30682 -52439
137 -52439 -49376 28231 47296 16162 -14946 -47371 -23380 55172 51569 -31281 -51589 -9689
149 -9689 21465 41392 16384 -53058 -48388 33076 50393 -413 -29268 -33886 -7203 49356 39614
162 39614 -38693 -50521 9734 37886 27001 -2756 -46209 -32262 42965 52016 -14718 -42725
174 -42725 -20040 10663 42478 25973 -42967 -49435 19014 43895 11213 -17965 -36887 -18501
186 -18501 40831 43050 -24749 -45436 -4082 25083 31804 10311 -39695 -37661 29252 47735 -116
199 -116 -29562 -26151 -2820 38488 33517 -29880 -46907 4213 32277 19731 -4176 -35481 -28807
212 -28807 29326 43182 -10146 -35944 -14270 10705 32168 22145 -29879 -39789 14940 39923
224 39923 11342 -15255 -28365 -15155 30700 37685 -16800 -40926 -7681 19616 23731 7743
236 7743 -30875 -34363 17972 39553 1511 -25649 -20522 -1202 29751 29306 -20389 -38477 4033
249 4033 30894 18345 -3376 -27431 -23886 22949 38120 -6614 -33558 -14976 8182 23970
261 23970 17123 -23955 -36676 8245 34052 9271 -14773 -21522 -11135 24079 33636 -10373 -34930
274 -34930 -4878 21445 20708 6514 -22808 -29225 12788 35656 3061 -24848 -19348 -1673 20879
287 20879 23097 -14775 -34739 -1731 25893 15756 -4494 -20729 -17436 16936 32896 -1235
299 -1235 -27386 -12293 10956 21876 14000 -17947 -29887 4464 28995 10026 -14230 -21243 -10946
312 -10946 17746 26401 -7950 -30146 -7581 16306 17803 5615 -17789 -22961 10821 30894 4352
325 4352 -19822 -14421 762 18867 20446 -11950 -30697 -1763 23564 13097 -5723 -18990 -17800
338 -17800 11480 28587 -265 -25995 -12109 9178 17043 12279 -11951 -24945 2764 26836
350 26836 9825 -12654 -15481 -6360 14182 22653 -4681 -27135 -8005 16115 15278 2276 -15814
363 -15814 -20939 5671 26211 5804 -18636 -14727 411 15075 17201 -7065 -24630 -3059 20457
376 20457 12715 -4210 -14198 -12404 9596 23523 689 -22396 -11160 8699 14704 8838 -11191
389 -11191 -22671 216 23274 9850 -11972 -15038 -5581 11630 20148 -1707 -22899 -8169 14433
402 14433 14233 1851 -11787 -16011 4329 22431 6086 -16920 -13318 2263 13209 13326 -6600
415 -6600 -22216 -4744 18517 12593 -5584 -14236 -10903 7453 20523 2960 -19198 -11244 8014
428 8014 13564 7502 -8396 -17734 -560 19526 9417 -10618 -13201 -3481 9983 15824 -1993
441 -1993 -20232 -8123 13091 12934 383 -11493 -14222 3234 19411 6456 -14439 -12423 2167
454 2167 11770 11508 -4156 -17844 -4394 15802 11324 -4692 -11637 -8068 6451 16731 2165
467 2165 -17075 -10314 7540 12217 4993 -8336 -16090 -1057 17191 9385 -9603 -12317 -2954 9074
481 9074 14169 -119 -16712 -7634 11428 11808 699 -9105 -11380 2158 16405 5792 -13248
494 -13248 -11515 2085 10116 8704 -4251 -16503 -4855 14283 10656 -4769 -10869 -6805 5536
507 5536 15282 3867 -14397 -9464 7131 11212 4779 -6073 -12943 -1847 14249 8540 -9185
520 -9185 -11433 -2081 7360 10697 -305 -15067 -7610 10364 11311 -241 -8588 -8975 2197 14676
534 14676 6993 -10882 -10832 2469 9941 7816 -3140 -13445 -5082 11446 9922 -4591 -10702 -5829
548 -5829 4661 11728 2667 -12587 -9430 6059 10890 3743 -5967 -10955 -985 13338 8707 -7214
562 -7214 -10655 -1726 7497 10010 -143 -12827 -7441 8471 10083 -676 -8411 -8484 1300 11964
576 11964 5891 -10008 -10404 2226 9367 6497 -2717 -11316 -4328 10893 9859 -3602 -9535 -4484
590 -4484 4405 10518 3019 -10875 -9110 5156 9917 2482 -5872 -9573 -1761 10520 7938 -6533
604 -6533 -10182 -966 7070 8231 3 -10610 -6650 7846 10344 -248 -7836 -7000 1667 10452 5371
619 5371 -8592 -9579 1517 8477 5780 -3218 -10143 -4028 8969 8716 -3261 -8935 -4167 4414 9602
634 9602 2560 -9621 -8000 4852 9373 2697 -5251 -8730 -1209 9859 7330 -6139 -9150 -852
648 -852 6095 7206 75 -9775 -6367 7076 9057 -932 -7063 -5753 1208 9072 5428 -7616 -8979
663 -8979 2332 8066 4437 -2653 -8474 -4123 7970 8751 -3195 -8853 -2997 4180 7155 2360 -7781
678 -7781 -8072 3820 8877 1867 -5491 -6729 -1203 7710 6850 -4539 -8968 -1074 6690 6378 -576
693 -576 -7688 -5586 5348 8868 153 -7187 -5625 1621 7945 4396 -6029 -8172 670 7266 4443
708 4443 -2931 -7634 -3268 6633 7434 -2072 -7838 -3521 3887 7350 2301 -7075 -6863 3265 8188
723 8188 2725 -4674 -6642 -950 7133 6170 -4084 -8198 -1247 5731 5608 -481 -7253 -5122 4924
738 4924 7851 17 -6291 -4717 1787 7284 4369 -5321 -7385 1093 7180 4161 -2691 -6939 -3120
753 -3120 5983 6998 -1989 -7343 -3214 3811 6176 1652 -6144 -6567 2956 7463 1968 -4534 -5663
768 -5663 -469 6529 5779 -3486 -7524 -957 5490 4802 -888 -6386 -4590 4062 7150 74 -6368 -4276
784 -4276 1621 5905 3725 -4660 -6769 777 6656 3570 -2329 -5694 -2327 4961 6384 -1216 -6583
799 -6583 -2807 3758 5447 1371 -5380 -5863 2001 6638 2130 -4552 -5259 -567 5387 4869 -3112 -6574
815 -6574 -1349 5022 4673 -609 -5624 -4096 3713 6438 601 -5495 -4215 1524 5442 3204 -3920
830 -3920 -6270 160 5922 3412 -2679 -5544 -2236 4571 5749 -1128 -6088 -2711 3350 5232 1452
845 1452 -4789 -5158 1878 6212 2021 -3909 -4877 -343 4879 4345 -2544 -6104 -1436 4448 4516 -522
861 -522 -5120 -3746 2877 6035 816 -5057 -4015 1612 5400 2790 -3388 -5544 163 5513 3367
876 3367 -2296 -4897 -2122 3872 5128 -731 -5741 -2843 3147 4675 940 -4167 -4637 1612 5492
891 5492 2221 -3587 -4613 -253 4549 4107 -2040 -5541 -1443 4255 3971 -610 -4725 -3281 2497 5480
907 5480 693 -4612 -3597 1525 4782 2454 -2988 -5097 -78 4968 3028 -2092 -4834 -1668 3577
922 3577 4583 -568 -4921 -2717 2761 4451 978 -3944 -4037 1342 5130 2238 -3285 -4184 -229 4156
938 4156 3731 -1783 -5145 -1391 3821 3898 -446 -4190 -2998 2252 4716 748 -4165 -3335 1315 4351
954 4351 2184 -2626 -4485 -122 4390 2950 -1931 -4072 -1714 3083 4232 -431 -4467 -2520 2394
969 2394 3976 875 -3449 -3937 871 4661 1956 -2860 -3900 -371 3625 3237 -1578 -4482 -1379 3299
985 3299 3615 -362 -3735 -2640 2168 4419 858 -3913 -3262 1071 3909 1954 -2507 -4040 -228 4012
1001 4012 2653 -1677 -4103 -1223 2939 3800 -136 -4152 -2321 2109 3794 647 -3262 -3285 816 4153
1017 4153 1933 -2792 -3610 -176 3449 2834 -1361 -4060 -1418 3083 3532 -358 -3549 -2331 1839 3952
1033 3952 991 -3372 -3117 992 3436 1926 -2208 -3687 -471 3435 2742 -1375 -3709 -1311 2520
1048 2520 3362 -380 -3723 -2315 1936 3759 801 -3047 -3160 722 3663 1951 -2222 -3487 -370
1063 -370 3220 2844 -1315 -3900 -1120 2642 3111 -200 -3416 -2596 1708 3671 998 -3098 -2893 801
1079 801 3525 2128 -2061 -3585 -229 3447 2421 -1297 -3429 -1470 2301 3242 -375 -3822 -2205
1094 -2205 1848 3323 904 -2602 -2925 729 3581 1925 -2121 -3244 -298 3007 2585 -1107 -3388
1109 -3388 -1253 2768 3110 -193 -2986 -2190 1416 3328 901 -2865 -2632 761 3182 1598 -1802 -3150
1125 -3150 -327 2740 2469 -962 -3155 -1148 2400 2888 -210 -3067 -2086 1529 3000 899 -2455 -2748
1141 -2748 512 3093 1574 -1944 -2852 -385 2570 2545 -913 -3297 -1252 2091 2691 190 -2776 -2008
1157 -2008 1226 3209 701 -2443 -2361 524 2859 1662 -1772 -3024 -341 2492 2260 -898 -2784 -1322
1173 -1322 2088 2839 133 -2754 -1982 1354 2775 856 -2246 -2423 288 2805 1379 -1579 -2808 -365
1189 -365 2414 2492 -726 -2944 -1091 2018 2480 -258 -2491 -1948 1173 2826 709 -2345 -2410 395 2591
1206 2591 1743 -1483 -2832 -430 2342 1897 -753 -2657 -1207 1864 2639 40 -2484 -1941 1197 2680
1222 2680 665 -1952 -2297 552 2594 1493 -1715 -2429 -226 2214 2119 -561 -2747 -1045 1892 2334
1238 2334 -66 -2370 -1826 870 2872 1083 -1980 -2215 179 2069 1486 -1296 -2562 -481 2042 1918
1254 1918 -743 -2404 -1167 1370 2393 167 -2388 -1792 1010 2406 831 -1742 -2112 189 2518
1269 2518 1251 -1426 -2382 -644 2078 1897 -679 -2523 -1101 1603 2265 4 -2322 -1702 789 2195
1285 2195 851 -1880 -1999 170 2199 1450 -1153 -2419 -490 1965 1849 -625 -2075 -1015 1485 2084
1301 2084 347 -1995 -1608 1015 2243 805 -1582 -2021 125 2220 1553 -956 -2111 -470 1785 1723
1317 1723 -415 -2160 -1004 1481 1771 178 -1812 -1560 769 2256 829 -1869 -2112 214 1912 1312
1333 1312 -942 -2240 -517 1775 1738 -497 -1926 -1001 1059 1876 162 -1771 -1488 877 1850 867 -1391
1350 -1391 -1934 -34 1990 1313 -941 -2022 -457 1376 1571 -252 -2038 -983 1274 1940 17 -1679
1366 -1679 -1402 739 1921 769 -1376 -1772 144 1892 1096 -900 -1727 -394 1830 1645 -548 -1672
1382 -1672 -770 890 2068 355 -1532 -1441 652 1758 718 -1057 -1575 86 1671 1215 -1066 -1756
1398 -1756 -167 1449 1566 -196 -1717 -880 1199 1646 68 -1419 -1434 351 1719 573 -1241 -1527
1414 -1527 21 1652 1051 -576 -1710 -398 1554 1487 -315 -1624 -863 1082 1580 392 -1554 -1199
1430 -1199 600 1584 726 -849 -1481 -135 1646 1071 -878 -1753 -185 1209 1320 -312 -1649 -1003 972
1447 972 1574 198 -1317 -1052 293 1489 753 -1008 -1482 9 1576 983 -703 -1474 -558 1501 1432
1464 1432 -195 -1619 -759 657 1537 321 -1481 -1237 572 1563 560 -906 -1316 98 1408 1223
1480 1223 -616 -1512 -437 1028 1237 -122 -1511 -985 823 1417 95 -1171 -1282 361 1392 748
1496 748 -1218 -1236 -164 1186 985 -369 -1496 -462 1113 1371 -136 -1376 -643 606 1309 367 -1110
1513 -1110 -1325 389 1247 498 -830 -1159 -13 1482 943 -610 -1285 -202 1125 1011 -178 -1328 -992
1530 -992 586 1148 56 -1072 -1152 110 1316 611 -969 -1165 111 983 942 -289 -1321 -500 1057
1547 1057 1294 -315 -1193 -707 774 1318 324 -1180 -1035 325 1321 475 -790 -1124 -101 1202 1028
1564 1028 -671 -1299 -416 716 803 -4 -1240 -588 766 1106 205 -919 -809 92 1215 845 -970 -1143
1582 -1143 76 1169 706 -515 -1298 -457 891 1053 -128 -1255 -527 711 1075 263 -972 -926 275
1599 275 1181 501 -677 -826 -217 918 907 -421 -1175 -308 784 966 -98 -1058 -737 613 1082 144
1617 144 -963 -751 263 987 651 -640 -1091 -171 958 773 -326 -859 -598 837 1066 -205 -1047 -554
1635 -554 435 843 245 -541 -1095 313 1107 488 -614 -836 -239 906 948 -232 -1126 -191 648 855 -114
1654 -114 -993 -764 547 1192 172 -851 -826 170 869 701 -518 -1041 -38 1030 595 -286 -844 -428
1672 -428 663 938 -2 -783 -495 390 946 247 -846 -876 391 1164 363 -545 -863 -56 701 918 -146
1691 -146 -1033 -383 589 751 -140 -971 -621 514 1143 321 -687 -712 90 847 641 -735 -1161 4 953
1710 953 592 -181 -774 -365 508 784 35 -1030 -202 578 903 117 -663 -650 39 1029 447 -393 -819 -193
1730 -193 755 689 -257 -818 -258 520 1021 95 -708 -645 407 918 372 -782 -762 165 828 695 -472 -894
1750 -894 41 836 584 -344 -715 -351 778 587 20 -796 -436 574 679 368 -723 -917 181 731 317
1769 317 -387 -772 1 590 620 -150 -974 -345 761 752 19 -551 -647 240 827 189 -726 -536 171 701 472
1790 472 -316 -761 -86 828 545 -292 -683 -408 298 865 -4 -781 -555 319 593 337 -447 -658 108 862
1810 862 477 -391 -759 -258 601 660 -11 -686 -483 542 503 -39 -511 -470 342 732 234 -741 -355 216 495
1831 495 621 -491 -723 -239 681 647 -219 -730 -236 372 722 120 -710 -588 171 548 297 -320 -690 -4
1851 -4 792 398 -589 -526 104 328 441 -191 -649 -189 525 790 92 -664 -486 227 688 483 -566 -497 56
1872 56 750 399 -103 -654 -243 639 453 -142 -589 -283 445 449 237 -564 -323 133 678 65 -324 -553 -150
1893 -150 573 281 -405 -521 -82 312 538 66 -564 -412 531 685 99 -381 -509 239 686 410 -487 -536
1913 -536 194 449 617 -144 -613 -268 508 504 -185 -626 -179 490 618 290 -566 -427 258 473 205 -340 -701
1934 -701 40 445 193 -195 -675 -128 421 481 68 -693 -581 501 547 20 -515 -377 157 554 450 -604
1954 -604 -527 165 546 483 -99 -458 -316 455 543 -36 -532 -382 159 535 160 -746 -555 96 644 213 -448
1975 -448 -501 -125 541 615 -240 -690 -124 325 511 -139 -484 -336 283 564 -61 -445 -257 201 489 239 -386
1996 -386 -554 -55 677 739 -83 -559 -196 525 486 -84 -543 -202 96 478 280 -523 -402 142 541 337 -405
2017 -405 -620 -54 486 436 -187 -525 -235 447 445 172 -449 -340 333 685 -43 -289 -272 35 373 501 -370
2038 -370 -550 -71 494 289 22 -604 -297 445 420 -54 -549 -84 361 440 83 -351 -350 260 588 235 -476
2059 -476 -403 -70 219 341 -154 -572 -12 361 567 -14 -528 -545 229 653 335 -405 -327 39 349 313 -246
2080 -246 -444 63 317 256 -70 -436 -214 237 501 -98 -425 -226 344 539 208 -213 -483 27 335 427 -362
2101 -362 -401 -134 376 328 -154 -543 -274 225 214 -90 -258 -277 351 362 183 -486 -373 90 449 231 -306 -436
2123 -436 63 427 216 -147 -432 -272 359 589 38 -603 -530 264 436 42 -272 -341 -127 626 365 4 -364
2144 -364 -333 237 215 11 -431 -201 425 525 195 -492 -269 51 500 324 -440 -468 160 604 203 -172 -808
2165 -808 -52 330 465 42 -74 -226 178 612 129 -581 -391 192 360 198 -222 -426 92 522 336 -238
2185 -238 -246 -161 242 376 -130 -437 -273 237 589 -91 -254 -315 200 461 140 -295 -329 117 358 467 -272 -440
2207 -440 -72 345 524 -253 -309 -316 23 525 -51 -444 -289 -12 360 281 -127 -387 -179 435 -19 28 -573 -221
2229 -221 157 414 46 -538 -147 324 114 -61 -355 -403 241 350 380 -250 -276 25 388 436 -62 -436 -108
2250 -108 311 292 3 -152 -259 55 367 173 -380 -298 10 133 126 -231 -474 -70 360 209 -226 -463 -225
2271 -225 232 210 46 -296 -299 116 476 194 -350 -363 61 255 339 -378 -295 18 242 330 -88 -451 -345 219
2293 219 341 23 -213 -159 140 310 114 -69 -295 48 360 220 -37 -403 -86 150 328 -169 -403 -205
2313 -205 95 374 124 -265 -320 73 189 90 -202 -179 -155 384 284 -86 -268 -105 235 412 -101 -274 -127
2334 -127 198 491 -229 -269 -276 132 245 121 -363 -352 136 222 120 -87 -423 -113 264 375 -47 -157 -70 76
2356 76 454 26 -207 -321 11 319 47 -217 -253 107 523 305 -211 -215 124 348 336 -19 -283 -186 212 356
2378 356 -26 -292 -228 101 330 108 -251 -252 81 180 61 -56 -112 -24 242 321 139 -334 -153 134 81 68 -107
2401 -107 -165 44 381 -61 -227 -122 28 314 167 -95 -273 -91 272 107 18 -354 -360 -22 405 -51 -275
2422 -275 -110 88 152 208 -293 -267 -12 313 -45 -47 -199 -222 178 223 -307 -76 -202 133 190 133 -126 -471 -85
2445 -85 179 31 -40 -95 -96 28 197 -28 -282 -25 172 133 -174 -247 -66 -46 203 -143 -198 -193 -32 359 93 -109
2469 -109 -270 -102 262 105 -97 -331 -46 54 427 -251 -214 7 278 106 215 -186 -219 157 127 53 -111
2490 -111 -410 74 32 112 76 43 101 8 30 -7 -15 119 292 258 44 -310 -304 -7 234 121 -95 -209 130 181 93
2515 93 -138 -35 -17 100 265 70 -346 -70 31 123 79 -89 -342 154 271 -9 -221 -48 -117 253 124 -12
2537 -12 -145 24 -54 114 -277 -186 -233 -47 69 -42 -103 -255 44 155 60 -8 -301 -44 251 143 17 -163
2559 -163 -89 152 131 -42 -220 -101 137 -79 -47 -136 -192 234 152 20 -118 -114 33 224 287 -96 -229 -143 229
2582 229 91 -83 59 -222 217 371 82 -281 -67 198 131 129 -102 -211 -77 190 62 0 -250 -95 190
2603 190 151 -47 -67 -80 261 29 30 -219 -261 81 213 187 -366 -293 108 -62 17 -123 -262 -66 118 187 -35
2626 -35 -322 -7 139 -12 184 -244 -96 305 141 34 -173 -144 -58 374 256 -65 -14 21 48 134 -32 -266
2648 -266 -91 158 45 88 29 -25 132 157 118 -136 -324 144 71 163 -136 -276 -71 83 145 -14 -159 -95 39
2671 39 56 100 -281 -181 81 327 -107 -103 -227 -102 74 105 -226 -249 -110 186 214 -110 -13 -112 170 -80 -121 -120
2695 -120 -24 100 167 -80 -223 80 84 55 320 -31 -72 -117 349 137 12 -186 -354 13 76 -1 -184 -221 119
2718 119 152 161 -64 -270 -78 172 4 -124 -300 -35 133 -42 -86 -211 -60 93 65 -60 -182 -153 -115 275
2740 275 89 87 -39 -282 117 150 -25 -72 -125 249 263 -89 -185 -314 -89 -24 191 -106 10 174 167 -23 -16 -289
2764 -289 23 253 87 -113 -152 -123 81 257 6 -12 -184 196 219 -52 -274 -93 111 70 241 -193 -18 -99
2786 -99 -51 188 40 -178 -125 143 297 25 -313 -135 80 -4 -55 -53 -44 13 197 16 -50 66 -14 19 47 -219 -92
2811 -92 90 70 295 30 -87 2 13 108 -81 -41 -138 270 79 177 42 -38 51 160 40 62 -74 -79 -35 13 1
2836 1 -84 -67 -27 -51 92 -162 -160 -11 209 115 -82 8 -160 78 100 165 -151 -97 82 -60 22 -155 6 20 124
2861 124 86 -188 -117 121 160 -109 -42 -159 -71 -52 164 11 -90 -126 150 205 -58 -94 21 60 216 101 -57
2884 -57 31 38 -25 -71 -34 -224 -19 122 -59 -164 -133 -123 93 304 130 -93 -78 40 190 69 20 -84 8 312
2908 312 -12 -3 -87 -178 172 33 214 -118 -219 95 398 216 -88 48 354 49 232 -80 -85 -114 173 165 -79
2931 -79 -212 -119 114 138 -76 -10 137 -162 34 4 9 24 -51 67 23 -48 -127 -9 59 209 66 -47 25 108 307
2956 307 -22 -100 -91 38 41 -68 -147 33 25 236 95 -172 -143 -140 61 208 -184 -46 -21 108 91 94 -182 -129 58
2981 58 81 245 72 -163 -34 -74 75 -16 -254 -102 251 132 -179 102 -188 -61 124 -43 124 -195 49
3002 49 56 129 -72 -109 -94 136 63 -215 -293 -121 106 12 -70 -9 -59 -40 159 42 -61 -30 -32 -74 -39 -101 -39 -12 111
3029 111 185 -155 1 10 52 14 39 -150 -52 244 31 106 17 -145 126 251 -77 23 -284 -149 252 -49 -262
3052 -262 -103 -109 -50 54 -182 -131 -231 33 373 40 -29 -85 157 84 79 -47 147 33 72 62 -46 -22 -154 113
3076 113 89 41 -107 -129 -110 203 -9 -54 21 3 76 214 -161 -286 -81 12 129 -134 -14 129 121 164 78 -46
3100 -46 -194 82 156 -33 -127 -141 54 39 25 -31 -80 28 164 157 167 -99 -18 66 4 125 -44 -10 0 90 -240 -157
3126 -157 -43 -77 231 160 -175 -271 13 207 255 -39 -107 -128 39 -101 -107 -106 83 11 -10 96 -184 -31 -76 131
3150 131 4 -24 -74 -109 175 -51 114 -166 -33 50 49 106 -174 -228 14 266 -134 -67 -169 72 8 12 70 -185
3174 -185 -33 -11 35 113 -178 113 -76 -85 -37 6 -13 19 65 96 48 -124 79 119 214 -46 64 -61 -84 183 -14
3199 -14 -93 100 67 133 -65 -132 -128 71 51 281 58 -55 245 233 166 -92 -262 -54 105 203 34 -48 -90 191
3223 191 117 57 -239 -72 89 -6 6 -63 -154 147 -104 -230 -6 -356 -27 -38 171 -78 -232 -38 23 143 -79
3246 -79 -142 -67 -89 131 7 -180 -93 4 17 159 -17 -7 -155 249 143 130 -44 -91 67 48 174 -134 -264 133
3270 133 92 -2 -45 -251 -252 119 -22 -29 -64 -21 58 150 79 -58 -115 149 124 -81 -162 -116 237 -44 147 -213 -159 33
3296 33 -166 155 120 -232 3 115 -34 -74 -137 -18 0 211 82 76 -210 256 127 -29 -100 -99 -33 -150 155 -127
3320 -127 39 -21 128 194 5 -31 -105 -128 201 -66 -288 -212 -61 -92 11 164 -97 31 160 72 -119 -111 141
3343 141 147 142 48 -44 -37 63 16 245 -46 -254 118 -124 -167 35 -133 -74 58 43 17 -28 9 50 70 9 10 -164 160
3370 160 151 -81 -85 -86 22 -120 155 -66 -148 -203 173 129 -7 -157 0 27 -38 -47 -65 -212 116 96 49 -144 -32
3395 -32 -180 -64 80 -310 -139 -96 91 83 -69 -98 34 -15 44 -48 -96 146 97 -36 72 35 64 -38 194 88
3419 88 38 -163 -84 203 -106 11 -16 -192 196 -86 63 -67 -55 23 47 7 -299 -120 -1 360 -65 -56 20 61
3443 61 25 70 -63 -124 51 132 70 -136 -58 -148 184 252 -44 -253 45 103 224 141 -79 88 -8 23 94 28 -261
3468 -261 -106 -62 197 95 -14 -25 130 102 168 -299 -141 68 -17 49 0 -167 -148 217 101 -6 -192 -41 -34
3491 -34 99 104 55 31 125 17 -142 -37 -118 81 -18 -48 -30 -159 149 214 -39 -75 -5 -172 -33 249 -193 -84
3515 -84 9 69 46 24 -72 16 62 130 196 -17 -44 -52 -170 -132 123 -181 -3 118 153 100 -274 -121 -90 -111 -40 -68 70
3542 70 111 -76 -72 -13 37 51 117 231 -216 -96 42 156 161 174 -32 -114 62 137 273 -3 -128 -115 -92 121 32
3567 32 -220 -15 143 182 -84 -45 16 47 14 20 18 -69 33 -175 38 -256 69 15 119 -51 -65 104 -98 137
3591 137 -70 129 -54 191 -11 182 -107 125 17 19 -111 201 -92 208 -72 -69 39 -62 -231 115 162 -129
3613 -129 -27 -138 85 53 46 -137 105 -91 90 -22 156 -38 2 -185 101 59 -94 -83 -240 87 189 -145
3635 -145 -27 1 26 158 32 31 -4 -78 -8 -81 -46 -47 111 184 291 -12 -196 -220 117 -12 -102 79 -102 -35 106
3660 106 -16 -281 -18 25 -87 -8 1 -8 256 -58 -125 -99 -180 -25 -78 210 -170 -98 -61 -94 -71 81 101 -60 -43
3685 -43 -47 62 65 66 -59 -31 104 -139 -76 -117 -127 131 -188 78 53 104 143 -121 125 -61 -45 -91 128 101 -403 38
3711 38 -59 255 -26 -223 -47 -7 277 -30 -23 -64 -52 46 -70 -78 -56 -43 220 61 3 -30 -108 162 -155 -193 -119 -101
3737 -101 -39 95 22 -77 36 146 87 99 -108 -93 -154 -29 53 -55 -182 -1 87 64 -90 -55 -88 -101 130 124 -108
3762 -108 -196 60 89 -103 -13 -111 68 80 -63 61 22 30 191 16 121 -114 -91 128 66 -262 -11 -127 56
3785 56 175 -52 -23 -149 -6 43 76 -39 7 -5 -44 23 -28 87 -187 -24 168 126 4 107 -25 193 78
3808 78 20 -41 -109 9 49 176 134 15 26 9 56 -116 -177 -21 -29 -125 -105 -66 154 -136 -228 225 -119 -109 219 -86
3834 -86 -69 -98 -126 -120 47 -246 -166 -45 198 21 10 21 -44 -154 -92 25 50 -102 -118 113 -273 -36 -154 -14
3858 -14 69 26 183 104 -13 -99 -7 56 -176 50 50 41 99 -17 -242 141 178 117 -149 -11 -54 261 40 220 62
3883 62 111 113 156 -76 -124 -102 -74 0 176 -89 -24 -51 85 52 -194 2 -147 122 -3 178 -196 4 21 110 218
3908 218 114 -24 -72 213 -49 50 -64 184 43 166 36 18 129 -24 113 43 50 -45 177 86 -26 -44 -145
3931 -145 15 52 193 16 -38 -170 108 121 -20 -121 5 141 -9 78 -43 -130 -39 301 132 -7 -28 9 222
3954 222 40 26 58 0 15 105 -99 -80 -15 -68 -75 -23 -59 65 -205 115 203 7 -206 8 74 73 29 -107 16 -24
3980 -24 0 228 -96 -29 -147 70 2 -36 100 -87 51 29 -73 28 33 19 162 94 16 87 44 100 -16 -3 20
4005 20 -53 79 11 92 -119 -123 63 45 -160 -176 13 106 -13 -57 6 121 32 66 -123 43 20 182 34 168 -76
4030 -76 -154 43 -57 149 -107 2 103 54 -60 9 -60 89 -53 132 -15 -4 -143 23 72 92 -192 47 98
4053 98 150 43 -129 -62 26 65 -35 -81 -45 -91 38 156 -275 -101 -178 196 -29 51 -61 -140 -54 125 -46 -188
4077 -188 -131 69 -61 20 99 73 -39 -219 129 -249 -13 12 138 28 43 -225 82 4 38 -89 76 -114 -144
4100 -144 154 19 133 -42 -126 33 72 49 -282 -124 70 10 -162 -116 61 -49 222 4 -232 -301 -74 183
4122 183 -60 -108 67 -29 146 35 -10 36 -92 4 143 -4 -137 -26 171 159 201 -109 -176 36 10 -173 -48
4145 -48 77 68 -125 -96 113 -122 -75 10 -52 214 -109 10 162 118 -35 -71 18 65 65 74 125 108 89 180 -17 -17 209
4172 209 102 117 -48 92 -67 -181 -35 -93 210 82 -359 -124 -30 115 115 -116 -48 59 -205 36 -152 -102
4194 -102 -28 -40 9 -136 18 69 -4 156 -21 -41 -17 -80 101 45 1 168 107 -114 -31 -40 216 64 8 -51 -71 -129
4220 -129 56 15 12 -49 -138 -80 -71 119 49 -64 -138 -131 0 65 -123 58 136 -33 102 67 -35 -45 76 -18 -47 -147
4246 -147 1 7 31 -26 -92 62 117 214 120 27 -61 -192 -90 37 102 90 -153 80 218 -215 74 -26 -1 37 -46
4271 -46 81 -127 46 -49 -62 15 -1 -44 -34 -81 -10 -159 88 103 84 -4 -4 -41 -79 -42 98 24 69 -105 -180 -134 7
4298 7 -77 -193 -28 -78 119 -41 164 -129 8 -13 -20 136 129 39 -44 -189 -101 -186 -33 -7 -157 1 -13 63 105 -86
4324 -86 68 -50 32 173 -105 189 -1 114 55 -49 -184 15 14 10 -70 100 96 -6 94 36 -104 -48 72 6
4348 6 166 140 -6 101 -77 -34 7 -88 -2 62 -93 -98 43 -71 -26 -47 191 3 221 -87 230 88 -21 70
4372 70 79 74 -92 -28 17 -198 -130 169 -43 12 90 -21 -38 -139 -8 108 14 81 -20 83 -129 -31 119 -121 -81
4397 -81 -73 47 -52 -136 125 -224 86 96 122 -36 1 -141 -99 -67 -79 63 -13 109 -146 -10 32 57 180 -118 -78
4422 -78 -110 -6 139 -109 36 -44 147 -97 -197 -28 -58 -88 3 -208 98 -72 -103 99 -94 -45 -306 46 109
4445 109 -153 -47 -158 -147 -44 116 24 19 -30 -35 36 107 127 -99 104 41 -17 67 -254 -155 6 -228 84 12 140
4470 140 -277 81 45 -176 -37 35 -27 -10 37 209 -5 -27 -91 -20 227 -51 -215 123 -71 -82 80 80 -17 12
4494 12 160 180 -26 188 69 9 -48 -38 -37 -183 -57 51 -9 12 -44 96 -42 -13 155 -49 88 116 -30 -25 -167
4519 -167 -86 92 -90 -253 -42 21 58 4 -58 -18 154 3 44 83 159 66 7 40 31 -32 36 -30 103 125 122 -137 -58
4546 -58 169 134 -54 141 -134 72 129 50 -10 -292 229 -14 174 -40 89 -54 -168 -21 84 -41 -100 123
4568 123 -87 182 59 11 199 -35 -52 -48 310 36 29 -50 -146 76 -160 -55 -163 129 -106 66 -86 -38 -213
4591 -213 42 -12 132 75 -28 142 -82 -42 183 36 -217 102 50 131 -36 -29 53 260 95 68 68 -205 -73 56
4615 56 16 12 -209 -34 -24 110 39 15 -47 -66 104 -8 72 26 218 -7 80 -115 -169 82 169 -131 -116 -21 14 167
4641 167 11 146 154 6 111 15 12 -35 -108 -174 -52 -82 58 111 142 154 100 34 -131 55 91 1 -181 -59 24 10
4667 10 48 3 -47 -134 96 105 140 74 -199 -69 173 -73 -178 -11 -185 204 9 -82 16 85 258 -109 -127 -27
4691 -27 -178 55 204 164 96 -112 10 -5 -70 38 -203 159 27 -215 -28 85 -2 -77 -127 -131 -162 122 -131 -48
4715 -48 163 87 -88 151 87 76 78 79 -181 44 -97 -86 68 -65 97 -46 57 -93 -54 -202 98 -33 134
4738 134 -323 -3 81 -88 -264 -97 51 -110 65 61 27 -39 -49 -158 -128 13 -76 -17 30 30 -18 154 -184 4
4762 4 79 -46 -60 24 0 -83 -9 5 66 -30 138 23 76 -67 -68 136 -77 -145 -34 -137 220 157 -258 91 42 236
4788 236 153 -66 -177 142 304 189 43 -4 -109 231 -130 -82 -60 53 -244 193 43 -88 -93 -57 -56 137 62
4811 62 -39 39 -98 -124 89 -106 -68 91 -196 17 88 42 14 27 119 -133 -110 -3 72 4 2 -95 -332 -62 128
4836 128 96 1 37 -68 41 100 -123 -162 117 9 247 -167 2 -81 -48 35 -31 -51 49 -133 209 -59 136
4859 136 -83 -21 62 41 -37 29 -69 55 59 -72 -18 -132 -44 6 23 14 128 20 200 88 -95 -56 107 81 -81
4884 -81 143 -85 -49 44 28 -42 -93 -87 -1 123 -48 20 110 78 162 24 13 -81 116 0 47 -176 -193 -60 186 160
4910 160 -211 -34 80 -36 38 120 111 -65 29 -49 25 -16 -92 81 -192 95 -59 -318 20 -51 -13 -47 -131 -136 -25
4935 -25 -187 -144 -7 190 -58 20 0 149 -50 38 146 -30 74 -150 -40 41 259 -121 -145 -82 3 -28 24 -67
4959 -67 65 -87 33 -101 -2 132 14 74 -47 -106 -41 16 -29 -24 -158 -123 -42 205 -140 50 -52 -53 129 -72
4983 -72 -161 -16 -100 -170 -3 -105 1 -47 32 54 127 122 -53 -22 -128 122 76 -135 -79 -97 -45 17 61 -283 58 54
5009 54 -263 40 -120 -32 -46 63 44 46 -54 0 -62 -69 -178 153 -51 22 127 -25 69 -119 120 -116 92 138
5033 138 -18 38 208 -161 77 -111 108 53 3 16 -42 143 -136 67 -13 -51 -66 82 20 12 53 -109 126 -55
5057 -55 -97 72 -15 12 18 -40 26 120 -104 -80 -40 -211 -128 58 200 71 84 -23 -84 -36 -59 -51 2 23 -98 -2 24
5084 24 -50 46 -70 -23 9 -68 -5 0 208 67 29 -156 -28 37 173 17 103 -112 -35 139 35 -69 -69 129 -3
5109 -3 0 0 4 77 108 -61 -177 -108 36 98 -128 96 36 163 35 2 93 39 -29 -204 -56 -154 -31 -127 -102 39 160
5136 160 -110 -28 -258 77 -154 -63 24 151 203 -74 -97 77 -52 41 -54 138 107 256 -85 -36 159 -242 -87
5159 -87 -92 17 -14 -31 33 -160 113 70 67 37 -36 119 5 162 14 29 107 -10 43 44 -36 153 65 108 161 -63 -144
5186 -144 -77 -41 -45 -39 87 -173 -18 103 30 -155 7 -103 242 -25 -195 -8 239 20 133 104 -72 39 -18
5209 -18 -16 12 -17 -235 44 -293 109 -176 37 143 -84 90 83 64 -45 -3 107 -109 165 -41 -157 176 -113
5232 -113 -60 -111 181 180 -44 139 -48 -53 28 19 155 -62 -10 -23 -155 -84 -42 16 86 28 10 93 33 28 39 -116 -46 -22
5260 -22 83 -75 -88 -62 0 -106 104 -198 48 29 -114 62 49 35 -35 74 64 90 -97 47 -37 -64 54 6
5284 6 -22 -176 -113 -119 -41 67 -141 -57 80 107 -67 -50 -1 41 -20 3 2 -169 -183 -91 87 3 102 104 -117 -25 -31 180
5312 180 30 100 115 2 -136 -102 -99 -147 -24 11 -12 -11 111 54 36 -42 61 68 190 -42 -128 -25 240 59 -89
5337 -89 41 148 -108 -76 -44 -55 3 36 96 138 -38 53 -18 60 20 -47 -60 -109 -196 -116 -228 -78 -51 -38 34 -144 100
5364 100 26 -117 113 -170 -70 -2 28 -106 37 137 174 -5 -150 -19 -73 -116 -163 -64 60 -265 -109 187 -89
5387 -89 40 -31 151 140 10 -65 -18 50 101 76 -49 -49 -151 165 -24 -20 55 -106 -178 -52 -155 -136 -104 150 38
5412 38 -37 -75 -8 47 -108 -25 105 -54 -27 135 -41 52 130 -22 -37 -69 -73 -156 -73 -179 -82 1 95 -135 48 -51
5438 -51 -86 -59 -181 -84 10 82 -144 -133 76 45 28 8 -17 38 88 50 244 27 22 9 97 -41 -86 5 81 93 -106
5465 -106 -14 -20 -38 -172 212 244 -28 25 -183 -83 -21 90 -43 203 -60 -200 84 183 -27 -146 -224 -3 41
5488 41 -73 -131 103 -5 -5 -33 -77 88 15 60 85 203 103 -18 -65 -63 -5 -49 -48 114 5 -36 -158 109 157 76
5514 76 -144 -99 172 -42 -17 115 134 -135 88 215 6 -142 -16 51 -6 -71 -5 28 42 -58 -14 235 144 -38
5538 -38 44 52 109 -24 -4 6 75 16 -76 -206 128 2 -14 34 -125 89 -110 114 -4 4 -10 -74 135 20 -51 75
5564 75 140 -48 101 188 -20 50 225 -15 -6 -86 -57 17 -19 35 -12 86 78 -152 84 28 -271 -213 101 -23 -101 -152
5590 -152 69 27 -36 140 -26 63 62 -42 -112 -40 -156 -67 7 -65 -95 -102 -126 222 15 -110 -151 -104 113 66 1 -154
5616 -154 42 119 -30 39 129 -48 68 33 -30 -7 58 -51 -59 38 16 -171 -8 7 -60 135 60 57 -20 -15 -11 146 -87
5643 -87 -42 169 -147 -32 -51 128 48 95 73 -66 -137 -120 -1 24 -81 -89 84 18 90 128 112 -68 55 -60 -75
5668 -75 -59 -88 94 16 39 3 133 3 29 98 -136 218 -150 118 38 17 -274 80 -121 -129 129 -47 -93 175
5692 175 -160 93 11 -106 -54 -42 132 -8 -48 79 -55 -104 39 -5 75 -1 -88 102 40 192 -4 8 -180 -41
5716 -41 -383 -26 -70 128 -58 107 -40 -90 -66 -19 30 -13 142 110 313 -51 -34 73 96 312 171 -57 -83 192
5740 192 -96 17 -92 10 106 -176 64 146 -1 -68 12 40 -79 66 77 -48 -148 -74 -39 -43 201 -47 2 98
5764 98 -19 -148 105 52 6 321 60 123 151 133 -115 184 -4 -18 -78 156 22 13 -105 -206 101 78 -3 7
5788 7 -70 45 165 -109 -25 -66 -19 52 -22 -157 155 72 -22 53 -23 -98 132 12 33 -134 -18 -22 -105 116 -52 -4
5814 -4 31 -117 -94 15 214 18 21 80 42 -5 13 42 -123 -53 82 14 91 98 -79 5 149 -136 139 -169 -88 12
5840 12 -70 3 73 -49 6 -55 -34 -19 6 241 9 -1 -108 60 68 60 67 5 2 29 116 -3 -82 -38 78 4 0 -120 1
5869 1 -41 -40 7 72 -197 151 -58 -41 128 -25 -189 364 -32 -92 24 8 81 -20 100 58 -83 -23 11 -62 43
5894 43 -56 178 28 83 -92 235 310 46 -203 -13 -99 -158 101 71 -92 -5 61 13 32 124 81 -13 64 -16 -84 -15
5920 -15 -120 -88 108 -63 -60 -123 -89 16 -184 -58 166 148 79 -64 -29 13 -70 54 38 -5 -120 -128 110 24 67 -106
5946 -106 -130 -48 30 35 -56 176 64 -158 -49 47 100 -88 40 -17 93 -81 165 30 55 -121 -144 47 -35 -63
5970 -63 -82 9 49 -67 135 61 27 24 -147 32 -128 207 62 -59 54 95 -71 8 -120 3 8 -1 9 -46 -78 19
5996 19 -137 -65 -53 -79 113 115 21 -58 -3 151 11 -4 30 -208 -154 -40 -71 -173 62 -156 82 92 54 19 -256
6021 -256 18 42 136 42 51 52 -6 -69 -248 -167 23 20 -39 77 -61 46 -123 -157 179 -21 17 207 178 -114 -46 -113
6047 -113 9 -64 39 106 -70 -14 82 28 13 -11 -14 -102 -58 70 -4 28 -20 -14 -151 187 73 40 -43 -147 -9 -44
6073 -44 53 108 -11 -109 -27 182 -131 -61 -12 -56 115 -64 87 -111 -31 46 -145 38 129 85 -77 -88 -50 25 -72
6098 -72 30 103 56 -64 167 -126 -146 15 87 66 -149 -59 -26 35 -36 -158 -11 5 148 141 191 -41 -141 -133 26
6123 26 69 -80 -96 102 80 4 8 104 -62 49 -32 -9 -139 66 -83 -12 -3 59 131 -54 69 -171 111 -105 9
6148 9 -186 105 -109 -121 -68 44 -67 28 40 -30 75 36 129 -141 176 18 0 48 106 -150 -213 -155 4 54 -120
6173 -120 47 83 18 -46 126 -96 89 -81 33 -207 -92 -144 271 0 -33 -99 25 94 -57 -93 5 -48 -281
6196 -281 -68 -40 -12 54 -58 -55 105 35 -39 176 -24 -44 -188 -32 -39 31 -113 -5 22 -24 -37 148 138 218 -53
6221 -53 -117 42 -56 -118 -114 -20 195 -45 -46 -46 -28 51 -224 13 -58 17 -105 21 -59 144 57 29 97 -203 -137 -43 -40 56
6249 56 121 2 115 43 -49 -123 87 -206 24 24 -78 -3 151 61 -5 -41 86 -132 -16 31 30 40 90 14 90 -72
6275 -72 161 -40 -45 -34 -76 105 -25 -120 -26 44 -176 -145 28 20 193 81 63 -113 5 -128 -188 -29 39 -84 115
6300 115 45 92 -2 -55 168 162 -21 165 -94 -40 76 -170 15 -115 58 -14 71 -30 176 -103 104 25 -64 -102
6324 -102 -131 -38 223 -28 -124 -29 -116 -71 44 -226 -82 -162 76 -16 73 179 114 107 -22 -92 -204 72 39 158 -23
6349 -23 50 -71 -98 -196 -7 24 81 -206 41 200 -82 -29 -73 117 66 -60 5 -87 -66 126 26 35 -19 214 -30
6374 -30 -19 -11 -65 -199 14 115 100 -30 123 -34 58 76 47 140 -39 -64 -85 -206 67 -6 -202 49 21 120 -127
6399 -127 8 -37 82 -154 -14 236 159 84 -34 -80 -305 -59 75 -178 21 144 145 44 152 10 -71 102
6421 102 192 68 -244 -62 108 -334 124 83 -124 129 40 -128 14 -42 -1 65 -22 189 -176 -103 3 121 17
6444 17 9 56 -106 127 179 -106 60 42 101 94 -50 -32 -54 -270 82 -23 27 37 -146 106 103 3 -11 40 31 -28 -11
6471 -11 101 113 -55 137 -21 -69 -12 -14 -46 114 82 3 30 -144 36 -79 -13 -4 -49 -140 -76 -133 -7 87 -142 48
6497 48 -64 149 -218 36 91 61 204 189 215 209 -102 136 58 160 -20 -79 -166 -84 78 167 44 -82 16 19 -34
6522 -34 -18 -44 -7 3 -41 62 -196 75 84 10 52 -49 83 -118 -63 157 -165 -19 102 -20 133 82 58 -108
6546 -108 -2 129 -46 -56 -185 11 -128 -222 -79 11 -20 31 56 -122 109 56 176 101 -18 -22 117 -22 122
6569 122 37 -7 -82 -28 1 208 -151 -12 -114 126 -59 118 -39 -190 124 35 -112 -121 -49 -111 -94 7 0 -98 -144
6594 -144 100 5 75 -17 111 206 15 -96 -27 -57 -47 -62 -89 63 92 -43 3 -73 5 85 41 35 6 -25 -26 58 122 59
6622 59 148 -208 -41 131 -78 -62 149 -186 31 134 -27 88 -61 117 23 -111 -120 145 -23 73 31 -53 -92
6645 -92 135 -36 -10 158 -77 159 -127 0 22 -184 -133 -80 -112 27 -85 -99 64 192 55 -109 12 -77 -60
6668 -60 173 -41 -25 -99 78 -6 -88 133 50 160 105 267 53 46 -72 -44 -6 38 0 26 56 34 -141 77 48 102
6694 102 -77 -55 165 130 -101 143 189 -174 -33 -5 264 -43 -110 -102 278 135 34 -43 -122 46 -93 -57 -7 19
6718 19 -121 245 39 1 63 -36 142 -151 -71 93 -157 105 85 93 13 55 29 17 32 3 -47 30 -59 83 241 12
6744 12 -103 22 66 56 -45 -155 -130 99 138 283 -71 7 -12 -42 -57 -88 -84 -7 -131 105 135 -257 181 -44 71
6769 71 17 -48 -53 -66 13 67 3 24 47 -59 167 35 54 120 -4 171 10 32 29 -24 81 12 43 34 155 83 -10 122
6797 122 -86 7 171 163 78 -86 -5 -28 127 137 -85 60 34 -75 230 12 -40 -105 -63 -87 -196 159 143 -36
6821 -36 76 -149 -43 -27 -62 -69 126 -152 43 -155 116 -133 -56 88 51 -30 5 -37 71 -109 -64 -14 -51 -35 -49
6846 -49 126 114 3 -49 -52 -74 -125 -117 -4 54 71 65 -76 -46 -209 176 24 -26 -180 -240 100 -84 -133 54 4 26
6872 26 -62 -38 167 -126 17 136 56 -57 -74 -106 36 136 -63 -130 154 171 -35 220 20 34 -103 -13 247
6895 247 -54 169 8 50 -40 -120 73 99 -92 -81 -116 -53 -135 -15 124 145 31 146 -130 73 28 12 16 253
6919 253 -17 47 52 14 100 -20 -16 -96 -3 -62 -10 -88 134 4 -60 -142 -52 4 7 -121 -41 -67 12 -255 53 75 -241
6946 -241 76 -30 -15 -22 -3 2 92 -141 28 -59 86 30 -17 57 94 19 -89 234 -10 -3 -17 193 2 -31 89 -21
6972 -21 84 153 61 -1 -89 -120 -110 -128 67 -29 121 -168 -164 220 -68 142 87 -200 57 -57 2 -178 -47 -18 37
6997 37 -171 10 -41 133 -158 17 92 -8 -78 43 -7 -32 -46 82 -122 87 76 -1 83 75 -34 20 -34 15 141
7022 141 -30 6 -80 35 158 211 230 -10 -74 -62 -95 -43 -42 -1 68 226 92 82 101 165 144 -263 86 52 -46 -39 -110
7049 -110 110 21 -133 2 127 -181 89 -93 3 -154 -127 -70 73 89 -53 -130 -125 56 74 -156 -60 41 240
7072 240 113 14 -47 14 -32 -58 66 120 73 13 31 46 -12 -92 -176 -76 -75 -74 65 -45 23 -113 -275 -118 -28 112
7098 112 -65 -55 -39 -69 35 137 -41 89 -132 -100 168 42 66 21 -75 -25 66 -187 -135 71 -54 131 -106
7121 -106 -18 -139 -2 -10 207 88 99 -30 181 31 155 -172 279 -71 -40 -1 17 -60 -140 -190 148 -101 -14 107
7145 107 -152 16 -5 57 137 107 8 -34 77 49 -43 9 154 151 -29 144 -41 -150 13 -96 30 0 186 -4
7169 -4 -82 -61 -52 -25 103 87 -54 -80 154 18 -104 104 -79 66 70 151 -28 53 -51 80 -32 165 -59 46
7193 46 148 46 -201 34 -89 108 -20 -18 -22 156 -125 112 -8 -79 15 -16 -22 82 -38 36 -4 97 99 -128 134
7218 134 92 -55 204 -165 -51 174 13 114 -52 89 -105 57 -120 15 -96 -159 -54 25 59 32 217 116
7240 116 -80 230 -175 158 -39 18 34 -95 -190 -29 85 13 1 116 -69 88 56 76 101 50 -5 -108 -18 176
7264 176 89 -57 223 -22 86 37 -52 140 23 -61 -105 44 57 14 244 -59 -103 149 -38 -167 132 75 71 209
7288 209 209 -45 222 -11 44 -80 -59 -21 41 -144 -90 157 25 67 90 -91 16 -76 -152 189 -139 20 -54 -66
7312 -66 -121 -3 -54 116 28 70 24 80 -16 -69 -79 -121 173 -113 80 -54 78 30 4 -8 11 226 -19 -131 -226
7337 -226 -180 13 31 -7 -78 -97 -69 -87 -55 74 -73 -13 -141 -49 44 -60 -97 164 -125 75 69 -115 13 -148 89
7362 89 -11 30 -84 178 -172 -16 121 -61 -16 19 50 -101 -36 25 20 -117 -25 -4 -304 35 -170 1 -123 72
7386 72 -27 -165 -12 6 -138 -70 -160 7 -8 184 17 -37 3 -27 36 -7 -98 -141 -73 -79 11 -35 -95 -4 100 -84 165
7413 165 98 105 68 -30 -22 -22 66 -78 -113 115 37 -33 -135 115 -6 139 -46 -47 -19 -125 196 2 152 -60 -89 -82
7439 -82 -104 12 -23 -45 31 28 -139 61 -104 -77 81 41 80 -48 -61 -27 172 -73 -135 38 83 166 -72 -87 -71 12
7465 12 37 -59 -228 -149 -68 83 32 -38 2 29 -77 92 -83 -50 -59 -71 23 -23 100 -91 12 19 -35 -112 -125 6 35
7492 35 -42 -6 95 -89 -51 -27 171 -115 175 -148 90 77 -106 -10 190 138 -57 -37 -143 208 77 31 -109
7515 -109 49 -98 -229 24 129 3 -15 145 2 124 77 -95 85 -37 84 -45 89 -13 -105 -224 116
7536 116 -31 -73 -51 112 -25 86 -39 36 -126 28 -45 -22 -23 -75 4 -81 -36 -60 274 40 31 -34 -15 201 -69
7561 -69 67 -58 204 198 -121 -59 -145 72 -1 33 237 98 -51 31 -75 11 131 86 51 125 132 66 66 260 214 -160
7587 -160 112 58 22 48 -55 -49 7 -150 32 55 21 23 87 141 19 26 -96 -187 -55 17 41 -89 65 -83 -40 -91
7613 -91 -50 -59 -214 -104 -1 40 107 169 -66 243 117 225 107 -125 -46 66 -12 -28 101 166 -35 -69 19 61 18
7638 18 -67 120 -84 -40 10 26 132 32 101 26 36 -131 -112 39 101 140 -46 96 67 33 14 50 -47 122 34 93
7664 93 65 136 73 -1 -49 195 40 33 91 -28 92 3 -92 -87 -43 -114 35 16 -111 -25 -23 46 98 68 -37 129 -53
7691 -53 45 -27 18 48 -198 130 22 -8 -175 60 78 -72 178 -55 24 -107 -66 -104 177 63 -4 123 100 -76
7715 -76 2 20 62 113 191 73 51 -82 -63 37 -47 226 73 80 21 58 -8 -154 -126 -114 -58 27 -60 213 32 160
7741 160 81 -114 57 37 92 -28 93 -96 -5 -43 -105 40 -117 122 -65 75 69 64 45 123 198 -77 -32 -31 -97 219
7767 219 90 -28 113 62 58 106 8 -211 88 107 -208 -28 -66 -216 -52 42 100 164 -71 60 -16 -94 22 -30
7791 -30 91 -73 17 -56 104 -186 -242 -85 -29 -221 117 161 -160 0 -110 208 72 -86 33 12 -80 -26 -76
7814 -76 -2 -30 5 -14 136 -225 -47 -18 -12 139 29 222 24 -86 75 56 108 8 -179 -10 26 -34 222 24
7838 24 -34 176 138 60 103 88 13 44 134 -43 47 37 45 12 -35 48 89 77 31 -24 85 107 102 81 0 75 229 -29 -48
7867 -48 15 49 -33 -139 154 -173 -15 90 57 -46 48 58 -102 24 111 -38 -72 -85 -78 42 -235 221 -77 112
7891 112 -118 -33 -143 -119 -21 3 -206 214 3 23 40 116 71 66 -33 -231 -97 241 -93 61 -12 56 131 -55 -28
7916 -28 26 20 71 158 -41 22 119 82 -168 -240 115 -77 3 94 94 36 23 -17 96 -196 -33 -31 115 -154 123 -57
7942 -57 36 -24 115 33 -105 155 -67 102 -170 17 -187 -75 89 86 22 -209 170 -151 112 68 158 110 -46
7965 -46 68 103 -25 -81 -197 66 -115 -260 57 29 6 -179 -36 110 -138 -99 91 72 -90 -76 15 -1 -23 -83
7989 -83 37 4 21 37 16 -116 89 -39 -68 -43 113 73 -92 -194 50 118 76 57 29 -10 21 -36 5 165 -67
8014 -67 -43 -43 88 -54 -1 138 40 56 -34 3 14 25 163 -29 -57 35 36 -82 -78 -25 195 -72 -40 -136 62 159 -34
8041 -34 -184 44 67 -20 92 -6 -125 -113 -52 177 57 -24 -35 -111 -14 94 33 -147 -114 -15 -72 -202 3 33 91
8066 91 -30 64 65 2 -50 -88 29 156 173 80 99 75 -45 9 3 -2 101 -16 -17 56 60 -19 -36 150 187 -130 -62 20 -62
8095 -62 -57 36 -213 312 95 -15 44 107 -126 -34 -74 138 89 -18 -69 -19 65 -35 24 46 -127 -210 97 -20 53
8120 53 -67 9 -154 9 164 201 41 -43 167 -23 70 110 -126 15 -102 -94 178 -123 87 22 43 113 86 -10
8144 -10 141 51 103 -58 21 42 109 66 12 79 -48 -18 185 140 185 -76 -98 67 -167 -100 36 -85 -66 45 -27
8169 -27 -107 -92 -59 32 40 80 7 121 -129 -31 69 166 -24 81 -197 -14 169 -109 137 96 104 -2
8191b
##END NTUPLES=NMR FID
##END=
