##TITLE=1H_DE-63_22_oil
 D2O
 8 sc, 
 8.8.2024
##JCAMPDX= 6.0         $$ Bruker NMR JCAMP-DX V2.0
##DATA TYPE= NMR FID
##DATA CLASS= NTUPLES
##ORIGIN= UXNMR, Bruker Analytische Messtechnik GmbH
##OWNER= root
$$ XWIN-NMR		Version 3.5
$$ Thu Aug  8 15:23:22 2024 Russian Standard Time (UT+4h)  she@DPX200
##.OBSERVE FREQUENCY= 200.1313
##.OBSERVE NUCLEUS= ^1H
##.DELAY= (6, 6)
##.ACQUISITION MODE= SIMULTANEOUS
##.ACQUISITION SCHEME= undefined
##.AVERAGES= 8
##.DIGITISER RES= 18
##SPECTROMETER/DATA SYSTEM= spect
##.PULSE SEQUENCE= zg30
##.SOLVENT NAME= Acetone
##.SHIFT REFERENCE= (INTERNAL, Acetone, 0, 15.7039)
##AUDIT TRAIL= $$ (NUMBER, WHEN, WHO, WHERE, WHAT)
$$ ##TITLE= Audit trail, XWIN-NMR		Version 3.5
$$ ##JCAMPDX= 5.01
$$ ##ORIGIN= Bruker BioSpin GmbH
$$ ##OWNER= she
$$ F:/spectra/data/she/nmr/H-F/1/audita.txt
$$ ##AUDIT TRAIL=  $$ (NUMBER, WHEN, WHO, WHERE, WHAT)
(   1,<2024-08-08 15:21:58.39 +0400>,<she>,<DPX200>,
      <created by zg, POWCHK disabled, PULCHK disabled
       configuration hash MD5:
       00 E9 B6 7A A2 85 ED C7 34 08 36 98 17 FE 4E 26
       data hash MD5: 16K
       B9 62 DE F1 E2 C7 B6 3D AE 89 31 F9 B9 C7 DC 4C>)
$$ ##END=
$$ 
$$ hash MD5
$$ D0 58 4D 4D 36 F6 51 07 FE 12 0F 4C 79 57 04 C6
##$RELAX= 
##$RELAX= 
##$RELAX= 
##$RELAX= 
##$RELAX= 
##$RELAX= 
$$ Bruker specific parameters
$$ --------------------------
##$DU= <F:/spectra>
##$EXPNO= 1
##$NAME= <H-F>
##$PROCNO= 1
##$TYPE= <nmr>
##$USER= <she>
##$AMP= (0..31)
100 100 100 100 100 100 100 100 100 100 100 100 100 100 100 100 100 100 
100 100 100 100 100 100 100 100 100 100 100 100 100 100 
##$AQSEQ= 0
##$AQ_mod= 1
##$AUNM= <au_zg>
##$AUTOPOS= <>
##$BF1= 200.13
##$BF2= 200.13
##$BF3= 200.13
##$BF4= 200.13
##$BF5= 200.13
##$BF6= 200.13
##$BF7= 200.13
##$BF8= 200.13
##$BYTORDA= 1
##$CFDGTYP= 0
##$CFRGTYP= 5
##$CHEMSTR= <none>
##$CNST= (0..31)
1 1 145 1 1 1 1 1 1 1 1 1 1 1 1 1 1 1 1 1 1 1 1 1 1 1 1 1 1 1 1 1 
##$CPDPRG= <>
##$CPDPRG1= <>
##$CPDPRG2= <>
##$CPDPRG3= <>
##$CPDPRG4= <mlev>
##$CPDPRG5= <mlev>
##$CPDPRG6= <mlev>
##$CPDPRG7= <mlev>
##$CPDPRG8= <mlev>
##$CPDPRGB= <>
##$CPDPRGT= <>
##$D= (0..31)
0 1.2 0 0 0 0 0 0 0 0.06 0 0.03 0 0 0 0 0.0002 0 0 0 0 0 0 0 0 0 0 0 0 
0 0 0 
##$DATE= 1723116118
##$DBL= (0..7)
120 120 120 120 120 120 120 120 
##$DBP= (0..7)
150 150 150 150 150 150 150 150 
##$DBP07= 0
##$DBPNAM0= <>
##$DBPNAM1= <>
##$DBPNAM2= <>
##$DBPNAM3= <>
##$DBPNAM4= <>
##$DBPNAM5= <>
##$DBPNAM6= <>
##$DBPNAM7= <>
##$DBPOAL= (0..7)
0.5 0.5 0.5 0.5 0.5 0.5 0.5 0.5 
##$DBPOFFS= (0..7)
0 0 0 0 0 0 0 0 
##$DE= 6
##$DECBNUC= <off>
##$DECIM= 24
##$DECNUC= <off>
##$DECSTAT= 4
##$DIGMOD= 1
##$DIGTYP= 9
##$DL= (0..7)
0 120 120 120 120 120 120 120 
##$DP= (0..7)
150 150 150 150 150 150 150 150 
##$DP07= 0
##$DPNAME0= <>
##$DPNAME1= <>
##$DPNAME2= <>
##$DPNAME3= <>
##$DPNAME4= <>
##$DPNAME5= <>
##$DPNAME6= <>
##$DPNAME7= <>
##$DPOAL= (0..7)
0.5 0.5 0.5 0.5 0.5 0.5 0.5 0.5 
##$DPOFFS= (0..7)
0 0 0 0 0 0 0 0 
##$DQDMODE= 0
##$DR= 18
##$DS= 0
##$DSLIST= <SSSSSSSSSSSSSSS>
$$ [...]
##$SUBNAM2= <"">
##$SUBNAM3= <"">
##$SUBNAM4= <"">
##$SUBNAM5= <"">
##$SUBNAM6= <"">
##$SUBNAM7= <"">
##$SUBNAM8= <"">
##$SUBNAM9= <"">
##$SW= 24.0689771365484
##$SWIBOX= (0..15)
0 0 2 0 0 0 0 0 0 0 0 0 0 0 0 0 
##$SW_h= 4816.95568400771
##$TD= 16384
##$TD0= 1
##$TE= 0
##$TE2= 300
##$TE3= 300
##$TEG= 300
##$TL= (0..7)
0 120 120 120 120 120 120 120 
##$TP= (0..7)
150 150 150 150 150 150 150 150 
##$TP07= 0
##$TPNAME0= <>
##$TPNAME1= <>
##$TPNAME2= <>
##$TPNAME3= <>
##$TPNAME4= <>
##$TPNAME5= <>
##$TPNAME6= <>
##$TPNAME7= <>
##$TPOAL= (0..7)
0.5 0.5 0.5 0.5 0.5 0.5 0.5 0.5 
##$TPOFFS= (0..7)
0 0 0 0 0 0 0 0 
##$TUNHIN= 0
##$TUNHOUT= 0
##$TUNXOUT= 0
##$USERA1= <user>
##$USERA2= <user>
##$USERA3= <user>
##$USERA4= <user>
##$USERA5= <user>
##$V9= 5
##$VALIST= <valist>
##$VCLIST= <CCCCCCCCCCCCCCC>
##$VD= 0
##$VDLIST= <DDDDDDDDDDDDDDD>
##$VPLIST= <PPPPPPPPPPPPPPP>
##$VTLIST= <TTTTTTTTTTTTTTT>
##$WBST= 1024
##$WBSW= 4
##$XGAIN= (0..3)
0 0 0 0 
##$XL= 0
##$YL= 0
##$YMAX_a= 88322
##$YMIN_a= -76796
##$ZGOPTNS= <>
##$ZL1= 120
##$ZL2= 120
##$ZL3= 120
##$ZL4= 120
##$ABSF1= 10
##$ABSF2= 0
##$ABSG= 5
##$ABSL= 3
##$ALPHA= 0
##$AQORDER= 0
##$ASSFAC= 0
##$ASSFACI= 0
##$ASSFACX= 0
##$ASSWID= 0
##$AUNMP= <proc_1d>
##$AZFE= 0.1
##$AZFW= 0.1
##$BCFW= 1
##$BC_mod= 2
##$BYTORDP= 1
##$COROFFS= 0
##$CY= 11.3945322036743
##$DATMOD= 1
##$DC= 2
##$DFILT= <>
##$DTYPP= 0
##$F1P= 15.6554695791079
##$F2P= 12.8336369535428
##$FCOR= 0.5
##$FTSIZE= 0
##$FT_mod= 4
##$GAMMA= 1
##$GB= 0.15
##$INTBC= 1
##$INTSCL= 1
##$ISEN= 128
##$LB= 0.24
##$LEV0= 0
##$LPBIN= 0
##$MAXI= 10000
##$MC2= 0
##$MEAN= 0
##$ME_mod= 0
##$MI= 1.114404
##$NCOEF= 0
##$NC_proc= 0
##$NLEV= 6
##$NOISF1= 3.799351
##$NOISF2= 2.8
##$NSP= 1
##$NTH_PI= 0
##$NZP= 0
##$OFFSET= 15.70392
##$PC= 1
##$PHC0= -25641.63
##$PHC1= 12.38749
##$PH_mod= 1
##$PKNL= yes
##$PPARMOD= 0
##$PSCAL= 0
##$PSIGN= 0
##$REVERSE= no
##$SF= 200.130013532006
##$SI= 16384
##$SIGF1= 3
##$SIGF2= 2
##$SINO= 400
##$SIOLD= 16384
##$SREGLST= <1H.CDCl3>
##$SSB= 0
##$STSI= 0
##$STSR= 0
##$SW_p= 3612.71676300578
##$SYMM= 0
##$S_DEV= 0
##$TDeff= 0
##$TDoff= 0
##$TI= <>
##$TILT= no
##$TM1= 0
##$TM2= 0
##$TOPLEV= 0
##$USERP1= <user>
##$USERP2= <user>
##$USERP3= <user>
##$USERP4= <user>
##$USERP5= <user>
##$WDW= 1
##$XDIM= 8192
##$YMAX_p= 0
##$YMIN_p= 0
$$ End of Bruker specific parameters
$$ ---------------------------------
##NTUPLES= NMR FID
##VAR_NAME=  TIME,          FID/REAL,        FID/IMAG
##SYMBOL=    X,             R,               I
##VAR_TYPE=  INDEPENDENT,   DEPENDENT,       DEPENDENT
##VAR_FORM=  AFFN,          ASDF,            ASDF
##VAR_DIM=   8192,          8192,            8192
##UNITS=     SECONDS,       ARBITRARY UNITS, ARBITRARY UNITS
##FACTOR=    0.0002076,     1,               1
##FIRST=     0,             0,               0
##LAST=      1.7004516,     0,               0
##MIN=       0,             -76796,          0
##MAX=       1.7004516,     88322,           0
$$ Real data points
##PAGE= N=1
##DATA TABLE= (X++(R..R)), XYDATA
$$ [...]
1731h27q62N29J840J199q70k043l49P97J124R76l11j883j130R44J495Q83o19j364
1749d71q11j45J858J241o20j417r23L33Q77J508r6j740j247P33J100J043n6j016
1767A51j469j32J676J143k09j288r98k38J294J158L37j492j032l6P73J439M30
1784A507j080j603l56J270J282Oo51j180n45P71J532M32j057j037m88M29J336
1801E68Q83p60j883j63R26J217N39n45j413r72P15J833L69o71j191n44L9J291
1819B38J278p59j324p69O07J071R53j95j329j215M70J620O28k82j006j095j90
1836a299J601J257m68j392r31J37R35J352J84j412j391M42J158O90K99p43j427
1853a008l99J094J734m74r68q30n50Q43J603N12j442j116k05P20J171O36o78j506
$$ y = [-827, -1689, -1160, 680, 1879, 1009, -1034, -1383, -586, 538, 1514, 1203, -680, -1810, -866, 629, 1512, 893, -471, -1282, -1427, 431, 1672, 1052, -365, -1288, -955, -78, 1430, 1334, -406, -1653, -920, 180, 1223, 1167, 151, -1318, -1450, 226, 1369, 1160, -128, -1126, -1364, -70, 1088, 1425, -67, -1099, -1135, -362, 1077, 1507, 427, -1176, -1532, -262, 1020, 1026, 375, -805, -1350, -579, 953, 1385, 328, -709, -1197, -768, 568, 1451, 691, -1192, -1355, -429, 788, 1327, 782, -631, -1603, -888, 945, 1314, 643, -548, -1092, -1053, 238, 1516, 757, -567, -1336, -729, 342, 1295, 1100, -229, -1444, -974, 646, 1274, 992, -14, -1109, -1299, 302, 1559, 1091, -301, -1232, -1095, -160, 1192, 1376, -36, -1427, -985, 173, 863, 1162, 419, -1008, -1407, -313, 1421, 947, -21, -851, -1401, -558, 1045, 1557, 115, -1001, -1206, -486, 685, 1321, 643, -863]
1871h63p34J173J189L80p02r75q18O68J456O47r12j236n53O09J071J112p34j433
1889f55o16P48J109M19l7j370r41M53J514K78k51r06r33J46J182J170k39j473
1907d02o55J92J004R55L05j508j208K85J241P29n3q03j101j55J265J101j49j108
1925f5p16k70P98J194L39j065j416K17P73R98K88n81j407m64R75J146L10q21r35
1944g02l21M57J375O74j141j245j35P58P06P32m13j479m46Q05R53M68n47q04p31
1963a036L05J144P37o90q13p03Q9J167J038l03j287o03J87R65P51K39j319j049
1981a181J41J433O70l36o78q84k14J116J031p8j128p87J96N56P81N12r26j093
1999h69J8Q78Q43K5o34r67k28Q47R69J02p88r48K6K55J068O11p50j345m4N48Q46
$$ y = [-863, -1597, -424, 765, 1145, 443, -532, -1350, -682, 774, 1421, 509, -727, -1280, -671, 400, 1512, 778, -655, -1271, -523, 586, 1005, 968, -402, -1343, -890, 624, 902, 651, -255, -1188, -1042, 140, 1310, 1071, -402, -1057, -865, 139, 1094, 1399, -109, -1317, -1032, 209, 938, 885, 82, -1019, -1174, 91, 1192, 1043, -65, -781, -1051, -253, 941, 1280, 215, -1201, -984, -211, 787, 1075, 494, -913, -1377, -402, 744, 1054, 233, -702, -1023, -566, 809, 1483, 342, -903, -1038, -280, 426, 1158, 745, -734, -1180, -375, 578, 1046, 499, -305, -1036, -731, 413, 1150, 460, -353, -1056, -967, 200, 1238, 935, -352, -955, -768, 197, 948, 1187, -132, -1181, -1040, 393, 1063, 727, 49, -835, -1049, 67, 1098, 1020, -108, -895, -699, -143, 638, 1150, 224, -869, -851, 27, 870, 895, 261, -706, -934, -87, 882, 984, 196, -752, -726, -471, 597, 1208, 458, -887, -931, -383, 463]
2020D63N79m35j229n10O75J101L14o99p13m42K21J064R16r22j048j58J50R18O97
2039I42k13r67r94O28R72M05j49p68r21K81J029Q17k90j015m86J6P11Q35j5q12
2059Fr75L38N73R57p7p65o89j45P99Q60j11n27r58j06P09P96J11q95o02lM44O14
2081C54N29o05o73m58P94O39L75m65r47l00L54R64K27o06o30l64L08P48P58p19
2101B83r51k7K11Q25M63l38n99p53L58R01M40n84l79n36p6R51P09k78q59m12K
2122f49P39N99kp82o93L78O11N40j75n13n73k02Q93N73j13p18l70k09O38N57L97
2143I26r61n88j23O21N10M61q68n85j58O46O72%m00p03j77M97R66j1n93l09n02
2164f79N12O00L52k87j062q1M11P30K25k87o20o94M16R97J57k57m94n47K58O92
$$ y = [463, 1042, 607, -622, -1132, -457, 644, 958, 259, -454, -896, -675, 389, 1305, 383, -665, -823, -673, 245, 942, 729, -238, -1232, -604, 368, 773, 624, -144, -1065, -784, 245, 1062, 772, -243, -729, -713, -2, 833, 818, 6, -969, -631, -58, 899, 822, 57, -632, -777, 22, 882, 771, 244, -714, -820, -111, 685, 796, -99, -701, -704, -260, 354, 883, 278, -395, -853, -59, 580, 955, 490, -457, -757, -403, 561, 788, 182, -448, -812, -504, 244, 1002, 283, -668, -695, -484, 341, 804, 466, -133, -886, -528, 373, 813, 229, -150, -686, -762, 189, 898, 620, -239, -651, -649, 90, 689, 687, -95, -788, -410, 201, 741, 566, 53, -520, -722, 171, 744, 631, -87, -457, -666, -28, 529, 926, -35, -623, -746, -125, 385, 846, -22, -607, -765, -119, 553, 553, 153, -550, -727, -230, 736, 725, 132, -177, -679, -167, 433, 785, 498, -564, -645, -234, 496, 721, 434, -186, -880, -464, 533, 690, 433, -61, -608, -350, 342]
2184C42N04k07r75l40L72M48M44L7q57m11K50K31O94j53m43q19L97N03N80j21
2204D76o89k18P0L73M58k1n49n37L2O53L93L8l34o51j54O63M77j1n90l07k07M78
2226a57O22K11o18l93k6K68N44m5j02o95j28L58N80k9k74l08k56J60O15M8j97
2247A78n05Rj47N87K58r2p33l4K03M27M46l65n41k66J98O19K29j73m60k89k0M46
2269b5M36m8n81l39J76M22M26j39l46o10J76N42L79j54n25j87l4L36O68J5m46
2290A42n04P2J20M05K10n00m56K28L75K30l1Mn89k20N19L12l5k19m15J06K64K60
2312B78K75n50k13j34L36K54K32k83m57k55K93N12J50l15l56n0K45L53J38m22
2332C1k71k67K88L56K74p4o38k40L59M01K42p8o47p6n3O55R3K0n28q2p1L32M99
$$ y = [342, 846, 639, -336, -676, -304, 144, 588, 625, -232, -643, -393, -162, 532, 379, -64, -883, -486, 17, 597, 476, -213, -431, -361, 12, 470, 449, -100, -637, -605, 48, 441, 479, 145, -506, -660, 3, 480, 469, -121, -428, -635, -157, 465, 676, 58, -335, -361, -93, 451, 406, 304, -391, -519, -161, 419, 390, 116, -192, -448, -288, 327, 375, 178, -327, -318, -465, 122, 380, 288, -445, -479, -276, 151, 597, 232, -309, -575, -377, 242, 471, 298, -162, -451, -471, -25, 411, 363, -218, -557, -381, 41, 467, 328, -18, -628, -452, 90, 469, 315, -210, -397, -431, -95, 573, 588, 142, -362, -290, -170, 235, 445, -55, -511, -283, 92, 322, 291, 295, -294, -514, 5, 317, 282, 63, -352, -246, 18, 278, 553, 3, -210, -344, -8, 246, 478, 195, -262, -517, -224, 288, 438, 123, -233, -283, -38, 315, 453, 31, -240, -507, -219, 137, 411, 337, -301, -541, -182, 219, 461, 383, -264, -340, -393, 262, 355, 375, -153, -235, -306, 26, 525]
2355E25j68m73l16J72J87L96M0l54n23O4M77L66N9n32j65k99N22L41Lk97k74l
2377b52R6N00j2l10l95J16L34L89q2j99n29j44L43O27L2l86l63L0j8M70J74l25
2399I6m29J34J68Q8K16j3l83k30M71Q2J29j02m78l1J00N64m9j79j61m07L3N15
2421A34Q1J06m93j14j66N76K05l1m50j37k1K24O06m4m89l19J31L04L47j4n01m8
2443a13m20L44N18l0k58l39NM30K10L3l49j66k66L17O11k70j16n01J57J83K40
2464B20J86k83m16jP0M42J34k71l04j66K08L86lJ07p01J53k53N78L03l29j80j13
2486b33M2R2M22j40k89k60J44K95L20o5k86l09j11L78N23m02l17j72K25Q8K42
2507A87K06m38k33P1L60K9K17l52m17N7K86L67j53k68j39JJ67K49p8k00p1p9R3
$$ y = [525, 357, -116, -432, -260, -73, 323, 363, 9, -514, -450, 27, 393, 452, -80, -245, -544, -22, 319, 322, 25, -249, -252, -156, 344, 332, 22, -373, -257, 77, 466, 384, 185, -344, -488, -145, 482, 514, 128, -235, -205, -223, 247, 421, 96, -333, -199, -31, 57, 273, 260, -123, -353, 118, 200, 329, 227, -251, -282, -182, 382, 333, 154, -7, -414, -381, 134, 215, 321, -172, -286, -452, 124, 329, 298, -152, -289, -310, -86, 520, 476, -13, -332, -201, 103, 450, 436, -65, -113, -533, -189, 329, 299, 41, -298, -293, 137, 347, 380, 31, -135, -401, -84, 527, 257, 141, -360, -203, -20, 220, 406, 123, -293, -294, -224, 218, 352, 81, -223, -389, -181, 205, 202, 309, -392, -239, -492, 86, 389, 60, -120, -233, -191, -99, 323, 183, -106, -366, -222, 73, 393, 328, 42, -267, -378, 0, 523, 121, -196, -368, -143, -55, 187, 393, -45, -278, -207, 153, 182, 399, 47, -370, -313, -27, 340, 187, -81, -220, -219, -52, 197, 119, -81, -152, -231, -138]
2530a38L01l7k1l79k3J80M43r9j20l23k61L04K77Rj10j59j50J26M07N4j66j16
2552ak85K54J79K85k00l56j95J52L41J12o7m72j32L63J91J09m7k83k10J39K50
2573A27K12N4l64j86j60L87J97j8j83m44J35J44M94j39k99k39mK36L89O7l47k23
2595a64p1K19P1J18K2o00K40J24R1J04n0j92o4j2L13K46k89r7l13K1M83J2K3n05
2619b70OJ4K98L85m01j79k27K33P7K64o6Rj71o7J45L47k11j04m20J68J73QK00
2642B11k83k80P1M76r4K12k27n47K23J78L55j04j74j53j92L02J19K35l21j50J29
2663a4RK13j8J21n76J3ON88p6k11p2k98K29L48N8l39J7m76L01L05O3k3l07o4J77
2688b6J75q8mj21k55Q9L32L0J5lk73j84M05j2J10k10k34n2L34R3J33m28j45K44
$$ y = [-138, 163, 126, 105, -274, -297, -117, 326, 227, 107, -216, -477, -173, 104, 113, 3, -156, -306, -180, 227, 281, 115, -1, -286, -32, 147, 432, 232, -124, -319, -167, 174, 286, 219, -253, -385, -22, 169, 278, 231, -52, -262, -123, 127, 339, 393, 29, -157, -317, 70, 267, 249, 66, -378, -243, -99, 395, 256, -43, -282, -286, -50, 339, 406, 59, -164, -235, -16, 55, 173, 195, -405, -165, -41, 50, 154, 104, -88, -152, -164, 149, 395, 106, 9, -304, -283, 200, 212, 235, -270, -264, -250, 48, 433, 32, -147, -374, -141, -64, 200, 134, 143, -28, -95, 50, 397, 186, 82, -338, -170, 3, 11, 211, -72, -352, -281, 195, 101, 313, 86, -461, -238, -60, 295, 191, 17, -136, -328, -26, 93, 328, 7, -143, -14, -5, 208, 190, 311, -265, -252, -246, 342, 266, 55, -17, -315, -86, 262, 320, -19, -2, -478, -177, 128, 191, 168, -139, -203, -26, 149, 61, 57, -64, -319, -230, 102, 132, 147, 144, -129, -313, 92, 80, 190, -20, -254, -306, 28, 121, 254, -174, -319, -75]
2712g5J54J84O1k02m76k7L03J36J11j7m79J71J56J00L32n48l8o1K75K8O1n4k02
2735a07l39M15L08Rj89r3j07m9K42P8J48n50QJ9L41J21j22j71l61K92K26l6M9
2758A32k96j52J50J22K18J50k31l50J16j0L83P6j80n65J33K83J86j3J1l16j41
2779b94J80L78q3j05m67J57J92L21n7k38m08OL16L2K91j70q2j35k1M51M3j11n00
2802c04K8J31K50J53j44l45M3o3K21L62r1k90k95K67QL86k06q9j57k46M47Q6o
2825A46k14j10j1K25J12OK0l49j19L79j66K0J6J8m6L7J65p2J01j56L5p9K46L5
2849B39j49k97K2J66R7K54k46k12r5J74J80O7q0k46k2K09J09p4K08n10m3J70K63
2872A84k0J39n44J42l1K25q1J48l55J79j05L12J6j59m6k90K50J47M0Lk23j61K02
$$ y = [-75, 79, 263, 324, 122, -354, -381, -78, 58, 169, 152, -327, -156, 0, 100, 432, -116, -154, -215, 60, 88, 149, 95, -107, -446, -31, 277, 286, 97, 4, -103, -152, 90, 168, 316, -234, -226, -207, 134, 255, 133, -38, -399, -107, 119, 83, 132, -164, -316, -166, -44, 174, 324, 93, -257, -141, -151, 232, 308, 128, -437, -304, -21, 165, 152, 163, -153, -294, -114, 264, 181, 76, -391, -234, -42, 279, 222, -16, -424, -418, -102, -70, 221, 51, -31, -166, -187, 264, 307, 196, -304, -276, -145, 105, 258, 114, -231, -188, -251, -30, 332, 241, -49, -344, -77, -69, 317, 111, 22, -135, -381, 66, 152, 146, -68, -178, -189, 36, 148, 154, 174, -175, -294, 85, -81, -61, -45, -27, -73, -36, 129, 57, 158, 2, 37, -42, 204, 239, 90, -207, -185, -19, 78, 332, 86, -126, -221, -47, 133, 200, 120, -126, -148, 61, 170, 96, 304, -206, -249, -79, 184, 164, 303, -241, -99, -130, 95, 14, 162, -193, -14, -119, 193, 209, 50, 4, -286, -36, 111, 151, 154, -69, -230, -28]
2895b8J3J53p2j30rq7K85k5j1r0j43j32K52M08j94j69l28J23J51P3J01m6l49K12
2919d2j25J21L35l11m5P1n7J25O4j53o2m3j1J73M9j30Qj13K66j61J52m2p1j04
2943a06J08J36P1n9l13oJ12jJ89N7k43N8L8J31r0J52l91P6j62L61J08p8k49k1
2967a22Q9K4M8J35j45r8lK09m7j18K08l42J5J4L43m9j11o4k13J75n5J58K5j15
2991c9p4n5L21L7o9k51j16J28Q5L44j71j98pJ64j39P1j37j8J75j11%N1j50P3m7
3016a33n6L33j67J59k24n4J14j34L27j60o4o1Q9J27N0j1j82l48L83L7R4J50m59
3039a90M7J8J56Q0l7j19j14k8J72J95j12j60j05RJ14J78k22K38j90J11l5J84Q0
3062B70l00J2J15j72J48n3P1J6r3P9K9j29J13k39J15K2M7J07k9k50J22j21M35
$$ y = [-28, -15, 138, 66, -64, -73, -160, 125, 100, 89, -1, -144, -276, -24, 384, 190, 21, -307, -184, -33, 40, 141, 95, -254, -42, -167, -46, 289, -22, -67, 4, -53, 72, 136, -17, -79, -122, -133, 40, 89, -41, -33, -146, 120, -41, 111, 69, -2, -106, 2, 138, 209, 150, -163, -169, -57, -58, 131, 188, -55, 3, 41, 172, 82, 234, -157, -81, -243, 118, 226, 148, -101, -122, -33, -9, 39, 174, 29, -69, -72, 137, 90, -28, 180, -162, -147, -133, 210, 161, 50, -14, -227, -52, -107, 51, 76, -39, -113, -168, 153, 190, 121, -130, -246, -118, -33, 311, 140, -58, -65, 99, -40, 31, -106, -124, 51, -60, -60, -9, -159, -86, -133, -189, 144, -23, 136, -88, -142, -28, -162, 165, 5, -59, -120, -31, 96, 146, 135, -47, -395, -12, 25, 119, 269, -190, -143, -125, 31, 111, 74, -45, -159, -187, -15, 180, 68, -92, -197, -188, -74, 104, -118, 120, -70, 41, 6, 190, 270, -30, -18, 97, -75, 73, 20, 91, 107, 14, 93, 122, -7, 106, -133, -18, 4, 51, 158, 129, -121, 1, -120, 315]
3085C15k60M6p2k7P7n2L1p3J05k03j5mK46K0j76p9N3M0K96k67J03j95K06j77K52
3110A90%j74k05N6L3K62%j71J12k95K19K1J15j19j33j09J87O5p3K18l70J67Om3
3134d1J44j36m1Q2J21j02O0p0j31n0pJ80L6k17K04r5R3m8o3K8N5j88J61P4J54
3159B03j07k7k05K4L2K49j06o1j63J30o4K66j55J34k85R5K4J08Qk92N2J14K9m6
3183d3K25j66p1N7J22Q5j26P7l16K68j23m5M5q9j37J25J77N0m7j18q9L0K05m9
3207D7l6j27j08J53j64K84o5m8l5oJ19J01J30k49n7n7L2j3L04k02l1Q0k00K83
3231A35j01K0m5k8J9J14j37n8R3k56J29K22N0k87k9L3njJ64n4J4j51J58j4J11
3256I6J2l60J96p1Q6P8L2k93J90k14L88M9j97j32P7j29oL93j01m3k67J37l9J56
$$ y = [315, 55, 101, 29, 2, 79, 27, 58, -15, 90, -113, -128, -132, 114, 134, -42, -121, -68, -28, 268, 1, 104, -91, 115, -62, 190, 190, 16, -189, -133, -100, 162, 162, -9, 103, -192, 27, 48, 163, 44, -89, -198, -11, 54, -19, 199, -171, -4, 2, -41, 103, -33, -74, 8, 129, 27, 87, 17, -114, -164, -171, 9, 45, -172, 32, -63, 30, -18, -81, -53, 2, -186, -25, 49, 203, 96, 69, -136, -112, -80, 169, 63, 2, -161, -31, -95, 171, 16, 150, -135, -40, -16, 92, 100, -192, -140, -26, 3, -43, 182, 16, -55, 2, 124, 209, 83, 160, -156, 112, -11, -56, -11, -100, -237, -112, 65, 115, 68, -50, -139, -109, 96, 47, 11, -116, -224, -71, -235, 49, -16, -64, -99, -105, 14, 115, 245, -4, -61, -118, -86, -99, 205, 3, -28, 52, -148, 135, 34, 54, 9, -19, 0, 114, -23, -81, 12, -244, -115, 107, 157, -130, -159, -126, -131, -132, 32, -22, -8, -159, -1, -15, 96, 108, -252, -56, -127, -41, 37, 69, -224, -34, -248, 140, 189, -8, -140, -63, -192, -198, 195, 94, 51, -216, -79, -118, 38]
3280C8m4j2K2j53L1K06r9J16r9j81rJ95n4K27k21J1j69J11K23p9j73J7K6l5L54
3305B49k86o8j14K48j28N5r0R6R7n4N6j23J8j4Kr3J35O5K8j2k20K6K16o3r3l6
3331a03r6P5N1M58k85k07%J86k45J44K3o1q3M6R0q3J60k38N5j5m0K15q7J03j38
3356g5K7l8J64P7n0n9k41J85R0o3o7j44J50j33P1J49J4r6mJ3o3O4O2O9l77L31
3382E6j50m5O3j00kL67l91J80J57k60l9k3L08j56MJ07mkm8J32L6r0l69K24j2J54
3408I7j0k5j54J8J13j04K79j26q8r6K1J69N6k20J40k66J52j81L82j97P3j38o2
3431a67M0K03l2l2j1n7P4LJ16o6M1p3q0K82n1j60j18J5o9K35q3J32k26j42K89
3456F3m3J47j63o6j97L25J98j71j9j65j09r4J84K41j03l66J32J04J47O3K3l77
$$ y = [38, -6, -18, 4, -149, -118, 88, -11, 105, 6, -175, -184, 11, -43, 184, -37, -26, -195, -84, 139, 60, -113, -96, -70, -105, 249, -37, -105, -219, 29, -99, -44, -134, -38, 59, 5, 61, -62, -44, -58, -56, -149, -14, 51, 79, 67, -153, -127, 89, 26, -67, -103, -199, -124, -73, 385, 100, -107, -107, 79, -166, -22, 1, -60, -143, -97, -7, -90, 70, -168, -113, -128, -168, 47, -40, 63, -75, -48, -86, 78, 155, 105, 46, -195, -10, 80, 17, -50, -194, -44, -177, -106, 43, 57, -39, -43, -30, -93, -29, 33, 102, -275, 56, -94, -139, -76, -176, -178, 189, -202, -22, 135, -125, -164, -187, 121, -35, -31, 76, 72, 70, 22, 154, 190, 100, -269, -45, -57, 97, 87, 62, -92, -74, 39, -65, 214, 88, 0, -96, -75, 94, 150, -70, 70, -196, -44, -225, 157, -40, 33, -105, -167, -127, 76, 44, 12, 1, -56, 18, 21, 137, 71, 112, 39, -41, 241, 190, 30, -88, -73, -142, 93, 10, 142, -84, -226, 63, 20, 167, 4, -62, -259, 66, 264, 93, 74, -91, -200, -294, -110, 131, 28, -338, -206, -102, 45, 108, 131, -246]
3478b46K48j36J79J16j08j08m5R3%K46j32j26j31p6K30J42K5l38J17K0R6M2O9
3501A77j93r4n5r7L46K18m71K4J7J27J87n9p7m1n5Q3K49j53j43k60J00N6K12N8
3525A56k57qj29K17k5N2J39k02p9j2L52R7k77j44k8R0J29m9o5O6j73J0L48j88
3549B0J48j76q5kJ88M2j30n6j4Q3j57J81L7j81J42k96K09P9J15j53Jk94K08K26
3573A35j00J18j23j23j41K93J41j16m1j90O2M4K18k53mj62P3M17j03p9k09K40
3595I7l27K76J78n6j77r0K04j90L76k35k80K7K00J95j12j49J7l8R9Q5J3Q3J15
3618C11l99N9Q7j02L4k02K79l58J84J42J79j96j18M4p2N5K14k5k00N6J79P2Q2
3641C05l84K41l21J66J99K0l5l48J76j20J77j04J34k84J18k0K64m9j60M7o6K6
$$ y = [-246, 2, -134, 45, 161, 53, -55, -100, -7, -7, 239, 107, -19, -150, -226, 4, 146, 171, -167, -50, -30, 66, 108, 177, -16, -110, -165, -262, 84, 302, -169, -145, -128, -1, 186, 127, 50, 9, -46, 37, 286, 133, -10, -270, -170, -114, 98, 156, -101, -109, -238, -21, -46, 6, 145, -57, -136, -148, 204, 301, 24, -120, -148, -58, 71, 22, -43, 23, -150, -140, 208, 20, 168, -8, -93, -95, 93, 135, 5, -51, -65, 18, -139, 42, 79, -102, 40, -256, -47, 32, 147, -6, -5, -299, -91, 135, 35, 153, 30, -93, -234, 59, 200, 84, 43, -147, -85, -41, 177, -76, -80, -242, -169, 248, 145, 66, -143, 97, -230, 46, 224, 168, -9, -99, 105, -85, 291, 56, -224, -197, 3, 198, 86, -63, -46, -84, 15, 100, 113, 196, 311, -88, -29, 58, -44, -10, -212, 67, -291, -107, 35, 214, 18, -100, -56, -128, -73, 141, 116, -84, -28, 151, 223, 305, -79, 162, -159, 7, 206, 226, 191, -157, 19, -101, 76, -28, 106, -178, -60, -80, 184, 135, -25, 22, -44, -18]
3663a8J64l5j19Pl79L09K08K76k98j85j55P2O2K32k0k90m1K10M2JJ44k01O8j90
3687a36K85n0j52P9j35M5oK55j97l4j5J31l37L08O9k23J53j29K1J60J64m6k07
3710Ck91K79K65l7l48R8k27J64RJ71N9q9j52L0J99L7r7l27nL07p8M6rk29J72o7
3736a17M3J68j79L68l77MQ8k4J33k28J22Lj10J15K37j67k99N4K11j13J35j30j4
3759g7lJ36L6J13j12k31k5K99r4n3O1j42K05J10k46J32P9k56l9J03J4K54j83j09
3783b8j68K86N4n6q4r0J69o2n8J11J2k8k58L29r4JJ64k40J39j40L7J68r6K7j31
3808c6m7J36O2q7k3k54J14j2J52O9K1j89r5K3N69l13k58MJ41m5O7J45j3j62p2
3833a03O0M6K34jk13j55N1J4J91j85Ko9J11P4L8K5k11J22J19j57J12j08n4O1k8
$$ y = [-18, 146, 111, -8, -1, -380, -71, 137, 413, 115, -70, -225, -153, -91, 141, 121, -169, -210, 0, 42, 43, 187, -14, 54, -136, 149, 99, -53, 26, -109, -64, -70, 185, -12, -46, -61, 70, -267, 41, 110, -113, 40, -89, -68, 92, 256, 210, 3, -288, -9, 256, 219, -129, -31, -258, -94, -85, 86, 145, 56, -96, -66, 133, 170, 73, -254, -259, 48, -30, 16, 7, -222, -50, -117, -74, 94, -85, 283, -94, -90, -2, -26, 107, -121, 1, 4, -106, 9, 246, 79, -220, -166, 45, -68, 67, -63, -77, -80, 56, 92, 205, 93, -138, -163, 136, 42, -11, 50, -92, 113, 223, -23, 109, 188, -68, -107, -4, 10, 264, 81, -28, -196, 90, 144, 88, 4, -86, 83, 21, -37, 74, 86, 58, -200, 129, 35, 36, 200, -40, 99, -41, -4, 164, 68, 95, -36, -83, 53, 115, 28, 5, -249, -135, -147, 5, 74, 95, -94, -189, -166, 403, 90, -168, -164, -23, -68, -1, 144, 131, -31, -103, -43, 3, 237, 236, 23, -132, -81, -67, 124, -61, -59, -128, -17, 57, 95, 120, -91, 31, 150, -7, 105, -3, -57, 4, -24]
3858b4m3K1q8k1J07r5R4P6j70N6l3n9O5K20k81J01q9R6o9L9J25j03j27nL46P2
3884B11l29j11P3K19R4l30J30q3K6J88Q9m2j71j47J28j64K14K2L8K9k10J87J59
3907B20k27Lp2j86J98R6qP6k27K21j11l7J49J3J17m53K43q2J76l9N9j26N3L6k35
3932a43J41L49k13k48j20J90N3JN4k20R9J33j76J49n8l0J51k97J79r4O8j06O4
3955g4J1K44j35m4j3O3o3R3j06J51j90l7J56N0j33Q8k43J34J3P2P8j14k91K94
3979DM4l2L2q8k5q7J48n6K31l43K42O1R7k67N9R5k67O5K26k97K31j50l1R8r2K65
4005A63k35J38j31n8M3J16m2J30J04k22n2J64J83r6k38lJ60L3j96j69J42r0K80
4028A24m5j21K49j62l5q5J56M2p6M8k03J43r4J35n7p2j90j72M60L6NM9k29n0K20
$$ y = [-24, -67, -46, -134, -155, -48, -143, -49, 27, -143, -87, -120, -179, -114, 106, -175, -74, -163, -67, -136, -97, 28, -75, -202, -207, 139, 211, -118, -229, -156, 63, 157, -173, -43, -126, -100, 88, 177, 135, -36, -183, -55, -219, -5, 17, 55, 84, -126, 61, 220, -7, -4, -76, -262, -64, 32, 24, 100, -127, 94, -17, -54, 95, 108, 225, -228, 15, -67, 109, 70, 129, 3, 56, 92, -143, -2, 347, 134, -114, -234, -44, 9, 10, 64, -156, -57, 76, -100, 49, -9, -39, 112, -185, -6, -100, -32, -138, -74, -63, 181, 46, 2, -11, 52, -11, 82, -24, 127, -63, -100, 56, 106, -27, 61, -182, -48, -35, 37, 115, 1, -290, 4, 48, 16, 48, -40, -65, -152, -4, -60, 171, -172, 70, 131, 228, -39, 20, 115, -152, -87, 139, -158, 73, -77, -108, -10, -102, 163, -72, 66, -65, -123, -80, 36, -6, 124, 228, 6, -46, 118, 301, 205, -33, -36, 124, 157, -39, -208, -66, -156, 124, 79, -42, 207, 45, 10, -75, 81, 123, 47, 95, -108, 35, -59, 76, 19, -53, -243, -415, 45, 81, 86, 135, -94, -144, 76]
4053G6J12k77J15j35J15j64L37J14m55K08k92L00N0P6k99J51n0k3J48j62qj5N
4076g3J14j1K47l15k63K23kJ50K07k30j70L1J30J5q2J05j09j9J00j09K34j72P0
4099G1l0j36J49J3j52P6j7O2o1K34p1k69RJ22o4K09lk11k5R0j17J47J26k23P0
4124aO1J68j39j47kk35R6L91j12K9r2k27P6O5n0J06m6K7m7lJ19l5O3k29J68k06
4150b02K87r8m8j77J82J13j7O1n4k40J6lK92j24L43m22R4N4p6P7p3l6J37k15K22
4175I3M7k97QL0j86K82K87j75j06Op7J91pR0k84n1J25m8J54j02J68jj21j47K98
4200A77m9j04m0j33K50N2J9q2j23j02O2J41Q4r4j95J7mM54m03J27l05J45J07J47
4224A48J5j65j66R4J6NJ54k9k23n0J85l7lM08l71L1o2J22J92o5r9j94r0J44J41
$$ y = [76, 188, -89, 26, -109, 6, -158, 179, 293, -162, 46, -246, 54, 104, 180, -119, 32, -18, -41, 107, -55, -63, -78, -73, 41, 30, 277, -38, -301, -78, -80, 70, 277, 47, -123, -92, 38, 53, -29, 76, -33, -52, 48, -61, 173, 1, 71, 41, -95, 54, 67, -85, -9, -26, 36, -25, 209, 138, -131, -122, 0, -64, 145, 142, -69, -94, -4, -121, 26, 152, -71, -1, 60, 228, 89, -58, -60, -295, -199, 192, 80, 109, 17, -210, -134, -69, -119, -13, -59, -32, -79, -82, 37, 2, 65, -164, 4, -202, 85, -13, -61, -238, -56, 57, 40, 101, 47, -193, -177, -180, 112, -12, 331, -91, 3, 57, -19, 58, -15, -51, 86, -129, 93, 140, -157, -149, -119, -305, -23, 264, 89, -17, -11, -88, 103, 96, 186, -98, -149, -24, -72, 82, -20, 148, 147, 26, -121, 177, 128, 24, -16, -149, 101, 153, 172, 90, -33, -135, -73, 68, 152, 58, -137, -120, -124, 330, -73, 54, -251, -106, 1, 148, 163, -2, -168, -74, -58, -53, 101, 72, -151, -201, -16, -53, -56, 352, -19, 12, -50, 72, 264, 199, 100, -94, -184, -40, 101]
4249A01k78K04j92N3J48J62q3j29k86J59JL20q8J86m05m6K74M2j76Q5k74J4J01
4272a07J60J25k12Mk69L70M1N1Jk34j9m0K15m6q6K2j8j13K69L5j75Q4oj58L8J95
4298A27p2l4j67O8K62n7j54J30k88R9O3K39k13m7j52J79J9J32jp8k98qK83k00
4322a68L68k39j11J14lJ00O7j83rK8O3J44j77j01MJ50j25J97L3k00oO7k04M14
4346B23p7m2j31J9j18N26l28O9M1l50J81j23M42k46q9j24J13Q5J13j45oj83J28
4369b2J8J04m3l7oj53J00J7K16j51j78L8P3j0Q6Q5j85K9N4J63r9p1j39L6L2J12
4395F9J9L5p2n1m8K0K40m1k88J24j45K26LRj35j2q9m5L41j66j67J13J55k87M85
4420B93m06J34l02J43M16j23j25j88p9J44K25J27j56j51oj0K93j97J88k49Q6j57
$$ y = [101, -177, 27, -165, -112, 36, 198, 115, -14, -300, -141, -140, 180, 92, 278, -127, -173, 101, 143, -33, 52, -222, -208, -107, 53, 178, -34, -30, -299, 71, 112, 163, 164, -70, -89, -129, 86, 40, -46, -24, -42, -155, 114, 149, -26, 58, 52, -106, -68, 127, 55, 21, -146, -78, 184, 127, -27, 103, -185, -86, -23, 216, 3, -44, -196, -17, 2, 134, 133, 55, -243, -251, 32, -168, 200, -39, -150, -36, -39, 61, 128, -55, -64, -36, 27, 171, -6, -107, -103, 47, -78, 119, 152, -48, -54, 13, -191, 223, 146, 104, -27, -8, -126, 400, 72, 141, 182, -168, 13, -110, 332, 86, -3, -127, -14, 71, 184, 39, 33, -150, -22, -4, 100, 57, 20, 14, -139, -39, -22, 194, 43, -135, -97, -24, -34, 52, 137, -48, -19, 35, 198, 99, 28, -111, -75, -43, 69, 88, 123, 51, 0, -48, -28, 212, 171, -117, 7, -138, 88, 91, 100, -35, -47, -136, -181, 160, -6, -173, -60, 95, -192, 293, -113, 21, -281, -138, 278, 155, 30, -158, -237, -93, 132, 259, 103, -48, -54, -64, 229, 32, 220, -29, 57, -100]
4442a00J37J31p4k9j06j40K86n9J09l60K7J59K05m3j13o3or4J75Q5r9n4l7l3M2
4467e4J84J89l71j35J97Q2j8J53j8m81J47j8K18Q9k81r9J33K9K6J89r5J9j91O9
4491c7o6Q9K31l41j14j5J62K71k08m9j02J02n3K51J9j90jP5j9J67R0l08o3K3m
4516i0L6K21k82K0R9j09J91m5k47Q9L24k42J02j13Kk0J80k97K27o9o4j9o1J84
4540A7L0O0j84J09k25R7M01m06J42j23Mm1L23j73l8K2j04O2o3J55m4J26j32o4
4564d9J65j35KK4k82L81j39K03r9k7k75J06K23N1l2j96q3K06K50k13Q3k05q8M3
4588h6K14M9L4l61P1J67NN9j06j17r2K20l6J13j72q9K33j83J33n6J1J0k33J59
4612e3J27o6R4j08p4j26K67K95k15j90j39J7O9K39m8L9j18l90L41O3k0j9o8j9
$$ y = [-100, 37, 168, 94, 65, -41, -181, 105, 46, 155, -205, -178, -19, 186, 143, 30, -33, -39, -133, 42, 127, 28, -26, -63, -96, -54, 130, 319, -52, -187, 10, 92, 74, 227, 209, -272, -125, -143, 75, 164, -117, -216, -83, -54, -28, 161, 66, 85, -106, -37, -103, -14, 217, -124, -238, -253, -91, 180, -28, -77, -179, -77, -130, 121, 140, -50, -51, 24, 5, 172, 262, -46, -109, -86, -90, -54, 167, -115, -95, 4, -105, 86, 41, -206, -117, 207, -35, 67, -46, -44, -64, 116, -181, 46, -23, -87, -106, -167, 17, 47, 107, -77, 32, -193, -96, 305, -101, 41, -82, -78, -119, 204, 31, -7, 15, -89, -27, -90, 65, 21, 147, 15, -49, 116, -19, -17, 7, -275, 106, -33, 170, 71, 44, -231, -125, 98, 149, 117, -79, -162, 44, 294, 81, 164, -41, -129, -86, 128, 177, 211, -150, -79, 88, 93, 152, 46, -71, -163, 57, 21, 134, -38, -127, 106, -77, 56, 0, 11, 21, -212, -53, 74, 8, 102, -6, -80, -206, 61, 356, 141, -49, -188, -171, -102, 137, 89, 128, 10, -380, -39, 24, 4, -15, -83, -102]
4636a02M2L14j07m6j48p6J1N5J29j23R1k51L27l6j11k7J49o3k37K63J83j11k06
4659h0m7R5M8k0J24k13j1p6L24r6P0j15j69K88J52k21O8Q1l10r5M42o9k7k7j71
4684e5j0N5L5j13N0j12J84k8p0J52n2r0l8K27l22L12j31j22OQ3J59J03l39l0J3
4709a33J30J03j7N0m23K26n2O3M5Qo6M8p1K58m4o1Kj77R5R3P7k7k01L9L2J08J23
4736B28j20k28J41j86M72Ll67j73J83J79j24L7J8j16r0J2K45r7J00j47j52J27
4758e5%J08P5j83Nk71K36K10Lk47K59l05MJ79J63j23j94J6J29K05j55n2j42N3
4782h2K7J27M4n4j80o7J66K51j45M0l59J05k1J46K05j99r3l9J02R0K4j47Q0j63
4806a42J18J67j63J33j84L4j84J87j2J35N0l71Q6K22j8J34l64n6K36p3K54j74
$$ y = [-102, -60, 254, 147, 101, -47, -123, -112, -57, 72, -51, 40, -211, 116, 80, -31, -58, 91, 28, -209, 54, 237, 126, -80, -127, -32, 16, -4, 120, -93, -104, -180, 144, 48, 118, 3, -166, 122, 274, 53, 121, 202, -108, -203, 239, 170, 143, 116, -55, -65, -10, 25, -88, -38, -150, 34, 6, -64, 88, 36, -54, -92, 135, -187, 125, -6, -128, -122, -39, 120, 223, -116, -146, -133, -3, 100, 83, 133, -290, -64, -116, -53, -8, 0, -66, -18, -89, 169, 125, 64, 66, -111, -16, 77, 154, 127, -74, -35, -3, 105, 228, 108, -120, 21, -165, 307, 310, -57, -230, -47, 132, 8, 45, 63, -53, -143, -131, 114, 17, 117, -30, -182, -55, -55, 53, 128, -55, -50, -321, -85, 125, 128, -119, 140, -165, -161, 18, 181, 58, -136, -120, 9, 214, 59, 7, -135, -82, -55, 72, 116, 62, -118, -185, -19, 232, 87, 127, -232, -127, -148, -2, 203, 4, -89, -128, -26, 64, 88, -59, 21, -142, -24, 143, -20, 113, -71, -37, -221, -34, -46, 89, 139, -232, -146, 76, 58, 192, -172, -228, 8, -65, 189, 15]
4828A5j41K14k75Q3K4N1j74j6J15J51N3m6%j62P7o9J74J29k84j9p6K15J09m6q4
4853A8k77J45J1L02r2P5j85k38J98K81j12j47K2K6j6J33Q3l02Om1R8J88j54P1
4877I3j53n6O7J15J61j52k25J48k40K91J00l09K73k05j7J94L8J29q1k13qq2O4
4900f8J80j97K7r2O1K17l7L2l55J50j4N3K20j87n1j37L73k42P8n3l0N4j0m2J52
4925H2J01l95oL38r0J2j19oJ30k02K86Q4m7l91L6k9J54q8K4J29j12O6J51M6n5
4950I9l08R2J86Q1j04q4L1j11j19K89K78l59L7k18Q1Q9J38q7m1r8K05o3Q2j39
4974d3L1k53J68K30L3j13j41m6o3K93k53K96l8k04r3J61J73J8j87o5j05K25Q1
4997A05q6N6j10Q4j44J98l08L32j05k78L56M7J05j12k12Lo9J22N6n9J44j26j57
$$ y = [15, -126, 88, -187, -104, -80, -29, -203, -219, -104, 47, 100, 54, 54, -108, -31, -100, 74, 203, -81, -100, -176, 39, 148, 102, 18, -259, -114, -103, 199, 107, 182, -3, -241, -43, 238, 126, -21, 1, 27, 11, 144, 227, -75, -69, -110, -12, 176, 22, 93, -60, -116, -49, 66, 227, 75, -150, -2, -242, 49, 149, -160, 113, -92, -109, 85, 123, 252, 171, -42, -50, -132, -68, 112, -85, -58, -150, -89, 128, 91, 123, -232, -82, -96, -43, 177, -10, -61, -198, 175, -67, 11, -42, -72, -18, -28, -70, 82, 183, -212, -218, 120, 30, 42, -77, -83, 47, -155, 131, 215, 168, -223, -187, -216, -62, -150, -126, 3, -109, -43, 108, 154, 99, -209, -117, 69, 150, 46, -38, -7, -118, -237, 52, 330, -29, 8, -210, -129, -40, 98, 11, -30, -128, 77, 14, 96, -43, -12, -265, -97, 133, 166, 53, -88, -134, -197, 96, -157, 139, 101, -103, -196, -35, 138, 156, -31, -96, -201, 24, 105, 19, 75, -35, 49, -95, 103, -205, 127, 22, -256, 100, 147, 252, 140, -72, -69, -138, -16, 40, -19, 125, -1, -158]
5020a58J84J0J0n0p4j8L35j20J46k57j76Q3P6P1j47R4j32K27j32J20j80M4j37
5043a81M5R4K45j04j56N4r6K87k32J93j56j77j2J59K39j76Q2k12K04r0J5j9l7
5066c1q5k0J6q0M09j61r2j81J61J11k4J0n0k09K40RJ26j4j47o9J11J26Q4k92n1
5091a03Pj63J65kL24k87k1l12N57k67R1J50l33J62K02oq9n3j22J57q9K60j40m0
5115D8j22k9L9J97j06k4O9r6J11j3mn7K8k72L16R3j65j38J97k19J9K22M9L1k24
5140e0j13J35J58m8p0o0L4N8m0N5q4p5k5K03m8P7P2k94J57j80J08K71k34j7m5
5165e5J48n3J28L6k95j1J38j16J60K34l61L6j56J94r2O5%j76pK09P0O1j22N1j73
5190h7N4K7k0m2j33J15K18m0j21M7p8p3K13k9M4M3k86j80K70J86j01l7N4j04l9
$$ y = [-158, 26, 36, 46, -4, -78, -96, 239, 119, 265, 8, -168, -85, -9, 62, -85, 9, -123, 104, -28, 92, -88, -44, -181, -136, -42, 203, 99, -57, -3, -99, 188, -44, 149, -7, -184, -196, -37, 202, 26, 108, -104, 100, 10, 25, 6, -31, -116, -136, -120, -200, 209, 48, -44, -225, -64, 47, 23, 33, -17, -226, 14, 23, 149, 135, -12, -81, 30, 156, 240, -52, -103, -96, -259, -94, -96, 228, -59, -80, -392, 165, -102, -11, 139, -194, -32, 170, 164, 75, 22, -100, 57, -32, 228, 88, 48, -74, -103, -64, 133, 27, 3, 72, -24, 87, 74, 70, 13, 41, -231, 85, 178, 13, -125, 72, -147, -128, 94, 143, 174, -50, -163, -28, 130, 82, 12, -48, -14, 44, 4, 59, -25, -100, -125, 78, 30, 107, 179, -115, 42, -138, -30, 241, 7, -10, -55, 93, 40, 168, 204, -91, -102, 36, -80, 80, 314, -47, -11, -167, 27, -65, 0, 0, -176, -183, 26, 96, 157, 35, 86, -87, -33, -6, -26, -68, -201, -86, 132, 92, -29, 18, -60, -133, 80, 51, 95, 138, -148, -328, -58, 128, 27, -10, 44, -60, -99]
5215i9R7L9j42J90j90l8J88K2l9p8j05J67K3J87M3l29j66J31NJ44l7m7k60L79
5239H5j03J84l4J1%l04L90r3j35j51Q8%J78q5l4Mj83L8O8M4J35j01j07N7j7J71
5265A06k69J19k9l4L4J48N4j63L4q7l6J40M4j74m7J44jN3J71k15m5k1R1J6m8N2
5291C7J40o0q0O6j05n0P4J4j31J05N8q6J28m0J7o0J01M7k22m4o0K07kj94J72j70
5317a38J00N9P9j04J20j97k9J94j55K05k38j52K88K9j93J43j51J58o7M7M7J07
5339A52j61P9j00K21K4j25m7j72J01J15O4j62J64k89P9J04q3P8j50L3j3K01N9
5362A72m9k1k94R2J89jP3r3j24QN2l0j31K64k91P5J56L2p3R1kr7p7K42q9n1k8
5389ep6R4r7K73j62J4k32J67L24l49l3L9kJ8M2K0j7q0%M9l5K3J95l16MJ84J94
$$ y = [-99, -2, 37, -105, 85, -105, -143, 45, 67, 28, -50, -155, 12, 35, 222, 265, -64, -230, -99, -94, 50, 13, -34, -294, 85, -18, 166, 132, 143, 143, -161, 229, 136, 1, -150, -62, -62, 116, 31, -3, 1, -182, -144, -76, -32, 103, 2, -105, -48, -65, 106, -163, -44, -73, -107, -73, 75, 129, -34, 0, -87, -123, 17, 61, -113, -160, -16, -17, 36, 207, -8, -53, -74, 17, 33, -15, 37, 177, 117, 37, 103, -2, -52, 22, 36, -95, 10, 68, -18, 110, 70, 87, 27, 128, 175, -47, -91, -151, 56, 54, -140, 32, -138, -38, 21, 100, -4, 116, -81, -110, 84, -71, 134, -104, -256, 32, 61, -132, 11, -140, 18, -49, -2, 45, 152, -9, 70, -30, 191, 215, 90, 43, -129, -28, 87, 151, -11, 153, -136, -57, 47, -36, 42, -108, -75, -88, 113, 172, 123, 102, -192, -100, 89, 88, 161, 68, -56, -48, 4, -26, -157, 107, -184, -109, 47, 79, 6, 97, 95, -2, -79, 163, 74, 23, -5, -81, 13, -84, 189, 27, 41, -191, -24, 300, -49, -82, -43, -45, -27, 15, 35, 18, -62, -62, -13, -48, -25, 170, -146, -142, 42, 236]
5416B36j63Q5k54J28j73J14R8J67j34k50K2J2J62P9p0k65Q4PK43j26N3j60K84
5439A79j91J11j25J24j18K0J04J6k19K5P3j68L39j12k21K03l64K53J33J10k85
5460a13J93j55R5O7J28j97P4k6l57K17K30Jm6j09N0j95J77j8j76K46k56J77l6
5483b9J27j48r9P6k4J4PO8k4j87J68P5J82j68n8j2L1j52L44p4k75R1O4J59M4k12
5509a2j28M7Q7O8J19j56l9J1N7nM9k2N9k09Nn1J10J74R4m02J51K82j73j25j7m2
5535f8K6l7K5L6j2o6k7q4J85L76l24j05j2Mj07L16j08k21P9o4J78J53j11k27J
5560a94K01J27l8p4M0k71J48R6J6K31l67L5j15R5P4J24j76r8l1J59L47j93k75
5583a39km1Q4J35%j87J95j76K40J2j0m1j27N3o2K25K5j97J4k05K24J19j90K02
$$ y = [236, 73, 158, -96, 32, -141, -27, 71, 238, 104, -146, -124, -112, 50, 129, 59, -206, -122, -115, 128, 2, 55, -105, 179, -12, 99, -26, 98, -20, 0, 104, 120, -99, -74, -1, -169, 170, 58, -163, 40, -324, -71, 62, 172, -113, 80, -75, 20, 87, 215, 18, 92, 66, -291, -74, 156, 157, 111, 2, 52, -143, 34, 16, -160, 86, -170, 7, -29, 98, -50, -149, -73, -97, -83, -76, -8, -32, -219, -51, 24, 206, 38, -20, -32, -1, -153, 191, 117, -158, -67, -3, 156, 200, -12, -140, -93, -6, 62, 181, 25, -14, -3, 54, 49, 98, 76, 135, -74, -69, -120, -10, 164, 258, -144, 7, 289, 116, -9, -26, -68, -42, -79, -54, -18, -30, -96, -123, -207, -22, 354, 30, -75, -87, -83, -190, 126, 18, -203, -124, -188, -10, 143, 32, -195, -194, 7, 134, 96, 22, 62, -209, -61, 35, 51, 282, -85, -50, -165, -70, 4, 128, -48, -146, -177, -18, 329, 136, -139, -141, -182, -98, 37, 37, -150, 45, -131, 109, 121, 111, 70, -57, -4, -66, 159, 184, -13, 1, -204, 20, 139, -51, 151]
5607A51p4j51J18o5J44o4Mp0j23K59L8p4k19J7j41J67J78j48J67j52J2L4K02j70
5631D0m9m4L2K22j01j12k53J54Q1K4J99j03j21q4o4J68J07J18k97o5J11k9N8P5
5655F7j57M9n9Q3J09p7j6p1J47r9K36j71j71N1mL4K02J9k72J07l3K7kJ62l29l
5681a71m5L93k00K25k49K42l04O3j15L72k15j4p0K03Mj57P6n5r9M1K59m3j87j95
5705b41L07k4P4P1n9l31J20M1Q5M7o0n1j00O3P4M8j40m8J53l46M37q1j7j07%K06
5731A21k36M3J93k66J38j64nL54j75k4k53J56N5J6J44j6k34J68L5J21j66R7l21
5754b19L00k2L1O9p0q1p2Q9q3J03Pj12j64K46M9m7q3Q0k4J72n4j23J19l79L70
5779A02n1J3J12j68k15K22j12J58M5j15M1j85J49J89j25O7k43LN3j0J10q8P3l4
$$ y = [151, 77, -74, 44, -21, 123, 59, 63, -7, -130, 129, 167, 93, -126, -109, -250, -83, 95, -53, 114, -38, -26, 8, 210, 40, -9, -53, -21, 201, 100, -12, -265, -111, -30, -6, 193, 90, -31, -115, -179, -11, 96, 214, -83, -148, -37, -66, -8, 67, -90, -41, -100, -17, 92, 15, -1, -72, 75, -24, 212, 41, -130, -79, -83, -49, 153, 172, -100, 7, -26, 1, -1, 161, -168, -171, -216, 177, -23, 202, -47, 195, -109, -46, -161, 211, -4, -18, -88, 115, 119, -38, 38, -17, -116, -75, 184, 141, -46, -241, 66, 42, 116, 187, 128, -203, -83, -42, 43, 90, 30, -21, -121, -58, 16, 64, -76, -124, 29, -317, 120, 39, 22, -85, -85, 121, -115, -72, 121, -145, -7, -171, -176, 178, 3, -21, -274, -118, -63, -47, 97, 81, -153, 15, 50, 171, 5, 102, -219, 81, 59, 90, 159, 89, 8, -64, 25, -58, 45, 52, -60, -224, 22, 71, 24, -59, 21, -3, 169, 115, -8, 111, -268, 102, 51, 64, 176, 8, -207, 15, -97, 61, 106, -9, 32, -153, -4, 185, 60, 127, -116, -113, -60, -70, 40, -48, 25, -9]
5803iJ59j93P7K4k02P4J85m4O3k02LmQm3N1J95l10K61m7O6j50L7Ol2j89K18P5
5830G7O8j6o8k86J88J16J32k63J4M4J8j16L47j83j00j39k4J97K01j17n0q2n8K43
5854A43l01K32O6l26K4J79QL3j33J04n8j6P2j23L5J02k23J29J53k23J55m6J14
5877A00j65P3Q6jj04N6n9j63K01Q2k47P2K69k48p2lm4q0J56K49j2q5k1j01k9J75
5903H5k60K28o4r2J76o1j84K29q3p8J79o6k1J8mk17K70J9O5p0j09N7O2oK4j22
5929b5l8P0j8K82k84N4o6LL6J2n6J94o6n1j67J9N8jK1N4j01K14j1j52m8P8ll5
5957b7J04J02j43j71K01M4J28l31j54J49L2R4J01j77M0j45P2P9L8q0k9l9L0P5
5981gj19O8QM7O4j09Q5J60j65q5j7K0n4k4N7j10J43K70k64J3O0j80J63N6j92J93
$$ y = [-9, 150, -43, 34, 58, -144, -70, 115, 71, 134, -68, -65, -69, -61, -104, -53, 142, -168, 93, 46, 112, -38, -1, 5, -27, -216, 2, 77, 145, 129, 61, -225, -37, 79, 211, -52, -38, 6, 24, -92, 255, 72, -28, -167, -191, 6, 207, 90, 40, -42, -100, 143, -158, 74, 140, -186, -162, 17, 25, 58, -75, 29, -29, -45, 27, -96, -61, 41, -182, -53, 100, -123, 32, -14, 100, -65, 8, 94, 93, -11, 45, -14, -177, 24, 106, -141, -69, 200, -48, -120, -123, -167, -247, -91, 158, 146, 61, 40, -61, -90, 85, -175, 53, -11, -103, 73, 12, -172, 57, -26, -104, 75, 9, -12, 6, 2, -215, 55, 74, 139, 69, -40, 17, 79, 73, 97, -25, -63, 7, -11, 271, -13, 41, -25, -22, 14, 26, -30, 164, 98, 47, -120, -101, -43, -44, -23, 31, -70, 144, 133, -19, -67, 11, 8, -27, 77, 179, 36, -135, 66, 110, 238, -93, -247, -98, -66, 28, 129, -48, -8, -153, -81, -2, 36, -44, -73, -112, -82, -7, -126, -58, -50, -3, 61, -48, 37, 197, 32, -53, -70, -50, -104, -128, -71, -181, -38, 232, -32, -19, 41, -139, 24, 80, -112, 81]
6007H1j57k7J65Mj4Q6j88J10j64R9m9O8j30j26K90mM3J21Km39J63N8P2l9p5M8
6033bj48K35j0J7j06p3N2j39K11J06j9m05J96r4K34p4L2j31r8K61m1J01j9J9j01
6058Dj14K94l4l8m5k88J68J81j12J1j33j9O3K07r9l0j14L02j10l03L29Lk6j83
6082h6J1J73k45R8Qj73K45J9j78J66J37l53J42M3j31J00JK2k3p2J61j58L0j65
6106b28K04j18K39j75m9j7%J13J46L6K7j50KK5j83J66n8jR1J3k2L7J4l17J6J78
6132a1P8P2p0k9J9j02L9M0M0r5j49K83l8J4j70k9k6J87K6R5k9k31LQ8j42J11J69
6159A43k59p0N2J71M9O3j99j39J30J3J97n2l04K28K4j39J15J06k91l9K80q5M1
6182C5J34j44q0KJ46P0p6j21R4J9j21L6P0j51j17J44m7J69j09o3k7J11P3q6J46
$$ y = [81, -76, -103, 62, 66, 52, 138, -50, 60, -104, -5, -54, 14, -116, -242, 48, 44, 87, 208, 210, -229, -66, -8, 64, 25, -50, -2, -150, 85, 75, 92, -14, -87, -35, -174, 37, 143, 124, -281, -85, -179, 55, -19, 13, -118, -216, 45, 4, 105, 86, 105, 4, -110, 184, 150, 112, 67, -221, -53, 128, 16, 27, -106, -125, -62, 145, 46, 16, -98, 204, 94, -209, 120, 123, 97, -86, -75, 98, -147, -49, -41, -214, 31, 50, -128, 38, 175, -178, -36, 7, -124, -24, -23, -1, -24, -96, 65, -93, -63, -228, -24, -142, 97, -78, -127, -144, -144, -31, 115, 151, 178, 28, 30, 55, -128, 38, -20, -21, 70, 83, 61, 98, 112, -205, -189, -11, 67, 139, 69, 40, 59, -43, -4, 36, 76, -19, -168, 115, 77, 91, -79, -108, -134, 53, 79, 174, 145, -86, -83, 5, -137, -26, 143, -116, -186, -134, 37, 86, 149, -50, -189, -59, -46, 151, 99, -205, 23, 47, -92, 23, 129, -162, -201, 79, -6, 35, 169, 25, -55, -53, 93, 163, 87, -34, 60, 79, -42, -6, 64, -87, -204, -60, -107, 62, -47, -110, -137, -26, 47, -39, 107]
6207A07o5J24j38m6o7kJ78k33J06J1L4R6j52J22j86O5L7R5n7K2j15K3k8qO9j82
6233a90K76j32P3J79j98N4k87KK83O2j68j10L42k43K26o3j33J11k01l3K16p5j62
6256a71J36j49K32j03R0P5p5l50J15J16R6Jk6Ql8J34o1j55J28k45K66Q7j3M7k74
6281a29K57j45kJ49j68K24k64R3Jk2j6L0k3K1M0p5J07k4k03J3K28j06p2Q7J5k2
6307fk4K4R8m7k02N8J54p2j8J72l96J08O1J06J58j93q8J79j06N5J23k09N2J27
6331A14l33J41J58r0m5R9K8P4n7r5o8J5J86j67J00L8k08R9j14J41m0K02l09P2
6355e9n4J74J00l7j09j04j15L77k28J33j49lP5o6J69k82K39j09K4J88j10l3J67
6378A88j82ko2Q0j58K07j68K89k54J68j76j33L14q9n1R4n0j69J63Qk5m1K01k54
$$ y = [107, 42, 166, 28, -18, -85, -87, 91, -142, -36, -25, 9, 105, -47, 75, -111, -46, -9, 86, 29, 51, -64, -41, -69, -77, -8, -190, 86, -46, 27, 206, 8, 62, -225, -223, 60, 122, -46, -156, 186, -57, 169, 106, -27, 84, -117, -150, 66, -9, -171, -35, -184, 48, -55, 35, 110, 35, -315, -200, -84, 12, 13, -13, -5, -43, 91, 30, -125, 3, -242, 24, 111, 98, 145, -129, 128, -17, -19, 130, -38, 186, -78, 15, 16, -6, -22, 8, -15, 6, 46, -29, 78, 54, -149, -136, 92, -14, -86, 1, 16, -6, -30, -6, 92, 45, -157, -99, 55, -17, -35, 137, -259, -151, -90, 16, 174, -19, -107, 72, -34, 21, 144, -65, -13, 114, -219, -78, 80, -10, -55, 44, 72, 146, 89, -6, -74, -59, 127, -40, 60, 98, -110, -11, -125, 16, -24, 178, -131, -59, -113, 61, 161, 124, 15, -89, -204, 173, -55, 78, -71, -74, 1, -65, 104, -178, 61, -48, -24, 164, 54, 21, 188, 6, 4, -58, 22, -136, 71, -97, 192, -62, 106, -70, -203, 111, 22, -29, 65, 15, -154, 9, 17, -8, -49, 152, -102]
6402a02J70j55p9p2L89j68j50Q6J60k26K09j03q0K60j30j67J16Q4m0kn1M6J33
6425A28J6k99P4l3P1K98q5q4m5M8J08k65J90p7k55J55%N6O9j61K0MP9Q0nK3k44
6452a34n4L35n8j54P9J80l47J23K56m26K15j06J17k05Q6J08r7N7j6J56k18J06
6474CQ8j65M7j19J13J14l3k20O2M7J06J18k32L9j28K37j29J4J13j29P1jJ09j82
6498e7m0M0nn1K43r3m7m6O8Nj58J52jj97M6OK34k3j07R3l6n8K40r6j45o6J1J41
6526E3k04K05Q5o6j17l8O1L11l13M1N8L6k12J11J00j69OO1l8J77P7k63nk40L50
6551F7J39j51N0k46M2P7Q2q7R1k42K06j64O8J47j72O5j6Kk1K70Mk76M1O0o3K13
6577A86j09k02oM7J82j09j14K00l07J21J88Nj05l9K0l8J20pr1K66l48M8O0J10
$$ y = [-102, 68, -87, -166, -238, 151, -17, -167, -81, 79, -147, 62, -41, -121, 139, 9, -158, -42, 42, 2, 0, -51, -5, 128, 144, -155, -81, -114, -43, 255, 170, 86, 41, 89, 197, -68, 122, 45, -210, -55, -55, 1, 70, -91, -71, -67, 12, 92, 87, 110, -134, -188, 147, 89, -65, 14, 194, -153, -30, 226, -200, 15, -91, 26, -179, -93, 15, -82, -25, -41, 115, -103, 3, 91, -74, -27, -146, -33, 81, 48, -172, -110, -63, 43, 161, -71, -32, -160, 77, -52, -38, 75, -54, 17, 16, 125, -57, -97, -57, -62, -113, 130, 37, -10, -56, 12, 17, -141, 11, 10, -187, -141, -135, 99, 76, -31, 62, 26, -32, 208, 112, -33, -99, -88, 53, -151, 54, 139, 73, -44, -82, -21, 290, -23, 18, 76, 112, -100, 11, 111, -58, -52, 9, -29, 148, 225, -38, -43, -283, 67, 206, 55, 105, -141, -99, -22, 60, -27, 64, -178, 28, -136, -68, 79, -93, -28, -44, -42, -63, 207, 211, -65, -24, 36, -27, 186, 77, -125, -131, -84, 98, -11, -125, 75, -232, -111, 77, 82, -23, -62, -42, -80, 40, 33, -58, 208, -140, -92, -32, 78]
6601G8m5lq4j22J83j8J14k38K4N7k0J50R1j93p4j0K21n9k17M3L5j24L67m8m9k04
6627a45R0J7L8k9KJ14j91J18o1j20K61l3k7o7J15l9J20p9k00M8K28j49M5j4j10
6652f8r2K18Jj36J76k31K6K3J55Q1j6r6j25P0n8K47j07Rj66L9R6O7Qj57K1N1j73
6679a37J85O2j30l4j8O3J19O5p4kk78K61lj2J25j07j78QJ68j23j29K14J07m7j79
6704g4J29j60J6J00r2J71k29J58ll0rn3j1J59j50q1L7K29Mj61j06K48p1k2J1J06
6730A16l03K03m2K21j10j17LL5k1l2N7q3j11O3ojL19j13j9j60j49K99j98J85r6
6755f0J42j60J23J15j34L3j69J47m3j49J45p4J07r6J16k97L76k01O1p7K64k46
6777g7M1Q9r0j5J79R6j85n4p3O2MMJ35j54J66j64P4n0J92l55J07N6O4J7P4k9j13
$$ y = [78, 33, 30, -54, -176, 7, -11, 103, -135, -111, -54, -74, 76, 167, -26, -100, -110, 111, 52, -165, -122, -87, -211, 156, 108, 59, -145, -55, -38, 0, -29, -27, 87, -104, 14, -47, -167, 94, 61, 34, -33, 82, 43, 163, 84, -116, -68, 160, 11, 56, 42, -68, -160, 58, 59, -77, 99, -132, -106, -83, 72, 153, 137, 41, -84, -14, -72, 175, 68, 77, -89, -50, 46, 113, 121, -36, -15, 36, -137, 48, 110, -20, -54, -72, -9, 110, 175, 101, 99, -179, 82, 79, 67, 192, 85, -93, -85, 83, -40, -169, 45, 152, 105, -74, 55, -105, -89, 11, -81, 90, -139, 19, 16, -14, -23, -76, -87, 72, -78, -159, -122, 107, 111, -50, -156, 92, 21, -1, 10, 116, -187, 16, -26, 195, 85, -32, -29, 6, -15, -47, 10, -73, -184, -121, -127, -128, 191, 78, 59, -101, -250, 49, -149, 36, -60, 82, -78, 45, 160, 26, 59, -110, 37, -6, -155, -10, -84, 23, -73, 43, -254, 122, -79, -18, -95, 169, -77, -36, 53, -37, -52, 127, 223, 38, -16, -89, -27, -23, -19, 116, -38, 128, -36, 38, -12, 180, -175, -68, -12, 52, 69, 143, 114, 1]
6804Aj18J78r7O7l9R0l67J21K99l5j8k14L1k4J29M7R2k68J00m0o8K03R1q3j31
6829e3o1Q9j82K03j20K50l1k54N4J53l3J6J24j66N9j02l0J82j82O7J98k06l7O1
6853aJ5j22K84k7j41qO5J42Jk54j1R4O2k6o8m32L41l9j00K07M4M2l27L47Kl6P2
6880A26j65J36q7j01J01k6R4k90M1M08k73p5J83n3r4M0l2J41j23J07k08J32Q2
6903F4j79K07n3l0Kp6j01J88k3k7J4o3m0J55q9O3j38J65j28K23r9j58Q9j66J38
6928f2J99q3J23k14m6K02q6K05l46k7J44p2Q4O5l0p0p7L31j83ro2p9o9P1J50n6
6954Cr0L04l37oK47k80L25k68n8J83Rl9J06r4P9j68Q5M0q5R6p6L0n0m8q1J46L9
6981A2K6P2j17J67n6j71R0p4Q2m9J44k64J63j0L8J10l6k28N9P1m0o8l2J89j83
$$ y = [1, -117, 61, -36, 31, -8, 82, -285, -164, 135, 100, 82, -132, -101, -125, 4, 51, 143, -125, -25, -65, -133, 70, 161, 78, -53, -114, -25, -207, -4, -124, 126, 95, -159, -105, 48, 15, 31, 155, -11, 48, -54, -84, 98, -84, -17, 181, -25, -62, -1, 14, -108, 176, 149, 8, 0, 65, 207, 208, -46, -57, 37, 99, 73, 5, -427, -86, -125, -225, -18, 26, 68, -259, 88, 90, 54, 126, -39, 97, 10, -91, 10, -16, 78, -212, -171, 237, -36, -111, 72, 19, -75, -35, -67, 74, -49, 58, -150, -18, 64, -115, 92, 39, 9, 11, -65, -166, 22, -1, -28, -14, -77, -117, 38, -51, 12, -126, 39, -89, 134, 35, -123, -34, -200, -62, 137, 54, 177, -37, -83, 119, 33, 238, -108, -135, 9, -63, 21, 86, 56, -14, -91, 240, 57, 48, -14, -93, -162, -91, 59, 3, -87, 217, -120, -126, 121, -159, 166, -102, -160, 23, 32, -7, 99, 5, 84, -84, 1, 41, -44, 52, -24, 6, -44, -92, -173, -27, 12, 38, 110, -7, 160, 104, -67, 23, -51, 31, -18, 126, -138, 25, 15, 53, 163, 127, -101, -42, 29, -11, -79, -111, 78, -105]
7006a05J69k53K70o9mj54K5J32k4J04Kk24K11M5j24k0j2k7R3M7J6j05o9l0J16
7031A0M0Nk02N7K25l77K54R4j31J75l57K50m7j17O1J62q6N5j45J23Pok57r2J78
7056a21k6j2K31N1j00j7o2J22l0J62k45qo2R4R6l2j32K05L5j68k2L3L7K0j28k
7082h1J55j58N5K4N0M6k23J67j69K67k30J70K1k24J28o4J19j19j1J23o9MQ9j9
7106E1m8P5l6p4k0k3Qo2n9L6K4L18k93j37J44l5J52N6l25K18J12j72Q0r1K30k74
7132a45J03N4j53J68k8k87K27k3l1K14j34K2k6r8J37m4j17L70k20J43j17R7k95
7155a83J33M4l9K86l22J39J2q7QJ01q8j70n6M13j26l8l0P7q4MJ58l9j25J24j04
7180HJ47k20J36l9kJ18j45j83L35j42j64J19r9k9K12j21J76m6n9kJ66k19j7J94
$$ y = [-105, 64, -189, 81, 12, 8, -146, -121, 11, -13, 91, 93, -131, 80, 125, 1, -19, -31, -58, 35, 82, 98, -7, -76, -106, 10, 50, 55, -147, -90, 135, -242, 12, 106, -25, 150, -207, 43, -4, -121, -60, 102, 16, 71, -74, 49, 56, 50, -207, -299, -121, -147, -159, 72, 123, 23, 6, -56, 66, 36, 198, -47, -55, -117, -23, 73, 41, -91, 114, 149, -19, -41, -8, 29, 49, -79, -81, 74, -84, -29, -5, 45, 91, -132, 35, -134, 133, -97, 73, 94, -130, -2, -66, 53, -66, -77, 46, -23, -19, 70, 51, 3, 78, 42, -32, -52, -75, -67, -129, -188, -152, -128, 190, -103, -240, -96, -131, 21, 77, -248, -30, 82, -90, -10, -101, 129, -145, -42, 12, -141, 27, -1, -288, -61, -84, -115, 99, -35, -13, -39, -137, 0, -44, -161, 209, -11, 132, 15, 112, -183, -50, -6, -45, 241, -81, 58, 70, -17, -9, 92, 4, -166, -222, 191, 65, 27, -3, 74, -10, -6, 152, 113, -12, 112, 8, 155, -65, 71, 32, 30, 148, 3, -180, 155, 13, -151, -32, -131, -160, 52, -69, 107, 61, 2, 0, 166, -53, -70, 124]
7204A24k7j19R7m2q5o1K96j62O2j24R1p3j18J82p8K14j70K1lj8p7n3K10Mk35O5
7230g9J19ok4J35j62K02k73K7J64j6j88K9J67j19J61k97J37p5J28j14L22l37N2
7253d7Kj46J49P4P2j86J23n9l3n2R8k36K30J0j3K46j94k1q9J8%J75l15J27J01
7278C4j42N8M0j73J62jJ89j15j12N2R7l71K62J97j97J00j32m0J67m5K8k4k81K16
7302c1J13l1l9K7K4j65J55q1J06j09LK04j85m0J26L1mj43j25K12N7j3j40k1J97
7327A28o4pJ07j08j4j45r5K81j92N1N0n4J43Q4k00J62j92K13L8p7q2j09J53k28
7351a57LN1J76k1n7k6N0l8O3q6p1P4Q6l1j0k1m6J9O6k30J18lJ99j24J17o5j02
7378f6L6n6J87j09J3M6P9r3p8J20J14Nj26p3M1l4j61K34j12Q7j71L4lQJ63l8N9
$$ y = [124, 97, -22, 75, 33, -52, -113, 183, 21, 83, -41, 50, -23, -141, 41, -37, 177, 7, 28, 25, 7, -70, -123, 87, 91, -144, -79, 40, 34, 10, 145, -17, 185, -88, -61, 103, 87, -101, -72, 95, -24, 137, -160, -23, -98, 30, -84, 238, -99, -47, -45, -191, -42, 32, 104, -82, 41, -18, -51, -103, -5, -241, -11, -1, -14, 232, 38, 17, -72, -54, -54, 121, -194, -67, 34, -108, -50, -10, -183, -21, -22, 167, 52, -60, -8, 89, -282, -20, 177, -20, 80, -52, -92, 75, 30, 58, 34, -247, -31, 82, 51, 12, 39, 63, -102, 53, -28, 78, -31, -28, 176, -9, -49, 77, 108, 104, -39, -164, 48, 105, 92, -48, -69, 128, 64, 57, 164, 56, 42, -103, -198, 83, -109, -58, -8, -62, 81, 165, -35, 127, -65, 148, 186, 109, 27, -82, 71, -157, -154, -103, 73, 52, -5, -31, 19, -19, 44, -42, -113, -39, 47, 16, 6, -15, -61, -42, 24, -206, -88, -91, 108, -16, 101, 36, -66, -30, -86, 101, -8, 5, 51, 130, 37, -41, 79, 193, 198, 72, -1, 40, 6, -155, 79, -33, 54, -117, -83, -86, -78, 85, 47, 106]
7405A06j15N4R1o4k98N5J21J35q9J14k06K69j26Lq0J4J1k4K22k65J74Mk2k36J23
7430b9K37p3k8m0r5m8n5L35k74L13k41j98J77l4n9L2K32j84J6n3J77m2Olj77N5
7456e3k2K25j63R6K1j15K3O4k61J99j3m0q2J43M7L4j43L0J1k5K79j83k2j03m2
7481i5j09Q5K58j47j21J03N3K1k2O5q7p9J2J22j45oO6L3J44r0Q9r5kJ60j30l0
7507E3JK9j84J39J02j64j14K36j2j05M2j5m0j52J52K3p9J8J50K2l9L9K3Jn9j4
7533E3M6q5N2j29J39k36P5J2J62n9j7O5n4n7J51j45j3p0l3J26J23q5j44J58J13
7558A48r0QJ03j07R9j58K6j19L49j15j27j18J80o0P7j06L3J2j5r9p1J2P0O8LJ23
7584A26k37O1n5K04J26k99L6O9pqQ6k90J91r3K16k05N9n9K2K02k53J07qm7Q8j7
$$ y = [106, -9, 45, 136, 72, -226, -171, -50, 85, -4, 110, -96, 173, 47, 50, -30, -16, -5, -29, 193, -72, 102, 106, 84, -152, -29, 208, 135, 107, 67, -28, -76, -131, 204, -70, 243, 2, -196, -19, -53, -112, -80, 152, -32, -16, -69, 108, 66, 72, 69, -108, -53, -75, 150, -13, 83, 104, -11, 12, 76, -185, 14, 1, -39, -121, 22, 69, 103, -40, -10, 1, -24, 255, 72, 50, -53, -95, -204, -119, 139, -8, -129, -26, 27, 48, 26, 91, 4, -75, -63, 59, -86, -92, -26, 7, 151, 61, 150, 55, 53, 213, 83, 53, 54, 83, -101, 38, 140, -24, -138, 98, 86, -19, 23, 8, -32, -184, -32, -9, -88, -70, 80, 102, 63, 102, 125, 126, 67, 53, 99, 14, 66, -63, 76, -160, -85, -73, 89, 30, 13, 78, 24, -33, 118, -27, -40, -110, -143, -17, 106, 21, -123, 35, 148, 58, 66, 169, 62, 161, 3, 29, -90, 259, 144, 17, -101, 79, 19, 96, -10, 23, 35, 20, -79, -150, -138, -68, 0, 3, 126, -111, -50, -105, 99, 225, -74, -38, 31, 24, 16, 102, -188, 3, -90, 126, -79, -20, -79, -57, 145, -108, -1, -9, -56, 32, 15]
7610A5K9m0J8J19k00R3j52R2p2J04l7J42k32M1j14K06k8M7j73K64q9m8O2K18k93
7635b8q7R0r4Q2j16J62N8q3L1J03l1q5q1m7O2N5N7k51K28J1J44j68L8j82K81k6
7661A23k37K83k31k0J69k29N5J30m8l7J11j64O9P2J1L1j70K78l95K54j5J4p1J69
7685A52M3M6r6j57k7l0L0J35m0j51J56k62J85K5M0p2J1J2J40j63l2p5R4N5N3j61
7711h9J71m7j22k9J52Ml3o6%p3J75N0j46nJ10L1k71J24R7j14K94k26m4PP8o0l3
7738f5j68k5M13j9j16N8%J85j19k06K12j67n3O9O2p3j65P4J96j71M6j12J42m2
7762d4L01m06K32k00M9Q0J70k50J48l6o9J1J9J18j29k2o9K46k14J80q1j33R0L1
7786B2pr9J8J52Nj74Q1N0N8J53l06J16o4R5j71N5m4k0J4Q9j9O3j16J27j2r5o0
$$ y = [15, 44, 4, 22, 141, -59, 34, -118, -26, -98, 6, -31, 111, -121, -80, -194, 12, -16, 31, -142, 122, 33, -15, 47, 265, -28, -115, -25, -119, -37, -153, 9, 67, -16, 15, 118, 87, 2, -79, -126, -64, -9, 48, -203, 25, 36, 180, 12, 50, -132, 149, 123, -114, 169, -62, -82, 87, -142, -87, 43, -5, -42, 69, -95, -26, 46, 57, 88, -82, 196, -199, 55, 40, 54, -17, 152, 195, 241, 145, -12, -39, -69, -39, 96, 56, -95, 61, -201, -16, 9, 49, -23, -12, 0, 140, -23, -55, -130, -36, 19, 72, -89, 82, 35, -87, -116, 36, 40, 7, -59, -59, -132, 43, 93, -53, -58, 52, 83, -188, -64, 33, -81, 213, -13, -57, -50, 28, -32, -65, -233, -258, 155, 136, 20, 78, 78, 263, 144, -62, 150, -17, -70, -1, 61, -12, -177, -103, 93, -78, -32, -144, -2, -44, 257, -149, 83, -117, -68, 12, 182, -68, 80, 44, -25, -14, 5, 123, -6, -28, -97, 149, -65, 115, 34, -99, -9, 22, 15, -84, -66, 86, 91, -83, -2, 48, 106, 259, -47, 69, 5, 100, -71, -16, -60, -80, -66, 23, 4, 67, -49, 78, 66, -29, -89]
7813h9J5J14l3m9j45J55k3J67j61p9J91j81L4l3k8J16J11Kj16l7J04J15k57K62
7837A55r2j4J17k06P7k71L18n9J47l23K66m0k41J28Q9j95J89J12p6n0n5o4J90
7860A02j70Q7K8r8J61k76J66K36k09m7J06k72j25M13M6k30N6j13J56n8K7P3p7
7883a8M5l32L38J7Q5l33J92N5n1J09j1j17Lk2J16K3o1J1j40P5k4o1n6K27p7k2
7909b9j02J08J73Jr1M9j30J43j35J3l9j54J77nJ22r1j2M5j04J4P6J6j7o4n0L6
7935e0K74k96R9m0q8N3J51k34J05J06j60J60J16k86J00Q9j16l0L7n7J27j8o4j6
7959c8R2M1j84J04J50j76j6K2J25j17j81N8J93k1J56l80R9n6L2q7J07O0l6J75
7983A22k53K15q9Rj85K28j09PL29k52J09j16j37J68j61K9J12J29N7j97j27J38
$$ y = [-89, -74, 40, 7, -42, -187, -32, -55, 112, -49, -128, 63, -118, -84, -117, -145, -29, 82, 84, -32, -69, 35, 150, -107, 155, 63, 49, 166, -40, 37, -234, 84, 25, 172, -151, 115, 75, -166, -38, 51, -144, 45, 157, 81, 31, -24, -88, 102, -68, 19, 47, -51, 110, -166, 0, 236, 27, -20, 86, -186, -311, 102, 148, -82, -26, -139, 17, -41, -14, 59, -18, 27, -305, 33, 50, 135, -198, -6, 49, -2, 107, 96, -21, -18, -40, 76, 99, 38, 49, -91, -16, -40, -101, -157, 70, -7, -29, -131, -23, 150, 151, 60, 109, -21, 122, -13, 0, -39, -193, -16, -21, 101, 10, -2, 43, -61, -47, 29, 45, 28, -36, -86, -50, 224, -72, 27, -13, -101, -48, 103, -131, -26, 80, -80, 80, 196, -90, 10, 99, -17, -47, -10, -67, 60, 42, -22, -38, 54, 95, -89, 15, 165, -11, -27, -5, 120, 3, -178, -120, 73, 52, 208, -172, -73, -129, -97, -184, -77, -17, -53, 122, -131, 84, -5, 4, -181, 47, -62, -55, 274, 22, 131, 15, -122, 46, -115, -86, 26, 155, 212, 15, -112, 26]
8005B6J63j67R8j47Q1l9n7Ok5L5j77N7N4N3J61o3O8p4M6k33K40R8k24J59q7j46
8031i4k2R5jp5J56J39k52J82l4j31j4K9R9o8J6l2m1J05r7J48o9m9j36J34j32K2
8057a22J64O3r3k5J41j21Rj2p8N7qp6K40k85k3K21K8j95k3J15n3k8J2J47j49N8
8083c6oO5n1J19J0l02J20R2N4j59M0K07M1j76J12j10j9m1p3Q9L4k9K77m50J75
8108a7J04j14J27q3j07J18o7M9o5J16P5k7k20J17R7k59J32o4J20k08J38J15k0
8131E7J04q0j57J76J16j72P5k50K20p7p3Q3p8R9mnj12J90j01L5j07L1K83k10N2
8156I5n5J04l12J75p8Q9n4J16j48L91k53j69K06k21J35m6k1j9J99Pj44j0L1l4
8180a6Q0J56l97J24L7j93R7l0p0J23J20
$$ y = [26, 189, 22, 120, -27, 54, 15, -42, -36, -61, -26, -203, -146, -92, -39, 122, 59, 127, 53, 99, -134, 106, 204, -20, 139, 52, -94, -116, -21, -22, -97, 59, 198, -54, 128, 94, -37, -51, -22, 77, 9, 25, -7, -48, 57, -40, 108, 39, -10, -146, -12, -144, -122, 42, 105, 12, -13, 128, 7, 16, 4, -74, -17, -25, -101, 139, -146, -169, 52, 80, -115, -138, -23, -76, -104, -92, 55, -94, -36, -42, 23, -28, 91, 101, -201, -81, 11, 65, -94, -54, 153, 194, 18, 130, 20, 1, -40, -113, -24, 10, -19, 258, -192, -17, 87, -27, 100, 17, -90, 28, -39, 10, -55, 61, 136, 109, -111, 6, 103, -156, -24, -88, 32, -176, -38, 77, 57, 161, 81, -76, 100, 216, 44, 119, -131, 89, 12, -61, 22, -56, 43, 39, 34, -78, 112, 11, 46, -61, -30, 253, 43, 95, 40, 144, -168, 7, -71, 18, -36, 80, -68, 323, 70, -99, 107, -114, 21, -25, -46, -65, 134, 141, -3, -13, 18, -16, 64, 220, -177, -53, -16, -209, -112, -142, -212, -89, 31]
8191C1
$$ Imaginary data points
##PAGE= N=2
##DATA TABLE= (X++(I..I)), XYDATA
0@%%%%%%%%%qJ6j6J6j6K3l1L2m0M8n6O5p3Q8j04J20j36J53j77K01k26K58k90L22
33A69l60M06m52N00n57O17o83P60q40R28j028J139j264J403j560J742j953K197
51A164k489K847l291L865m639N740p454J0508j7595O5053K3449j17754j4923K3393
65c2126L0817M1811L7562o6973q7887J6400Q6877K7409j7747k6304m5359l2851
77f8371N7543Q1069j0664p4396l3391Q499K6459N0434L0210n3629p3872L019N6214
90h76L7646Q538k3549n7492k9741M7138O2042L330l7708l7306k1726K1041N9642
103C0979K5879m3417n0747o493K3793L7609L2902j8547o3553k6847L9695M4349
115B5602J3364r735l7766m5027J2740O4843K9078l0739l6278j9153l464L6496
$$ y = [0, 0, 0, 0, 0, 0, 0, 0, 0, 0, -8, 8, -8, 8, -8, 15, -16, 16, -24, 24, -32, 33, -40, 48, -56, 64, -72, 81, -96, 105, -121, 137, -153, 169, -191, 215, -237, 263, -294, 323, -360, 400, -440, 488, -540, 599, -665, 738, -822, 920, -1033, 1164, -1325, 1522, -1769, 2096, -2543, 3197, -4257, 6251, -11344, 53709, 77158, -40596, -55519, -32126, -1309, 40502, 78064, 11091, -76796, -60396, 26481, 53890, 36143, 9839, -35520, -68371, -10828, 70241, 59577, -14819, -48210, -39711, -13252, 37182, 67392, 13763, -60109, -57090, -876, 36770, 45308, 21759, -35733, -65474, -18336, 43706, 47036, 9328, -27978, -49704, -28663, 30979, 56858, 13441, -37306, -43799, -20006, 17603, 50505, 31958, -31595, -58442, -18747, 25602, 38966, 29231, -8535, -53562, -40822, 24021, 53099, 22360, -13918, -33071, -36535, -39]
127c9N1952q360o1434k8410K3247L0014K5154J0856l7649n5584O536N8584K9851
140D4718j4955k6499l2589j8438L8497N9037k606n2943l0044M935J9622L8115
152B6850K4637l7313n7956O12M5043K7668L287j5323m2172k7376L7543N5701L94
165D1595l8594k7657j1488J2601M6624L0122l5662n4023m286L0269K7096J9610
177C6207p980m8175l2452L2256M8810O648k1303k5261k5944M688M9515L1647k9705
190A8951m3005r556J3387K5467L2278k790m9496l2269K4744L7861J3805l856k4723
203G98l7762n10M7415L1487j8731l1012j6397l720K3075M0604K290m4605k9213
216c6281J4073K5145J9764J0321k3528m3170l369M1593K7576p234j9544k4373
$$ y = [-39, 51913, 43553, -17881, -46291, -23044, 6970, 32124, 42980, 5331, -50253, -43717, 14867, 44718, 29763, 3264, -29325, -47763, -9266, 49771, 47165, -5778, -35822, -30887, -11265, 26850, 51487, 14174, -43782, -43170, 1873, 29541, 32828, 17505, -24667, -52043, -14500, 41201, 41595, 3001, -24656, -36144, -23543, 23081, 53203, 17541, -36482, -40768, -10499, 16597, 36207, 28227, -19948, -52400, -20144, 28666, 35314, 14011, -11250, -37194, -32506, 17009, 48656, 18951, -24054, -33610, -20223, 5244, 37522, 34732, -14764, -47033, -22289, 15572, 29377, 25521, 798, -36964, -37474, 9941, 41428, 22697, -8315, -24712, -28432, -5357, 35247, 37537, -7068, -36281, -22208, 2937, 22701, 33022, 9494, -33676, -37045, 4548, 32124, 24890, 5346, -19027]
228a9027j5733K2620M3917N355l5978k5957Q63J3880K6621K0449k1824m3127o318
241c4259L1159K3621M688r896k9664k3577K1673M1743P055k5223k2473j1423N809
254b0767L2195K6399k0048l9203q798J8319K0007J7240j861l3229k7393J8075
266a9064L5187R389j2020j8216k1517j019L4359K7661j6182l1888j0476N759J6745
279a282K6345L934l3825k8019J3119K7128J2338P09j4985k9231o218L2447K6778
292B9238r619k2256j3749n417J4110L1291O862l0386k5452O224J8512J5949R958
305B5265j3908l2570q274K7843K3734j658j3733j8132j4580J3245L2397R118k4163
318D584k1267k532Q892J9992J7579j3023l2385q762K0448J9523O434n659k1707
$$ y = [-19027, -34760, -12140, 31777, 37132, 1154, -24803, -23940, -10060, 16561, 37010, 15186, -27941, -34259, -3100, 20521, 25209, 15313, -14351, -37928, -16255, 25488, 32543, 7320, -15153, -26576, -20767, 11428, 37827, 17779, -21424, -30222, -11903, 8104, 25344, 23483, -9746, -37139, -19064, 16123, 25512, 13492, -4724, -26241, -27260, 7099, 34760, 18578, -13310, -23786, -18027, -1282, 25063, 28997, -4828, -32847, -19728, 7400, 19738, 20447, 5462, -23769, -29987, 2460, 29238, 19619, -2637, -16386, -21803, -7693, 23598, 30460, 74, -25378, -19154, -642, 15307, 25265, 11357, -21213, -29487, -1644, 22090, 20432, 6699, -11433, -26013, -12768, 19629, 28747, 4584, -16683, -19215, -10323, 9669, 27248, 14225, -18160, -26922, -6474, 13049, 19483, 13824, -7883]
331g883k0478J2091L1480R430j6212j7403j0496J313K2967K2210j0767k9466r351
344b2565J1539J4950J3988J453k3496k2615R778K6540R829o981j3668j7506l207
357b1961K4021K3052q285k3266j0859K465J1997K0856N370k3678k2436O263J9729
370C268J1076K528j0738k2737o703K3164K1211m748j6105j1896o497J0179K4838
383A6840P559k2089k0550K290J2582J3223J0417r189k5962q787J9899J8954N67
396A5754q901j3845j3294P833K5744R152j7259j7232l315N787J5173J5377p600
409A3374k5660r453J4567J5789O208k479j6508j7493O815K4603R492j0990j3487
422e222r575k83J6912J8879o500k2392r073P487J1476J2139K878j7945j9497O044
$$ y = [-7883, -28361, -16270, 15210, 24640, 8428, -8975, -19471, -18158, 4809, 27019, 16252, -13214, -22565, -11026, 3924, 17912, 19365, -4131, -26746, -16968, 9572, 19401, 12420, -1248, -18754, -21961, 2060, 25112, 16827, -6439, -17298, -14833, -2836, 18020, 23390, -288, -22724, -16461, 3268, 14344, 16872, 6134, -16603, -23306, -142, 21069, 16321, 216, -11680, -18177, -7998, 16840, 24399, 2310, -18240, -15950, -3368, 9855, 20272, 11083, -14879, -23666, -3767, 15187, 15754, 6853, -6992, -20286, -12453, 13291, 22443, 5184, -12048, -15363, -9576, 5597, 20974, 13374, -12286, -21739, -7172, 8617, 14825, 12346, -4162, -21655, -14840, 9763, 19255, 8265, -5222, -14797, -15080, 1832, 20711, 14211, -8181, -17254, -9767, 1709, 13848, 16726, -1219, -20716, -14672]
436a4672K0881R192m190j0157j4891m904J8603K0270n217j8499r348L91Q521J7149
450A3129O729j8050j9576L608J5697R283K782o782j8760p967J7601J8829k449
463A4074j2821r997o107O386K0181Q971j6714j7910K01R853J0672Q972n239k0668
477a0146r477J4789J6120J656o559j0945j1635M748K0704R454j3055j4741l593
490a2680M159J1624J3630m422k0570r584J0613J3326N904j090j2651j5235L788
503a3188J9676R238p903j1112q173j480J3186J6102l442j8463q889N568R590J0124
517A0834L482j3644j7315L441J6874R063k540q089j2568n670J4087J7525j997
530A3483j4811q680p68O205J4481O882j3735j7085J332J2580Q619L406n349j5661
$$ y = [-14672, 6209, 15401, 11211, 1054, -13837, -18741, -138, 20132, 14915, -3584, -12932, -12541, -4020, 13129, 19858, 1808, -17768, -14160, 1537, 10820, 13602, 6820, -11940, -19907, -2306, 16523, 14074, 1253, -8744, -14851, -8465, 11716, 20687, 3973, -13937, -13736, -3883, 6789, 15761, 10522, -10146, -19623, -4834, 11286, 12942, 6383, -4562, -16197, -11449, 9255, 18709, 5654, -9087, -12680, -8521, 3103, 16733, 12311, -8259, -17843, -7230, 6096, 12000, 10910, -1741, -16976, -13188, 6488, 15726, 7823, -3289, -11462, -12942, 244, 16346, 12904, -5559, -14448, -8880, 710, 10834, 14316, 672, -16643, -13202, 3672, 12735, 10195, 2106, -10462, -16132, -2045, 15480, 13483, -1328, -10008, -10776, -4571, 9910, 16792, 3057, -14028, -12696, -116, 8503, 11909, 6560, -9101]
544i101p964J3343J6594l21j0116q867o092M037J6984R066j2547j5668j336P544
558d444Q885Q952l329j7433r358J1007J4178K580m777r326j0647K709J7549R324
572A5870r861j2949l959K411R843J2506j930j7815r551Q029J1260N784N53j0163
586B8j4332J649J6856R181n873r048p692k566J0369J5018j215j5513q888L569
600h457P937R149M397j0533j5755O43J3993R067r00o307j1003o229J0423J6068
614A2493J4j2403q406j120M538J2063P510j0134j5692m80J0309Q094L575l363
628F998j3466q447J0001J4928J365q116q054o048K333J4189R313r270j4116k178
642a0568N755P599P974j005j4726r758Q649J2382L037l301p423r951N15J4932
$$ y = [-9101, -17065, -3722, 12872, 12551, 2435, -6432, -12524, -8487, 8497, 17563, 5016, -10652, -11988, -4444, 4441, 13393, 10064, -7369, -16727, -5720, 8458, 11038, 6261, -3065, -13712, -11003, 6546, 15870, 6009, -6940, -10899, -8488, 1355, 13861, 11931, -5884, -15435, -7406, 3854, 9638, 10191, 28, -14304, -12655, 4201, 13382, 7509, -1539, -9231, -11797, -1428, 13590, 12375, -3138, -12026, -8457, -520, 8629, 13026, 2493, -13262, -12619, 1374, 10441, 9541, 3234, -7769, -13998, -3575, 12493, 12507, 104, -8302, -9422, -4884, 7179, 14689, 4555, -11137, -11617, -1308, 6786, 10361, 6998, -6468, -14915, -4914, 10014, 11379, 3263, -4791, -10839, -8506, 5683, 14996, 5726, -8390, -10568, -4813, 2786, 10760, 9755, -4971, -14729, -6080, 6302, 9339, 6038, -1385, -11336, -10821, 4111]
656D111R693p328j1329m031R01P792J1312K95j4349r746N291R849N395J238p427
671A667j2500q14J3389R725l862q153o658k878P434J3118J354j2506r041J769
685g956O522Q056M540p152j3632k178J1115Q991M32n100r297o111O980J3401K611
700A1222r336q401k575M182R937P206p029j2996k877P719P958M235k328j1159
714d242q506O946J2904K786n433p509o394J125J1886Q921o244j1830l453L446
728e597O984P748P7j2330r057N752J0677L840j655o295r478q64J2304R342m785
743F663r273m644l06N952J0398J750j1842r162L575P861N300J961n621j1049k159
758a0596J0892Q776j983o578n830l467N253J1515K534r858q362O74M809O829M997
$$ y = [4111, 13804, 6476, -4853, -8884, -7983, -191, 11121, 11416, -2933, -12679, -7388, 2461, 7856, 9094, 1667, -10833, -11647, 1742, 11467, 7605, -548, -7206, -10084, -2650, 10468, 11822, -684, -9725, -7956, -1434, 6622, 11162, 4010, -9622, -11800, -685, 8306, 8738, 3638, -5659, -11770, -4790, 8611, 11222, 1886, -6515, -9090, -4908, 5029, 12235, 5206, -7790, -10667, -2948, 5010, 9245, 6917, -4242, -12748, -5802, 7102, 9888, 4455, -3054, -9448, -8323, 3563, 12484, 6240, -5590, -9043, -5597, 1387, 9135, 9212, -3118, -12175, -6423, 4254, 8094, 6439, 144, -9334, -10198, 2106, 11448, 6663, -2610, -7254, -7560, -1608, 8790, 10540, -1302, -10464, -6889, 972, 6272, 8233, 2612, -8437, -10596, 296, 9072, 7089, 511, -5319, -8786, -3533, 7982, 10516, 658, -7704, -7030, -2221, 4608, 9605]
773I605n229j1573l056Q802P763Q13l301p483o439N062J1679L145p415p027k619
788g273K074Q190P175m489j1567l135N710O760L876q32q690q019M107J0770L861
803H518m264n877n384o84R107Q574l649j0081l743K411N441O495J370r212q369
818i347K675R004M310q42m829p779j821Q811Q643k253p661m783q14M593Q623K373
834H903q608q194J479O327N016K204m147r281k735Q056P984l91m909n637l723
849g656L622R715L397p396p416m11L126O342M888l634r735l705O723O548K009
864F417k469o225o187L195R903L678n374o066k708R15O381O995k867r474l652
879g538L996N617L679J77o759p547K357Q854M025k920m739m881j088O812P987
$$ y = [9605, 4376, -7197, -10253, -1451, 6312, 7125, 3824, -3659, -10098, -5036, 6643, 9788, 2373, -4654, -7273, -5199, 2991, 10166, 5677, -5890, -9025, -3315, 3445, 7321, 6489, -2201, -10220, -6113, 4657, 8518, 4254, -1623, -7007, -7691, 1416, 9990, 6341, -3740, -7483, -5072, 369, 6864, 8234, -978, -9347, -6672, 2332, 6642, 5800, 971, -6808, -8629, 182, 8825, 6572, -1089, -5872, -6686, -2093, 6530, 8903, 295, -7899, -6420, -93, 4923, 7127, 2980, -6301, -9036, -980, 7004, 6613, 1704, -3933, -7656, -4034, 5681, 9078, 1682, -5734, -6145, -3019, 3323, 8211, 4577, -5158, -8863, -2140, 4408, 6417, 3948, -2277, -8464, -5269, 4634, 8312, 2938, -3128, -5836, -4921, 1460, 8455, 5588, -3886, -7538, -3542, 2075, 5754, 5931, -828, -8375, -6018, 2836, 6861, 3941, -798, -5679, -6767, 45, 8032]
894H032j869q464l967J760M027N823K041p128p673J320P215M212j36l738o648
909e193k504O833P750r36o145m390j203L429P174K991o686p248M28M924M535K272
925F031k837p830l038N938P273J70l693m826l816K871Q185L175n345o358j379
940e479K660M810M962k299q197l665M783N521K232j563m976n762K022Q129L772
955F950m091m912l041L84N317O257j839p694l657K831M609L554O17n454o546J364
971e351P307L807k060m108m246j264N545O692q47o752l744Q75L305N062J912n365
987G68o696N10N967L871j2k823n573k549N532O529k55m839l873j580K471O225
1003C673L119n304o316n9L684L854K647k169o582l169M831N753O69k738l705l504
$$ y = [8032, 6163, -2301, -6268, -4508, -481, 5342, 7383, 255, -7418, -6098, 1117, 5329, 5193, 1455, -5193, -7697, -864, 6886, 5950, -195, -4585, -5788, -2359, 4815, 7806, 1120, -6128, -5700, -776, 3759, 6031, 3194, -4636, -7674, -1736, 5537, 5707, 2014, -2812, -6628, -3757, 4428, 7603, 2258, -4100, -5479, -2819, 1991, 6953, 4654, -3543, -7208, -2425, 3096, 5328, 3765, -1211, -6973, -4951, 3178, 6950, 2859, -2053, -5094, -4710, 607, 6864, 5025, -2669, -6326, -3495, 1114, 4668, 5285, -169, -6715, -5351, 1956, 5763, 3703, -405, -4651, -5915, -370, 6322, 5475, -1277, -5021, -4146, -841, 4221, 6133, 768, -5928, -5418, 549, 4420, 4408, 1585, -3988, -6537, -1005, 5524, 5269, 430, -3443, -5023, -2552, 3673, 6792, 1488, -4828, -4887, -1203, 2651, 5298, 3129, -3453, -6622, -1791, 3962, 4631, 1893, -1812, -5316]
1019e316J510O892L321m095n547j246J725L835M397r76o941l733L385M978K094
1034D283p52m198m681O18O653L789k609m547k739N1L940N435l67o319l633J552
1050c524L892L424J146m500n639K9N887L998r24l229m309j504M230N928K45n499
1066c49l665k4K719M712K404m415o222j22M669L838N05j911n112k867M089O049
1082D298N84m038l555j658J587N641L102m138n683r09L252L833K357j475n698
1097b500l398L668N609J142k347l587l276R41N871L370l027m805j804J224L802
1112H83L948r80n602l618K912M249J910m09l498m392N71N400L496j962l775k511
1128c378m67L248N131J32n471l496J195L077L048J347l374n353l14M913L610o99
$$ y = [-5316, -3806, 3086, 6407, 2312, -3235, -4481, -2756, 1079, 5476, 4500, -2441, -6174, -2789, 2189, 4283, 3531, -667, -5348, -4730, 1923, 5712, 3103, -1444, -4183, -4132, -192, 5243, 4876, -1443, -5076, -3524, 368, 3792, 4938, 438, -5201, -5172, 715, 4713, 3789, 560, -3749, -5253, -1023, 4905, 5150, -349, -4014, -4038, -1319, 3393, 5797, 1382, -4840, -4962, -293, 3545, 4050, 2139, -2973, -5840, -1751, 4298, 4882, 844, -2711, -4369, -2782, 2859, 5961, 1823, -3860, -4769, -1517, 2316, 4673, 3198, -2500, -5898, -2230, 3379, 4521, 2174, -1413, -4689, -3748, 2123, 5493, 2466, -2339, -4143, -2919, 883, 4831, 3851, -1751, -5369, -2457, 1792, 3702, 3293, -205, -4597, -4026, 1374, 4870, 2908, -867, -3378, -3845, -597, 4534, 4666, -805, -4301, -3106, -29, 3019, 4366, 992, -4361, -4675, 238, 3848, 3149]
1144C149k307l530j917L244N422N53m326l276m85K019L788K476k977n393j088
1159d648L882L471R82j391m134l330K835N627J046k977l188j814J037M505L333
1174E236k765n120j476K148L356K450o48m576l638K475M665J763j599l154k933
1189c816J60M810L930k248m484j934O40L193L649J79n078l606J653L783K417R0
1205C338k845m482j95M559L866j233l453k523o69K665M687O20m484l503L97K823
1221d32L077J298k547m768j070M150L401m1k171l010k199K569M883J079l664l167
1237b612o01J735L233K599k356m970j019K786L343J104o82l839l300K152M948
1252B521J402k360k911k104N66M157L220j945m450j698J636K760K621n3l833l957
$$ y = [3149, 842, -2688, -4605, -1361, 4061, 4614, 288, -2988, -3473, -1454, 2334, 4810, 1833, -3560, -4648, -766, 2705, 3687, 2296, -1838, -5168, -2333, 3294, 4340, 1363, -1825, -3639, -2602, 1903, 5236, 2471, -2649, -4125, -1977, 1379, 3829, 3181, -1395, -5033, -2558, 2107, 3870, 2271, -883, -3816, -3656, 1154, 5084, 2836, -1648, -3582, -2942, 251, 3900, 4079, -999, -4605, -2952, 831, 3248, 3338, 493, -3989, -4184, 375, 4241, 3008, -445, -2968, -3637, -972, 3715, 4335, -149, -3652, -3255, -432, 2645, 3943, 1396, -3372, -4442, -292, 3109, 3068, 897, -2113, -4312, -1743, 3140, 4219, 555, -2612, -3213, -1478, 1755, 4354, 1998, -2972, -3991, -1205, 2138, 3242, 2560, -1279, -4579, -2427, 2521, 3923, 1563, -1348, -3452, -2886, 1271, 4491, 2546, -1904, -3602, -1966, 794, 3415, 3362, -471, -4428]
1268d428J710M193J908r05k649l108l71M101L711j408l873j784J15K448L504O26
1284C790l942l288N30L416J996O49k237l986r01L699L804m20k992k243j127J779
1300a473M371J121l563l404J74J833K680J811j901m217j398L304L220M92j576
1315A474k954k250J569M486J488k734l047j000J093L097K510j331m161j982K263
1330a479K940J286m57l008l066J277M087J927j785k487j873j80L194L455j144
1345B687l837j983J117K320K214O29l268l594R39L413K032m36j905k846r71L298
1361a91L565m48l166k114l3J655L118J122l049l557K23K734K287Q87j851l410
1377b228j188K644L491M7k128k284j377J430L611J723k676l442n18J917K067K086
$$ y = [-4428, -2718, 1475, 3383, 2478, -171, -3279, -3650, 451, 4162, 2754, -1119, -2903, -2788, -340, 3164, 3790, -152, -3440, -2910, 506, 2502, 3151, 914, -3072, -3973, -274, 3530, 3110, 118, -2125, -3252, -1473, 2898, 4019, 456, -2948, -2774, -941, 1739, 3550, 1649, -2568, -3966, -662, 2558, 3050, 1474, -1480, -3730, -2161, 2325, 3813, 1079, -1968, -2968, -1875, 1222, 3732, 2401, -1760, -3742, -1479, 1461, 2747, 2290, -718, -3784, -2507, 1580, 3507, 1722, -765, -2638, -2818, 376, 3831, 2687, -1150, -3133, -2016, 304, 2518, 3147, -121, -3715, -2776, 637, 2669, 2233, 328, -2518, -3489, -191, 3374, 2926, -240, -2354, -2387, -732, 2386, 3508, 459, -3098, -2875, -141, 2146, 3033, 1182, -2228, -3416, -772, 2719, 2766, 638, -1646, -3023, -1593, 2018, 3741, 1065, -2377, -2895, -978, 1089, 3175]
1393C175j145l792j620K017L078R14j151k193k419Q45L857J759k040k744r18L95
1409a982K511K459n57l570k092J643K261J848k12k366k913O20L159J993r03k301
1425d02j805n16K577K828J8l144k113N68J729K226J149k727k926l1K539K091O9
1442B130j609k382r58J964L151M25k591k054l16J029K952J229j987l381k51K138
1458e11J777J138j041k799j763J996L200M44j437k201j302P01L241J649j598l080
1474a586o85J020J978J795n75k889k375J738K666J025l78j994k329K62L194J584
1490B451r29k307j395M16J770K561l57k648k104Q28K099J476R6j645k561p5K522
1507A98K142o36j757j657m94J746K704K00k544j709N3J243J872J276j888k706
$$ y = [3175, 2030, -1762, -3382, -1365, 1713, 2627, 1476, -717, -3136, -2291, 1566, 3325, 1285, -1459, -2377, -1982, 529, 2988, 2431, -1139, -3231, -1588, 673, 2521, 2309, -57, -2970, -2350, 809, 2802, 1899, -402, -2207, -2723, -146, 2682, 2700, -444, -2557, -1989, -260, 1966, 3115, 388, -2538, -2569, -30, 2061, 2130, 521, -1861, -2819, -855, 2296, 2721, 130, -1924, -2240, -1211, 1741, 2970, 983, -2398, -2649, -511, 1266, 2404, 1363, -1436, -3199, -1203, 1997, 2441, 1004, -1197, -2499, -1798, 1443, 3092, 1494, -1586, -2271, -1251, 727, 2522, 1947, -942, -3317, -1579, 1087, 2112, 1734, -260, -2589, -2327, 867, 2451, 1522, -785, -2180, -1764, 6, 2567, 2210, -438, -2542, -1714, 385, 1861, 1957, 312, -2249, -2324, 198, 2340, 1704, -53, -1710, -2204, -458, 2246, 2446, -98, -1807, -1754, -511, 1361, 2637, 749, -1957]
1523a957n76K101K140J19j073j905j523J728K730N99j735j883p47O60K217J668
1539B563j456k554q64J569J637J148o38k225j723J337K435Q38r17j780j490M66
1555a654K432J493p31k465r98O37J465J803J4k390j875P40K333J080l24j542k001
1572a983j09K337K010o28j891j257k33J528K182P6k068j859L45J497J609L27j363
1589E20k021o04K120J684j53j239j491p16J266K277L93j901j688j4P53J812J170
1606B168j172k369p06J545J580M79o27j741j352J265K256N95j209j545p90N19
1622a104J923J090p96k257r50J240J448J031l65j689j585O44K242Q11n16j523
1638c56j395J52K114J457n74j958r12K33J272J572L24k046j868O28J610J248j87
$$ y = [-1957, -2533, -432, 1708, 1827, 754, -1151, -2674, -946, 1784, 2383, 648, -1235, -1982, -1322, 895, 2563, 1107, -1447, -2311, -742, 895, 2043, 1405, -820, -2543, -1206, 1229, 2067, 1150, -630, -2120, -1654, 778, 2271, 1540, -925, -1923, -1286, 179, 1982, 1996, -394, -2269, -1529, 804, 1884, 1560, 18, -1983, -2092, 245, 2255, 1627, -264, -1521, -1754, -226, 1956, 2032, -36, -1895, -1550, -53, 1556, 1883, 520, -1501, -2105, 15, 1699, 1546, 307, -1184, -1900, -634, 1643, 2036, 135, -1553, -1567, -814, 998, 2168, 996, -1373, -2079, -534, 1046, 1525, 898, -843, -2195, -930, 1326, 1921, 712, -833, -1623, -1104, 819, 1909, 1113, -1144, -2094, -854, 594, 1625, 1260, -429, -2014, -1370, 872, 1683, 1167, -356, -1751, -1599, 515, 1972, 1398, -560, -1472, -1239, 33, 1605, 1929, -117, -1985, -1357, 253, 1501, 1314]
1655A314j077j767j03J454K074l72j755j010k88J022J959N43j800j798j1J317
1671b98J363O17r62j933p89J758J619L0r20j514p02P61K247P14j599j369n29Q59
1689f47J415J012q98j848r49J238J426M89m16j363j267Q27K000O27p85j495p38
1706a372K81J512J214n12j921j018R07J213J080j41j470j378M31J655Q35l32j037
1723e3j179k35J465J655l73j551r16j9J037J541j4j434j391J06J373R89L67r79
1741C89j622l35J296J533o4j180j176l36J164J366O47j342j553q5Q87J118P97
1758A504p89j656q08J362J404L08p82j267p19N67J755Q99j298j425m35P74J213
1775F07R66q09j580n89P54J153P12l14j066j245J56J829R39p31j199o86n6J241
$$ y = [1314, 237, -1530, -1633, -179, 1895, 1523, -232, -1242, -1530, -508, 1451, 1994, 194, -1604, -1615, -298, 1065, 1682, 720, -1213, -2002, -244, 1375, 1405, 485, -1029, -1731, -970, 1277, 1991, 392, -977, -1506, -647, 768, 1780, 882, -966, -1915, -677, 749, 1238, 822, -541, -1808, -981, 1019, 1646, 861, -634, -1372, -1091, 421, 1635, 1123, -798, -1816, -909, 304, 1384, 1243, -227, -1605, -1174, 481, 1316, 984, -53, -1232, -1467, -2, 1653, 1280, -271, -1187, -1206, -169, 1372, 1358, -76, -1467, -1361, 12, 1001, 1368, 389, -1233, -1568, -272, 1261, 1197, 17, -1159, -1495, -331, 1035, 1682, 340, -1213, -1298, -411, 707, 1504, 715, -941, -1749, -387, 1017, 1325, 543, -724, -1443, -876, 879, 1778, 480, -945, -1380, -606, 607, 1573, 764, -816, -1405, -651, 502, 1214, 900, -166, -1411, -1255, 574, 1513, 782, -417, -1103, -1159, 82]
1793H2J487l03j606j063M85J054Q66M02j555j312K93J177J184j63r71j035m39
1810a417J373J402qj457j083Q8Q47J249O32j329j608J9J073J184K24p05j468m05
1828a389R28J472J56q47j041n77O65J538P75j225j475l51R46R08P80m55j620p68
1846a580J017J316M93p24j016r03M38J635Q07p30j529l89N41P91J190j91j605
1863d39j041O85J176O76q3j119j049Q0J273J057m16j063p69K0R65J371l03j147
1881a26j005K24Q73R83L66j088j788L37J228J044j80o98j145l65J059J426L9j145
1899C9r34k79Q17J106P21j020j419k13Q57J096M55n92j133p51P09J600J50q22
1917C87r42m73J89J498P47q56j106o75O81R00N63j05j249q45N66J340N23n38p49
$$ y = [82, 1569, 1266, -340, -1403, -918, 136, 1002, 1404, -151, -1463, -1170, 7, 1191, 1028, 57, -978, -1417, -44, 1358, 1350, -107, -1190, -1102, -255, 994, 1626, 297, -1311, -1292, -219, 965, 1189, 484, -984, -1389, -461, 1011, 1167, 320, -721, -1298, -633, 905, 1680, 455, -1020, -1371, -425, 483, 1263, 808, -812, -1580, -563, 753, 1246, 522, -494, -1397, -959, 676, 1483, 753, -776, -1165, -624, 167, 1357, 1166, -439, -1480, -795, 381, 1057, 974, -145, -1194, -1114, 159, 1216, 800, -263, -1032, -1012, -47, 1324, 1021, -126, -1131, -907, -34, 949, 1315, 227, -1561, -1224, 4, 1048, 868, 170, -975, -1340, -281, 1145, 1184, 39, -895, -1174, -357, 749, 1470, 450, -969, -1182, -325, 771, 1226, 634, -499, -1250, -541, 1059, 1209, 387, -555, -1028, -839, 659, 1406, 550, -556, -1231, -550, 350, 913, 808, -441, -1286, -720, 620, 1143, 605, -144]
1936a44j110K22J376Q04k98j018p78PJ068R63r5j159r43K02J099N74J07r07q65
1955h95k13J367Q98l09r05p88j11N20J508J13j026j227K21O61Q37N99q32j282
1973h64l70J046J064K94p26j062m33P34J275J99p60j038l59N67J057O42p62j221
1991g17m74P86J004M18l34j172n71L40J229N72m76j069n96K28J074J024n85j319
2009f38l58N84L16J081j08j130q67M38J100N61j31j008q18l5J058J061m19q20
2027a33p77K28N20R28J35q64r24M5P13R61J57p32j017j31P09Q68K89o48q59l94
2047i26N58Q92M38n08j088l25Q16N47O60n65j181l71P79P71L56l95p14n47K23
2066e80J176N41q49q37j44M0J052N60l92j059n84O01O76O15m03o00n93p0J169
$$ y = [-144, -1254, -1032, 344, 1148, 850, -168, -946, -939, 129, 1092, 997, -162, -1105, -903, 196, 770, 877, -30, -895, -1108, 259, 1157, 848, -57, -845, -956, -436, 1072, 1185, 159, -1068, -847, -186, 651, 1250, 418, -864, -1234, -188, 876, 1170, 444, -618, -1051, -317, 958, 1157, 397, -641, -1000, -433, 624, 1266, 504, -717, -1191, -405, 599, 1017, 683, -489, -1060, -720, 509, 1081, 605, -464, -1060, -832, 242, 1266, 681, -638, -996, -412, -96, 985, 877, -253, -1120, -682, 418, 979, 848, -160, -978, -1013, 45, 1106, 687, -133, -910, -682, -162, 766, 901, 37, -887, -842, -129, 832, 989, 257, -760, -891, -182, 686, 975, 327, -532, -926, -368, 524, 962, 454, -634, -959, -143, 404, 1064, 499, -682, -1053, -274, 497, 853, 458, -256, -803, -580, 596, 1137, 288, -549, -693, -653, 399, 959, 567, -492, -1076, -475, 201, 816, 413, -187, -780, -850, 319]
2085C19N59k05q19p15L49N43R82m51q21n00K54O50N30J55o92r34R6O65O50j1o40
2106c6m96m04P61R03J15p35q99J13M66R07K10q97p44j3P36N05M35l80j117k82
2126h52N76N67M02l69q52k49M36R65K19n06p40j19J57P43M04l34p76m09M65O01
2146C29K07L2q90m61K36P98M19k43o82m80L96M67O39k42q73k82L22L99N87J2p20
2167c0p14l6J080K78k85m06n87K85Q5R28J9p82n81K63M21M35K41n97m68k66O95
2188b2M73J15m52n05m00P06N52K17l82p41j44M26M85L44m76o53j17L04N92L62
2208F84l23p36m68M68P45P4k00m70k53L7Q75J14n3p35k41rN44L34l9o47o87P28
2230b58N44J32j96j40o40M8P14L27m8m76m49P1L63O20j37p64k56K59K82K78K66
$$ y = [319, 878, 673, -146, -861, -512, 31, 1013, 562, -259, -759, -505, 145, 675, 830, 138, -796, -700, -35, 615, 604, -36, -532, -936, -175, 728, 843, 108, -791, -678, -212, 695, 905, 8, -736, -749, -13, 492, 927, 547, -570, -852, -276, 291, 693, 324, -528, -777, -341, 624, 843, 337, -403, -522, -365, 378, 782, 448, -328, -737, -272, 329, 536, 568, -322, -783, -547, 251, 670, 427, -255, -735, -339, 128, 767, 525, -348, -630, -308, 91, 678, 690, -30, -744, -780, 300, 578, 293, -113, -700, -415, -330, 598, 617, -165, -746, -483, -62, 373, 614, 17, -451, -717, -22, 451, 566, 114, -391, -791, -85, 467, 684, 302, -439, -583, -157, 328, 672, 196, -457, -574, -270, 322, 684, 361, -375, -843, -375, 370, 444, 244, -226, -479, -442, 433, 547, 494, -241, -482, -491, 53, 387, 348, -299, -986, -258, 286, 418, 222, 82, -558, -510, 204, 531, 483, 7, -442, -371, -8, 612, 475, -289, -545, -286, -4, 274, 540]
2251E40l65q20K30M25L31N3n21k44j49M69O27J29q82j67k0K18M41k1K8p10j39
2272e47O63K56j53J67p31k57K40P83M5n17j58l59L29O49J89l82l58l67K95M45
2292B32N7O0o85j41L02L93K32k56m49j29j4N24L98l36n14k3J7M29K82k1m98k43
2314c83P5L98K06J03l28m49PM04K70j59r9m77R6K97M46k2n67o5QL11K10nk13m51
2338c87K0K52M34R6l79m81N1K53L21K70m35k61l45M71K46K49j99o05O9J05O14
2359C59m4j89k49m61M98J45K03j01l03l89L78M79M5k70j87m02J16M76L17l59l01
2380b39k34L18L20R6k3k67k44J81K40K73j00m74j23K2M83J54P0n08l11J58P1M38
2402C01rk20m49j21M22L95N7m43k59K23J23P3L02l72j78k78M41K37L8j88m34j51
$$ y = [540, 175, -645, -415, 10, 341, 394, -127, -371, -520, -51, 576, 705, -177, -344, -364, -146, 295, 274, 302, -408, -547, 116, 372, 219, 386, -345, -602, -362, 421, 466, -51, -209, -568, -239, 410, 599, 217, -141, -508, -213, 232, 289, 349, -336, -477, -175, 218, 450, 194, -255, -384, -398, 126, 524, 188, -326, -349, -332, 97, 379, 358, -140, -383, -308, 90, 296, 399, 71, -378, -371, 33, 303, 144, 45, -432, -336, -39, 407, 385, -182, -247, -239, 72, 282, 277, 64, -387, -367, -115, 319, 415, 36, -445, -394, -141, 180, 450, 15, -246, -591, -120, 126, 375, 176, -429, -360, -255, 359, 315, 126, -123, -584, -86, 59, 262, 161, -142, -531, -153, 326, 371, 101, -86, -488, -372, 104, 421, 62, -239, -473, -155, 165, 261, 238, -29, -273, -92, 148, 421, 321, -153, -276, -254, 229, 383, 453, -55, -366, -208, -137, 301, 292, 72, -377, -498, -76, 319, 376, -67, -326, -103, 20, 93, 395, 23, -155, -433, 8, 245, 283, 95, -339, -490]
2424d90M40L08M4j77k78j28K29M48O1m43k91L1nL48M43k80m17m8K30R5J12p0k36
2447g4j96J28L33O5j53k57Pj10M44L30l69k47l42J99L69J18j74k3m97l4O88J09
2469C14j43j77o39J61O33K48j08l53k48OL82K72j64k34k62R6L21R9k0k08j97j04
2491c25K24L12J39k47l94n8J64N17l07Q8l42RK04R5L03q8n95j24L57K37J32j12
2513A89k29k39mM03J03kl33j22K78J05O2J75m55m66L18M26oK23q23J04J29J71
2535GK46k24J6k48l4K92J6P9m2l12j3J04L56O7j84m06P9K8M20n7k21k30J02J41
2559a8K45J24k45k64q4J49K99J6pm20M2P5K78j4j37j27k62L37M48k62j26m8r8
2582i9q6L60O5m6k36k41K5K93J10Q6l09l04J10M91q9O0k01j12M8K48J5l0k90j29
$$ y = [-490, -50, 258, 302, 125, -153, -281, -52, 396, 457, 14, -277, -246, -251, 97, 540, 260, -157, -205, 25, 120, 232, 162, -74, -270, -142, 191, 256, 103, -154, -147, -257, 187, 517, 148, -99, -441, -242, 127, 245, 71, 48, -449, -483, 205, 314, 171, -6, -645, -484, 149, 397, 289, -64, -312, -306, 76, 348, 184, -50, -312, -216, 105, 204, 184, -24, -221, -325, -101, 211, 350, 103, -291, -349, -185, 332, 25, 113, -229, -220, -16, 79, 382, 294, -301, -425, -68, 169, 301, 189, -40, -279, -283, 120, 223, 221, -112, -234, 44, 149, 211, 386, -69, -535, -217, 209, 203, 426, -397, -293, -164, 7, 253, 29, 45, -203, -237, 55, 71, 150, 108, -204, -217, -113, 243, 310, 126, -280, -201, -173, 247, 190, -31, -261, -159, -18, 227, 351, 106, -158, -242, -93, 206, 222, 215, -205, -163, -88, 190, 176, 39, -88, -350, -13, 435, 173, 47, -1, -99, -185, 175, 240, 194, -42, -283, -258, 35, 145, 231, -78, -382, -272, 219, 130, 190, -11, -123, -75, 173, 188, 158, -132, -261]
2606b61K72k3J15J71k23l15k5M44M1J18j60l35l1Q0N40k78m8j69l17L11L53J82
2628D42n26J6l75L30O07r3j89n08j2K36K75J44j86m43j73L60K99J78m44M9q4k84
2650c81M58K49K0n42k47J83L97J21j98q6j94K62J60J11k50j36j31J2K76L24j13
2671B95n22N3o5J71J85J93l29l03J64JK24K35k46l69J04K7M66p3k16l36K0L33
2693A2K27M3l32k58J24J28M24j03j11l85J07J96P9J96j38j85l59K46L65n6k44
2714b4J16l40J75P5O7n7k49j43J77L17jJ54m03k11Q7K11K50q2k09k64Q6M76q0
2737A28J64l19j62j98L55L42P8k48m54M8K41J88O7k75l10K18K4K83J71k76k66
2758b01r5L26Q3K46j44k37l82L09K24K9R5m23o4K7J89J74k3k22j59q8K43L87j41
$$ y = [-261, 11, -12, 103, 274, 51, -264, -289, 155, 196, 314, 154, -181, -212, -132, 408, 130, 82, -87, -404, -93, 260, 442, -84, -68, -443, -113, 494, 401, 212, -296, -308, -72, 203, 347, 161, -282, -455, -95, 204, 382, -62, -13, -97, -381, 77, 326, 346, -196, -443, -260, 137, 258, 60, -26, -220, 42, 202, 313, 63, -73, -204, -192, 84, 408, 295, -227, -174, -239, -68, 117, 310, -19, -322, -158, -157, 67, 302, 56, -313, -209, -182, 284, 211, -5, -341, -321, 12, 239, 282, -50, -308, -184, -56, 368, 265, 154, -231, -124, 72, 151, 347, 209, 24, -335, -89, 276, 220, -24, 92, -248, -73, 2, 69, 12, -237, -380, -203, 114, 113, 267, -136, -347, -260, -49, 201, 119, -90, -354, -268, 208, 128, 292, -27, -189, -387, -32, 310, 388, 140, -314, -266, -25, 163, 230, -45, -355, -137, -113, 170, 341, 65, -201, -296, 30, 113, 359, 215, -22, -404, -95, 129, 158, 253, -170, -234, -207, -18, 156, 133, -89, -248, -336, -93, 294, 153]
2781A53l39r2K04J78J56k57k21l0K7J98K53o5j67k39K26j00M09r4j95m6j10J52
2803AL1J97k53j88q9L84K15m6l42j5JQ3K29j42m9j80p2O1M39j53j57m2R1Q2j77
2828i1K55k52o8k6p5K20K70P2l65L5k54M52O2k86j29jN1L07J7o3j58r8N2m2J30
2853A5J91m12o1N3K47J37n2Q0l64j12J33L46J12m01jn5J35J47j6q0k31k74M55
2876hK20N0l61M5j11j0K52J28j16k04J00k4J34J07k30O5m59K67L13J8j34k37j14
2899c09K59R7j5K39m29OK8J94J45j26j71K0r7O2J71Rr2j85R3K66l3j27k71J21
2923a45K2J91L39l08k35o7J58M9K46j37j47K9j94K03m8J40P1k64J57m7M9m7J23
2946A38l83LL9L87j13Rr2l20L35J53j56l1j55k4J72J17n5J72k35j61J47J96j77
$$ y = [153, -186, -278, -74, 104, 260, 3, -218, -248, -221, -23, 230, 165, -2, -241, -15, -115, 294, 200, 5, -41, -151, 1, 32, 229, -24, -212, -301, 83, 298, 252, -90, -105, -104, -21, 208, 66, 17, -163, -235, -174, 265, 112, -45, -87, 4, 86, -91, 164, -88, -156, -182, -257, -37, 233, 305, -60, -25, -279, 173, 235, -51, -180, -181, -130, 177, 194, 131, -27, -125, -73, -115, 15, 206, -206, -267, -214, 33, 170, 118, 198, -166, -278, -145, 201, 313, -88, -89, -144, -9, 138, 122, 42, -189, -463, -8, 212, 262, -99, -54, -165, -175, 77, 205, 89, -115, -15, -39, 95, 202, -28, 37, -422, -155, 158, 176, 42, -195, -309, -50, 47, 32, 271, -158, -152, -124, 70, 215, 89, -82, -62, -159, -97, 74, 83, -9, -194, -101, 165, 132, 5, -266, -145, -123, 68, 407, 99, -136, -203, -45, 4, 250, 113, -34, -5, -199, 4, -44, 96, 167, -97, 60, 13, 62, 15, 138, -245, -242, -203, 184, 71, 80, -12, -332, 3, 156, 0, -31, -186, -210, -38, 79, 24, 196, -39, -200, -53, 143, -34]
2969c4K73k27j45%N6L63j33l01j05K26r3K25R3k96j7kK07r6J65j95l29K81J48
2992F4J36k5j20l8lO1J08j16k71L6m9J25R4J21P4l41N3J24K00l9j33k95J39J75
3016H0K80k54q5k98Q0l1J12J24J80k22o0J89J9N2k34o7R8P0J2K3nn7Qn8J42R1
3042A89M4l39Q9n4K97k42J25j15j33N9J48m2j77J00K3j04K73%j43Pk74L89k11
3065i1K85l9l34J33p1J19M1m6N0l0j17K05m4P0k06L02j88j60J41J98k22l16K08
3088a12N6K26N6j26r4k63M20J07m51K85j16L5M2r4K70k28K2r8pK34o2k03R1k51
3112b61J43J25j6M5l8j87J45K18p4J17k88j2j93L89k2l7j44pQ5J23L7l5k88K28
3136E3j59J38n1j9J97j81k50L35J4Q8j50Kk8J97j98J09o4k06M2J98o2k0O0n7k26
$$ y = [-34, 239, 12, -133, -133, -77, 286, 153, -148, -253, -27, -120, 105, 198, -98, -115, -117, 90, -6, 159, -36, -365, -84, 64, 200, 175, 55, 17, 14, 75, 183, 67, -204, -168, -217, -92, 2, 123, 197, -144, -91, 33, 233, 194, 61, -234, -95, 80, 360, 106, 21, -277, -197, -228, -116, 8, 188, -34, -94, 95, 114, 166, -68, -135, -37, 33, 45, 68, 63, 6, 14, -44, 98, 189, 233, -106, -17, -71, 226, -16, 109, -6, -139, -80, 68, 26, -151, -51, -28, -132, 141, 141, -2, 5, -269, 120, -91, 194, 155, -179, -46, -117, 2, 43, -3, 47, 17, -100, 105, 61, 131, -75, 227, 39, -121, 20, 218, -4, -320, -112, -56, 170, 226, 100, 6, -257, 163, 270, -181, 104, -12, 23, 65, -29, 241, 13, 35, -63, -70, 164, 102, -101, -10, -261, -118, 7, -9, 36, -2, -189, -44, 174, 100, 217, -71, -83, -276, 113, 91, 54, -90, -97, -12, 111, 148, 113, -175, 53, -106, 32, -19, -38, 159, -22, -272, 63, 77, 165, 15, 17, -11, 186, -12, 97, 33, -173, -131, 67, 5, -15, 45, -12, -238]
3161b38K09J98j13p2p8N1M7Q3O3k50O4j67L08J28j80k8P8j68R7J46j31m6p6L7
3185c8o5N9J51n6j09r7j5Q9L12o7k05kj51L92Lk15N1K8k2l3K0J03j69J29r7m8
3211e2J95n7j88k4m1J85O4j71J8P7k5Q4q6L7o8J58k05K64j09Qmj30l8J09J99j11
3237H9k46N4J41j06J15n2J36k39J98j85Q4J4K3P0l16J86k2K97k10j31l5L12j86
3260ik5m3n3L5LK24K0j51k0R1k01M41l02K50l72q0J44P1J5k3J02l88J28J02K46
3285B05k26J66j44p4J88j52k44J90j46R6R2J85R0n85M53k06n1L43l5j97j05L43
3307A86j56j47K01K78l46O9k62Q0N3L4R8j11j00K45J76m54J94k14J38K12n3r2
3329B9k14J43j49J28K56r1j88m9J91J9j22M6QJ28l22J52J50k51J97j95OK40o9
$$ y = [-238, -29, 169, 56, -16, -94, -43, 4, 87, 150, -100, -36, -203, 105, 233, 53, 25, 103, -65, 32, 178, 47, 1, -75, -38, -103, -44, 107, 51, -58, -155, -170, -81, 231, 164, -41, -43, -194, 198, 201, -14, 37, 65, 43, 10, 30, 133, -36, 93, -4, -52, 143, 86, -102, -126, -167, 18, 82, -89, -71, 6, -19, 65, -21, 16, -52, 106, -99, 165, 56, 64, 60, -70, -108, 1, 200, 89, -157, -103, 38, -68, 47, -5, 131, -108, 90, -95, -11, 3, 26, 96, -220, -34, -56, 241, 31, -100, -135, 177, -9, -34, -77, -130, -95, -92, 132, 152, 1, -19, 72, -129, 312, 10, 260, -112, -192, -48, 23, 38, 15, 117, -271, -143, -41, 205, -21, 145, 1, -73, 115, -37, -281, -91, -237, -141, -49, 136, 226, -359, 94, -112, -163, 180, 145, -52, -157, 186, 30, -117, 84, 362, 16, 85, -177, -97, -44, -10, 88, -23, -123, 122, 298, -156, 38, -176, -38, 174, 121, 29, -185, -42, -191, -63, 193, 102, -86, -135, 56, 75, -47, -1, 7, 135, -187, -35, 115, -136, 61, -134, -128, 112, 43]
3352D3q1N5k68K01J66O7k05J4pj1r8J47m8n7P8Lp4j17M05j98j06J08j66J40N0
3377D1K48l62J08j12K47Qj79r7KJ00K6J92k88K05l24J90R7J52j63j95J90k66K88
3400A08l6j05j12N9p3J30J89j08P1k45m4K33p9Rr6m9j47L00P8K8j92J34k47J82
3424a2J42j16k9J2q8M0J50Q7J1l01pJ82Q9j06j19J13j11k2J81n4n5K55n02J88
3448g2K60n2J9j96J00j77L35p3M6j36j51j07J45P5j7J15j35o5K09J14M7k63p1
3471e0J37k21J06J49j30j15J43o4KKJ2j09qJ2K76j50M2j70J4J83m9pmm8q7J4J14
3498fO0j2J9j52R2k2J2J69k37Nj9J44K13k94jmk11L11o7J05j15j50K87o4M2l6
3524F9j57R6r6J03P6p8p2N9k2q7R7K80k92m5R3q3J24Q9j64n7j34O4K08J07j1k59
$$ y = [43, -38, 17, -251, -50, 116, 183, -22, -8, -15, -26, -124, 23, -25, -82, -4, -1, -75, -192, 213, 15, -91, 17, -149, -9, 41, 289, -73, 35, -77, 170, 178, -1, -98, -96, 4, 30, 222, -66, 139, -185, 5, 102, 254, 91, -104, 86, -180, 108, 72, -33, -145, -86, -159, -29, 160, 52, 123, -122, -166, 67, -12, -3, -99, -148, -295, 5, 83, 111, -81, 53, -194, -12, 130, 14, -15, -3, -91, -51, 99, 186, 197, -104, -111, 71, 160, 54, -65, 48, -63, -85, 96, 42, -13, 242, -260, -72, 188, 136, 155, -41, 59, -118, 217, 144, 190, 54, -97, -204, -59, 16, -1, 114, -21, -86, 123, 237, 284, 21, -50, 87, -134, -28, 121, -9, -124, 19, -45, -43, -41, -29, -138, -146, -134, 142, -8, 34, -136, -122, 61, 12, 5, 1, -47, -134, -120, -6, 54, 42, 61, -91, 1, -21, -9, 160, -77, -72, -91, 53, 266, -28, -29, -33, -244, 67, 0, 105, -10, -160, 127, 63, 105, 69, -88, 8, -88, 15, 91, 13, -59, 0, -22, -109, -12, 268, -24, -69, 24, -59, 65, 154, -10, -67, -201, -137, 71, 178, 167, -92]
3550i2o4K42p8J47j59K0q8q6R5R8j44L2k8j01K91o8oj48K4l9K74N7Lj90j8j43
3576a69Q4N05l96rK0k06K88j96P2K8j59j3J63K88k53O5l26M4j29L50J62k53O8
3599B8k23J17K80q6j22L1j55K81%j12M4p7j17J17J06J01p5k64O6M4p7K43J82l69
3623c7j17J38J4K16p3j92j27J29J19OM4j62j89R5K62J5j29J4j43O8q2K52k0k80
3647a79J15J2MN2L7p4O5j88K38n6J25k45M0j01L67j50J92k02q4j04J74O1M1j76
3671c6K4j45K12J10O1l24J10p2Q4N7P9J5l64l4K4K64M1k49J48r3K04j74J67Kj48
3696c7k33J57L57o3n0K5r4j27K5J0K93l10o1n7K76j08M5m8k7j26L04j14N8l1j31
3721f7j2J85N8m7n8j37J4M6L7L0j22j53q5L84RP4q3K3k28L14j55lj2r2p1K67j42
$$ y = [-92, -156, 86, 8, 155, -4, 16, -72, -158, -63, 35, -109, -77, -105, -206, 85, 17, 11, -137, -113, -152, 122, 179, 182, -8, -26, -169, -85, 420, 24, 15, 35, -171, 117, -79, -7, 21, -138, -151, 12, 300, 47, 112, -214, -170, -299, 51, 213, -40, 28, -195, -78, 202, 116, -6, 25, -130, 151, 151, 39, 83, 6, -111, 6, 112, 213, 138, -126, -60, -16, -93, 150, 332, -37, -154, -16, -2, 214, 141, -51, -178, -49, 70, 76, 120, -42, -231, -136, 126, 141, 12, 26, -117, -49, -131, 121, 101, -179, -64, -52, -48, 4, 41, -33, 32, -156, 82, 26, 151, -94, -54, -155, 212, 62, 254, 52, -32, -136, 38, 99, 140, -36, -12, -157, 55, 165, 226, -98, 12, -60, 24, 81, 160, 175, -189, -223, -199, 65, 106, -143, 5, -88, 116, -58, 109, 111, -37, -270, -113, 244, 181, 131, 156, 62, -65, -40, -30, 263, -47, -108, -165, 111, 3, 48, 0, -27, -153, 151, 37, 95, 64, -67, -79, 106, 164, 117, 59, -78, -64, -18, 19, 49, -73, -226, -311, 73, 82, 156, 73, 96, -132, 182, 27, 24, 12, -80, -151, 116, -26]
3748b6k6N1o1J9P3J7J11j25j41J14j95J82Q0o9j77J28j32K14K59k43k60P9K15
3771H7L6l5O5k33k7K07j26R4Rq7j90J80J37J8j20N8j37J85K6K9m0l8l11K79j38
3796g2K02j00o2QN5pK7K4pQj96k6Q0O3q4K3J78l58J36J13J6j0j34M09l64Q1kj9
3824a8m9J40Q0rl8j64L9o2Q4J16J25j82j19J02j58K02K8k03jm0K15n1p8m2P2j98
3850b09K70QM1k08m9J26M3P0K3J5k13k5K69j6j64j18o3J36R2l2J28n6k29J16J25
3875H0K5J12k1l27r9K75J98k68P8j71p1J50K06l2n3l34K53j51N9J61j92k5O2J46
3899F1M0j7k79L05j54j49L09o8n7L7j09m9P0J14k5j32l3J26j19L82q3k72q6J89
3923AQ9k03K21j85Q9p2R7j08l3J86j59k1J60j31J09p9K4k92J81J41l8J4j05J35
$$ y = [-26, -52, -1, -62, -43, 30, 47, 158, 33, -108, 6, -189, -7, 73, 4, -173, -45, -177, 37, 296, 53, -207, -128, 87, 123, 88, 153, -80, -107, 100, -26, 68, 77, -10, -200, -20, 117, 135, 15, 73, -64, 121, 147, 176, 136, 98, -213, 66, -72, 130, 30, -32, -24, 31, 24, 51, 75, 68, 76, -120, -146, -66, -3, -87, -64, 114, -244, -108, 5, 21, 11, -123, 286, -78, 3, 1, -18, -67, 73, 153, 144, 106, -58, -19, -81, 3, 119, 244, 62, -57, 45, -113, 89, 117, -86, -87, -127, 88, 37, -41, -83, -11, -209, 61, 69, 110, -98, -147, -21, 22, 92, 115, 130, -83, -108, 161, 145, -19, -137, -200, -64, 28, -4, 124, 68, -161, -45, 80, 105, 217, 196, -131, -230, 45, 243, -25, 53, -118, -189, -39, 167, 135, 82, -252, 1, -150, -91, 70, -122, -147, -85, 61, 101, 84, -195, 110, -44, -193, 116, 48, -9, 28, -81, -130, -60, 54, 29, -103, -136, -10, -129, 253, 170, -102, -188, 1, 90, -113, 108, -77, 12, -60, 37, -71, -104, 82, -77, -98, 62, -69, 40, -39, -15, -307, -126, 15, -23, -9, -114, 21]
3947B1l7J43j16Jr8J20q7o9K61j54Kk66K52LJ53j7k55J09L7J76j77J0j06J26O5
3972I7j28J12L3j47j68K10kO7j54r7J33J72j32P2j01l0J54k54J54P1p5j73q7K64
3996iK2n0k4J5l8J1J52J20o1o6l26J52J27k67R4O4K08k0j08K97l12Jj21N3J02
4021A6j29L53j88m9j38o4J73J35j21r9R2m2P1K32o9j54j88RK17J28m2k15J38j12
4045d6J63O2j34n7j30K26q0J52j59K05k67j9k7J03jj62M9J78j57l6J25J8j83M7
4069a30K77K04m00P5qL8j63K62k53j2N1j7Q4N8l6j43J7j25M27LJ2k65j98K57n1
4094c6J47j19k6j23LK94j81JP5j53rO4L57p7k44L7P0j61J03N3R8k36j6j42J84
4119c7Q5J86l65P3J67L6j2k08L6j65M38M5j97j70lK7L1J51j11r9k4l1J25M2l6
$$ y = [21, -16, 127, 11, 12, -86, 34, -53, -122, 139, -15, -13, -279, -27, -24, 129, 112, -143, -34, 3, 179, 2, 12, -94, 32, 97, -31, 81, 114, -33, -201, 9, 7, 74, -80, -177, -44, 128, -4, 68, -33, -63, 91, -163, -9, 62, -13, -186, -273, -9, 13, -37, -61, -46, -84, -73, 79, 199, 138, 72, -254, -102, 25, -242, -148, -84, 124, 104, -4, 293, -19, -18, -139, -86, 16, -113, 240, 52, 3, -135, -199, -26, 109, -12, -111, -19, -61, 10, 242, 173, 19, -169, -160, 57, 185, 143, -72, 66, -46, 117, 179, 45, -12, -142, 84, 4, 156, -3, 202, -65, -84, -111, -8, -9, -171, -122, 56, -101, -137, -12, 6, -177, -130, 147, 351, -49, 26, 18, 56, -107, 155, -98, -110, -59, -76, 8, 66, 30, -113, -96, -221, 206, 209, 221, -44, -242, 15, -36, 111, -8, -34, -157, -154, 140, -41, -40, 35, -118, -127, -63, 294, 217, -27, 10, 80, -81, 22, 75, 173, -63, -79, -221, -37, 48, 234, -131, -58, 109, 145, 133, -75, -39, -204, 234, 279, 82, -88, -91, -64, -33, 118, 7, -92, -116, -147, -22, 20, -16]
4144a6O4j06m7n0K21K29r7j31j91N9K20M7lk52j26O6O4K42R3j88l40L15o4J61
4168A70l7k64P3O1m2N7j72K29j00k56L39J8j7M6l20J83N9J67j80j30R6n1K20k16
4192f7J48k25J2j08j5K69J12q2j68j4L56k91J91k35o2M7p8Q9M2Q4J7J3j31K38
4216A42o3P7k93J77k03M3M58j83j60k18J72k0J60j9O8k73K1K02J65j99j61Qn8
4239a57K10m7P4k52jM0M3Q2R7q5j24m2n0J80L76m99P6p7Q2K05Q3k31Lk22q4M83
4265A63J90j66r4k28J84r4K46j08l43J51L4K03k0j95M3r6J15j07J91K38j15j35
4287E7j9j62L40k03l2j28J63k4p9J31j34o5O4N8K11k06K18k69q9K65k2k14OM9
4311h4n4K21n4J90k58j49R9j71L09p7Q3p4j47lJ17K96O0m19j32K71K09J61p3k72
$$ y = [-16, 48, -58, -105, -155, 66, 295, 198, 67, -124, -65, 155, 202, 199, -53, -179, -113, -49, 193, 286, 98, -242, 73, 9, 170, 133, -131, -58, 3, -39, 18, -154, 75, -25, -281, 58, 76, 59, 105, -215, -32, 27, 194, 14, -116, -20, -71, 149, -67, 81, -144, -132, -240, -255, 14, 126, 44, -124, -138, 218, -73, 118, -117, -179, -132, -210, -121, -79, 5, 22, 35, -96, 142, 79, 156, -137, 40, -163, -120, 338, 155, -5, -223, -51, -71, 89, 70, 138, -135, -114, 88, 253, 54, -107, -99, -157, 53, 6, 80, -172, -173, -133, -90, -8, 89, 4, -120, -162, -212, -32, 344, -155, -79, -156, -74, 131, 214, -17, -14, -236, -320, 163, 353, 187, 93, -135, 49, -45, 201, 93, -250, -99, -65, 138, 118, -77, -34, -130, -15, -122, 69, 307, 192, 57, 38, -124, 216, 13, -19, -147, 16, -8, -87, 44, -90, -155, -91, -33, 178, -28, 190, -79, -168, 97, 75, -139, -133, -84, -138, 83, 29, 219, -39, -188, -89, -260, 49, -28, 55, -19, -166, -169, -52, 244, 304, -115, -247, 24, 233, 394, 321, 49]
4335D9j72o8K16J97j63j20q9J2K51l0o0Q6j44N5j19J30J76l37J16j8R0J2L43m89
4359g6K8J11l42N31j61K9k90L8n6L16N9k94l2mJ16O2P3pJ59l90J6J14J25j66r8
4384a39RJ21RJ9R5j79k02K22J92K7l6k57N4o9K36J28q4j8l84L55j72K61p2p6m4
4409dj64L69j13Rk55J16j31J67K03j00j57k4J21J16l9P4j78j38K77k89R0L12k78
4432a6j10p8M20j21n4j82J92j84J23J77q4K6l68L7K84n5OK2k6p8j4J02J53L3j23
4457H2j02j72K56J53k75J05k47J42J55J30l18N7m7Q7p6J7K70l17N7k05K04J52
4479A08J17j56j47m2J34j4R7L9k20p9J68P8mj16k0o5J78l0l8J21j40j06K8L22
4503B13P0k67j17J2M0R0J82K4k27j21j7K39q8K9k36R2j5K40JR3l40n5k4R9L42
$$ y = [49, -123, -191, 25, 222, 59, -61, -150, -138, 113, 83, 23, 109, -35, 20, -99, 31, 207, -130, -14, -32, 58, 70, 413, -76, -48, 63, -279, 252, 91, 120, -170, -132, -188, 128, 187, -107, -139, -143, -27, 35, 108, 101, 260, -130, -114, 0, 125, -41, -139, -130, -9, 0, 19, 114, -65, -267, -45, 147, 174, 138, -119, -65, -134, 102, 230, 146, 128, -256, 99, -73, 188, 116, 40, -4, -168, 201, 88, 97, -158, -42, -173, -6, 197, 97, -60, -84, 37, 153, 114, 188, 10, -128, 149, -140, -50, 262, -16, -126, -204, 216, 95, 41, -141, 51, -133, -10, 167, 83, 109, -259, -222, 62, 7, 13, 35, 9, -69, -83, 19, 172, 205, 82, -20, -192, 64, 217, -58, 47, -200, -58, 97, 227, -91, -34, -81, 6, -70, -53, 217, -100, -43, -248, -44, 108, 225, 69, -78, -120, 14, 0, 97, 136, -84, -163, 5, 83, 79, -37, -57, -122, 56, 26, -12, 109, -31, -137, -109, 213, 283, 16, -101, -89, -49, 41, 223, 247, 20, -101, -118, 121, 33, 62, -174, -82, -97, 143, 144, 237, -103, -158, -182, -83, 259]
4528B59j63o4j73J26J87L5o4l07J98J36j31M6J11j39j51J07j12K45j57j79J39
4549e1j94K03L46k10j43kmj49L32N0j78qj23J04J88j18o4k26L18j97L8J71k53
4572a70K12j64J75k47J27P3k72l5J59K40j27O2o7j19K47j8P9r3j95oJ73Q1K05
4595C20l01j93N2K2L41l27R2k01J96O4j34L34m16Q3n8PJ87K06l88J41j69k2J45
4618a9J65n9m6n0j68M26k39P6k55k48L68n6L5L15j88j18Q9j16J41J00k40M9O6
4641B8j5K8J09j07n9j48q0M12j75r7K34j49N1p9K95l43L2j63L3L75n1r3j32L8
4665e6J5J21n9J5j59j35K80K36r7k55J53j36p0K08k4j44J68r9k0j20L04q4p3j57
4689a88K02n9K36K6q4k37O9J46J35j13k58K1O6L3K69j39j29k40J51J99j07J87
$$ y = [259, 96, 32, -141, -15, 172, 207, 143, -164, 34, 170, 39, 85, 196, 57, -94, 13, -99, 146, -11, -190, -51, -245, -42, 304, 94, -49, -51, -55, -204, 128, 178, 0, -8, -131, -27, 161, 43, -21, -247, 71, -126, -88, 83, -170, 42, -122, 53, -194, -67, 6, -266, -301, -142, 98, -29, 33, -34, -153, 94, 76, 155, 62, -133, -139, 34, 115, 320, 19, -174, -122, -100, 241, -86, 6, -195, 1, 65, -69, 265, -151, -68, -126, -119, 68, 274, -114, 27, -142, -164, -19, 146, 87, 41, -9, -177, 249, 10, 86, -169, -417, -49, -105, -70, 245, 57, -61, 28, -88, 53, 153, -87, -38, 28, 13, 41, 150, 43, -16, -164, -244, 168, -7, -104, 130, -19, 32, -47, 248, -95, -63, -226, -193, 182, 131, 38, -94, -56, -41, 80, 21, 36, -123, -258, 22, 258, 161, -94, 59, -77, -147, 61, 37, -107, 61, -38, -58, -178, 126, 42, -31, -188, 14, -45, 191, 217, 133, -104, -35, 111, 246, 133, -125, -104, -38, -5, 264, 125, -4, -244, -93, 106, -1, 186]
4711A86j11j51N8R5j2j24K09m32K40P5R4K5m0k41n7J89J96L4k09J4j85J21J88
4734A62k44q3J0J75j65J06O7M4R0k78J84j31J28pj95r6K10K38k89k9K5M5L8rJ40
4759A36j22j43K15Lj37K08k65KMMK50m4R3l84N2P3N6K15k09jQ1o1R1%P2l54m2
4786b07O1J85J02o4L9l30K18Q4K3o9j30K1q8L41J35j34j87k5K6K6RO2j50j82J80
4811e4Q9J06N9j47j93Q0k9J87Pk36Q1K2j21L62k38K1ML5J02K9j76O4o1k20J21
4836a06J30R1j1j03j28nJ03QK34q8j81j40J19K08j13j82l6J53j15L09j85j31r2
4859b61J83p5L24j19o1j07J4P9J31mj95P7J2M3J32j8j23k6r7K56k55K39j00J3
4883F2k68J00K61K2q8j66m8J53no6l8k2j50K21J8K7N1n2k9k5J34q1J7k41J41p0
$$ y = [186, 75, -76, -18, 77, 65, -59, 150, -282, -42, 33, 127, 152, 112, -129, -186, 3, 199, 233, 24, 38, -147, -26, 162, -82, -165, -155, 20, -145, -39, 28, 72, 162, -116, 68, -63, 65, 58, -137, -233, -23, 215, -74, -103, -78, -33, 5, -4, 136, 14, -129, 86, 89, -48, 160, -105, -103, -99, -95, 155, 111, 204, -180, -128, -55, 1, 216, 7, 6, 87, 26, 117, 117, 189, -165, -207, -146, 39, 141, 77, 116, -214, 4, 88, 111, 42, -88, -67, -155, 186, 321, 187, 0, -25, 1, 27, 36, 98, -52, -234, -54, 35, 141, 200, 53, -140, -60, -89, 98, 105, -131, -50, -28, -149, 213, -25, -4, 0, 35, 137, 166, -10, 54, -7, -227, -106, 24, 115, 104, 1, -127, -132, -29, -21, 213, 125, -56, -196, -77, 131, 18, -164, -200, -47, -162, 147, -38, -169, -261, -78, -153, 171, 52, -9, -116, -102, -23, 108, 104, -91, -14, -2, 41, 173, 155, 32, 6, -91, 165, -90, 149, 49, 62, -206, -106, 155, 177, 89, -77, -125, 28, 23, -43, -81, -103, -253, -32, -14, 13, 64, 12, -17, -42, 92, 11, 28, -213, -72, -142]
4909a42K66L0k27r7j94K00L19j7J28q4k60o3J59K51j89j69l0j9J08J60n8l11J44
4932i5j16K75J39j27k68Or6J2K58J39r9j23j29J09K70n2Lk35J24j40J41rm2j58
4956b13K47j33J49K9p7n9k47K42J03M3N7n20K40R0J28J69n9j3r7j18JJ65j84j30
4980a87Q3q7J96L8Q5k40p3O3K52P5p4k59J93L1K0n2J21k79O2nj25J68o5q6K5l2
5006a52J70PMP6j29Q0n0K8N0j25p3R8Q5n1j9O1k82R9K82j12J88j50j90j4J1K43
5032A35O3K4k83pM6o2L35k64M7j09p8L27j6k32r7j0n0L18L5j2k14O8J10K1N4n7
5058I2k37J78q3J5J21N2k24J7m8J01L6o1L8J2j18R2j3Q0r5k34J34K84n9J10j83
5083Gj16p9K45J6K4nr5l26L49L27j57j70o9P6j30K94j2k08j56J32PK03n1j42j48
$$ y = [-142, 124, 154, -73, -170, -364, -164, 155, 138, 266, 182, -78, -141, 18, 269, 80, -89, -119, -138, -30, 130, 72, -239, -95, -211, 64, 203, 76, -192, -186, -282, -270, -12, 127, 28, -95, -224, -115, 155, 103, 106, -129, -5, -145, -4, -13, -55, -213, 34, -99, 50, 79, 2, -57, -304, -62, 41, 84, 141, -379, -139, -49, 79, 248, 189, 176, 79, -39, -38, 127, -57, -187, -104, -191, 5, 43, 128, -112, -185, -122, 130, 205, 131, -128, 65, 96, 116, 64, 185, -94, -32, -37, -162, 6, -59, -145, -120, -152, 18, 25, 29, 105, -24, 56, 6, 34, 84, -41, -114, -16, 69, 18, -1, 60, -222, -123, 159, 47, 235, 85, -105, -119, -108, 135, 198, 222, -61, -68, -22, -84, 251, -13, 34, -75, -153, 174, 158, -74, -171, -181, -231, 87, 122, 110, -104, -36, 74, 95, 149, 92, -145, 33, -50, -35, 86, 138, -86, -69, -117, -16, 20, -41, -3, 9, -109, -17, -30, 50, -45, -279, -145, 139, 80, 190, 7, -109, -188, 57, 73, 97, 92, -3, -329, 20, 347, 190, 20, -49, 27, -103, 191, 179, -29, -185, -53, -46, 157, 106, -36, -184]
5108a84m8J52j2L51l46j83Q1J73Q6o3k6K0k41J79J88j51r5R4l5l2q3L08K9j83
5132b1n5k4K37q7K40l14Q3p0l7p4jJ84j99J55P0M7j26j27n2J81R1J23p0l1l77
5157b54RK20J8J14j33j64J98N4j10P3l7p8P9L3M3Q6j34O9k95J66J70o2J5k50J63
5182gj05O2K65kk13o6J04j3K12k81k2q1R8K35m7j88J66j87j5J77N2p4j99P1N5
5207cj43L21rk48k13K27k2L8O8k61K66j5o1K24o1o5k50J96l1N1L9M2l25K49m6
5232c2O2J41l95J53j07K20K2jn0j12q4J16J16n9j04j40J82J22L2J70k07l5J9j08
5256g9J7M2Ml9R3n3k2RP5j67J0O0J35O4j66J03o2K7J9M0j8k16K72k6j0j93j24
5283b05J13k8j20K66J40J5l04J13P3j73K11qj8j51j0J08K13j25k75J69%j6O7O9
$$ y = [-184, -232, -80, -92, 259, -87, -270, -189, -16, 70, 7, -19, 1, -240, -61, 127, -24, -119, -25, -60, -92, -175, 133, 162, -21, -76, -100, 137, 50, 290, -24, 59, -11, -48, -122, -123, 61, -138, 17, 87, 134, 8, -119, -171, 10, 101, 224, 154, 123, -254, -245, -25, -7, 107, -26, -190, 8, 62, -48, 25, -12, -90, -11, 22, 65, 151, 17, 86, -209, -43, 127, 65, 80, -170, -7, -112, -50, 215, 213, 0, -66, 38, 25, 237, -44, -66, -147, -49, 186, 139, -49, 117, -70, -85, 92, 144, 70, -129, -58, -3, -146, 175, 166, -82, -295, -68, -90, -52, 16, -245, 21, 6, -55, 169, 108, 43, -207, -11, -42, 9, 48, 90, -235, 14, -32, 30, 171, -224, -71, -178, 42, 64, 63, 13, -99, -183, -67, 49, -10, -114, -254, -72, 50, 82, 252, 45, 10, 29, -79, -62, -20, -16, -55, 38, -15, -37, -28, 47, -120, -110, -50, 85, 149, -17, 86, 24, 51, 70, 110, 92, -124, 148, 122, 112, -81, -205, -92, -120, -240, 26, 166, 181, -123, -10, 63, -110, 101, 93, 75, -76, -86, 22, 235, 110, -165, 4, 4, -12, 55, 124]
5307A24l3l56Q7J41l8J25N2p9k10J29J81l8o5L2j25k7J62L4p7k02J6J03J36P2
5331A44j40N7q5r6L19j83J6j17o4n6J68n1N1m6J16j19O3J56j0r7k55L31k39K62
5355A25R2l46O3O1q2O8J39K1l96M07N7k56K69l54j0L16p9R6p1ql22K48j06K46
5379A78M0k04pn3J8K06K6l59R3J7J93k14R9n4j39Q2l8M17k45k80L27k21J76j1
5403D7K23m17j2o4K52k05L82k81k6J35j2J2O8r3%j28J47J30k69O0m2M1j7J12J34
5428A77j98q6k4Q4K53o2k94R9J62j48J06l0O8k80J5J4J52l2J88l06J36R7k2k15
5452a46J30K0j62k4J15J82J3j70j49J12M0J9R4l44M01k13r0K12j22K35k53Q6J17
5475A03r3j3l6j11K21r6J9j0n8K7j72M2J37J33k65J17j26L24l5Nor5j54J62J4
$$ y = [124, 91, -265, -178, -37, -75, 50, 102, 23, -187, -58, 123, 85, 20, 52, -73, -100, 62, 96, 19, -183, -167, -64, 72, 144, 4, 61, -24, -120, 199, 16, 32, -85, -149, -205, -37, -88, -37, -83, 33, -86, -23, 133, 123, 26, -229, 102, -137, 125, 217, -129, -66, -5, -87, -19, 120, 141, -255, 152, 209, -47, 222, -132, -142, 174, 95, 191, 120, 112, -210, 38, -68, 178, 218, 14, 7, -46, -28, 178, 204, -155, -62, -45, 148, -66, 33, -21, -160, -78, -116, 301, 56, -224, 103, -118, 58, 47, 270, -147, -159, -223, 29, -176, 206, -75, -101, 34, 22, 34, 102, 9, 9, -119, 28, 158, -111, -51, -93, -52, -69, 43, 177, -21, -107, -131, -47, 206, 144, -150, -51, 111, -37, 69, 39, 107, -173, -158, -144, 8, -24, 164, -142, -6, 91, 69, -146, -16, 4, -158, -182, -67, 115, 128, -42, -191, -79, -39, -20, 74, -270, 131, -82, -172, 40, -82, 153, -100, -14, 103, 10, -3, -39, -150, 71, -25, -6, -16, -74, -47, -219, -177, -40, 93, -172, -55, -181, 143, 108, 113, 107, 12, -142, 20, 34]
5500C4N2l7m6o8L2k26L40J25k53p9J43J37k31Q8p0P3k46J1M28J16j63j68R6K53
5524C41l44N1l2p5j23K07J61j95o1n6M2K7J31o1M3j83q8L38k5k8j49l8j65O23
5548C41r6j21j12p8q0L46j45R9k2j59N3K3j1J35j68j13j6K1K09o0m5k6j14o3L46
5573A44j58J0r3l7Q6k3J25J3k38J79k92L77q2k4j89K02N2J7j0p1j80K51l4J78
5597B03p6j41J6l02M68K9j16o3j30J34j42J36j02L24k99o6K2K57J18m56J70l9
5619e5N1m3Q3P8j80m4L7J28J57N0r1m07K67k1j9j18P3N8j7k6J9R8k6j86J55J12
$$ y = [34, 86, 49, 3, -65, -33, -259, 81, 206, -47, -126, 17, 154, -77, 11, -59, 14, -232, -221, 207, 323, 160, -8, 88, 341, -3, 48, 16, -59, -182, 25, 186, -9, -70, -126, -84, -57, 74, 13, 56, -127, -215, 123, 98, 70, -79, -117, -282, 341, 245, 124, 12, -66, -146, 200, 55, 154, 132, -27, 26, 49, 38, 173, 5, -108, -124, -103, 106, 46, 1, -25, -139, -202, 144, -14, -4, -97, -134, -48, -71, 54, 67, -171, 8, -284, 93, 11, -13, -202, 0, 52, 69, 59, -12, -192, 59, 25, 203, 127, -14, 2, -300, 168, 197, 81, 18, -112, 22, -120, 16, -86, 238, -61, -127, -105, 152, 270, -186, -16, -55, -4, -47, 36, 114, -66, -110, -73, 55, 212, 262, 171, -236, 31, 10, -9, -127, -54, 4, -13, -39, -20, 78, 52, -134, 21, 133]
$$ [...]
8191a22
##END NTUPLES=NMR FID
##END=
