##TITLE=1H_DE-63_21_oil
 D2O
 8 sc, 
 8.8.2024
##JCAMPDX= 6.0         $$ Bruker NMR JCAMP-DX V2.0
##DATA TYPE= NMR FID
##DATA CLASS= NTUPLES
##ORIGIN= UXNMR, Bruker Analytische Messtechnik GmbH
##OWNER= root
$$ XWIN-NMR		Version 3.5
$$ Thu Aug  8 14:23:46 2024 Russian Standard Time (UT+4h)  she@DPX200
##.OBSERVE FREQUENCY= 200.1313
##.OBSERVE NUCLEUS= ^1H
##.DELAY= (6, 6)
##.ACQUISITION MODE= SIMULTANEOUS
##.ACQUISITION SCHEME= undefined
##.AVERAGES= 8
##.DIGITISER RES= 18
##SPECTROMETER/DATA SYSTEM= spect
##.PULSE SEQUENCE= zg30
##.SOLVENT NAME= Acetone
##.SHIFT REFERENCE= (INTERNAL, Acetone, 0, 15.7039)
##AUDIT TRAIL= $$ (NUMBER, WHEN, WHO, WHERE, WHAT)
$$ ##TITLE= Audit trail, XWIN-NMR		Version 3.5
$$ ##JCAMPDX= 5.01
$$ ##ORIGIN= Bruker BioSpin GmbH
$$ ##OWNER= she
$$ F:/spectra/data/she/nmr/H-F/1/audita.txt
$$ ##AUDIT TRAIL=  $$ (NUMBER, WHEN, WHO, WHERE, WHAT)
(   1,<2024-08-08 14:22:28.15 +0400>,<she>,<DPX200>,
      <created by zg, POWCHK disabled, PULCHK disabled
       configuration hash MD5:
       00 E9 B6 7A A2 85 ED C7 34 08 36 98 17 FE 4E 26
       data hash MD5: 16K
       B7 CC DA 6D 98 6B 67 8C 84 BE 21 B3 05 9D 01 E8>)
$$ ##END=
$$ 
$$ hash MD5
$$ 1B 5C 63 07 CF 94 C7 1B 58 F7 C2 86 92 1B 33 8D
##$RELAX= 
##$RELAX= 
##$RELAX= 
##$RELAX= 
##$RELAX= 
##$RELAX= 
$$ Bruker specific parameters
$$ --------------------------
##$DU= <F:/spectra>
##$EXPNO= 1
##$NAME= <H-F>
##$PROCNO= 1
##$TYPE= <nmr>
##$USER= <she>
##$AMP= (0..31)
100 100 100 100 100 100 100 100 100 100 100 100 100 100 100 100 100 100 
100 100 100 100 100 100 100 100 100 100 100 100 100 100 
##$AQSEQ= 0
##$AQ_mod= 1
##$AUNM= <au_zg>
##$AUTOPOS= <>
##$BF1= 200.13
##$BF2= 200.13
##$BF3= 200.13
##$BF4= 200.13
##$BF5= 200.13
##$BF6= 200.13
##$BF7= 200.13
##$BF8= 200.13
##$BYTORDA= 1
##$CFDGTYP= 0
##$CFRGTYP= 5
##$CHEMSTR= <none>
##$CNST= (0..31)
1 1 145 1 1 1 1 1 1 1 1 1 1 1 1 1 1 1 1 1 1 1 1 1 1 1 1 1 1 1 1 1 
##$CPDPRG= <>
##$CPDPRG1= <>
##$CPDPRG2= <>
##$CPDPRG3= <>
##$CPDPRG4= <mlev>
##$CPDPRG5= <mlev>
##$CPDPRG6= <mlev>
##$CPDPRG7= <mlev>
##$CPDPRG8= <mlev>
##$CPDPRGB= <>
##$CPDPRGT= <>
##$D= (0..31)
0 1.2 0 0 0 0 0 0 0 0.06 0 0.03 0 0 0 0 0.0002 0 0 0 0 0 0 0 0 0 0 0 0 
0 0 0 
##$DATE= 1723112547
##$DBL= (0..7)
120 120 120 120 120 120 120 120 
##$DBP= (0..7)
150 150 150 150 150 150 150 150 
##$DBP07= 0
##$DBPNAM0= <>
##$DBPNAM1= <>
##$DBPNAM2= <>
##$DBPNAM3= <>
##$DBPNAM4= <>
##$DBPNAM5= <>
##$DBPNAM6= <>
##$DBPNAM7= <>
##$DBPOAL= (0..7)
0.5 0.5 0.5 0.5 0.5 0.5 0.5 0.5 
##$DBPOFFS= (0..7)
0 0 0 0 0 0 0 0 
##$DE= 6
##$DECBNUC= <off>
##$DECIM= 24
##$DECNUC= <off>
##$DECSTAT= 4
##$DIGMOD= 1
##$DIGTYP= 9
##$DL= (0..7)
0 120 120 120 120 120 120 120 
##$DP= (0..7)
150 150 150 150 150 150 150 150 
##$DP07= 0
##$DPNAME0= <>
##$DPNAME1= <>
##$DPNAME2= <>
##$DPNAME3= <>
##$DPNAME4= <>
##$DPNAME5= <>
##$DPNAME6= <>
##$DPNAME7= <>
##$DPOAL= (0..7)
0.5 0.5 0.5 0.5 0.5 0.5 0.5 0.5 
##$DPOFFS= (0..7)
0 0 0 0 0 0 0 0 
##$DQDMODE= 0
##$DR= 18
##$DS= 0
##$DSLIST= <SSSSSSSSSSSSSSS>
$$ [...]
##$SUBNAM2= <"">
##$SUBNAM3= <"">
##$SUBNAM4= <"">
##$SUBNAM5= <"">
##$SUBNAM6= <"">
##$SUBNAM7= <"">
##$SUBNAM8= <"">
##$SUBNAM9= <"">
##$SW= 24.0689771365484
##$SWIBOX= (0..15)
0 0 2 0 0 0 0 0 0 0 0 0 0 0 0 0 
##$SW_h= 4816.95568400771
##$TD= 16384
##$TD0= 1
##$TE= 0
##$TE2= 300
##$TE3= 300
##$TEG= 300
##$TL= (0..7)
0 120 120 120 120 120 120 120 
##$TP= (0..7)
150 150 150 150 150 150 150 150 
##$TP07= 0
##$TPNAME0= <>
##$TPNAME1= <>
##$TPNAME2= <>
##$TPNAME3= <>
##$TPNAME4= <>
##$TPNAME5= <>
##$TPNAME6= <>
##$TPNAME7= <>
##$TPOAL= (0..7)
0.5 0.5 0.5 0.5 0.5 0.5 0.5 0.5 
##$TPOFFS= (0..7)
0 0 0 0 0 0 0 0 
##$TUNHIN= 0
##$TUNHOUT= 0
##$TUNXOUT= 0
##$USERA1= <user>
##$USERA2= <user>
##$USERA3= <user>
##$USERA4= <user>
##$USERA5= <user>
##$V9= 5
##$VALIST= <valist>
##$VCLIST= <CCCCCCCCCCCCCCC>
##$VD= 0
##$VDLIST= <DDDDDDDDDDDDDDD>
##$VPLIST= <PPPPPPPPPPPPPPP>
##$VTLIST= <TTTTTTTTTTTTTTT>
##$WBST= 1024
##$WBSW= 4
##$XGAIN= (0..3)
0 0 0 0 
##$XL= 0
##$YL= 0
##$YMAX_a= 78549
##$YMIN_a= -83415
##$ZGOPTNS= <>
##$ZL1= 120
##$ZL2= 120
##$ZL3= 120
##$ZL4= 120
##$ABSF1= 10
##$ABSF2= 0
##$ABSG= 5
##$ABSL= 3
##$ALPHA= 0
##$AQORDER= 0
##$ASSFAC= 0
##$ASSFACI= 0
##$ASSFACX= 0
##$ASSWID= 0
##$AUNMP= <proc_1d>
##$AZFE= 0.1
##$AZFW= 0.1
##$BCFW= 1
##$BC_mod= 2
##$BYTORDP= 1
##$COROFFS= 0
##$CY= 11.3945322036743
##$DATMOD= 1
##$DC= 2
##$DFILT= <>
##$DTYPP= 0
##$F1P= 15.6554695791079
##$F2P= 12.8336369535428
##$FCOR= 0.5
##$FTSIZE= 0
##$FT_mod= 4
##$GAMMA= 1
##$GB= 0.15
##$INTBC= 1
##$INTSCL= 1
##$ISEN= 128
##$LB= 0.24
##$LEV0= 0
##$LPBIN= 0
##$MAXI= 10000
##$MC2= 0
##$MEAN= 0
##$ME_mod= 0
##$MI= 1.114404
##$NCOEF= 0
##$NC_proc= 0
##$NLEV= 6
##$NOISF1= 3.799351
##$NOISF2= 2.8
##$NSP= 1
##$NTH_PI= 0
##$NZP= 0
##$OFFSET= 15.70392
##$PC= 1
##$PHC0= -25640.75
##$PHC1= 12.38749
##$PH_mod= 1
##$PKNL= yes
##$PPARMOD= 0
##$PSCAL= 0
##$PSIGN= 0
##$REVERSE= no
##$SF= 200.130013532006
##$SI= 16384
##$SIGF1= 3
##$SIGF2= 2
##$SINO= 400
##$SIOLD= 16384
##$SREGLST= <1H.CDCl3>
##$SSB= 0
##$STSI= 0
##$STSR= 0
##$SW_p= 3612.71676300578
##$SYMM= 0
##$S_DEV= 0
##$TDeff= 0
##$TDoff= 0
##$TI= <>
##$TILT= no
##$TM1= 0
##$TM2= 0
##$TOPLEV= 0
##$USERP1= <user>
##$USERP2= <user>
##$USERP3= <user>
##$USERP4= <user>
##$USERP5= <user>
##$WDW= 1
##$XDIM= 8192
##$YMAX_p= 0
##$YMIN_p= 0
$$ End of Bruker specific parameters
$$ ---------------------------------
##NTUPLES= NMR FID
##VAR_NAME=  TIME,          FID/REAL,        FID/IMAG
##SYMBOL=    X,             R,               I
##VAR_TYPE=  INDEPENDENT,   DEPENDENT,       DEPENDENT
##VAR_FORM=  AFFN,          ASDF,            ASDF
##VAR_DIM=   8192,          8192,            8192
##UNITS=     SECONDS,       ARBITRARY UNITS, ARBITRARY UNITS
##FACTOR=    0.0002076,     1,               1
##FIRST=     0,             0,               0
##LAST=      1.7004516,     0,               0
##MIN=       0,             -83415,          0
##MAX=       1.7004516,     78549,           0
$$ Real data points
##PAGE= N=1
##DATA TABLE= (X++(R..R)), XYDATA
0@%%%%%%%%%%%%%%qJ6j6J6j6J6k4L2l2L8m6N0n8O9p7Q6r9J12j24J40j59J77j96
37a03K18k41K68k99L29l64M04m47M95n49O10o78P56q46R51j077J230j418J657
56H96j975K417l067M096r035Q4360r314r6373k0094Q513M9366O8759l6793j15560
70g3804R013R8138K6306l8478m1397l9688L2070R0948j398r6646l0346N1896M6212
83C2826J5207l4962p0299M110Q4522L0907n2629m7910n277M0250N6295j0245p3797
96c1002k3270M9944M3720p89m1552m6996J7214O7842J3912n1714l6936P485L8582
109F440M0419j8758o6561r871N6153L2026j5324l3471l3148J6249O2866J0649
121D7669n8169l0014K3023L1338K2661j4538n5861j1133N8664L0253l1084l3181
$$ plain form
0 0 0 0 0 0 0 0 0 0 0 0 0 0 0 0 -8 8 -8 8 -8 8 -16 16 -16 22 -24 26 -32 37 -40 46 -53 59 -65 75 -84 93 -103
37 -103 115 -126 142 -157 172 -192 212 -235 260 -289 321 -357 399 -447 504 -573 657 -761 896
56 896 -1079 1338 -1729 2367 -6668 77692 68378 -27995 -48089 -39576 9790 78549 41756 -73804
70 -73804 -64791 33347 59653 21175 -20222 -59910 -27840 63108 61710 -34936 -65282 -13386 32826
83 32826 48033 13071 -57228 -53118 31404 62311 9682 -38228 -43505 -3255 53040 42795 -31002
96 -31002 -54272 -4328 39392 38603 -2949 -49945 -32731 35111 49023 -2691 -39627 -32142 6440
109 6440 46859 28101 -38460 -48331 7822 39848 24524 -8947 -42095 -25846 37020 47669
121 47669 -10500 -40514 -17491 13847 36508 21970 -33891 -45024 13640 43893 12809 -20372
133b0372j2293J7123M7823R376n7057l1449L5641L7022L933k0849m0011p165N4201
146A5923L1691l8568l8591L386K4151L1965L227m9472k9100M0129L9172j0551
158B3362k8553k4257K552M4804K5570m1598m0144J6177L3443J6945p691l9733
170a9123k1762M0499M0007j9629l6248j0484J3282L3342J6841l8156l7707K2315
182a6823L8262M037j8506k7924j0679L5460L4369k4046l9816L53K3998K2942M876
195B6503l2616l0860K4482M0079l236k7519j8377O91K8930K6137k3363l9329O407
208b2071L0153J3694n996k5658k1453K3172L7206q335l3289j0343J1635K2711
220A1426J6496k2056l5216R162L5422Q003j6010k0324j0624K0308L1920r826l5412
$$ plain form
133 -20372 -32665 -15542 32281 41657 -15400 -46849 -11208 25814 29747 8898 -31113 -38278 15923
146 15923 47614 9046 -29545 -26159 -2008 29957 33184 -16288 -45388 -5259 33913 23362
158 23362 -5191 -29448 -26896 17908 43478 1880 -38264 -22087 11356 28301 20610 -19123
170 -19123 -40885 -386 39621 19992 -16256 -26740 -13458 19884 36725 -1431 -39138 -16823
182 -16823 21439 25476 6970 -20954 -31633 3827 38196 14150 -25666 -25313 -1315 21627 26503
195 26503 -6113 -36973 -12491 27588 24352 -3167 -21544 -20853 8077 34214 10851 -28478 -22071
208 -22071 8082 21776 15780 -9878 -31331 -8159 29047 20712 -12577 -22920 -11285 11426
220 11426 27922 5866 -29350 -20188 15234 23237 7227 -13097 -23721 -3413 28507 18681 -16731
233a6731o245K0214J7897M955j9357k7671J0302L4987M647k4265j6628P59J8944
246A808K3256j0734l4114l192K6931J5440n381j8345j8891J1268L2342J891k8207
259e928j4030R737J7340J3620j1602k9651n01K9418J2492j4249j6641q958J2267
272f686K6547l12l0196j1233J7564J6842L825j2060k3050Q86K9421J0958k0331
285B175j6477P95J2553J8498k039k7638j0023K2031J6620n447j3780j3987L791
298a2928K5119Q958k2698j6883Q572J5501J0003n356k2480p737K2762J6610j0841
311H602j6276o641P158J9762N566k2082j5458J2679J6614L237q868j7292l480
324a6479K1468J4649j4535j7414l94J1311J4438J733k0562j3507J5206J8397k618
$$ plain form
233 -16731 -22976 -2762 15135 20090 733 -26938 -16636 18351 22998 -1267 -17895 -17136 1808
246 1808 25064 14330 -19784 -22976 3955 19395 14014 -4331 -23222 -11954 20388 22279 -5928
259 -5928 -19958 -10221 7119 20739 9137 -20514 -21015 8403 20895 6646 -9995 -18953 -6686
272 -6686 19861 19549 -10647 -21880 -4316 12526 16351 4291 -18759 -17873 11548 22506 2175
285 2175 -14302 -13507 -954 17544 15505 -12133 -22156 -125 16495 11048 -2732 -16719 -12928
298 -12928 12191 21149 -1549 -18432 -9860 5641 15644 10288 -12192 -19929 2833 19443 8602
311 8602 -7674 -14315 -7157 12605 18171 -3911 -19369 -6690 9924 13161 4293 -12999 -16479
324 -16479 4989 19638 5103 -12311 -12705 -1394 13044 14777 -5785 -19292 -4086 14311 11693
337A1693j2621j1343n5J8878J2173j5966j8050M951J4350P748k651j6552j0038
350a7483J5710J7978o661j5989n659N523J4658Q250j5651j7094P835J7011L636
363A2064p607j2853n934J5079J5766r031j7379j671R564J0998L200j4034j4433
376a6271R899J7639k98j1435r195q90J3284J3054r900j8264J530J3485P483j752
390H369j1826j1010R412J8113k408j4993o194M392J0558Q536r058j7051K621J6611
404F072M947p161r757n934R289J5555l062j7080m474R505R393K878q785j3860
418a2474L545J6693L931j0928q751p16Q699J1758m372j6074k722J1983Q285j637
432G220q974r594M737J5882K079j3582p473L735Q762Q064n164j5003j390J3862
$$ plain form
337 11693 -928 -12271 -12326 6552 18725 2759 -15291 -10340 4010 11758 9107 -7445 -17483
350 -17483 -1773 16205 9544 -6445 -12104 -6581 8077 16327 676 -16418 -8583 8428 12064
363 12064 4457 -8396 -14330 749 16515 7484 -9895 -11566 -2002 8996 12196 -1838 -16271
376 -16271 -6372 11267 10969 -466 -9661 -10551 2733 15787 5887 -12377 -10847 2638 10121 8369
390 8369 -3457 -14467 -5055 13058 10650 -4343 -10537 -6145 4413 12949 3891 -13160 -10539 6072
404 6072 11019 3858 -5899 -11833 -2544 13011 9949 -7131 -11605 -2100 7293 10171 1386 -12474
418 -12474 -8929 7764 11695 767 -7984 -8700 -1 11757 7385 -8689 -11411 572 8857 7220
432 7220 -1754 -11348 -6611 9271 11350 -2232 -9705 -5970 2792 10856 5692 -9311 -10701 3161
446C161P160o046q448n334N355J3684O44j4630o404Q178Q229K672n584j1918l04
461i585J4846O153r603q877j51O101J0223o06j3982n931J0707Q855j824o940p727
476h341J112J2839N444j1212r122L873P510N487j999j1403m878J1419R060m876
490D913q513l707L193J0144L897j1108q654N639R010K333m508q765k715J0693
504A852Q032o573r366p00N555P578J328j0262p399P405R514p68o224o327j24R527
520C048O871p919r579J878P102M943q43q952n825Q031R425k901q140l386K196
535d051P716M877p830r383L926Q652K338l509o716l879P661Q923m058r705j108
550f146M738N915K331p121q187M472R619M85n950m972o86O595O995m506r802M6
$$ plain form
446 3161 10321 4275 -4173 -9507 -4152 9532 10176 -4454 -10858 -2680 5549 8221 2637 -9281 -9585
461 -9585 5261 11414 1811 -7066 -7217 -1116 9107 8501 -5481 -11412 -705 8150 6326 -614 -8341
476 -8341 -7229 5610 11054 -158 -9280 -5407 2103 7590 5591 -5812 -10690 729 9789 4913
490 4913 -3600 -7307 -4114 6030 9927 -1181 -9835 -4196 4814 7147 2639 -6126 -8841 1852
504 1852 9884 3311 -6055 -6755 -1200 6378 7706 -2556 -9955 -2550 6964 6196 -28 -6355 -6479 3048
520 3048 9919 2000 -7579 -5701 1401 6344 5501 -3451 -9276 -1245 8180 5279 -2861 -6247 -4051
535 -4051 3665 8542 712 -8671 -4745 3907 6245 2736 -3980 -7859 -198 8725 4667 -5038 -6146
550 -6146 -1408 4507 6838 -283 -8470 -3998 5621 6106 156 -4816 -5502 1093 8088 3582 -6220 -6174
566f174P243M057n40o261n840M622R532o03q133l652K357N610M740m655r039R66
582e770Q443L128l412n359l342M512Q388j408q709k421M538M962K046m496p662
597f562J776Q834K167n520m724o12M477O359j784q924j755O382M548p13m503n343
613e897K197Q377J371p072m310J969M690M107k345q021r47P731L709l125m864
628b430k490K729O996P47p742l661L921M780K069l467o227l81P663L484n035m746
644c790j66L345N358p8p497l375N845M742r03l681m241N70P012L013o213m648
660d707J493M411L100r15o691k489O053N089k842m464k023J567N541K057n770
675e90m875L125N074J143k271n168j338O118M422l569n582k77L108L993R14n386
$$ plain form
566 -6174 1069 5126 4586 -1675 -7515 -2893 6639 6036 -2097 -5749 -3392 2218 6958 2303 -6736 -5770
582 -5770 2673 5801 2389 -2970 -6312 -1800 6588 5180 -3529 -5950 -1412 3550 5596 1100 -6562
597 -6562 -4786 4048 6215 695 -4029 -4641 -164 6195 4411 -4513 -6268 114 4662 3949 -554 -5897
613 -5897 -3700 4677 6048 -1024 -5334 -3365 1325 5432 3087 -4934 -5881 1850 5559 2434 -2430
628 -2430 -4920 -2191 4805 5552 -2190 -5851 -1930 2850 4919 1452 -4775 -5156 2507 5991 956 -3790
644 -3790 -3956 -611 4747 4669 -2828 -6203 -358 4384 3481 -200 -4441 -3871 3141 6154 -59 -4707
660 -4707 -3214 1197 4297 3382 -3309 -5798 255 5344 2502 -1962 -3985 -2418 3123 5180 -590
675 -590 -5465 -2340 2734 3877 1606 -3562 -4900 1218 5640 2071 -3511 -3788 -680 3313 4227 -1159
691a159m244L606N615k09l775l248k51N289L746l971n532O49M479K588n65m901
707a883l230M236N524j371m790k112J362M490K479m254n195J614N032J810j998
722A714m104k176M513M964k277n266r15K476L854J332m291m927K728N538O33l554
738B42l083m14L624M521k824n567j53M036K613o6l706l821K822N490m35m344k244
755c309J212L468K702k583n355L76N226J678k027l184j999K859M979r92n150j814
771c913K851L202J151k684m416R69N145J523l454k926l96K853L889j083n256j039
787c584L740K785o99k601l153J094M988J181m245k576J007K784K647j628m499
802b759q01M476K474j920k854j607J343M489N26m534k230K241K952J125j928l772
$$ plain form
691 -1159 -5403 -1797 3818 3609 -166 -3414 -3665 1624 5370 1399 -4133 -3484 995 3583 3018 -1883
707 -1883 -5113 -877 4647 3276 -1514 -3626 -2264 2226 4705 451 -4744 -3130 1902 3712 1714
722 1714 -2390 -4566 -53 4911 2634 -2632 -3547 -1071 2783 4115 -176 -5103 -2375 3163 3796 242
738 242 -2841 -3255 369 4890 2066 -3501 -3654 382 2995 2929 -777 -4598 -1776 3714 3279 -1065 -3309
755 -3309 -2097 1371 4073 1490 -3865 -3489 1737 3415 1388 -1796 -3795 -936 4043 3051 -2099 -3913
771 -3913 -1062 2140 3291 607 -3809 -2840 2305 3828 374 -2552 -2948 -95 3794 2711 -2545 -3584
787 -3584 156 2941 2242 -359 -3512 -2418 2570 3751 -494 -3070 -2063 721 3368 1740 -2759
802 -2759 -3560 916 3390 1470 -1384 -2991 -1648 2841 3367 -1167 -3397 -1156 1796 2921 993 -2779
818b779m62M563K199k659k849o38K318K939J47m367j936K989L152l87k381k676
834b827J68M714J665l408l224J000K497K187o48l883j604L351L194j328k921j457
850b524Q79L611J303l541k998J687L128J153j558l061j013L378L012k040l373
865a957l44J770K551P56l659k515K189L368k2j871k525P9L155K279k437l461N33
882b111K580J806j77l164k278K559L244m90k869j376Q05K544K007k531l505R28
898b028L151J171j177k536j184K221L186j094l164r51J791K157P65k190l031J251
914a662L517L77k019k105K0K104K494j311l339k80K251J857j36k292k152J503
930a173L338Q3k659j561O12K239J666j453l537K35K777J448p97k248j274J584
$$ plain form
818 -2779 -3241 1322 3521 862 -1987 -2625 -307 2632 2779 -1588 -3524 -535 2617 2230 -151 -2827
834 -2827 -2659 2055 3720 312 -2912 -1912 585 2772 2124 -1759 -3363 -12 3182 1854 -1067 -2524
850 -2524 -1645 1966 3269 -272 -3270 -1583 1545 2698 1140 -1921 -2934 444 3456 1416 -1957
865 -1957 -2301 -531 2020 2776 -883 -3398 -1209 2159 2137 266 -2259 -2180 975 3254 817 -2644 -2111
882 -2111 469 2275 2098 -1066 -3344 -785 2459 1969 -900 -2276 -1471 1073 3080 549 -2956 -2028
898 -2028 1123 2294 1117 -1419 -2603 -382 2804 1710 -1454 -2405 -614 1543 2308 118 -2913 -1662
914 -1662 1855 2232 213 -1892 -1872 232 2726 1415 -1924 -2204 47 1904 1768 -524 -2676 -1173
930 -1173 2165 2248 -411 -1972 -1360 879 2545 1092 -2445 -2210 567 2015 1218 -1030 -2304 -720
946g20K932p8k916j516J435J934J293j881k805L42L161J221k023j856l01J542
962b36K547p62k993r11K244J906k17j642k094O49L189O11k284j860K84J902J665
979A998p93k867q10K840J591q01j834j221P37K662M42k199j969J330J905P36j082
996F65k278m77K707J880j747k066m40J167K262M3k605j508J870J904J38j440j820
1013a745K18K504J419k201j909L79J522J240L7k325j304K025K085q06j786r31
1029a578N10K126Q99k016j803Q50J822O52q33j823q41K350J636j055j928n00J167
1046c65J323O77j742j840R95K194J7j031j500k70J811J595j370j619j80J290J263
1063A248J04j901j288J339J862P9j624r31J44J593J223j497j841N20J318J064
$$ plain form
946 -720 2212 2134 -782 -2298 -863 1071 2364 483 -2322 -1980 1181 2402 379 -1477 -1778 -236
962 -236 2311 1549 -1444 -2355 -111 1795 1578 -64 -2158 -1509 1680 2291 7 -1853 -1569 333 1998
979 1998 1205 -1662 -2472 368 1959 1158 -676 -1897 -1160 1502 1944 -255 -2224 -894 1011 1747 665
996 665 -1613 -2090 617 2497 750 -1316 -1756 -589 1673 1716 -889 -2397 -527 1377 1515 75 -1745
1013 -1745 -1527 977 2396 195 -1714 -1335 187 1427 1464 -861 -2165 -140 1945 1139 -647 -1578
1029 -1578 -1068 1058 1957 -59 -1862 -1012 810 1462 629 -1194 -2035 315 1951 896 -1032 -1532 -365
1046 -365 958 1635 -107 -1947 -952 1242 1259 228 -1272 -1542 269 1864 494 -1125 -1305 -15 1248
1063 1248 1352 -549 -1837 -498 1364 1443 -181 -1112 -968 625 1848 351 -1490 -970 348 1412
1079A412n58j622j047J386K016k73j946o93P98J372Q47j250k117N71J884P68j250
1096B98j451j84J393J621p60k145k4J386R99J6j353j272O71J889K74j569q95J47
1114i59J294J294r93j750m4J469J027n72j146j153R31J757K23k023o72Q48J109
1131F40P39p94j862o5K004O01r96r91m73Q89J523j14j739p03R56J573k31p42j471
1150a256K95J770P28j502j030J85J003J126p50j239o96J662P40n62p95q10N25
1167f06J529L67j603j009Q44R41O77m28j617k84J428R14q05j020l32P02J103J73
1185I74j235q96Q85J099J29p53j186q9J456Q23r36j135j6Q97P05L29j389j216
1203a554J540J104l18r55p38J83J263N34q10j166K04J079O33l12j308m28J095
$$ plain form
1079 1412 854 -768 -1815 -429 1587 1314 -632 -1325 -527 845 1692 442 -1675 -1104 780 1548 298
1096 298 -1153 -1337 56 1677 917 -1228 -1252 134 1133 1149 -204 -1476 -805 1084 1358 -211 -1106 -959
1114 -959 335 1629 636 -1114 -1158 311 1338 766 -380 -1533 -602 1155 1378 -645 -1317 -469 640
1131 640 1379 585 -1277 -1342 662 1263 267 -724 -1197 -308 1215 1101 -638 -1341 -385 1188 957 215 -1256
1150 -1256 -961 809 1537 35 -995 -810 193 1319 569 -670 -1366 296 1036 474 -321 -1131 -606
1167 -606 923 1290 -313 -1322 -478 463 1140 712 -905 -1189 239 1153 348 -672 -1004 -302 801 974
1185 974 -261 -1157 -272 827 956 203 -983 -1072 384 1207 271 -864 -880 17 722 1051 -338 -1554
1203 -1554 -14 1090 772 -183 -921 -738 525 1059 249 -917 -713 366 999 687 -621 -1049 46
1220D6J090n46j100l98P66O54M89j029j126O31J337Q8r10o71j16R78Q75p36j138
1239h16OQ33Q35P3j232p35M21J549j68p82n61pJ072O74j020j048J69J010M38k92
1259D19p19n76O62J129k52r83p07O27Q80L76p03r78J96J169J60n37m71n05P04
1278a09J210l96j381RN71R05j60p61q10L13J284J48p93n87qO61Q50m29j144k12
1298h39J020M77j06o48p11M26J068J00j027p99P69P55m8j92j021O2J095L69m96
1317B54q01J21K80Q15j45q65l27N44P51o1k14j101L88P28M63o71p05j55N05R17
1337G21k07j056j56N98R04l25p62l02K27P54J74p24n23K25P08K96k79p50m9P05
1357A79M41l42p25j62K41Q42K03r70m76M15O75L22m13o46q8P14M94m49q29K6O25
$$ plain form
1220 46 1136 590 -510 -908 -142 512 1001 -28 -1154 -523 814 902 -8 -679 -795 183 1058 322 -816
1239 -816 -810 23 858 931 -301 -1036 -615 934 766 -16 -577 -584 488 1162 142 -906 -737 273 711 419
1259 419 -300 -876 -214 915 663 -320 -1027 -400 480 856 153 -825 -629 540 700 163 -308 -813 -109
1278 -109 1101 705 -676 -667 -96 809 649 -112 -922 -609 675 823 30 -557 -565 96 946 517 -627 -839
1298 -839 181 658 552 -96 -807 -381 687 787 -240 -1039 -270 485 437 245 -776 -714 381 750 254
1317 254 -547 -426 -146 669 524 -341 -668 -124 627 566 352 -749 -361 367 830 159 -546 -701 -196 721
1337 721 514 -542 -698 -100 804 479 -283 -585 -358 396 570 -154 -677 -452 256 552 273 -477 -526 179
1357 179 620 278 -447 -609 -368 474 677 -293 -769 -354 321 643 230 -416 -504 210 704 255 -574 -548 77
1378G7N77j82q54l37L57Q87J12p47m02M6P69K26n83o79L47M43K63L3p04o9L03
1399a17R84l18p20k25K24M75K25n50n97K89N97K81n31l42k20O10K40o1n92q2M82
1420E2L96j05n18m08L87Q34j99n03n70K25O01L67n43o23J59O08K78k37m02k50
1440d51L65O62o5p74m78N87N74P1k91p01N3P38L43n47l78j1L22M31j31m27l11
1461d19N40J86J29o75p7R0N18K25n07m90L16K98L26k05m24l22M71L80k74j82l30
1482d26L77M36O0n62k48P0M35q1L7n52M4M67K62j52l38o8J51O21k93n07k51P75
1504B57j5N6k51n87K43N26K35m56l46R6M75J01j24m95M7K41N12k80l72j40n7P22
1526C88n7m82k00L38J91L5k74m21J12M58J40k61j45k10K70L35L3l76k13K86K06
$$ plain form
1378 77 654 472 -382 -719 -362 525 637 -110 -512 -466 303 529 -54 -733 -386 57 320 353 -351 -420 -117
1399 -117 867 549 -171 -396 -172 303 528 -22 -619 -330 267 548 17 -325 -545 65 305 244 -348 -430 52
1420 52 448 343 -175 -583 -196 638 439 -64 -634 -409 192 559 16 -607 -448 160 438 201 -201 -451
1440 -451 -86 576 511 -263 -741 -154 420 491 200 -501 -448 290 633 86 -292 -303 19 450 319 -108 -419
1461 -419 121 307 436 -239 -316 -226 292 517 10 -480 -164 134 460 255 -169 -491 -20 360 86 -96 -426
1482 -426 -49 387 447 -115 -363 -293 142 61 98 -454 -410 57 319 167 -171 -239 -88 533 240 -267 -518 257
1504 257 242 298 47 -540 -297 229 464 8 -338 -242 233 334 210 -285 -238 3 515 235 -137 -277 -334 388
1526 388 331 -151 -351 -13 178 213 -61 -482 -370 88 228 -33 -178 -388 -118 217 250 -126 -339 -53 153
1547A53J87l21l40j13O31J95j86m62K2K13J75M5o11J76J72L24J20n06m3K9K15
1568G5K09l41l88J53N33j03n7k53r6K49L07j10m05J13K73k3R4l73j29J32L87j01
1590A46j10j81j10M67J6j96j09k36L76K25l88k38J52J08K93Ok94j27oL25J96j85
1612A30n64K43J16K84Om10j70K34M21p8k08m5k9K37P8l36k10O6K62K11l36j66
1634b64K05Q3M15m10k52NJ67R6K73m80j47J58L09Q4m20j49K22J35K40n1n15J5
1656b81N02p3r7k5l35L15K73k61j03O6j15K87r9R5l31m0K44K58j51j75k82M22
1678I4N5k1k60m5J64J87oj45k50M6K74J21k55j77j7L53l3Q5k12k86M04q4on6n2
1703a22J37J72J96n62j78K84L30pk63p4j10L06qQ1k95m9J79J53j03j47j66N09
$$ plain form
1547 153 340 19 -321 -434 197 392 206 -256 -234 -21 154 199 -412 -236 -64 260 380 -126 -169 -140 75
1568 75 284 -57 -445 -292 241 138 81 -172 -268 -19 288 178 -227 -114 159 136 230 -143 -272 -140 247 146
1590 146 36 -145 -255 212 228 32 -77 -313 63 288 -100 -338 -186 -78 215 221 -73 -200 -206 119 315 130
1612 130 -434 -191 -75 209 215 -195 -365 -131 290 212 4 -41 -70 167 245 -91 -301 -235 27 238 -98 -264
1634 -264 -59 24 439 29 -223 -218 -51 45 318 -162 -309 -151 158 242 -178 -327 -105 30 270 219 -296 -281
1656 -281 221 148 51 26 -309 6 279 18 -85 -19 -134 153 54 149 -182 -222 22 280 129 -46 -328 94
1678 94 149 128 -132 -177 -13 174 168 23 -227 -181 93 214 -41 -218 -235 118 85 170 -42 -328 76 -8 -14 -70 -122
1703 -122 15 187 383 -179 -357 -73 257 250 -13 -87 -197 109 101 182 -113 -162 17 170 67 -80 -246 263
1725B63m2k52j5k62J63L12j5l8k20j08J56J22l7j92p4K08K79j86j56r9K19K6p4
1748b2L4j92J46P8L23m03n6k9K42l9o8p1J16j46J72j81J40k47J30K09J48l13j82
1771b11M2N3M09l83J24k05J58R3J49m18j56M94l9P4l18L3J87R8j5j52k83K90j
1794B3N3j8M2j52O9K56j30j76p1K15o4K54l01j68Q9N3L45k15k45r9K52J35j57
1817a0k07OK37OJ24l63L6J95J9j11K6q4k9J56J47M2k53J28l04J34J74j42j46J24
1841i5K30N7l24P0J03o3J3M7q8J19J57P5m14Q2j1O7J10j8m2M2Q4j21J20j07k63
1866a70K62n2R1j75m8M1N2o9J71j40l3J08J70j83k03q6L34j70J12k23K0J56J55
1889A20j17j64p7L37J9j75M4j46K94j57J52k81m8K65p1J18j35O4J26l36K12jj45
$$ plain form
1725 263 221 -31 -46 -308 -145 167 152 114 -106 -214 -58 64 27 -165 -239 -31 248 62 -94 -193 26 52 -22
1748 -22 12 -180 -34 44 367 -36 -92 -121 121 82 14 -57 59 -87 85 -96 44 -203 -73 136 284 -29 -211
1771 -211 -169 -116 293 -90 34 -171 -13 80 229 -189 -345 149 110 184 -134 -101 86 184 169 17 -266 24 23
1794 23 76 58 100 -52 17 273 143 -33 -104 111 47 301 0 -168 -79 -26 319 104 -141 -240 12 147 -10
1817 -10 -217 -211 26 32 156 -207 -171 24 43 -68 -42 -126 -155 1 148 190 -63 65 -239 -105 69 -73 -219 -95
1841 -95 135 192 -132 -62 41 -22 -9 38 -50 69 226 301 -113 -31 -42 25 135 117 75 117 201 80 200 93 -170
1866 -170 92 40 131 -44 -92 -51 1 -68 103 -37 -70 38 208 25 -178 -264 70 -100 12 -211 -191 -35 120
1889 120 3 -161 -238 99 118 -57 -13 -159 135 -22 130 -151 -199 66 -5 113 -22 42 168 -168 44 43 -102
1912a02O6j47J41L06j29m04R0K99j1M2j12J10p3J30q3k81R1r1L12l7j93r2L3J59
1936B4P6k3j20j25J71j01J90k54j16N10k42lq4q7J79J07r8K8P6j96Q3K7Q1k15
1960a12K91k71n2K41l05K06k41L52l29O9J52Q6j53K10j97lL9k20K95k51K13j33
1982a13J07Q9pjj53K69j68j10N0j07J18M4j37K11P1j42rL6j72K53j40K03k33L9
2006bj2q1j9K02J05k11l3j06K37j04Qj40%K05j35P2k0oK32k02Nn6J58k57L33J22
2032B95k98O0k9P8m0j10L6n4L9m4O4R1k59K50N0n4q8J6j27N9O1o6j9P8P4O9j64
2059c2j05L15j30J17p6q4j40J83M1O0j89J54k42J07pR2p4k6K66j34Pm08K52m6
2083i9j0J14J71k52j23J84j31k5J13L0lj03J74r2l2K21P4q0j45q7J30q5L5L1m7
$$ plain form
1912 -102 -36 -183 -42 264 135 -269 -179 120 109 151 39 149 76 206 123 -158 -67 -158 154 117 -76 -168 -135 24
1936 24 100 77 -43 -168 3 -98 92 -162 -278 232 -10 -13 -97 -184 -5 102 4 32 108 -88 -5 22 103 -112
1960 -112 179 -92 -144 97 -208 -2 -243 109 -220 -151 1 87 -66 144 -53 -56 -17 -237 58 -193 20 -113
1982 -113 -6 83 76 75 -78 191 23 -87 -37 -144 -26 18 -119 92 163 21 12 48 -124 129 -11 192 -41 -2
2006 -2 -14 -95 -114 88 193 -18 -51 -157 80 -24 -16 -156 -156 49 -86 -14 -34 -40 192 -10 -5 -61 97 -160 173 295
2032 295 -3 57 28 106 66 -44 -8 -62 -23 -67 -3 88 -171 79 129 75 -13 3 -124 -65 -4 -70 -89 -11 63 132 -32
2059 -32 -137 178 48 165 89 5 -135 48 89 149 -40 114 -128 -21 -28 64 -10 -36 230 96 103 -305 -53 -99
2083 -99 -109 5 176 -76 -199 -15 -146 -171 -58 -28 -31 -134 40 -52 -84 137 211 131 -14 -101 29 -56 -21 10 -37
2108c7o6M3l7q2RJ57R4P4j39M3J69j24Q7k42O5k1J49n9r9n9o4J54p4m8J12j40
2134a35m0K72K5k09J30O9j59J09j62J76k30J08o5K31j94j70K48l0N6N5k39Q7J85
2157A18j40J07r4j53J73n8j12P5r6L38j52o5j1K81l43J39Q7j71j75P5L5N5J94
2180A07l08K08J63j72j01J41k9m8j6O5K0Q3k72K05m4o2m4L41j65j49J38N0j06
2203EJ4R8k20l9J97k69L95l72R0J75RJ1j54K28j27k9p6N4j27J1q3K38J03j06r7
2228g1Q9j19J24j22K8J44k2j23k7M7j08K22p7o6lJ87J24m0j72k2j09L0J91j34
2252b9J27j30K10l9K3k10n5M6L40k37j46J59J06k05R5O1j20mr7K77k5O0k15P8
2276G0j59J09q8r4M5L34%k3j63kJ02j7Q6j46j88L8M3N1K28k82Q2rNk2j95J44j
$$ plain form
2108 -37 -103 -60 -97 -179 -170 -13 81 155 16 59 228 104 191 -51 14 -7 142 83 -16 -75 -139 15 -59 -107 5 -135
2134 -135 -175 97 122 -87 43 112 -47 62 -100 76 -154 -46 -111 120 -74 -244 4 -26 30 85 -154 -67 118
2157 118 -22 85 -9 -162 11 -47 -159 -84 -180 158 6 -59 -70 211 -132 7 94 -77 -252 -177 -142 -87 107
2180 107 -201 7 170 -2 -103 38 9 -39 -55 10 30 113 -159 46 2 -60 -104 237 72 -77 61 111 5
2203 5 19 117 -103 -142 55 -214 181 -191 -101 74 83 94 -60 168 41 12 -64 -10 -137 -126 -209 29 132 26 -71
2228 -71 18 -101 23 -99 -71 73 51 -72 -99 -52 -160 62 -15 -81 -84 103 227 187 15 -7 -116 -86 105 -29
2252 -29 98 -32 178 139 162 -48 -103 -57 283 46 -100 59 165 -40 55 116 -4 -8 -105 172 147 207 -8 70
2276 70 -89 20 -68 -162 -117 217 217 194 31 29 131 114 200 54 -134 -96 -53 -2 226 -56 26 17 22 0 -195 -51 -52
2303e2J20k94J20O0KJ62p0mk6q2K3K07m1j51p3O3Q6k77P5L55p8J16j57L8k15J1
2329h2J84K8l6k15J79L2l9n5r2J78l4J22j32k71J49R7M2o6p6k8J00k7M1n7P7J1
2355C0jlk2j8p4J82k8p5k00K69j1j7L7j4K4k57L16j39L3j34L95k42j52J22k21
2380b00J08J53N8j34J70L5q5P0o8k98J85K01k68k3J5K18m8l05L82l59J57J79m7
2403I6P3j46O5j29P2J42l39J51J1j9N7L1r7p6J75j73J65q4j33Q7P3J14j59J7O
2428b0k56L32j2j20J67q0R6J00k29j28J12j30M66j19k42J78l09J77R8j39k7o6
2450a51oL09j92n1o9L51q5j49J41j77J60j49K28k30J17J90%p1k13j09K86j55J22
2473I7l7k12L65j25j65o2J66j31k9O5J84K2n4j11k49L55q8q1J31j16J16m7j53
$$ plain form
2303 -52 68 -226 -106 -46 -44 118 48 44 18 -64 -41 166 125 -26 -99 -36 50 -227 -152 203 125 241 84 122 -93 -82
2329 -82 102 130 94 -121 58 90 51 -4 -96 82 48 170 38 -233 -84 13 55 -11 -87 -115 -15 -42 -1 -58 19 30
2355 30 29 26 4 -14 -88 94 66 -9 -209 60 49 32 69 55 79 -178 138 -1 32 -102 293 51 -101 21 -200
2380 -200 -92 61 119 -15 155 190 105 175 107 -191 -6 195 -73 -96 -81 137 89 -216 166 -193 -36 143 96
2403 96 169 23 88 -41 31 173 -166 -15 -4 -23 34 65 -32 -108 67 -106 59 -25 -158 -71 2 116 -43 -26 -20
2428 -20 -276 56 44 -76 91 11 107 207 -22 -150 -38 -168 298 179 -63 115 -194 -17 81 -58 -85 -151
2450 -151 -157 152 -40 -91 -160 191 106 -43 98 -79 81 -68 160 -70 47 237 237 166 -47 -156 130 -25 97
2473 97 60 -152 213 88 -77 -139 27 -104 -133 -68 116 138 84 -27 -276 79 -9 -90 41 -75 41 -6 -159
2496a59P8J42j40N1O7j72L37j52j2J1o7J21J82j76q3o6r9K83k05o1J39K4o7Qj3
2521b9O7p1o1kK3N1o9l5J52L1p2r3n3K93o4p9Q8k70J93J06k23Q9O5j00L03j23
2547A17k34K56q2R7j15r7Q6l3J57L0j21N3j90o3L03n6j21rk9j52K79p8j01N1J53
2572A01Ro9M2k20J65K00l09J03q3J21P5j12j1n5m6J48O7j34n7K13j43q0J5j0K5
2597d5L01k08q0J37r8P5PK9j41QK5P4o3l4j44J48p7k54J49R2J72J04j20j25Q6
2622A8q7K66m1j70O5k49L10rk45K70k51nK32Ql79M4J20QN8Q9K0j23J29k07L7j1
2648a03J40j87M11j62o8L1j18n8J38j4k06L6K58N8j49k84J76J07J37O1j97%J13
2671A20j49J1j11P1L6K7PK0j06n2J43J65j00l97L38J10J8j44j69M3K76k07L6j77
$$ plain form
2496 -159 -81 61 -79 -28 39 -133 204 52 40 51 -16 105 287 111 28 -38 -137 146 -59 -120 19 43 -24 -16 -29
2521 -29 38 -33 -94 -96 -73 -22 -91 -126 26 57 -15 -108 -161 132 68 -11 77 -193 0 106 -117 -28 37 -63 240 117
2547 117 -117 139 57 154 39 -58 28 -5 152 182 61 114 -76 -139 164 108 -13 -22 -51 -203 76 -2 -103 -52 101
2572 101 110 41 83 -137 28 228 -81 22 -61 60 135 23 12 -43 -89 59 126 -8 -65 148 5 -75 -60 -70 -45
2597 -45 256 48 -32 105 7 82 89 118 -23 -15 10 84 21 -13 -157 -9 -86 -340 -191 -99 73 177 57 -68 18
2622 18 -69 197 156 -14 51 -198 112 103 -142 128 -123 -128 104 112 -267 -223 -103 -95 -37 52 72 -51 78 -129 -92 -103
2648 -103 37 -150 261 99 31 62 -56 -114 24 10 -196 -160 98 156 7 -277 -101 6 143 204 7 7 120
2671 120 -29 -18 -129 -58 -22 5 12 32 -74 -126 17 182 82 -315 23 133 151 7 -162 -119 157 -50 -14 -191
2695a91J52r2J44J29k83J49l42M23j44q1J06LPJ78k37K7l2J92qJ10k96O0L8J78
2719A90j58k3j66N2J64J68k43L4j37J00J89l22L4Q3L0J72j90o3l4J09n7n9j0J11
2743b6QQR9j33p6J30M3r7Q2k72J89J3r9K72k61j48J79q7K06Q7N1k95K9J03j19
2768a14J53o2M7pJ0P5pq7K19l68K27n2r6L9j62K92j54N0R6n8M8j49K3K4j2J68
2794A43m3k09j41J69K65k54K1Ok7J82O2k86N1J35p0Mj75K05j90N4J38M2j11j21
2818a50M7L56k17ON4m5O0N0j39O0j72P3J63j51j17J90N7p6K06j84j83J45R1M1
2842A65j53N8n8j39L99n38K11l4L1J21j17J5Q4j03M2kj83l0L58J14j77r9m0J68
2866I3k2L9j28J0j26J65o9l8K53j60J84j04o9k5j47J27J77r0p9J15j06K1P2k16
$$ plain form
2695 -191 -39 -131 13 142 -141 8 -334 89 -55 -136 -30 -27 -20 158 -79 -52 -84 108 100 210 -86 -26 12 190
2719 190 32 9 -157 -105 59 227 -16 18 -119 -19 170 -152 -118 -35 -5 167 -23 -86 -120 -11 -68 -127 -137 -26
2743 -26 -18 -10 89 -44 -120 10 53 -44 38 -234 -45 -32 -131 141 -120 -268 -89 -176 30 117 168 -127 -98 5 -114
2768 -114 39 -23 24 17 27 102 95 8 227 -141 86 34 -62 -23 -185 107 -47 3 99 41 89 -60 -37 -13 -25 143
2794 143 100 -109 -250 -81 184 -70 -49 -43 -70 112 174 -112 -61 74 4 8 -167 38 -152 -98 40 82 -29 -150
2818 -150 -103 253 36 42 96 51 111 161 22 82 -90 -17 146 -5 -122 68 125 49 255 71 -112 33 124 165
2842 165 12 70 12 -127 272 -266 -55 -89 -58 63 -54 -39 45 -58 -16 -18 -201 -231 127 241 64 -35 -75 93
2866 93 71 110 -18 -8 -134 31 -38 -76 177 17 201 97 28 3 -144 -17 160 70 -9 106 0 21 93 -123
2890a23J02q6K54J06k65M7j26J52Q0k18O9R2j50l7M5P5j82Q7Q9l0R7j79J28P0
2914I7r3k1m3L0LK6k6k8mJ17K68m02J86j38j04K6L27k26L8k95J47J67o1Nr8L64
2940B62j17k1l67R3L10k69K32k41J26o2J62j39NR9k53J65J8J5k94L26J82k22j1
2963aq4J0P6N0j13q9K52j30L0K97l00n3J4K88k05j98p7J98J5J10j21rM2K7k4P2
2989G7%j4L0j3K13l51N0j11K8J79p2r0j8J41L2r9m8K00j51Q6j58K1p8p2J24J92
3015I8j05n2q6N2J53j07n8LJ69k37J64j20K43j69K41k53p0K25n9M2r1n0J27r4
3039c4J0k3k1O8J6m7pK17j15j71PO6J87l39P1K03l3J81k64K0q5J04K37j05l05
3064a62j2K79k0M5j18j27Q4J45qj23p4L7J42k07J89j69L6K0J2JP0o0j22K10J47
$$ plain form
2890 -123 -21 -107 147 253 -12 35 -91 61 141 -77 -8 84 -66 -103 -58 17 -165 -78 11 -19 78 -101 27 97
2914 97 4 -17 -60 -30 -27 -1 -27 -55 -59 58 326 -76 110 -28 -132 -106 221 -5 33 -262 -115 52 -9 -4 -102 262
2940 262 145 124 -243 -150 160 -109 123 -118 8 -54 108 -31 -26 73 -180 -15 3 18 -276 50 232 10 -1
2963 -1 -85 -75 1 51 -62 -151 101 -29 1 298 -2 -55 -41 247 42 -156 -233 -35 -20 90 -31 -40 2 29 5 77
2989 77 77 63 93 80 293 -58 -8 -119 -91 88 16 -74 -92 49 81 -18 -66 134 -17 69 -89 -68 -146 -218 -94 98
3015 98 -7 -59 -145 -93 60 -47 -105 -102 67 -170 -6 -126 117 -52 189 -64 -134 91 32 74 -17 -67 60 -34
3039 -34 -24 -47 -68 0 16 -31 -38 179 64 -107 -100 -34 153 -186 -115 88 55 236 -28 -8 -93 11 248 143 -162
3064 -162 -174 105 85 130 12 -115 -31 114 106 -17 -91 -54 88 -119 70 -99 -63 -43 -31 -30 40 -20 -142 68 215
3089B15j72q8R6L3j55q8L2K04j41J81k80O5J45Kq9Q6j38K62o5k8r4p8K25j33j5
3114a8J5j43J34j21J68m8J34l34J00J51J43l00K1M4J47Q5p2k02q6J71M5j24J02
3137A2m9N6k5O0r5K7p4N8L4kK15k38rK25k54j28K41M7L5k26kJ88o2J39J00k39
3163C4J0k42K98j32j21K13j00p4K40j58Q3n4K14j46j99mL9J22j10J37J8l09J96
3186d5P8J39q9j73mK7J93N6l9j16j14J5O2MP4j04N8q8K95k24N0j20J71j79J26
3211E3j13K3n1J65Q5k82J61j69K25j73N9j23J98Q4l71J34P6j6R4j07M4j21M0K6
3235e9M9O7Q1K5P5l11J28Q6mj96J02J11j67p5k8J65r1K52l79K03L7qk58N8J03
3260c4K26j45M1j35J07M0k3j33J5l0J25j09m3J96k02O7O0pm9N5j10K06j42k54
$$ plain form
3089 215 43 -45 51 84 -71 -159 -127 77 -64 117 -163 -98 47 49 -40 46 -92 170 105 77 -17 -95 130 -3 -18
3114 -18 -3 -146 -12 -133 35 -13 121 -213 -113 38 181 -119 -98 -54 93 178 106 -96 -182 -11 34 -90 12
3137 12 -37 19 -6 54 -41 -14 -88 -30 4 2 217 -21 -30 195 -59 -187 54 101 136 -90 -92 96 34 173 273 34
3163 34 44 -198 100 -32 -153 60 -40 -114 126 -32 51 -3 211 65 -134 -138 -99 23 -87 50 68 -241 -45
3186 -45 33 172 83 -90 -94 -67 126 182 143 27 -87 -72 -10 -6 68 -36 22 -66 229 5 55 -65 106 -73 53
3211 53 -60 -37 -88 77 162 -120 41 -128 97 -76 -17 -140 58 142 -229 -95 -19 -35 59 -48 -4 -125 -85 -59
3235 -59 -10 57 138 163 238 -73 55 141 137 -59 43 154 -13 -88 -116 49 -42 210 -169 34 71 63 -195 -137 -34
3260 -34 192 47 88 -47 60 100 77 -56 -41 -71 54 -55 -98 98 -104 -37 23 16 -33 22 -88 118 -24 -278
3284b78L78m9k9j4J33j40m6P5j69J90j25J3qJ34j12pJ7K6k22J53J63j55J66o7
3308B7l9K1q1j92J88J73k07J31N3k4m7K11k01p2n0J43J7N1o6n7m6J21P6J6k19
3333g3o2K42j21K09l18K36q3n0N7j06J17M7j14j22J31p1M3j43K46L7k42J92L5
3356H7r8J72l59K18l3K58n46K82O6LK0j85K50k20K02k25M4Q8N9K0P8r3k17J27
3380bK10k38O7j30r1O6K62J0k27R7j10j26L14P9k51R6j0o8J32k26j2J43j40R1
3404f4J17J4r5N2J23k42J48j1P5m9j45J0qj66J20K88n2k56P2l0M5J2o0J54O1K0
3430A33j57o2p9Q3J51Rn7j35J07J2J04J29k90J45j43M0Q6j85J89j25l4J01J17
3453A39j04j0M7j83N1j19M1L81l50j16K16j10O3K39j54m2k00K14p2j06J88p0R2
$$ plain form
3284 -278 100 51 22 8 141 1 -45 30 -139 51 -74 -61 -69 65 -47 -54 -37 -11 -233 -80 83 -72 94 27
3308 27 -12 9 -72 -264 -76 97 -110 21 74 50 3 214 13 -59 -109 34 51 102 36 -21 -67 54 130 146 -73
3333 -73 -135 107 -14 195 -123 113 30 -20 37 -69 48 95 -19 -141 -10 -81 -38 -181 65 102 -140 52 87
3356 87 -11 161 -198 20 -13 245 -301 -19 47 50 70 -115 135 -85 117 -108 -64 24 83 103 181 88 -129 -2
3380 -2 208 -30 37 -93 -184 -118 144 154 -73 24 -86 -212 102 181 -70 26 16 -52 80 -146 -158 -15 -155 -64
3404 -64 53 67 -28 24 147 -95 53 42 117 68 -77 -67 -75 -241 -121 167 115 -141 -69 -99 -54 -42 -102 52 113 133
3430 133 -24 -86 -165 -82 69 78 21 -114 -7 5 109 238 -52 93 -50 -10 76 -109 80 -45 -79 22 139
3453 139 35 25 72 -111 -60 -179 -138 243 -107 -223 -7 -117 -54 185 31 -11 -211 3 -69 -175 13 -57 35
3476C5l4J21J8j38L7oj59J86o9J50k50K15j11L6k57Q7K40m9M3j32K18K8j64r4
3500d9L07k49J56L5l25J03J30r8j7j01k4Q2L1J10o9rK15l09J21R6k22J42j01n8
3524a03L1J49r8j3k81K92J50o5p8j52R5OL3J9K08p0j45J8J5j3Q9k8j15M2q8l0
3550a32J90k38J46l4O8j50J56L8n5N8p7J71l00p7J73O4KJ18k71l8J32n9J69j80
3574a26J09j0J34q0j75J19J18J3j72J37j55J02o4K56k42%j24J75N5r7j04O4J64
3597I7Jo5j09J26r8K28j43m6MN3n8l0Q6j88N1J52q0O1klo0kJ14o2k85J89pJ77
3625A01n6j69L1J21j01n9J98k24J69j24J71j72Lk0R1r4m3J75jj05N3q0J90j40
3649h5o5K81j66R9j63J4L1p3M5J31q8Q9j88Q9jJ92l7n8O4j89L5q5Q2l0L3PK9m2
$$ plain form
3476 35 1 122 140 2 39 33 -126 60 -9 141 -109 106 -5 31 -226 -139 101 52 95 -37 181 209 45 -49
3500 -49 258 9 165 200 -125 -22 108 10 -7 -108 -132 -50 -19 91 22 13 228 -81 40 136 -86 56 -45 -103
3524 -103 -72 77 -21 -34 -315 -23 127 62 -16 -168 -73 -67 -34 -15 193 123 -22 -4 11 -2 87 59 -56 -14 -102 -132
3550 -132 58 -180 -34 -68 0 -150 6 44 -11 47 -30 141 -159 -236 -63 1 3 121 -150 -188 -56 -115 54 -126
3574 -126 -17 -27 107 27 -148 -29 89 102 -70 67 -88 14 -50 206 -36 -36 -160 15 70 -27 -131 -67 97
3597 97 98 33 -76 50 -48 180 37 -9 -5 48 -10 -40 46 -142 -91 61 -19 42 40 37 -23 -25 89 27 -258 -69 -76 101
3625 101 45 -124 -93 28 -73 -132 66 -158 11 -113 58 -114 -111 -131 -40 -134 -177 -2 -3 -108 -55 -135 55 -85
3649 -85 -150 131 -35 64 -99 -85 -54 -127 -82 49 -39 50 -138 -49 -50 142 105 47 111 -78 -43 -128 -46 -76 -43 -36 -7 -49
3677d9M6m1m4R1P6j04J4q8j34K75K3j25r7K45J05k68L1j21O9r9L38j12j55J78
3701E4r6r1Nl2L20j71N9j14J18j92K62k62J98j69N8j8l0l6K61O8k70J22j84J75
3725C5J28j97L3q4L2j04J64oj34L62o3k56j4K80k16n3J61j21k7N8N7j1n7k25K45
3750a3J51j68k0N0%p7J81k84L13j2k09J92k39R5P2n7J1K8o9O8j49R7o0O7J3j58
3776a77J26J30j19J22k81L25j46o4j00J26O4M8K7j77J54r8n2J03j20J47Oj9j07
3799h2M6J30M1k48K14j69P4j34K03q1J4J43j80J32r9J55l61J06O4J02j34N7k4
3822c1j12J80O7j86m9K62j08J2j36L8j6%J67k09J4rJ24J41k88M2P7Q0q6n0o3J20
3848a9j5K17k58O5r7J06j13J04l6Q6l1j53L11j11Mj76J44M7j89j34K07j06R2O4
$$ plain form
3677 -49 -3 -44 -88 3 79 -25 -11 -99 -233 42 65 -60 -157 88 193 -75 -44 -165 -96 -195 143 31 -124 54
3701 54 -42 -133 -128 -160 160 -11 48 -66 52 -140 122 -140 58 -111 -53 -71 -101 -137 124 192 -78 44 -140 35
3725 35 163 -34 -1 -85 -53 -157 7 1 -133 229 166 -90 -104 176 -40 -93 68 -53 -80 -22 35 24 -33 -258 -13
3750 -13 138 -30 -50 0 0 -77 104 -180 133 121 -88 104 -135 -40 32 -25 -14 14 -55 13 -136 -39 -99 -32 -19 -177
3776 -177 -51 79 -40 82 -199 126 -20 -84 -184 -58 6 54 81 -96 58 -40 -92 11 -109 38 44 25 -82
3799 -82 -36 94 135 -113 101 -68 6 -128 75 -6 8 151 -29 103 4 159 -202 -96 -32 70 -64 -7 -31
3822 -31 -143 37 104 -82 -131 131 23 35 -101 -63 -79 -79 88 -121 -107 -116 8 149 -139 -97 -20 60 -26 -76 -139 -19
3848 -19 -34 183 -75 -10 -107 -1 -114 -10 -46 40 9 -144 167 56 60 -116 28 75 -114 -248 -41 -147 -55 9
3872Ij25P2l3K04j61J70k05M5KJ18j69j21J93J04j90J2J7l4J74o5j95K15K0k21
3896a64J40K7N7K1j1j33m1Q9o7P3J1M0o5K13k82P5l3k0M6Q0j8q2J52j17p4P4J4
3923Ejr1R1J80j71r3J56m5j59K72J4o4k71K8J94K2J4L2k7m5q9K14q9k9K7L2j99
3950i2K65j96J03j33P8O7j5k15J18J93k95J38r9J9K58m6p8j40l2J58k0l5J56m06
3974b49K07P9J24k0j84J34k56K23q1J97k22N5l8P2j9q5o2J21nK7m9r9J98j9J6
3999F5M0j24O7J1k06J45o4K31JP2j06k40K5K13j93M7k2j5j20M5L03p3R6k26K08
4024A80j33n6p1l3M4M0l0L5J22j26m4J32p7j90N4K09j0k9q3J07j93J58k4j43l0
4049a91K27p7J47k54K04m6J70q4n0j97J61K0KP3l0o4N4k42R4k0J29J5j61K74j07
$$ plain form
3872 9 -116 -44 -77 127 -34 136 -69 -24 -22 96 -73 -194 -1 103 -87 -75 -58 -92 82 17 -178 37 57 -164
3896 -164 -24 3 60 81 70 -63 -104 -15 -82 -9 2 42 -23 190 -92 -17 -50 -70 -24 56 38 -44 108 -9 -83 -9 5
3923 5 4 -87 4 184 13 -80 76 31 -128 144 158 94 -177 -149 45 67 81 113 86 41 -48 166 77 48 75 107 -92
3950 -92 173 -23 80 -53 25 92 77 -138 -20 173 -122 16 -83 -64 194 148 70 -70 -102 56 36 1 157 -249
3974 -249 -42 37 161 141 -43 91 -165 58 -23 174 -48 7 -31 41 22 -63 -125 -4 -9 18 -31 -130 68 49 65
3999 65 105 -19 48 59 -147 -2 -66 165 166 238 132 -108 -83 130 -63 -16 -38 -53 -173 -128 175 102 198 -28 180
4024 180 47 -9 -80 -113 -69 -29 -59 -24 98 -28 -72 60 -17 -207 -153 56 46 17 -66 41 -152 6 -18 -161 -191
4049 -191 36 -41 106 -148 56 10 180 96 46 -151 10 30 32 105 75 11 65 -177 -83 -103 26 41 -120 154 47
4074D7lk5q9k5Jp3L6L24l0j83K80k76j9K6k1q1K81j34m3j55k4K50r7j39L0J04
4100c8n0K19m7N8j84O8n0L52l03N5j31N1L7k11K35j31k3J42j00NQ5j23j04J65
4124b3K9j17Q3n2J80k09J69q9Q6m9J2o1P4K13k31j23J36J01k01L43k98K4op6N5
4149c0K9R4j61J11p0P9J5j33k07L53k00N7Q6L8pj03J09k5j42m8K39j30P2Q9k41
4174a26m7R9J69k82J39n4N3N5L1j09J56j70K42j64p5M3j48J23P8J57l56L6J53
4197CK31k97K4q7J9J69k84J69l6K53o5j60K16j81Q3j75J45%p6R6j0R3j82L7m8
4222f3J60l8j26J64j83J24J05j01M6j5O8j49j3Q0K5j28o1J75q1j78K53j77K08
4245I5j06j33J81M1j21k0J30k78J15J30m3n1J63k14Q3k3L35j73k91O7l5j0R0J59
$$ plain form
4074 47 44 19 -70 -95 -94 -167 -131 193 163 -20 260 -16 -35 -9 -30 -111 170 36 -7 -162 -186 64 -33 -172 -142 -38
4100 -38 -88 131 84 142 -42 26 -24 328 25 80 -51 0 37 -174 61 -70 -93 49 -51 -46 39 -84 -188 -23
4124 -23 6 -111 -28 -80 100 -109 60 -29 57 8 20 -41 33 246 15 -108 28 129 -72 271 -27 -3 -9 -85 -30
4149 -30 -1 93 -68 43 -27 52 67 -66 -273 80 -120 -63 23 61 54 -49 60 35 -107 -155 84 -46 26 115 -126
4174 -126 -173 -74 95 -187 -48 -102 -49 6 37 -72 84 -86 156 -8 -83 -40 -188 -65 13 170 -186 -150 3
4197 3 234 -63 -39 -126 -107 62 -222 -53 -89 164 99 -61 155 -26 57 -118 27 27 -49 47 37 130 -52 -15 -63
4222 -63 97 59 -67 97 -86 38 143 42 88 73 141 -8 -21 59 84 -44 -105 70 -11 -189 64 -113 95
4245 95 -11 -144 37 78 -43 -63 67 -211 -96 34 -9 -60 103 -111 -28 -51 284 111 -180 -113 -148 -158 -68 91
4269I1k08J18j15J28j36J44N8j67K98j32QL2j34q3O0l7J17j62K86j94J2p2L20
4292B32k73P7R5j97K08k33j04J20O0J57k9j85L7q3P6q7K67r6j16J59o7J0K7j06
4316e1QJ28l9j5O3j27J30j43R4j32Q2R4J9l4k62J71K1j51N2K5K4J35k47K20j49
4341h4J4j06K78j21n7O8j19Q5M7N9M6j25k8j36Q9P1J44l22J89M0L9j5j63K7Q2
4366BJ56l28J03R3o7J44k28K55k03K57k84m6l6K91k57J6P9K5j41L0Q8K6P1j91
4390a45K95k07m2N4L7N9j52K25mk0k1j01Or9M8j09K88k95J84qj72J92k2j17J2
4415a14K19k2l75K63k6jN0K40k35r4L4K7o9J22J60k37J51q4J83k45K1p2o5J18
4439e1O5p2K05k23K03r9j00j02MP3J47j23j2l7O6J43j08r7J34K6j19J82n2p5P9
$$ plain form
4269 91 -117 1 -114 14 -122 22 80 -87 211 79 87 119 -15 -98 -38 -75 42 -120 166 -28 -16 -88 232
4292 232 -41 36 131 -66 142 -91 -195 -75 -15 142 113 -72 -35 -118 -42 -129 138 42 -74 85 18 28 55 -51
4316 -51 -43 85 46 31 94 -33 97 -46 48 -84 -2 92 111 77 -185 -14 7 -144 -92 -67 -43 92 -155 65 -84
4341 -84 -70 -176 102 -19 -76 -8 -127 -42 5 64 110 -15 -43 -179 -90 -19 125 -197 -8 32 71 56 -107 -80 2
4366 2 158 -170 -67 26 -41 103 -125 130 -73 184 -100 -146 -182 109 -148 -132 -53 -28 -169 -139 -51 -25 46 -145
4390 -145 150 -57 -99 -45 -8 51 -101 124 120 100 79 -22 -16 -115 -67 -176 112 -183 1 -7 -179 13 -9 -126 -114
4415 -114 105 83 -292 -29 -55 -56 -6 234 -1 -95 -61 -34 -103 19 179 -58 93 9 192 -53 -32 -104 -169 -51
4439 -51 14 -58 147 -76 127 28 -72 -174 -170 -97 50 -73 -85 -122 -56 87 -21 -118 16 42 -77 105 53 -22 57
4464E7J33l53K51N5k61J89k00J29Q7k48K00Q2j30J09k21K02j9Rj91J31j14J36
4486C3L3o7q2J26JN5J9l67K43R5J00q7k88Q9j3J50K4j50n3J66N0j0O1m6k46KJ26
4513c6K7J05j7j02K28k24L4J14J78l92J59N4j47j58K04p6mJ19r6j5J91k76K18
4536H8j21k04L59k6j89J67L2N2j9J10k43jR6j80o3J89j16J01k55J89P0l9k6l8
4560f7P9k4JJ8J7k27R5M7j52J24J96q2J15n1k51L04j32k3J7k5j2r5J54j25Q6q
4586b1J47j70q4j12J78K4o1L6j78J99M8P0p2n4J19q9K3j50K60k64P6J45j24LO1
4611A0j66K38r4k53K00j03K44r3K4L6J7j87J96J09j09k44K63q7O0j59K9N1J0m0
4635d8J44j25l9J89k31K20k5j41J15j9MrJj32J82j4N8l17K73Q1k29n9l9J70Q2
$$ plain form
4464 57 190 -163 88 143 -118 71 -129 0 87 -161 39 121 -9 100 -121 81 62 71 -120 11 -103 33
4486 33 66 -1 -83 43 44 99 118 -249 -6 89 189 102 -186 -97 -110 40 64 -86 -139 27 77 67 128 82 -164 -162 -36
4513 -36 -9 96 79 -23 205 -19 15 129 307 -85 74 128 -19 -177 27 -49 -53 66 -30 -45 146 -130 88
4536 88 -33 -237 122 96 -93 74 106 158 139 249 6 5 101 -79 -142 47 -69 32 -223 -34 36 -3 -29 -67
4560 -67 12 -12 -11 7 24 -203 -108 -61 -213 -89 107 25 140 89 -162 142 10 -13 4 -21 -33 -128 26 -99 -13 -21
4586 -21 126 -44 -128 -240 -62 -38 -99 -63 -241 -42 6 76 4 -50 69 -20 3 -147 113 -151 -75 70 -54 -51 10
4611 10 -156 82 -12 -265 -65 -168 76 -17 7 43 60 -127 69 178 69 -175 88 1 61 -98 -69 -18 -8 -48
4635 -48 96 -29 -68 121 -110 110 85 -56 59 40 44 35 36 -96 86 72 130 -187 86 167 -62 -121 -160 10 92
4660I2J18k00O0m3o8P0O0O2l62K06o7L8O3K7k12J60J28j38J64k91P0K38j57n0
4684c2Lj8n7J34p5Nk37L57J50k70OP6L6l16L33o5l0J7P8j34J53j43r0J02J1j17
4710a23M3K01q2j44L40l53j7L98j16k41K4R3j20K14J9j24j51J2L01j77j66O2O0
4733d7m5K20j51m0K44j14k64K37l0j71J08N1j7O5O0j52J06Q4k50L02k05L3j5J3
4757B2N7L2j83kJ40q5k1O5l5L7l1L3J61j5J56n42K43m9p4J59L5l16K38K88k07
4782A06m2o4OL4J08o5p4k5L0k6L34l45J00Q2j08L1k4j39K31k40J67P2j24l0n5
4807f0K31k43J00O2k6p4p0J49r4RQ7k04K20j54R4N1n7k8L3r1j23K64n1J52j8k35
4833g6J02R3j80Jo7J24n0o6J98k2j81R8J14j1j70LK46j49K37k83P0j02R7j70J70
$$ plain form
4660 92 210 10 70 27 -41 29 89 151 -211 -5 -72 -34 29 56 -156 4 132 -6 158 -133 -63 175 18 -32
4684 -32 -29 -47 -104 30 -45 -40 -277 80 230 -40 -34 42 78 -238 95 30 0 17 95 -39 114 -29 -119 -17 -6 -123
4710 -123 -80 121 39 -105 235 -118 -135 263 147 -94 -70 23 -97 117 136 12 -139 -127 174 -3 -169 -107 -47
4733 -47 -92 128 -23 -63 181 67 -197 40 10 -161 -53 -2 -19 46 106 -46 60 144 -106 196 -9 24 9 22
4757 22 79 111 -72 -74 66 -19 -40 25 -10 27 -4 29 190 175 331 -211 32 -17 -91 68 103 -213 25 313 106
4782 106 64 0 6 40 148 83 9 -16 14 -12 322 -23 77 159 51 82 58 -81 150 -90 77 149 25 -5 -60
4807 -60 171 -72 28 90 64 -10 -80 69 -25 -16 71 -133 87 -67 27 78 21 -7 26 -65 -188 76 25 177 159 -76
4833 -76 26 119 -61 -60 -127 -3 -53 -119 79 57 -124 -26 88 77 -93 -90 156 7 244 -39 31 -71 26 -144 26
4858B6j18Q3L0Q9j24P9p0j99J10J06J6j8J6q8jM1rQ6P4lj10Q7Pj42R3p2M0oP7
4887A00p5L6j16L4q2O3L7J19k26J04pJ07pm5M2p1P3k3r0K46k23n4J3p8K80k19
4913f2K84l73N8J27l5O2R3j66j9L2K2O1k8J39l94K36m7P4J0j63o0J59j1r4R7q8
4939h6N0J54L4k70R1J63j19q5J38k12Q7J4p8K00l2j32K3K01p1j04l6M2J33k25
4963a20K22k13kJ06j03R7j4j5Q6M2j59N0j4K38k51m9K0J04J52l81J76O8l9k6n3
4988g8K5J19K9Nr0m7N1O2j20j77K14J14J03l49L97k54J29J0P7j83o1l6k0K56j05
5013G1r5J93l4j00l3k17K96O3p2k5%j00J4n9J10j16p1J52O2m9K3r2R2J55j97Q9
5039F0J10l2j57J6j62L8J94j24j52K57N8j97J23k16K76j05Q2j20rK20j71l8j5
$$ plain form
4858 26 -92 -9 21 110 -14 65 -5 -204 -94 12 28 10 26 -62 -63 -22 -31 55 129 126 16 103 110 -32 61 -11 29 23 100
4887 100 25 61 -55 -21 -103 -40 -3 116 -110 -6 -13 94 87 42 84 13 86 63 -27 219 -4 -58 -45 -123 157 -62
4913 -62 222 -151 -93 34 -1 61 154 -12 -31 1 23 84 56 195 -199 37 -10 64 74 -89 -149 10 -1 -95 2 -86
4939 -86 -36 118 152 -118 -27 136 17 -68 70 -142 -55 -41 -119 81 49 -83 -60 141 70 -34 -70 -28 105 -120
4963 -120 102 -111 -113 -7 -110 -13 -27 -42 44 86 -73 -23 -37 201 -50 -99 -79 25 177 -204 -28 40 1 -25 -78
4988 -78 -53 66 95 100 10 -37 14 76 -44 -221 -7 107 210 -139 258 4 133 143 220 37 -24 -60 -80 176 71
5013 71 -24 169 135 35 2 -215 81 144 72 47 47 -53 -39 -98 12 -104 -175 -23 39 -10 13 -79 13 168 -29 60
5039 60 170 138 -19 -3 -165 -127 67 -57 -209 48 106 -91 32 -184 92 -13 69 -51 -60 160 -11 -49 -64
5062f4L7l0l2J39P0j91K05r8j55O6J16p8j38K67j23M3l0M1o8Mj18K32o7K9n6n5
5088e4J13L4n3jp3J75j84J59J6k78K11M9j24m5j15P0J75k7j09J30q2j38RJ98k4
5113C2j07R3j00J24j00J67l53K95J12k57J29m5k8J70j92K3J34l4k16J48j25J41
5135A1r3J42o9k26J99j44L2K20j69K70j94J46j08q7J02J25j53J62l59J57J00j23
5157e9Q9J3M4p2O6j57J62R4k47J99l8j78O0J26j38P9K0k1m6l0J10J14q8k28J48
5182B2r4J05j13K8j55K92j04j0J15k26M10j65j25q4J58L4j97k8m3J07R6J26j5
5205A34j74J65j59jn3J6J04J09R3l79M0J38j05m2P9k8k1j4K04R3j90j56K70j43
5229b0K9L0j35O8N5N3j87N0k39K17K49k04N9J09J0M9j86p0K13o2nL4O9l02K24
$$ plain form
5062 -64 -27 -57 -89 50 120 -71 134 36 -119 -53 63 -15 -153 114 -9 34 4 45 -23 -19 -137 95 28 57 1 -54
5088 -54 59 93 40 39 -34 141 -43 116 132 -146 65 114 -10 -55 -170 -100 75 48 -61 69 -13 -151 -142 56 32
5113 32 -75 18 -82 42 -58 109 -244 51 163 -94 35 -10 -38 132 -60 -37 97 63 -153 -5 -130 11
5135 11 -82 60 -9 -235 -36 -180 -148 72 -97 173 -21 125 17 -70 32 157 4 166 -193 -36 64 -59
5157 -59 30 43 87 15 81 -76 86 180 -67 132 94 -84 -24 102 -36 43 63 42 -4 -34 76 190 102 -126 22
5182 22 -72 33 -80 -52 -207 85 -19 -29 86 -140 270 105 -20 -104 54 88 -109 -137 -180 -73 23 149 134
5205 134 -40 125 -34 -35 -88 -72 32 141 234 -145 -105 33 -72 -114 -35 -63 -84 -98 106 199 9 -147 123 -20
5229 -20 9 39 -96 -28 27 80 -107 -57 -296 -79 170 -34 25 134 144 193 7 -63 150 88 83 117 186 -116 108
5254A08j30O6Q3p8J4k07K34r1O9j37K4Q5j71J82k84L57l7m0q1pK57k86K7J06j33
5279g0L07j99Jm2O9n2J52j04j77M8L1j07J86M0On5q1o4J62k42K90j58P5K8M1j69
5305h4Q5q5L14k31M4j29r5K03k6pK1k33J84J68j39q8J07m5j2j73K71j8N7j95J09
5330Cj07J97j69K32j09m2K07l00J1NJ22j86R7M0q1N4j20PK16j16Q5J65k29M5m0
5355a3o7P3J0k0Q2o3p2K3Q9m0r5J34j76J60l6J45j94J71j69q0K45L3r4r3N7l5
5381b5M7L3k81K56lj47K96j56L5O1k46J8J72j53O7L2k3j27j2P7J94K4q3j60K16
5406A12m9j59O7q2K15j44O9J02k71J43Oj20Q0J19k45o6M0K72l55K53P5j76K74
5429A60r0j16L5j64J21J67j36K9l7m2p2J19m8M3N2pP4l9J02j8q4j75J06j32J25
$$ plain form
5254 108 -22 44 127 49 63 -144 90 -1 68 -69 -45 40 -131 51 -233 124 87 47 -34 -41 216 -70 -43 63 -70
5279 -70 237 38 39 -3 66 14 166 62 -115 -67 -36 -143 43 83 89 34 -47 -111 51 -191 99 -59 16 44 85 -84
5305 -84 1 -84 230 -1 43 -86 -181 22 -4 -11 10 -223 -39 129 -10 -98 9 -36 -48 -221 50 32 89 -106 3
5330 3 -104 93 -76 156 47 5 212 -88 -77 -72 50 -136 -39 1 -80 -26 -146 -139 77 -39 46 211 -18 27 -13
5355 -13 -80 -7 3 -17 65 2 -70 -47 42 2 -93 41 -135 25 -11 134 -60 111 -58 -138 107 140 46 -47 10 -25
5381 -25 22 55 -226 30 27 -120 176 20 55 116 -130 -112 60 -93 -26 6 -17 -144 -156 -79 115 139 56 -104 112
5406 112 63 -96 -29 -111 104 -40 29 131 -140 3 9 -111 -31 88 -157 -223 -183 89 -266 -13 62 -114 160
5429 160 70 -46 -11 -175 -54 113 -23 6 -31 -73 -145 -26 -74 -31 21 14 88 49 151 133 49 -126 -20 -152 -27
5454b7n4J47k15R0O2n6J12ml3j73L14j78K3J01n3j35L0l9j08J80Q3L7q9q4R8Q7
5480A16j05J6mn0J2K54j76m1j36O4K0j90K44n1J7R4j90J61r9k79K35j16P9o0N8
5505a27J30K01k34J37L0k20m8J83j08L27k60p8J5L9q2K03R5k69K4Q0j3o3K04l86
5529b20K21M6k38K50M9l02L18l6k94L18j51r8J79L0j4q8J91j59j19K49L6q3q8
5552cL53l39r6J3J70j91J05O6n3j16K22r1J20j42j7K8lJ37j48no5L7L9J50j38
5577C3o8j35k2K12j5R0k38N1j0J15P9k9j47K09p1r8J52k11R5K7N7L2k1n1L0j08
5603d2jP1L8R4j98J32l3O5Jk16k2M2N2N3j36K6R1j91J20J84j52M8j19K86k59J48
5629H2j74J65J34k26R1j99J89l58K15J51j7k1K4n2m4K20j45k26K05MJ26j27J5
$$ plain form
5454 -27 -81 66 -149 -59 3 -53 59 55 22 -151 163 -15 8 109 56 -79 -49 -88 -196 -16 67 104 15 -69 29 116
5480 116 11 27 23 -27 -15 239 63 22 -114 -50 -30 -220 24 -27 -10 84 -106 55 -44 -323 -88 -204 -125 -185 -127
5505 -127 3 204 -30 107 137 -83 -131 52 -56 271 11 -67 -52 -13 -95 108 203 -66 -42 38 25 -38 166 -220
5529 -220 1 47 -191 59 108 -194 124 88 -206 112 -39 -137 42 72 58 -30 161 2 -117 132 168 85 -3
5552 -3 350 11 -85 -72 98 -93 12 78 25 -91 131 40 160 18 1 29 26 163 15 10 -55 -18 21 171 33
5577 33 -35 -170 -192 20 5 95 -143 -92 -102 13 92 63 -84 125 54 -44 108 -103 -8 19 76 108 87 36 66 -42
5603 -42 -43 28 66 160 -38 94 61 126 127 -89 -111 -69 -17 36 -100 -74 17 -174 -54 130 -22 26 -93 193 -66 82
5629 82 -92 73 207 -19 72 -127 62 -296 -81 70 53 32 56 4 -40 180 35 -191 14 18 144 17 32
5652C2j41J49j43L4J03j18Q0k8J10p5l3kK67l28R6j12J04K4j87J02r9L09Rk03
5676e0j31K43L2k78J82m0K39j90j14K05r7j33K68k05K18l80K78m5j32L41k22j01
5698a12Q9n5M2j2K05j49O5n3l5J62q6k28K24j09N2j4k04K14mK2j29P3J98k80J83
5723E9j96K14M7l0j65m7PK7M9N3K8Rn7O1j2P2k2n7j0J63m41K92n2K3q7n3J48o1
5751c8J31j22J34k35K55k72MK47n3mr1J1j30K73o8r5n1J31l8J45j27j7J27k44
5775a27J61J13m0k74K09j02J1J5J47j84L2P7j80K45j23L6k9J24l5l5Mm2K14k41
5799b4m4N3O6p5l1J2M8K05r8j17j84%J0L38j53J28k69L19k74P2p2K1JR8j93J62
5825ak5Oj57K84m2k48K58K3J91m13K12q3J25k36K5J22o2J8k7Q2r2P5j13j12J76
$$ plain form
5652 32 -109 40 -103 -69 34 -84 -4 -32 78 3 -30 -32 235 -93 3 -109 -5 19 -168 -66 -165 144 153 -50
5676 -50 -181 62 94 -184 -2 -42 197 7 -107 98 1 -132 136 -69 149 -231 47 2 -130 211 -11 -112
5698 -112 -23 -78 -36 -48 157 8 73 20 -15 147 61 -167 57 -52 0 -14 -218 -4 -8 14 -115 -42 156 -124 59
5723 59 -137 77 124 94 -71 -118 -111 -84 -35 18 46 55 -2 59 47 119 97 40 30 193 -248 44 -8 15 -72 -125 23 -38
5751 -38 93 -29 105 -130 125 -147 -143 104 51 47 -44 -33 -163 110 42 -53 -104 27 -11 134 7 -10 117 -127
5775 -127 34 147 107 -167 42 -60 -49 -34 113 -71 -39 38 -142 103 -20 16 -13 111 76 41 45 3 217 -24
5799 -24 -68 -15 51 -24 -55 -43 5 210 112 -5 -189 -189 -179 159 6 134 -135 184 -90 -18 -90 -69 -68 30 -163 -1
5825 -1 -26 -20 -177 107 65 -183 75 98 289 -124 88 5 130 -106 -81 41 -21 -3 -30 52 -40 35 -78 -190 -14
5850a4J56nk18N9j2j01K28j79J29q1K1n7j40K79r4L6q7J42k12O8o3K81j51p8k
5875i5Q4Q5M2k02j0K12o2j9lj02K10j66k0O0j22N9j25L98k72lJ14k5M6j95J90
5900G9j82R6J43j87L2J2j8J22M7k32n3K59r1j41J93L8j85N2j26K23J09l03K78
5923A65k13OM0Q4J3n0o1K9M8N5rj20j57J03M2ok01J61P6P9j30R1q1k5r2J08J42
5950I7j00M5N9j33rJ77l33K22J72k82l4N6J68j33q6R4M5J26j82J14n0j33q3J68
5974a5J11o3j56K87m5r3J6p0Q6m1PJ28j28j00P5q0J50j42P4Q1j43J90M4j14J1
5999G0j77l3K20n3M7m8j0Q2n6J8O2j96J4K02O1k00j39J4J68o9n1lj19K67J04j56
6025A9k20N3J57k5k18K75m6q2j02R5J87j58Rk19J98P5O9j23N3q8Q6J37j15j42
$$ plain form
5850 -14 142 137 -81 -22 -34 -135 93 -86 43 -38 -17 -74 -214 65 -29 7 -80 62 -150 -82 -145 136 -15 -93 -95
5875 -95 -11 74 116 -86 -96 116 54 35 32 -70 140 -26 -46 14 -108 -49 -174 224 -48 -51 63 38 84 -111 79
5900 79 -103 -7 136 -51 -19 -7 -25 97 144 -88 -141 118 27 -114 79 117 -68 -16 -142 81 190 -113 165
5923 165 -48 -42 -2 82 95 45 -16 13 61 116 107 -13 -170 -67 -25 -31 -232 -71 5 84 -46 45 -36 -61 -153 -45 97
5950 97 -3 42 101 -32 -41 136 -197 25 197 -85 -119 -63 105 -28 -114 -20 25 151 -31 83 33 -100 -183 -15
5974 -15 96 33 -123 164 119 26 42 -28 58 17 24 152 24 -76 -1 -81 69 -73 1 82 -61 129 173 59 70
5999 70 -107 -140 80 27 74 26 16 98 42 60 122 -74 -60 142 203 3 -136 -122 46 -23 -74 -77 -196 71 175 19
6025 19 -201 -148 9 -16 -234 41 -5 -87 -189 -94 93 -65 -56 -275 -77 -2 67 -56 -3 -91 -5 132 17 -125
6049a25N8J92o4j11M9j08j22J95m6P2M4P2k2J18m23K70k3j2N0j44N8RP2k95J86
6074e0r8L1K18n4j0K33k98J41J2k6%q9q7L9N4K6Mk09K08j41P1R8q9k6m3o0L7J17
6102IK16j51p7J57j17J08k33J24j48M0r7K31j56R6m0m4lP6o1M0J45k21Q3J99j03
6127G3J4k37L54L4n53L51P1k04J58K03l21l2P1j32J10k1K51l30K43n0j46J36k4
6150A9J04j61RK42j80j6oP7j54M5nJ18j03K05m0q7K24l80K35j30O5k05K22r1J01
6175A08k11L30l06K31q1k41J04J5J62k35J76J33k75K9j00J35J77m8j89J70l64
6196b80K09j38OK1J64J2L3O6L9k40R8P6Jpj21P1J70k80J07j27O7J89qr2m7n9m1
6223a11O4O1r2J12j06l4K17Qr6j17L14k18L3q0q2K37j30O9L1j86J2J56j44kr0
$$ plain form
6049 -125 -67 125 61 -50 -1 -109 -231 -36 -82 -10 34 106 84 202 -221 49 26 14 64 -80 -22 -13 59 -236 -50
6074 -50 -148 -117 101 47 37 270 -28 113 125 99 99 10 -77 -38 16 42 46 -163 45 -96 -25 73 -16 -42 -85 -145 -108 9
6102 9 225 74 -3 154 37 145 -88 36 -112 -72 -169 62 -94 2 -38 -82 -85 -9 -70 -30 115 -106 -23 176 73
6127 73 87 -150 204 238 -315 36 107 -97 61 264 -57 -89 -18 -150 -40 -61 190 -140 103 53 -93 43 19
6150 19 123 -38 -29 213 33 17 11 88 -66 -21 -26 92 -11 194 154 67 291 -89 146 16 81 -124 98 7 108
6175 108 -103 227 -79 152 71 -170 -66 -51 111 -124 52 185 -90 -61 -161 -26 151 103 -86 84 -280
6196 -280 -71 -209 -203 -182 -18 -6 27 93 132 -108 -10 66 67 60 -61 10 180 -100 7 -120 -53 136 128 36 -11 -70 -111
6223 -111 -47 14 -78 34 -72 -106 111 119 23 -94 220 2 35 -45 -127 110 -20 49 80 -106 -94 62 -82 -84 -174
6248a74J08K4J13k10J97L7k2q3Q6O4k04m7m1N2m3J2K86j81K2K28k87J14n6J65
6272A60q8P7q5q9l8J32j21K46p5j97P2N3r9j74K83j68n9J80j7%ok1o8J02Jm5j13
6299a57lJ94Lq1l6j5RJ21O1j35j61K07n6Nr2J96k4j03J13P6l44K70P1q1o1J81
6325A58kj79M7l7Q5n3k21L74k61J37O0j61K10j22M9r4J00N5J00m11L82k38O0j91
6349a53J09k7J64j34ONj05J36l3L7J30M0j80J0m0L63l70L6o2K30j12j8L6P0k46
6374a08L05q1o2l7r1O3k9Q8m7k3J78j95K12j27L3kl0m2k28J07J73q9j42J85jp5
6400f5K8J37r7M0Q0l03J77OR1j32J51j55Q6J24j52m3R4N1n2n6J16j96j19K66l2
6425D5j24J43r8O5K2J9j13L3Mj24J14j81J26J35N9j42p2J00or3Q0LJ34o7j69L41
$$ plain form
6248 -174 -66 -42 71 -139 58 95 73 -10 76 140 -64 -111 -152 -100 -143 -131 155 -26 -4 224 -63 51 -5 160
6272 160 72 149 64 -25 -63 69 -52 194 119 -78 -6 47 -52 -226 57 -111 -170 10 -7 -7 -13 -34 -102 0 1 -44 -157
6299 -157 -160 34 37 -44 -80 -95 -86 35 96 -39 -200 7 -49 -44 -136 60 36 -67 46 122 -222 48 119 38 -23 158
6325 158 156 -23 24 -13 72 19 -202 172 -89 48 108 -53 157 35 84 -10 90 145 245 -166 216 -22 38 -153
6349 -153 -44 -71 93 -41 -35 -30 -135 1 -32 5 135 175 -5 5 -35 328 -42 -6 -68 162 50 32 68 138 -108
6374 -108 197 116 54 17 -74 -11 -40 48 1 -22 156 -39 173 46 79 77 47 5 -223 -116 57 -32 -174 11 10 -65
6400 -65 -37 100 3 43 123 -180 -3 3 94 -38 113 -42 44 168 16 -27 67 118 66 10 126 -70 -189 77 45
6425 45 -79 64 -34 31 53 72 -41 -8 -4 -128 -14 -195 -69 66 125 -17 -89 11 5 -88 -8 -5 129 62 -107 234
6451B34p6l72J08q5K97k1j1j77r8J57P6r7J45j37J47j84J1p8J54J5j02Q2l1j77
6475b20J46qP8J29O4k31J7K04j79Oq5M3j7J04R1p4N0R9k33m7Q4k0o7n9K65N5o8
6502A27q7pR3l0o5r8L3J49j03Q5j73O4p9K18k64J94j47K2L44l48j55M08j34j64
6526a17J8K97k04N0j10J70j64J21o1%J29j77j9L4J63j78M1rj97K34J5J61p4p0
6550E3j16K40l4j75p3m0J68k26J69k97K78O8K5Q0j52l4N0j5o5P8N9J35m7j11P5
6575I3j2j00J40j98K2O0j00J27J09k01J32J6j27Q3o1m9Q3j35K46j80J42q4j14
6598a08N5n9P2J08j28J78N8l66J39p9J46J17j62O0K3l37L45j48J44n8O0L0k40
6621a50K18J5k9o4K9J10l05j47N35k86N8J39k62K95k57m5L03j31P4k61j41L83
$$ plain form
6451 234 158 -214 -106 -191 106 85 74 -103 -201 -44 32 -65 80 -57 90 -94 -83 -161 -7 8 -94 -12 -43 -220
6475 -220 -74 -82 -4 125 189 -42 -25 179 0 6 -79 -36 -53 51 142 68 118 217 -16 -63 21 1 -66 -125 140 195 127
6502 127 40 33 126 96 31 -67 -34 115 12 97 -76 -12 -91 127 -137 57 -90 -68 276 -72 -227 181 47 -117
6526 -117 -99 198 -6 44 -66 104 -60 61 0 0 129 -48 -67 -33 130 -48 -7 -16 -213 21 36 197 123 53
6550 53 -63 177 143 -32 -105 -145 23 -203 -34 -331 -53 15 40 120 -32 -66 -16 -31 -96 -18 41 176 129 18 93
6575 93 81 -19 121 -77 -55 5 -95 32 141 -60 72 88 -39 44 -17 -66 17 -118 128 -52 90 6 -108
6598 -108 -53 -112 -40 68 -60 118 176 -190 -51 -130 16 133 -29 31 54 -283 62 -86 58 0 60 90 -150
6621 -150 68 83 54 -10 19 129 -176 -323 212 -74 -16 123 -139 156 -101 -146 157 26 100 -161 -302 81
6643H1j38p3J92j16K2R0n2q8J4p1K39j60r2P8J63R2j11m1J9j1l0k9j39P6K46N2
6669B13j79j43J44q2M6J32o1j22J97j24N4M3j59M1J9J40l03Q6j97J71M1NJ1l4
6693f1J8L3o6n3L17p1r1j16J30j4K20l27Q5j77K22L2L5l3j23l3J10k02K17j33
6717h1Q0K17j68J02J5J10p6j53o1M7j61K23o3q0k6J05p7OJ36r2P8p4L9k34O5l6
6743a59P4J05J41j5k41k4J46O4m0n8k0Qj57K80l9l6Q2k46J47j32J44m4R1o8nr8
6769a00J30r5L01l04K8J02n9J4k7rJ75q3j82J85j82J18L9LQ7j01P4q3km2N4j0
6795C1p4J18O2k03K56j30r3J71m3j41J3K2m3K08j43j14Q6J6Jj41J71P8j80L7J51
6820A16j88L3O5l5l5J44n9m1q5l4J51n9lj28N0J05J42l55J38K91n0l41N2J13J55
$$ plain form
6643 81 -57 -130 62 -54 -32 58 6 -82 -68 -139 100 -60 -152 -74 89 181 70 29 48 37 7 -22 -161 -85 161 213
6669 213 34 -109 35 -47 -1 131 70 -52 145 21 75 118 -41 0 19 159 -144 -58 -255 -84 -43 -38 -27 -61
6693 -61 -43 -10 -76 -129 188 117 26 -90 40 26 246 -81 4 -173 49 81 116 83 -40 -73 37 -165 52 -81
6717 -81 -1 216 48 150 165 275 199 46 -15 32 -129 94 31 -49 -75 30 -47 -41 95 3 81 7 46 -188 -123 -159
6743 -159 -85 20 161 146 -95 -119 27 91 51 -7 -27 -19 -176 104 65 29 111 -135 12 -120 24 -20 71 3 -2 -100
6769 -100 30 -65 236 -68 -40 62 3 17 -10 -19 156 73 -109 76 -106 12 51 54 141 40 114 31 29 -13 41 31
6795 31 -43 75 137 -66 190 60 -33 138 95 -46 -33 -11 -54 154 11 -103 -17 -1 0 -141 30 108 -72 -35 116
6820 116 -72 -39 26 -9 -44 100 41 0 -85 -119 32 -27 -30 -158 -108 -3 139 -216 -78 213 163 -178 -126 -13 142
6845A42j55qM7q2RO0j91O8O6Jj14J29k30J52R2K19j81J42q0p1J30j33J66j13j56
6870i1q5j02J93J41j58J70L4o8nk87J47P8j86L37n0o5l0lr4J85n7j97J12J20j7
6895B2k8j36J05P0J59j90L7j01J83j38j50M9K10p0n7Q6Qo7j41K61k29J02J16j24
6919b3P0J30l39J13O1m5j7NJ18k99M02P5l71K04M5j15p7K69k09L7p0q7L7L4Mj9
6945f7N5k8J31j42J07o1l1m0q9K86k08j9R9l0J41M1j43M9pk21K86j06kOn8K0R
6972b2m0jJ73l8j38j6L01j80k35J17P2k8N1j02J40Qn1Rj07K07j96n6R3q0K13j37
6998d3O4j7oL9P0j09Q8j22J00p5J6Lj8J00j56N2P1l9R1n2Q5j64N1K68m06O7j8
7025f0n9J16k9O3l8j47L66l89M6N8J61k8J53l05J18j05J31J34j68l4J61j63J7
$$ plain form
6845 142 -13 -21 26 -56 -47 13 -178 -110 -44 -43 -157 -28 -258 -106 -14 205 24 166 86 15 145 12 178 65 -91
6870 -91 -176 -278 -85 56 -102 68 102 34 29 -258 -111 -33 -219 118 68 3 -27 -30 -124 61 4 -193 -81 39 22
6895 22 -6 -142 -37 33 192 2 39 -62 121 -17 -167 -118 92 22 -35 51 59 -8 -149 112 -117 -15 101 -23
6919 -23 47 177 -162 -49 12 -33 -50 -45 73 -226 176 251 -120 84 129 14 -63 206 -3 34 -36 -123 -86 -52 -48 -67
6945 -67 -12 -40 91 -51 56 -5 -36 -76 -165 121 -87 -106 -7 -37 104 145 2 51 44 -177 109 3 1 7 -51 -31 -22
6972 -22 -62 -63 110 72 -66 -82 219 39 -196 -79 -7 -35 16 -86 54 62 11 20 -87 120 -76 -132 -39 -119 94 -43
6998 -43 21 4 -2 37 107 -2 86 -36 64 -11 5 8 -10 90 -66 -14 57 18 109 57 142 -22 29 297 -109 -42 -60
7025 -60 -119 -3 -32 31 -7 -154 212 -177 -131 -73 88 60 213 -92 26 -79 52 186 18 -16 145 -18 -1
7048aJ9M7k84K11P8p3J5l9J61j87J53J6r7j1k5PQ0j85J0K46j95J58q4%j4R6m9
7075E3J0l9j39J16NO5n9j50Q2O4J23j7j22J7p4R2P5j47J6M5O9q0J6j23M6Q7J9
7102E0j02J27k12K26j66J22r6q2K42j98n4J41L6j31J13j22On3J74M8p1J42j64
7125b4K6j03J93q2Q6m4j46J93o6p5N4J18j92N6J29j93J03o5k12M25j75J17k85
7148a62K67M7j43K08k70j2J19qj01J99j26m6P2J62j36q9K8q7J57k28K26j1r8%
7172c2j46Q9Q4P3j10l9P4R1OL8k50J66J68j52n1R3k36K53k68L23mj26k73L56l4
7197I3m8q3Q2nJ09j22p8n6J72J8l72J06L55j6j05kj82K86j24J2J4k38mL18p6N2
7223A06j19k14J18J48j83J31j83J42j54J95O2j67N2N5j1O6j3j42R4j00K8L4J35
$$ plain form
7048 -1 18 65 -219 -8 70 -3 12 -27 134 -53 100 116 19 8 -17 -10 70 -115 -105 141 -54 104 20 20 6 102 53
7075 53 63 24 -115 1 6 71 12 -138 -56 8 131 114 -8 9 -65 27 102 -45 -29 16 85 5 21 -102 -56 31 50
7102 50 -52 75 -137 89 -77 45 -51 -133 109 -89 -143 -2 34 -97 16 -106 -100 -153 21 69 -2 140 -24
7125 -24 2 -101 92 10 96 52 -94 99 33 -42 12 130 -62 -6 123 -70 33 -32 -244 181 6 123 -162
7148 -162 105 152 9 217 -53 -65 54 46 -55 144 18 -28 44 206 70 -19 9 -78 79 -149 77 66 -32 -32
7172 -32 -178 -89 -5 68 -42 -81 -7 84 90 128 -122 44 212 60 9 102 -134 119 -149 174 170 44 -229 127 93
7197 93 45 -38 44 39 148 26 -52 -108 64 82 -290 -184 171 155 50 48 -134 152 28 40 54 -184 -188 130 54 106
7223 106 -13 -227 -109 39 -144 -13 -196 -54 -208 -13 49 -118 -66 -11 -22 44 31 -111 -17 -117 -89 -55 80
7246H0j33J2P3o4J11p5j5J26L7j71J34j19J75j66K0k47N6J99n8J31q0j51K33K
7270A10j30j3M7J33j95LJ48r9j8j00K00l4j59J68j93K27j45k31K40m9N3k6R9j98
7294a62K66j63J21k0j8R3j81P1k7m4J81j89o8J00p3J76M5k1o0j59o1L98k43k7
7318f5J6J20l9j94J98j71J50j46J74j24K9M3m5q7J45r3J00O1j5J01k13J76Mj56
7342c1Q6Kl4k5j12Q6O8j15J00l7j05P4J00P0j72K14J6p6j46J75j42R8r8J55l45
7367a94J85L2J05O3r5q6j37R3j1n9J83L5R4k23q4O1J62j94k3J46r1Q6Jn3N4k4
7393B6K5j25o6J47j52Q1j90L77k19J09j12M7O2J11k04J12K28k38K06j51q8m8J20
7416E8j66J69l7J91o2k16K91k80J75l8r3R9k02M1kM0q4O5J36L5j64P3m1p4Q9J13
$$ plain form
7246 80 -53 -41 32 -32 79 4 -11 115 152 -19 115 -4 171 5 25 -222 -166 33 -25 106 26 -125 108 110
7270 110 -20 -33 14 147 -48 -45 103 4 -14 -114 86 52 -107 61 -132 95 -50 -281 -41 -90 -37 -63 36 -162
7294 -162 104 -59 62 42 24 117 -64 7 -20 -64 117 -72 -140 -40 -113 63 108 87 27 -132 -193 205 -38 -65
7318 -65 -49 71 32 -162 36 -135 15 -131 43 -81 -52 -9 -54 -141 4 -89 11 72 57 158 -55 121 125 -31
7342 -31 55 57 23 -2 -114 -28 40 -75 25 -12 -117 -43 57 127 -45 169 185 109 -37 138 -4 94 -4 151 -194
7367 -194 -9 23 128 191 96 10 -127 -34 -45 -104 79 114 208 -15 -99 -38 124 -70 -93 53 -38 48 49 -4 50 26
7393 26 51 -74 -140 7 -145 -64 -254 123 -96 13 -99 -52 10 121 -83 29 257 19 225 74 -14 -62 58
7416 58 -108 61 24 215 153 -63 228 -52 123 85 -8 91 -111 -70 -72 -32 -116 -51 85 120 -44 29 -12 -86 3 116
7442A16j18M0J72k57l9R1pQ2M3k95K84j67L2jj33J23l0R7k42K11j30J40N2n9M5
7467E0j07L8p5J23N4j36J50j05l7j24J69n0nj7j09J59n6P8P4o6J01m18K29oj1
7492i7K5N3R7j06P6j70J90j62m5O5J79p3j61P7k7M25m62OJ94R0k30J88N8j56r8
7517f4K3K30j72j1J4j23j12Q6J18O9J30j21l3L5j12J34j35l3J10Q6j9k3j82P4
7541c1k6Q4k8Q5o0RP0k57L2O8r8J71k12J39p5J15J6j41J82j16J35r2P3J91k60
7566b6kR4j47J4O4P3k7o5K44j78k8J2n3j1K8N9j19O1M9k94L91l25K36n6o8K41
7592A67LQk78J26o7K35l91R5J96j80J77k92K26j84m6K15K4n9R2r2o1K22j66q3
7616a13L64k61j04J64O4k6j13P6L3l9k63K12j18O4r6J39M2r3J0Jk13K26j67K94
$$ plain form
7442 116 -2 38 210 -47 -86 5 -2 80 123 -172 112 -55 -23 -24 -157 -34 -64 33 -209 2 -128 12 64 5 50
7467 50 -57 -19 -94 29 83 -53 97 -8 -45 -169 0 -50 -55 -72 -181 -22 -78 0 74 8 109 -309 -80 -86 -97
7492 -97 -72 -19 78 -28 48 -122 68 -94 -139 -74 105 32 -129 -52 -79 346 -116 -110 84 174 -56 132 190 34 -64
7517 -64 -41 189 17 6 20 -103 -215 -129 -11 58 188 67 34 69 -43 91 -44 -77 33 119 100 77 -105 -31
7541 -31 -57 27 -1 84 24 33 103 -154 -122 -54 -152 19 -193 -54 -129 -14 2 -139 43 -73 62 -30 43 234 -26
7566 -26 -28 66 -81 -67 -3 70 43 -22 222 44 16 28 -25 -36 -8 51 -68 -7 42 -252 139 -186 50 -6 -74 167
7592 167 170 178 -100 26 -41 194 -197 -102 94 -86 91 -201 25 -159 -205 10 34 -25 67 -25 -86 136 -30 -113
7616 -113 251 -10 -114 50 114 88 -25 51 84 45 -218 -6 -124 -60 -156 -17 25 -68 -58 -57 -270 -44 -211 83
7640H3J25j12k11j45L84m2lq4J97k15m4Q8L9j74K80r6j21p3K47k05lJ41j83L60
7664B33l11j74K22j0lm6L9k6M0j08R1j13K51q7j46L39j78J17l00r4L02mk02K37
7688F9p6k8L4l1J47r8n4r5J20j28l3J63J50k92J55r2J46j33O1R3J98k50l9P2L7
7713I6k49J22K37k22M8l2k35J47J95q6p7K7M8j52R2J33j25k6P7k7k01J62m8m2
7737a38J42j57J2K66l2o6K7O5j51O1J45m1np9k26J50M7J17k50p8J01J75j97K02
7761I0k15J17m2J42j18J22r5R1l5R5l24K09k4J31j66l3J88j56J43j83J06m9oL0
7785A8M8O4j67L0k1P0O6P4k89K01K8j77l6J52n0j10M0J78m4M4j93n0q1L08%k34
7811a31K30j44M3J51r0o8J24j09M1J34r6qq4J2J71k04K40k35J02q5k5l9J36m4
$$ plain form
7640 83 208 96 -115 -260 124 82 79 -5 192 -23 -67 21 60 -114 166 70 -51 -124 123 -82 -85 56 -127 233
7664 233 -78 -252 -30 -40 -43 -89 -50 -76 -36 -144 -53 -166 85 -2 -148 191 13 130 -170 -264 38 34 -168 69
7688 69 -7 -35 -1 -32 115 17 -37 -132 -12 -140 -173 -10 140 -152 3 -89 57 -76 -15 78 276 26 -13 59 96
7713 96 -153 -31 206 -16 32 0 -235 -88 107 21 -56 -29 19 -133 -41 92 -33 -59 18 -9 -210 -48 -96 -138
7737 -138 4 -153 -141 125 93 27 54 119 -32 29 174 133 128 49 -177 -27 20 137 -113 -191 -90 85 -112 90
7761 90 -125 -8 -50 92 -26 96 1 92 57 152 -172 37 13 144 -22 -55 133 -23 120 -63 43 -6 -12 18
7785 18 66 130 -37 -7 -28 42 108 182 -107 94 122 -55 -91 61 11 -99 -59 119 75 119 -74 -124 -205 103 103 -131
7811 -131 99 -45 -2 149 59 -9 115 6 47 181 85 77 -7 5 176 -28 212 -23 79 -6 -31 -70 66 22
7835B2P7k8k4p9J57o3m1Q6r7J07K3k61p5J63K19j98K4M6n4j26K39M0r5j08P2j90
7861a64Q2L7M5J36j90J19q9O5K7N2l08J91m3J20j9j94K97j50n7L4O7m1J16q2j1
7886D0K4j38j40K60k5k5Q2r3j7M6M9j98J7J53k12L15O5k72Q7j48K23k8Ok0j11
7911f0Q9n3J90k44Np2K21j18L5P2o8j12J37k3p9N7J1rk8om9P8r5K1m1P7lj30J52
7940d5KQ9p3j17L12j49R4j97J76j39K33k8k13K59j67J9j59J35j6l4K5J28l08J43
7964c0J76j46Q8l3K2r4J4o2R0Q8j04k8J65q1n3o6J31Q4o5k04O7K40k33k7Q9o2
7990c4k99K66p0K41k15R0j13K30k42R3j82L12L4k19O7p6J57J10m1k39q8K85K3
8013I0j67N5K7j08OR1j04J79j12oj16K14J40k88j71L53Ln1j9J9j23Q0QJ09j79
$$ plain form
7835 22 99 71 47 -32 125 62 21 107 10 117 140 -121 -196 -33 186 -12 12 58 4 -122 117 157 62 -46 26 -164
7861 -164 -82 -45 0 136 -54 65 -24 41 68 120 -188 3 -40 80 61 -133 164 14 -43 -9 58 17 133 51 40
7886 40 64 -74 -214 46 21 -4 78 -15 -32 14 63 -135 -118 35 -177 138 203 -69 18 -130 93 65 71 51 -60
7911 -60 29 -24 166 -78 -73 -145 76 -42 -7 65 -3 -115 22 -1 -80 -23 -12 -21 -49 -55 -104 -26 -121 -100 -141 -64 -67 -197 -45
7940 -45 -43 46 -27 -144 168 19 113 -84 92 -47 186 158 -55 204 37 56 -103 32 16 -18 7 135 -173 -30
7964 -30 146 0 88 55 77 -17 -3 -65 25 113 9 -19 146 65 12 -54 77 161 96 -108 -41 199 -34 -61 28 -34
7990 -34 -333 -67 -137 104 -111 -21 -134 96 -146 -53 -235 77 111 -108 -41 -117 40 150 109 -130 -218 67 90
8013 90 -77 -22 5 -103 -97 -6 -110 69 -43 -49 -165 49 189 -99 -270 83 86 35 16 35 -88 -8 0 109 -70
8038g0R9j46N2N7Q0Rj21L5J79m01L22k43JK96j94j64K06j00P2N2kQ7j43k0k6J35
8064E2Oq9K0q3L8P7j9Q8q7Q5k87L42j65J51j07l2Q7q9m9p4J59M9j58J58j87R6
8090a8J06j09O7j57J25M4p7Lj21L07k24J01J8l0k4j95M53k35R8k73J65k9l2k1
8114e8j75K07R7k57K9J54j4q3J39j57J75j16Q5N6j26J44j26o9J1J46J16k08J77
8137A47j58K7k0J98j93qL0J24j64K03k53J69k66J90J75k82k5K04l8%K2%j32o9
8161a19j06K93j56l1J91j20J00J06l61M5J11J1R6Q8j45kj13N3KrJ00m4M4n6j9
8186d1pJ85j36o5K44
$$ plain form
8038 -70 29 -117 -65 -8 72 81 -40 -5 174 -227 95 -148 -147 149 -45 -209 -3 -103 -31 21 19 106 -37 -57 -83 52
8064 52 58 -31 -11 -94 -56 21 2 90 3 88 -199 143 -22 129 22 -10 77 -12 -61 -135 24 73 -85 73 -114 -18
8090 -18 88 -21 46 -111 14 58 -19 -16 -137 170 -54 47 65 35 11 -184 269 34 132 -141 24 -5 -37 -58
8114 -58 -233 -26 71 -186 -157 -3 -17 -100 39 -118 57 -59 26 82 -44 100 -26 -95 -84 62 178 -30 147
8137 147 -11 16 -4 194 1 -7 23 147 -17 186 -67 102 -164 26 201 -81 -106 98 60 60 82 82 -50 -119
8161 -119 -225 68 -88 -119 72 -48 52 158 -203 -158 -47 -36 60 148 3 1 -112 -59 -57 -66 34 -10 34 -22 -41
8186 -41 -48 137 1 -64 180
8191A80
$$ Imaginary data points
##PAGE= N=2
##DATA TABLE= (X++(I..I)), XYDATA
0@%%%%%%%%%qJ6j6J6j7K5l2L5m3N0n8P2q6R7j12J31j50J70j94K19k46K79l14L53
33A87l97M43m92N47o08O75p48Q29r19J016j124J246j381J534j708J905k135K405
51A275k723L114l603M231n078O285q156J1480j9140O9022J4451j35049P133M6422
65a0336M5088K7254m2708j02713K7597J10891J2591p5093l5118k942M1335O8949
77F4795j6926j01530j4411P8764M2013j9645m2845m7079K2053Q2812J5078p4019
89a0940m2238K4702M7541L3301k6876p0607p194O6194L6100k7196m5726k5234
101d8173L1221O1849j470o4048k7448L2088M0576J7949l0615n7465M691O5903
113B5058K3112l8222l5864r605K6827N1586l031o5179k2217M3530L3194l13k4721
$$ plain form
0 0 0 0 0 0 0 0 0 0 0 -8 8 -8 8 -9 16 -16 19 -24 26 -32 40 -46 51 -61 70 -80 90 -104 115 -131 148 -166 187
33 187 -210 233 -259 288 -320 355 -393 436 -483 533 -591 655 -726 808 -900 1005 -1130 1275
51 1275 -1448 1666 -1937 2294 -2784 3501 -4655 6825 -12315 56707 71158 -63891 -56758 -10336
65 -10336 34752 62006 19298 -83415 -55818 55073 67664 -7429 -42547 -45489 -4154 64795
77 64795 47869 -53661 -68072 10692 52705 33060 -9785 -56864 -34811 48001 63079 -10940
89 -10940 -53178 -28476 19065 52366 25490 -45117 -52311 13883 49983 22787 -22939 -48173
101 -48173 -16952 44897 43427 -20621 -48069 -15981 24595 42544 11929 -45536 -40845 25058
113 25058 48170 9948 -25916 -35521 -8694 42892 39861 -25318 -47535 -4005 29189 28876 4155
126D155m2373J814O1399K2177m7762l4228R916K7407L2484m137n6139k2401N0196
139B508L6927j6940l0833k4109P249N0758K0772m9858l7662K2200L3658J5607
151C0277j1514m4044j7529M8432L6478k6920l6416p565J6808L7320J2495m6304
163h482l5108L0894L9530N57k1896l0705p623M3206L3014l2014m1150M748K6202
176A173K3870J792l8396k9677L2530M0716r441l0491j7353M287L4293K4308l2211
189E400l9730J3187L4369J2319j0126k9985j9613L0968L8311j5181l6145q380
201b4606J4683K5580J4057k8355l5068J5692L7293M212j9571k1186q160K5956
213E27L1753j6850l7877j268K4403J7996K499k3949k7611J6632L7752l97k7608
$$ plain form
126 4155 -38218 -36404 24995 47172 -590 -34818 -24902 2505 34989 30852 -25287 -47688 2508
139 2508 39435 22495 -8338 -32447 -25198 25560 46332 -3526 -41188 -18988 14670 30277
151 30277 18763 -25281 -42810 5622 42100 15180 -21236 -28801 -11993 25327 37822 -8482
163 -8482 -43590 -12696 26834 27391 5495 -25210 -32833 10373 43387 11373 -29777 -25029 1173
176 1173 25043 26835 -11561 -41238 -8708 32008 22567 -7924 -25277 -20990 13303 37611 5400
189 5400 -34330 -21143 13226 25545 15419 -14566 -34179 -3211 35100 19919 -16226 -24606
201 -24606 -9923 15657 29714 1359 -33709 -18017 19276 23488 3917 -17269 -25429 527
213 527 32280 15430 -22447 -23715 688 18684 21183 -2766 -30377 -13745 24007 23610 -3998
226c998j5563K818K1863K2925j6112l6199J497K9919J3379q507j9870j7663J6126
239i385L3685l041l1735j1486J3464J9178J2105j5948l0746L878L3024R901j7261
252E633j8272p400J6102K7262m866l2654q749K0488J6846K169j5656k3190N979
265a6308L1753O939k3182j5702K965J5359J9112o601l0477o084K5722J5008p351
278A1153j5256j4820P124K8231N046k6528j4726J1061J5562R618p713k4784m237
291b0269K6392J4314j4351j6325m871R758K0952K862k5855j3648J6586J7566P93
304A3904j1304j7817q17K4322J2669j7740j7799K255J2442J4349j034k2482j1220
317b0272J8690J7186m924j3904j1108L393K0672R844j9584j7058P635J5242Q008
$$ plain form
226 -3998 -19561 -16743 5120 28045 11933 -24266 -22769 7150 20529 12022 -7848 -25511 -9385
239 -9385 24300 21259 -10476 -21962 -8498 10680 22785 6837 -23909 -20031 12993 22894 5633
252 5633 -12639 -20039 -3937 23325 18459 -14195 -22944 -2456 14390 16559 903 -22287 -16308
265 -16308 15445 22384 -798 -16500 -13535 1824 20936 14335 -16142 -22226 3496 18504 11153
278 11153 -4103 -18923 -11799 16432 21478 -5050 -19776 -8715 6847 16465 8752 -16032 -20269
291 -20269 6123 20437 6086 -10239 -15110 -5352 15600 18462 -7393 -21041 -4455 13111 13904
304 13904 2600 -15217 -16034 8288 20957 3217 -14582 -12327 115 14464 13430 -9052 -20272
317 -20272 -1582 15604 10680 -3224 -14332 -10939 9733 19577 -7 -17065 -9430 5812 13820
330A3820m951j8846q307J9452J6893r847j6404m794O874J6055O545j8640j6018
343a8168J0971J7252K248r366j3458l836J7386J5263j2183j8164N52J1386J1416
356A1299J212j6493j3657J2434J8447k206j2813r397Q25J5059J1711j2707j7989
369a4275L582J4795O860l390j3569r509J3037J7203n082j6029m813N788J2290
382F888P402j2620j6818O185J6915L379q286j0409n066J1491J5591o366j7777
395i491k050J0603Q950K161j0438j3979O694J7895J280j2604p925P89J0259J1239
409A3383o613j7350r49J4115P486l344r907r059O646J6540J42j4991o654N340
423e215R698O673p225j4927Q86J5153O005p383r382m167P482J3617j767j5555
$$ plain form
330 13820 8869 -9977 -18284 1168 18061 8214 -8190 -12984 -6110 9945 16490 -2150 -18168
343 -18168 -7197 10055 12303 2937 -10521 -14357 3029 18292 6109 -12055 -11503 -117 11299
356 11299 12511 -3982 -17639 -5205 13242 11036 -1777 -11174 -10349 4710 16421 3714 -14275
369 -14275 -10693 4102 10962 7572 -5997 -15506 -2469 14734 9652 -6377 -11190 -5402 6888
382 6888 14290 1670 -15148 -8963 7952 11331 3045 -7364 -12430 -939 14652 8286 -9491
395 -9491 -11541 -938 8012 10173 -265 -14244 -7550 10345 11625 -979 -8904 -8115 2144 13383
409 13383 6770 -10580 -11529 2586 10072 6728 -3179 -12238 -5592 10948 11090 -3901 -10555 -5215
423 -5215 4483 11156 3931 -10996 -10110 5043 11048 3665 -5717 -9884 -2402 11215 9448 -6107
437f107n287R274R018K109p505j2391K009J5634M416j0629q447K70P608J0088
451A0060k341j5131l732J1885Q220k847p818p713K997J4339L348j3100p962M776
465e019Q249N511l617j2835l162J3114Q089o482q473l246M259J1059K262j2768
479c059p692P719R077J109n291r227j222J2259P233q627r589R19O132P567J98
494G506j1436o712R165R757k220p177o097J161J0276N801r066r414L102P841M561
509G048k291r613m660R362R267m308q500l068L143Q529M052r583q727N018R116
524D785J660m140p505k771Q906Q378n829r399l68N315O350J452q456p291N862
539c051R866p54o660m999j3P781O859o385r857J339P633L774j159o950n586O025
$$ plain form
437 -6107 -11394 -2120 6898 9007 1502 -10889 -8880 6754 11170 541 -7906 -7636 -28 10060
451 10060 7719 -7412 -11144 741 8961 6114 -1704 -9417 -6420 7919 11267 -1833 -9795 -5019
465 -5019 3230 8741 5124 -7711 -10873 2241 10330 3848 -4625 -7871 -3612 7447 9709 -3059
479 -3059 -10751 -3032 6045 7154 1863 -7364 -8586 3673 10906 2279 -7310 -6391 -259 7308 7506
494 7506 -3930 -10642 -1477 8280 6060 -1117 -7214 -6053 4223 10024 958 -8456 -5354 2487 7048
509 7048 4757 -4856 -9516 -154 9113 4805 -3695 -6763 -3620 4909 8961 -622 -9349 -4331 4785
524 4785 6445 2305 -5200 -7971 935 9313 3484 -5915 -6283 -968 5382 6834 -1622 -8913 -3051
539 -3051 6815 6061 -599 -5598 -5611 2170 9029 2644 -7213 -5874 1759 5533 4374 -2576 -8162 -2137
555b137R687k074q402l153K811O171M525o123q984K420R297K176m467n353k970
570f576N975Q100k746r478j663N698M921J382n583p424K826R738J091o323m681
585d743J4N632O105l137r290p41P148M088j179n023n354L535Q638M04p821l830
601e554K757M817L702l409q099J5Q271L299l739m932k346L653P301l69q288l152
617f073N014M779J005l891o264O31Q390K690n761m765J77L887N583j068q244k264
633f174O218M812j546m089m358J651P576K093o851m656K674M298L170j999p003
648d184j688P099M658l780m635j918K576O166J053o968m295M183M873Q05k734
663A211n298q85O893L994m773m780J24L293M215J62o104m034N190N272r69m039
$$ plain form
555 -2137 7550 5476 -2926 -6079 -3268 2903 7428 1305 -7679 -5259 4038 6214 1747 -3606 -6576
570 -6576 -601 7499 4753 -4725 -6388 -690 4231 5613 30 -7394 -4568 5170 6261 -62 -4743
585 -4743 -4729 903 7008 3871 -5419 -6160 988 5076 3897 -1126 -6480 -2945 5693 6097 -1724 -5554
601 -5554 -2797 2020 5722 2313 -5786 -5771 2500 5799 2060 -2872 -5218 -1565 5736 5367 -2921 -6073
617 -6073 -1059 3720 4725 834 -5430 -4799 3591 6281 520 -4245 -4068 -181 5402 4334 -3910 -6174
633 -6174 44 4856 3310 -779 -5137 -3486 4090 6183 -668 -5324 -2650 1648 4818 2819 -4184
648 -4184 -5872 1227 5885 2105 -2530 -4448 -1872 4294 5347 -1621 -5916 -1733 3140 3945 1211
663 1211 -4087 -4972 1921 5915 1142 -3638 -3514 -221 3994 4156 -1948 -5982 -792 4480 3511 -528
679e28l466M02N934L240m871n504J813M451K526j468m996k742N119N054k076n009
695b121j840K120M557K268n014m943K380N148J410k942l944j488M879M618k801
710B287n599m40L116L766N05m579l940L082N383q3l558l080j67M598L550l469
726A372n429O75M234K593o75m221l384L703N491j106m773j984J523L917K480l584
742H32n401J674M969J338k211l149j859L290M872j602n511r50L101L106Q26l223
758A02m451J773N594O46l641k752j20L120L757j846n447l39M042K561p30l094
774h25l065J937N426jm415k686J956K981K405k229m881N5M767J978k123k889j772
791c381K485M314k62m775k096K850L027O58k271l863N36M726J700l328l000K12
$$ plain form
679 -528 -3994 -3592 2342 5582 711 -4793 -2980 1471 3997 2529 -2467 -5209 -90 4964 2888 -2121
695 -2121 -3961 -1841 2716 4984 -30 -4973 -2593 2555 3965 1023 -2921 -4409 470 5088 2287
710 2287 -3312 -3752 -636 3130 3635 -944 -4884 -1802 3581 3498 -60 -3140 -3307 1291 4841 1372
726 1372 -4057 -3382 852 3445 2770 -1451 -4835 -1132 4359 3253 -1520 -3504 -1981 1936 4416 832
742 832 -4569 -2895 2074 3412 1201 -1948 -3807 -517 4355 2753 -2758 -3708 -607 2499 3325 102
758 102 -4349 -2576 3018 3664 23 -2729 -2849 271 4028 2182 -3265 -3604 438 2999 2269 -825
774 -825 -3890 -1953 3473 3472 -943 -3629 -1673 1308 3713 1484 -3397 -3342 1425 3403 1280 -1609 -3381
791 -3381 -896 3418 3156 -1619 -3715 -865 2162 2820 549 -3314 -2778 1948 3648 320 -2680 -2468
807b468K349L337o13m825j460L834K753j032k421k658J042M421J201l826k735
822c101J105L055K056j358m095j128L951K938j866l153j052J382L630Q58m080
837h58k649K443K961O98j780l420m95M123K635k608l404j32K260K847p8l854k140
854c451K780L231k36k752k039J39L735K192l210l122P67K692J706o46l186k000
870c400L209L155j234k812j176R95K730J823l329l193J574L306N75j445k467j115
886b804L125K921j740l409m32J923K292N14k863k685J691L710J7k360k054K47
902a907K661K067j686l464PK678J970o55k565j949J867L484n09k862j341Q24K297
919I17J625j844l389O73L223J169j378k288j183J959L059m57l480r99J886K049
$$ plain form
807 -2468 -119 3218 2605 -2220 -3680 154 2907 1875 -546 -3204 -2162 2259 3460 -366 -3101
822 -3101 -1996 1059 3115 1757 -2338 -3466 485 3423 1557 -1596 -2648 -1266 2364 3222 -858
837 -858 -3507 -1064 1897 2595 815 -2605 -3100 1023 3658 1050 -2354 -2486 -226 2621 2543 -1311 -3451
854 -3451 -671 2560 2324 -428 -2467 -2328 1407 3599 389 -2733 -1966 726 2432 1786 -1400 -3400
870 -3400 -191 2964 1730 -1082 -2258 -1263 1467 3290 -39 -3232 -1658 1648 2223 778 -1689 -2804
886 -2804 321 3242 1502 -1907 -2339 -416 1876 2390 -473 -3158 -1467 2243 2260 -100 -2154 -1907
902 -1907 754 2821 1135 -2329 -2322 356 2326 1671 -894 -2843 -976 2508 1999 -863 -2204 -1380 917
919 917 2542 698 -2691 -2018 1205 2374 996 -1292 -2475 -516 2543 2086 -1394 -2393 -507 1542
935A542O08k165k616J080L043Q65k178j752n22K181K266o75l333o05K504J641
951A884k72j846k189J183L248L18k712j809R64J725J746j030l300k06K936J490
967B130j390j678j039J142K949l4k873j533J559J888O31j349k280nK929J312j801
984E58k119jJ436K009j68k745j341K128J771j37j604j710L30K841J071k253k053
1001a987P34J746J241m10k716o56K034K125j042j662j061P19K216Q40k555j626
1017b060J242J807O64r78k197m95K459J705j462k149qR58J900K58k068j743J574
1034e93K258k97j335j408K66J906J168j449k041K17J513J202k77j727j281J579
1050b99J891m55j650q57M99J650J084j643j906P62J618O97n79j645j003J777J699
$$ plain form
935 1542 2150 -15 -2631 -1551 1492 2357 179 -1573 -2095 86 2352 1677 -1656 -2261 243 1884
951 1884 1612 -234 -2423 -1240 2008 2326 -386 -2195 -1231 494 2240 1210 -2090 -2296 640 2130
967 2130 740 -938 -1977 -835 2114 2080 -793 -2326 -767 1121 1752 403 -1877 -1882 1047 2359 558
984 558 -1561 -1562 -126 1883 1715 -1030 -2371 -243 1528 1391 -213 -1923 -1593 1248 2319 66 -1987
1001 -1987 -1253 493 1734 1324 -1392 -2048 -14 2111 1069 -593 -1654 -935 1281 2121 -434 -2060
1017 -2060 -818 989 1653 675 -1522 -2017 442 2147 685 -1464 -1472 -514 1386 1644 -424 -2167 -593
1034 -593 1665 1368 33 -1375 -1109 797 1965 516 -1525 -1308 205 1407 1130 -597 -1878 -299
1050 -299 1592 1137 -513 -1370 -871 779 1863 220 -1686 -924 694 1391 812 -833 -1836 -59 1640
1067A640m68k110l14Q59J399L64j371j818Q35K055M33j288j218m56J672J529r51
1084G92j980k38J490J146k12j135j503R35K196n0j884p84L39J332J174j162j849
1101a393L3J805R70o75j347q21P96K189j23j939p81Q61J138N33j073j589J39K181
1119I04N34j224j113k87J226J348k17k123o60J428J206p7j240j256Q78J651N38
1136A516j660r65K97J214R46o23j868q4J473Q90m19j277o21N07J959m6j831p90
1154a382P90J262N31j001j342J6J640R80r72j188l11P95J400J05k078n70J157
1171a68J006J43r57q50k68J574Q56j262j180K61J039R03k52j380p47J115J479
1188A312o80r33o81K60J530L13j223j151O35J057L23l04j194m38J432J110r45
$$ plain form
1067 1640 1172 -938 -1252 -393 1006 1370 -1 -1819 -984 1071 1504 216 -1002 -1458 214 1743 792
1084 792 -1188 -1426 64 1210 998 -137 -1640 -705 1491 1441 -443 -1227 -888 444 1618 456 -1393
1101 -1393 -1360 445 1415 740 -607 -1428 -632 1557 1434 -505 -1286 -425 713 1246 173 -1416 -1277 904
1119 904 1438 214 -899 -1186 40 1388 1171 -952 -1612 -184 1022 945 -295 -1551 -673 978 1516
1136 1516 -144 -1109 -812 402 1348 725 -1143 -1227 246 1136 717 -560 -1181 -674 1285 1239 -592 -1382
1154 -1382 -592 670 1201 200 -1142 -1126 514 1494 522 -666 -977 -182 1218 1323 -755 -1325 -168
1171 -168 838 981 24 -826 -1094 480 1336 74 -1106 -845 194 1097 845 -535 -1282 -167 1312
1188 1312 632 -301 -982 -722 808 1121 -102 -1253 -618 439 762 458 -736 -1174 258 1368 423
1205D23j050j99O90Q99L88j488q44P08J227K47r74q29o9J109J134j008j327K48
1223g15Q35P27j29j104p70R33J356m87j177j93Q8J117P45j145j081M30R83L53
1241G66k63r77m99J155J009o29j149l89O26Q91L89j064j017O76J083L63r70o98
1259f97j04Q26R22n60j255O2Q37N74n6q12p18L50J530r7r02n47J35Q13P52o48
1279D05j259O2J103M18l00p47q14Q83J049R0j147n59O33O61K30n77r63M4J227
1298D39M00o26o85k32N07P29J24j196l31O81P24J41r32n86M44J017J72o64q03
1317f77J97O38M01l0j096j90Q11N80k98o73m52M62R89J04r18m33L36O42M01n62
1337B32q01r6P73P83p10n70l06O45O70o1q58k95N44N41j05l57n47m5P89N70o26
$$ plain form
1205 423 -627 -826 -136 763 1151 -337 -1181 -473 754 1001 27 -802 -871 238 1372 364 -963 -715
1223 -715 120 847 718 -386 -1156 -223 1133 646 -531 -724 -636 481 1226 81 -1000 -570 413 766
1241 766 503 -474 -973 182 1191 562 -587 -976 -350 541 930 -134 -1151 -475 608 971 1 -697
1259 -697 -801 25 947 387 -868 -806 31 605 549 -263 -981 -631 899 802 -100 -647 -512 301 1053 405
1279 405 -854 -792 311 729 429 -318 -1132 -249 800 890 -257 -816 -183 478 708 131 -832 -788 439
1298 439 839 213 -472 -704 -197 532 656 -540 -871 -190 534 675 -257 -843 -399 618 790 126 -677
1317 -677 -480 158 559 529 -567 -757 54 634 336 -337 -789 -327 662 766 -152 -585 -249 393 794 232
1337 232 -569 -665 108 891 181 -389 -695 -50 620 559 -299 -594 -50 491 386 29 -518 -563 226 796 170
1358A70q52K02N72M02o7q38j45O36N69m59l81k82J15N65N15n59o21K93N18K40
1378E93k72p22j77O25N19j63n62k71J20O00R7k79p74M03O28j2k94m68k54Q20L66
1399E23k61o55%N14M40j27o27k97N05L82M0n87k36qO89K66n76n33Q5O27K50k77
1421A37k78n05M57Q91l27o67p2K31J70M77n89m88K43P48mm86j04k52P66J79j48
1442C79p70J3K68O69k38m67l89K34P13p4j27n72R5M18L23k03p29K2O63L74k12
1463C90n36l96M05N89J40o51l63K51N17j07k54j74j75P13K03m27l56n1K71J71
1483A60M5n22k81O86K52j8l04n21J56O08K62p39k56L05K00L58l50l26o7L04O50
1504F02k49o93J49J9N79j24n06k17K97L96J92m11n41M0M60M84l38m20r1K33L85
$$ plain form
1358 170 -682 -480 92 494 427 -411 -556 80 649 190 -191 -473 -358 207 722 163 -458 -165 353 593
1378 593 321 -401 -578 47 566 403 -159 -430 -310 290 387 108 -666 -263 365 353 59 -409 -663 157 523
1399 523 262 -393 -393 121 561 434 -193 -490 15 397 437 -150 -386 -394 295 561 -15 -548 -463 164 414 137
1421 137 -141 -646 -189 702 375 -292 -364 -133 37 514 -75 -563 -320 428 424 -62 -166 -418 348 527 379
1442 379 -391 -378 -110 559 321 -146 -535 -301 412 338 211 -361 -266 152 475 272 -457 -435 228 602 390
1463 390 -146 -542 -137 452 592 -59 -422 -171 346 239 -15 -189 -364 349 552 125 -231 -282 -11 160
1483 160 205 -317 -598 88 340 322 18 -503 -347 261 523 -216 -472 -167 33 391 41 -285 -352 -48 602
1504 602 353 -340 -191 -172 407 283 -223 -440 -143 253 445 34 -507 -467 -7 477 139 -281 -372 -139 246
1525B46J38m34j96K54J78J73l55m06K34K54L38m75l46K95M8L75k71j46l76N35
1545F3K02p1m21p6L57K68l8m93q1Q3M31M4j27m39n2M73J61l23j46j10L56L11j20
1568B52l50k11J54L01J83k85j68pN01p7m05j00n8L56O7J37l20m46M25K86N0m25
1590a40j19J13L24K10m44l69J99L30L30n29j4k33L10M02k43j57r5L6L40l0k94
1611g3kk7K49o0R1l90J79L17r4o8k69r2M05J29j81m05m2M39K58j41m00J4J14J66
1635A17K65l35k53k4M32r3j45m2p9K29J64k02o7j77K48O0L7j56j48n1K54K1k8
1658B7j25r7J59L90k74j44k05K17K71j4l24rk1K26J49l22k01L17j28K84l03PJ99
1681G9j03K15j14j54j21K31L48j97l59j69L02P0J84j84l29J88M46k31k69K52k48
$$ plain form
1525 246 384 -50 -246 8 186 359 4 -402 -168 86 424 -51 -397 -102 -54 321 50 -96 -472 63
1545 63 265 194 -227 -303 54 322 284 -209 -290 -207 224 268 141 -298 -350 123 284 -39 -185 -295 61 372 252
1568 252 -98 -309 -155 146 329 44 -124 -131 370 293 -112 -212 -270 86 153 290 -30 -476 -51 235 285 -140
1590 -140 -259 -146 178 388 -56 -425 -226 104 434 -95 -109 -342 -32 370 127 -30 -125 -89 251 221 -73
1611 -73 -75 -102 147 87 178 -212 -33 284 190 122 -147 -239 166 295 114 -291 -333 106 364 223 -177 -163 -49 117
1635 117 382 47 -206 -230 202 109 -36 -78 -157 72 236 34 -33 -210 38 98 135 -21 -169 -220 34 55 27
1658 27 -98 -195 -36 354 80 -64 -269 -52 219 205 -119 -128 -149 77 226 -96 -297 20 -108 176 -127 -120 79
1681 79 -24 191 77 -77 -198 33 381 184 -175 -344 -42 28 212 28 -301 -113 333 102 -167 85 -163
1702a63J04J05P5k70j39L30J10j17k1k47%K71J00j47j79P1M12r3j19m74J20L78
1724A07M5m3j95j53J30R0K30j00j58j22K97M5k29r1N6J92P3j33L1l0N7J1p9m7
1748a6j36K93m8j00n9j15n0N20k37ql7j78K13K29k22j3j47J05J95j56n8j74O6
1771a33J03J16m3l41L39J7N4o4k82J50J17R9q8k21J58oJ98j01k7j96k1L81j7l40
1795a48j03L22j21K79k89L3n2R7L3J4j92N6J27J45kj23p9k1J17J24j84j34N8O5
1819B2Q0j55p8J37r3J40M8r4j11KJ49j10J50k24O4J40o9Q6k25O1J69K9Q0l61K09
1844D6n2Q8r0pLN0J27K8j44M6l7r3J01k63O4j2K20k01l0J07N5J80j24L0j06j39
1870a53R9J89Kj41j21L1J88K8j84N3O5M0J42j24q5p9K06p7L8l7j60m6L10Ok81
$$ plain form
1702 -163 -59 46 121 -149 -288 42 152 35 14 -233 -233 38 138 -9 -188 -117 295 202 83 -391 -271 107
1724 107 152 109 -86 -239 -109 -19 211 111 -47 -169 128 173 -56 -147 -91 101 174 41 72 42 99 110 31 -16
1748 -16 -152 141 93 -7 -66 -181 -231 289 52 44 7 -171 42 271 49 36 -111 -6 189 33 -25 -199 -133
1771 -133 -30 86 43 -298 41 58 112 48 -234 -84 33 132 44 -177 -19 -25 173 72 45 -151 -172 209 192 -148
1795 -148 -251 71 -50 229 -60 -27 -79 18 51 65 -127 -71 56 201 199 76 -3 -24 93 217 33 -101 -43 22
1819 22 102 -53 -131 6 -87 53 101 7 -104 -102 47 -63 87 -137 -73 67 -2 84 -141 -80 89 118 198 -163 46
1844 46 -6 82 -8 -15 -12 38 165 193 49 95 58 -35 66 -197 -133 -145 75 -126 -156 -49 6 186 62 92 -14 -153
1870 -153 -54 135 137 -4 -125 -94 94 122 -62 -9 56 96 238 114 29 -50 156 79 117 80 -80 -126 184 190 -91
1895i1j9Q2%J87j49k9n6J0K7J03j19N6J85j12p5N4J61j11l0m4K7j78J24J0K7Q3
1921A23k34K7k7rJ38K8j43J13Q5q2j72J75q3L22k91J02j72M5PN5K2q4k5J82j8
1946H4j7q5j03J93M0m6k29J75l4k9KN6k5Q6R8l6Lj74n6J41n6j05M1j98L21Q0l9
1973H8j22j35J45K4J58k34J0J7J59K2n7p5k89N6K73o0j2J88j93K15l44O8J18j13
1997i3Q7p2j30J74j5M4K96l63J1o4jK04n3n9K1J42L1k77J74j89K15j73o3J5n6
2022a94L88k31Q2j60m7K33Q4L5k90J19k8j82N9L01j49k19O6K03o6K47l14J61J0
2045A08j39O9r4k5OP1Q7j13J50k81K87j28q1jj80L75R1j93j05J70j39OJ45l05
2069b19Q2J60P1j66J86j77rK13j34o4N5K5pn8K3p3N5L14n1k09k9o0Q5O0o8Q4k10
$$ plain form
1895 -91 -110 -28 -28 159 10 -19 -75 -65 -38 65 -54 2 187 75 0 54 215 104 74 30 57 -121 3 13 40 123
1921 123 -111 -84 -111 -120 18 46 -97 16 101 19 -153 22 -61 261 -30 72 -100 -55 -48 7 29 -55 -80 102 84
1946 84 67 -18 -121 72 112 66 -163 12 -22 -51 -49 7 -18 68 166 130 133 -41 -97 44 -12 -117 -76 -274 47 127 88
1973 88 -34 -169 -24 0 158 -76 -66 -49 110 132 75 0 -289 -233 40 -20 -32 156 -37 178 -166 -98 20 -93
1997 -93 -6 -78 -208 -34 -49 -5 291 -72 -61 -125 -126 78 25 -34 -13 129 160 -117 57 -132 83 -90 -153 -138 -194
2022 -194 194 -37 45 -115 -162 71 155 190 -100 19 -9 -191 -132 169 20 -199 -133 70 4 251 -63 98 108
2045 108 -31 38 -56 -81 -75 -4 83 -30 120 -161 126 -2 -83 -84 -264 111 202 9 -96 74 -65 -59 86 -219
2069 -219 -137 23 94 -72 114 -63 -72 141 7 -57 -2 23 16 -42 -19 -92 -37 277 226 17 -12 -72 13 73 5 89 -121
2096a21P0K10q8j68P5O1r3L39l06n6L78l86J96j1j07L6j6O9J00k33j0N1r5J78
2120G3j3k9j63K03P4k42m3J18J13q9nq2J90j8p8J68j79L0J50l80M42q6o6k13K7
2145i8o9K51o4L4K5j12j74J90m0P9j14m6mj8J31J47r3j86J54j1J9Q4k61J06O5
2170eJ55k36N8m9q9J38L9q4r9J87j63L33o2q6nl2k4j4k66J90J72j32k0n7J83j60
2196a28K97j09n5R0j95p1M05k51L1p9J12J54j05j89L3K09pK4l39J70j01M0J28
2219F4No0j62J73r7Oo7J05N1j9J08k15MJ03K11o3k82k2K2J77n8j1j3q7K9K97k04
2246ekk9N7R9j22l1pK34q1k45K8NO2R3m9K1k36N9JL9j79J56J25K4j69K06K9k26
2274a43J66Pl8J8q1J16L0K2j04l8J47j43J36l0r7r5J89l2Q2J3j42l4J74M8j65
$$ plain form
2096 -121 -51 159 71 -97 -22 39 -54 285 -21 -77 301 -85 111 100 -7 29 13 82 182 -51 -61 -10 -105 73
2120 73 60 31 -132 71 145 -97 -140 -22 91 2 -3 -85 105 87 9 177 -2 28 178 -202 240 154 88 -125 -98
2145 -98 -167 84 20 54 79 -33 -207 -17 -57 22 -92 -138 -142 -160 -29 118 25 -161 -7 -18 1 85 -176 -70 -5
2170 -5 150 -86 -28 -77 -166 -28 11 -73 -172 15 -148 185 123 37 32 0 -24 -38 -304 -114 58 -74 -94 -151 32 -128
2196 -128 169 60 5 95 -100 -171 234 -17 14 -65 47 201 96 -93 -60 149 142 166 -173 -3 -104 -64 64
2219 64 69 9 -153 20 -77 -71 -138 -33 18 -1 107 -108 -104 -1 210 147 -135 -157 -135 42 -16 -27 -40 -127 -98 199 -5
2246 -5 -7 -36 21 120 -2 -33 -40 194 113 -132 -104 -99 -37 56 7 28 -208 -149 -148 -109 -288 -132 -7 17 -152 54 83 -143
2274 -143 23 30 -8 10 -71 45 75 97 -7 -45 102 -41 95 65 -32 -127 62 30 112 125 -17 -51 123 171 6
2299FL4k58J80m0r8O3J85L8j42N9m5m6J67q5J00j87o1P6J84j88N2j58J67l10L05
2324bJ07k89K50k05L39j67M8k09o1J17M6l21M59m9o5R8l09j1J37J36rJ76l15k61
2348c60L16J90j56o6J17J01J8j33J27q9J41k49N3R2j72P4M0Q2r0j66L00k51K93
2371B12k80j33K23n3K20j13j48j5N2K0J24P1k74R8R6k49K46j10q6J28m1J43j78
2394d7j32K55j58K19r3j37K8k1l7J25N0m8j56K68k14K3N2j8J31j61K58j08j79
2417a00K17j82P7p6J06N1J04k22k63P6m0M48j34k45J13J02J54j51l8j16j91M33
2439A23j43J1j21J79j70L29k04K1M8j83J99Q7k64K08Mp8q1Po9oK85l32J29J31
2463A10k20J09J26j20o3p8L28k31K9L5k3n6K49j85M1k41K30J11k37K6O4j40k5
$$ plain form
2299 6 40 -218 -38 -78 -176 -113 72 110 -32 27 -18 -64 103 18 118 -69 -130 -54 130 -58 -6 -164 3 -307 -2
2324 -2 105 -184 66 -139 200 33 81 -128 -189 -72 -26 -347 112 63 -2 96 -213 -224 -87 49 40 216 -99 -360
2348 -360 -44 146 -10 -76 41 142 160 27 154 65 206 -43 10 102 -70 4 44 126 36 -130 170 -81 212
2371 212 -68 -201 22 -31 189 76 -72 -87 -35 -15 109 180 -94 4 100 -149 97 -13 -99 29 -12 131 -47
2394 -47 -179 76 -82 137 44 -93 -65 -86 -123 2 52 4 -152 116 -98 -75 -23 -41 90 -71 187 79 -100
2417 -100 117 -65 12 -64 42 93 197 -25 -288 -212 -252 196 62 -183 -70 32 186 35 -3 -119 -310 123
2439 123 -20 -9 -130 49 -121 208 4 25 73 -110 89 176 -88 120 124 46 -35 -28 -97 -103 182 -150 -21 110
2463 110 -110 -1 125 5 -58 -136 192 -39 -10 25 2 -54 195 10 51 -190 40 151 -86 -60 4 -136 -161
2486a61J73j44M1Q4M2J22J1k36K71j54l2l0O4l5j67OL04p2q7o3j83J05K86j27
2510A8j12O8Q7j62J44j77J15O3J10j41R5N5k03J57k01J12j63J62k23J2J51J92
2532A59k59Q5J14K1m5k60J52o0j9M0j09J39J46j76L1k1J10O6j03j10NR8J20k37
2556a13J48j48M3P8J42k51j5J05m8J6K4q1K16j51J78L6k98K15r7m5q3K58N2k41
2580f0J54J73j60j62J25q3J85k00K2Q0M0j37K13k47L6k3J09p6j09J45K6J57j30
2603G8m6k65K56l1R0k33K81j58pk6J28j51j59M09j55M2k2p5n5J86J16l45J59j38
2627a21J66P7o3k8l8j57K60j18m7JO3J12j96N4M1J72k10JM4j80O3J86O3p0k78
2652b03J64J13j72J47j56m7J12Q5j73K99j64k7n1J43r7L5o6R2j91N8K12k36L75
$$ plain form
2486 -161 12 -132 -91 -7 35 157 168 -68 203 49 17 -13 51 16 -151 -145 159 87 0 -63 -246 -141 145 18
2510 18 -94 -26 61 -101 43 -134 -19 44 154 13 108 163 -40 117 -84 28 -135 27 -196 -184 -33 159
2532 159 -100 -15 99 120 75 -185 -33 -93 -112 -72 -181 -42 104 -72 -41 -62 48 114 11 -99 -94 4 124 -113
2556 -113 35 -113 -70 8 150 -101 -116 -11 -59 -43 -19 -100 116 -35 143 179 -119 96 -1 -46 -129 129 181 -60
2580 -60 94 267 107 -55 70 -13 172 -28 -6 74 114 -23 190 -57 -21 -44 65 -11 -120 25 51 208 78
2603 78 32 -233 23 -8 82 -151 130 -28 -35 -61 67 -84 -243 166 11 53 31 -44 -99 87 203 -142 17 -121
2627 -121 45 122 59 31 -7 -164 96 -22 -69 -68 -5 107 -89 -35 6 178 -32 -31 13 -167 -104 82 145 75 -203
2652 -203 -39 74 -98 49 -107 -154 -42 43 -130 169 5 -22 -73 70 -27 8 -58 34 -157 -99 113 -123 252
2675B52k69P9m1k05J78l3K19l32K08j03J49P0j18Q0j93n1K6J93q4P3q6L2O9k69
2699a56R4Mj6J14P4Jj63m3K26p4m4j29L1m3Q0L8m8j09K43k9q1J31J6l2j54j7J62
2726G6l14K50Q3j55m2j01L31rj9j13j2K12k24P4j13K3p1M8K22Nl78L42r4m4P2
2751D9j92K44j30K86k25L8j20J51k34J84J6j57R0J6J41k02j85O9J58Q4J01l86
2773b04Q9J99k06K70j36M9Kj01J84j54p5Q9r7K55j41j0k3J33J44n45K03N2M9m
2797B2ml4p2J3J38k35K0J3rJ9J76mk27L54j00r1J40j98m4P1J13l9j80M8o8J73
2823eJ71j88q5K63j20M2k10J29J24k46J82j3m6l7M8J42j22j59J85j98K67l3k67
2846a76K88k75L25n0M7r9j99J86P1j01q2L7J84k03J19k3o4P8P0j13r5J80k02L08
$$ plain form
2675 252 -17 62 21 -184 -6 -39 180 -152 56 -47 102 172 54 134 -59 -110 -84 109 25 98 12 44 113 -156
2699 -156 -62 -58 -74 40 114 115 -48 -91 135 61 17 -112 -81 -124 -44 -6 -54 -163 80 51 -30 101 117 85 -69 -86 76
2726 76 -238 12 95 -60 -102 -203 128 119 100 -13 -25 187 -37 37 -76 -53 -124 -76 146 151 -227 115 21 -23 49
2751 49 -143 101 -29 257 32 70 -50 101 -133 51 67 -90 0 16 157 -45 -230 -161 -3 81 182 -204
2773 -204 -115 84 -122 148 12 61 63 -38 146 -8 -83 6 -91 164 23 13 -10 123 267 -278 -75 -23 26 22
2797 22 18 -16 -88 -75 63 -172 -152 -139 -148 -129 47 43 -184 170 70 -21 119 -79 -123 -52 61 22 -158 -110 -178 -5
2823 -5 166 -22 -107 156 36 78 -132 -3 121 -125 57 44 -2 -39 9 151 29 -130 55 -143 124 91 -176
2846 -176 112 -163 162 112 159 60 -139 47 118 17 -65 -28 156 -47 72 49 -15 63 133 20 -75 105 -97 211
2870B11o8L3m34J18J54j01J20p2j38J31R8p9j02p0K10J78k35Q0m8J29k43Q2m0
2893h6J30k78J11J56n4O6o5R8rM8j92L15l54j7L4J09m3K02j99n0K50j27l8l7K54
2918B24j67l11J91O8R6l7p9J23k09p9K28j01J9P7l9J72l01K47k21j24L68N2k04
2941gj28J43L3l5J3kj2q5N8n6Q4j60O9L4r0J69j26J66P4j20K9j22l5K50r7l2k12
2968a97J02K26K5j31NJ29j51J01N7m31J93k6K12j62K1j03l2K37j95J14M4n7P9
2991F0J40J0m87J07J48p8K47j50o1n3K79j03j01J51j78K58k73J46q0j36P7J65
3013H8M3j37L6m8J42Kj39k51P5K53R0j94j32K2M1Q8j03K6J8J6L56l77J35k14J67
3038CJ4p2R1kM6L3Q3l38P5J18j11J22P2k54n4K62j25P1j93O3n4K86J1l2j66k17
$$ plain form
2870 211 143 176 -258 -140 14 -87 33 -39 -177 -46 52 -27 -129 -199 11 189 -46 34 -14 115 -128 -46 -86
2893 -86 44 -234 -123 33 -21 45 -20 78 69 117 -75 240 -114 -131 -97 12 -31 171 -28 -78 172 45 7 -30 224
2918 224 57 -254 -63 5 101 64 -15 108 -101 -180 48 -53 -34 43 4 176 -125 122 -99 -223 145 197 -7
2941 -7 -135 8 41 6 19 17 5 -80 -22 -78 6 -154 -85 -51 -141 28 -98 68 142 22 51 -71 -106 144 47 15 -197
2968 -197 -95 131 156 25 30 159 8 109 166 -265 -72 -98 114 -48 -27 -130 -162 75 -120 -6 38 -19 60
2991 60 200 210 -277 -170 -22 -100 147 -3 -64 -117 162 59 -42 109 -69 189 -84 62 -18 -154 -77 88
3013 88 131 -6 30 -18 124 126 -13 -264 -189 64 154 -40 -172 -150 -109 -21 -124 -98 -80 -64 292 -85 50 -164 3
3038 3 17 -55 36 34 80 113 196 -142 -67 51 -60 62 134 -120 -174 88 -37 34 -159 -96 -150 136 147 115 -51 -268
3064b68M29p8Jq4j39J6K58k5Qj80k9J66L5k00J64k00K6P0j06K28k95Q9K30%j70
3089e4j17K23J86l42M9J51p8j10R4j56q7L47k64K33m2o5n2J29J98k04j83K36j50
3112e8L19l73K2J43k41K8J22Q4o6n0Q0%nm1N6j25J76k8k07M3Q2J41j08j59J35
3137c0%L7r8J6j1L9R9M4m2Jq9qJ46j91K4Q3j95J26O1JJ2J5Rj95R9R0j8Q6J53j90
3167G4j21J77j42K06j19j03L0M4p6M4q8m7mN6K72k52j34K12J82l68K30k95R2J68
3191C8j72j2J37lp3J26j08O3o0J2J78p3j00o9J14RJ4L3k8J44p7O6q2N9p4l8J44
3218A68m1j73L8J9j26J34j7n1j5j0L29k92q5J00L8K68k57J22l43J35J36K0j25
3241b8L6j8N0J12n3k26J20R4n0q4n2n9J57J92Km4k41J78r3K02j84j1j8j56J71
$$ plain form
3064 -268 161 83 84 0 -139 -123 135 110 118 -62 -91 75 110 -90 74 -126 -100 -30 -136 92 -203 -114 116 116 -54
3089 -54 -171 52 238 -104 -55 96 18 -92 2 -154 -241 106 -158 75 33 -32 -84 45 243 39 -144 92 -58
3112 -58 261 -112 -90 53 -188 -160 -38 46 -20 -70 10 10 5 -36 20 -105 71 43 -164 -121 -39 102 -6 -165 -30
3137 -30 -30 7 -91 -75 -86 -47 52 96 54 55 -34 -42 104 -87 -63 20 -175 -49 12 13 25 40 49 -146 -47 43 25 111 264 74
3167 74 -47 130 -12 194 75 -28 2 46 -30 14 -74 -121 -125 -69 203 -49 -183 29 211 -157 73 -222 -130 38
3191 38 -134 -146 -9 -12 -85 41 -67 -4 -64 -52 126 53 -47 -116 -2 7 21 54 26 170 93 159 77 136 62 24 168
3218 168 127 -46 -8 11 -115 19 2 -49 -64 -74 255 -37 -122 -22 16 284 27 149 -194 -59 77 97 -28
3241 -28 8 -10 40 152 99 -127 -7 87 37 -47 -99 -158 -1 191 193 149 -92 86 -7 195 11 0 -18 -174 -3
3266cR4k81l7K13R3J21j73J49j18j05O6J20k47PJ75P2j36o9M1M2K00m13K60k7
3290D4j31K36k11L33m75K92k19J46K4j55N9O5k22Q9P4J07kJ08k14j71K65p6J04
3313G0k22n6R5P6O4J28j44N2j37J32O7l48J53J04Ooj53q0K21j13K25j45N1Q4j87
3338f3J34j85L07j93k7j05J28J16j66Q7N9q4J14r3l8j3J69k31l3M2O3K38k23j
3362BJ65k03M7P4k06P7J88pj87J91j76m2J63L4j60j0j73L18o9J71j42K3j99L9
3386h2L6K0J02j12K11j08k40K03k31J15J00O3j94r8K39j51M4j4K6J63J2j21J4
3409cNOJ9m1k1j0k08K93l7n4l2K20l19K28k9r5r4K26l9oj14J04p8J55j17NJ46
3436A10j39o1RR6k4k2N3J17r6J09j90P2J39j05p9j0q9J87r1K5k22K16j1L3Nl6
$$ plain form
3266 -3 91 -190 -227 -14 79 200 27 176 58 -47 19 139 -108 -101 74 146 10 -59 -18 24 224 -189 71 44
3290 44 -87 149 -62 271 -204 88 -131 15 39 -116 -57 8 -214 -125 -51 56 54 162 -52 -223 42 -34 70
3313 70 -152 -208 -113 -37 27 155 11 63 -74 58 125 -223 -70 34 40 34 -119 -199 22 -91 134 -11 40 124 -63
3338 -63 71 -114 193 0 -27 -132 -4 112 -54 33 92 8 122 29 -9 -22 147 -84 -117 -75 -12 226 3 2
3362 2 167 -36 11 85 -121 -44 144 137 -50 141 -35 -77 86 120 -40 -50 -223 95 26 197 55 78 -121 -82
3386 -82 -46 -26 76 -36 175 67 -173 30 -201 -86 14 77 -117 -215 24 -127 -83 -97 -71 92 104 -17 -3
3409 -3 2 8 27 -14 -35 -45 -253 40 3 -51 -83 137 -182 46 17 -78 -172 54 15 9 -105 -1 -79 76 -41 -36 110
3436 110 -29 -90 -81 15 -9 -31 22 139 43 152 -38 34 173 68 -11 -21 -110 77 -14 11 -211 5 -6 27 32 -4
3462dn2N3N3o8j29J39j1J20k37M2o6J46kJ7N4r1M8j22Q1J42p9oj2L1j17M9m2J43
3490H0q2K5J24Nj66JJ55k56K42J17j92P6q4J0k08K6J48O5j79K91j57pm8K2J73
3515A81k79L3J24R9j40P5j06jK90m88K00r8km5J79j63Q2K73o0lj06p6k9P3K5l0
3541Hj37K15m1J2j1o5r5K18l9ok28J26K04j76q4Q0J96k19N9k8m7N7j69n5L50N5
3567A80j11n9Q5j09jP1p7R1n2R4r7l88M07j61M3J71r8J5J66j89J2M6o6l4oM9O5
3594D7j00J27o5q3N9N6q9M5Qm0L2P9Q8k75l5J23q7J53j19J61k6j46J43Jr3j45
3620a81K03j51J12n4k8J13j64K32j74j19P0r0J23R4m7l3J45JJ06j58J30l05J00
3643g5J08j7R5J8j30k25J93l2L8O2j74J89P1j34j92J18K14j71J12p5q0P9j3m4
$$ plain form
3462 -4 -56 -3 50 -18 -147 -8 -19 101 -136 -94 -160 -14 -16 1 55 -36 12 -110 -29 113 34 28 16 47 -70 -21 -63 80
3490 80 -2 23 147 152 -14 -13 142 -114 128 245 53 129 45 55 -153 -127 21 86 -93 198 41 34 -14 8 181
3515 181 -98 -65 59 158 18 93 -13 -14 276 -212 -12 -110 -112 -157 22 -141 -59 214 154 151 45 -31 -60 13 38 8
3541 8 -129 86 45 57 46 -19 -114 104 65 59 -169 -43 161 -15 -99 -19 177 -42 17 -11 -58 -1 -170 -225 125 180
3567 180 69 10 95 -14 -15 56 -21 70 18 112 15 -373 34 -127 -84 87 -11 4 170 -19 -7 39 -27 -61 -67 -18 47
3594 47 -53 74 9 -74 -15 41 -48 -3 5 -35 -3 76 164 -111 -146 -23 -110 43 -76 85 59 -87 56 57 -36 -181
3620 -181 22 -129 -17 -71 -99 14 -150 82 -92 -211 -141 -231 -108 -14 -61 -94 51 52 158 0 130 -175 -75
3643 -75 33 16 111 129 -1 -226 -33 -65 -27 35 -139 50 121 -13 -205 -87 127 -44 68 -7 -87 -8 -21 -65
3667f5N9j76K41q1K92k40j95L35q3j50n2O8j4O2J50j11R1k07K36m5j73O2j14L26
3691B16l19J00j46J58J5m0N4J09l30K36R4K4k63J51j07oJ77k57J08P8p1j4l1R6
3715C2j42J48J08j33R3p4j06P4Qj0R8j78K17k84K47k08jN0j22K76l8j46J62L0
3739A01p8J43j19J7K2k65J40O7rq4O1o8O2r1j07K95k7M7o6j48K94p4j01J78j60
3764C0RK3n1%j16K26m5k53K50L0kj10j93K62n0J94p3j39J3n2J67k34J44l0J36
3789A36j85P6q5N3j31K74q8k51K23J83l39K79k55P0j77J42J05j71K41pj63M8k2
3812d4N9l4K8Pm6J87k26N0N3l8J20m7k11J32L0J67j62k9R5O8j63J04O0q5k13J41
3838CJ65k35J17n2K18k50l4O3M1j00J85j09r1J30l5lj9J41o8l00K08M5J20K9M1
$$ plain form
3667 -65 -6 -182 59 -22 270 30 -165 170 87 -63 -115 -47 -61 1 151 40 131 -76 160 115 -58 4 -110 216
3691 216 -103 -3 -149 9 24 -16 38 147 -183 53 147 171 -92 59 -48 -54 123 -134 -26 52 -19 -33 -64 32
3715 32 -110 38 146 13 106 32 -74 0 8 -2 96 -82 135 -149 98 -110 -111 -61 -183 93 55 -91 71 101
3739 101 23 166 47 64 86 -179 -39 28 19 -65 -4 -72 -10 -101 -208 87 60 107 41 -107 187 113 12 190 30
3764 30 39 62 11 11 -105 121 76 -177 73 103 101 -9 -202 60 10 204 131 -8 5 -47 120 -114 30 0 136
3789 136 -49 27 -58 -5 -136 138 50 -201 22 205 -134 145 -110 -40 -217 -75 30 -141 100 93 -70 -22 -44
3812 -44 15 -19 9 16 -30 157 -69 -19 34 -4 116 69 -142 -10 20 187 25 -4 91 159 -4 100 160 75 -138 3
3838 3 168 -67 50 -2 216 -34 -68 -5 36 -64 121 12 -79 51 16 13 -6 135 67 -233 -25 20 140 169 210
3863B10j63ll35L34j3N3n5k34K75j32jJ7p2K47Jl4j67R7Rj08j25Q1O1J7J43q4
3889A9j85K24J2P3o3J2j02q5Qj3K39Qq6QJ54j60j07j53K15q6N5m2j05L06r8q0
3915c2J21j04L0l9K02l08L5N6L0j55J9R1N8j58O5J4j5l3J10J58orj86J78j97J6
3941e9K04k47K48j15O7l7J3j36J30p1P4j16j63J32j29L06j71J90r3ol2j67J90
$$ plain form
3863 210 47 44 -291 43 30 83 28 -206 69 -63 -64 -47 -119 128 129 95 -72 25 34 -74 -199 -118 -57 -40 103 19
3889 19 -166 58 70 143 80 92 -10 -95 -87 -100 139 147 61 69 223 63 -44 -197 18 -68 -13 -55 -160 146 48 -32
3915 -32 89 -15 15 -24 178 -130 -95 -39 -9 -164 -145 -54 4 -154 -89 -75 -90 -123 -13 145 139 130 -56 122 -75 -59
3941 -59 145 -102 146 31 98 61 74 -62 68 -3 71 -45 -208 -76 -205 101 -70 120 27 21 -11 -178 12
$$ [...]
8191A30
##END NTUPLES=NMR FID
##END=
