##TITLE=1H_DE-63_1_oil
 D2O
 8 sc, 
 6.8.2024
##JCAMPDX= 6.0         $$ Bruker NMR JCAMP-DX V2.0
##DATA TYPE= NMR FID
##DATA CLASS= NTUPLES
##ORIGIN= UXNMR, Bruker Analytische Messtechnik GmbH
##OWNER= root
$$ XWIN-NMR		Version 3.5
$$ Tue Aug  6 13:48:51 2024 Russian Standard Time (UT+4h)  she@DPX200
##.OBSERVE FREQUENCY= 200.1313
##.OBSERVE NUCLEUS= ^1H
##.DELAY= (6, 6)
##.ACQUISITION MODE= SIMULTANEOUS
##.ACQUISITION SCHEME= undefined
##.AVERAGES= 8
##.DIGITISER RES= 18
##SPECTROMETER/DATA SYSTEM= spect
##.PULSE SEQUENCE= zg30
##.SOLVENT NAME= Acetone
##.SHIFT REFERENCE= (INTERNAL, Acetone, 0, 15.7039)
##AUDIT TRAIL= $$ (NUMBER, WHEN, WHO, WHERE, WHAT)
$$ ##TITLE= Audit trail, XWIN-NMR		Version 3.5
$$ ##JCAMPDX= 5.01
$$ ##ORIGIN= Bruker BioSpin GmbH
$$ ##OWNER= she
$$ F:/spectra/data/she/nmr/H-F/1/audita.txt
$$ ##AUDIT TRAIL=  $$ (NUMBER, WHEN, WHO, WHERE, WHAT)
(   1,<2024-08-06 13:47:48.17 +0400>,<she>,<DPX200>,
      <created by zg, POWCHK disabled, PULCHK disabled
       configuration hash MD5:
       00 E9 B6 7A A2 85 ED C7 34 08 36 98 17 FE 4E 26
       data hash MD5: 16K
       CD E5 39 57 4C 80 3C 6F E9 2D 39 88 65 6F 75 F0>)
$$ ##END=
$$ 
$$ hash MD5
$$ B2 52 8C F0 12 43 AE 7B 06 B9 A3 A0 27 77 2D 47
##$RELAX= 
##$RELAX= 
##$RELAX= 
##$RELAX= 
##$RELAX= 
##$RELAX= 
$$ Bruker specific parameters
$$ --------------------------
##$DU= <F:/spectra>
##$EXPNO= 1
##$NAME= <H-F>
##$PROCNO= 1
##$TYPE= <nmr>
##$USER= <she>
##$AMP= (0..31)
100 100 100 100 100 100 100 100 100 100 100 100 100 100 100 100 100 100 
100 100 100 100 100 100 100 100 100 100 100 100 100 100 
##$AQSEQ= 0
##$AQ_mod= 1
##$AUNM= <au_zg>
##$AUTOPOS= <>
##$BF1= 200.13
##$BF2= 200.13
##$BF3= 200.13
##$BF4= 200.13
##$BF5= 200.13
##$BF6= 200.13
##$BF7= 200.13
##$BF8= 200.13
##$BYTORDA= 1
##$CFDGTYP= 0
##$CFRGTYP= 5
##$CHEMSTR= <none>
##$CNST= (0..31)
1 1 145 1 1 1 1 1 1 1 1 1 1 1 1 1 1 1 1 1 1 1 1 1 1 1 1 1 1 1 1 1 
##$CPDPRG= <>
##$CPDPRG1= <>
##$CPDPRG2= <>
##$CPDPRG3= <>
##$CPDPRG4= <mlev>
##$CPDPRG5= <mlev>
##$CPDPRG6= <mlev>
##$CPDPRG7= <mlev>
##$CPDPRG8= <mlev>
##$CPDPRGB= <>
##$CPDPRGT= <>
##$D= (0..31)
0 1.2 0 0 0 0 0 0 0 0.06 0 0.03 0 0 0 0 0.0002 0 0 0 0 0 0 0 0 0 0 0 0 
0 0 0 
##$DATE= 1722937667
##$DBL= (0..7)
120 120 120 120 120 120 120 120 
##$DBP= (0..7)
150 150 150 150 150 150 150 150 
##$DBP07= 0
##$DBPNAM0= <>
##$DBPNAM1= <>
##$DBPNAM2= <>
##$DBPNAM3= <>
##$DBPNAM4= <>
##$DBPNAM5= <>
##$DBPNAM6= <>
##$DBPNAM7= <>
##$DBPOAL= (0..7)
0.5 0.5 0.5 0.5 0.5 0.5 0.5 0.5 
##$DBPOFFS= (0..7)
0 0 0 0 0 0 0 0 
##$DE= 6
##$DECBNUC= <off>
##$DECIM= 24
##$DECNUC= <off>
##$DECSTAT= 4
##$DIGMOD= 1
##$DIGTYP= 9
##$DL= (0..7)
0 120 120 120 120 120 120 120 
##$DP= (0..7)
150 150 150 150 150 150 150 150 
##$DP07= 0
##$DPNAME0= <>
##$DPNAME1= <>
##$DPNAME2= <>
##$DPNAME3= <>
##$DPNAME4= <>
##$DPNAME5= <>
##$DPNAME6= <>
##$DPNAME7= <>
##$DPOAL= (0..7)
0.5 0.5 0.5 0.5 0.5 0.5 0.5 0.5 
##$DPOFFS= (0..7)
0 0 0 0 0 0 0 0 
##$DQDMODE= 0
##$DR= 18
##$DS= 0
##$DSLIST= <SSSSSSSSSSSSSSS>
$$ [...]
##$SUBNAM2= <"">
##$SUBNAM3= <"">
##$SUBNAM4= <"">
##$SUBNAM5= <"">
##$SUBNAM6= <"">
##$SUBNAM7= <"">
##$SUBNAM8= <"">
##$SUBNAM9= <"">
##$SW= 24.0689771365484
##$SWIBOX= (0..15)
0 0 2 0 0 0 0 0 0 0 0 0 0 0 0 0 
##$SW_h= 4816.95568400771
##$TD= 16384
##$TD0= 1
##$TE= 0
##$TE2= 300
##$TE3= 300
##$TEG= 300
##$TL= (0..7)
0 120 120 120 120 120 120 120 
##$TP= (0..7)
150 150 150 150 150 150 150 150 
##$TP07= 0
##$TPNAME0= <>
##$TPNAME1= <>
##$TPNAME2= <>
##$TPNAME3= <>
##$TPNAME4= <>
##$TPNAME5= <>
##$TPNAME6= <>
##$TPNAME7= <>
##$TPOAL= (0..7)
0.5 0.5 0.5 0.5 0.5 0.5 0.5 0.5 
##$TPOFFS= (0..7)
0 0 0 0 0 0 0 0 
##$TUNHIN= 0
##$TUNHOUT= 0
##$TUNXOUT= 0
##$USERA1= <user>
##$USERA2= <user>
##$USERA3= <user>
##$USERA4= <user>
##$USERA5= <user>
##$V9= 5
##$VALIST= <valist>
##$VCLIST= <CCCCCCCCCCCCCCC>
##$VD= 0
##$VDLIST= <DDDDDDDDDDDDDDD>
##$VPLIST= <PPPPPPPPPPPPPPP>
##$VTLIST= <TTTTTTTTTTTTTTT>
##$WBST= 1024
##$WBSW= 4
##$XGAIN= (0..3)
0 0 0 0 
##$XL= 0
##$YL= 0
##$YMAX_a= 217382
##$YMIN_a= -218173
##$ZGOPTNS= <>
##$ZL1= 120
##$ZL2= 120
##$ZL3= 120
##$ZL4= 120
##$ABSF1= 10
##$ABSF2= 0
##$ABSG= 5
##$ABSL= 3
##$ALPHA= 0
##$AQORDER= 0
##$ASSFAC= 0
##$ASSFACI= 0
##$ASSFACX= 0
##$ASSWID= 0
##$AUNMP= <proc_1d>
##$AZFE= 0.1
##$AZFW= 0.1
##$BCFW= 1
##$BC_mod= 2
##$BYTORDP= 1
##$COROFFS= 0
##$CY= 11.3945322036743
##$DATMOD= 1
##$DC= 2
##$DFILT= <>
##$DTYPP= 0
##$F1P= 15.6554695791079
##$F2P= 12.8336369535428
##$FCOR= 0.5
##$FTSIZE= 0
##$FT_mod= 4
##$GAMMA= 1
##$GB= 0.15
##$INTBC= 1
##$INTSCL= 1
##$ISEN= 128
##$LB= 0.24
##$LEV0= 0
##$LPBIN= 0
##$MAXI= 10000
##$MC2= 0
##$MEAN= 0
##$ME_mod= 0
##$MI= 1.114404
##$NCOEF= 0
##$NC_proc= 0
##$NLEV= 6
##$NOISF1= 3.799351
##$NOISF2= 2.8
##$NSP= 1
##$NTH_PI= 0
##$NZP= 0
##$OFFSET= 15.70392
##$PC= 1
##$PHC0= -25640.87
##$PHC1= 12.18749
##$PH_mod= 1
##$PKNL= yes
##$PPARMOD= 0
##$PSCAL= 0
##$PSIGN= 0
##$REVERSE= no
##$SF= 200.130013532006
##$SI= 16384
##$SIGF1= 3
##$SIGF2= 2
##$SINO= 400
##$SIOLD= 16384
##$SREGLST= <1H.CDCl3>
##$SSB= 0
##$STSI= 0
##$STSR= 0
##$SW_p= 3612.71676300578
##$SYMM= 0
##$S_DEV= 0
##$TDeff= 0
##$TDoff= 0
##$TI= <>
##$TILT= no
##$TM1= 0
##$TM2= 0
##$TOPLEV= 0
##$USERP1= <user>
##$USERP2= <user>
##$USERP3= <user>
##$USERP4= <user>
##$USERP5= <user>
##$WDW= 1
##$XDIM= 8192
##$YMAX_p= 0
##$YMIN_p= 0
$$ End of Bruker specific parameters
$$ ---------------------------------
##NTUPLES= NMR FID
##VAR_NAME=  TIME,          FID/REAL,        FID/IMAG
##SYMBOL=    X,             R,               I
##VAR_TYPE=  INDEPENDENT,   DEPENDENT,       DEPENDENT
##VAR_FORM=  AFFN,          ASDF,            ASDF
##VAR_DIM=   8192,          8192,            8192
##UNITS=     SECONDS,       ARBITRARY UNITS, ARBITRARY UNITS
##FACTOR=    0.0002076,     1,               1
##FIRST=     0,             0,               0
##LAST=      1.7004516,     0,               0
##MIN=       0,             -218173,         0
##MAX=       1.7004516,     217382,          0
$$ Real data points
##PAGE= N=1
##DATA TABLE= (X++(R..R)), XYDATA
0 0 0 0 0 0 0 0 0 0 0 0 -8 8 -8 8 -15 16 -16 24 -24 29 -36 40 -47 55 -64 73 -84 97 -108 123 -140 157 -178
33 -178 200 -223 248 -277 307 -341 378 -420 465 -517 571 -631 697 -774 860 -957 1070 -1198
51 -1198 1350 -1533 1754 -2028 2387 -2863 3526 -4509 5977 -12543 217382 181841 -78453 -117400
65 -117400 -105764 10042 209477 127348 -187927 -175778 78971 149049 62201 -30749 -151291
76 -151291 -95718 147794 172861 -70859 -165070 -50121 61682 121613 61440 -129233 -155985
87 -155985 50029 154794 50627 -70270 -118227 -43981 118824 132402 -44092 -131971 -42966
98 -42966 68469 111608 36142 -110346 -110470 53099 121494 29580 -66455 -96829 -32791 101281
110 101281 105989 -57772 -127136 -22325 66963 79655 29751 -89337 -110928 48256 130979
121 130979 20666 -70880 -65742 -21077 75935 106790 -35151 -127223 -19400 82344 62794
132 62794 6149 -68820 -93380 30274 124599 22127 -94129 -67363 6227 66135 79444
143 79444 -28012 -123578 -29331 96975 68837 -16114 -64330 -67038 25983 115591 31558 -94390
155 -94390 -65860 27593 65765 54185 -27112 -103455 -27826 94884 65393 -38393 -69873 -41643
167 -41643 29905 92137 24410 -94887 -68373 42686 71537 29654 -32903 -81586 -22521 89439
179 89439 67708 -45092 -70479 -17528 37117 71152 19446 -81683 -63280 48298 71626
190 71626 9432 -41813 -62264 -14815 75269 60810 -49253 -75540 -6383 45229 53149 10250
202 10250 -68386 -59153 45659 76298 3428 -46918 -43728 -4482 61517 55907 -41421 -73575
214 -73575 1389 51382 37591 -1940 -55388 -50894 38665 72546 -3303 -57127 -36089 6684
226 6684 50092 44937 -36502 -71842 1394 58944 33512 -12027 -45061 -37796 33120 69115 -277
239 -277 -59521 -29187 19733 42650 30938 -31114 -64357 762 61105 27455 -26861 -42131
251 -42131 -25105 28561 59715 -743 -62476 -28319 30461 40441 18694 -26850 -53767 -222
263 -222 61214 29329 -32338 -37932 -10038 26889 47731 864 -58392 -28233 36244 39132 3336
276 3336 -29122 -42639 -887 54817 28370 -37794 -41881 -844 29790 37233 -59 -50248 -28438
289 -28438 36698 42311 -1243 -29059 -30902 2959 46651 26730 -35330 -40560 5193 31438 26148
302 26148 -5460 -43914 -25829 34829 40365 -8598 -34044 -23619 6044 40530 24983 -34269
314 -34269 -41532 10444 35537 19503 -7245 -34788 -22618 32092 42094 -10770 -37208 -14531
326 -14531 12395 30741 19210 -29400 -41845 10230 39811 12322 -17477 -28478 -15995 26150
338 26150 39772 -8836 -41333 -12813 20615 26812 12040 -23200 -36001 8051 40759 12857
350 12857 -21965 -24646 -7446 22586 32782 -8048 -40277 -12388 23926 23752 3569 -22619 -30957
363 -30957 6782 39313 11884 -26177 -23837 -1515 21333 28046 -5327 -37344 -12062 27557
375 27557 23403 -1642 -19468 -23089 5137 35537 12814 -28142 -23391 5723 19737 18601 -5814
388 -5814 -33276 -13879 28009 24450 -8444 -22261 -15666 6591 30082 13692 -26622 -25119 9195
401 9195 23521 13432 -7317 -26584 -11710 25527 25043 -10076 -24078 -10427 9223 24278 9916
414 9916 -24867 -24990 10420 24905 8792 -11362 -22787 -8979 23502 24486 -10867 -25465 -7250
427 -7250 12555 20388 8363 -21340 -23343 10985 26044 5625 -13884 -17503 -5696 19692 22151
440 22151 -11005 -26812 -4427 15897 15900 3255 -18536 -21146 9811 26825 3906 -17779 -14667
453 -14667 -1271 17175 19653 -8271 -26052 -3638 18964 14091 -881 -15091 -16514 8085 25465
466 25465 3686 -20065 -13412 4044 14813 14173 -7930 -24329 -4350 20546 13698 -5715 -14872
479 -14872 -11990 7174 22938 4704 -20236 -13508 7643 14866 10175 -6697 -20514 -4539 20620
492 20620 13621 -8867 -14955 -7674 7170 18959 4616 -20600 -14265 9706 15141 5421 -7995
505 -7995 -17544 -4403 19233 14486 -9740 -15490 -3836 8459 15364 4280 -17507 -14201 10498
518 10498 16507 2241 -9576 -13056 -2862 16322 13611 -10630 -17266 -1331 10690 11594 1543
531 1543 -15298 -13481 9915 17799 617 -11775 -10348 -224 14154 12385 -9215 -17355 -6
544 -6 12739 9455 -953 -12904 -11359 8945 17180 -669 -13990 -8674 2564 11695 9677 -8992
558 -8992 -17244 411 14423 7578 -3874 -11250 -8778 8099 16612 -46 -14773 -7051 5462
571 5462 10552 7120 -7599 -15482 -136 15409 7494 -7063 -10245 -5842 6848 14424 -57 -15879
585 -15879 -7479 7834 10029 3981 -7286 -13529 -179 15209 7528 -8303 -10123 -2335 7412 11855
599 11855 533 -14382 -6906 8933 10268 1120 -7389 -10623 74 13575 6926 -9751 -10445 1
613 1 7527 9114 -39 -13088 -7900 9594 10711 -1161 -8029 -7753 732 12418 7442 -9188 -10844
628 -10844 2106 8656 6429 -1466 -11203 -7264 9398 11386 -2628 -9793 -5253 1936 9652 6885
642 6885 -8528 -11832 2706 10324 4528 -2766 -8615 -6210 7954 11630 -2543 -10593 -4103 4126
656 4126 7942 5073 -7324 -10938 2141 10749 3987 -5322 -7806 -3285 6739 9685 -2087 -10923
670 -10923 -4042 5973 7403 2240 -6548 -9309 2066 10896 4035 -6139 -7149 -2019 6297 8474
684 8474 -2101 -10319 -3311 6282 6687 1198 -6576 -7906 1909 10291 3209 -6951 -6935 -202 5956
699 5956 6863 -1999 -10105 -3397 8038 6598 -582 -5633 -6106 1482 9939 3760 -8082 -6786 1863
714 1863 5628 5039 -1510 -9353 -3856 7966 7210 -2714 -6230 -4433 1742 8325 3840 -7891 -7374
729 -7374 3017 6730 3391 -2586 -7414 -3132 7409 7240 -2987 -7008 -2814 2965 6812 2709 -6919
744 -6919 -7062 3188 7453 2154 -3498 -6130 -2159 6364 6796 -3336 -7634 -1774 4012 5458 1911
759 1911 -5968 -6500 3217 7810 1313 -4701 -4705 -1018 5078 6378 -3248 -8046 -1333 5057 4533 398
775 398 -5364 -5609 2570 7700 1357 -5623 -4378 -11 4982 5254 -2510 -7283 -1233 5712 4496 -971
791 -971 -4281 -4299 2297 7265 1232 -5907 -4254 1736 4580 3864 -2179 -7174 -1245 6253 4350 -2081
807 -2081 -4440 -3469 2075 6515 1585 -6010 -4053 2364 4690 2618 -2206 -6072 -1277 6222 4045
822 4045 -2837 -4392 -1665 2446 5368 1080 -6040 -4203 3062 4643 1414 -2783 -4953 -815 5725
837 5725 4264 -3507 -5145 -760 3138 4167 574 -5089 -4116 3202 5333 638 -3573 -3831 -525 4679
853 4679 3876 -3147 -5429 -286 3861 3581 14 -4628 -3927 3259 5487 -26 -3898 -3210 110 4234
869 4234 3547 -2912 -5226 -111 4232 3005 -892 -4049 -3330 3199 5456 -64 -4478 -2433 1144 3812
885 3812 3113 -2551 -5218 -51 5008 2421 -1589 -3837 -2110 2418 5106 59 -4452 -2083 1929
900 1929 3437 2160 -2189 -5094 -216 4720 2338 -2211 -3292 -1718 2559 4280 -98 -5117 -2447
915 -2447 2510 3374 930 -2222 -3909 -306 4568 2260 -2826 -3311 -542 2234 3789 32 -4411 -2743
931 -2743 2809 3913 278 -2333 -2958 -1 4400 2226 -3148 -3761 247 2571 2923 -217 -4228 -2236
947 -2236 2837 3680 -636 -2776 -2616 537 3856 2266 -2655 -3603 470 2892 2260 -561 -3589 -2135
963 -2135 2871 3695 -945 -3087 -1902 697 3303 1785 -2519 -3761 650 3320 1833 -1048 -2808
978 -2808 -1769 2452 3796 -713 -3574 -1585 1600 2538 1269 -2658 -3504 367 3497 1539 -1457 -2406
994 -2406 -998 2255 3111 -501 -3702 -1274 1918 2405 807 -2191 -3013 812 3695 1251 -2251 -2395
1010 -2395 -789 2213 2732 -501 -3538 -984 2307 2292 282 -2203 -2483 390 3337 1131 -2584 -2575 13
1027 13 1921 2474 -649 -3160 -1486 2533 2251 -366 -1988 -1976 688 3276 1350 -2561 -2377 605 2126
1044 2126 1895 -747 -3099 -1072 2656 2534 -815 -2109 -1474 891 2752 884 -2492 -2433 840 2492
1060 2492 1334 -963 -2427 -712 2420 2960 -1002 -2424 -1099 1458 2334 847 -2627 -2512 1250 2686
1076 2686 966 -1568 -2056 -771 2347 2331 -1211 -2891 -551 1392 1895 505 -1802 -2331 1015 3062
1092 3062 494 -2048 -1731 -288 2259 1978 -658 -2638 -525 1966 1537 -26 -1806 -1884 937 2586
1108 2586 604 -1874 -1484 90 1580 1814 -788 -2674 -596 2063 1506 -211 -1819 -1376 948 2711
1124 2711 356 -2278 -1530 446 1524 1246 -942 -2467 -502 1906 1295 -1127 -1895 -1131 946 2549
1140 2549 417 -2327 -1510 964 1531 976 -745 -2208 -639 2223 1637 -919 -1707 -764 919 1802 775
1157 775 -2351 -1967 875 1702 462 -928 -1937 -649 1849 1291 -1246 -1964 -243 1140 1669 418
1173 418 -2282 -1712 1389 1887 303 -1453 -1468 -387 1767 1342 -1068 -1826 -349 1448 1315 -43 -1481
1190 -1481 -1250 1104 2199 -28 -1271 -1099 272 1724 1649 -883 -1997 106 1672 1039 -227 -1399
1206 -1399 -1359 1193 1728 230 -1621 -433 404 1233 943 -862 -1982 -201 1671 1052 -503 -1364 -863
1223 -863 389 1917 52 -1699 -1098 789 1598 741 -838 -1654 164 1683 958 -901 -1166 -597 1125
1240 1125 2047 -98 -2015 -944 1275 1156 421 -1031 -1270 -71 1636 960 -941 -1184 -42 790 1477
1257 1477 21 -1263 -764 1246 1502 -316 -1060 -962 142 1661 756 -908 -1290 20 852 746 -140
1274 -140 -1221 -698 999 1356 -192 -1163 -752 63 1093 816 -945 -1319 228 1298 974 -106 -983
1291 -983 -779 1064 1573 -311 -855 -456 600 1098 587 -931 -1349 233 1404 418 -273 -1281 -398 1040
1309 1040 1745 -493 -1158 -769 400 1254 621 -837 -1369 200 1305 482 -759 -842 -339 751 1153 -364
1327 -364 -1316 -559 652 805 293 -812 -1110 216 1184 533 -747 -712 -412 709 1003 -78 -1073 -299
1345 -299 814 750 286 -852 -1144 191 1447 488 -1274 -1068 111 1291 1032 120 -1463 -504 714
1362 714 829 -341 -919 -642 -25 951 697 -715 -928 109 1025 677 -344 -763 -389 751 934 -197
1380 -197 -994 -433 218 765 402 -924 -1004 293 1244 669 -197 -574 -365 733 918 -383 -1035 -374 537
1399 537 638 306 -769 -1189 310 817 301 -498 -788 -363 609 635 -314 -913 -515 499 858 275 -431
1418 -431 -639 521 879 338 -717 -585 -386 584 842 -392 -1051 -315 468 798 -104 -685 -588 -132 778
1437 778 444 -535 -578 101 769 800 -84 -931 -489 734 448 2 -536 -332 584 1128 65 -809 -449 666
1457 666 463 625 -247 -832 92 518 696 11 -981 -451 -19 849 212 -992 -542 -128 817 343 -96 -874
1477 -874 174 605 615 -269 -687 -19 231 581 214 -726 -638 241 631 208 -498 -323 -237 703 468 -356 -712
1498 -712 -114 499 759 441 -676 -536 217 599 0 -395 -390 -184 701 853 -325 -594 -75 391 435 -7
1518 -7 -211 -489 455 874 0 -516 -638 158 604 559 -458 -450 -87 508 393 62 -407 -346 299 877 -8 -636
1540 -636 -404 122 654 405 -248 -821 -215 331 612 -366 -422 -364 108 609 175 -626 -313 -12 391 174 -129
1561 -129 -613 -238 391 351 -208 -419 -223 458 586 41 -696 -499 416 553 379 -261 -478 -165 343 388 -150
1582 -150 -556 -205 386 313 132 -222 -246 597 179 391 -268 -717 -23 603 301 -302 -514 -156 455 329 -90
1603 -90 -468 -274 443 830 -46 -207 -404 116 514 464 -159 -499 10 376 82 -262 -192 -646 214 501 -179
1624 -179 -375 -196 47 420 81 -202 -661 41 363 393 -284 -280 -235 213 1027 -111 -171 -436 338 174 161 -290
1646 -290 -612 -61 348 515 -155 -335 -60 235 305 -149 -670 -352 278 308 207 -371 -105 -245 101 207 140
1667 140 -231 -25 452 356 -327 -747 -198 239 478 -26 -361 -312 -18 225 158 -426 -279 108 151 260 206 -557
1689 -557 -297 393 166 168 -231 -430 130 264 333 -465 -315 22 307 -22 -47 -503 136 500 149 226 -438 56
1711 56 285 392 -129 -137 -572 80 152 20 -91 -363 -117 530 478 64 -166 -54 153 417 86 18 -346 224
1733 224 256 64 107 -334 20 300 363 90 -220 -14 134 217 183 -551 -239 151 393 -29 -202 -490 -166 133
1755 133 543 -258 -337 -72 1 246 180 -224 2 -178 258 28 -237 -359 -70 573 182 24 -201 -411 276
1776 276 56 71 -479 -123 158 396 95 -538 -190 45 274 420 -132 -429 -32 238 162 72 -462 -141 270
1797 270 284 -78 -610 -383 -46 429 381 -88 -379 -109 663 450 -66 -309 96 343 274 -34 -328 -401 177
1818 177 329 149 60 -266 -193 490 323 -148 -98 -61 181 173 -8 -292 -169 -48 27 -19 -201 -267 150 301 503
1841 503 -59 -485 145 -206 434 172 -204 -569 -76 361 -31 263 -446 -23 303 211 -5 -57 181 159 65
1862 65 -175 67 -326 -281 192 170 -155 -152 -8 -41 251 -582 -65 -294 288 136 -35 -182 -82 127 202 -50
1884 -50 -368 291 245 -32 131 -102 -199 -17 288 150 -140 -319 -78 456 151 24 -246 -240 -44 101 22 -272
1906 -272 -166 -17 109 134 -273 -409 -62 234 143 232 -497 -287 371 302 -6 -82 -144 -96 305 227 -88 -430 339
1929 339 387 264 -126 -235 -487 -111 15 -288 42 -228 -63 297 370 61 -122 1 35 129 -63 -195 46
1950 46 167 382 -189 -65 -323 -111 141 -89 -142 -337 -318 587 107 -30 -114 -15 -14 370 85 -96 -234 4
1972 4 89 -33 -191 -261 225 426 64 -71 -164 -34 242 228 -89 15 -87 -92 163 45 -20 -149 14 307 264
1995 264 -280 63 190 195 -16 69 143 -96 -223 -56 -45 -366 -357 -76 117 -195 34 -181 -79 82 47 -170 -354
2018 -354 -133 131 -120 -29 98 -146 61 346 97 -75 63 127 -115 57 -160 -63 77 22 104 -65 6 -76
2040 -76 -15 383 70 168 -279 162 -142 16 1 221 -56 -104 390 -47 85 -50 -35 257 -30 -44 -210 93
2062 93 44 -40 -108 -84 -48 118 551 -93 25 71 23 -281 -20 -487 56 90 363 24 -189 -232 -9 424 359 232
2086 232 -146 -111 -231 120 -38 -14 -270 244 28 92 -390 150 6 -97 -114 -224 -232 49 54 209 -137 -118 -250
2109 -250 264 222 129 171 -325 -13 29 131 126 -235 79 277 -286 -215 52 -5 128 321 -198 150 247 140 224
2132 224 -215 55 31 -130 482 -10 -123 -102 -291 4 2 -2 -201 -151 66 293 61 -322 -162 284 169 -12
2154 -12 22 -124 8 222 0 118 -294 -321 44 55 181 -169 149 133 260 349 -40 -384 136 45 -9 105 -102
2177 -102 71 -156 274 -246 -39 -179 164 -1 202 34 -133 54 180 149 91 135 -448 36 122 1 -105
2198 -105 -370 61 -1 487 -91 98 -2 119 217 -47 -14 -163 5 95 81 -307 -59 68 133 363 -11 36
2220 36 -58 178 -23 -179 -324 259 53 245 26 -243 166 -255 148 77 -8 169 19 326 166 -71 22 -223
2242 -223 123 185 2 -164 77 280 34 -366 -354 -152 -55 -150 -111 -83 98 155 211 155 139 18 217 103 123 -29
2266 -29 19 -297 68 -45 -190 214 73 -150 250 303 46 -246 117 -84 -215 -134 -110 90 135 -202 -121 -273
2288 -273 -115 -83 116 -237 14 -294 -500 268 165 -16 130 117 146 374 -361 -134 -246 -13 205 -72 97
2309 97 -326 135 292 75 -9 -87 -100 193 48 -148 -14 106 62 207 -34 -120 -2 126 -116 -97 -190 -328 -149
2332 -149 112 144 -1 128 -65 158 70 -39 240 -150 -167 255 -122 -19 -94 -413 -87 111 -185 213 50
2353 50 -5 0 135 164 64 -6 243 -80 -253 33 202 44 -35 30 250 105 -130 -27 -146 -252 -246 202 -111
2376 -111 -243 183 -75 198 235 -41 -119 -159 -67 -41 2 79 -164 131 192 259 109 -371 -83 -181 170 -73 -64 -290
2400 -290 -86 171 127 107 -104 -33 -22 232 378 -136 67 -264 -111 194 -129 -13 72 76 54 55 199 -206 -436
2423 -436 83 134 -251 -158 -70 318 331 64 -244 -26 -47 205 13 -133 -52 10 49 20 280 -40 145 -301 -165
2446 -165 111 142 -203 -56 -79 -103 -54 231 -69 -29 47 -39 96 -118 -61 -81 369 213 176 152 -34 -167 -178 51
2470 51 -32 -221 -337 -243 -44 -31 -144 -67 -179 31 -84 31 152 113 -290 -157 92 289 -129 -6 -200 166
2492 166 -71 205 -199 35 84 -36 181 -328 -122 38 248 46 -209 -95 -317 61 122 38 -238 108 -269
2513 -269 -123 -50 -223 -86 37 105 125 42 -143 159 118 162 99 230 -311 -365 353 111 88 -83 -152 111 175 -76
2537 -76 186 27 179 14 -61 -227 70 -214 103 2 -81 -247 -383 -11 30 -143 -79 309 -68 -205 -208 -11
2559 -11 -295 -91 344 -58 33 -135 -318 205 336 -206 23 39 -290 139 42 -49 -195 222 117 -85 34 149
2581 149 -275 24 30 -433 -175 194 -58 15 -160 -220 -402 100 -203 152 -184 113 -34 274 205 94 54 -78
2603 -78 207 6 101 75 28 -76 238 170 251 61 -101 182 -160 -352 48 -203 -132 -144 -34 -179 -127 -4 346
2626 346 188 -27 229 -94 -157 -1 -25 106 82 38 75 -101 -70 287 -194 -45 170 -60 -149 -51 -14 -55 182
2649 182 80 189 77 -273 95 -210 -379 206 389 -168 -31 64 215 4 158 -44 256 153 20 165
2669 165 75 -83 169 38 53 -92 10 -128 -179 -4 -84 294 -350 -26 35 374 239 -103 -293 6 92 -33
2691 -33 46 83 36 209 257 -13 -136 1 -181 -30 202 -169 -80 47 403 56 318 266 125 -44 4 42 -146
2714 -146 -153 296 -217 178 -1 178 -82 -14 306 -94 343 192 -93 -198 271 72 16 -221 -12 222 37
2735 37 152 102 -50 81 -63 108 -18 96 176 191 -234 168 159 -300 18 18 -63 -69 -134 -92 236 35 49 -57 159
2760 159 19 -63 -215 -155 117 -105 152 65 86 -149 205 -15 2 44 -394 150 -13 -435 142 273 -47 142
2782 142 84 86 195 164 107 -45 -247 -207 150 255 136 -505 87 -135 -110 -110 19 -26 -135 -239 -198 -24 -120 134
2806 134 -29 -193 -239 68 -226 166 -53 253 15 -473 491 232 48 129 -170 -76 -40 22 -227 15 -203 -187
2828 -187 3 -128 190 58 -127 118 224 -153 -90 1 -164 -142 27 193 -43 -222 328 154 -1 65 233
2849 233 125 -81 -166 -76 119 59 -205 -204 162 -96 78 -101 -264 76 131 -169 -19 -288 -99 -4 91 32 -193
2872 -193 -111 86 180 59 -394 11 41 135 -83 165 -50 -275 -116 324 85 223 -181 -90 3 -146 -167 -36
2894 -36 -38 -117 130 31 1 -74 -302 -123 -14 68 181 1 -204 -59 -72 106 38 -57 -174 -105 -68 60 -167 54
2918 54 48 50 -125 249 203 224 62 -60 114 -115 -79 79 -65 1 -230 54 210 -21 -131 -471 -160 -116 -61 -22
2942 -22 338 -103 18 331 163 -221 -164 -176 -228 12 81 -41 155 -84 2 -76 -27 13 -60 126 -136 -28 -118 63
2966 63 58 76 -208 65 415 453 -104 75 -216 -91 -131 85 258 -151 -36 361 -52 -160 106 150 110 -76 130
2989 130 -58 123 120 226 -163 -63 -51 -112 -45 -405 61 135 113 -47 -69 82 39 216 133 40 280 68 16 216
3013 216 -57 -202 -152 -70 -120 -24 283 -106 69 196 131 87 198 73 63 81 1 -11 -33 -85 116 114 -9 -424 -27
3038 -27 -64 56 -86 203 -180 253 175 -48 307 313 -159 -14 25 138 -83 26 121 283 291 167 -7 -145 186
3061 186 25 -166 -180 166 -203 316 48 4 -99 60 -28 -300 -113 106 263 -156 107 36 27 -92 24 130
3083 130 -10 -87 -23 66 -475 220 31 9 73 -148 -115 19 -468 246 323 128 130 -28 -61 262 45 31 110 -2
3107 -2 56 316 75 -201 200 377 81 107 69 -68 -40 192 9 -41 66 -86 112 265 322 100 -175 -215 312
3130 312 37 -327 -293 -10 -2 -76 -218 111 -123 115 27 -173 -112 5 -247 99 -130 -196 30 -85 20 -39 -47
3153 -47 -120 23 -382 -153 -18 -136 141 -92 173 -26 230 -321 -42 -121 -194 45 2 -178 -137 65 57 120 117 -71
3177 -71 -189 442 103 -239 -155 -265 42 215 -176 -174 69 -287 -117 13 -66 -51 -92 -87 62 189 -70 71 -32
3200 -32 221 233 13 -38 -283 -99 -57 25 -171 222 -14 70 -198 156 56 310 55 -83 256 54 132 -106
3222 -106 -209 -335 -27 122 125 -2 206 115 112 -36 -12 -26 252 -102 -2 21 34 -314 -15 55 416 230 -154
3245 -154 -163 93 29 238 -33 -96 -258 -62 193 -204 -169 -133 2 163 111 -186 -147 -65 127 104 109 -89 124 111
3269 111 80 336 -2 -144 207 308 -55 -104 253 109 36 -157 -19 -30 83 18 -243 5 39 34 -88 197 -200
3292 -200 -369 156 25 -158 -10 -167 -5 -88 -57 -177 60 141 14 -113 -143 352 65 -14 51 69 -208 -95
3314 -95 238 62 23 80 -125 -33 -98 113 -2 8 -34 116 116 59 111 -82 345 50 -29 -334 352 -2 -52 -153
3338 -153 -8 -18 101 -11 -6 159 68 -182 -83 -144 -138 171 -69 -44 96 -8 103 81 -115 120 92 11 -38 -28 294
3363 294 429 -48 47 -45 -111 -50 -97 -101 104 95 -53 46 -73 -15 62 -124 132 78 -64 16 -9 18 -189 -33 -162
3388 -162 179 -11 49 293 -89 83 -155 169 229 276 -8 61 43 -40 44 -2 -88 73 246 64 130 73 305 99
3412 99 43 159 -61 43 -152 -11 117 -1 103 31 35 89 -240 -66 241 -182 94 -116 -143 -177 -357 -69 -236
3435 -236 77 37 -109 -312 178 17 125 -5 78 205 283 -263 -32 52 102 69 38 193 314 -243 -79 -245
3457 -245 113 16 66 -147 -285 -135 77 40 173 99 -160 66 -69 8 -292 29 -123 117 -93 -261 111 -44
3479 -44 231 211 243 -210 131 98 -30 182 -23 117 -98 41 91 -113 83 56 20 136 214 -114 130 0 -73
3502 -73 129 -291 -110 -90 -36 247 441 -181 -172 -371 -157 -88 -260 -122 336 271 241 219 26 -75 86 -50 -302
3525 -302 39 1 -257 -38 80 69 363 -92 81 -323 -73 89 98 188 -24 -99 12 -131 -31 -218 163 -41
3547 -41 -35 219 -68 67 47 -228 143 -35 132 -20 219 202 -1 -117 -36 -54 122 -99 93 131 -169 168 156
3570 156 175 88 92 81 72 113 -172 224 219 16 102 -63 127 -210 -376 -50 -61 93 -8 -95 125 150 56 -38 31 170
3596 170 155 -94 16 37 -97 -180 -83 158 110 -43 234 -332 129 0 7 452 -38 -146 -54 -56 -359 95 -6
3619 -6 -96 -200 -96 22 35 279 131 -211 -70 -129 -177 -182 233 -85 -26 -91 85 16 -95 -133 50 -254 235 -61
3643 -61 -528 -149 130 144 -64 -125 220 171 7 258 -334 210 196 46 -4 382 -124 232 20 168 -192 249
3665 249 117 -199 -191 -119 -2 -161 48 -87 -44 253 -44 -97 -75 12 325 121 -172 134 -171 26 66 190 185
3688 185 -174 124 119 -187 -164 196 226 43 -101 -145 -19 -114 -138 252 -163 266 76 -165 -122 309 -17 44 96
3711 96 -116 140 10 -41 -103 -139 384 68 46 -354 -226 213 -73 -186 63 -250 157 100 -124 -52 308 -163
3733 -163 -3 -142 -154 214 -115 -116 8 -242 -143 -262 174 -26 126 391 -208 -31 181 -133 336 -308 -95
3754 -95 11 -85 40 103 -63 -76 127 158 -27 325 77 -63 -19 5 -176 72 119 -87 88 156 -18 80 87 -5
3778 -5 -256 -221 -74 11 -244 164 20 111 13 -163 -50 -381 -109 131 -46 129 38 -421 -59 142 87 -196 -396
3801 -396 -135 -167 105 70 22 131 -122 -141 53 64 -243 -115 -93 -52 272 -68 -145 -88 -161 -144 143 -74 92 -100
3825 -100 -70 18 261 4 336 -87 70 -259 -69 126 -138 165 318 -366 -225 -173 -17 -191 80 74 -155 119
3847 119 161 -147 98 -108 -61 174 86 -49 -13 -81 85 107 -271 -105 263 216 91 248 -330 -175 -73 79
3869 79 -162 -370 58 -31 125 200 50 -150 124 195 175 -124 -222 -107 370 -68 30 -267 -605 331 15 33 -26
3892 -26 -70 165 -348 -251 -183 -202 -278 -37 -265 171 150 -253 79 142 -222 -107 -33 -138 175 -26 298 100 -189
3915 -189 1 -106 16 262 -191 -267 -35 136 10 238 -15 334 18 93 499 -29 3 183 14 339 44
3936 44 -20 139 -94 82 -315 -64 -186 -38 46 215 74 22 186 -429 7 -22 14 -243 71 8 -196 1
3958 1 -101 119 -90 156 -64 170 291 -21 160 35 123 300 -61 165 206 -167 87 -14 -6 -151 -101 38
3980 38 74 -135 156 82 4 -156 -108 146 -67 117 -154 -158 -26 -147 -213 64 -121 -266 75 26 -341 30 -360
4003 -360 55 -125 155 -56 87 -53 150 -180 -32 226 -221 259 -255 -74 -45 43 -564 123 271 232 -96
4024 -96 -266 191 -11 -87 36 69 167 155 81 127 -262 -160 -108 -186 73 16 80 -302 254 -52 32 54 -135 -235
4048 -235 -24 144 -133 217 -19 40 183 -221 -77 -150 14 214 -113 -60 -62 -222 -80 -97 143 -125 -93 173
4070 173 -2 84 87 128 -108 208 165 -81 -58 -354 -5 11 -151 190 97 29 -377 -200 -109 -15 -20 275 -46 -8 8
4095 8 -304 42 -29 50 51 -79 164 145 -12 226 71 -77 -12 -129 249 -301 150 319 188 -4 -81 -22 -106 -240
4119 -240 -32 107 -88 202 172 -489 129 53 42 156 39 -9 -58 -67 -10 119 74 41 42 -126 -155 -204 8 138 -109
4144 -109 -8 -65 20 -147 -6 135 20 -200 -114 -203 -74 -119 -53 130 -221 -38 4 18 -52 166 30 -136 -185
4167 -185 -24 -62 -10 -4 135 75 198 158 146 -181 421 -109 -313 -287 32 400 230 171 -187 302 90 -47 160
4190 160 33 52 61 101 173 91 168 3 160 -139 258 149 -326 -114 -394 151 234 -369 24 91 -24 -64 136
4213 136 85 -241 -63 -16 -79 -87 106 101 146 76 -22 -134 -183 151 58 -54 238 222 -247 -221 367 -148 204 75 -51
4238 -51 -118 68 205 172 -192 86 1 103 130 64 -19 -201 -155 -229 145 -310 -283 2 -65 198 220 148 247 -290 -17
4263 -17 -90 141 -104 62 96 34 136 74 170 -181 -51 158 -151 216 -55 35 -94 11 -100 148 -92 -14 -44
4286 -44 -32 133 -259 143 4 267 -219 -47 -120 -58 142 174 -204 387 -113 -188 -111 54 -94 37 150 -30
4308 -30 2 63 332 16 -324 -182 177 70 74 236 -21 -97 42 70 -86 -85 91 0 81 -29 61 162 -153 -138
4332 -138 42 137 -174 385 -40 -32 -156 -178 -112 79 -80 208 -78 11 -29 29 102 125 54 -168 -132 247 100 -82
4356 -82 -70 63 165 -106 38 -45 -320 136 106 -210 -296 -75 -30 102 -96 -80 436 198 1 -258 -146 -83 -15
4379 -15 113 -90 -10 72 210 -8 -88 -90 -68 -126 143 -131 -127 27 -228 151 -185 130 72 78 128 132 266 -30 -117 344
4405 344 138 -33 111 -236 143 -93 99 106 -146 155 -339 54 -20 -212 -216 46 144 -98 -50 -333 -23 118
4427 118 -25 106 156 -225 -272 165 117 122 141 -130 -24 61 72 -71 30 -35 309 -54 196 -97 304 85 -49
4450 -49 -91 -113 276 55 67 -192 -126 -158 -73 72 -30 -78 35 -28 -270 -52 -150 -63 -31 -240 332 51 -203 221
4474 221 -180 -52 120 70 -260 124 -82 -214 155 -77 -79 -32 -236 -68 -225 33 -205 -210 4 83 268 56
4496 56 233 -55 100 14 -24 -115 120 -266 -86 -156 240 -116 40 288 132 -196 -217 62 -21 -103 -51 61 -108
4519 -108 -116 32 -204 116 -19 -140 90 -33 12 107 25 76 89 -265 -75 -10 -298 -18 245 44 112 1 97
4542 97 35 -21 53 -64 -91 -274 214 -78 -184 77 39 178 -96 -96 165 -24 -79 57 75 351 -44 201 241 -64
4566 -64 196 22 -187 211 -70 -371 -259 -115 -188 -32 -48 -142 57 9 318 267 58 61 132 76 75 184 -111 182
4590 182 -101 237 38 -380 -64 -25 -80 -84 -188 157 -65 129 19 -230 -13 113 259 313 10 -320 124 -397
4612 -397 -72 97 91 -177 -228 -17 174 -123 -116 103 -122 82 -151 45 147 -42 141 -122 -205 442 205 -62
4634 -62 -62 134 30 91 105 188 241 98 -75 184 111 89 -134 -413 82 -92 -126 -26 -143 126 94 141 125 -162
4658 -162 70 175 -91 -4 -322 -181 -89 -116 -89 126 -11 -101 97 53 -69 187 123 -83 32 188 67 -104
4680 -104 -217 -73 -266 -190 -10 199 -91 176 1 -27 338 96 -178 -12 -76 -44 272 -89 295 -140 1
4701 1 108 -99 -204 -28 -78 282 -280 -141 110 151 -47 44 -124 -198 -59 162 102 39 14 -70 -190 215 -68
4724 -68 0 -348 72 -142 -28 116 204 203 87 37 190 69 -215 -58 -128 164 95 -37 -13 74 177 -38 178
4747 178 -26 -239 -117 -57 111 126 -55 -79 84 226 279 193 -176 -6 -428 174 272 49 -52 -159 -249 66
4769 66 -366 32 -260 -36 -28 155 -143 -177 -170 229 159 -87 -82 -91 146 333 114 -8 92 -18 120 194 111 47 304
4794 304 -101 66 224 -287 213 -176 0 -150 -253 46 20 14 -61 -157 34 -85 -151 367 59 -83 -7 175
4816 175 -183 -54 163 -116 -97 -208 125 39 41 202 180 -98 -97 -135 149 135 -69 -177 24 -252 45 -126 45
4839 45 18 166 334 333 41 281 -169 -141 145 -121 72 -27 -240 -65 193 -319 -161 -83 -143 8 204 -210 63
4862 63 140 87 -226 -296 -213 -55 169 -25 -123 -177 62 -77 17 -38 -6 141 3 144 20 197 -111 121 106 -109
4886 -109 -51 -196 -84 -20 -209 -43 282 71 121 93 24 -41 56 95 -46 120 324 10 -161 28 -73 150 252
4909 252 89 56 -234 -205 60 165 -257 154 23 23 219 88 69 -29 -103 -28 345 -145 109 -109 142 76 45
4932 45 -100 -247 -26 228 -5 -46 59 85 4 112 -27 277 232 230 -23 -23 -53 32 63 -14 -222 329 101 22 132
4957 132 -367 67 105 -106 201 -38 55 -6 -124 -8 83 29 -18 -85 -270 40 -2 -9 -161 -13 -9 144 33 -162
4981 -162 -27 41 56 42 75 194 -244 -18 -50 -324 178 209 119 153 115 -77 -99 -137 -77 -15 384 171 -31 -273
5005 -273 46 162 -13 47 10 -117 30 306 -59 -26 -98 28 -98 101 155 97 -107 15 -100 -116 -53 -32 -200
5028 -200 143 100 -119 -62 4 -86 -19 384 -530 140 -226 -167 209 106 15 12 -93 -42 -24 -22 -106 -16 -280 -124 106
5053 106 -169 44 -96 207 -70 256 -193 -194 282 -288 5 -113 -311 297 106 50 36 60 183 -1 -340 64
5075 64 -106 137 96 -19 -29 75 183 -48 61 103 91 -88 179 25 320 13 126 -67 38 279 74 92
5097 92 78 138 154 -120 -110 -336 46 -218 -307 87 -73 71 61 -363 144 41 -1 196 64 91 86 169 -181 -194
5121 -194 89 111 -66 62 -73 109 110 -74 -202 68 -50 4 -192 96 -20 -87 21 -23 70 131 -262 -227 -19
5144 -19 -107 -71 -187 24 -40 0 246 60 -102 -40 -6 192 130 234 91 -8 194 -144 75 2 60 -48 -52 -114 99
5169 99 148 141 -59 -211 -3 -5 -25 51 -51 -152 -51 149 420 -116 152 -75 84 7 -387 -220 241 -111 112
5192 112 70 47 -11 95 -281 328 110 88 232 44 -46 107 -22 158 -154 104 -207 -73 61 23 -93 8
5214 8 -24 -116 109 -222 -154 -129 87 44 294 1 -165 -145 36 61 27 76 -106 42 27 -2 -56 150 -21 -269 149
5239 149 91 71 76 205 27 18 78 18 34 282 81 106 39 -157 -122 417 -110 250 63 -105 -41 56 -408 -80 324
5264 324 -189 -141 253 134 -211 98 63 100 -30 -24 -5 157 150 -99 27 447 -330 30 -37 -36 -310 352 53 -178
5288 -178 -57 -102 -61 -59 -145 78 -123 200 -384 -129 -28 285 0 -251 -293 22 195 75 -136 -13 249 -99
5310 -99 -53 -48 -79 99 -190 42 -115 -392 272 -325 -21 -241 110 207 -43 -22 119 128 106 71 -86 140 -138 150
5334 150 -81 -140 87 73 -54 -174 -118 60 -13 286 138 30 200 199 -329 -53 -98 -194 -83 -100 -13 -133 -129 154
5358 154 173 -150 -40 -68 222 64 169 252 231 -137 56 -276 -35 315 -132 -54 -176 -143 -283 228 -81 -94
5380 -94 -40 -258 -119 -84 -87 -93 218 16 -292 -84 39 -141 210 215 40 -30 -104 -79 127 204 -106 -22 155 -141 99
5405 99 24 -67 -5 -3 93 -329 -61 83 -102 -281 37 83 10 75 253 -165 -55 81 29 30 -52 156 -15 -130 -59
5430 -59 -68 -106 4 33 52 -2 -162 -242 -136 -48 101 130 -57 -11 -36 -113 -105 -20 -111 -151 -93 -100 -67 -111 -64 -10 -39 159 64
5459 64 178 107 -12 208 1 150 130 75 -5 90 -170 -353 -60 -29 180 24 137 -194 98 -12 -185 -37
5481 -37 186 -116 -55 269 -36 -277 -35 130 137 -92 34 -323 122 -12 -200 86 343 267 68 74 -266 45
5503 45 -60 69 355 -43 166 -148 106 84 168 2 3 -59 -258 11 -120 205 -40 85 48 131 -244 -191 58
5526 58 12 -61 -317 62 343 38 -281 127 -7 -205 -9 321 -107 214 197 -21 107 137 255 37 -11 306
5548 306 -54 -179 -96 -74 -291 -101 161 -225 148 -77 56 -188 229 29 -115 -102 -72 13 1 -167 -51 204
5570 204 145 142 -176 91 51 -158 158 -47 -99 -175 181 293 83 -253 -5 -2 -54 -297 -59 66 -53 -189 -90
5593 -90 189 -17 209 -64 122 -328 31 -77 -37 378 46 -54 -138 256 -80 -159 133 172 -203 8 -81 -52
5615 -52 -11 -289 -26 -302 -202 325 -236 189 -56 -284 -3 17 -133 -3 56 -89 -334 -242 -35 4 -58 -75 -64
5638 -64 199 -112 244 -110 -78 16 -3 -37 -210 400 -187 194 -169 176 81 -321 -93 -65 49 -123 231 -261
5660 -261 175 5 51 78 -99 198 -168 -232 -129 -46 -78 -32 76 -49 200 -382 -65 33 -126 -121 82 166 20
5683 20 -41 -55 -60 12 -164 275 203 -76 195 -101 -200 -25 252 -63 -17 1 -290 -161 -46 92 414 68 519
5706 519 19 -51 156 -91 49 122 -160 102 41 -70 186 70 -143 110 -130 -116 -321 147 37 334 -38
5727 -38 33 122 -422 -200 -41 74 -167 34 44 6 95 15 -255 -63 -120 -270 207 -231 -3 -308 -22 304 -320
5750 -320 191 -129 -147 218 -93 -129 -121 75 38 -355 209 -47 -195 53 29 -250 -29 128 -325 112 -155 293
5772 293 -163 -228 129 -251 -84 -74 -247 -222 -210 141 -53 -95 -129 97 43 197 7 -203 -18 197 6 -64 143
5795 143 -211 -158 156 50 61 -169 225 -4 -93 -28 31 -331 -199 110 -76 265 218 -359 33 169 -107 109
5817 109 110 163 97 71 327 153 253 72 -34 82 39 -347 -30 167 206 184 168 -356 -220 -104 64 127 59 52
5841 52 -363 62 -290 -1 -126 -233 -242 -96 17 -13 29 -49 -272 24 217 14 -255 9 -257 287 -17 -105
5863 -105 50 43 -18 -40 -26 152 57 274 175 -382 137 225 168 -15 500 201 339 -329 -52 -126 313 -70 265
5886 265 -27 105 -110 62 29 19 -7 -92 -137 130 220 -52 -82 67 -136 32 -148 -41 61 239 112 5
5908 5 5 -188 -169 -39 -79 13 33 -134 27 -31 -183 152 -100 -32 -10 -103 -140 -30 -70 -230 310 -97 120 16 46
5933 46 -44 -71 32 -40 -23 117 -112 -165 -4 -172 242 9 -23 -49 163 163 -246 115 95 -38 -75 75 72 -152 56
5958 56 21 195 319 191 94 3 90 -120 -63 -98 -179 73 -17 162 214 101 -162 -338 -356 -205 227 69 -129 -77
5982 -77 244 48 301 24 108 135 127 -292 -216 46 -102 -108 257 -97 -126 -88 102 -18 -33 120 61 66 127 51 -181
6007 -181 99 58 197 256 -208 91 -86 35 -2 -209 -3 -247 298 -268 -71 -108 174 -75 -196 -60 14 -294
6029 -294 261 280 -174 65 -277 -297 96 -174 -18 90 101 -86 355 162 -171 99 162 183 115 -24 152 -21
6051 -21 -44 25 -143 -36 -96 -13 2 359 271 -119 -28 -75 -273 79 -205 64 -22 31 -243 -55 9 -215 -257 -101
6075 -101 -111 -116 191 -3 -262 91 207 -70 175 244 2 49 39 139 231 -277 197 43 270 -112 -118 -144 -115 -43
6099 -43 79 219 -38 -121 137 -204 192 31 -410 -202 -39 -61 -5 -212 145 -67 -70 -276 -172 -24 -162 -195
6121 -195 -141 -42 193 33 -125 -76 -53 -8 -205 -182 -159 -56 -464 -161 182 -308 -73 -62 72 292 -46 115 223
6144 223 -118 153 -20 164 -15 -14 -41 10 131 -47 377 -227 39 61 -200 -263 -165 -46 -154 -98 74 -61 110
6167 110 122 18 135 60 59 425 -44 -35 -68 -285 -135 101 -126 -65 330 84 -191 123 -176 -224 -9 166 169 176
6191 176 104 164 -167 -23 -39 -36 244 93 -418 110 -127 -208 -26 -208 233 55 -4 -129 -12 -139 -251 -49
6213 -49 122 -320 144 -40 109 63 -97 120 -280 164 -156 -120 -25 -214 -153 -49 32 -250 -48 223 -22 82
6235 82 -37 -32 -239 -163 -81 31 -63 38 147 -134 -57 47 279 155 -91 140 -75 36 4 -29 -54 -41 -131 26
6259 26 -66 75 255 -49 -305 -80 -51 4 115 -269 94 431 52 -39 -27 72 214 61 104 303 -86 -115 64
6282 64 162 -77 224 -244 -46 363 7 -249 -238 89 -56 -52 -114 -404 190 293 -119 -186 63 -55 -208 -5
6304 -5 -46 -112 177 -108 -92 74 133 -244 70 156 208 -153 44 -150 270 74 -11 136 282 398 -110 -24 -91 379
6328 379 -99 23 222 -49 165 -314 -52 88 -42 57 228 67 2 -150 -167 295 55 165 26 -22 -152
6349 -152 -34 -111 545 83 2 -58 -139 38 -79 -242 -72 231 -160 74 -119 -198 -265 -16 -37 70 -116 -152 109
6372 109 -49 151 -11 68 -136 -21 -159 99 113 120 88 -10 -150 46 -61 9 197 149 -76 -127 79 98 -101
6395 -101 235 23 -65 13 376 -109 -23 -292 -5 65 26 -241 -78 36 82 -329 -297 199 69 -10 37 -35 31 -267
6419 -267 -44 74 -320 -80 -177 -36 -194 72 -179 210 -128 126 19 69 -33 -2 104 -137 163 -112 22
6440 22 116 38 157 -307 221 109 181 229 -204 -92 6 248 115 29 164 -14 98 -245 -73 92 -13 -68 200
6463 200 156 -274 491 -216 -239 -40 12 -93 42 -18 50 -24 87 8 -373 -314 -86 -125 134 -102 -126 -63 -83 -95
6487 -95 -141 9 -73 -127 208 -15 -245 292 -75 -361 211 -76 -67 202 240 243 4 24 8 -65 105 -172 126 -16
6511 -16 -245 72 112 -70 -184 48 -1 116 38 25 113 238 -61 -447 143 61 33 125 -25 -33 165 -394 24 167
6535 167 108 -169 183 203 55 -28 226 209 3 49 -258 -56 12 -29 -75 60 -266 79 120 149 85 153 -17 64
6559 64 -42 -77 49 258 -159 45 167 -66 -62 -164 39 92 -59 264 -137 183 61 -55 -81 -207 219 35
6581 35 -130 -5 123 -324 90 184 -16 227 -134 -128 -164 130 124 -135 -102 168 -173 -183 -72 29 28 135 119 57
6605 57 -95 92 -446 88 83 305 -182 -138 82 249 17 28 96 46 -182 -77 93 -43 -33 -203 329 -62 123
6628 123 -2 -111 205 116 87 81 -313 78 -165 4 73 215 20 -172 -43 -34 -6 -158 -204 -112 175 1 0 -126
6652 -126 1 336 -97 -191 131 -37 140 -66 -51 -80 123 119 2 -20 -110 31 263 -159 147 17 -257 -204 191
6675 191 79 -148 -104 53 229 73 -47 77 -197 -166 -24 -129 179 130 60 -7 -60 -156 321 311 6 68 357
6698 357 123 39 77 -146 -326 43 242 93 -128 296 0 -15 -223 -20 229 175 -21 157 -192 301 24
6719 24 -194 48 -281 182 268 -37 -79 -203 -52 91 -271 108 -225 -6 43 -87 -9 -162 123 212 -39 123
6741 123 150 -123 52 240 18 -258 40 -117 -247 169 -110 -87 -334 -38 -23 -29 52 25 -94 28 -13 29 83
6764 83 26 2 -117 -32 261 0 1 3 -40 145 -117 -19 89 -16 19 -109 221 -142 13 -1 -265 32 206 -63
6788 -63 143 -133 -145 -165 -289 -49 -66 -96 203 -64 -58 200 -251 -40 271 192 -147 -33 -161 -67 62 -42 90
6811 90 44 -3 -48 -1 175 -79 -26 186 -51 -19 151 -30 126 148 67 173 -170 230 11 41 -378 -395 8 -444
6835 -444 64 -45 -96 -8 11 -192 156 -223 124 -157 487 76 143 -180 -23 -33 -374 115 -64 186 319 -222
6857 -222 -225 120 -75 24 -78 37 122 111 68 74 173 -50 -224 2 251 -373 -34 96 -123 -296 153 217 53
6880 53 -290 87 -82 -89 -49 -148 519 -262 82 156 -64 13 -31 26 118 -183 147 -34 60 -46 141 83 87 -43 95
6905 95 148 -89 -109 15 -12 -10 -107 -281 143 93 7 -221 -6 73 -35 -194 173 -50 -219 -27 23 177 80 286
6929 286 252 -66 -222 400 51 78 36 329 15 124 54 5 0 -201 -126 -26 -299 -90 149 -11 69 56 84 67
6953 67 99 10 -11 341 242 -206 -194 -111 -29 181 175 48 -105 170 59 -87 -88 20 158 78 245 -157 13 217
6977 217 57 -23 -80 81 -284 110 -69 -487 -125 316 -23 -29 48 56 -65 99 85 -27 295 -96 -59 -134 -272
7000 -272 -119 55 26 -84 89 -184 75 -134 70 -226 34 169 97 -52 93 19 -51 165 -121 -120 64 -97
7022 -97 53 -122 -62 272 -7 172 51 -125 18 6 174 -109 9 140 -124 -197 -117 -127 229 -94 14 112
7044 112 -415 -128 -51 188 -72 -20 39 -325 -66 -99 69 -164 127 -285 147 -85 -41 23 114 90 40 85 -104
7067 -104 98 -95 106 -127 25 115 135 -282 133 22 59 99 -62 196 221 -120 222 -144 374 355 -105 -21
7089 -21 112 -66 41 -185 116 149 -205 -200 -391 -271 -74 -67 -25 -109 18 -7 -49 132 -260 -37 178 -53 -185
7112 -185 149 -240 -203 -62 -8 6 -109 172 -451 236 -244 51 170 -13 55 145 173 82 -109 -403 134 -11
7134 -11 -297 7 114 237 -243 288 156 11 87 -308 73 70 29 -4 33 248 39 50 -77 -243 243 -15 70
7157 70 -39 -39 123 -2 -317 20 -86 55 90 106 -309 162 -88 2 174 -52 -151 279 49 -97 142 136 259
7180 259 25 274 42 -127 165 -224 45 -235 -87 166 214 69 -106 -78 203 -38 -19 -58 -350 45 -27 24
7202 24 145 -68 -148 -142 52 -144 85 43 133 -130 -232 90 -124 -231 78 171 3 108 98 20 319 127 -142
7225 -142 -116 -4 -268 -169 69 87 -31 -85 12 -44 249 122 -137 30 90 219 77 111 -30 -108 -49 126 -108
7248 -108 69 69 -97 120 160 18 -252 104 -22 -198 -107 81 59 -2 -63 -277 32 -17 90 195 -122 128 -97
7271 -97 53 -164 -168 120 290 -109 -91 75 -15 -204 -74 -63 -307 -136 -93 553 -29 -158 -24 -319 -179 158
7293 158 -99 505 -7 -224 95 9 60 -156 -76 347 -93 -237 -171 39 -117 201 -46 194 -77 -153 19 99
7315 99 -284 312 -43 -89 102 -445 105 0 165 70 82 -93 -40 -27 57 88 -34 146 3 -71 -259 18 -83
7338 -83 238 -382 -76 33 166 168 271 -65 100 39 158 197 110 230 -324 -33 -250 145 -85 135 -60 77
7360 77 350 -24 4 -98 15 -65 131 68 -13 -18 -193 58 -107 -31 106 61 96 -234 -138 -180 187 140 -61 7 -112
7385 -112 -75 -167 55 28 -5 -158 65 -194 -301 -119 124 -113 -116 -360 115 -155 241 151 -25 137 70 20 -274
7408 -274 -116 102 212 -252 -172 -214 186 -192 -83 177 -141 38 -148 117 41 110 -352 178 41 -16 -287 -142
7430 -142 50 361 -227 -187 -356 27 -40 -112 -40 -140 82 117 -209 85 -179 66 -8 129 -20 -262 76 35
7452 35 178 -162 -211 218 -326 203 -254 -120 178 47 235 -392 36 -230 -129 3 70 23 -153 -292 21
7473 21 -228 160 135 -103 59 23 17 60 -166 254 398 -391 123 76 -310 -71 93 56 -226 379 4 71 -128
7496 -128 114 -73 -300 -297 11 118 6 -58 -154 -55 305 17 64 415 -111 222 60 -47 48 -43 219 -135 -48
7519 -48 210 -37 -9 97 239 -147 -128 -45 109 169 -252 -22 -92 87 23 -84 30 38 -57 118 166 -66 66 -173
7543 -173 -187 -177 -255 210 124 6 -85 -40 95 -166 31 -87 -111 -263 -13 -77 346 88 146 176 44 187 36
7566 36 5 39 -244 -231 -174 -84 20 -110 37 -95 -292 -102 -107 -28 182 -327 -60 -25 -75 -140 52 -196 -90 -4
7590 -4 104 37 31 27 63 264 153 26 -45 -70 138 280 -349 22 117 -300 27 -125 144 -121 147 228 -260 85
7614 85 46 -35 3 -39 25 14 11 19 -409 235 -88 -5 -177 -143 109 -198 5 45 18 -230 175 68 -6 41 -18 -600
7640 -600 -124 -297 -353 -73 -4 36 83 20 17 172 134 -46 275 -109 -230 28 15 -174 28 307 195 50 40
7663 40 111 -123 18 -311 -133 -23 154 -77 -260 210 325 390 -163 -98 11 302 91 -270 -104 -73 232 -275
7685 -275 37 206 9 -279 1 78 214 19 227 180 149 -111 -28 25 -2 26 55 361 -248 -33 34 -21 79
7708 79 17 -185 18 223 -35 -199 -141 -261 -42 90 -94 129 177 -55 11 140 34 -171 -128 -152 52 -197
7730 -197 -155 115 111 100 -127 -256 -242 35 170 -60 -194 -100 -54 109 65 253 -98 -164 -217 264 -84 -46 94 -23
7754 -23 -17 362 -131 197 155 76 54 -27 226 -108 -49 10 93 -315 -282 28 -182 116 123 -142 119 -1 -71 -154 -26
7779 -26 -122 52 289 135 8 -41 -124 182 214 -103 141 -189 142 -317 13 -247 -116 80 -70 31 -175 -62
7801 -62 -311 -162 221 -201 -315 -278 -43 154 -55 -330 386 20 -439 267 -278 145 128 14 -241 -22 262
7822 262 30 10 -198 84 99 -235 182 -41 -31 212 73 -161 113 40 110 -14 52 -124 -52 25 -85 -178 -89
7845 -89 60 -65 278 -496 3 37 176 196 10 278 -108 76 -238 -141 16 -55 -98 -139 66 -166 41 209
7867 209 142 -153 -274 342 214 -74 15 -151 -191 12 115 320 -177 -14 236 21 89 13 -13 6 51 87 199
7890 199 187 -31 166 149 127 148 136 -334 19 17 173 9 -134 -87 -243 -28 -94 -32 -38 120 -90 72 30 -82
7914 -82 35 -95 -45 186 -64 136 240 -116 9 15 3 -35 -125 -98 -386 35 -59 48 19 12 63 -123 101 193 66
7939 66 126 210 -160 198 31 -54 -315 103 246 290 -59 157 -181 -256 92 111 -51 12 -275 209 159 -90 -47
7962 -47 -49 42 -318 11 -60 2 133 113 -53 37 159 156 -173 10 -266 -146 91 227 40 -55 22 -68 157 138 -237
7987 -237 -95 21 33 40 161 162 -25 113 155 417 -24 -20 -6 -107 -90 -412 196 -22 158 5 -220 40 -96
8010 -96 7 -26 -276 -20 182 -350 -128 233 -182 -199 87 49 12 -39 -31 179 175 124 -180 -82 -64 -5 -21 -32 -504
8035 -504 13 2 -67 253 -117 2 189 42 -111 198 -58 -140 179 -237 -14 176 141 -124 230 290 180 200
8057 200 99 -152 25 35 -177 56 -218 -174 -288 -36 -211 153 -29 24 62 65 224 -167 -12 -182 -50 31
8079 31 6 68 79 92 149 96 198 5 -196 185 26 -51 -175 4 25 -162 79 -92 115 67 278 36 -19 126
8103 126 -231 258 19 -28 -28 -144 -120 -53 74 193 -69 -93 69 62 15 151 -174 -224 136 -187 -9 78 32 -261
8127 -261 -266 -29 -38 55 164 182 -43 -14 43 181 383 -147 287 141 -297 26 118 71 116 -110 -6 185 -8 84
8151 84 -142 -17 -68 108 224 -93 -20 56 111 -55 -1 -133 -161 198 -5 154 -26 208 317 -27 -21 116 -155
8174 -155 100 -126 -342 -27 252 -78 -39 6 -2 -55 -151 155 -204 -88 82 112 182
8191A82
$$ Imaginary data points
##PAGE= N=2
##DATA TABLE= (X++(I..I)), XYDATA
0 0 0 0 0 0 8 0 8 -8 8 -16 16 -17 24 -32 40 -44 56 -64 73 -89 105 -121 139 -162 186 -215 244 -276 315
29 315 -355 402 -450 505 -563 627 -700 779 -865 959 -1064 1179 -1305 1444 -1599 1771 -1966
46 -1966 2186 -2434 2719 -3054 3446 -3922 4504 -5238 6203 -7527 9466 -12584 18430 -33190
60 -33190 148498 192055 -175883 -143959 -25634 79357 166665 69627 -218173 -159460 136743
71 136743 176072 -11392 -96743 -121538 -35393 156702 143248 -120568 -182064 7001 121936
82 121936 93296 2307 -135782 -115743 98429 170627 2682 -117563 -89933 15269 129611
93 129611 97945 -86596 -141862 -184 106893 82261 -17947 -121366 -81420 85342 123035
104 123035 -14673 -103101 -69449 17221 106311 74627 -85630 -125518 19524 106329 57000
115 57000 -18568 -89715 -74095 75557 131681 -12826 -107983 -47231 26883 76931 68679 -60770
127 -60770 -126990 6890 111350 43196 -42135 -72732 -55134 52864 116570 -4750 -117901
138 -117901 -48214 54381 73131 40282 -50192 -108263 843 119623 54654 -59731 -71396
149 -71396 -27125 49192 98594 2956 -113343 -53324 64578 70268 13674 -51118 -85940 -1339
161 -1339 105812 49043 -72438 -73386 -2093 54033 72870 -2726 -100136 -49334 74817 76679
173 76679 -5795 -55423 -59252 6480 92710 49417 -71900 -74540 14021 57186 47574 -10237
185 -10237 -83308 -45529 68706 72117 -21256 -61969 -39307 14475 73925 40741 -66950 -72914
197 -72914 23355 65865 33502 -18176 -64633 -36436 62350 73596 -21916 -65958 -25984 22740
209 22740 56997 32178 -55573 -70717 21722 67037 19179 -29690 -51163 -27131 50565 65891
221 65891 -22924 -69808 -17478 34951 47490 21168 -46199 -62355 20919 71299 18550 -37515
233 -37515 -42706 -13721 42482 57802 -17824 -69928 -16542 41875 37924 5202 -40267 -52387
245 -52387 16338 67150 14093 -47662 -37394 1064 38429 46547 -15485 -65229 -14345 50692
257 50692 38299 -5348 -35647 -38781 14488 61767 15931 -50619 -36652 11560 34533 30797
269 30797 -14819 -57863 -16629 50429 36066 -17757 -37051 -25110 15444 52635 16191 -49472
281 -49472 -37591 20240 39120 21175 -15437 -46510 -14853 47195 38017 -20295 -38720 -16630
293 -16630 17079 41386 12714 -44705 -37333 21067 38205 10914 -20174 -38219 -10942 42658
305 42658 35711 -23398 -40071 -7912 22540 35026 10520 -40053 -35431 23965 41791 5432
317 5432 -23035 -29473 -8112 36144 34251 -23302 -43090 -2901 26015 24081 3141 -32794 -32627
330 -32627 21260 43913 1033 -30882 -22305 652 30319 30387 -18709 -43598 -1702 33630 21697
343 21697 -4303 -27100 -26066 17242 41339 2502 -34018 -20868 7198 25413 21468 -17046
355 -17046 -39453 -2421 34228 19425 -11205 -25389 -18487 16078 38021 3093 -34855 -19066
367 -19066 13769 24562 16148 -13930 -35359 -3659 34983 19155 -15655 -23511 -11813 12737
379 12737 31256 3624 -34536 -19776 17741 23384 6883 -14240 -28328 -4122 33280 20820
391 20820 -19030 -24865 -3831 15842 24971 3964 -30426 -20931 19413 26021 2323 -16732 -21755
404 -21755 -2296 28014 19506 -19225 -26963 -889 17868 18555 -111 -26811 -19033 19190 26994
417 26994 -676 -19592 -17032 1302 25227 18654 -17975 -26948 2079 20971 15354 -2202 -22612
430 -22612 -16820 16990 26371 -3098 -21816 -12714 4018 20095 14675 -16661 -26296 3330 22841
443 22841 11017 -6833 -18618 -12772 15347 26238 -3128 -23866 -10203 8844 17215 11104 -13506
456 -13506 -24670 2417 23658 9523 -10698 -15960 -8517 12252 22226 -2541 -24630 -9372 12804
469 12804 15273 5896 -12550 -20358 2083 24278 9907 -14064 -14939 -3496 12315 19056 -1330
482 -1330 -23280 -9783 14922 14932 1405 -11747 -16604 1209 21742 9664 -15941 -15758 755
495 755 11750 14143 -1875 -21161 -10073 16425 16085 -2356 -12583 -12205 2077 19995 10623 -15796
509 -15796 -16414 3482 13007 10398 -2702 -17943 -10010 14994 16203 -4355 -14197 -8443 3540 15789
523 15789 8574 -14842 -16571 5034 15195 7307 -4683 -14584 -8133 13835 16645 -5089 -15385
536 -15385 -6145 6185 13170 7039 -12812 -16247 4825 16021 4906 -7380 -12279 -5684 11810
549 11810 15080 -5240 -16757 -4778 8806 11194 4129 -11199 -14340 5205 17159 4188 -9795
562 -9795 -9820 -2499 10800 13988 -4319 -16971 -3999 10970 9838 1045 -9820 -12208 3904 16902
576 16902 3720 -12156 -9681 461 9332 10521 -3757 -16072 -4163 12532 9760 -1961 -9094
589 -9094 -9153 3541 15702 4419 -12537 -9644 2957 9198 8001 -3697 -14170 -4572 12270 9494
603 9494 -4333 -9667 -6303 3617 12739 3570 -12386 -9771 5022 9892 5075 -4083 -12302 -3570
617 -3570 12501 9809 -5701 -10006 -3829 4628 11014 3815 -11812 -10203 6031 10423 2876 -5467
631 -5467 -9451 -3309 10745 9842 -6205 -11380 -1312 6410 8271 2587 -10014 -10236 6404 12134
645 12134 960 -6729 -7219 -1718 8797 9508 -5566 -12130 -870 7868 6344 193 -8216 -8762 4760
660 4760 11750 656 -8831 -6055 770 7649 7346 -4547 -11340 -1116 9002 6025 -1892 -7668
674 -7668 -6242 4381 10708 1257 -8929 -5959 2202 7096 5800 -4795 -10216 -859 8808 5281
688 5281 -2846 -6873 -4941 4586 10040 705 -9639 -5555 3607 6936 3957 -4395 -9447 -953 9735
703 9735 5200 -4323 -6466 -2894 3771 8415 1111 -9939 -5645 5315 6652 1704 -4054 -7515 -1521
718 -1521 9229 5727 -5362 -7290 -1199 4444 6817 650 -8485 -5913 5598 7870 158 -5194
732 -5194 -5861 -938 7799 5694 -5421 -7869 285 5163 4827 4 -7341 -5442 5357 7996 -651
747 -651 -5692 -4420 580 6738 5005 -5167 -7612 872 6451 3984 -965 -6109 -4527 4968 7860
762 7860 -956 -6622 -3710 1730 5584 4039 -4517 -7535 888 6902 3303 -2569 -4919 -3246 4525
777 4525 7248 -675 -7220 -2764 2923 4805 2793 -4170 -6895 767 7044 2981 -3440 -4827 -1815
792 -1815 3888 6244 -544 -6934 -3021 3788 4553 1199 -3493 -5527 641 7263 2888 -4272 -4500 -675
808 -675 3731 5487 -232 -6990 -2667 4566 4689 284 -3471 -4688 660 6501 3023 -4850 -4586 478
824 478 3413 4131 -575 -5995 -3196 5257 4876 -853 -3851 -3349 1090 5632 3165 -5020 -5188 1316
840 1316 4323 3044 -1038 -5264 -2904 4559 5064 -1199 -4725 -2360 1247 4725 2056 -4219 -5292
855 -5292 1662 4970 2212 -2239 -4313 -2077 3981 4979 -1581 -5249 -1868 2106 4020 1994 -4151
870 -4151 -4912 1437 5123 1574 -2869 -3955 -1770 3612 4738 -1587 -5395 -1510 2963 3503 793 -3634
886 -3634 -4490 1295 5317 1329 -3201 -3220 -772 3671 3954 -1448 -5174 -1329 3569 3128 192 -3051
902 -3051 -3894 1343 4991 1444 -3907 -3429 483 2907 3217 -1313 -4773 -1360 4084 3302 -930 -3180
918 -3180 -2555 1534 4496 1120 -4378 -3160 1059 2935 2259 -1362 -4266 -1405 3850 3552 -1190 -3267
934 -3267 -1635 1505 3896 1095 -3745 -3178 1578 3451 1435 -1568 -3596 -1287 3954 3380 -1922 -3256
950 -3256 -1375 1526 3514 782 -3630 -3173 1742 3419 790 -2066 -3094 -761 3754 3100 -1702 -3652
966 -3652 -565 2036 2924 573 -3069 -3318 1758 3713 582 -2687 -2344 -36 3110 2956 -1690 -3812
982 -3812 -375 2862 2144 -19 -2732 -2702 1282 3819 392 -3030 -2167 433 2583 2221 -1627 -3639
998 -3639 -536 2900 2097 -544 -2455 -1962 1713 3468 15 -2714 -1959 652 2284 1753 -1367 -3195
1014 -3195 -333 3262 1822 -1017 -2192 -1535 1382 3223 542 -3137 -2023 1406 2359 1738 -1644 -3097
1030 -3097 -311 3077 2127 -1598 -2436 -1019 1733 2771 434 -3153 -2031 1629 2371 936 -1536 -2638
1046 -2638 -293 3044 1950 -1653 -2345 121 1808 2421 -25 -2824 -1844 1927 2572 153 -1847 -2050
1062 -2050 -185 2651 1872 -1870 -2821 160 1827 1627 -17 -2450 -1704 1943 2722 25 -2186 -1474
1078 -1474 252 2571 1523 -1912 -2692 538 2394 1482 -825 -2160 -1735 1889 2539 -290 -2167 -1346
1094 -1346 850 2128 1108 -1432 -2504 197 2397 822 -755 -1814 -1029 1442 2484 -388 -2660
1109 -2660 -861 1424 1708 832 -1398 -2336 514 2523 1240 -1120 -1643 -726 1473 2010 -353 -2408
1125 -2408 -1043 1353 1744 390 -1632 -2173 328 2287 1122 -1550 -1604 -275 1255 2125 89 -2351
1141 -2351 -1050 1488 1815 240 -1376 -1528 119 2336 1520 -1666 -2116 57 1844 1592 -5 -2023
1157 -2023 -1231 1715 1948 53 -1379 -1270 310 2101 1104 -1559 -1699 521 1744 949 -325 -2127
1173 -2127 -1047 1249 1752 -499 -1897 -978 618 1731 967 -1814 -2000 843 2110 1007 -897 -1679
1189 -1679 -655 1614 2182 -392 -1976 -691 967 1624 478 -1572 -1564 640 2068 544 -922 -1349
1205 -1349 -612 1334 1874 -667 -2163 -647 1132 1292 386 -1317 -1736 440 1779 469 -1358 -1525
1221 -1525 186 1326 1695 -756 -2087 -473 1190 1102 -16 -1239 -1391 508 1727 303 -1225 -1105
1237 -1105 147 1210 1098 -644 -2050 -284 1488 1322 -23 -1135 -888 487 1604 546 -1566 -1083
1253 -1083 423 1171 1216 -481 -1398 -430 1533 1324 -235 -1145 -995 496 1429 665 -1446 -1035 769 1462
1271 1462 519 -417 -1378 -233 1507 1190 -801 -1335 -560 726 1224 272 -1272 -1173 552 1343 458 -578
1289 -578 -1170 -213 1370 1285 -435 -1619 -68 775 1030 387 -1110 -1035 618 1262 592 -722 -1104 -141
1307 -141 1212 1135 -819 -1386 -301 1034 867 -140 -913 -949 690 1466 307 -1069 -720 323 1099 985
1325 985 -373 -1520 88 1388 846 -259 -836 -937 592 1414 112 -1336 -320 483 1115 502 -267
1342 -267 -1203 -433 1463 884 -461 -1082 -585 249 1214 393 -909 -780 507 638 266 -734 -1236 -427
1360 -427 1150 525 -546 -683 -551 161 738 175 -1446 -583 705 715 98 -584 -707 -142 1128 767 -558
1379 -558 -845 -95 826 999 13 -938 -669 520 989 -64 -810 -699 337 880 726 -720 -1107 73
1397 73 768 476 78 -803 -526 803 962 2 -1092 -585 65 892 780 -492 -923 260 989 560 -289
1416 -289 -800 -290 555 913 80 -775 -589 524 684 656 -402 -850 -29 773 10 -237 -601 -278 510 807
1436 807 161 -1159 -399 377 358 10 -586 -666 -9 894 592 -474 -473 -306 382 823 -5 -741 -700 576 724
1457 724 -213 -548 -855 -65 795 278 -374 -363 90 410 590 89 -705 -295 572 328 -102 -655 -547 175
1477 175 954 605 -580 -655 40 607 604 -21 -690 -627 496 787 -376 -703 -610 267 604 547 -780 -655 51
1498 51 344 363 -403 -661 -168 358 931 286 -747 -521 324 480 132 -507 -431 -36 507 277 -297 -702 -422
1519 -422 539 857 203 -812 -408 524 553 539 -640 -400 151 941 644 -368 -725 -204 364 565 -149 -741
1539 -741 -50 236 579 145 -514 -421 -165 820 192 -428 -637 7 224 591 -53 -800 -115 15 248 63
1559 63 -552 -217 354 665 388 -677 -381 -139 399 263 -93 -427 -92 465 663 -18 -503 -559 178 629
1579 629 469 -549 -636 361 335 533 70 -332 -454 592 388 135 -318 -465 252 488 252 -299 -490 69
1599 69 406 246 -204 -343 -352 528 449 -457 -583 47 418 636 100 -334 -499 408 531 -102 -270 -439 -342 658
1621 658 568 -188 -631 -273 263 288 375 -335 -224 157 333 228 -216 -143 -131 523 472 -302 -439 43 226 334
1643 334 347 -469 -380 6 488 290 -626 -190 -63 333 268 -264 -650 -311 541 459 -51 -168 -492 165 448
1664 448 52 -343 -353 -2 407 290 -29 -459 80 455 203 -124 -367 -76 506 12 27 -131 -368 224 407
1685 407 -24 -244 -474 -201 592 332 -237 -370 -41 172 648 137 -543 -356 125 250 220 -389 -366 -74 93
1706 93 327 -309 -170 -75 7 352 32 -335 -503 26 314 200 -280 -266 183 113 191 -7 -342 149 664 285
1728 285 -246 -652 -248 258 562 59 -207 -376 -46 276 545 -112 -474 -223 298 336 5 -341 54 32 282
1749 282 136 -370 -383 145 244 70 -314 -360 -58 194 -38 -72 -219 58 182 287 50 -622 -236 389 179
1770 179 -140 -312 -78 -51 582 649 -189 73 10 101 136 43 -412 -294 350 283 -89 -266 -173 47 432 379 -52
1793 -52 -516 100 389 575 431 -281 -412 436 203 70 -319 -285 35 486 243 -368 -592 -31 14 160 14
1814 14 -344 -219 273 210 290 -148 -43 40 -220 186 -535 -493 248 557 255 -13 -469 138 309 369 -26 -241
1836 -241 -304 -159 208 -262 -151 -404 -90 195 91 170 101 -141 81 288 5 -171 -50 197 102 99 -66 -238
1858 -238 176 167 -72 -238 -344 306 256 461 -67 -504 -170 184 233 -27 157 -275 4 436 439 -247 -250 113 -6
1881 -6 232 130 -197 -402 52 68 -26 53 -291 -43 170 13 -189 -574 279 284 4 -120 -126 -78 209 379 376 -419
1905 -419 -385 188 188 242 -192 -210 -178 360 -7 145 -305 -71 83 -63 75 -319 -54 64 315 87 -487 -156
1927 -156 81 260 83 -150 -2 -185 162 192 -267 -102 106 242 245 522 -44 85 -100 101 -71 -91 -103 -180
1949 -180 113 221 -113 -262 -52 -183 78 -373 -257 -89 -134 495 367 42 -129 -159 354 119 -369 -118 -270
1970 -270 276 256 33 -109 -118 403 205 283 -82 -213 -181 336 96 58 -228 26 39 -94 -109 -238 -65 -8 426
1993 426 17 -60 -113 59 -1 -99 -102 -326 16 35 24 -371 -117 -49 -118 -36 111 -89 -163 -126 441 203 -194 -171 -140
2018 -140 96 57 -124 -136 155 169 138 -5 -299 -88 -5 135 162 13 -68 49 452 70 -159 -510 59 87 188
2041 188 -147 -40 -165 -45 25 340 -49 -114 48 83 347 -236 179 -298 57 -4 -116 -158 -291 150 4 -85
2063 -85 -281 -78 40 -26 98 -112 -314 57 -41 182 102 -376 -381 138 20 77 -62 36 25 37 134 -33 -31 176
2087 176 123 21 193 -139 -170 -29 -93 -237 -248 57 99 30 -13 -99 -28 199 26 333 19 6 28 231 93 -81
2111 -81 118 -246 -284 -208 309 -189 -196 -319 67 374 22 -242 -113 -193 67 -79 -263 -120 -49 153 -92 -337
2133 -337 -148 75 194 152 -193 28 -412 136 -129 150 -317 5 -63 28 130 -73 -5 297 179 -177 -169 -164 -186
2156 -186 -21 -114 -72 -166 -21 307 -170 -103 -140 -208 51 -375 68 -129 -297 -3 -4 -104 -81 -254 92 291 29
2179 29 48 -62 -142 281 33 124 151 -150 -30 97 -201 -23 11 68 225 -235 125 -111 -144 137 -101 108 -279
2202 -279 -52 -23 427 -182 -37 9 -75 180 27 -122 -186 36 83 177 172 -75 -137 202 -13 0 -89 -153 -131 -74 -136
2227 -136 -205 138 158 294 -53 -247 -24 71 18 267 -71 -178 -136 12 217 148 162 -155 141 -75 103 288
2249 288 -261 76 -77 -11 119 -123 47 56 36 84 91 -176 -195 479 27 -27 -120 -58 -37 264 253 -300 -30 -15 272
2274 272 96 69 -307 -95 -79 293 -204 81 -230 -160 332 -52 -160 -35 -141 124 -162 47 30 -220 -337
2295 -337 156 -223 74 12 30 301 21 124 -151 -209 156 220 -26 -206 67 -122 87 57 -224 109 215 228
2317 228 -72 148 -269 59 -35 225 -13 -13 -384 290 91 -158 1 -235 365 -283 -123 -238 310 171 119
2338 119 -68 96 252 183 83 -15 -205 9 161 19 59 290 -100 -25 149 33 100 -135 2 -58 -77 18 -146
2361 -146 -213 -129 -145 -125 -29 -43 -270 70 295 74 83 -312 -136 197 -169 -1 -553 307 6 -6 -217 -138 -119 -25
2385 -25 -68 -97 -302 7 -143 151 -27 209 72 38 254 237 -159 -257 -47 -142 91 31 70 60 -170 256 63
2408 63 399 202 141 210 -44 69 33 116 -11 21 23 -14 -79 29 261 26 81 79 33 21 -112 49 20 39 -243 138
2434 138 38 308 182 53 -86 -155 194 -118 -35 -62 10 42 97 -106 -128 7 -352 -150 -151 34 90 -106 -139 -45
2458 -45 73 -92 -140 148 93 -68 -87 135 61 -161 20 -6 -126 -71 103 -255 -152 -350 -123 135 51 42 -44 211
2482 211 -78 -271 52 139 149 -23 97 101 46 33 -19 -200 -58 -224 170 157 151 -41 -19 213 144 270 -199 158
2506 158 -106 276 -6 -61 253 -56 166 178 -66 45 -38 142 -38 90 159 -276 -2 -168 205 187 354 40
2528 40 0 -59 -401 -61 -59 158 -316 115 -111 26 -206 48 -59 -318 -134 -75 181 117 102 14 -115 -161 58
2551 58 -100 -297 159 17 20 49 -153 156 249 185 -46 -131 -403 552 113 89 -199 -285 -85 198 96 132 -174
2574 -174 -140 -126 103 -154 -25 -115 72 83 -49 141 -241 -15 10 388 -56 -63 -80 -94 30 -19 166 170 13 -150
2598 -150 152 174 -448 216 -40 210 -297 -395 -8 77 -7 139 -380 -336 143 175 -119 180 30 -64 40 -293
2620 -293 38 -204 -101 -121 49 90 -20 -251 -222 169 -144 171 -137 202 268 76 118 100 -54 -25 18 -125 275
2643 275 42 117 -103 -200 24 -74 51 154 -132 45 -55 -200 -290 152 -191 -162 -182 61 -9 48 -117 -15 70
2666 70 -436 -129 6 0 -282 335 147 -91 68 65 -109 -101 -118 40 -15 -87 75 58 178 -16 -149 -36 130 -35
2690 -35 -98 -189 174 340 128 -52 -209 85 5 -251 183 38 -80 -102 160 328 -255 -162 -80 122 57 -99 -44
2713 -44 45 -49 75 -105 128 -161 -191 -65 -110 -165 14 -169 -33 -30 88 -110 -362 108 130 -313 -275 -30 430
2736 430 151 -124 -50 -175 138 15 -121 -168 -202 250 94 -67 168 -294 83 -41 123 -169 -117 -84 -85 -148 71
2759 71 21 29 98 203 -187 1 12 4 21 -58 -100 -190 -87 110 -242 162 -152 -138 42 45 85 -8 139 70 113 200 13
2786 13 -98 -134 -1 -101 -77 -109 225 -1 -144 -93 157 90 -290 104 76 94 145 66 -11 13 161 38 -151 24
2810 24 -48 -321 74 -114 30 -33 -41 291 218 307 118 199 -14 -44 193 -129 26 -167 28 151 11 -110 131
2833 131 98 79 71 -318 94 -177 -53 -379 -49 -88 -51 307 -19 -159 130 22 -229 333 -125 332 -77 -117
2855 -117 4 -119 -77 -40 -121 -117 -51 38 -10 -142 -217 -118 148 277 -404 -76 -150 -253 -243 140 -177 5 -6 285
2879 285 312 33 267 -72 218 75 180 298 -53 129 -132 288 -93 117 -178 -484 -118 181 52 -171
2899 -171 -5 210 238 77 22 -51 -155 -31 68 -249 -123 -39 -120 -28 178 -43 -212 145 -150 -59 115 -20 237
2922 237 298 -226 -147 20 -217 -264 -13 283 299 -105 -55 26 -256 -63 -46 -77 -106 -165 -358 198 275 -334 -17 -344
2946 -344 -151 -43 28 -142 91 -86 231 -16 267 -94 -332 175 -29 -80 -25 -144 -104 253 240 232 -57 97
2968 97 79 -20 -128 118 -107 156 109 19 -48 102 -127 230 154 -79 231 -84 113 131 -84 64 -195 29 -81
2991 -81 72 -10 -40 -105 -159 74 135 -226 107 241 90 238 -230 -50 -148 -51 -290 -112 -162 -96 -37 34 -64 84
3015 84 -12 -225 -44 -64 -26 -74 -189 74 -66 -102 -103 -48 101 -217 151 198 202 -343 -115 -7 230 126 -20 282
3039 282 -43 -7 82 178 319 -33 238 310 -56 122 128 98 -47 -104 80 37 -246 360 61 -143 190 -135 -97
3062 -97 31 135 197 243 -151 -309 -118 -29 31 -135 38 83 -71 -1 -2 -121 79 129 121 -24 -6 71 -160 139 -185
3087 -185 166 -66 233 -38 18 -155 -248 -73 -308 125 321 -75 131 146 125 -168 117 -229 -56 165 270
3108 270 135 199 87 56 -14 85 288 -336 36 -13 21 298 -27 -108 103 150 11 239 297 60 -200 28 -12
3131 -12 -234 86 -101 212 -114 -24 -99 -115 -10 -221 -25 248 71 -170 183 -66 19 22 116 -76 211 242 182
3154 182 264 22 151 143 -24 -86 170 127 2 -111 2 -273 80 30 97 -142 -212 65 -248 150 -156 136 160
3177 160 -159 91 -220 -13 -247 21 38 560 -81 -36 66 -240 263 -208 272 -373 49 18 -104 153 258
3198 258 -213 -242 -79 -138 -214 -196 54 277 66 93 -145 242 -3 -78 -72 -243 -103 -27 47 335 332 -191 65 43
3222 43 -316 164 112 256 4 -136 182 -59 61 -30 13 -148 -182 -40 29 -270 43 -24 -113 -22 -278 220 -251
3245 -251 -268 -6 278 14 -124 194 87 43 64 -40 -32 9 188 -88 -1 -82 222 -160 -194 -260 -145 195 -39
3268 -39 40 18 0 -225 -74 -35 -285 98 -58 12 -29 192 -37 -286 132 -117 -218 -167 -172 -161 187 -182 -518 103
3292 103 253 107 255 7 -225 -53 -34 -379 13 -115 -162 -275 216 -28 139 117 -194 345 -95 153 -209
3313 -209 92 -48 -149 26 195 35 436 -256 -118 80 -126 0 74 37 10 134 -305 -191 14 48 -30 -121
3335 -121 132 -180 137 -200 -3 154 -107 -258 -56 -394 140 222 -82 67 -268 -177 6 229 128 -375 -14
3356 -14 89 -7 -373 -134 -29 118 333 -105 -68 152 189 -80 86 50 186 315 -57 -91 -490 -171 65 79
3378 79 -50 -166 10 67 31 -179 56 80 -22 -246 82 -72 -180 -57 -80 30 -28 -205 26 45 3 -56 4
3401 4 -91 56 -24 20 180 -22 125 212 163 -147 -79 152 -44 -205 -234 85 -50 100 -206 188 -202 35 -115
3424 -115 -15 44 -150 -55 9 -104 -55 139 61 -108 110 -25 394 -13 332 -33 -241 192 78 -54 -106 -115 -158
3447 -158 28 -209 -298 -47 -34 181 60 -109 -56 -2 -114 147 -70 -389 176 -130 -6 -145 44 47 6 -70 32
3470 32 105 -333 -48 -70 -4 179 168 275 250 65 -61 125 69 96 50 -40 43 -159 164 233 24 -8 28 -146 281
3495 281 90 341 135 8 -62 325 112 42 -190 39 105 -30 23 40 212 -45 -29 -82 49 114 -81 274 98
3518 98 -173 -155 -146 365 -245 -92 37 48 -174 202 219 132 324 -274 -18 -306 104 84 -217 9 -168 50 129
3541 129 -61 16 -34 -194 -146 209 -184 -237 -51 -164 9 -124 -182 214 -187 -144 116 1 -135 41 67 126 -203
3564 -203 53 122 172 17 -335 193 157 97 -50 -103 144 195 93 129 -122 191 -111 -102 170 -159 -132 -74 307 -111
3588 -111 361 30 522 115 -56 -203 -101 67 142 96 59 -220 125 -81 -114 -74 -69 -56 -52 48 104 -256 -126 206
3612 206 -24 188 -157 97 84 9 -59 14 26 53 16 -9 -14 176 -140 -516 99 168 -55 -41 -84 86 -57 -27 38
3637 38 9 -273 78 67 212 96 74 -103 362 -91 77 248 -43 -75 -219 -122 2 142 -158 -55 140 -34
3659 -34 -99 -18 -43 205 101 9 196 143 3 -76 -100 51 -14 -54 -176 221 115 284 -85 40 -127 179 157 -68
3683 -68 -2 -214 -134 101 144 106 -183 -343 13 -45 -86 142 32 58 -31 -179 -99 165 -89 350 -72 -291 -207 -202
3707 -202 18 72 -142 -105 136 -148 28 46 21 -24 -160 -88 108 -40 208 -162 14 275 -77 -133 234 -90
3729 -90 196 -170 233 -207 -65 -60 93 -13 49 22 -131 -41 -131 -57 -48 23 -146 120 -136 158 -11 356 204 -179
3753 -179 38 151 46 -24 32 97 -182 -7 -82 4 -5 -11 214 -150 -100 -7 -198 42 -380 -266 290 -71 128 56
3777 56 -2 21 -221 -15 256 24 29 -202 -160 -228 -69 -114 -17 -63 137 -94 359 -208 -75 10 82 72 169 -234 117
3802 117 8 248 153 98 228 46 180 -162 -157 401 121 -73 136 -128 -68 85 -38 -13 127 144 -16 -80 -128
3825 -128 144 -119 -120 162 -188 -50 -76 88 -103 -38 41 107 -104 180 -16 -178 480 88 30 -41 -80 374 -171
3848 -171 -84 -297 -108 211 39 -110 -209 122 86 -77 142 80 -235 -75 270 104 165 -265 -234 124 61 10 254
3871 254 -90 -113 215 204 103 -195 -256 -20 -92 -393 -61 -138 -96 95 202 -30 154 101 215 428 -100 -317
3893 -317 -61 248 93 -327 -38 104 -117 171 -121 -189 5 69 -168 -113 -103 35 -258 -52 184 148 74 -85
3915 -85 263 22 137 106 -340 -57 64 59 -52 38 -69 103 -44 78 -131 59 -63 -276 111 -283 233 35
3937 35 -28 -63 -69 246 55 -34 153 106 -189 149 -210 114 -156 214 75 -219 -150 -114 -79 79 109 259 37 -46
3961 -46 13 -216 220 -252 -40 -85 124 -110 -20 -130 237 -12 439 173 56 225 -165 245 7 -209 -231 -30
3983 -30 -151 7 157 118 228 168 176 -39 -36 162 10 266 -51 -71 -24 170 -172 32 15 -41 79 158 192 333
4007 333 88 181 63 70 229 5 358 244 50 77 -84 -185 165 159 24 26 -23 -59 -118 -161 -149 -111 47 98 -110
4032 -110 281 -76 -186 51 141 -144 -72 149 147 99 53 -162 -21 27 42 306 153 -356 310 161 188 117 131 -25
4056 -25 -321 -233 162 -138 -158 -225 148 -217 -25 -119 -219 161 50 -2 -249 -20 97 -125 216 -45 -168 -211
4078 -211 -320 -22 -55 282 131 39 4 -289 132 -6 120 115 145 227 123 53 42 -37 144 2 126 161 54 17
4102 17 -112 -13 117 -90 -133 -30 -120 24 69 175 -91 218 -294 124 222 -21 126 115 196 -197 95 39 -168
4125 -168 29 98 -237 241 -20 202 -153 -155 -173 -56 -202 -262 276 140 109 111 -100 186 -120 120 304 -245 30
4148 30 154 251 -174 -126 159 15 -168 145 172 22 194 100 -127 41 11 -51 53 39 15 -38 50 1 249 -311
4172 -311 63 152 -34 184 325 -343 -209 71 82 5 9 171 -213 138 20 -77 -146 232 -127 -73 -258 64 -21
4195 -21 20 168 9 -189 -217 82 187 66 64 -281 164 74 115 -115 -20 -17 150 76 -225 -19 -31 117 -1 109
4219 109 233 -13 -199 44 -290 151 -130 36 -74 -32 -11 47 248 -244 9 115 -23 154 150 211 -86 -164
4241 -164 420 31 111 110 -281 -147 70 -107 -183 -507 -77 -124 -127 -226 18 5 88 -14 80 77 -88 -261 105 272
4265 272 -113 18 82 -36 -132 100 0 -147 156 -5 -144 376 -136 -277 8 -1 79 -289 115 -91 -49 -11
4287 -11 -19 -49 179 -251 35 361 -277 -170 40 72 79 218 -225 -212 -293 -14 7 -38 145 291 -40 207 27 -120
4311 -120 -56 -155 328 108 -264 209 -242 -108 96 -44 -50 -9 -98 -26 -74 168 -41 258 75 -142 56 -10 -33
4334 -33 13 195 181 219 93 252 -6 127 -73 105 -117 233 33 -4 39 -128 15 182 142 -91 293 337 449
4357 449 266 -6 164 301 103 102 125 18 -88 215 -90 -244 -254 -21 -21 -85 -75 25 221 -59 -132 -29 -23 43
4381 43 -102 45 11 52 -79 -139 56 -18 -100 112 15 58 109 -113 58 -127 102 270 -5 -21 -308 -16 217
4404 217 -206 -4 -219 28 9 -13 -300 324 133 362 295 -146 242 101 102 -52 -267 66 -73 -31 -22 -311 217
4427 217 -242 -251 -4 54 -110 -206 51 124 36 19 235 -62 82 50 -55 -76 98 110 101 27 -20 89 -90 -18 120
4452 120 109 -348 178 -64 -205 -74 41 123 -31 57 -241 12 -102 198 39 370 189 -129 -79 264 -69
4473 -69 34 -110 -143 5 26 -183 9 63 138 122 192 191 166 -349 -68 -15 250 -33 -23 -39 13 138 -272 342 -50
4498 -50 -326 274 -98 -275 4 31 -103 -29 -49 193 26 103 191 -303 46 -110 -82 -412 -92 -61 97 -117 162
4521 162 322 -70 -221 247 -337 341 114 14 91 80 25 -45 187 136 8 104 174 -202 37 -158 -189 99 -51
4544 -51 190 -77 -357 58 -107 51 200 235 -25 -19 -246 -302 82 -218 171 14 374 217 -187 155 2 18
4566 18 -173 250 98 144 -10 210 -153 -319 18 -290 201 -187 -254 1 -45 -18 -49 -319 -96 104 13 -31 -72
4589 -72 238 11 7 -174 -64 294 -76 69 66 46 71 -153 -119 -127 102 -35 16 -25 -138 -86 137 -90 -91 91 77
4614 77 -347 -149 -51 -14 9 96 4 -248 270 38 -42 -201 -108 -54 -119 186 -187 -102 -278 -2 -100 105 52 -87
4638 -87 167 -143 89 -33 128 -96 -131 165 16 -176 70 232 -224 119 225 93 -185 58 -303 136 196
4659 196 -4 172 -78 -23 -15 176 143 -25 -88 55 91 202 205 -130 -216 135 -249 -19 51 190 109 -95 7 349
4683 349 -90 135 -72 192 177 -253 -121 151 37 -70 3 107 88 145 163 -27 235 -185 -232 -258 333 38
4705 38 27 -7 25 -115 72 -201 97 -23 261 406 -112 -162 118 183 12 29 -26 -97 225 73 -283 -148 -62
4728 -62 91 80 -172 23 19 267 127 -222 -68 -170 -111 -248 -294 45 63 -187 -24 -31 47 196 34 -164 -94 -59
4752 -59 -34 -163 -73 -106 -264 12 -123 118 170 140 25 83 -128 -32 -131 -184 -90 223 145 71 214 60 -73 -25 270
4777 270 -28 -239 -102 -251 204 -2 -141 -142 320 180 81 -85 -257 109 23 306 -208 -57 -132 227 -15 171
4799 171 -36 -236 167 -112 -163 -3 75 -96 32 -85 -307 -70 -280 3 65 152 -23 -99 7 146 -89 178
4821 178 -166 109 -34 -25 -6 -100 -272 187 51 39 112 -22 -152 -182 -114 62 -10 22 -74 -36 52 -269 -102 174
4845 174 -238 -137 112 -10 396 -31 -128 124 199 -188 202 -49 -100 -184 130 117 392 98 -350 225 -93 -295
4867 -295 115 359 93 139 -244 -206 25 206 -173 39 258 270 152 155 -41 143 38 -19 210 -164 11 -219
4889 -219 -53 -53 -284 19 167 211 10 174 107 20 -90 -151 -69 328 240 156 -81 -87 -52 87 -77 -129 -52 -116 -442
4914 -442 111 -88 31 -6 -343 -88 -87 94 -137 22 25 -48 -33 -9 -40 97 215 230 -104 108 193 -32 284 -157
4938 -157 10 -13 166 6 225 -338 160 -58 253 34 -20 18 84 -247 115 -116 -118 -152 -273 -41 117 -31
4960 -31 59 -26 14 -4 -58 121 -251 -116 -36 -159 -225 -249 -224 -364 -98 213 76 77 -253 102 135 -69 29 -38 -264
4985 -264 -17 429 313 -144 -43 182 -121 -42 -65 68 257 11 127 -132 80 -24 -143 -92 -251 -57 -81
5006 -81 -159 26 -102 114 -97 -265 49 123 -289 136 -179 -22 38 11 277 -90 -34 148 22 175 206 52
5028 52 -53 243 238 110 26 -395 -229 -293 262 -5 98 189 191 -30 -174 189 -33 -194 94 -95 18 -218 14
5051 14 46 -248 -98 292 74 -195 37 -155 -60 2 148 62 -25 -72 -68 148 -303 54 63 112 143 291 9 -128
5075 -128 -175 -125 -194 -10 36 180 -78 -72 2 -163 29 335 124 27 26 -128 -165 41 36 -273 214 -88 -252 268
5099 268 -25 -333 -140 -18 33 -112 317 31 -80 256 74 271 28 -135 -112 147 92 27 132 -90 170
5120 170 189 204 175 127 335 168 -59 19 -45 -8 66 45 207 7 -189 -243 -250 284 -39 340 -146 -26 41 -116
5144 -116 -282 -258 308 131 -64 153 -151 137 102 39 22 -54 76 4 372 92 -15 -261 -183 111 16 69 -188
5167 -188 -81 115 -264 302 16 102 -174 462 -38 -100 60 -137 188 -155 61 -13 186 -224 49 300 336
5188 336 -400 -297 79 9 128 -217 113 -279 183 171 -213 15 352 451 -225 24 47 -69 -37 63 -168 111
5210 111 -228 71 338 0 -89 -48 235 153 6 -8 200 116 103 -28 282 -43 -113 152 60 143 -15 -81 -310
5233 -310 16 148 -12 38 -17 -21 -171 -29 -127 41 24 256 -68 308 47 -346 -216 -140 45 -205 -91 16
5255 16 82 -201 -158 -272 -21 299 6 103 -17 -5 48 52 -38 76 45 123 162 -35 390 -111 -151 -70 -71 -133 -81 -50
5281 -50 -319 -37 -69 -114 180 -6 168 -25 -165 -210 -42 -5 -169 -106 1 -170 -116 37 -171 -122 -230 198 -98
5304 -98 -237 116 333 8 -66 -51 -266 -66 -93 187 110 -156 -392 -202 -104 -75 17 94 72 163 55 222 -165 62
5328 62 -230 -148 -117 114 334 -218 259 20 19 -95 -47 38 -117 125 63 -82 -35 -401 87 -354 47 -47 -164
5351 -164 21 135 190 -76 143 26 19 53 232 -101 -131 169 94 59 -419 81 -42 -47 -23 111 -143 -227 -71 45
5375 45 -37 98 -68 260 15 -239 124 272 -151 -290 -68 106 255 -207 -89 67 -246 358 171 20 -9
5396 -9 138 11 238 72 129 65 110 -134 -119 139 35 -73 -105 -288 148 -393 71 64 -136 65 -171 239 111
5419 111 107 -275 -128 -277 58 61 47 97 -156 90 -19 -215 -146 -252 121 -90 200 -218 105 -30 53 231 -350
5442 -350 72 204 -84 -89 184 79 -75 157 -30 -224 -139 220 -239 -45 48 122 43 -130 74 -393 261 90
5464 90 147 -102 68 -164 133 124 4 -122 182 234 110 -26 200 17 51 21 165 8 156 -50 207 74
5486 74 -31 -194 -13 -142 -84 285 -265 -11 47 -101 -146 44 -228 -20 204 229 -40 25 73 189 243 226 -250
5509 -250 -101 72 129 -144 -76 -93 -105 38 -17 68 -175 -325 -145 257 -70 33 -79 95 -24 89 89 187 82
5532 82 122 150 9 357 -54 -38 -135 -127 29 -10 -163 -53 24 -203 73 380 141 -38 22 251 145 -15 171
5555 171 218 155 208 90 111 348 195 -16 78 -192 -53 -61 120 78 13 22 -241 82 9 -33 -142 -102 127 137 -99
5580 -99 117 167 75 15 -57 128 -251 -104 228 90 -82 -320 159 -97 234 79 138 7 -5 221 -137 116
5602 116 18 -399 64 38 -28 3 225 312 -79 -352 65 246 255 -39 140 249 65 70 181 -261 -80 -205 -75
5625 -75 149 -26 -54 163 192 208 -41 -14 -32 126 -29 -155 63 80 -65 -291 -63 150 46 267 238 -50 54
5648 54 31 39 -73 -172 64 -64 -203 32 23 26 225 -65 33 184 -99 43 99 -88 -73 -4 -52 -84 -164 -180 -248 82
5674 82 -11 212 137 -40 -227 159 56 -281 19 -8 238 -33 -170 -66 197 -139 -290 -72 47 -48 -62 -16
5696 -16 58 90 -56 -26 209 115 -163 116 -232 67 348 -49 126 -87 -148 226 146 372 383 -177 -91 -69 19 -190
5720 -190 -147 27 -97 240 -72 -7 73 99 -97 113 -200 -210 88 -192 -207 -254 -57 20 70 26 57 92 -93 74
5744 74 0 -315 313 97 112 -191 307 147 215 223 -240 52 -106 -199 -175 114 -208 -177 -63 -163 70 149 64 139
5768 139 -149 -15 46 0 -145 231 211 67 -263 -168 220 -11 -81 5 151 109 30 135 -476 1 1 42 -387 -69
5792 -69 -109 -26 -200 -279 167 -205 44 -25 -1 79 34 -120 4 138 -85 182 66 66 -118 113 -370 50 -289
5815 -289 210 -253 -60 142 49 309 -89 188 -279 -66 3 -190 39 -260 198 -50 50 246 216 -296 -3
5836 -3 26 -94 -181 25 -105 -133 306 9 27 -205 -89 -33 62 126 -100 -217 16 102 186 -293 -19 -163 165 -30
5860 -30 -10 -1 128 5 15 169 20 -140 237 -18 68 48 -125 -89 150 -64 -106 -196 -114 222 -14 63 -94 -126
5884 -126 -79 122 38 64 182 170 -254 -149 -135 46 -43 -96 -284 -25 -195 61 -7 -114 5 9 48 63 -236 134
5908 134 104 -42 74 266 4 81 -161 133 -62 217 211 494 287 78 90 -319 106 -75 293 159 -82 169
5930 169 35 141 -221 165 273 -38 -4 -162 203 68 285 195 80 -155 -380 33 106 68 -68 147 159 248
5952 248 112 104 315 216 -126 92 -80 -101 -134 75 467 -154 77 -24 1 -317 64 -249 -126 -147 -239 122 184
5975 184 -27 30 -13 14 122 -61 48 -12 91 -18 0 -82 204 6 -17 -233 -17 -37 -71 -41 -148 -73 -184 172
5999 172 -248 117 -85 -92 -1 -375 -184 36 -11 322 83 164 128 113 129 -349 -245 -269 331 129 -217 -180 -78
6022 -78 114 76 -29 -204 90 75 -173 181 -297 39 -152 -232 -26 -33 -191 167 179 -130 -13 -275 -18 -187
6044 -187 187 -186 220 -76 -210 70 132 -173 47 1 -136 96 125 -54 76 23 -22 107 59 315 -84 238
6066 238 -153 83 17 247 32 -31 99 -62 -166 34 198 166 -6 -118 164 -276 -44 38 -154 -35 -55 179
6088 179 116 -53 264 145 140 95 13 -52 -137 -30 163 218 -120 10 -18 112 73 218 19 -124 -114 -170 147 77
6112 77 -27 -25 -61 -289 -4 72 -125 74 23 -112 -144 -146 -28 -131 17 -116 -196 -114 -28 16 297 -393 -342 -246 48
6137 48 -147 -224 74 80 -432 41 160 -133 -174 205 56 -309 470 20 123 153 -1 -137 -43 -108 -72 -78 -1 -80
6161 -80 346 -117 -222 15 -19 -162 -10 156 -160 311 115 -10 274 123 290 -161 96 315 88 37 -269
6182 -269 76 -95 -422 295 -161 112 -51 -48 212 61 -118 48 -123 5 12 -418 -246 -268 108 -117 47 191
6204 191 -24 -50 163 207 -76 -204 5 -557 -185 -26 181 -344 132 69 -45 117 -16 -33 -50 127 54 72
6226 72 -80 46 266 -180 -1 -24 41 27 -123 79 -148 -289 -33 158 -44 -180 -258 -317 -93 40 -229 -91
6248 -91 -28 56 108 112 -86 -53 249 182 -190 3 76 8 -273 -52 323 -35 45 -46 -52 -386 44 67 -122 209 14
6273 14 -60 273 -98 135 193 -177 75 107 -92 105 -199 108 38 -23 -181 8 123 -100 197 -68 4 14 22
6296 22 -149 -94 94 -158 -73 99 -7 251 -205 -90 86 37 181 -154 -188 102 -61 155 1 91 107 -13
6318 -13 87 -18 -86 109 5 -262 82 -37 100 69 -207 92 -141 -52 -158 86 -35 -114 -136 64 122 349
6340 349 -102 -66 -16 125 22 -150 -92 177 38 120 214 -259 -128 -75 -49 -44 -197 -279 -279 193 108 110 -54 18 81 -47
6366 -47 -102 121 -110 334 281 20 -160 13 41 187 104 355 245 -15 -64 188 -370 5 217 -339 -166 -128
6388 -128 -119 -321 164 55 223 -116 -243 -57 101 -107 -322 -225 77 -5 -92 124 -107 107 136 34 -118 202
6410 202 49 28 -173 44 -315 -77 -327 -103 -286 304 -156 -239 89 -87 -270 55 -206 -86 1 76 68 -152
6432 -152 -75 -26 267 -29 83 23 -9 -49 217 89 -89 -38 -180 -244 -184 -123 -37 43 -40 -327 575 -115 -191 -159 -55
6457 -55 312 -3 -6 47 147 -168 -36 -134 248 274 133 -70 -54 -64 128 -161 40 -74 -154 -41 210 -83 -47
6480 -47 -190 58 63 -119 -7 -44 -114 21 -145 -293 2 86 72 46 -197 28 30 -210 -306 -51 -210 -98 -112 -14
6504 -14 329 109 -134 53 1 -207 -98 -99 6 -216 -6 -75 -123 -313 256 99 -111 19 -66 -172 24 212
6526 212 -259 87 82 -103 77 -253 51 331 -70 145 167 125 -75 -239 -49 78 22 -119 24 0 -187 -69
6548 -69 -127 52 -147 -36 -29 -1 -214 177 -157 116 146 -10 198 155 -225 46 -132 127 -171 24 124 71 6
6571 6 -124 18 -171 -45 495 32 -41 156 272 -112 -241 7 89 -235 17 87 140 58 9 -101 5 132 244
6594 244 -67 -73 138 27 -83 -68 113 35 -37 -192 -156 -368 -70 -143 29 26 119 40 116 -89 -132 -134 133 12 146
6619 146 109 42 63 -28 1 77 -197 196 -53 451 189 -113 -195 -114 -90 336 -176 40 -35 -214 -39 -68 56 -112
6643 -112 -89 -120 70 70 -96 72 -267 -25 3 97 -125 -73 166 -143 8 159 -27 -103 -97 -112 -108 -115 -114 106 154 -69
6669 -69 321 189 -91 232 -6 -370 -174 367 -317 6 -33 277 -104 111 -147 -172 185 -201 -144 -209 190 130
6691 130 -29 202 -219 -244 367 -5 74 -76 20 86 91 -213 21 84 14 69 186 337 165 89 48 -2 253 -246
6715 -246 142 132 -81 135 373 189 -106 170 -151 -117 169 128 -137 -286 -16 23 73 114 163 223 319 55 -79
6738 -79 118 -16 -136 59 -151 152 22 -138 51 260 166 -51 -93 100 156 -220 -190 317 114 -18 34 136
6760 136 -8 165 -145 156 -250 164 27 -146 -95 65 -359 -210 -40 177 335 -8 74 -107 81 -8 -214
6781 -214 8 -64 110 121 -198 -48 184 32 4 -42 -33 178 -352 54 -174 -277 92 146 115 19 -70 -109 89 135
6805 135 110 -231 96 -80 194 -50 -175 210 -239 -68 -241 -331 170 -82 -12 -91 -51 -50 76 -24 113 143 135
6828 135 -15 -380 41 -29 83 82 -67 366 1 39 -89 32 -164 -31 -92 28 -119 -213 69 187 -169 -228
6850 -228 5 -70 -141 -2 154 -31 375 -261 43 30 -198 -123 -108 -86 167 -45 -147 23 283 -9 40 19 -119
6873 -119 45 16 -85 46 -88 -106 -268 -53 -66 -22 -2 168 14 -143 81 -186 -130 -87 148 121 -204 -142 -66
6896 -66 43 -62 -6 98 27 33 -20 93 -158 -39 113 159 51 -28 44 -329 233 -29 2 86 -32 106 -341 98
6920 98 113 20 48 -277 70 -8 -126 -46 61 -74 18 41 50 -29 56 194 -127 204 -243 -175 -118 -94 -59 -223 -112
6945 -112 -22 -125 21 424 28 32 -99 55 -94 41 -21 238 -3 -207 -114 329 319 -32 -267 143 -155 197
6967 197 -163 -86 127 -29 64 -120 -236 -71 -30 60 -20 -24 119 -45 -86 92 50 152 175 58 -4 68 -93 89
6991 89 20 -238 157 117 -26 176 -2 167 102 -406 -17 40 -25 22 64 91 126 -204 51 181 -3 -61 -54 -179
7015 -179 -76 168 -73 -9 -244 -55 71 -12 -167 -8 -10 -137 -36 -10 -38 82 -29 70 -2 201 129 137 170 58
7039 58 -5 -104 -115 122 -79 -171 -78 -179 -120 24 218 79 110 18 167 -199 -86 -123 -348 148 -12 191 -183
7062 -183 -406 -47 209 55 209 157 28 146 260 129 92 -158 -334 212 -244 -21 34 -100 96 -12 -38
7083 -38 155 145 6 -8 -50 359 333 284 145 22 193 33 -101 -58 -218 194 38 48 -249 -121 176 318 127
7106 127 -81 55 -128 68 -135 -49 -123 82 -12 -39 -75 104 249 -163 188 99 -6 -55 283 12 1 -123 -33
7129 -33 -155 -218 295 21 102 41 -143 159 -86 288 -97 -245 -118 6 68 -278 79 248 54 52 -270 -87
7151 -87 348 71 -96 -110 147 -89 179 -237 -79 -224 75 100 -22 160 125 105 51 -123 -324 176 283 -104
7173 -104 50 85 -350 168 -23 149 165 -47 29 2 -8 -125 -109 32 22 -192 -79 -81 129 172 -144 -88 59 -48
7197 -48 41 -386 83 -16 -160 -113 31 344 -189 -433 81 93 -27 177 -40 119 46 -215 -71 -82 55 29 88
7220 88 13 -129 -103 137 272 156 -42 3 -123 280 -150 -91 -146 -7 -91 -151 363 7 141 -77 -127 -231 69
7243 69 21 181 215 64 -36 65 96 -81 48 311 149 207 197 230 -85 -163 165 -332 -155 305 328 82 -4
7266 -4 -485 167 288 -115 311 -21 -92 116 18 33 -77 1 -28 151 -137 14 -37 110 38 -7 -106 15 -137 21
7290 21 22 122 125 -25 118 -192 220 258 68 -44 35 -90 69 43 -247 -81 208 222 219 -154 32 147 -245 200
7314 200 -294 45 -190 274 -273 168 272 51 29 65 -42 -104 -87 -134 36 199 -250 -143 -70 -368 -48 -72
7336 -72 274 24 209 81 127 -3 297 -106 -173 285 83 66 48 203 49 18 -198 -71 113 -207 -330 329
7358 329 112 180 -189 -192 158 -162 -46 -115 322 -54 -40 -225 -63 93 -54 59 93 159 -107 118 -150 -107 52
7381 52 -54 297 -134 83 -19 -266 295 -118 -237 54 142 -136 -126 61 -295 44 226 84 253 -45 67
7402 67 -386 118 279 -2 119 322 -50 -33 -98 -153 -89 -98 -229 -6 -306 42 -143 -131 -25 117 -6 81 116
7425 116 21 -347 47 35 117 -206 -235 -64 142 178 14 -76 173 -146 20 -55 -133 -123 -179 208 154 -10 -40 -271
7449 -271 -72 -1 3 208 -37 78 -176 -81 140 113 47 -129 -103 -249 -157 -148 -242 100 -3 53 62 214 -61 -239 212
7474 212 -242 -62 205 211 -130 49 31 -149 -102 -270 -106 115 -56 -125 119 -48 -269 -269 -195 -22 81 -1 -10 -110
7498 -110 141 -129 -36 108 -426 -268 286 -210 -334 -311 128 -9 309 -63 -131 338 36 -77 -13 351 154
7519 154 -11 152 34 326 136 -333 335 116 -140 -33 142 -158 -139 151 31 191 137 -27 28 -362 98
7540 98 -11 -287 -157 -84 53 -122 -28 -19 185 -111 -305 -190 -86 -192 -251 205 -281 61 100 -286 -44 -83 -40
7563 -40 -276 73 -200 -148 82 -95 107 -27 -8 25 -182 -240 -68 187 -94 99 -158 250 -39 -45 33 -182 211
7586 211 -10 103 -562 135 -431 -69 -97 -66 -100 -231 -213 -158 -137 -67 100 73 -13 35 272 87 35 -3 -45 29 80
7611 80 64 297 -22 -34 -207 156 158 77 -41 289 -6 123 12 -314 17 -92 -113 -248 201 73 -115 77
7633 77 -130 -221 -323 -129 -66 -126 86 146 39 -70 162 -116 410 -226 75 251 95 244 -93 61 27 95
7655 95 154 61 -46 -44 158 199 145 180 -205 -581 178 -72 111 -171 26 -154 -7 130 -202 11 -258 -1 -231
7678 -231 12 -196 243 -124 258 -154 386 -23 81 -131 25 168 -70 -76 -180 50 24 -158 20 -48 253
7699 253 76 -127 261 -82 -114 5 -202 -430 -87 58 77 -36 -5 186 -46 23 -11 -52 -156 111 11 -1
7721 -1 200 12 -112 -389 251 -135 176 -69 229 -237 -29 135 179 36 -130 143 -253 130 263 -131 -9
7742 -9 -74 -359 -221 -37 -153 -255 -228 -88 -120 -112 -115 -171 -189 -27 126 -226 2 -45 344 -119 -4 93 36 155 43
7767 43 20 -242 -344 400 -26 130 -125 220 46 -51 28 156 294 96 100 179 256 133 65 -42 55 -22 125 -230
7791 -230 179 -44 37 -8 113 62 215 18 112 -106 -78 57 106 168 -115 174 -8 -58 121 -85 12 9 -93 30
7815 30 16 -133 99 191 30 211 -119 -86 -89 81 7 275 -187 -45 -42 -46 223 -36 -165 112 59 71 235 25
7839 25 88 -160 -40 66 113 154 160 94 -173 -14 131 155 -31 -397 -165 185 -23 8 46 260 -314 -341 -54 27
7863 27 -74 -25 -69 119 253 -45 223 104 -157 29 -66 62 -123 -65 -92 96 161 222 -104 -95 303 -336 56
7886 56 106 31 -45 -8 143 198 -87 174 -126 -13 271 -207 -162 205 -57 -56 254 -61 299 -76 -64 -88 -23 120
7910 120 -13 -69 184 -29 -170 198 -117 -38 -59 -1 -44 257 -80 -169 -379 154 -135 292 -83 117 -132 -80
7932 -80 231 -351 263 198 -25 143 -181 -6 -66 110 93 -202 66 15 114 102 -48 87 81 -5 -57 308 44 -196
7956 -196 -42 36 -113 -363 -35 31 -95 -159 50 121 70 -193 7 28 15 68 69 -117 -182 61 45 -50 -141 41 -3
7981 -3 -47 96 182 72 -38 90 -142 -122 -94 359 -63 -34 132 69 263 90 78 102 -63 16 175 241 -277 -5
8005 -5 144 -152 167 357 190 9 -68 -155 -146 -114 112 140 46 90 -90 -86 -105 88 221 -197 341 242 152 149 213 185
8031 185 213 -153 19 -59 -171 153 -16 398 150 -172 113 63 -171 -24 -296 -31 122 55 -127 -107 -114 -121 26
8054 26 15 84 -58 -349 29 -121 -347 -109 -193 -92 129 104 -185 166 143 -255 290 63 10 -290 58 -5 -45
8077 -45 18 109 3 -19 38 -85 -67 -245 -150 77 -182 134 141 297 269 31 5 -117 14 151 -63 -210 -51 -306
8101 -306 -125 75 -150 47 3 211 -241 -75 -102 -228 -30 80 164 354 76 -95 294 290 -6 12 -103 13
8123 13 -32 -68 -299 -108 207 178 193 -118 -173 281 90 99 -58 56 162 -328 172 -24 68 91 40 -31 5 -19 -163
8148 -163 248 -297 -186 -211 366 -103 -32 352 -129 291 166 -16 102 43 -22 156 444 -136 -427 -74 -117 60
8170 60 0 77 -23 -120 76 -212 317 31 -53 -140 -20 -225 -71 1 -193 58 -137 -66 -99 2 -88
8191h8
##END NTUPLES=NMR FID
##END=
