##TITLE=1H_DE-63P5_UP
 D2O
 8 sc, 
 27.12.2024
##JCAMPDX= 6.0         $$ Bruker NMR JCAMP-DX V2.0
##DATA TYPE= NMR FID
##DATA CLASS= NTUPLES
##ORIGIN= UXNMR, Bruker Analytische Messtechnik GmbH
##OWNER= root
$$ XWIN-NMR		Version 3.5
$$ Fri Dec 27 16:37:23 2024 Russian Standard Time (UT+4h)  she@DPX200
##.OBSERVE FREQUENCY= 200.1315
##.OBSERVE NUCLEUS= ^1H
##.DELAY= (6, 6)
##.ACQUISITION MODE= SIMULTANEOUS
##.ACQUISITION SCHEME= undefined
##.AVERAGES= 8
##.DIGITISER RES= 18
##SPECTROMETER/DATA SYSTEM= spect
##.PULSE SEQUENCE= zg30
##.SOLVENT NAME= D2O
##.SHIFT REFERENCE= (INTERNAL, D2O, 0, 15.7039)
##AUDIT TRAIL= $$ (NUMBER, WHEN, WHO, WHERE, WHAT)
$$ ##TITLE= Audit trail, XWIN-NMR		Version 3.5
$$ ##JCAMPDX= 5.01
$$ ##ORIGIN= Bruker BioSpin GmbH
$$ ##OWNER= she
$$ F:/spectra/data/she/nmr/H-F/1/audita.txt
$$ ##AUDIT TRAIL=  $$ (NUMBER, WHEN, WHO, WHERE, WHAT)
(   1,<2024-12-27 16:36:32.31 +0400>,<she>,<DPX200>,
      <created by zg, POWCHK disabled, PULCHK disabled
       configuration hash MD5:
       00 E9 B6 7A A2 85 ED C7 34 08 36 98 17 FE 4E 26
       data hash MD5: 16K
       74 1A EC 7B 57 D6 5F 77 B3 99 1E 0E 0B D2 A4 BD>)
$$ ##END=
$$ 
$$ hash MD5
$$ 6E 10 DD D8 28 4C 1C F7 54 A3 39 AE 63 E3 CD 95
##$RELAX= 
##$RELAX= 
##$RELAX= 
##$RELAX= 
##$RELAX= 
##$RELAX= 
$$ Bruker specific parameters
$$ --------------------------
##$DU= <F:/spectra>
##$EXPNO= 1
##$NAME= <H-F>
##$PROCNO= 1
##$TYPE= <nmr>
##$USER= <she>
##$AMP= (0..31)
100 100 100 100 100 100 100 100 100 100 100 100 100 100 100 100 100 100 
100 100 100 100 100 100 100 100 100 100 100 100 100 100 
##$AQSEQ= 0
##$AQ_mod= 1
##$AUNM= <au_zg>
##$AUTOPOS= <>
##$BF1= 200.13
##$BF2= 200.13
##$BF3= 200.13
##$BF4= 200.13
##$BF5= 200.13
##$BF6= 200.13
##$BF7= 200.13
##$BF8= 200.13
##$BYTORDA= 1
##$CFDGTYP= 0
##$CFRGTYP= 5
##$CHEMSTR= <none>
##$CNST= (0..31)
1 1 145 1 1 1 1 1 1 1 1 1 1 1 1 1 1 1 1 1 1 1 1 1 1 1 1 1 1 1 1 1 
##$CPDPRG= <>
##$CPDPRG1= <>
##$CPDPRG2= <>
##$CPDPRG3= <>
##$CPDPRG4= <mlev>
##$CPDPRG5= <mlev>
##$CPDPRG6= <mlev>
##$CPDPRG7= <mlev>
##$CPDPRG8= <mlev>
##$CPDPRGB= <>
##$CPDPRGT= <>
##$D= (0..31)
0 1.2 0 0 0 0 0 0 0 0.06 0 0.03 0 0 0 0 0.0002 0 0 0 0 0 0 0 0 0 0 0 0 
0 0 0 
##$DATE= 1735302991
##$DBL= (0..7)
120 120 120 120 120 120 120 120 
##$DBP= (0..7)
150 150 150 150 150 150 150 150 
##$DBP07= 0
##$DBPNAM0= <>
##$DBPNAM1= <>
##$DBPNAM2= <>
##$DBPNAM3= <>
##$DBPNAM4= <>
##$DBPNAM5= <>
##$DBPNAM6= <>
##$DBPNAM7= <>
##$DBPOAL= (0..7)
0.5 0.5 0.5 0.5 0.5 0.5 0.5 0.5 
##$DBPOFFS= (0..7)
0 0 0 0 0 0 0 0 
##$DE= 6
##$DECBNUC= <off>
##$DECIM= 24
##$DECNUC= <off>
##$DECSTAT= 4
##$DIGMOD= 1
##$DIGTYP= 9
##$DL= (0..7)
0 120 120 120 120 120 120 120 
##$DP= (0..7)
150 150 150 150 150 150 150 150 
##$DP07= 0
##$DPNAME0= <>
##$DPNAME1= <>
##$DPNAME2= <>
##$DPNAME3= <>
##$DPNAME4= <>
##$DPNAME5= <>
##$DPNAME6= <>
##$DPNAME7= <>
##$DPOAL= (0..7)
0.5 0.5 0.5 0.5 0.5 0.5 0.5 0.5 
##$DPOFFS= (0..7)
0 0 0 0 0 0 0 0 
##$DQDMODE= 0
##$DR= 18
##$DS= 0
##$DSLIST= <SSSSSSSSSSSSSSS>
$$ [...]
##$SUBNAM2= <"">
##$SUBNAM3= <"">
##$SUBNAM4= <"">
##$SUBNAM5= <"">
##$SUBNAM6= <"">
##$SUBNAM7= <"">
##$SUBNAM8= <"">
##$SUBNAM9= <"">
##$SW= 24.0689530833862
##$SWIBOX= (0..15)
0 0 2 0 0 0 0 0 0 0 0 0 0 0 0 0 
##$SW_h= 4816.95568400771
##$TD= 16384
##$TD0= 1
##$TE= 0
##$TE2= 300
##$TE3= 300
##$TEG= 300
##$TL= (0..7)
0 120 120 120 120 120 120 120 
##$TP= (0..7)
150 150 150 150 150 150 150 150 
##$TP07= 0
##$TPNAME0= <>
##$TPNAME1= <>
##$TPNAME2= <>
##$TPNAME3= <>
##$TPNAME4= <>
##$TPNAME5= <>
##$TPNAME6= <>
##$TPNAME7= <>
##$TPOAL= (0..7)
0.5 0.5 0.5 0.5 0.5 0.5 0.5 0.5 
##$TPOFFS= (0..7)
0 0 0 0 0 0 0 0 
##$TUNHIN= 0
##$TUNHOUT= 0
##$TUNXOUT= 0
##$USERA1= <user>
##$USERA2= <user>
##$USERA3= <user>
##$USERA4= <user>
##$USERA5= <user>
##$V9= 5
##$VALIST= <valist>
##$VCLIST= <CCCCCCCCCCCCCCC>
##$VD= 0
##$VDLIST= <DDDDDDDDDDDDDDD>
##$VPLIST= <PPPPPPPPPPPPPPP>
##$VTLIST= <TTTTTTTTTTTTTTT>
##$WBST= 1024
##$WBSW= 4
##$XGAIN= (0..3)
0 0 0 0 
##$XL= 0
##$YL= 0
##$YMAX_a= 308978
##$YMIN_a= -404232
##$ZGOPTNS= <>
##$ZL1= 120
##$ZL2= 120
##$ZL3= 120
##$ZL4= 120
##$ABSF1= 10
##$ABSF2= 0
##$ABSG= 5
##$ABSL= 3
##$ALPHA= 0
##$AQORDER= 0
##$ASSFAC= 0
##$ASSFACI= 0
##$ASSFACX= 0
##$ASSWID= 0
##$AUNMP= <proc_1d>
##$AZFE= 0.1
##$AZFW= 0.1
##$BCFW= 1
##$BC_mod= 2
##$BYTORDP= 1
##$COROFFS= 0
##$CY= 11.3945322036743
##$DATMOD= 1
##$DC= 2
##$DFILT= <>
##$DTYPP= 0
##$F1P= 15.6554695791079
##$F2P= 12.8336369535428
##$FCOR= 0.5
##$FTSIZE= 0
##$FT_mod= 4
##$GAMMA= 1
##$GB= 0.15
##$INTBC= 1
##$INTSCL= 1
##$ISEN= 128
##$LB= 0.24
##$LEV0= 0
##$LPBIN= 0
##$MAXI= 10000
##$MC2= 0
##$MEAN= 0
##$ME_mod= 0
##$MI= 1.114404
##$NCOEF= 0
##$NC_proc= 0
##$NLEV= 6
##$NOISF1= 3.799351
##$NOISF2= 2.8
##$NSP= 1
##$NTH_PI= 0
##$NZP= 0
##$OFFSET= 15.70392
##$PC= 1
##$PHC0= -26581.25
##$PHC1= 18.78744
##$PH_mod= 1
##$PKNL= yes
##$PPARMOD= 0
##$PSCAL= 0
##$PSIGN= 0
##$REVERSE= no
##$SF= 200.130013532006
##$SI= 16384
##$SIGF1= 3
##$SIGF2= 2
##$SINO= 400
##$SIOLD= 16384
##$SREGLST= <1H.CDCl3>
##$SSB= 0
##$STSI= 0
##$STSR= 0
##$SW_p= 3612.71676300578
##$SYMM= 0
##$S_DEV= 0
##$TDeff= 0
##$TDoff= 0
##$TI= <>
##$TILT= no
##$TM1= 0
##$TM2= 0
##$TOPLEV= 0
##$USERP1= <user>
##$USERP2= <user>
##$USERP3= <user>
##$USERP4= <user>
##$USERP5= <user>
##$WDW= 1
##$XDIM= 8192
##$YMAX_p= 0
##$YMIN_p= 0
$$ End of Bruker specific parameters
$$ ---------------------------------
##NTUPLES= NMR FID
##VAR_NAME=  TIME,          FID/REAL,        FID/IMAG
##SYMBOL=    X,             R,               I
##VAR_TYPE=  INDEPENDENT,   DEPENDENT,       DEPENDENT
##VAR_FORM=  AFFN,          ASDF,            ASDF
##VAR_DIM=   8192,          8192,            8192
##UNITS=     SECONDS,       ARBITRARY UNITS, ARBITRARY UNITS
##FACTOR=    0.0002076,     1,               1
##FIRST=     0,             0,               0
##LAST=      1.7004516,     0,               0
##MIN=       0,             -404232,         0
##MAX=       1.7004516,     308978,          0
$$ Real data points
##PAGE= N=1
##DATA TABLE= (X++(R..R)), XYDATA
$$ [...]
2407h36N56K004L100j160m573l174N45J974O55J554K517J761k610m528j801J471
$$ -836 -280 1724 4824 3664 -909 -4083 -3538 -1564 -909 645 3162 4923 2313 -2215 -4016 -2545
2423b545J527K42K223K587K82l939l519p22K027Q74Q94K794K003j470m449k714
$$ -2545 -1018 -776 1447 4034 4316 377 -3142 -3864 -1837 -963 -69 2725 4728 3258 -1191 -3905
2439c905P64J771L1J716L360R26l335l657j088J250N02O44K637K911o58m086k945
$$ -3905 -3141 -1370 -1339 377 3737 4663 1328 -2329 -3417 -2167 -1665 -1021 1616 4527 3869 -217 -3162
2456c162J14Q27O80J534L104J552k074l999k050R51P37K74K617L201K3l240l510
$$ -3162 -3048 -2221 -1541 -7 3097 4649 2575 -1424 -3474 -2523 -1786 -1512 1105 4306 4329 1089 -2421
2473b421n00Q95K41O75L412K282j515l625k259O39J04L31J938L231Q46k635k978
$$ -2421 -2921 -2026 -1785 -1110 2302 4584 3069 -556 -2815 -2176 -2072 -1741 197 3428 4274 1639 -1339
2490a339j169Q0M47N68L108K720n24l305l309J00L05J73J319L631J972k441l149
$$ -1339 -2508 -2428 -1981 -1413 1695 4415 3891 586 -2723 -2623 -2318 -2145 -826 2805 4777 2336 -813
2507h13j621O3j46N67K193L548L38l282k551m87l71O7J287L076K593j220l142
$$ -813 -2434 -2371 -2517 -1950 243 3791 4129 847 -1704 -2191 -2562 -2495 -1208 1868 4461 3241 99
2524I9k347m12K51M85J460L643J465k288l552j101M83o12L46K799L262l24l111
$$ 99 -2248 -2660 -2409 -1924 -464 3179 4644 2356 -1196 -2297 -1814 -2426 -2080 719 3981 3657 546
2541E46k018j69r68l48J696L884J617j682k404j817n53m91O46K492K815P83k014
$$ 546 -1472 -1641 -2609 -2957 -1261 2623 4240 2558 154 -1663 -2216 -2707 -2061 431 3246 4029 2015
2558B015l099j067J84l89N46L167K700n64l537j367o0q64m98K093L720J254k185
$$ 2015 -1084 -2151 -1967 -2356 -1810 1357 4057 3493 -44 -1411 -1471 -2335 -2833 -740 2980 4234 2049
2575B049k412o33j196j145J420K903K363l48j292k145j353j134K65J255K860K215
$$ 2049 -363 -996 -2192 -3337 -1917 986 3349 3001 1709 -436 -1789 -2923 -2658 -1403 1457 3672
2591C672j21l148j831l79m67o95K406L617Q45k570j965l78r24j188R34L739K074
$$ 3672 3551 403 -1428 -1807 -2274 -2969 -563 3054 3899 1329 -636 -1014 -1938 -3126 -2192 1547 3621
2608C621j046j893o38j348j944K06K540K517J263q43j703k107p69n47L66K188
$$ 3621 2575 682 44 -1304 -3248 -3042 -502 2015 3278 2435 732 -1375 -2144 -2691 -2325 -137
2624a37L054J038k553j907m44j005j332J015M183J926j588j748n42j112j975J66
$$ -137 2917 3955 1402 -505 -949 -1954 -3286 -2271 1912 3838 2250 502 -40 -1152 -3127 -2961
2640b961K619K956J85p91j005j525j810q11J165K097K082R60j595j671j036j035
$$ -2961 -342 2614 2799 2008 1003 -522 -2332 -3143 -1978 119 2201 3161 1566 -105 -1141 -2176
2656b176j024J278L552K107j226k194j56j265k063j74L819K637n86j070o58j260
$$ -2176 -3200 -1922 1630 3737 2511 317 161 -1104 -3167 -3341 478 3115 2529 1459 801 -459
2672d59k214o66K241K266J048K62p67j498j397j425J1J542K204K076q26j888r04
$$ -459 -2673 -3339 -1098 1168 2216 2478 1711 213 -1184 -2609 -2598 -1056 1148 3224 2398 510 -394
2689c94r46j883l4L595K852n21j606k77r48l031p87K959K962J66j99j84r79k466
$$ -394 -1340 -3223 -3257 338 3190 2669 1063 786 -162 -3193 -3980 -1021 1941 2107 1908 1724 745 -1721
2707a721j484R01J974J674J200l56j346j766r23p00M2K636K396j86j715j5l20
$$ -1721 -3205 -2304 -330 1344 2544 2188 842 -924 -1847 -2547 -2505 131 2527 2341 626 611 291
2724B91k462j556K527L209J35o68K20k47l418k015J355K873J227N05Q06q84k476
$$ 291 -2171 -3727 -1200 2009 2144 1476 1696 1449 -1969 -3984 -2629 244 1471 1976 2782 1898 -578
2741e78k168Q0J057K048J922O90j413j420j141j549o29K108K533N34q04K8o36
$$ -578 -2746 -2666 -1609 439 2361 3051 1638 218 -923 -2472 -3101 -993 1540 2074 1270 1298 662
2758F62k077k133J232L069J187r50Q91L20k651k931M13J843J249J075J553j76
$$ 662 -1415 -3548 -2316 753 1940 990 1881 2201 -450 -3381 -2968 -1125 124 1199 2752 2576
2774B576k074k171r94K63J065K786J202q19j131l41j807j889P87L314J197m15
$$ 2576 502 -1669 -2663 -2400 -1335 1451 2653 1834 703 362 -1445 -3334 -2547 767 1964 1549
2790A549q3N76k455k862L65K661P60L22Q58Q74k038k627j96O40J143R81J616O52
$$ 1549 1466 2042 -413 -3275 -2910 -249 511 833 1691 2565 527 -2100 -2296 -1656 -513 468 2084 2736
2808B736j367j701j339j275O17K571J776J40n41l93j684l110Q83K435J294L6O87
$$ 2736 1369 -332 -1671 -2946 -2329 242 2018 2158 1617 1224 -460 -3570 -2687 -252 1042 1078 1765
2825A765O49j716l248p05K125Q51M53J598R09r75k410j518L2O70J291J891Q25
$$ 1765 2414 698 -2550 -3255 -1130 -279 174 1772 2681 1706 -704 -2222 -2190 -1520 -229 1662 2487
2842B487j040p11j424j866j43J971J785P15j81M46j526k610j279K399J264K73
$$ 2487 1447 736 -688 -2554 -2697 -726 1059 1774 1593 2039 513 -2097 -3376 -977 287 560
2858E60Q19J400p97l673q50R98N59K06J932J479n14k054j395j151M89J025J719
$$ 560 1379 2779 1982 -1691 -2541 -1543 -984 -778 1154 2633 2119 65 -1330 -2481 -1992 -967 752
2875G52R95K82l52j143k409j084J400J971R3Q75J221o79l031j632R55J327M48
$$ 752 1747 2029 1677 534 -1875 -2959 -1559 412 505 1380 2601 1922 -1109 -2741 -1786 -459 -11
2892a1P25K155l5k785j991j39O35K77J257K122M17j082j743j080r70P38J237J152
$$ -11 714 2869 2834 49 -1942 -2081 -1446 -1169 88 2210 2627 1545 -198 -1278 -2248 -1510 -273 879
2910H79R01N99p55k325j962Q77R62O13J276J186L11k310k365J13Q45J97R17K129
$$ 879 1780 2379 1624 -701 -2663 -1786 -824 -211 1065 2251 2562 252 -2113 -2000 -1155 -958 -41 2088
2928B088N85j567k022p51q9J81R32J809J381j57j807j787q57L8J101Q54J472J118
$$ 2088 2673 1106 -916 -1667 -1756 -1575 -643 1166 2547 2390 583 -1204 -2061 -2023 -922 -68 1404 2522
2946B522l35k480j413j04P30J62O79K370N78j615k333j54M1J74O75J648J471l00
$$ 2522 2187 -293 -1706 -1810 -1080 -918 -239 2131 2709 1094 -1239 -1393 -1352 -1178 -503 1145 2616 2316
2964B316k178j403l37n8N51J347J493P78n43k049j548k71M54P12J168J610L94
$$ 2316 138 -1265 -1602 -1660 -1109 238 1731 2509 1966 -83 -1631 -1902 -1448 -736 432 2042 2436
2981B436j510j842o36K17l1M94K096J482j011j890j060j43j62K11J252K263N33
$$ 2436 926 -916 -1552 -1335 -1366 -872 1224 2706 1695 -195 -1255 -1398 -1560 -1349 -97 2166 2699
2998B699j525j851o46o6k36O61J982J178L7j689j252o79J9N0O80K032J241r45
$$ 2699 1174 -677 -1323 -1389 -1625 -964 1018 2196 2233 544 -708 -1387 -1368 -1318 -638 1394 2635 1690
3016A690j881p80l00k69%J758J851O38j879j557k59l53p74R50K174J068n4j752
$$ 1690 -191 -971 -1271 -1540 -1540 218 2069 2707 828 -729 -988 -1341 -2115 -1165 1009 2077 2023 271
3034B71j008n82j17m37J467K140O28r89j540j007l05l50J28J927K015j03j509
$$ 271 -737 -1319 -1436 -1873 -406 1734 2362 1373 -167 -1174 -1479 -1829 -1701 226 2241 2138 629
3051F29r10o94l04n59P12K545J372j468j125n72j018o11M72J699J508O11j131
$$ 629 -281 -975 -1279 -1838 -1126 1419 2791 1323 198 -374 -1392 -2003 -1531 168 1676 2287 1156
3068A156j612l99j94q22Q08J706J885o05j350j199k09n51r01J758K073Q06j141
$$ 1156 -456 -855 -1049 -1871 -1063 643 2528 1923 573 -626 -835 -1386 -2287 -529 1544 2350 1209
3085A209j218l39m65j091M29J320K432j87j524p17k30j081n96J069K121J311r74
$$ 1209 -9 -348 -813 -1904 -1475 -155 2277 2090 566 -151 -381 -1462 -2058 -989 1132 2443 1469
3102A469j306k98n56j441K60J691J729O81j305j079j52r37j128P33K275J631n91
$$ 1469 163 -135 -691 -2132 -1872 -181 1548 2229 924 -155 -307 -1244 -2372 -1639 636 2267 1676
3119A676q22n78n43j473m43J567K053J034j313n28m55r36j150K01K019J581k62
$$ 1676 854 276 -267 -1740 -2183 -616 1437 2471 1158 630 175 -761 -1911 -1710 309 1890 1628
3136A628j096l98m74j055j047J468K100Q36n40r04k66j079j063j74J465K236l0
$$ 1628 532 134 -340 -1395 -2442 -974 1126 1962 1422 518 252 -827 -1890 -2064 -599 1637 1607
3153A607n21o26q0j435j109M82J975J332L81j415l72o30r77j019J546J871R54
$$ 1607 1086 460 380 -1055 -2164 -1682 293 1625 2006 591 219 -411 -1388 -2407 -861 1010 1964
3170A964n77o96k33r64j364m40K131J837O9j201l7j86j522j559J667J734J076
$$ 1964 1387 691 458 -506 -1870 -2310 -179 1658 1727 526 489 303 -1219 -2778 -1111 623 1699
3187A699m26m15k21j393j081l39J277J990J54j55m33Mj545j432N06J862K045p68
$$ 1699 1273 858 637 -756 -1837 -2176 -899 1091 1245 1090 657 661 -884 -2316 -1810 52 2097 1329
3205A329m17l8p95j686o70J577J621L33l12L76m05j785j592M05J858J311Q2l30
$$ 1329 912 874 79 -1607 -2277 -700 921 1254 942 1318 913 -872 -2464 -2059 -201 1110 1192 862
3223H62K02o83j177j526N85J721J450k48l77K19j029j913m98J781J559M57o33
$$ 862 1064 381 -796 -2322 -1737 -16 1434 1186 809 1028 -1 -1914 -2412 -631 928 1385 752
3240G52L95j69j540k040J268J580P06j4o6O32j260k175l77J320J250Q37jJ85l97
$$ 752 1147 978 -562 -2602 -1334 246 952 938 872 1504 244 -1931 -2308 -988 262 1099 1098 1283 886
3259H86j270j146n38J387J741O6pj53p9j618j521O40K028O90n67M73N45j520j858
$$ 886 -384 -1530 -2068 -681 1060 1126 1119 966 887 -731 -2252 -1612 416 1106 539 1012 1557 37 -1821
3278a821l08J933O43J1L36N51o15j559q70q6J523P72L37K71k00m59j515j105N15
$$ -1821 -2129 -196 447 458 794 1345 730 -829 -1699 -1785 -262 510 847 1118 918 459 -1056 -2161 -1646
3297a646J877O41j02M52K01j621k014Q1J954J356j057P46R42p43k239j210J286
$$ -1646 231 872 770 1222 1423 -198 -2212 -2131 -177 1179 122 868 1810 1067 -1172 -2382 -1096
3314a096O53P83o3J191m00q74j703n90J158J209N93J75j21N33r93k734J56J857
$$ -1096 -443 340 277 1468 1068 194 -1509 -2099 -941 268 861 1036 915 1448 455 -2279 -2123 -266
3332b66J010p29N68J363p74k494j150J950O87j73N35J246j18j999j588O03P24
$$ -266 744 15 583 1946 1172 -1322 -2472 -522 165 -8 527 1773 1655 -344 -1932 -1329 -605
3349f05M86M39O00N16q02j207j088Q8J449J017n12M93P80o06k347p30J387J261
$$ -605 -119 320 920 1436 634 -573 -1661 -1573 -124 893 381 874 1654 1048 -1299 -2029 -642 619
3367F19o44l8K137k32k464j684J230R91l63K75J684L99j542j234p26O95P24M80
$$ 619 -25 -63 2074 1842 -622 -2306 -1076 -85 -448 -173 1511 1910 368 -866 -1592 -897 -173 307
3385C07N93L70J90p55j990p60J437J071n2J7R92L98k379j769J142J538o65k7J645
$$ 307 900 1270 1460 705 -1285 -2045 -608 463 411 428 1420 1818 -561 -2330 -1188 350 -315 -342 1303
3404A303J041j852j924j72J170q0L00J130P15m03j204j530K26P21N76N16RJ380
$$ 1303 2344 492 -1432 -1604 -434 -514 -214 916 1631 1228 24 -1506 -1280 -559 17 533 542 1922
3422A922o04j921j116M93J779n70k55J789M97j497k453L89J841p26j01J489J001
$$ 1922 1318 -603 -1719 -1226 553 -17 -272 1517 2014 517 -1936 -1547 294 -432 -533 956 1957
3439A957o33j931o03K15N88j82P61J138K61r11j572r82O25J127K27j87J492K77
$$ 1957 1324 -607 -1210 -995 -407 -589 172 1310 1571 660 -912 -1894 -1269 -142 85 -102 1390 1667
3457A667j493j778K61J210O9o05J304J313n19k604j47J157k02k83R12J729n27
$$ 1667 174 -1604 -1343 -133 -64 -669 635 1948 1429 -1175 -1322 -165 -367 -650 262 1991 1464
3474A464j131j087l19L39J84N24P08R19k64j286j439r4J185P6o88J843J214j142
$$ 1464 333 -754 -1073 -734 -550 -26 682 1601 1337 51 -1388 -1482 -297 -221 -909 934 2148 1006
3492A006k515J7J064K37n91O68J880J27k368q60P18N12n96Q9J558P58p52j301
$$ 1006 -1509 -1492 -428 -191 -782 -114 1766 1893 -475 -1335 -617 -105 -701 -612 946 1704 952 -349
3510c49q01N61j26J35P94R41R32j334j604l25O58K07p32R26K168j73j995j488
$$ -349 -1150 -589 -715 -580 214 1155 2087 753 -851 -1176 -518 -311 -1043 -117 2051 1878 -117 -1605
3528a605J302L19j161N81J919O63j094j507k45L79l66M8J055J553m61j015j111
$$ -1605 -303 16 -1145 -564 1355 2018 924 -583 -828 -449 -815 -767 288 1841 1380 365 -746
3545g46J18R3n4p6J009J332K4k244q53Q54K86q10N95J925O96j974j237L65N40
$$ -746 -628 -535 -589 -665 344 1676 1700 -544 -1397 -543 -257 -1067 -472 1453 2149 175 -1062 -697 -157
3564a57p88L8J354J292o54r69o76Q4o00J16O15J106Q31m64j559o64N63K3n54R35
$$ -157 -945 -907 447 1739 1085 116 -560 -476 -1076 -960 -345 761 1592 1128 -431 -1095 -532 -509 -1063 -128
3584a28J679K02j264j764O43P37j358J37J706J535j239j468j31N14m94m61R28
$$ -128 1551 1753 489 -1275 -632 105 -1253 -1116 590 2125 886 -582 -713 -199 -693 -1154 -226
3601b26J509L41j310p39p1k50j48Q8J030J170J81j387q73L75j30k62n5J328J449
$$ -226 1283 1624 314 -425 -496 -746 -894 -806 224 1394 1575 188 -685 -310 -440 -702 -757 571 2020
3620B020j297j178J71j30k20p02J437J284M5j327o46K73j55p52P72R08J336j021
$$ 2020 723 -455 -284 -414 -634 -1336 101 1385 1430 103 -543 -270 -425 -1177 -405 503 1839 818
3638H18r49l34M1n3r02P97J602P49j374p86L23j99p22m59J437J545Jj365o68Q28
$$ 818 -131 -465 -424 -477 -1379 -582 1020 1769 395 -391 -68 -267 -989 -1448 -11 1534 1535 170 -498 330
3658C30o66j196O10J688Q61p77j097R5j29q11l85J224J445N4p73q23L56k44j041
$$ 330 -336 -1532 -922 766 1627 850 -247 -152 -281 -1092 -1477 -253 1192 1246 473 -350 6 -238 -1279
3677a279L88J039J279n58j049j41L96o25r82R95J486O24j184n96L67k28j060j81
$$ -1279 -891 148 1427 869 -180 -321 75 -550 -1532 -537 949 1573 389 -207 160 -68 -1128 -1309
3695a309J081J409R6j259j00n4l5r89L18J461J235r39j255L08L21j191o27J104
$$ -1309 -228 1181 1277 18 -82 -136 -171 -1160 -842 619 1854 915 -340 -32 289 -902 -1529 -425
3713d25J783p2j389q3J69k04j189J04J667J004m25j029j7L2o73r89R78J618N81
$$ -425 1358 1286 -103 -186 -17 -221 -1410 -1306 361 1365 940 -89 -106 -74 -747 -1736 -758 860 1441
3732A441m61r12j41K38j182m67J513R95K50q72l55m3m72q44J39J605R52p33o45
$$ 1441 980 68 -73 165 -1017 -1484 29 1024 1274 402 47 4 -468 -1312 -1173 432 1384 651 6
3751Fj65N67j489k21Q08J588K13o77n26K03l27j270l4J459J270q08n08Q3K64q34
$$ 6 -159 408 -1081 -1302 -494 1094 1307 630 104 307 -20 -1290 -1324 135 1405 597 89 172 436 -398
3771c98j206J032J625J71p04o15J90k60q47l64J440J133l37n83P5K40j183o55
$$ -398 -1604 -572 1053 1224 520 -95 95 -165 -1012 -1376 64 1197 860 277 352 592 -591 -1246
3789a246J31J143J172o77o86O40n31j054n1O91J178L94o31l61M76q13q36K29R34
$$ -1246 -1115 28 1200 523 -163 477 -54 -1108 -1159 -468 710 1104 473 112 588 -225 -1061 -832 102
3808A02R19m69o73M58j41r44p08P40J446P7m16j07K99p97p54l35J276Q34K61q13
$$ 102 1021 552 -121 337 196 -748 -1456 -716 730 807 391 284 583 -214 -968 -1303 -27 807 1068 255
3828B55L41j87o16j223O7J515Q23k37q25M05Mj586k86J130J456j64r75K63L38
$$ 255 596 409 -207 -1430 -1363 152 975 738 -87 318 322 -1264 -1550 -420 1036 872 -103 160 498
3847D98j189p59M01J026R69k38p35P47j34q54r32O92J154L7k45j29J12l13r47
$$ 498 -691 -1450 -1049 -23 946 708 -27 720 586 -268 -1200 -508 646 683 438 309 421 108 -839
3866h39m67Q51J129p9m74M19J84j297j143J007J087O3l95N10M35n79j481j20P21
$$ -839 -1306 -455 674 595 121 540 724 -573 -1716 -709 378 441 46 556 991 412 -1069 -1189 -468
3885d68J244j45l46K44J79o85j225o0J047Q47J46k41q2m5o54j085M65J497l7o74
$$ -468 776 631 285 529 708 23 -1202 -1262 -215 632 778 537 455 410 -244 -1329 -864 633 596 -78
3905g8O16L53p74j317m26J399P99l26K6N25o1j124n48L45J003J46k29p3K68j77
$$ -78 538 891 117 -1200 -1626 -227 572 246 272 797 736 -388 -936 -591 412 558 329 256 524 347
3925C47j023p29J014P14L58l97j26N85o92j085k8J097K00m46N60M51L3j641l63
$$ 347 -676 -1405 -391 323 681 284 158 743 51 -1034 -1062 35 235 -211 349 800 833 -808 -1171
3944a171N27O73L36m39O97j4m89j167J21O77N03L0l05O53J05j071p17J14Q72Q34
$$ -1171 -644 29 365 -74 623 609 120 -1047 -926 -249 254 284 -21 632 737 -334 -1051 -937 -65 769
3964G69o81K52N17j84j551k26R40P04n91m0R18P1r79p61K27K15J84L34K36L63
$$ 769 88 340 857 673 -878 -1104 -164 540 -51 -91 827 898 -81 -842 -615 -400 -216 118 354 717
3984G17k26q18o94O31L28N27j12J02J78l06r16o61R89O25j21m34J063K54j003
$$ 717 491 -327 -1021 -390 -62 465 353 455 633 327 -589 -1250 -261 364 243 -191 872 1126 123
4003A23j746J183O96m41m7M91J026j050p24o29P55N21j05N7L26J06n38n29m45
$$ 123 -1623 -440 256 -185 -232 259 1285 235 -489 -1118 -363 158 53 110 436 542 4 -525 -970
4022i70P84L50M9P2K55K98j085r01O61N80M4k67J039M1m13j795L52R85k25j56
$$ -970 -186 164 213 285 540 838 -247 -1148 -487 93 137 -130 909 950 537 -1258 -906 79 -146 -302
4042c02P56N52k22p83m70l57L16O11K29L01K13l62o40r76N49N58p9K3M85P22j147
$$ -302 454 1006 784 1 -469 -826 -510 101 330 631 844 482 -158 -1134 -585 -27 -106 -83 402 1124 -23
4063b3r64J90P42M0j73L96J003o39j286k7M36J15O6N4J091k20o24n85l44J71P84
$$ -23 -987 -797 -55 -15 -188 208 1211 572 -714 -741 -305 -190 -124 -70 1021 801 177 -408 -752 -581 203
4084B03j5J40L75M30j053j235O20M45L0l98Q89P46n00j308j77M78k9k09Q42N86
$$ 203 188 328 703 1133 80 -1155 -535 -90 -60 -458 431 1177 677 -631 -808 -330 -359 -568 274 860
4104H60l42p06l71J45K9J21J14P19K8K41j054n85J66L58M13k41K68Q52p28r80
$$ 860 518 -188 -559 -414 -385 -264 -150 569 597 838 -216 -801 -635 -277 136 -105 163 1015 287 -693
4124f93P3L65K86m14L80J060j06j143n17K45L96l27J23Q10L68m18o93k37p6J01
$$ -693 -620 -255 31 -383 -3 1057 951 -192 -709 -464 -68 -395 -272 538 906 488 -205 -442 -518 -417
4144d17P8O41M31Q4m35r70k3L43J72j09M52N07j34j011m02N51J55l71L69Q46J96
$$ -417 -339 302 733 817 382 -588 -611 -268 -96 -205 247 754 620 -391 -793 -242 -87 -458 -89 757 953
4165I53q75m96K66L41q74L41P10L10j51n21p4l93L58pN7R4N56o0n50m39J24K13
$$ 953 78 -418 -152 189 -685 -344 366 676 525 4 -70 -463 -105 -112 -55 39 595 535 -15 -454 -330 -117
4187a17j88K99P68K55p31p23M26L4k09k53J078L44l75n85j04Q6o52K58J04O50
$$ -117 -305 -6 762 1017 286 -437 -11 23 -186 -439 639 983 608 23 -81 5 -647 -389 -285 365
4207C65M06n76l45m25r0N25k3J35P75K6n36p29K06N9m48M78N92L95m34n72k57
$$ 365 771 195 -150 -575 -665 -140 -163 -28 747 773 237 -492 -286 -227 -675 -197 395 790 356 -216 -473
4228d73K94k68j08M63N87J55l75m60j38r6k14K96O20L69o6m78r5k84R7m43M47
$$ -473 -179 -447 -555 -92 495 650 275 -185 -323 -419 -633 -337 283 652 586 108 13 -271 -174 -617 -170
4249a70N81M11j88j043L37o8n56k15P63R93l55o31l31l2K89m14J87P29M76n14
$$ -170 411 822 634 -409 -72 -140 -696 -911 -148 845 490 -141 -472 -504 -215 -629 -442 287 763 249
4269B49m5m59o8J18k35P5O47O59n09p04J92n7l5m45Q97L67k09o23K02M0m23m34
$$ 249 204 -255 -323 -205 -440 -365 282 941 432 -272 -80 -137 -172 -617 280 647 438 -185 17 57 -366 -800
4291h00M70O02L58k19n86l2n6j10j84O97N11j63l32j06l03j1m46M13P07L34l07
$$ -800 -330 272 630 411 -175 -207 -263 -373 -557 140 651 488 156 50 -253 -264 -710 -297 410 744 437
4312D37m36k47K44o64J74N58M03N16j003j67L22l03nq9M57N44m62k82j41K02j12
$$ 437 1 -246 -2 -666 -492 66 469 985 -18 -185 137 -166 -171 -260 197 741 279 -3 -144 58 -54
4333e4k84N5L62N32l37K9l72o2j69r9O94J8K76m56o4j08J06j043L65R74J81k02
$$ -54 -338 -283 79 611 274 303 -69 -131 -300 -399 295 313 589 133 69 -39 67 -976 -611 363 544 342
4355C42m30R5N2k13m48O14M65p7m26L5J16k90l43J36O93J0n6n47M73j86m90k4
$$ 342 -88 7 59 -154 -602 12 477 400 -26 9 125 -165 -508 -372 321 331 275 -272 201 15 -475 -499
4377d99L37N47O23o37k54N0j70m07L0J01P07n2n03P7p1k34K7J66M04J38r6%j85
$$ -499 -162 385 1008 371 117 167 -3 -410 -380 -279 428 376 -127 -50 -121 -355 -328 -162 242 380 284 284 99
4400I9l51j45P0J05P73R5m59pm9o3q54L75M77J61K14m83J02n3m57j04K86O49j00
$$ 99 -252 -397 -327 -222 551 646 187 180 131 68 -786 -411 66 227 441 -42 60 7 -450 -554 -268 381 281
4423B81K39k25O8o97k77J76L50M08k00J41J56o03K90o83O2N52L66Q5k71o9M7m55
$$ 281 520 295 363 -334 -611 -435 -85 323 123 264 420 -183 107 -576 -514 38 404 489 218 149 196 -259
4445b59p3J25L91K17J34l86J74m73p25J51Q81L73l27L22l85J66p66j68M50L53
$$ -259 -332 -207 184 401 535 149 323 -150 -875 -724 157 530 203 525 140 306 -460 -628 -178 175
4465A75L37n22j08K97k29n21k68O30M91M8k47K03N9n72o06O82L67L08j42l79L84
$$ 175 512 -10 -118 179 -50 -571 -839 -209 282 330 83 286 345 -227 -833 -151 216 524 382 3 387
4486C87l14k39l17K56L12K46r3L8j96k14k05j6K23L84P1J95k06k11k90k95L93
$$ 387 73 -166 -483 -227 85 331 238 276 80 -134 -339 -355 -132 252 323 518 312 101 -189 -484 -91
4507i1R8J92J71k67J34n61O8j60L45L75m01K08Oj76j97j20j28M49L90Pj44pk73
$$ -91 7 199 370 103 237 -324 -256 -416 -71 304 -97 111 117 -59 -256 -376 -504 -55 335 342 198 191 -82
4530h2j87j47K74J15L60r7n0l8m49k77J23K82N02j84j17L23l90k99k31N84j10
$$ -82 -269 -416 -142 -27 333 236 186 148 -301 -578 -455 -173 329 145 28 351 -39 -338 -569 15 -95
4551i5L69j09j92K64j04m53m20M76O9P28k84J98n6l63l99n8M61K26q4j26K61k32
$$ -95 274 165 -27 237 133 -320 -740 -264 -195 533 249 447 391 28 -371 -429 32 258 174 48 309 77
4573G7m19j23K52N3J46J53K91l58j01k53p1M78k35K44n1N9j20K40n51K22r5M31
$$ 77 -342 -465 -213 -160 -14 139 430 72 -29 -282 -353 125 -110 134 83 142 22 262 -289 -67 -162 269
4595B69j72L5J89k76o94N10L76k73J77J7K01K3m67m85J86L58K73l30M24L89p05
$$ 269 97 132 321 45 -649 -139 237 -36 141 158 359 382 -85 -570 -384 -26 247 -83 341 730 25
4616B5m09J13p6n8M64M60k48l27J37l77m88O89K24J7q5K5J84j35l61m90O94k32
$$ 25 -384 -271 -347 -405 59 519 271 -56 81 -296 -784 -95 129 146 61 86 270 135 -226 -716 -22 -254
4638b54K43N21l71j61m59J44L47r7RK66N2l48J40k49J7O5M62m34L15J49j29m99
$$ -254 -11 510 139 -22 -481 -337 10 -87 -78 188 240 -108 32 -217 -200 -135 327 -107 208 357 228 -271
4660b71j05L42j47j4K59J98o6l31p8LJ1K26P5l6M16l44j06m22M82k99m4N76j80
$$ -271 -376 -34 -181 -195 64 262 196 -135 -213 -210 -199 27 102 66 482 138 32 -390 92 -207 -251 325 145
4683A45L5k00k75q2K61P9M04j06k12P6J35m01J40J57j79O6K40K18l11m07j85L00
$$ 145 180 -20 -295 -377 -116 -37 367 261 49 125 260 -141 -1 156 -23 43 283 501 190 -217 -402 -102
4705a02K31n29O99P9m4m67j78K45r1J07m7M7Q6o5R3n80K67M01l12L32Q9J6m36
$$ -102 129 -400 299 378 334 -133 -311 -66 -157 -50 -97 -50 36 -29 64 -516 -249 152 -160 172 261 277 -159
4728a59k83k0N51k15nL48L02J6o45r5J45L9K1J98K49l00M1J32m09k11M41M07m15
$$ -159 -442 -462 89 -126 -131 217 519 535 -110 -205 -60 -21 0 198 447 147 188 320 -89 -300 141 548 133
4751A33L30l24k28l80N7J88j59K28M96KK7p29k2J56R7k44M98K04j31j45k46k46
$$ 133 463 139 -89 -469 -412 -224 -383 -155 341 343 370 -359 -381 -225 -128 -372 126 330 199 54 -192 -438
4773d38j1K48J38L86j18j84n6j55j11J2K15j4K02pJ77j72q1j32K70o17K67O72
$$ -438 -449 -201 -63 323 205 21 -35 -190 -301 -289 -74 -88 114 107 284 112 31 -101 169 -448 -181 491
4795D91j71l80K3K07m11n3J18J70K61j14j44j05J63k5k78J21K74K47k74l76J04
$$ 491 320 -60 -37 170 -241 -294 -176 -6 255 141 -3 -108 55 30 -248 -127 147 394 120 -256 -152
4816a52J07m44L59l6J79K43j37l31L02j68j09q8K84N58j70m14q3J88k03N8JJ61
$$ -152 -45 -489 -130 -166 13 256 119 -212 90 -78 -187 -275 9 567 397 -17 -100 88 -115 -57 -56 105
4838A05N1j06K20j38m64J9o6K12L79Q4m51O8q5q6K65J7J57J73m02o8K39p7k28
$$ 105 156 50 270 132 -332 -313 -379 -167 212 296 -155 -87 -172 -258 7 24 181 354 -48 -116 123 46 -182
4861a82l5N48M7Mk66l11rK84l94N53J37j76o8J98o14K5j24M45M4L39j31n46K72
$$ -182 -217 331 378 382 116 -195 -204 80 -314 239 376 200 132 330 -284 -259 -383 62 106 445 314 -232 40
4884D0k08K34m87J12O15Q5k06k42K54k70l74L50L43J10k10J0j67K37m78J01P4
$$ 40 -168 66 -421 -309 306 391 185 -57 197 -73 -447 -97 246 356 146 156 -11 226 -252 -151 -77
4905g7K38j80K02l86J67N9P3m88J37P11j39k81M1j33j38K2J61j45L27j23J74k38
$$ -77 161 -19 183 -203 -36 23 96 -392 -255 456 317 36 77 -56 -194 -172 -11 -156 171 48 222 -16
4927a6J1k35k48K81K46J50k92J5M49n63j09L35l3nL63k51j75j5Nr4K70N1K19j20
$$ -16 -5 -240 -488 -207 39 189 -103 -88 361 -202 -311 24 -9 -14 349 98 -77 -92 -87 -181 89 140 359 239
4951B39l60M0J67K02o06L02M89k80p1M9j5l8m81l44O47J25K14m9O0l80k83J95
$$ 239 -121 -81 86 288 -318 -16 473 193 122 171 156 118 -363 -707 -60 65 279 230 290 -90 -373 -178
4973a78L13j9O0Q9l3N5l33l65K57L00K04k55J09kr9k49j50K13J38Q7J51m97M30
$$ -178 135 116 176 265 232 287 -46 -411 -154 146 350 95 204 202 103 -146 -296 -83 55 142 293 -204 226
4996B26O9p42O20l40K72K9j48j0K79l10q7J29J82L81k15k30n5O6o1n22N57n8M54
$$ 226 295 -447 173 -167 105 134 -14 -24 255 -55 -142 -13 169 550 335 105 50 116 55 -467 90 32 486
5019D86n73K18j15j05m7Q5L41k92J87m20L37l6k97j71K63k75M84m33J43O93m25
$$ 486 -87 131 16 -89 -136 -51 290 -2 185 -235 102 66 -231 -402 -139 -414 70 -363 -220 473 48
5040D8k43j3j73M15L00m66J26P8J62o83k3Q02J39m74l5K14j22m12O1L06L4J31
$$ 48 -195 -208 -381 34 334 -132 -6 72 234 -449 -472 330 469 -5 -40 174 52 -360 -299 7 41 172
5062A72p5l55M29k73m8j18M29k05J40J9P4l35J54l7j10J46P6j67J92N8Q0o49M
$$ 172 97 -258 171 -102 -150 -268 161 -44 96 115 189 -146 8 -29 -139 7 83 -84 108 166 246 -403 -399
5085c99K49N04r5m65L67j81l10j40K68o5L20k54K70K96j59j33m33N01L39l08j73
$$ -399 -150 354 259 -206 161 -20 -330 -470 -202 -267 53 -201 69 365 206 73 -360 141 480 172 -1
5106aM7L70q73M24J63k20M39n71K03K58j37l70N2q0N8K81q2J99k43q1n5K94j19
$$ -1 46 416 -457 -33 130 -90 349 -222 -19 239 102 -268 -216 -296 -238 43 -39 160 -83 -164 -219 75 -44
5129d4J31j61K17j9j30j70j46L06J85j15o7J81J34m41k70m9N65m8j48K65N4J61
$$ -44 87 -74 143 124 -6 -176 -322 -16 169 54 -13 168 302 -139 -409 -458 107 59 -89 176 230 391
5151C91m80o3p3K30J32n3k30J80q8j88r6M46m9M3J88m2j62J5j19k98N04J01m63
$$ 391 -89 -152 -225 5 137 84 -146 34 -54 -242 -338 108 59 102 290 248 86 101 -18 -316 188 289 -174
5174a74j14O27k13J32n14Q2Q9J2O9j86L49L78q09J62K12jj17k4j6K90j34l34K1
$$ -174 -288 339 126 258 -256 -174 -85 -73 -4 -190 159 537 -272 -110 102 101 -16 -40 -56 234 100 -234 -213
5197b13K06J8j53K20N64p46Q3j74K01R4q9N8J41J06k43l49J90J20K19l56K36J56
$$ -213 -7 11 -142 78 642 -104 -21 -195 6 100 11 69 210 316 73 -276 -86 34 253 -103 133 289
5219B89k27r3l47N68k41M30k86J52n5j51j65J36l1m5l9P3j44K71J02k03k9qO4
$$ 289 62 -31 -378 190 -51 379 93 245 190 39 -126 10 -21 -66 -105 -32 -176 95 197 -6 -35 -43 21
5242B1M7q5M29k79j03m34N96n4M5j63J30L64n18k75K59J3j5J49k62K79%j91K00
$$ 21 68 -17 412 133 30 -404 192 138 183 20 150 514 -4 -279 -20 -7 -22 127 -135 144 144 -47 153
5265A53m48L37J43m52K86L09m6o62O8L79K4l59J35J90J20L9l55j44O61l00j29
$$ 153 -295 42 185 -267 19 328 282 -380 -312 67 91 -268 -133 57 177 216 -139 -283 378 78 -51
5286e1L12k29kl28r2L92j76J56L1k43L86J18m36j91L52o5j62K01L61j09m80j5
$$ -51 261 32 30 -298 -390 2 -174 -18 13 -230 156 274 -162 -353 -1 -66 -228 -27 334 225 -255 -270
5308b70J47j5M00n92J58K45K53n74J22K21q2k73Q9L39j8j59j88K21J58J43k96
$$ -270 -123 -138 262 -330 -172 73 326 -248 -126 95 13 -260 -171 168 150 -9 -197 24 182 325 29
5329B9k64N87k48l36k30L19K4j20M30j58L43l92q0k88O71n47J14j00K74J74l58
$$ 29 -235 352 104 -232 -462 -143 -119 -239 191 33 376 -16 -96 -384 287 -260 -146 -246 28 202 -156
5350a56p9J45K19k15J30l3K23k69O4j03J23n5l7O8MM80n04l92L15R1O5l54N60
$$ -156 -235 -90 129 -86 44 11 234 -35 29 -74 49 -6 -43 25 29 509 5 -387 -72 19 84 -270 290
5373B90k80R6j88p3L78N4k35k89M30j74Q9m7J01j00O4j41L53j12K58m13l40L60
$$ 290 10 106 -82 -155 223 277 42 -247 183 9 98 51 152 52 116 -25 328 216 474 61 -279 81
5395H1k41K66k16J26n8J31o2L11k12K31l01j97L59O5l67P5k00J89K37j96j50K66
$$ 81 -160 106 -110 16 -42 89 27 338 126 357 56 -141 218 283 -84 -9 -209 -20 217 21 -129 137
5417A37m33M20k90k30M55Q9j63OK20l67m01M48K35j70J37l39M48j1o3m13L75j14
$$ 137 -296 124 -166 -396 59 148 -15 -9 211 -156 -557 -109 126 -44 93 -246 202 191 128 -285 90 -24
5439b4k59o0L77J29n0J64k06K35k03l83K16J05j7k9K39k78J10no3M0J57k91k43
$$ -24 -283 -343 34 163 113 277 71 306 103 -280 -64 41 24 -5 234 -44 66 61 -2 38 195 -96 -339
5462c39O6K25L15k12j69K65J78k68L0J44k11p5r9J26J94k95K8J58Q3k28K36j3
$$ -339 -273 -48 267 55 -114 151 329 61 91 235 24 -51 -150 -24 170 -125 -97 61 144 -84 152 139
5484A39q1K74j49l45N6M32p0l76L5J30J24q4n39N26j66K20n71L89N0k45K71k57
$$ 139 58 332 183 -162 -106 326 256 -120 -85 45 169 85 -454 72 -94 126 -445 -56 -6 -251 20 -237
5506b37K13k68N61r9j71M46n13l03M10K16l35J2O6L19j71j33j12R4q7O0k16Q7
$$ -237 -24 -292 269 170 -1 445 -68 -371 39 255 -80 -68 -2 317 146 13 -99 -5 -92 -32 -248 -161
5528a61L50m22j91L39k4n3j16J31L31j69l7O7l18N62k45r0J07Q6J03l52N7L26
$$ -161 189 -233 -424 -85 -109 -162 -278 -147 184 15 -22 45 -273 289 44 -46 61 147 250 -102 -45 281
5550B81q6k56q9J9M51m26j62L50k3q6j40M25n2l02q6l67Q58k89J13j91J45J64
$$ 281 195 -61 -150 -131 320 -106 -268 82 59 -27 -167 258 206 -96 -182 -549 309 20 133 -58 87 251
5572B51l09J37j9l05K30j3k89M22oj90k44O20m6l62L9n6L4L15k79L7J01J16n40
$$ 251 -58 79 60 -245 -15 -28 -317 105 99 -91 -335 285 239 -123 -84 -140 -106 209 -70 -33 68 184 -356
5595c56K50N44j50m59Q7J63m6r6j84M27J69n48J64j8j8l5j91K39p2N00k34k69
$$ -356 -106 438 288 -171 -84 79 33 -63 -247 180 349 -199 -35 -53 -71 -106 -297 -58 -130 370 136 -133
5617a33K09l5kl55K93K80K13n85L3J83m20J53J70n7J73j94Lq9J3L37j05j84K72
$$ -133 76 41 39 -316 -23 257 470 -115 -82 101 -319 -166 4 -53 120 -74 -71 -160 -147 190 85 -99 173
5640A73J69k66l26P2M36j99K65l99J27Q0n6j22k58K56M00j90J06K2j6l56K35N
$$ 173 342 76 -250 -178 258 59 324 -75 52 132 76 -46 -304 -48 352 162 268 290 274 -82 153 158
5662A58k08l0J04L32j97l82J9L74j04jk47J74K96l07j51p7J6L80rj43J30L9l03
$$ 158 -50 -80 24 356 159 -223 -204 170 66 65 -182 -8 288 -19 -170 -247 -231 149 140 -3 127 166 -137
5685a37l2L11j08K53l38J49R1k7l6k11K6Q0k65K14J97j86K27j49J66K97m36J39
$$ -137 -169 142 34 287 -51 98 189 162 126 -85 -59 21 -244 -30 167 -19 208 59 225 522 86 225
5707B25o03N28O0k81mJ1R7j84o3K61J70l87L5J28K16k23K6J14k17J64P1k53K40
$$ 225 -378 150 210 -71 -75 -64 33 -151 -214 47 217 -170 -135 -7 209 -14 12 126 -91 73 144 -109 131
5730A31J79n63q8N25j22k3l11J59Q0N94m20j6k08J59l76J60K35M2n9k94K21j09
$$ 131 310 -253 -341 184 62 39 -272 -113 -33 561 141 125 -83 76 -300 -140 95 137 78 -216 5 -104
5752a04N8L4k06N92n1l20k56K85K96j79m62m0N29l72K18Q9K45l53M70n12K7L12
$$ -104 -46 -12 -218 374 323 3 -253 32 328 149 -313 -353 176 -196 22 111 356 3 473 -39 -12 300
5774C00k23j29K14K1K0l36K70j95K11j62lM8R2l82o6N14o9j13j30J3M12l96J25
$$ 300 77 -52 162 183 203 -133 137 -58 153 -9 -12 36 128 -254 -320 194 125 12 -118 -105 307 -89 36
5797C6q6N07k14n41J12L36r3j4N5j34M24q3o02K14P2J67j91R7Ol19l7Q5M50k8
$$ 36 -50 457 243 -298 -186 150 57 43 98 -36 388 305 -297 -83 -11 156 -35 62 68 -251 -288 -203 247 219
5821B19m40K46L33k55j6J69k02J42k32Rl4J91J77k52o2J16j10k4L0r2L04l71o2
$$ 219 -221 25 358 103 87 256 54 196 -36 -27 -61 130 307 55 -7 109 -1 -25 5 -87 217 -154 -216
5844b16J82Q2O5jn65M68O9k3l58L67k60O11n32k28K49M47j44k88K96m93N53k31
$$ -216 -34 48 113 112 -453 15 84 61 -297 70 -190 421 -111 -339 -90 357 213 -75 221 -272 281 50
5866E0o9J38l5j40l5M16j28k32l98R68m24k66J58O2L10r8m21J37r6j48J73J43
$$ 50 -19 119 84 -56 -91 325 197 -35 -433 535 111 -155 3 65 375 277 -144 -7 -103 -251 -78 65
5888F5k60L15M1m76L56M0M7l17J06J62K97m54J45J60l42m9J57j15J86m8J1k71
$$ 65 -195 120 161 -315 41 81 128 -189 -83 79 376 -78 67 227 -115 -164 -7 -122 64 16 27 -244
5910b44N83m62k90J47L61K69o56J95K05j25k6j25L18j01J04l93o7K40l49L34o7
$$ -244 339 -123 -413 -266 95 364 -292 -97 108 -17 -43 -168 150 49 153 -240 -307 -67 -416 -82 -149
5931a49L03j83j06M8K36L22n06n2k46O65j56l14M5J89Mk03j98O20o68J24%M03
$$ -149 154 -29 -135 -87 149 471 -35 -87 -333 332 176 -138 -93 96 100 -103 -301 319 -349 -225 -225 178
5953A78o8M2m9m08N65k60k75N6N52n46p1M22l24J21m7M37r7l8k42k97K79r5K76
$$ 178 110 152 103 -305 260 0 -275 -219 333 -213 -284 138 -186 -65 -112 325 228 190 -52 -349 -70 -165 111
5976A11j94N8K2K6j99j92M50j66J73j58M03j69o8k78q8L77K57l59k47M16j42J0
$$ 111 -83 -25 -3 23 -176 -368 82 -84 89 -69 334 165 97 -181 -269 108 365 6 -241 175 33 43
5998D3m00K12M88j83m81L51M8k43L29m9P0k28j05K51j52J36m6l51L05P1j34j65
$$ 43 -357 -145 343 160 -321 30 78 -165 164 115 185 -43 -148 103 -49 87 41 -310 -5 66 -68 -233
6020b33J57J24J65j39l09K09J49r3l58L97k2K48n25K27n3J38j69L46P0J62n97
$$ -233 -76 48 213 74 -235 -26 123 30 -328 69 47 295 -230 -3 -56 82 -87 259 329 491 -106
6041a06J57J15j04k94K61j05J02k0mo4Q8J89m62K36l0K05n0k30J13M92m05%l14
$$ -106 51 166 62 -232 29 -76 26 6 2 -62 26 215 -247 -11 -41 164 114 -116 -3 489 84 84 -230
6064b30L69j03k87M94l94M05j38j49J81j46rk70o3M40K72n08K09R2j96j7k67K28
$$ -230 139 36 -251 243 -151 254 116 -33 148 2 -7 -277 -340 100 372 -136 73 165 -31 -48 -315 -87
6086h7L94q0k02N8k97K07k40M65r7l4r4o0K56k63RK3K46o4k35j04L68j96J63m84
$$ -87 307 227 25 83 -214 -7 -247 218 121 87 -7 -67 189 -74 -65 -42 204 140 -95 -199 169 -27 136 -348
6110c48J64O1K74k08J42J31m09Q2j46l6M60k09j0O1L7j80j59K57J8M12m05j02
$$ -348 -184 -123 151 -57 85 216 -193 -111 -257 -293 167 -42 -52 9 46 -134 -293 -36 -18 394 -11 -113
6132a13J23pJ30j91j10L17j09j66k3K8L13m66N32j29J57j16j16J43j31k23J46
$$ -113 10 3 133 -58 -168 149 40 -126 -149 -121 192 -274 258 129 286 170 54 197 66 -157 -11
6153a1k17J74k4J69j06K67m77J19J84k60J86Q7j9j19J36J22k07k32M85l03J15
$$ -11 -228 -54 -78 91 -15 252 -225 -106 78 -182 4 91 72 -47 89 211 4 -228 257 -46 69
6174F9m78J83L46rl6l26J39K99l70J61L02j0O4o16J48L99o3m81K31L4m3m49K52
$$ 69 -409 -226 120 111 75 -251 -112 187 -183 -22 280 270 334 -282 -134 265 202 -279 -48 -14 -57 -506 -254
6197b54K45l42J44N9J79L35m59j71J43l4K87j43k19K09L60m35l5L95l62L77k76
$$ -254 -9 -351 -207 -148 31 366 -93 -264 -121 -155 132 -11 -230 -21 339 -96 -131 264 -98 279 3
6218Cn9L83j83j74l6r4J04L16l55j5J34Ql47M28J40m12L15J29m0n05K12J88L7
$$ 3 -56 327 144 -30 -66 -160 -56 260 -95 -110 24 32 -315 113 253 -159 156 285 245 -260 -48 140 177
6241A77q9l93L67j9J34j9l27M0K01k7k7l5L36m17k7L69j52p8k64M10k66J17j78
$$ 177 88 -305 62 43 177 158 -169 -129 72 45 18 -17 319 -98 -125 244 92 14 -250 160 -106 11 -167
6264a67M73o26M06m50K80M6R1o5n8r5J05J26K5J21j46p4J49m1K1J93k32l74K47
$$ -167 306 -320 86 -364 -84 -38 53 -12 -70 -165 -60 66 91 212 66 -8 141 100 121 314 82 -292 -45
6287d5%J05j35j93J86N4p7O5K79k49J75l72K62k07L7j71K99j05N64l74j09l4K31
$$ -45 -45 60 -75 -268 -82 -28 -105 -40 239 -10 165 -207 55 -152 -115 -286 13 -92 472 98 -11 -45 186
6310A86r1m45L33L2R8k21j1J15l7J17j44K67k0m1q6J02j23j04j01K39j3P1j43
$$ 186 95 -350 -17 15 113 -108 -119 -4 -41 76 -68 199 179 138 52 154 31 -73 -174 65 52 123 -20
6333b0jn5J81k51P1L59k64P2j07J19j73P2l9q4Q6j03K70l22L45M6m64K67J17N8
$$ -20 -21 -76 105 -146 -75 284 20 92 -15 104 -69 3 -36 -120 -34 -137 133 -189 156 202 -262 5 122 180
6357A80j52K60m75M16M2k11L11n05K34k09K46j2j98o3J04M6M6k7R5l60L61j41
$$ 180 28 288 -187 229 271 60 371 -134 100 -109 137 125 -73 -136 -32 14 60 33 128 -232 129 -12
6379a2m1J85m12M98nk57qJ30n46M94Q2n2M2m46M57J16j56J66l72J34N5p4K39l13
$$ -12 -53 132 -280 218 213 -44 -52 78 -468 26 108 56 98 -348 109 225 69 235 -137 -3 52 -22 217 -96
6403i6o2J31K50r5k28J79p8r3pJ86j32j19mK16j43K35J84q6j63j58p8L67n5r9
$$ -96 -158 -27 223 128 -100 79 1 -92 -99 87 -45 -164 -168 48 -95 140 324 238 75 -83 -161 206 151 52
6427E2k6J47J15m68P8j09M32m13J54j76J25K83k40o9k71P60n81j5K47j7L7k48
$$ 52 26 173 288 -180 -102 -211 221 -192 -38 -214 -89 194 -46 -115 -386 374 -207 -222 25 8 45 -203
6449b03L15J55k52O3n20N70Ol70K43J84l51K31q1j5R9J46n21J46K77j60J21j75
$$ -203 112 267 15 78 -442 128 134 -236 7 191 -160 71 -10 -25 74 220 -301 -155 122 -38 83 -92
6471i2L3n5r5J68K2J87rJ94j84q5j78j19K42p7J39k55K15J30j98r6J11j61N81
$$ -92 -59 -114 -209 -41 -19 168 159 353 169 84 -94 -213 29 -48 91 -164 51 181 -17 -113 -2 -163 418
6494D18l70o0O6m8K3Kj7J76j27p3J57k93J87k93M56k01K20l23Q3J39k6k19K02
$$ 418 48 -12 54 6 29 31 14 190 63 -10 147 -146 41 -252 204 3 223 -100 -17 122 96 -123 79
6517G9J27j60j84l3j9N31j92j55J04j17L02l60j30M50l73l7K35j00j23J11J07
$$ 79 206 46 -138 -171 -190 341 149 -6 98 -19 283 -77 -207 243 -130 -167 68 -32 -155 -44 63
6538F3k6j3k0K99m15O0k2o0q1K07j29K41k16L1P5j2J43N0j35K90j95r2l67J14
$$ 63 37 24 4 303 -112 -52 -74 -134 -215 -8 -137 104 -112 -81 -6 -18 125 175 40 330 135 43 -324 -210
6562b10L07l89M60j25P9o4l39K46M9J50l39L54j72J28k72j83N20j37K11l64N87
$$ -210 97 -292 168 43 122 58 -281 -35 14 164 -175 179 7 135 -137 -320 200 63 274 -90 497
6583D97k56j94J37j94j7R5O3j49N2q0J88K43m95p8M78l71K25J9l35J99k9J41K43
$$ 497 241 47 184 -10 -27 68 131 -18 34 -46 142 385 -110 -188 290 -81 144 163 -172 27 -2 139 382
6606C82m18q1J92K6r3Q3j47Q1n6K33R8j44j55J21j8k8p5J77J52l88r2K29k72k3
$$ 382 -36 -117 75 101 8 91 -56 25 -31 202 300 156 1 122 104 76 1 178 330 -58 -150 79 -193 -216
6630b16L50n7q8j4K17m8k53k8L7J47m7k75L09n8L2K11j6j72mk37K89O2l60K54
$$ -216 134 77 -11 -25 192 144 -109 -137 -100 47 0 -275 34 -24 8 219 203 31 27 -210 79 141 -219 35
6654C5L88m95L6K18k82L15m76J71N0j31j8O35n45mJ67k83M6O5L72j62l9k73J11
$$ 35 423 -72 -36 182 -100 215 -261 -90 -40 -171 -189 446 -99 -103 64 -219 -173 -108 264 102 63 -210 -99
6677i9L79j84j15j58O03m39j98L15K69l75j51J73M7K8k64L25k52L0L48j81j43
$$ -99 280 96 -19 -177 426 -13 -211 104 373 -2 -153 20 67 95 -169 156 -96 -66 282 101 -42
6698d2p0J0J24m7J0j0J25k16l5J59n2J49k43J86p6j32J36o1q3m7N67j14j23N1
$$ -42 -112 -102 22 -25 -15 -25 100 -116 -151 8 -44 105 -138 48 -28 -160 -24 -85 -168 -215 352 238 115 166
6722A66K98l47J30q8mk71j31K52P1j0k2k58J37m1N6L23k14l90M10O2j37K97l23
$$ 166 464 117 247 159 155 -116 -247 5 76 66 44 -214 -77 -118 -62 261 47 -343 67 129 -8 289 -34
6745c4j68L59P1l47j19K88k52L73J34K20o75J05J26j10q9L07l32j64L37J6j62
$$ -34 -202 157 228 -119 -238 50 -202 171 305 525 -150 -45 81 -29 -118 189 -143 -307 30 46 -116
6766a16M8%K19j03k3L98n25r0J46L44P7m26j67J70J61j16j58R4j37K36k10L13
$$ -116 -68 -68 151 48 25 423 -102 -192 -46 298 375 -51 -218 -48 113 -3 -161 -67 -204 32 -178 135
6788A35o5K38l54k51M18o5K42k31Q3k69P9N4K13J18m53J85k62L20l1j08p7J81
$$ 135 70 308 -46 -297 121 56 298 67 150 -119 -40 14 227 345 -108 77 -185 135 104 -4 -81 100
6810A00O0k96j41O52M4k72k7r7P1n4J13Qj51k03K90k69Lp2K60k25N7O7J85j66
$$ 100 160 -136 -277 375 419 147 120 23 94 40 153 161 10 -193 97 -172 -169 -241 19 -206 -149 -82 103 -63
6834f3J82j39j82M14n32L35j22lq1Q6k23L82K71k20L3k12j4k8L52m01K10O3l84
$$ -63 119 -20 -202 212 -320 15 -107 -110 -191 -105 -328 54 325 105 138 -74 -88 -116 236 -165 45 108 -276
6857b76K60j02k04J46K21j12j19Q5N71p13J49K3L53l81N68m76Q2n6L4k0o5K60
$$ -276 -16 -118 -322 -176 45 -67 -186 -101 470 -243 -94 -71 282 -99 469 -7 75 19 53 33 -32 228
6879B28L2J11k42j06j46o5q1K65L93j03n69L73k8J05l01Q6p1K56j0rr1k6O1j42
$$ 228 260 371 129 23 -123 -188 -269 -4 389 286 -283 90 62 167 -134 -48 -119 137 127 118 27 1 62 -80
6903h0J97j64L22j88o1P9o9j18J12N6k80J07p2j10O52l74M4J32k66J63j50k42
$$ -80 117 -47 275 87 26 105 36 -82 30 86 -194 -87 -159 -269 383 9 53 185 -81 82 -68 -310
6925c10J68L56k0l98K1K25P3j60j3j10J97J02j77k5kJ46m9K56k15LL74o18L53
$$ -310 -142 214 194 -204 -183 42 115 -45 -58 -168 29 131 -46 -71 -73 73 24 280 65 68 442 -176 177
6948A77m12K40l2K01l41J74l0r9l2J20K8o5K97M5j49j27j6j94M24k3j14n3Q0m54
$$ 177 -235 5 -27 174 -167 7 -23 -122 -154 -34 -6 -71 226 271 122 -5 -21 -215 209 186 72 19 99 -355
6972c55K57L13O5m34K52j18rP8l34J81J07j05k9M0J56J25j92K5Q0k26M1p9K68
$$ -355 -98 215 280 -154 98 -20 -29 49 -285 -104 3 -102 -131 -91 65 190 -2 23 103 -123 -82 -161 107
6995A07P2k98J58k2j22J51M9l47J62n4K60p9l41J78L65n1j54k24L05n2o3M3Kj79
$$ 107 179 -119 39 17 -105 46 95 -252 -90 -144 116 37 -304 -126 239 188 34 -190 115 63 0 43 45 -134
7019a34R2K59j5Pm16L20o2j38K4J90k23J75m89L25L80k30k59L0L90j25k40R6n
$$ -134 -42 217 202 209 -207 113 51 -87 -63 127 -96 79 -410 -85 295 65 -194 -164 226 101 -139 -43 -48
7042d8J33oj52J77j23j38K94r6L2l15M02k46j04M33k21J26m02J3J11J41R4p6j7
$$ -48 85 79 -73 104 -19 -157 137 41 73 -242 160 -86 -190 243 22 148 -254 -241 -130 11 105 29 12
7065A2j72Kk46P69n69qM21J70l90j98L46J7l22Q8O1J21j04k71N46l18K18Np91
$$ 12 -160 -158 -404 365 -204 -212 209 379 -11 -209 137 154 -168 -80 -19 102 -2 -273 273 -45 173 178 -613
7088f13O70J7p0k9j07J08K38j43k13L44k81j40K61j65J07K42k80j78K23P3JJ1
$$ -613 57 74 4 -25 -132 -24 214 71 -142 202 -79 -219 42 -123 -16 226 -54 -232 -9 64 65 76
7110G6J3M4l00L02l19K29j04q0M7N10k44k32m2j51K41N0J91m6k75l15K43K01J73
$$ 76 89 133 -167 135 -184 45 -59 -139 -92 418 174 -58 -100 -251 -10 40 231 185 -90 -405 -162 39 212
7133B12k84K3K12o7k86K97k82l4J32K02l0o6m9J05Nn6K22k45R8o3M7j92Ko2J10
$$ 212 -72 -49 163 96 -190 107 -175 -209 -77 125 95 29 -20 85 90 34 256 11 109 46 93 -99 -97 -159 -49
7158d9p3m9J93K37l16K06j57k3P6k87M49l35K65k01N1J82k13j77kL49n32M20j35
$$ -49 -122 -171 22 259 -57 149 -8 -31 45 -242 207 -128 137 -64 -13 169 -44 -221 -223 126 -406 14 -121
7181a21J42k24J98J63j48j89J96j58L89k52k18K30J8o09N81k9K36k36K34m27J94
$$ -121 21 -203 -5 158 10 -179 17 -141 248 -4 -222 8 26 -583 -2 -31 205 -31 203 -224 -30
7202c0M6k24J97J42k3k73j12N77k47jj93K77j27K19m12K8r3J16MJ44k3J17k4p
$$ -30 16 -208 -11 131 108 -165 -277 300 53 52 -141 136 9 228 -184 -156 -249 -133 -129 15 -8 109 85 78
7226G8k82Q3r1L31Q4K61m86p4J64k17L23j60K77J01n29L50m16L0K91l59K13K06
$$ 78 -204 -121 -212 119 203 464 -22 -96 68 -149 174 14 291 392 -137 213 -203 -173 118 -241 -28 178
7248A78l24K89k89K61j88j24L47k05M6NK8m5nj43L07l08M19rN7l19j55K62J13
$$ 178 -146 143 -146 115 -73 -197 150 -55 -9 -4 24 -21 -26 -169 138 -170 249 240 297 -22 -177 85 198
7271A98K17m41M60k36k19k33K54K21m9j12j8j0j19M9Q2J12jJ4l61J7M42j53J15
$$ 198 415 -26 434 198 -21 -254 0 221 172 60 42 32 -87 -38 44 156 155 169 -192 -175 267 114 229
7294B29l68J43J56l53K09Q1k38j20M95k38j99J23K54n9Nl5j74J03Jj28K50N3m8
$$ 229 -139 4 160 -193 16 97 -141 -261 234 -4 -203 -80 174 115 120 85 -89 14 15 -113 137 190 142
7317A42l2k93K76j73Kj82K67l07K55K94j74l7J94k13r5J53j39O7L58m33M0K60
$$ 142 110 -183 93 -80 -78 -260 7 -300 -45 249 75 38 232 19 -76 77 -62 5 363 -70 -30 230
7339B30j55p4J64k8j29o7m5j0K47j21j81J49K21j63k2j7l7M5P9Q3k09j20K24m13
$$ 230 75 1 165 137 8 -59 -104 -114 133 12 -169 -20 201 38 16 -1 -38 7 86 169 -40 -160 64 -349
7363c49N55l77jK36k04K41k42Q0j46M55l90K46j93kJ97j02K52J52l84k7N8l68
$$ -349 206 -171 -172 64 -140 101 -141 -61 -207 248 -142 104 -89 -91 106 4 256 408 24 -3 55 -313
7385c13K42J49R9j39j14J21L6l0P2m37J93j44K38J3P8k38Q9M1L56l09P4L9p1l38
$$ -313 -71 78 177 38 -76 45 81 51 123 -314 -121 -265 -27 -14 64 -174 -85 -44 312 3 77 116 45 -293
7409b93K87K97l98M31m85M01j00j69l99P59l48K41l23K7J07K79k43j61J91j24
$$ -293 -6 291 -107 324 -161 240 140 -29 -428 331 -17 224 -99 -72 35 314 71 -90 101 -23
7429b3m4J1m9L69l84J69P9j37p7J70K34j97o1k95J16K82k12p8J76p9J60r5M1l46
$$ -23 -67 -56 -105 264 -120 49 128 -9 -86 84 318 121 60 -235 -119 163 -49 -127 49 -30 130 35 76 -270
7453b70N5O10l72m9L9l6J43j51J05j06J46M8J09j26p3l2K5r2L63j85m08M03q4
$$ -270 -215 395 23 -26 13 -23 120 -31 74 -32 114 162 271 145 72 40 65 -27 336 151 -257 146 62
7476F2J36k40k5L86l05k70K84k46K59k33K25K9k11J51M5k51M0M40m15l6RM05j91
$$ 62 198 -42 -67 319 14 -256 28 -218 41 -192 33 62 -149 2 47 -204 -164 276 -139 -175 -166 239 48
7499D8k25P10m58k35K3J62l0N6o9O4n2m7J47J5K1k10J67K13j94J82l88Q8l1L91
$$ 48 -177 533 75 -160 -137 25 -5 51 -18 46 -6 -53 94 109 130 -80 87 300 106 288 -100 -12 -43 348
7523C48n52J70l5J06J10j08j06N4K60Mn64J59K13p3N2M2L68k26q3N7K52o22J11
$$ 348 -204 -34 -69 37 147 39 -67 -13 247 251 -313 -154 59 -14 38 80 448 222 139 196 448 -174 -63
7546f3J15Rk47N17j11m58o0J28k30R1K33J99J37k78J38J6j04j70L01L7k27m3j08
$$ -63 52 61 -186 331 220 -238 -298 -170 -400 -309 -76 123 260 -18 120 136 32 -138 163 200 -27 -70 -178
7569a78J68J47k46k48M30M7k38q2Q0Q7q2o2j14L86k02N96o29OL01l50J66j11J33
$$ -178 -10 137 -109 -357 73 120 -118 -200 -120 -33 -115 -177 -291 95 -107 489 -140 -134 167 -183 -17 -128 5
7592Ep0p7P0K71l60L80k37k29K03r3J81n2K98j47j14J58j88L1j20K39k07J82J8
$$ 5 -65 -142 -72 199 -161 219 -18 -247 -44 -137 44 -8 290 143 29 187 -1 30 -90 149 -58 124 142
7615A42J72k46j95J19m7J26K71l43k31J4L95O6o8l49M76j67l26L30k9j58N9J60
$$ 142 314 68 -127 -8 -55 71 342 -1 -232 -218 177 243 175 -174 302 135 -191 139 110 -48 11 171
7637A71l78J07j05L95k42j44P5q0M8q3L1j52J25J84j35R2j07J77J64j47J89k62
$$ 171 -207 -100 -205 190 -52 -196 -121 -201 -153 -236 -205 -357 -232 -48 -183 -91 -198 -21 143 -4 185 -77
7659g7J42j33K21j39k2N7k15NK72Ok26L60j89k3j7k05K28L3K7m29M09k59L00k95
$$ -77 65 -68 153 14 -8 49 -166 -161 111 117 -109 251 62 39 22 -183 45 78 105 -324 85 -174 126 -169
7683a69K66o9k88K89O1Q2l01m9Q9N3n1p7J4L75j38q3j93L91m26N28k42q3j19o3
$$ -169 97 28 -260 29 90 172 -129 -178 -89 -36 -87 -164 -150 225 87 4 -189 202 -224 304 62 -21 -140 -203
7707b03K73j60l5J33o2K7K32J79m45k31N22k30j07O8k48J58J19j15L8J46J03K53
$$ -203 70 -90 -125 8 -54 -27 205 384 -61 -292 230 0 -107 -39 -287 -129 -10 -125 -87 59 162 415
7729D15k57k73K46k27K53m51K51K94k38m2k1M23j36l55L6N7LP7p0J09l83M07l4
$$ 415 158 -115 131 -96 157 -294 -43 251 13 -29 -50 373 237 -118 -82 -25 -22 55 -15 94 -289 118 84
7752H4j87K06j03o2o3J89K32l51R4j71J94j94k9K56K80j16k87j33L51l31o0L13
$$ 84 -103 103 0 -62 -125 64 296 -55 39 -132 62 -132 -161 95 375 259 -28 -161 190 -141 -201 112
7774A12n02N92p9J47k80l56L12J63m07K08j24K19J06k8J94O4k92P6k40J90k1o8
$$ 112 -390 202 123 270 -10 -366 -54 109 -298 -90 -214 5 111 83 277 341 49 125 -115 75 54 -14
7796a4O9m4J0p3p3m8L61j46M6q1o1q8J72j42n6R3l9K67j35J8k46j08N00r3j77
$$ -14 55 11 21 -52 -125 -173 188 42 88 7 -54 -142 30 -112 -168 -75 -114 153 18 36 -210 -318 182 89 -88
7821h8K31j61N6o4Q0J9J16j64j29J76m1j44J3K43k1j82lM7J8K00l1j57j07K27
$$ -88 143 -18 38 -26 54 73 189 25 -104 72 31 -113 -100 143 122 -60 -63 -16 2 202 171 14 -93 134
7845A34l50N2K8J40J01k7k01J40J35P7k34K26l08l2J36L37m11k5j86l1J16K62
$$ 134 -216 -164 -136 4 105 78 -123 17 152 229 -5 221 -87 -119 17 354 -57 -82 -268 -299 -183 79
7867G9J75K4m50J25J52j96j84K33N9j23l40L60L63O9k92K34k51k6L46j67Oj8j11
$$ 79 254 278 -172 -47 105 -91 -275 -42 17 -106 -446 -86 277 346 54 288 37 11 357 190 196 178 67
7890F7l15pM04l04k77N48J20k57J1r8R8J45k93M98j06l20J23Q2j8j4k68K11q1
$$ 67 -248 -255 149 -155 -432 116 236 -21 -10 -108 -10 135 -158 340 234 -86 37 119 101 87 -181 30 -51
7913e1J1J04K70l69P8j7R3j55K37j39l37K36P8j01K56m5k43J79K38l52q6J52j87
$$ -51 -40 64 334 -35 43 26 119 -36 201 62 -275 -39 39 -62 194 149 -94 85 323 -29 -115 37 -150
7936a50M23l28K42j38J6l17K1n4m0J80n6M74m64L58j75K68j19j36j44K72j20j15
$$ -150 273 -55 187 49 65 -252 -231 -285 -325 -145 -201 273 -191 167 -8 260 141 5 -139 133 13 -102
7958a02L70q3k10m1Q6l52M76K56k59j07n2m1J71j05RP1o0jj82r7K06r6K70k3j34
$$ -102 268 185 -25 -66 20 -332 144 400 141 34 -18 -59 112 7 16 87 27 26 -156 -253 -47 -143 127 104 -30
7983c0Q9n2J06j80K76l66R4K61M5m76K78J96l52M1k2P3K7qP0K0j3l7m1L3n8J46
$$ -30 59 7 113 -67 209 -157 -63 198 243 -233 45 241 -111 -70 -92 -19 8 0 70 90 77 40 -1 32 -26 120
8009A20J11O7m0l53L05n4j14k61L41k46j22J87j00J42J50l3P9j66r1J65O9k50
$$ 120 231 298 258 -95 210 156 42 -219 122 -124 -246 -59 -159 -17 133 100 179 13 -78 87 156 -94
8031i4l43M11k30M28J62l80l73K45L24k69J94J60k11L23m93K05j63J68Ml1R0k42
$$ -94 -437 -26 -256 172 334 -46 -419 -174 150 -119 75 235 24 347 -146 59 -104 64 68 37 127 -115
8053a15K25k95M26k81Ql41M96K11n52J49J6j09N0J30l2k5k3J1n2K20q0k00ln2
$$ -115 110 -185 241 -40 -32 -373 123 334 -218 -69 -53 -162 -112 18 -14 -39 -62 -51 -103 117 37 -163 -166 -218
8077b18K05n9Q4J34O0m4J13n08L18J80j20j08J77j91k99J93P7n2KK40k62J93j22
$$ -218 -13 -72 12 146 206 162 275 -233 85 265 145 37 214 23 -276 -83 -6 -58 -56 184 -78 115 -7
8100gNK13k10N0j16N5r0J0J86j31l40M12J94j61J72k4j58j95m0J78j95L39k06
$$ -7 -2 211 1 51 -65 -10 -100 -90 96 -35 -375 37 231 70 242 218 60 -135 -175 3 -192 147 -59
8123e9L75n47J99r2L6k39M98j04j95K65j41N5J1R5j65l00Q2K97J80m52P3K61q1
$$ -59 316 -231 -32 -124 -88 -327 171 67 -128 137 -4 51 62 157 -8 -308 -226 71 251 -201 -128 133 52
8146E2K7J16l12J97j92K34n5j3m47N38N2n21J10L37j29L4O1J74k4l37K92j51j82
$$ 52 79 195 -117 80 -112 122 67 54 -393 145 197 -324 -214 123 -6 28 89 263 239 -98 194 43 -139
8169a39JJ35J40J7k36L89l86j71L71n3Q2l24L11j06o1j82J30j55J04o6L04L1
$$ -139 -138 -3 137 154 -82 307 -79 -250 121 68 150 -174 137 31 -30 -212 -82 -237 -133 -199 105 136
8191A36
$$ Imaginary data points
##PAGE= N=2
##DATA TABLE= (X++(I..I)), XYDATA
0@%%%%qJ6j6J6k4L2l3M1n6P2q8J06j30J57j83K18k57K98l47M02m63N31o08O93
$$ 0 0 0 0 0 -8 8 -8 8 -16 16 -17 24 -32 40 -48 58 -72 85 -98 120 -137 161 -186 216 -247 284 -324 369
28C69p84Q85j002J127j262J415j583J765j964K183k425K689k978L299l654M045
$$ 369 -415 470 -532 595 -667 748 -835 930 -1034 1149 -1276 1413 -1565 1734 -1920 2125
44B125m477M963n512O131o840P660q619R759j1141J2863j5072J8026k2214K8653
$$ 2125 -2352 2611 -2901 3230 -3610 4050 -4569 5190 -5951 6912 -8160 9866 -12348 16305
58A6305l9946O5514k27137J2394M07011o7100r9929L7939M4625k63219k24858
$$ 16305 -23641 41873 -185264 -172870 234141 167041 67112 105051 149676 -113543 -338401
69c38401J10912L17463R5862r4119n0216O2476n1497j82960j04163J49323K14903
$$ -338401 -227489 89974 185836 91717 41501 103977 52480 -130480 -234643 -85320 129583
80A29583L8626j10590p058Q0006p9572k52941p1070K25386J92041o0006n9177
$$ 129583 168209 57619 50561 130567 50995 -201946 -273016 -47630 144411 84405 25228
91B5228J18053L0572k56095k26515J10441K39918M2091n5888O9992P6490j44462
$$ 25228 143281 173853 -82242 -308757 -198316 41602 83693 27805 97797 174287 29825
102B9825k37460l3758J77263J48145J8231o709K9646l0143j55090j55047K9887
$$ 29825 -207635 -241393 -64130 84015 102246 95537 125183 95040 -60050 -215097 -185210
113a85210J88493J25832k7904k8454N4543k8295j97030j33598J16994J75211K180
$$ -185210 3283 129115 101211 72757 127300 99005 -98025 -231623 -114629 60582 62762
124F2762n1023Q2072P1670j43511k07853j100J50903P0459j1421N3982P8220o3874
$$ 62762 11739 93811 165481 21970 -185883 -186983 -36080 34379 22958 76940 155160 91286
136I1286j86081j11018N6753J26690Q2249L3616L2207P587r2969j66709p6984
$$ 91286 -94795 -205813 -149060 -22370 59879 93495 125702 133289 40320 -126389 -203373
147b03373J02043J46377L5543j3845M6997J6087j38508j64395K1776J46078O1064
$$ -203373 -101330 45047 80590 66745 113742 129829 -8679 -173074 -151298 -5220 55844
158E5844k2532M0433O4749p3534j72742o8526Q2521R2789L1667L3498N4534p749
$$ 55844 33312 73745 138494 64960 -107782 -176308 -93787 -998 30669 64167 118701 110952
170A10952j12548j29564l1422P8236R5475M2252K1797L6455j3101j22890j27099
$$ 110952 -1596 -131160 -162582 -84346 11129 53381 75178 111633 98532 -24358 -151457
181a51457J8183J20019O0433p630L7118N4510o9100j59540n6382R0429Q3113P247
$$ -151457 -133274 -13255 47178 39548 76666 131176 62076 -97464 -153846 -63417 19696 26943
193B6943K5634O8429p572j27251j17916J185P4735N4981L2598M8630L9522m2743
$$ 26943 52577 121006 113434 -13817 -131733 -130548 -55813 -832 31766 80396 119918 77175
205G7175j25508r6094K3570R2163N1752J4933M5872L6477p8817j46053m2790R0656
$$ 77175 -48333 -144427 -120857 -28694 23058 37991 83863 120340 41523 -104530 -147320 -56664
217e6664P9309N502K6189O7875j6516j36814j04821L2208Q2976L1676J8656O0980
$$ -56664 22645 28147 54336 122211 105695 -31119 -135940 -103732 -20756 10920 29576 90556
229I0556L7165p0864j26386n6101M2263O0957K7487L0436N6735J3642q9214j17927
$$ 90556 127721 56857 -69529 -125630 -83367 -22410 5077 35513 92248 105890 16676 -101251
241a01251k0869P1127N2224Q941M1131O4724k8175j31842q7010M1296P3155J9113
$$ -101251 -122120 -50993 1231 10172 51303 116027 87852 -43990 -131000 -89704 -16549 2564
253B564K3573P4666L1506r1894j25695k7580N5151M0807J6205N0389O4356j5004
$$ 2564 26137 100803 132309 40415 -85280 -112860 -57709 -16902 -697 49692 114048 99044
265I9044j06665r0813O323N4895K7309J7085N5535M8187m9931j18737n7683M4202
$$ 99044 -7621 -98434 -92111 -37216 -9907 7178 62713 110900 60969 -57768 -115451 -71249
277g1249N1878R926L3642P6573J6650r9963j09353p199N1901K2631J5483O7545
$$ -71249 -19371 -9445 24197 100770 117420 17457 -91896 -99095 -47194 -24563 -9080 58465
289E8465O5024l5945j11404o5712K0127L5815J2439L2686O9677K9183o9329j01917
$$ 58465 123489 87544 -23860 -89572 -69445 -33630 -21191 11495 81172 110355 41026 -60891
301f0891l1349L7253K9981J2324M8971O7627o755r9406q5339L710L8437J3200
$$ -60891 -92240 -54987 -25006 -12682 36289 103916 97161 -2245 -87584 -83874 -45437 -32237
313c2237K4964P3803N1448n0550j03261m5900K2402K0790Q239M7024P4124J1306
$$ -32237 -7273 66530 117978 67428 -35833 -81733 -59331 -38541 -30302 16722 90846 102152
325A02152p8849q3502j3157K7232J3986K0549O2372N6742k8237r4710o1587Q455
$$ 102152 23303 -60199 -73356 -46124 -32138 -11589 50783 107525 79288 -15422 -77009 -68554
337f8554K4117R366L7611P5567L3579o1817r1140l1105J8739R601J0480N8458
$$ -68554 -44437 -35071 2540 78107 111686 49869 -41271 -72376 -53637 -44036 -33556 24902
349B4902P0912n373q2553o7214j795J7953L038K8095P1003M5643m3513q6848m1420
$$ 24902 95814 90441 7888 -59326 -61121 -43168 -40130 -12035 58968 104611 61098 -25750 -67170
362f7170J1684J0152O908M9514P5713J5808o9126p5169j8397J1309l39J7117O8700
$$ -67170 -55486 -45334 -38426 11088 86801 102609 33483 -41686 -60083 -48774 -49113 -31996 36704
375C6704O2815k0117p9908n1343R79O495j067L8164P5013L1805n3883p6408k7268
$$ 36704 99519 79402 -506 -51849 -50870 -44375 -45442 -7278 67735 99540 45657 -30751 -58019
388e8019Q093l98J1511O0154O9842j813p1756o0280r604K883m815K8283P3609
$$ -58019 -49926 -50324 -38813 21341 91183 89370 17614 -42666 -52270 -49387 -54202 -25919 47690
401D7690M9798l2706p2631l6380J330m212j43M8133P2695J7593n7699o2214j6398
$$ 47690 97488 64782 -7849 -44229 -42899 -47111 -47254 879 73574 91167 33468 -28746 -45144
414d5144R68r086J6862O7452O0173j4794o7785m6099p341p269n594L8472P5190
$$ -45144 -44176 -53262 -36400 31052 91225 76431 8646 -37453 -44794 -52063 -57657 -19185 56005
427E6005L6456m1240o3029k6834l859j1511O355N7698O6849L031n7256m9271j1029
$$ 56005 92461 51221 -11808 -38642 -42501 -54012 -47657 10041 76890 79921 22665 -26606 -37635
440c7635p092j0610K6655O9933M6911k5671n9325l3383r646j3965j002M8257O8946
$$ -37635 -44727 -55337 -28682 41251 88162 62491 3166 -30217 -39863 -53828 -54830 -6573 62373
453F2373K1329m2458n0783k2339j2077j4235J4762O0862N7018m846n1542m0221
$$ 62373 83702 41244 -9539 -31878 -43955 -58190 -43428 17434 74452 69606 18064 -22157
465b2157j2993j3339q821L4793O8323L5715l0878n1042k5831j2523j8128O029
$$ -22157 -35150 -48489 -57310 -22517 45806 81521 50643 -399 -26230 -38753 -56881 -50852
477e0852N5277O1492Q367m1787l9984j9970j8047j3026K4388O0799M4990j0862
$$ -50852 4425 65917 74284 32497 -7487 -27457 -45504 -58530 -34142 26657 71647 60785
489F0785m4434l3005j6082j7073m738L8496O4127K7332l2111m5468k1921j4654
$$ 60785 16351 -16654 -32736 -49809 -54547 -16051 48076 75408 43297 -2171 -24092 -38746
501c8746k0342J0336N9674N7151j669m3080l2094j7398k3147j1437L3780O2669
$$ -38746 -59088 -48752 10922 68073 66404 23324 -8770 -26168 -49315 -60752 -26972 35697
513C5697L3306j8176l7299k6823j9996j8766L280M3028N5564J8324l0248l8948
$$ 35697 69003 50827 13528 -13295 -33291 -52057 -48777 -5749 49815 68139 37891 -1057
525a057j9753j6457j8442J3125N8302N1158p438m1216k6201j5103k8163j2779
$$ -1057 -20810 -37267 -55709 -42584 15718 66876 59438 18222 -7979 -23082 -51245 -64024
537f4024M0898O4645K4079k4711l0319k0160k6565k3370J2815N1248M7019O607
$$ -64024 -23126 41519 65598 40887 10568 -9592 -36157 -59527 -46712 4536 51555 58162
549E8162k6770l0525k1716j9818j1436K0956N3909M0716j0959l7350k1671j3859
$$ 58162 31392 867 -20849 -40667 -52103 -31147 22762 63478 52519 15169 -6502 -20361
561b0361k6644j2513M2418O2049J6435k8469k3309j2656l0805l2000J7964N9069
$$ -20361 -47005 -59518 -17100 44949 61384 32915 9606 -3050 -33855 -65855 -47891 11178
573A1178M0434l912k0722j9364k7576l1480n477L4788N0407K8413j0084k9489
$$ 11178 51612 47700 26978 7614 -19962 -51442 -56919 -22131 28276 56689 46605 17116
585A7116k4557j9816k2006p37M3427N4799J0235k9718k1959r470k8477l0482K0305
$$ 17116 -7441 -27257 -49263 -50000 -6573 48226 58461 28743 6784 -2686 -31163 -61645 -41340
598d1340O0267L2077j3633j6255o985k8439m1279l277M3906M5167J4402n450j4765
$$ -41340 18927 51004 37371 21116 14131 -14308 -55587 -58864 -14958 30209 44611 39161 24396
611B4396k7810l4190j9414J3127M3186M3741J1932k1520k6010j9707k6676j8543
$$ 24396 -3414 -37604 -57018 -43891 -705 43036 54968 33448 7438 -12269 -38945 -57488
623e7488K5115N7837K8728j7710k0314o231k4869l8222J577M9068L8459q46q037
$$ -57488 -32373 25464 54192 36482 16168 9937 -14932 -53154 -51577 -2509 35950 35104 27067
636B7067k335k2353m1093j7738K3169L7427K5936J1814m955k2119l1130k7447
$$ 27067 24732 2379 -38714 -56452 -33283 4144 30080 41894 36939 14820 -16310 -43757
648d3757r488K3154M7389L2066o421k1476j6059k6510l4205L052N1985M3092j674
$$ -43757 -53245 -30091 17298 49364 42943 21467 5408 -21102 -55307 -52255 -270 42822 41148
661D1148j5014m934k2119m2842j3897L5655M1145J2166R83J34j8670l6680k2768
$$ 41148 26134 21200 -919 -43761 -57658 -22003 19142 31308 32291 32425 13755 -22925 -45693
674d5693N790K3492K8906K3582L192j6383k1554k3434k3985k40L7799M1774P652
$$ -45693 -39903 -16411 12495 36077 39269 22886 1332 -22102 -46087 -46327 -8528 33246 40898
687D0898j2377p767j9554m1438k0121L3398M7436J5127k880J148j6003m3291k9189
$$ 40898 28521 20754 1200 -40238 -60359 -26961 20475 35602 32722 33870 17867 -25424 -54613
700e4613J5729L4323K3076J4566O635j4013l1443k6684r198Q756K7995L2292J1512
$$ -54613 -38884 -4561 18515 33081 39716 25703 -5740 -32424 -41622 -32866 -4871 27421 38933
713C8933j1187j4170j8282l0279j8126K6035M3884J7522m822l24j0560m0465l4608
$$ 38933 27746 13576 -4706 -34985 -53111 -27076 16808 34330 29508 29184 18624 -21841 -56449
726e6449J4814M0787K2947P611R309p078l7487l6504k173K2355K4558K2548J4050
$$ -56449 -41635 -848 22099 29710 39019 31941 -5546 -42050 -44223 -21868 2690 25238 39288
739C9288o485k3865k5322j9364m482K0428L4731J7659m679n951j0394l0862k9651
$$ 39288 32803 8938 -16384 -35748 -40230 -19802 14929 32588 27909 21958 11564 -19298 -48949
752d8949J0414L7627K1203K693Q901J142l3170m2243l675K6650K2614J5244J8602
$$ -48949 -38535 -908 20295 22988 31889 33031 -139 -42382 -46057 -19407 3207 18451 37053
765C7053M347k7463l7898j7080O178J9853K7126K1960L096j4984k2187k5781j7010
$$ 37053 41400 13937 -23961 -41041 -34863 -15010 12116 34076 37172 22188 1 -25780 -42790
778d2790J1077L2734K2523K069P00l249k6976l5219k563K7556K0489P280J4918
$$ -42790 -31713 1021 23544 25613 26313 23064 -3912 -39131 -41694 -14138 6351 13631 28549
791B8549J0444k2317m0324j7121J1519J6013J6875K4278J5242j3737l2349k6359
$$ 28549 38993 16676 -23648 -40769 -29250 -13237 3638 27916 43158 29421 -2928 -29287
803b9287j0218Q923K5839K7664J3359l316j5680k9070k8333q52K7911K5144R481
$$ -29287 -39505 -30582 -4743 22921 36280 32964 17284 -11786 -40119 -40971 -13060 12084 21565
816B1565P788K312k3239l7548j1402J8532J8269R100J6715J5667j2460l3936k0904
$$ 21565 29353 31665 8426 -29122 -40524 -21992 -3723 5377 22092 37759 25299 -8637 -29541
829b9541N47P822J3084K2782J9954o34j9924k6167j9976l244J6390K4957J8201
$$ -29541 -28994 -21172 -8088 14694 34648 34014 14090 -12077 -32053 -35297 -18907 6050 24251
842B4251R592k776k3981l3522j4095J5056K0902J4416J6158J2051j4413l6320
$$ 24251 33843 31067 7086 -26436 -40531 -25475 -4573 9843 26001 38052 23639 -12681
854a2681k1980N647J3007J1080J9986K0640k930k6928k4689r048R47J0076K0121
$$ -12681 -34661 -29014 -16007 -4927 15059 35699 32769 5841 -18848 -27896 -26949 -16873 3248
867C248K2203R014j0133k2152k4059j1703P909J8076J7794J7251Q466j4481l2355
$$ 3248 25451 34465 24332 2180 -21879 -33582 -25673 -7597 10197 27448 35914 21433 -10922
880a0922k1748L484J2657J2610J9465K0822l008k9422k6512n921M370Q176J9094
$$ -10922 -32670 -29186 -16529 -3919 15546 36368 33360 3938 -22574 -28495 -24125 -15949 3145
893C145K4990P924j6318k4403j7353o778M783J5650K1964J5954J979j6472k5563
$$ 3145 28135 36059 19741 -4662 -22015 -28793 -24010 -8360 13604 29558 31537 15065 -10498
906a0498j7778K85J0998J5101J9444J6565m005k6334k4827o514M488Q234J8723
$$ -10498 -28276 -27991 -16993 -1892 17552 34117 30112 3778 -21049 -27563 -23075 -14841 3882
919C882K4627P877j8456k5351j5027l919K658J5052K4476J6615l906j9308k0626
$$ 3882 28509 36386 17930 -7421 -22448 -26367 -23709 -8657 15819 32434 28528 9220 -11406
932a1406j3706k258R592J8678K0074J1039p188k2873k1167p286L590J0059J9154
$$ -11406 -25112 -27370 -17778 900 20974 32013 24825 1952 -19215 -26501 -22911 -12852 6302
945F302K1852N425j7735k3996j3062l988K556J4650K4775J6318o366k1092j7869
$$ 6302 28154 33579 15844 -8152 -21214 -25202 -22646 -7996 16779 33097 26731 5639 -12230
958a2230j1357k515Q261K0563K1383O402j1080j9365j7607p578J852J2216K0205
$$ -12230 -23587 -26102 -17841 2722 24105 30507 19427 62 -17545 -25123 -23271 -11055 9150
971I150J8124K191j6451k0331j2649m143K689J5260K3766J4454p230k0172j6615
$$ 9150 27274 29465 13014 -7317 -19966 -24109 -21420 -6160 17606 32060 24830 4658 -11957
984a1957j0018m382Q399K2190K1761M354j3480j8355j4950q879J228J4539K2076
$$ -11957 -21975 -26357 -17958 4232 25993 30347 16867 -1488 -16438 -25317 -24089 -9550 12526
997A2526J5573j790j6101j7812j2477m576M738J7377K1424J0595q686j7822j4684
$$ 12526 28099 26309 10208 -7604 -20081 -24657 -19919 -2542 18882 29477 20791 2969 -11715
1010a1715r215l706R265K0925J9345K374j2834j6047j2753r435j19J5065K2390
$$ -11715 -20930 -24636 -15371 5554 24899 27273 14439 -1608 -14361 -23796 -23915 -8850 13540
1023A3540J3718l573j4339j5493j3041o588N356J9925K0983Q075r369j6677j4504
$$ 13540 27258 23685 9346 -6147 -19188 -25776 -20420 -495 20488 28563 19194 2517 -11987
1036a1987j0808k006J1161K2154J7318l00j3486j5094j2237q489J763J6343K1716
$$ -11987 -22795 -24801 -13640 8514 25832 25532 12046 -3048 -15285 -23774 -22011 -5668 16048
1049A6048J0163n895j3251j3838j1406o551P114J9192J8987M482q863j3097j3495
$$ 16048 26211 20316 7065 -6773 -18179 -24730 -17616 1576 20563 25045 16182 3085 -10410
1062a0410j1277l057J2709K1623J4631p78j1816j3316j3219j0009L027J7793K1257
$$ -10410 -21687 -24744 -12035 9588 24219 23441 11625 -1691 -14910 -24919 -21892 -4099 17158
1075A7158Q336o262j2664j3290j2599o258R661K1215J7052J322r895j2125j3036
$$ 17158 25494 19232 6568 -6722 -19321 -25579 -15918 5297 22349 23671 13776 1651 -11385
1088a1385j1129n17J4926K0168J0624k764j0135j1725j2982r038M241J8276J8291
$$ -11385 -22514 -23031 -8105 12063 22687 19923 9788 -1937 -14919 -23957 -19716 -1440 16851
1101A6851N548o184r644j1794j3525o336J0566K0862J3875M72p074r971j3833
$$ 16851 22399 16215 6571 -5223 -18748 -25084 -14518 6344 20219 20691 13617 3646 -10187
1114a0187j3469K16J6735J9728Q868k823p954j2243j5421r549P662J9574J6587
$$ -10187 -23656 -23440 -6705 13023 21891 19068 11114 -1129 -16550 -26099 -18437 1137 17724
1127A7724L893n634r573j3793j3906l336J3323K0520J1204j701o736r472j4546
$$ 17724 21617 15983 6410 -7383 -21289 -24625 -11302 9218 20422 18721 11985 2513 -12033
1140a2033j2392L230J8275J6530N628l079n285j2312j6434p269J0387J8639J2029
$$ -12033 -24425 -21195 -2920 13610 19238 16159 10874 -1438 -17872 -25141 -14754 3885 15914
1153A5914K780k801q883j5182j3793p22J4125J7436R224N8n631j0071j5799j1159
$$ 15914 18694 15893 7010 -8172 -21965 -22687 -8562 8874 18098 18156 12525 2454 -13345 -24504
1167b4504N127J8754J4752L589k255m505j3187j7821n112J3761J7905Q113J785
$$ -24504 -19377 -623 14129 17718 15463 10958 -2229 -20050 -25162 -11401 6504 14617 16402
1180A6402m08q976j7699j3026M326J4965J2910P032J716m454j2252j5659p682
$$ 16402 15994 7018 -10681 -23707 -19381 -4416 8494 15526 17242 12788 536 -15123 -22805
1193b2805O564J6384J2230M214j123m782j3774j7023m180J4189J6926O745K094
$$ -22805 -16241 143 12373 16587 15464 10682 -3092 -20115 -24295 -10106 6820 13565 15659
1206A5659J073r495j9746j2873P249J6626R960N728M112m354j6135j6327l060
$$ 15659 16732 7237 -12509 -25382 -18133 -1507 8453 14181 18293 13939 -2196 -18523 -21583
1219b1583R900J2959R708N326J08q064j4537j3307j270J2556J4623O226K456L26
$$ -21583 -11683 1276 10984 16310 16418 8354 -6183 -19490 -20760 -8204 6419 12645 15101 15427
1233A5427q732j9194j1706Q066J5908P967M235N932k218j8508j7660j96J1486
$$ 15427 6695 -12499 -24205 -16139 -231 7736 11971 17903 15685 -2823 -20483 -20679 -9193
1246i193J0088P360Q968J572j1908j7458r557K974J0410J1960Q768K698l070j1096
$$ -9193 895 8255 17223 18795 6887 -10571 -20128 -17154 -6744 5216 13984 16682 13612 2516
1260B516j5656q804P841J4398P901K849N038k065j7041j7128Q65J2970P617M525
$$ 2516 -13140 -21944 -14103 295 8196 11045 16083 14018 -3023 -20151 -19286 -6316 1301 5826
1274E826R577N156j3185j9946p235N411Q044Q477J1491O716o195j4878j4118n015
$$ 5826 15403 20559 7374 -12572 -19807 -14396 -6352 2125 13616 20332 14137 -741 -14859 -19874
1288a9874O425J2515J0165N385J690n649j5842j4926J675J3745Q516L199P217
$$ -19874 -13449 -934 9231 14616 16306 10657 -5185 -20111 -18436 -4691 3825 7024 14241
1301A4241M420j3053j9766m912R222O198L751J0350R884o166j7576j1476l94L951
$$ 14241 18661 5608 -14158 -19070 -9848 -3650 101 10451 20335 14169 -3407 -14883 -15277 -11326
1315a1326O844J0983J0198O53q986j4695j1554J59J0564J0618O121O485J445j2828
$$ -11326 -4482 6501 16699 17352 8366 -6329 -17883 -17724 -7160 3458 9579 16064 17509 4681
1329D681k0313m919J0852Q756K779Q817R873p247k0494j0058M957N472K064R637
$$ 4681 -15632 -20551 -9699 -943 1836 10653 20526 13279 -7215 -17273 -12316 -6844 -4780 4857
1343D857J2461j84j2658j2711n212l1M709R236R517O034j010j1675j5626o234
$$ 4857 17318 17134 4476 -8235 -13447 -13478 -8769 467 9984 16018 15008 3333 -12293 -18527
1357a8527P376Q847M729R139R001o937k1004j1467N837P075K298R043J3890o11
$$ -18527 -11151 -2304 2425 11564 20565 13628 -7376 -18843 -13006 -5931 -3633 5410 19300 18689
1371A8689j7511j3916K2L199J712P590J2874M678o721j2176q914l209L164O698
$$ 18689 1178 -12738 -12716 -9517 -7805 -215 12659 17337 10616 -1560 -10474 -13683 -10519 -3821
1385c821P402Q125N406o211j6422j0571L495O478K224Q158J4487Q31j7801j5112
$$ -3821 3581 11706 17112 10901 -5521 -16092 -12597 -6119 -3895 4263 18750 19581 1780 -13332
1399a3332M59M267k74P062J6254O758j2255j4611n515j52L06O217J1220Q943r09
$$ -13332 -12873 -8606 -8880 -1818 14436 21194 8939 -5672 -11187 -11339 -11033 -4816 6404 15347 14438
1414A4438r156j1996o598J752N120M497P567J0467k13j4557j3165O96M180j360
$$ 14438 5282 -6714 -13312 -11560 -6440 -1943 5624 16091 15878 1321 -11844 -11148 -6968 -8328
1428h328N468J6066P848j1929j5663l698J040k802M246J5037J1799m520j2298
$$ -8328 -2860 13206 21054 9125 -6538 -10236 -9196 -11998 -7752 7285 19084 14564 2266
1441B266r373m322j005L548R184J0233N425m344j2406j0278m52L841J617O103
$$ 2266 -7107 -11429 -12434 -8886 298 10531 15956 11612 -794 -11072 -11524 -7683 -6066 37
1455C7J2459N620j1276j4005k330K502l161J533J4922J2449n028j3540o155j787
$$ 37 12496 18116 6840 -7165 -9495 -6993 -10154 -8621 6301 18750 13722 182 -5973 -7760
1469g760l861k46J1496J3392L247p227r742p874l258O50N208R518J0632K459j1289
$$ -7760 -11621 -11867 -371 13021 16268 9041 -701 -8575 -11833 -11183 -5975 3543 14175 16634 5345
1484E345j2632k818K063q34L187J3108J0915o615j3748m619Q94m166j777J1021
$$ 5345 -7287 -10105 -8042 -8876 -5689 7419 18334 11719 -2029 -6648 -5754 -9920 -11697 -676
1498f76J4653J276r455p628l567m240l577O399J2273Q973m82q849r462m998j230
$$ -676 13977 15253 5798 -1830 -5397 -9637 -13214 -6815 5458 14431 13949 5100 -4362 -9360 -10590
1513a0590M34O259J2968Q555o365j2909o210M07k645k93J1877J3927r9j2341p078
$$ -10590 -10156 -3897 9071 17626 11261 -1648 -7858 -7451 -10096 -10389 1488 15415 15316 2975 -4103
1528d103q52l449m381O728J4242O489n112p715m613m007m669J661Q281J1619M431
$$ -4103 -4955 -8404 -12785 -6057 8185 14674 9562 1847 -2766 -6773 -11442 -9781 -1500 10119 14550
1543A4550n532r946m521k047l388R24J1757J3625r72j1337o514j062m271m761
$$ 14550 9018 -928 -5449 -7496 -10884 -9960 1797 15422 14450 3113 -3401 -4463 -8734 -13495
1557a3495P478J5995N752p581p932k297m204o358J734J1902J0886R36o559o196
$$ -13495 -6017 9978 15730 8149 217 -2080 -6284 -12642 -10908 994 11880 12816 6257 61
1571F1m216m498l214M116J1999R553j929q973n424k025m978l478Q155J5324M627
$$ 61 -4155 -8653 -11867 -7751 4248 13801 11872 2899 -2525 -4550 -9528 -13006 -4851 10473 15100
1586A5100p932p575j206m394p532J998J4276J0663j970p415m051l134o292l520
$$ 15100 7168 -407 -1613 -6007 -13539 -11541 2735 13398 11428 4013 -38 -3172 -9464 -12984
1600a2984P438J2414O306l861o755l871l720n511j092R590J2724K131o860n575
$$ -12984 -5546 6868 13174 9313 2558 -1313 -5033 -10544 -11636 -2046 10678 12809 5949 374
1614C74j483m873o891L022J3403R726l459o700k102l014q658k959R061J3050L505
$$ 374 -1109 -5982 -12873 -9851 3552 13278 9819 3119 1017 -1997 -10655 -13614 -4553 8497 12002
1629A2002m634m530k606n704o968J791J0995J0323K44n581l693k903o284n401
$$ 12002 7368 2838 232 -5472 -12440 -10649 346 10669 10913 5332 1639 -1264 -7548 -12949
1643a2949M917J3025O974l877n149j409l825r126k092J0524J2223J410m798k436
$$ -12949 -8032 4993 11967 8090 2941 1532 -2293 -11419 -13511 -2987 9236 10646 5848 3412
1657C412k224p569p284L800J2119Q126j507m125j815m476q260l327P529J1916
$$ 3412 1188 -6381 -13665 -9865 2254 10380 8873 4748 2933 -1543 -9803 -13130 -5601 6315
1671F315M410l253l874j534o108q326N99J1165J0026K0m407j801k443q534n987
$$ 6315 10725 7472 3598 2064 -4044 -12370 -11771 -606 9420 9440 5033 3232 789 -7745 -13732
1686a3732O172J1810N576k763k712p79n459q920j432R260R883J942l105j217k227
$$ -13732 -7560 4250 9826 7063 4351 3572 -1887 -10807 -12239 -2979 6904 8846 5741 4524 2297
1701B297p531p039K028J0777Q101q51k574p24l972r320m571P296J0620L993k051
$$ 2297 -5234 -12273 -10245 532 8633 7782 5208 4484 512 -8808 -13379 -6083 4537 8530 6479
1716F479j143q90p119r114J44J0107Q585M87j889n74l019q653o203M738J0403
$$ 6479 5336 4446 -2673 -11787 -11643 -1536 7049 7536 5647 5073 2054 -6599 -12802 -8064 2339
1731B339N423j232j290m80n315r150k594Q008R268K133j446j80j625p801q051
$$ 2339 7762 6530 5240 4760 -555 -9705 -12299 -4291 4977 7110 5664 5484 3859 -3942 -11993
1746a1993J820R925O751n94k71M12m210r245n130N605R726L734r57L28K9p674
$$ -11993 -10173 -248 6503 5909 5638 6050 1840 -7405 -12535 -6930 2796 6530 5573 5901 5930 -1744
1762a744r089o74Q754P910J297r14P78k310r161p362L855R631N120n42Q8R90n581
$$ -1744 -10833 -11507 -2753 5157 6454 5540 6318 4008 -5153 -12515 -8660 971 6091 5549 5637 6627 1046
1779A046j0136l263P828Q368J669k28J542j405q195q508J639Q805N858K5P41J160
$$ 1046 -9090 -12353 -4525 3843 5512 5284 6826 5421 -2774 -11282 -9643 -838 5020 5045 5786 6946
1795F946l748r566n881N016Q951L348k41J436O67o533j0419j220Q214O732Q60
$$ 6946 3198 -6368 -12249 -7233 1718 5066 4825 6261 6928 395 -10024 -11244 -3030 3702 4562
1810D562M96K557k283r973p110L458Q726L550K32J955J396n701r877l226N983
$$ 4562 5058 7615 5332 -4641 -11751 -8293 433 3983 4215 6170 7566 1865 -8012 -11238 -5255
1825e255P338J747O67K416o01p598q921K14P969N039K42J302L593l058j0791o100
$$ -5255 2083 3830 4497 6913 6312 -1286 -10207 -9993 -2024 3015 3257 4559 8152 5094 -5697 -11797
1841a1797N181P575J791M85L565J625p871r928o37O813M994M97K585L468k601
$$ -11797 -6616 959 2750 3235 6800 8425 554 -9374 -10011 -3198 1796 2293 4878 8346 5745
1856E745q941o677J661O585M157K70L115K541m568j0531m361N491O581P00J144
$$ 5745 -3196 -9873 -8212 -1627 2530 2800 5915 8456 3888 -6643 -11004 -5513 1068 1768 2912
1871B912M772Q21r422r077R60O906K954Q23L914L872m580r997m636L660N418J847
$$ 2912 7684 8505 -917 -9994 -9034 -2128 826 1649 5563 9435 4855 -5142 -9778 -6118 -700 1147
1887A147K004M123N89o228q511k613M977N300Q83J595M528q49q432q390K410O382
$$ 1147 3151 7274 7863 1635 -6876 -9489 -4512 788 1671 3266 7794 6945 -1487 -9877 -7467 -1085
1903a085J689L0N173M002n906j0226l178N143L427K08L618N572n34q583o961K05
$$ -1085 604 634 5807 9809 3903 -6323 -9501 -4358 -931 -723 2895 8467 7933 -650 -7611 -7406
1919g406L652L367J769M055K967k662q778n763J889O009J171P33N324L010o756
$$ -7406 -3754 -387 1382 5437 8404 5742 -3036 -8799 -6910 -901 270 1003 6327 9337 2581
1934B581r828j370N832K111o37M317O200j775r545n495J918K931N66K770N423
$$ 2581 -7247 -8617 -2785 -674 -1311 3006 9206 7431 -2114 -7609 -5691 -2760 -2194 576 5999
1949E999L099m954p981l735J736L760J877K851M411J644o811r135q70M849K722
$$ 5999 9098 4144 -3837 -7572 -5836 -2076 -199 2652 7063 8707 1896 -7239 -8109 -3260 -538
1964e38k21M734N895k922j0375m940M060K840j087K633O994J459o846o434j311
$$ -538 -759 3975 9870 6948 -3427 -8367 -4307 -1467 -2554 79 7073 8532 1686 -4748 -6059
1979f059J773J218K014M153M811q04o345o755o82L235J792J293M812N067l402
$$ -6059 -4286 -3068 -1054 3099 7910 7106 761 -5994 -6676 -3441 -1649 -356 4456 9523 6121
1994F121r869m707L934L354j561L150Q013P90q430p226J207K129k56J700N887
$$ 6121 -3748 -8455 -4521 -1167 -2728 422 8435 9225 795 -6431 -5224 -3095 -3351 -1651 4236
2009D236M245l268o602l793M63J341J086K903M713K590l244p638l502K058K303
$$ 4236 8481 5213 -1389 -5182 -4719 -3378 -2292 611 5324 7914 4670 -2968 -6470 -4412 -2109
2024b109m22L348P402J182q614p191J529K720j807J640Q014M338n456p871j496
$$ -2109 -2531 817 8219 9401 787 -6404 -4875 -2155 -3962 -2322 5692 10030 4574 -3297 -4793
2039d793R45m39Q59M897N353L36n159n433j591J020J211Q55L759N719Rp498n807
$$ -4793 -3848 -4287 -3428 1469 6822 7158 1999 -3434 -5025 -4005 -2794 -1939 1820 7539 7548 50 -5757
2056e757J490K209k145J461Q148M800o307p454p61K028k245k91O697O721j494
$$ -5757 -4267 -2058 -4203 -2742 5406 10206 3899 -3555 -4316 -2288 -4533 -4824 1873 8594 7100
2071G100o363m032m18j133K23L511N332L470k267o342m270P95J688n15K399O173
$$ 7100 737 -3295 -3713 -4846 -4623 -1112 4220 7690 5423 -919 -5189 -4394 -2706 -3221 -822 5351
2087E351L090n542o814p3K284k148p79O394P230k544p411j676R06k449j443M366
$$ 5351 8441 2899 -3915 -3988 -1704 -3852 -4631 1763 8993 6449 -962 -2638 -1732 -4181 -5624 -1258
2103a258P002J820l841m483k326j078m01J029M164N321J495n151n745q19J813
$$ -1258 5744 7564 3723 -760 -3086 -4164 -4565 -3536 628 5949 7444 2293 -3452 -4271 -2458
2118b458j368K84O394N922l199p248j243J504k044k832N318P638M99n255l378
$$ -2458 -3826 -3542 2852 8774 5575 -1673 -2916 -1412 -3456 -6288 -970 6668 7167 1912 -1466
2133a466l4j807k846K048O311M360r39m074l292j785m43o68K102O031M557l086
$$ -1466 -1500 -3307 -6153 -4105 2206 6566 5627 1553 -1739 -3524 -3967 -4635 -2533 3498 8055 4969
2149D969n849k271Q05j503k082N290Q038k62o383k969J118j451l755K225P663
$$ 4969 -880 -3151 -2346 -3849 -5931 -641 7397 7135 752 -2217 -1099 -2550 -6305 -4080 3583
2164C583L360l038l185r80j895k671o5L969M966K293k411l981k168o39j758o86
$$ 3583 6943 3905 720 -260 -2155 -4826 -4891 -922 4044 6337 3926 -55 -2223 -2862 -4620 -5306
2180e306N392O750K2n556l110P03k059l229K800Q161K856m356l808M18j305l790
$$ -5306 86 6836 6858 1302 -1808 -1105 -3164 -6393 -3593 4568 7424 3068 -740 -322 -1627 -5417
2196e417R5N619N141m88k947j563j489k036k070J530N099L756Ll721k577l41k098
$$ -5417 -5322 297 5438 4950 2003 440 -1049 -3085 -5155 -3625 1474 5230 5233 1512 -1065 -1406 -3504
2213c504k579K746P690K689l753l616K33j583m133J21O796N196j617l330p35j347
$$ -3504 -6083 -3337 4353 7042 3289 -327 -94 -1677 -5810 -5689 1107 6303 4686 1356 621 -726
2229g26l377j964L594N685J934j305k486j771j479k391o52L221N846J453k949
$$ -726 -4103 -6067 -2473 3212 5146 3841 1355 -416 -1895 -4286 -4938 -1717 4129 5582 2633
2244B633k724oj524m204Q16O216M580k016k896j05l73m928k039M649N606J248
$$ 2633 -91 -97 -1621 -5825 -5009 1207 5787 3771 875 770 397 -4531 -6570 -1921 3685 4933
2260D933j896j237q95l389l025N98M987M348J74j796k027j126k571k297J482N688
$$ 4933 3037 1800 905 -2484 -5509 -4911 76 4424 4598 2802 775 -351 -2922 -5219 -3737 1951
2276A951L407j719k467o35q64m237j828M693N702N77k727k85l07l645l478J277
$$ 1951 5358 3639 1172 537 -327 -4564 -6392 -1699 4003 4580 1853 1568 1261 -2384 -5862 -4585
2292d585N356L537r96j083j26k300l970j753L005N095K399j381j549m80k064l848
$$ -4585 771 4308 3312 2229 2103 -197 -4167 -5920 -2915 2180 4579 3198 1649 1169 -895 -4743
2308d743n92M523M737J43k153n07l13l601l614K531N144K437q87r38J5k390m619
$$ -4743 -5335 -812 3925 4068 1915 1408 1095 -2506 -6120 -3589 1555 3992 3105 2167 2182 -208 -4827
2325d827p70L766M467J109j057j60j291l198l231N29M630L320J15j217p3j380
$$ -4827 -5597 -1831 2636 3745 2688 2528 1237 -1961 -5192 -4663 -33 3287 3402 2185 2112 732
2341G32m237k591L186M838J695j364j78J35k948m533j70M095M241K62j008L5q65
$$ 732 -3505 -6096 -2910 1928 3623 2259 2081 2216 -732 -5265 -5435 -1340 2901 3163 2155 2190 1325
2358A325m126k823J846M507K264l04j91J28k395m121j376L115M216J067r34L15
$$ 1325 -2801 -5624 -3778 729 2993 2689 2498 2626 231 -3890 -5266 -2151 2065 3132 2198 2513
2374B513k00l519l954M71M244L096O1m00P24j374m907k517K599M013J585m69Q67
$$ 2513 2313 -1206 -5160 -4689 -445 2651 2712 2312 3036 1662 -3245 -5762 -3163 850 2435 1966 2833
2391B833k07k773m274n98L825K851O79j26R13j056l848l380R61M063K290k9M83
$$ 2833 2626 -147 -4421 -5019 -1194 1657 2336 2210 3123 2067 -1781 -5161 -4200 -137 2153 2124 2607
2408B607M71k401m604j183K910L398Q94k5J169n93l593l691M82L246K607J88R61
$$ 2607 3078 677 -3927 -5110 -2200 1198 2092 2067 3236 2643 -950 -4641 -4159 -913 1694 1882 2843
2425B843M22j748l919k697J778L800J362K96P22L26k782m181j115L154K834N02
$$ 2843 3265 1517 -2402 -5099 -3321 479 1841 2137 2859 3185 403 -3778 -4893 -1739 1095 1597
2441A597O76J252o52m606k903J100K843J692N01J383O05k308m470j290K201K573
$$ 1597 2273 3525 2873 -1733 -4636 -3536 -693 999 1500 2883 3488 1180 -3290 -4580 -2379 194
2457A94R26Q96J518p74l245l795K90K630K312N76J162J006j393m326k448J162
$$ 194 1120 2016 3534 2760 -485 -4280 -3990 -1360 952 1528 2690 3696 2303 -2023 -4471 -3309
2473c309K902J184P96J452O83l164m366k69K162J976Q56J505J481j295l486l059
$$ -3309 -407 777 1573 3025 3708 544 -3822 -4091 -1929 47 903 2408 3889 2594 -892 -3951
2489c951O47K416J452Q16J527Q67k169m000j805J386K372J086Q29K041rl350m088
$$ -3951 -3304 -888 564 1380 2907 3774 1605 -2395 -4200 -2814 -442 644 1473 3514 3505 155 -3933
2506c933J47K328J205R33J872J419j946l659k213J080J622J230J542J621L13k869
$$ -3933 -3786 -1458 -253 680 2552 3971 2025 -1634 -3847 -2767 -1145 85 1627 3248 3561 692
2522F92l316j189J784J741Q15J323J821l57l762l258N7K087J358O43K150J812
$$ 692 -2624 -3813 -2029 -288 527 1850 3671 3314 -448 -3706 -3649 -1562 -204 439 2589 4401
2538D401k562l909j515J429J066P86J774K421k76l420k943n21R12J386J517J688
$$ 4401 1839 -2070 -3585 -2156 -1090 -304 1470 3891 3615 195 -2748 -3269 -2357 -971 546 2234
2554B234J252j069l144k716P5J798R35J513J894R67k002l851j094J231R19M58
$$ 2234 3486 2417 -727 -3443 -3368 -1570 -635 878 2772 3739 1737 -2114 -3208 -1977 -1058 -600
2570f00K223K504p84l700k594N76O34M41J864K363J063j962l084j766K07O67J538
$$ -600 1623 4127 3343 -357 -2951 -2375 -1741 -1300 564 2927 3990 2028 -1056 -2822 -2615 -1948 -410
2587d10J587K044M73k798l488p55J327R41N97J984K185o32m069k078R21P27p2
$$ -410 1177 3221 3694 896 -2592 -3347 -2020 -1079 -482 1502 3687 3055 -1014 -3092 -2171 -1444 -1516
2604a516J866K889K82k404k600n76J84j75J121K507J777o13k219k333r89M56J232
$$ -1516 350 3239 3521 1117 -1483 -2059 -1875 -2050 -929 1578 3355 2742 523 -1810 -2799 -2343 -1111
2621a111J058K154J594o44l797k106N48R96n0J659L330N34l147l183L64J9m92
$$ -1111 -53 2101 3695 3051 -746 -2852 -2304 -1308 -1358 301 3631 4165 1018 -2165 -1801 -1782 -2274
2638b274J420L161J330j350k418r62r67n65J172J942K006O35j070k719j638l22
$$ -2274 -854 2307 3637 2287 -131 -1093 -2060 -2625 -1453 489 2495 3130 2060 -659 -2297 -2619
2654b619R12M78J902K708L51k958k961k08P38q74J399L685J659k327l064j82m70
$$ -2619 -1707 -1229 673 3381 3732 774 -2187 -2395 -1657 -2531 -1132 2553 4212 1885 -1179 -1361 -1831
2671a831r77R44K919K369o87j844j538j295o55J45J982J619J731Jk267k329l10
$$ -1831 -2808 -1864 1055 3424 2737 893 -645 -1940 -2595 -2450 -468 1151 2882 2883 616 -1713 -2023
2688b023K84l60J181L045J921j707l388l83l06r29K81L637K479j289j981q40q90
$$ -2023 -1739 -2099 -918 2127 4048 2341 -1047 -1430 -1736 -2665 -2384 1253 3732 2443 462 -378 -1268
2705a268j552J21K582K230O35m70j715j730j174J04Q75J022K332R57j340k117
$$ -1268 -2820 -2699 -117 2113 2748 2278 563 -1167 -2341 -2237 -1362 -340 1992 2949 1609 -508
2721e08o25k43j157L1L522K420p76k492l15o35j846o61K952L276m06r80q52j205
$$ -508 -1133 -1376 -2533 -2502 1020 3440 2664 172 -143 -778 -2624 -3285 -333 2943 2537 1557 705 -500
2739e00k081n27J580K302J320P26j174j943j467n75K82Q79K215K301q76k213j308
$$ -500 -2581 -3108 -1528 774 2094 2820 1646 -297 -1764 -2339 -2057 -1178 1037 3338 2462 249 -1059
2756a059L97j455r04K213L889k17j890l17l98k523j404K023K965R30k86o6j153
$$ -1059 -662 -2117 -3021 -808 3081 2864 974 657 259 -2264 -3668 -1645 1320 2250 1964 1898 745
2773G45k264j432P57J535J645J593p5j531j969o69l87jK102K410L69k009r37R7
$$ 745 -1519 -2951 -2194 -659 986 2579 2504 973 -996 -1665 -2052 -2053 49 2459 2828 819 -118 -21
2791b1j731j276J478L113J430j699k1k88k202j807N44K780R36N17K28j13k551
$$ -21 -1752 -3028 -1550 1563 2993 1294 1273 985 -1217 -3024 -2480 300 1236 1753 1981 1868 -683
2808f83j694j20Q30J497K429O51j271j452r03j192j158J430L439R05j164o06n50
$$ -683 -2377 -2497 -1667 -170 2259 2910 1639 187 -716 -1908 -3066 -1636 1803 2708 1544 938 388
2825C88j474k153Q26K911J239J34n12M6j614k290l7J605J124J067J018k01j766
$$ 388 -1086 -3239 -2413 498 1737 1871 1359 1405 -209 -2499 -2536 -931 193 1260 2278 2077 311
2842C11j448j075l9J032K061J701n21j300k33j918j767O51K814J877o19k56o8
$$ 311 -1137 -2212 -2251 -1219 842 2543 2022 722 489 -1429 -3196 -2545 269 2146 1527 1271 1203
2859A203j481k537j3J950J958K84L74l6j335j856j121P89J218J331J166L75j252
$$ 1203 -278 -2815 -2828 -878 1080 1364 1738 1702 367 -1489 -2610 -1821 -603 728 1894 2269 1017
2876A017j260j070j289M33K109K088j88j022L21j328k509m42K416J943J52J36
$$ 1017 -243 -1313 -2602 -2169 -60 2028 1840 818 1139 -189 -2698 -3140 -724 1219 1371 1507
2892A507L26j253k346j055J311J812N99J96J392o85k335j481j77P54J546J151
$$ 1507 1833 580 -1766 -2821 -1510 302 901 1097 2489 1804 -531 -2012 -2189 -1435 111 1262
2908A262J017p02n75j318k064P6J306K245P4NM86q94k838j080J871J491K24O34
$$ 1262 2279 1577 1002 -316 -2380 -2304 -998 1247 1321 1326 1812 918 -1920 -3000 -1129 362 586 1220
2926A220R23j30k383k334L73J270J060R75J335l15j609j763j051O75J212J229
$$ 1220 2143 2013 -370 -2704 -2331 -1061 -1 974 2309 1994 385 -1378 -2429 -1754 -542 687
2942F87P49L50j85q66k432j086J344J770O25L54J015n23k161k191J75K004K03
$$ 687 1436 1786 1601 735 -1697 -2783 -1439 331 956 1310 2325 1802 -359 -2550 -2375 -371 -168
2959a68J169R79N20j998k182o25Q20Q63J156P59R35p14j810j889J2R23J198R75
$$ -168 1001 1980 2500 502 -1680 -2305 -1485 -622 534 1293 2228 1514 -296 -2185 -2173 -1250 -52 923
2977I23N71P73p82k042j660K44J745K79O70J026L46j639k242j56N95J013L97J508
$$ 923 1494 2267 1485 -557 -2217 -1973 -228 51 721 1747 2093 454 -1788 -1944 -1349 -336 61 1569
2995A569P73m43k304j456J65N74N86J154J277K64j079k196q36N44R42P29P84R63
$$ 1569 2342 1899 -405 -1861 -1696 -1122 -536 618 1895 2159 1080 -1116 -1952 -1408 -466 263 1047 2010
3013B010m13j581j813n52J355K97R25J310P32m26k810j003M09P25O92R16J403
$$ 2010 1597 16 -1797 -2349 -994 -697 228 1538 2270 1844 -966 -1969 -1560 -835 -143 773 2176
3030B176K01j821j906m30L90P78Q22Q11J436n53k152j754k2P08O22J031J491M62
$$ 2176 2377 556 -1350 -1780 -1390 -612 210 1021 2457 1904 -248 -2002 -2024 -1316 -694 337 1828 2290
3048B290r57k072q57K7P11L17J187J275J43k003j522n57Q73K87N83J712J001q83
$$ 2290 1333 -739 -1596 -1569 -858 -541 646 1921 2064 61 -1461 -2018 -1145 -858 -275 1437 2438 1555
3066A555j811j214k01L98Q58J011J414J64j567j643p40L86K05J86J845J698p67
$$ 1555 -256 -1470 -1671 -1273 -415 596 2010 2174 607 -1036 -1776 -1390 -1185 -999 846 2544 1777
3083A777k002j039j70J44l2J169J989K10o19k105o53K18q2J77J656J326N9j407
$$ 1777 -225 -1264 -1434 -1290 -1322 -153 1836 2046 1427 -678 -1331 -1113 -1195 -1018 638 1964 2023 616
3101F16j838j24L35j61P19J522J425q90k094q08K52j47J7J091K067P17k130j713
$$ 616 -1222 -1346 -1011 -1172 -453 1069 2494 1604 -490 -1298 -1046 -1193 -1176 -85 1982 2699 569 -1144
3119a144m9J97m09L35J763J595n8k204r36k58L8n6M92K331Q13j195j629o51j69
$$ -1144 -1193 -996 -1405 -1070 693 2288 2230 26 -910 -1168 -1130 -1186 -694 1637 2450 1255 -374 -1025 -1194
3138a194l47L31J413K021J8j774j557K44o5q25O32K016J861j247j813r19L49l16
$$ -1194 -1541 -1210 203 2224 2242 468 -1089 -845 -910 -1735 -1103 913 2774 1527 -286 -1205 -856 -1172
3156a172n35J690J843K10j039j355n32k84l14J49J880J918n92j799q03k7m62m43
$$ -1172 -1707 -17 1826 2036 997 -358 -890 -1174 -1488 -1339 541 2459 1867 68 -735 -762 -1224 -1667
3174a667P86K426P12j150j219q40j69n20K8J498K160j10j274j154j20p60m84Q41
$$ -1667 -881 1545 2257 1107 -112 -952 -1121 -1641 -1613 -115 2045 1935 661 -493 -613 -1373 -1857 -1016
3192a016K107J076o84j361n53l70n85j1O65K306P62j312j096k10n04j088K06J838
$$ -1016 1091 2167 1483 122 -431 -801 -1386 -1397 -732 1574 2336 1024 -72 -282 -786 -1874 -1668 170
3210A70J840k00j356n90M0j394p42J090K726M89o80j249n77n35n83K7J147K007
$$ 170 2010 1810 454 -136 -96 -1490 -2232 -1142 1584 2073 1393 144 -433 -968 -1551 -1524 -377 1630
3228A630M10r78j241k59l02q93K18J943K020j077j486j37j49j058p21J298K251
$$ 1630 2040 1062 -179 -438 -740 -1633 -1415 528 2548 1471 -15 -152 -301 -1359 -2080 -782 1469
3245A469O40j478m81K3j098j156L23K071J532l49o56p48o56m15q63N19J699J549
$$ 1469 2109 631 150 173 -925 -2081 -1758 313 1845 1496 840 92 -564 -979 -1842 -1323 376 1925
3263A925p72j168J01k64j156r26J811J990K59j335k24N0j015j422O34K684O23
$$ 1925 1153 -15 86 -178 -1334 -2260 -449 1541 1800 465 241 291 -724 -2146 -1512 1172 1795
3280A795j072k5q1j066j273j36J292J607M95m13m99l72j095o15k26J395J709M11
$$ 1795 723 698 617 -449 -1722 -1858 -566 1041 1536 1123 624 252 -843 -1458 -1684 -289 1420 1831
3298A831j445n74L94j241j245Q51K705N01q42m90Ol65k050o0J935J415K0q05K13
$$ 1831 386 -188 206 -1035 -2280 -1429 1276 1777 935 445 451 86 -1964 -2024 -89 1326 1346 541 754
3317G54o04j176r07M80J573J195L85j223j26k32j004j246R60K338P65j446r0O44
$$ 754 150 -1026 -1933 -1453 120 1315 1700 477 351 119 -885 -2131 -1171 1167 1932 486 396 1040
3335A040r58k485K99K237J696r87k20K34l60k082o85J496J443L15J71n11rj082
$$ 1040 82 -2403 -2104 133 1829 842 622 856 496 -1586 -2271 -775 668 983 1154 643 634 -448
3353d48j056l74J098J987N96j078l77J70q07j888J72K418J306j134j44P34m75
$$ -448 -1504 -1878 -780 1207 1803 725 348 518 -289 -2177 -2005 413 1719 585 441 1175 700
3370G00k251j035J869J870j15n05M10o8j242j518M96J129R77P06l50l29n8j320
$$ 700 -1551 -2586 -717 1153 1038 533 943 875 -367 -1885 -1389 -260 717 1423 1073 744 686 -634
3388f34j303K88J595J641p48r60J119l96k454m55J587J951m11n42Q38J53j889
$$ -634 -1937 -1649 -54 1587 839 -121 998 602 -1852 -2307 -720 1231 820 278 1116 1269 -620
3405f20j729J141J582K92n0N71j19m31j848n18Q38J109P31K39n49K28n14j790
$$ -620 -2349 -1208 374 666 616 1187 1068 637 -1211 -1729 -891 218 949 1188 639 867 353 -1437
3423a437o61J956J546n74p21R51M43k281k002J490J941M93r00O11Q19j617k087
$$ -1437 -2098 -142 1404 830 109 1060 1503 -778 -2780 -1290 651 1144 244 855 1674 57 -2030
3440b030K35J548P30j30K37N24j79j274j375J43J327J140j04l43L9K45j573j363
$$ -2030 -1795 -247 483 353 590 1114 935 -339 -1714 -1571 -244 896 792 449 488 733 -840 -2203
3458b203R45J798M46j125R05R44j680k002K29J935L59l72M72J035p67k158o44
$$ -2203 -1258 540 986 -139 766 1710 30 -1972 -1743 192 551 179 651 1686 919 -1239 -1883
3475a883R69R57M14L77JK80o33j573r05J066J641j91k06P87L52j408k383P41J740
$$ -1883 -914 43 457 834 835 1115 482 -1091 -1996 -930 711 520 314 1101 1453 45 -2338 -1597 143
3494A43O26p06M82J089l66k700n26J539O31j00K58J065Q8j617j548M11Q13M76
$$ 143 769 63 545 1634 1268 -1432 -1958 -419 212 112 370 1435 1523 -94 -1642 -1231 -418 58
3512E8L79M20J95J28j413j582N15J601J09k10J40J388o42k123q19J316R73m22
$$ 58 437 857 1052 1180 -233 -1815 -1300 301 410 200 340 1728 1086 -1037 -1856 -540 433 11
3530A1Q6J405j78j578j050K37J056k18K97R76L56o25j541o51N23O45O40K51L34
$$ 11 97 1502 1324 -254 -1304 -1067 -11 -229 68 1044 1400 775 -766 -1417 -894 -249 391 642 976
3549I76M16q25j940m38J263P54k84J70J737k4k028j466O06J326m93Q2J564J07
$$ 976 1392 567 -1373 -1811 -548 206 -78 92 1829 1805 -223 -1689 -1083 243 -250 -168 1396 1503
3567A503j266r72p73P29O23K32L19Q06J36j264j197o2P34O10j22N29R18j29j710
$$ 1503 237 -735 -1508 -779 -156 76 395 1201 1337 73 -1124 -1186 -452 158 36 565 1483 1354 -356
3586c56j479J123P35K1k27J168J031j781j708P4J060j76N4J013N41j38j350j033
$$ -356 -1835 -712 23 44 -183 985 2016 235 -1473 -1399 -339 -515 -461 552 1093 955 -395 -1428
3604a428L77N44K65j23J170P75n75j771q52Q39N62M2R1J422N63j876j328J83J089
$$ -1428 -1051 -507 -242 -365 805 1580 1005 -766 -1618 -779 -217 -175 -84 1338 1901 25 -1303 -1120 -31
3623c1k55J38P27J268q22j535o90O58M79l79K98J308M68j423j149j52Q79r5P8
$$ -31 -286 -148 579 1847 1025 -510 -1200 -542 -63 -442 -144 1164 1632 209 -940 -1092 -213 -308 -230
3642b30N70J495l95j883q53N48M13l9n2J167R31n79j915o04J117p1l23P47J438
$$ -230 340 1835 1440 -443 -1296 -748 -335 -374 -426 741 1672 1093 -822 -1426 -309 -380 -703 44 1482
3661A482j73j384j045L94M68Q9o2R34Q82n83j383n51J71K92p9k5J592K81p94j206
$$ 1482 1309 -75 -1120 -726 -258 -169 -231 703 1585 1002 -381 -932 -761 -469 -548 -573 1019 1300 506 -700
3681g00j45R80m33k26O09J389j47j760q30P36L32o33K95J293R92j054j443o2K60
$$ -700 -845 135 -298 -524 85 1474 1327 -433 -1263 -527 -195 -828 -533 760 1752 698 -745 -807 -547
3700e47O4j62P58J036L43j274q61j31P31n73J10R20J371r47j366m22P58l44J8
$$ -547 -483 -645 113 1149 1492 218 -643 -774 -43 -616 -506 414 1785 838 -528 -950 -192 -536 -518
3719e18J98J640N95j416j340J58L92k52j52J074J123k36j118q46K74J21n12J39
$$ -518 -320 1320 1915 499 -841 -683 -291 -543 -695 379 1502 1266 148 -698 -424 -303 -815 -676
3737f76J460P14p22j367q0M02l31m31Q14J378L64j485n88L40j79m67l5J121J021
$$ -676 784 1498 776 -591 -671 -269 -600 -1031 -217 1161 1525 40 -548 -208 -387 -854 -889 232 1253
3756A253j21j233n92K39J16n61M95J385N56q37j498L11L29m94l38Q76J865m78
$$ 1253 1132 -101 -693 -454 -338 -899 -404 981 1537 700 -798 -487 -158 -652 -990 -114 1751 1273
3774A273j483m70p4J44k19j73J624Q66p22j260J14L41n12m71Q30J298K10j134
$$ 1273 -210 -680 -754 -610 -829 -1002 622 1488 766 -494 -380 -39 -551 -1022 -192 1106 1316 182
3792A82r53M34k21k37P7P56J179j30j273l24O54p15m42L48J542L32n85r28L3J0
$$ 182 -771 -337 -558 -795 -718 38 1217 1087 -186 -510 144 -571 -1013 -665 877 1209 624 -304 -271 -261
3812b61q92n6J310J292l82q67k97J41m50p35N05J343N12o63m53k99p5m27j69Q22
$$ -261 -1153 -1209 101 1393 1011 144 -153 -12 -462 -1197 -692 651 1163 500 47 -252 -327 -754 -923 -101
3832a01J229O2j031p90N61k45r26K74J307J129m76j295J07M77p96o01K39J708
$$ -101 1128 1190 159 -631 -70 -315 -1241 -967 340 1469 993 -302 -195 282 -514 -1115 -876 832
3850H32M5p06k65q7p9r26L84O11J507m60q58k80J79j11p32J3J405O28l41p22p0
$$ 832 877 171 -94 -181 -260 -1186 -802 -191 1316 856 -2 -282 -103 -214 -946 -933 472 1100 759 37 -33
3871c3J49o98m59M25J741q9r67j42K35m91j153O84J075J118p18o59k66K24k08
$$ -33 116 -582 -1041 -616 1125 1036 69 -73 162 -329 -1482 -798 277 1395 677 18 -248 -24 -232
3890b32q14L69J093O17o54m15J34k85o33k99P79J313J58r40k54J95o11o05J49
$$ -232 -1046 -677 416 1033 379 -36 98 -187 -820 -1119 -340 973 1131 191 -63 132 -479 -1084 -935
3909i35J421N06m30n55O0L2r19l57R54Q77K38m34k11j42l20q94OQ59J205o3p25
$$ -935 486 992 562 7 67 99 -820 -1177 -223 654 892 458 247 105 -215 -1109 -1103 -244 961 898 173
3930A73p1K95p66r32M24J677K6o70j79N19n74j095K37P66Q99l21l3RJ38j153M6
$$ 173 102 397 -369 -1301 -877 800 826 156 -23 496 -78 -1173 -936 -170 729 408 375 384 522 -631 -585
3951e85k49J111O19n52n00J17K86q09l49M32J125M22r66J83K43o31j000m4J547
$$ -585 -834 277 896 344 -156 -39 247 -562 -911 -479 646 1068 102 285 528 -103 -1103 -1147 400
3970D00M60q03J95K51p3j225k54O82P44L07j77j68m9l98p33l30P47J140l10l08
$$ 400 860 57 252 503 430 -795 -1049 -367 377 684 507 339 290 -108 -841 -1171 -424 716 406 98
3990I8j53J77l85m44l80J302O02n28j77L47M6j304k44Q49J119o15r0K67j98o36
$$ 98 -55 122 -263 -707 -1087 215 817 289 112 459 505 -799 -1043 -194 925 310 220 487 289 -347
4010c47q36K15J241K59m0J72j44n08l24p00L89R05N46k68n29M70n35j028J29R62
$$ -347 -1183 -968 273 532 492 664 520 12 -312 -1012 -623 282 828 560 31 501 -34 -1062 -933 29
4030B9O73j79l80O30q0r72j128P81Q06K9p0L57J1m61p99j73P92L92K71Jl76J4
$$ 29 702 523 143 773 693 -279 -1407 -626 180 209 139 496 507 46 -753 -926 -134 258 529 530 154 168
4052A68l16o82j33Q45Q37l80k10j05O28q94p83N04R24j10l80O84J84o29j401K05
$$ 168 -148 -830 -963 -118 719 339 129 24 652 -242 -1025 -521 403 293 -87 597 781 152 -1249 -1044
4072a044J069M9Q7m7M77l92l55q35N88j9O97m1k0j0N89j384k91L29R99K59n90
$$ -1044 25 74 161 114 591 199 -156 -991 -403 -422 275 234 214 204 793 -591 -882 -553 446 705 115
4093A15J77L00q07j164L60R47L75n33N15L22o6j221j21M15M42J99J9O32q23j57
$$ 115 292 592 -215 -1379 -1019 -72 303 -230 285 607 541 -680 -801 -386 56 255 274 906 83 -74
4113g4l74n73J90J192o4K86j34L92m22j144l2O75M91n87K30P62k17j404k73O26
$$ -74 -448 -1021 -831 361 297 583 449 841 419 -725 -757 -82 409 -178 52 814 597 -807 -1080 -454
4133d54N23J58J78M95k54m31j096pN13M53K30K32l0qo61o82J41O74M71p26O91
$$ -454 69 227 405 900 646 215 -881 -888 -375 78 308 540 510 502 -159 -841 -700 -26 445 -281 410
4154D10Q0j76j126j83R94K78j93J95O26n89o48o12O52J39L3K6M83J32m22p67l4
$$ 410 490 314 -812 -995 -1 277 84 279 905 316 -332 -944 -292 -153 -120 -94 389 521 99 -668 -702
4175g02L09M03J74L0M9M80n41q80J4K39M81J97o2N53j14j190j09M35L16j31J32
$$ -702 -393 10 184 214 263 743 202 -678 -664 -425 56 253 191 744 630 -560 -669 -234 82 -49 83
4196H3L10O88j015n49k74L77L58j79M79J97P3q49P9k58L12P6L75j5N78l66p50
$$ 83 393 1081 66 -483 -757 -380 -22 -201 278 475 548 -301 -222 -480 -168 -92 283 268 846 480 -270
4217b70n97N36L55PM5M53K58p66p24M00J93K08k57M40M41k61q46k51L36o1O21
$$ -270 -867 -331 24 31 76 529 787 21 -703 -303 -110 98 -159 281 722 461 -385 -636 -300 -361 260
4238B60k50O75L2l77n20j54N0M17k25M8M70O5m71k76j01J12M2k09N66O40l75o37
$$ 260 10 685 717 340 -180 -334 -284 133 -92 -44 426 491 20 -256 -357 -245 -203 -412 154 794 419 -218
4260b18n84L93L39K97J61K43J19o09m64k62K67L08j42K20M00q6l85n43O0J77L28
$$ -218 -802 -409 -70 227 388 631 750 141 -323 -585 -318 -10 -152 68 468 382 -3 -546 -486 -309 19
4281A9k51O96L99l73p71k66K10j1N4K54O99j58j27q42j8K60R2J10M65M58m47o99
$$ 19 -232 464 863 490 -281 -547 -337 -348 -294 -40 659 501 374 -468 -486 -226 -134 -24 441 899 452 -247
4303b47q3JJ76m62M89N94M75p56n56k08L21K59o67Q84K87K06r24m77O64k03k19
$$ -247 -330 -329 -153 -615 -126 468 943 187 -369 -577 -256 3 -664 220 507 713 -211 -688 -24 -227 -446
4324d46N85K25J47l03m04k41j30L23j99P73L60j70n14m80J7K47kl03J184J65l09
$$ -446 139 364 511 208 -196 -437 -567 -244 -443 330 690 520 6 -474 -457 -210 -212 -515 669 834 525
4345E25j173L83j3q4l8M55N73l6j88q85K09K04l45k3P16J49J05l94j50j12j0l11
$$ 525 -648 -265 -278 -362 -400 55 628 592 404 -481 -272 -68 -413 -436 280 429 534 140 -10 -122 -132 -443
4367d43N15M09K00m68n44J94J10L2m84M81L98N40q86l12O9L06m31j04R69N2j40
$$ -443 72 481 681 213 -331 -137 -27 5 -479 2 400 940 54 -258 -189 117 -314 -418 551 603 463
4388D63p95P9K28n25M38L8N82O3l83m72Q8k64K94j70N86K4Mk43k42j52K4J95j65
$$ 463 -332 -253 -25 -550 -112 -74 508 571 188 -284 -196 -460 -166 -336 250 274 278 35 -207 -359 -335 -140 -305
4411c05O12M27l18n13j2K19o92L80K65N53l53l63j38Q7l1j61K83M14J74k37j23
$$ -305 307 734 416 -97 -109 110 -582 -202 63 616 263 -100 -238 -151 -182 -343 -60 354 528 291 168
4432A68l60k54J76L23R7K99J4n97k78J03n9j05J08M13K80L1m38L10l30k77j72
$$ 168 -192 -446 -270 53 150 449 463 -134 -412 -309 -368 -473 -365 48 328 359 -79 231 -99 -376 -548
4453e48N62N46K8m75j17o0l91O6N4N16L58L4o18R8m9p9j32k8O01J83k88j12r1
$$ -548 14 560 588 113 -4 -64 -455 -389 -335 181 539 573 -45 53 4 -75 -207 -235 366 549 261 149 58
4476E8K2k63j37K86M51R2m97j15Q7j84l57J20P84j3k57p7J55k13j92R0O0P17l10
$$ 58 80 -183 -320 -34 417 509 12 -103 -16 -200 -557 -437 347 334 77 0 155 -58 -250 -160 -100 617 307
4499C07l01L77o26j91Q4K9N86m5kJ71m45J68m57N8J61O8L47j16j54K09l53J5k68
$$ 307 6 383 -243 -434 -350 -321 265 220 218 389 -56 112 -345 -287 -126 -58 289 173 19 228 -125 -110 -378
4522c78N06N44n48J07k27L2k58o9j5N87J84j31k60k25L68n53j47kQ63j2q1pl10
$$ -378 128 672 124 231 4 36 -222 -291 -306 281 465 334 74 -151 217 -336 -483 -485 378 366 285 278 -32
$$ [...]
8191f3
##END NTUPLES=NMR FID
##END=
