##TITLE=1H_DE-63EA
 D2O
 8 sc, 
 1.8.2024
##JCAMPDX= 6.0         $$ Bruker NMR JCAMP-DX V2.0
##DATA TYPE= NMR FID
##DATA CLASS= NTUPLES
##ORIGIN= UXNMR, Bruker Analytische Messtechnik GmbH
##OWNER= root
$$ XWIN-NMR		Version 3.5
$$ Thu Aug  1 14:06:27 2024 Russian Standard Time (UT+4h)  she@DPX200
##.OBSERVE FREQUENCY= 200.1315
##.OBSERVE NUCLEUS= ^1H
##.DELAY= (6, 6)
##.ACQUISITION MODE= SIMULTANEOUS
##.ACQUISITION SCHEME= undefined
##.AVERAGES= 8
##.DIGITISER RES= 18
##SPECTROMETER/DATA SYSTEM= spect
##.PULSE SEQUENCE= zg30
##.SOLVENT NAME= DMSO
##.SHIFT REFERENCE= (INTERNAL, DMSO, 0, 15.7039)
##AUDIT TRAIL= $$ (NUMBER, WHEN, WHO, WHERE, WHAT)
$$ ##TITLE= Audit trail, XWIN-NMR		Version 3.5
$$ ##JCAMPDX= 5.01
$$ ##ORIGIN= Bruker BioSpin GmbH
$$ ##OWNER= she
$$ F:/spectra/data/she/nmr/H-F/1/audita.txt
$$ ##AUDIT TRAIL=  $$ (NUMBER, WHEN, WHO, WHERE, WHAT)
(   1,<2024-08-01 14:05:15.85 +0400>,<she>,<DPX200>,
      <created by zg, POWCHK disabled, PULCHK disabled
       configuration hash MD5:
       00 E9 B6 7A A2 85 ED C7 34 08 36 98 17 FE 4E 26
       data hash MD5: 16K
       E3 8D 00 9A 1D 47 FD 45 F1 B7 4F 3F 8C F0 2D 7E>)
$$ ##END=
$$ 
$$ hash MD5
$$ 92 1F E5 E7 77 25 C9 5B 07 96 CB A8 9F 0B 13 4C
##$RELAX= 
##$RELAX= 
##$RELAX= 
##$RELAX= 
##$RELAX= 
##$RELAX= 
$$ Bruker specific parameters
$$ --------------------------
##$DU= <F:/spectra>
##$EXPNO= 1
##$NAME= <H-F>
##$PROCNO= 1
##$TYPE= <nmr>
##$USER= <she>
##$AMP= (0..31)
100 100 100 100 100 100 100 100 100 100 100 100 100 100 100 100 100 100 
100 100 100 100 100 100 100 100 100 100 100 100 100 100 
##$AQSEQ= 0
##$AQ_mod= 1
##$AUNM= <au_zg>
##$AUTOPOS= <>
##$BF1= 200.13
##$BF2= 200.13
##$BF3= 200.13
##$BF4= 200.13
##$BF5= 200.13
##$BF6= 200.13
##$BF7= 200.13
##$BF8= 200.13
##$BYTORDA= 1
##$CFDGTYP= 0
##$CFRGTYP= 5
##$CHEMSTR= <none>
##$CNST= (0..31)
1 1 145 1 1 1 1 1 1 1 1 1 1 1 1 1 1 1 1 1 1 1 1 1 1 1 1 1 1 1 1 1 
##$CPDPRG= <>
##$CPDPRG1= <>
##$CPDPRG2= <>
##$CPDPRG3= <>
##$CPDPRG4= <mlev>
##$CPDPRG5= <mlev>
##$CPDPRG6= <mlev>
##$CPDPRG7= <mlev>
##$CPDPRG8= <mlev>
##$CPDPRGB= <>
##$CPDPRGT= <>
##$D= (0..31)
0 1.2 0 0 0 0 0 0 0 0.06 0 0.03 0 0 0 0 0.0002 0 0 0 0 0 0 0 0 0 0 0 0 
0 0 0 
##$DATE= 1722506715
##$DBL= (0..7)
120 120 120 120 120 120 120 120 
##$DBP= (0..7)
150 150 150 150 150 150 150 150 
##$DBP07= 0
##$DBPNAM0= <>
##$DBPNAM1= <>
##$DBPNAM2= <>
##$DBPNAM3= <>
##$DBPNAM4= <>
##$DBPNAM5= <>
##$DBPNAM6= <>
##$DBPNAM7= <>
##$DBPOAL= (0..7)
0.5 0.5 0.5 0.5 0.5 0.5 0.5 0.5 
##$DBPOFFS= (0..7)
0 0 0 0 0 0 0 0 
##$DE= 6
##$DECBNUC= <off>
##$DECIM= 24
##$DECNUC= <off>
##$DECSTAT= 4
##$DIGMOD= 1
##$DIGTYP= 9
##$DL= (0..7)
0 120 120 120 120 120 120 120 
##$DP= (0..7)
150 150 150 150 150 150 150 150 
##$DP07= 0
##$DPNAME0= <>
##$DPNAME1= <>
##$DPNAME2= <>
##$DPNAME3= <>
##$DPNAME4= <>
##$DPNAME5= <>
##$DPNAME6= <>
##$DPNAME7= <>
##$DPOAL= (0..7)
0.5 0.5 0.5 0.5 0.5 0.5 0.5 0.5 
##$DPOFFS= (0..7)
0 0 0 0 0 0 0 0 
##$DQDMODE= 0
##$DR= 18
##$DS= 0
##$DSLIST= <SSSSSSSSSSSSSSS>
##$DSPFIRM= 0
$$ [...]
##$SUBNAM2= <"">
##$SUBNAM3= <"">
##$SUBNAM4= <"">
##$SUBNAM5= <"">
##$SUBNAM6= <"">
##$SUBNAM7= <"">
##$SUBNAM8= <"">
##$SUBNAM9= <"">
##$SW= 24.0689530833862
##$SWIBOX= (0..15)
0 0 2 0 0 0 0 0 0 0 0 0 0 0 0 0 
##$SW_h= 4816.95568400771
##$TD= 16384
##$TD0= 1
##$TE= 0
##$TE2= 300
##$TE3= 300
##$TEG= 300
##$TL= (0..7)
0 120 120 120 120 120 120 120 
##$TP= (0..7)
150 150 150 150 150 150 150 150 
##$TP07= 0
##$TPNAME0= <>
##$TPNAME1= <>
##$TPNAME2= <>
##$TPNAME3= <>
##$TPNAME4= <>
##$TPNAME5= <>
##$TPNAME6= <>
##$TPNAME7= <>
##$TPOAL= (0..7)
0.5 0.5 0.5 0.5 0.5 0.5 0.5 0.5 
##$TPOFFS= (0..7)
0 0 0 0 0 0 0 0 
##$TUNHIN= 0
##$TUNHOUT= 0
##$TUNXOUT= 0
##$USERA1= <user>
##$USERA2= <user>
##$USERA3= <user>
##$USERA4= <user>
##$USERA5= <user>
##$V9= 5
##$VALIST= <valist>
##$VCLIST= <CCCCCCCCCCCCCCC>
##$VD= 0
##$VDLIST= <DDDDDDDDDDDDDDD>
##$VPLIST= <PPPPPPPPPPPPPPP>
##$VTLIST= <TTTTTTTTTTTTTTT>
##$WBST= 1024
##$WBSW= 4
##$XGAIN= (0..3)
0 0 0 0 
##$XL= 0
##$YL= 0
##$YMAX_a= 286727
##$YMIN_a= -276203
##$ZGOPTNS= <>
##$ZL1= 120
##$ZL2= 120
##$ZL3= 120
##$ZL4= 120
##$ABSF1= 10
##$ABSF2= 0
##$ABSG= 5
##$ABSL= 3
##$ALPHA= 0
##$AQORDER= 0
##$ASSFAC= 0
##$ASSFACI= 0
##$ASSFACX= 0
##$ASSWID= 0
##$AUNMP= <proc_1d>
##$AZFE= 0.1
##$AZFW= 0.1
##$BCFW= 1
##$BC_mod= 2
##$BYTORDP= 1
##$COROFFS= 0
##$CY= 11.3945322036743
##$DATMOD= 1
##$DC= 2
##$DFILT= <>
##$DTYPP= 0
##$F1P= 15.6554695791079
##$F2P= 12.8336369535428
##$FCOR= 0.5
##$FTSIZE= 0
##$FT_mod= 4
##$GAMMA= 1
##$GB= 0.15
##$INTBC= 1
##$INTSCL= 1
##$ISEN= 128
##$LB= 0.24
##$LEV0= 0
##$LPBIN= 0
##$MAXI= 10000
##$MC2= 0
##$MEAN= 0
##$ME_mod= 0
##$MI= 1.114404
##$NCOEF= 0
##$NC_proc= 0
##$NLEV= 6
##$NOISF1= 3.799351
##$NOISF2= 2.8
##$NSP= 1
##$NTH_PI= 0
##$NZP= 0
##$OFFSET= 15.70392
##$PC= 1
##$PHC0= -25641.44
##$PHC1= 12.18749
##$PH_mod= 1
##$PKNL= yes
##$PPARMOD= 0
##$PSCAL= 0
##$PSIGN= 0
##$REVERSE= no
##$SF= 200.130013532006
##$SI= 16384
##$SIGF1= 3
##$SIGF2= 2
##$SINO= 400
##$SIOLD= 16384
##$SREGLST= <1H.CDCl3>
##$SSB= 0
##$STSI= 0
##$STSR= 0
##$SW_p= 3612.71676300578
##$SYMM= 0
##$S_DEV= 0
##$TDeff= 0
##$TDoff= 0
##$TI= <>
##$TILT= no
##$TM1= 0
##$TM2= 0
##$TOPLEV= 0
##$USERP1= <user>
##$USERP2= <user>
##$USERP3= <user>
##$USERP4= <user>
##$USERP5= <user>
##$WDW= 1
##$XDIM= 8192
##$YMAX_p= 0
##$YMIN_p= 0
$$ End of Bruker specific parameters
$$ ---------------------------------
##NTUPLES= NMR FID
##VAR_NAME=  TIME,          FID/REAL,        FID/IMAG
##SYMBOL=    X,             R,               I
##VAR_TYPE=  INDEPENDENT,   DEPENDENT,       DEPENDENT
##VAR_FORM=  AFFN,          ASDF,            ASDF
##VAR_DIM=   8192,          8192,            8192
##UNITS=     SECONDS,       ARBITRARY UNITS, ARBITRARY UNITS
##FACTOR=    0.0002076,     1,               1
##FIRST=     0,             0,               0
##LAST=      1.7004516,     0,               0
##MIN=       0,             -276203,         0
##MAX=       1.7004516,     286727,          0
$$ Real data points
##PAGE= N=1
##DATA TABLE= (X++(R..R)), XYDATA
$$ [...]
2082a079J33J826M22j470j163R40J658n25j577j25J414O59j088j195K63J768L79
2099A240j404j087Q93J539l94j644l53J528J008j125j300L44J422O18j430r80
2115a125P16J316l22j202n99J294Q52p50j387K38J651N17j453p73P50J146J17
2132I86j418o81J352Q38p94j054k9J095N67j040j309J168J276j41j431k50O88
2149a77J326o45j366K07J000M49r18q55P10J116l2j271l58R55J073p69j635N09
2167f81J100M55j157n80O10J153k73r27o68J019R10n15j313J74R99N74j120r24
2185a164P73J406k52r62q49R60R87n39j068J48R90O93j345q41Q42J134J2j425
2203e00j30R99M49n84p49l53J407M50r62j152J163O77r1j373j66J081R77q80r61
$$ plain form
2082 -1079 -946 880 1302 -168 -1331 -391 1267 742 -835 -960 454 1113 25 -1170 -907 861 1240
2099 1240 -164 -1251 -358 1181 787 -857 -1210 318 1326 201 -1099 -755 667 1285 -145 -1125
2115 -1125 -409 907 585 -617 -1216 78 930 180 -1207 -969 682 1199 -254 -1027 -277 869 986
2132 986 -432 -1113 239 1077 283 -771 -800 295 862 -178 -1487 -319 957 816 -615 -865 -177
2149 -177 1149 504 -862 -655 345 794 -124 -979 -269 847 815 -456 -814 141 1214 445 -1190 -681
2167 -681 419 874 -283 -863 -253 900 627 -300 -968 51 961 446 -867 -693 306 880 -240 -1164
2185 -1164 -391 1015 763 -199 -1048 -88 899 360 -708 -560 430 1123 -222 -1063 -221 913 925 -500
2203 -500 -630 369 818 234 -515 -868 539 989 27 -1125 38 715 624 -749 -915 166 1143 263 -698
2222f98L80Q05M50r83n38J50J522k61j483j57P88J086l86j574rJ369J98j025n18
2241h84M35J224j26r63n90R31Q15l64r47j89J011L39o85o45J48J064J64j093m21
2260g76J034Q38l07j569NJ149L21q10q45N42J380m68q50m42P24J003m17j468J62
2279g94J156L35p72o65K15J243J91j150m59Q40P67n19q21J7R42M38j002r40O23
2298c55J055k17q52m40Q01Q71n40r40j39J147N85r35q81P13Q73L22j376k58L83
2317a83O92k04o90k88P85O17n84o73K28N57O24p54j029J166M23k98r47Q5N75P98
2337I00p44r75K98J048l12o72m47Q93O08k92p64m42P71J012p92o47l6J118Kr18
2357c91l68Q20M20k29o37m28R71O65p52p53M23J018k91q91k13L49R99k16r72K5
$$ plain form
2222 -698 -318 487 937 -46 -584 -434 1088 827 -656 -813 -25 1061 675 -899 -908 461 659 -366 -884
2241 -884 -449 775 649 -314 -904 27 842 478 -469 -658 353 692 7 -638 -490 574 738 -355 -776
2260 -776 258 1096 789 -780 -775 374 695 -115 -960 -418 962 494 -356 -798 -74 929 512 -956 -794
2279 -794 362 697 -75 -740 -525 718 909 -241 -700 140 907 388 -433 -416 526 964 -38 -978 -355
2298 -355 700 483 -369 -809 -8 863 323 -617 -756 391 976 41 -840 -127 746 1068 -308 -566 -183
2317 -183 509 305 -385 -673 112 729 145 -528 -300 257 881 127 -902 264 687 389 -558 -473 102 900
2337 900 156 -819 -521 527 215 -457 -904 -11 597 305 -459 -901 -130 882 90 -557 -593 525 527 -391
2357 -391 -759 61 481 252 -385 -813 158 823 71 -682 -259 759 468 -423 -636 -287 712 496 -476 -451
2377d51M66P25m22j175L23J020K91j233k81O47O89j70o88m46P13R23j040k02J27
2396a84L38L59r50j96O62L91R9p96m23O50R27q29o56J39N90O06q93o36P20N91
2416E09q8n47j88N67J49m6q50n2Q69O4q04l30N12P35k34r91L6J008N98j021p25
2437h29N48Q63p1q58l12P43M51l93k84m88M61P16k65r21K00R22k11k76m54L40
2457a18P53k17o89j45N49M69m98p33lJ194P7n83q27O38M65n1n69m87Q83L22j99
2478B31p07q2J229Kp25n90Q97O37n83l92n73Q61M28l61p63K38P34j34l93n47N75
2499a8N75r4q65r7O57K22k47p06J80P67J68m46q06O53O01k76q42J57N66J82k52
2520G9r10M23P68K9k21m74K34O82j89p11j78K07P84l80o68J56O95R4n09m14N77
$$ plain form
2377 -451 15 740 318 -857 -534 486 777 -456 -737 -90 599 429 -259 -705 8 931 -109 -311 -184
2396 -184 154 513 -437 -633 29 420 519 -277 -700 -50 877 48 -608 -469 121 727 -166 -802 -82 509
2416 509 421 -126 -314 253 402 356 -494 -546 323 387 -417 -747 -235 500 266 -725 -689 319 917 -104 -829
2437 -829 -281 582 511 -347 -659 84 535 142 -142 -630 -169 547 282 -639 -439 483 272 -4 -458 -118
2457 -118 635 418 -271 -416 133 602 104 -629 -632 562 639 56 -771 -133 332 281 -288 -775 108 430 231
2478 231 -476 -558 671 673 -52 -642 255 892 309 -83 -656 205 633 272 -491 -253 481 347 -46 -593 -18
2499 -18 557 463 -402 -499 158 380 133 -573 -393 374 542 96 -710 -57 544 268 -574 -417 149 331 79
2520 79 -831 -408 360 389 168 -306 -72 610 421 -290 -468 -261 523 143 -525 -369 326 420 -89 -503 74
2541G4O76j80n86p39P70J139j084j44k81N00M74q09n61P32L37R5p10j80P32J1
2561B66k23o21K64O22L27o25m76j17Q72K8o25l55K10J160n59n79l4O77K58m10
2581F0m69O9Q59n2m80p27O93N69j02j064L69N17M91j102r1J21P19l4o67L4Q8Q25
2603F26n58o18R3Q24K17m10o19J44Q49n0o01n60N50O73m24l44j93L38P30r60o8
2624c61L4P87Q0o73l41L43N57l8o12l20N24O21l54n32R8N04J94p14l83O26K26
2645B66K1p41j46Q75N12o75l87k25P30L78q02l59J29R49l54l89l53Q93M94q60
2665d4n31P9R27k53j64q03O63N35lo46m41O15Q25l51r12J96L91O72p09n58K92
2686b20N60K0o80l00N49R21o09q90J78P42J12m34m58J57Q28k77q97J66N85N72
$$ plain form
2541 74 750 570 -16 -755 15 1154 70 -74 -355 145 619 -190 -751 -19 318 413 -297 -477 255 266
2561 266 43 -578 -314 308 635 10 -466 -583 289 317 -308 -663 -453 707 148 -431 -465 212 470 60
2581 60 -409 -340 519 467 -13 -740 -47 522 420 -644 -275 242 733 -369 -460 -339 380 346 -321 -287 -199 626
2603 626 68 -550 -457 367 584 174 -445 -301 548 498 -103 -663 -113 560 136 -208 -401 -63 667 -293 -361
2624 -361 -327 460 540 -133 -474 -131 426 388 -224 -544 -20 601 247 -285 -187 317 511 -203 -586 40 266
2645 266 287 -454 -600 275 787 112 -275 -500 230 608 -194 -553 -424 525 171 -218 -571 322 816 -44
2665 -44 -575 -496 431 178 14 -789 -126 409 406 -240 -681 -66 759 408 -504 -308 83 755 46 -512 -220
2686 -220 340 360 -320 -620 -71 850 241 -649 -471 271 383 -51 -509 -352 476 199 -698 -532 53 625
2706F25q4j095K65N28M71j041j1J97O45Q7q93j73P27L45l47n09N8O17K27o51o91
2727g03M94O39mo70k48M99N29nq43j94P47K56n95o89P59M96Rn37l72M56Q03m46
2749C81m51m72R03K2m44n81O54N09k35q98L76N86Q8q8j027K34L94O55n39m80K02
2770b11Q54p4o29k23M46J92l65k24j26O83R8k10q10K30J084o5q88m05P28J24K48
2791D57r24n7M39O44n33m80J31P03K45p02n93M29N18N7o07k88Q04K43n09n14N58
2812B1L71p5p9q90N37M81m0o70p5M34O97m49o66J1O21J12l66m68K53Q46l16p29
2834d39j62O96O05p41l78K74M72l9l96l67L37N46J13j033O13J26K29k51p48K32
2854c11L83L88n27m65L88P27l73m31j68L36O05o14l85O0M31M41p27k23N64L89
$$ plain form
2706 625 541 -554 -289 239 710 -331 -342 -145 500 587 -306 -479 248 593 246 -263 -205 412 639 -12 -703
2727 -703 -209 430 426 -244 -492 7 536 531 -312 -506 241 497 -98 -787 -28 468 477 -60 -432 24 827 381
2749 381 -70 -542 361 383 -61 -642 12 521 286 -612 -236 350 438 350 -677 -443 -49 606 67 -413 -211
2770 -211 643 569 -60 -283 163 355 -10 -234 -360 323 421 211 -599 -369 715 650 -238 -643 85 209 457
2791 457 -467 -524 -85 559 26 -454 -323 380 625 -77 -670 -241 277 334 -273 -561 243 486 -23 -537 21
2812 21 392 317 238 -652 -115 366 326 -344 -419 15 712 263 -403 -392 229 341 -25 -493 -240 606 290 -439
2834 -439 -601 95 700 -41 -419 -145 327 288 -108 -475 -138 408 521 -512 101 227 456 205 -543 -311
2854 -311 72 460 -67 -532 -144 583 210 -221 -389 -53 552 -62 -447 -387 44 485 -242 -465 99 488
2874D88j88m44j02J93N49m88m13j53R28K11o28m69J71R34l92l62m47O17L64M8
2894D17q68J2N07K66l04m72p7Q39J40p98j04M23K06J09o69k50Q37K65l46q74M42
2915b99P65j97m08l94J31Q99n81k40J01L50J55k06n23J37P32L5n81k89P51K45
2935E83j44p98M5L26K88n5o81M38K05J57l72n12O34M53l43l95k51M48M25l63o19
2956e31M22O00k83m83k10L65N03l85l39k44N84M50j87q19J85P06P1m48k71J79
2976a35O37m40o16p4P30K63l31p34K95N30J26q6m55L34K57R1p36K9M31N86m95
2997B07m52k9M10O82j116r1O25j30Q6m15k2O93L22n66o66l4Q81M9m58n35N57N02
3019E00k15j023L59M42O41n83n02O1M71j6o3o41M46R48m00n67l80N87O62n73l79
$$ plain form
2874 488 300 -144 -246 -53 496 8 -405 -558 370 581 -47 -516 -345 589 197 -165 -612 5 369 417
2894 417 -451 -439 68 334 30 -442 -519 320 460 -338 -442 -19 187 296 -373 -623 214 479 133 -741 -299
2915 -299 466 269 -139 -533 -402 497 -84 -324 -223 127 282 76 -447 -310 422 457 -124 -413 338 583
2935 583 439 -359 -314 12 300 245 -436 2 207 364 -8 -520 114 567 224 -171 -422 26 451 88 -531
2956 -531 -109 491 208 -275 -485 -120 383 -2 -341 -585 -1 449 262 -557 -372 334 405 -43 -314 -135
2976 -135 502 62 -554 -628 102 365 34 -700 -405 125 251 165 -290 44 301 392 -344 -315 116 702 207
2997 207 -245 -274 136 818 -298 -389 236 106 192 -223 -245 448 770 204 -462 -496 385 434 -24 -559 -2 500
3019 500 285 -738 -379 63 704 121 -381 -320 151 135 72 -569 -123 825 425 -142 -522 65 727 154 -225
3040b25j13O07N2k87m82R2O77o9l23n77Q58J18J00n93k37R30j91l34m72M24L55
3061C10j94j19l46N18M51o27n88K70N67J4k36n19K99O10j45m65q2K70L60Q8q08
3082c72K58K03M65p13m57M82M57J35r13L13K23N74o23k67k40O30L75n82k83K55
3102h0K64l0l97r3L86N95o40l89k82P34J24j59m31J64N46l0l61m57N42M06p9n86
3124b53j47N54M35o99j79NL17J57n71j2J69O95n87k05N6L24L02m46k23j2N87J68
3146D35n05l93L60O83j20r36J58N59J31j94o42N1O18L17o39l54K36P11j83n74
3166b81j36P21J45o06j97L55M99l42l70l26N60L40j59k87l29Q89n4m98l05j07
3186d88O53J37l15Kj24L95j28m66J99K98M08n79m97j42J036j59n46k39O90K04
$$ plain form
3040 -225 -338 269 321 34 -448 -356 321 252 -71 -648 210 328 428 -165 -402 528 337 3 -469 -45 310
3061 310 116 -3 -349 169 620 -7 -595 -325 242 256 20 -499 -200 410 265 -200 -282 -12 348 436 -372
3082 -372 -114 89 554 -159 -616 -134 323 458 -455 -142 81 655 32 -235 -475 155 530 -52 -335 -80
3102 -80 184 154 -243 -336 50 645 5 -384 -666 68 192 33 -398 -234 312 282 -79 -536 6 412 333 -253
3124 -253 -400 154 589 -110 -289 -284 33 190 -381 -393 -224 471 -116 -321 -265 59 361 -85 -308 -320 267 435
3146 435 -70 -463 -103 580 460 -476 -318 241 372 178 -464 -413 205 522 -117 -471 -235 476 293 -281
3166 -281 -417 304 449 -157 -354 1 500 158 -212 -538 22 362 203 -84 -413 476 422 -76 -381 -488
3186 -488 165 302 -13 -11 -135 260 132 -334 -135 163 571 -8 -505 -647 389 230 -316 -555 135 339
3206C39k6o09%N30J43m93l19L71L06O2m88k50L78L19J06o81L9J55M90k03q65N40
3228a56P02n2p73j85M93N5Q4o50K32L19M32l89n06K85L19n3k54p3K28L53k61l68
3250b18R5J50J03j13l76R5N63J92n24m16J23N81j22n12K74M22K14m32l97R9N39
3271C40n6m80r2K95L80l11k68j56L02M26l83k53O4M87j05n38r3K97P11n54k20
3292b07M5L38l2J26o71P5O98K9l28p44N36L45n7l82k44L14L73k82j43K95J66K05
3314D55m60n09N63M02p9p57Q3L53J89l23l41K37K22K02k87m89N88K77m2m73j64
3335c53N43R7l49m86M12N70k26n01K15jO90n18n03J80J84P63p23k74J49L78N8
3356C05m08l73N22L07l09l84l0M63L83l02m64J92K22K34l77j98J46K68Q7l67M1
$$ plain form
3206 339 313 -296 -296 234 377 -116 -435 -64 242 304 -184 -434 -56 263 369 -312 -273 -118 372 169 -696 -156
3228 -156 546 494 -279 -464 29 84 168 -482 -250 69 501 112 -394 -109 210 157 -97 -170 58 411 150 -218
3250 -218 -123 27 130 17 -359 -264 299 491 -33 -449 -326 255 133 -379 -105 317 531 99 -298 -199 340
3271 340 284 -196 -288 7 387 76 -192 -348 -46 380 -3 -256 -192 295 190 -348 -441 -144 567 13 -207
3292 -207 -162 176 144 270 -401 -326 372 401 73 -671 -135 210 153 -229 -473 -159 214 -68 -211 84 250 455
3314 455 -5 -514 49 451 372 -385 -302 51 240 -83 -424 -187 35 237 -50 -539 49 326 284 -189 -353
3335 -353 190 287 -62 -548 -136 434 208 -293 -78 -79 611 93 -410 -230 -46 717 -6 -280 -131 247 305
3356 305 -103 -476 46 353 44 -340 -370 93 476 174 -290 -98 124 358 -19 -217 -71 197 284 -83 -42
3377d2K14K45k10m18j97O16N72p33k57K00L34P5n86k4M0O76m09l91P4N82k0j13
3399B28n57O2L34J64p81K51N56k2J90p87j39N77K00m11K0nN26l44m76j40P63r8
3421A11j15j47K28J31M3m19O5R0O39l33k53j52J56M13n64j24j49M70J90m13k77
3442d10O04M62O6j142J80J86M48j65m99K5M04K19m49j27q3P21l5p16K00J38M17
3463D44p46P2k1K12L66k81k71j47L00L99n83k43O37K26r7p92l8P90J63o41q0L88
3485E7O1L4m50JL27M91k58r19M36O16J58n21l17J47O26k7m40p7J06L00j20o85
3507d54L70K73K05j13p72M01M31j00l88Q9Q0L82l78m51P5N12K73m35m19M78N20
3528E79p10J9l97N00O87n62l21j84L86k0k49J00L49J58l56l40K2M20M38j66n13
$$ plain form
3377 -42 172 417 207 -211 -408 208 780 47 -210 -10 324 399 -187 -211 -171 505 96 -295 -221 361 341 228
3399 228 -329 -267 67 231 -550 -299 257 235 425 -362 -501 76 276 -135 -115 -120 406 62 -414 -554 209 111
3421 111 -4 -151 77 208 251 -168 -103 -13 626 293 40 -112 44 457 -107 -231 -380 90 280 -133 -410
3442 -410 194 656 722 -420 -240 -54 394 229 -270 -245 159 378 -71 -198 -281 440 405 -311 -111 27 444
3463 444 -302 -230 -251 -39 327 46 -225 -372 -72 327 -256 -499 138 364 267 -525 -563 227 390 -251 -331 57
3485 57 118 152 -298 -297 30 521 263 -656 -220 396 554 33 -284 -137 489 462 22 -55 51 351 231 -454
3507 -454 -84 189 394 281 -491 -90 341 241 -147 -58 22 404 26 -425 -350 162 435 0 -419 59 579
3528 579 -131 -112 -509 -9 678 116 -205 -389 -3 -23 -272 -172 177 335 -21 -361 -339 81 519 353 -160
3549a60j65L64K82n01k30L76O59n07j12k68M74L30k73n93L55J51L7l46l76L27
3569a76K89lk67K88l92K72J64k29m84P36K64o00l47N18J27K9l31k02N20K05j96
3590A85n45K41M34L4m68k43L55M31j87m98k3K87M10qp75LQ04M5m84j90K40L5K32
3613C15o85P1L12J19Om13J5L78j10j02j45J78N79n09m6m65M88K65p25N6n3O21
3635A50L05m73n38N41K77p4m92j81L62L46k22n16O41J39r6P6m78L74K31j79o54
3656d61L59L81l33P3k86K55q8k5J85k19L01K53k88N2k71K76N9m06j41P3O13R2
3678D54l60m99K26J18L72o94O9L48Opr3l38M74L63k14o15N20K10j29m65M2K91
3700G9K65k63k64k5K41P2l85j82L28O03n4k85o71O82L17m06n96L34N22J8k61j96
$$ plain form
3549 -160 -325 39 321 -180 -410 -34 625 118 6 -262 212 542 269 -324 31 182 219 -127 -503 -176
3569 -176 113 110 -157 131 -261 11 175 -54 -538 198 462 -138 -485 33 160 189 -142 -344 176 381 185
3590 185 -360 -119 315 349 -119 -362 -7 424 237 -261 -284 3 413 405 -370 -367 437 482 -2 -192 48 83 315
3613 315 -370 -299 13 132 138 -275 -260 118 8 -94 -239 -61 518 9 -37 -502 -14 251 -474 -418 -471 150
3635 150 455 -18 -556 -15 262 188 -304 -485 -123 223 1 -515 126 265 169 245 -233 141 372 193 -461
3656 -461 -102 279 -54 19 -267 -12 -100 -125 60 -159 142 395 107 159 -112 164 223 -183 -324 -251 362 454
3678 454 94 -405 -179 -61 311 -383 -314 34 40 33 -60 -398 76 439 225 -390 130 340 211 -254 -212 79
3700 79 344 81 -183 -208 33 105 -280 -462 -134 469 415 130 -541 141 458 52 -544 -210 312 330 69 -127
3722a27j26N13R0o05Q7J55K92j44m9r1K74J59p2p26K20j6M15l82n2J14K44l77
3744b04o0J65L07L78m92k62J7L35J10n22N8L45j53O0j12j64J97K58m34l8Q5N65
3766D39j99km07L40k19m7p6j40L81L44m60q9p3L91J40m08k74L86J25j21j57j9
3788a45K71N2m50r3O19k67K03k75l6l6K49R3j62p9K05j02K03m01q4O30k86n84
3810d75m7N04j52m8K3R8l4K06j16n97K45N12J21l49p4J01K83K19q90M05K72r8
3832A09l7n56L09L08L97m66j05j62M91l80j37j35O26q7k15k75M69m8M3j32l06
3853b89L91R3k65j60K07j51N63j79q25M19J70M09n54j80L57L16l39j47j91O10
3873B55N2j61k33k05M76J75l90n8K74j56k3j03j29L82K71m20p2j96L60J98l99
$$ plain form
3722 -127 -253 260 350 -255 -168 -13 279 135 86 -5 269 428 356 -370 -150 -166 249 -133 -185 -71 173 -204
3744 -204 -264 -99 208 586 94 -168 -151 184 294 -228 -170 175 22 82 -30 -194 3 261 -173 -211 -126 439
3766 439 240 238 -169 171 -48 -95 -171 -311 70 414 -46 -135 -208 183 323 -85 -359 27 152 31 -126 -145
3788 -145 126 178 -272 -365 254 -13 190 -85 -121 -157 92 185 23 -56 149 47 250 -151 -235 395 109 -475
3810 -475 -522 -18 -170 -218 -195 -97 -131 75 -41 -638 -393 119 240 -109 -183 -82 201 420 -470 -65 207 109
3832 109 72 -484 -175 133 530 64 -41 -203 288 -92 -229 -364 262 175 -40 -315 154 106 149 17 -289
3853 -289 102 195 -70 -230 -23 -174 389 210 -615 -196 -26 383 -171 -351 6 322 -17 -164 -355 255
3873 255 307 146 -87 -292 184 359 -31 -89 185 29 6 -97 -226 156 427 7 -65 -261 99 297 -102
3894a02Q0K8K43J32p09L99L6K8j32n53N69K41L9k04j41j46N25k6o89Q2N83qj90
3917H5k23J45L07k24l26q3L01J98j43l01K61j52J40N3m26R0O51k03j87k63J28
3938a72O97m14j20l88N68K54l76PNJ6J81k57j49O0K21L19p19J22K81J2m37J34
3960a55k7L96p9m90M97k24K87k47j48J4J06M98m72pk13O42l29j78l08N57K00l80
3982f0j68j27N56k92M1l8j37L61J18m05k16K50N21k48k47p1L57J57j88l75K50
4003C9M42l40l4o03M00N58o36j41L08OJ10k79l67L46L08P4j28m19L93k4J99k07
4025El14L98N1k96R0k18P21l77k59j66L72J82j80m20J90K75M6r3k05J09K32K20
4047C63m96r8K20L86j60l47j1M73m11M85p32j27O35K29l18n04Q02j67j88m7j38
$$ plain form
3894 -102 -22 6 249 381 -328 71 107 135 3 -550 19 260 299 95 -46 -192 333 307 -382 -300 283 275 85
3917 85 -138 7 314 90 -236 -319 -18 180 37 -264 -3 -155 -15 38 -388 -298 353 150 -37 -300 -172
3938 -172 525 111 -9 -397 171 425 49 56 61 77 258 1 -148 -88 133 452 -267 -145 136 148 -289 -155
3960 -155 -182 214 135 -355 142 -82 205 -42 -190 -176 -70 428 -44 -51 -264 378 49 -129 -437 120 320 -60
3982 -60 -228 -355 201 -91 -50 -88 -225 136 254 -151 -367 -117 404 156 -91 -162 195 352 164 -211 39
4003 39 481 141 107 -496 -96 462 -174 -315 -7 -1 109 -170 -537 -191 117 191 63 -356 37 13 212 5
4025 5 -309 89 140 -156 -66 -284 437 60 -199 -365 7 189 9 -411 -221 54 100 7 -198 -89 143 363
4047 363 -133 -231 -11 375 215 -132 -143 330 -81 404 -328 -455 180 409 91 -413 389 222 34 -13 -151
4068a51J39J50n4l28L0j26L21J7j80J35J05M53n88M2M36j19m63M6j11M54K1j96
4090C3m46K32L77K12m03j30R6mL64m53m20O65k34J81m64L25N5J3k43J89rM98m09
4113B5l40M84R1Rn3n07M10K3k4R0l22L06L53j88n70L03k63N45l21j81m2M52M8
4136C28m98J43K19k03L16n38J78K3Q3om03M33O5Q7m04J4L02o3j95j43KL91J03
4159B34j20m79M41L1k1j81o0J62K14k74l20K93K66J80n36k56O86K3K0j06j97m0
4181d0J47N5j80k62K91N80p57KJ53R9K36j46n86K33L04j44l63K99L39p2j55j41
4203a08j18K80k08n4l10N51K00m00K12m69P84k29k90j39K46K63k8rm12L81J01
4224B44k48j56j90M29J90k09l21L27K27q0l42q7R1K16j4j96j02K48J09Q1o06N86
$$ plain form
4068 -151 -12 138 84 -244 -214 -340 -19 -2 -182 -47 58 511 -77 -35 401 282 -181 -135 -246 208 229 33
4090 33 -413 -181 196 408 5 -125 -29 -33 331 -122 -542 123 -111 70 -394 -69 -14 -1 -244 -55 -64 434 25
4113 25 -315 169 260 269 216 -291 119 142 118 208 -114 192 545 357 -213 90 -173 372 51 -130 -172 280 328
4136 328 -170 -27 192 -11 305 -233 -55 -32 51 45 -358 75 140 227 -177 -163 139 76 -119 -262 -260 131 234
4159 234 114 -365 76 107 86 -95 -155 7 221 -53 -373 -80 186 366 -170 -426 260 283 303 197 0 -40
4181 -40 107 162 -18 -280 11 591 -166 -164 -11 88 324 178 -408 -175 129 -15 -378 -79 260 188 33 -108
4203 -108 -226 54 -154 -208 -518 33 233 -167 45 -424 360 131 -159 -298 -52 211 183 174 -238 143 244
4224 244 -4 -160 -350 79 269 60 -261 66 293 213 -129 -216 -125 91 77 -119 -221 27 136 217 -389 197
4246A97J89k77l99J88L1L73k21k69l46Q47k21l16l0j96M06K33j03m3K15r7j43
4267A8j51J21K69J45m19k04K7J93k4K55m73J10K64j04k20J04L34L55m52m32j14
4288c98M98K53n19j8K22j11L07n02J3P62k19m19j79j7O78k14j12j77j91M57k08
4309i4L4n6K65m6j99j37k08M80K7r0l33O99l11J51k16l87K63O17n02l49J98J55
4331c9K22m76M6K32J46n7m50O5N62R4l34j52P9J27o4L6m57J43M98j22n56L03J92
4354C8M0N6n92N00j71M45k89j88q9K98L77k33k58K85o9n6l13P4M33J46n40n4j66
4377c26Q31k71k25N0p1J99k6K9l35K63Q1r6J17L1Q1k57J30m55J97N14m48l92l31
4400g10J131o4n12P9K1K08M3j16m44K89N10m15l98M54l56L81j86k27L13J17K57
$$ plain form
4246 197 386 109 -290 -102 -71 302 81 -188 -534 313 92 -224 -254 -450 -44 189 86 43 258 161 18
4267 18 -133 -12 257 402 -17 -221 -194 -1 -25 230 -243 -133 131 27 -193 -89 245 600 148 -284 -398
4288 -398 100 353 -166 -184 38 -73 234 -268 -255 507 288 -131 -310 -327 351 137 25 -152 -343 114 -94
4309 -94 -60 -116 149 103 -96 -233 -441 39 66 -24 -357 342 31 182 -34 -421 -158 459 -43 -392 -194 -39
4331 -39 183 -293 -247 -15 131 74 -376 -311 251 345 11 -141 -62 65 1 37 -420 -277 221 99 -457 -154 38
4354 38 78 134 -458 42 -129 316 27 -161 -250 48 425 192 -66 219 150 94 -219 -145 288 434 -106 -160 -326
4377 -326 505 234 9 59 -12 187 161 190 -145 118 199 103 220 251 332 75 205 -250 -53 461 13 -379 -710
4400 -710 421 357 -155 -76 -55 153 196 80 -364 -75 435 20 -378 76 -280 101 -85 -312 1 118 375
4421C75n17k09O0L84J29n87qM67L45j93o08L15M28m51K74k58O9k07L71l35Q1K97
4443B22m7r5k58K57q2J56m91L69K21J32k93j87j62K30jl82L30j50J53N3J46j52
4465c1j33K74Q8m25p5K36M54k74k60k7N05l96m1M3K93j08R1p9j72K46l92K98m12
4488b97K15K05k21j08k39M32M17k02k82JM04k0o87J47L38k19K33m02j10O78r2
4509A91Q1n05J16J40K43k64k79K32J24k29j0j55M60J16k16k53k4K14M36p82J54
4530b10p4M52pk85j04q5O05m16L3j43M86j53k8j76R2q2K56k04j62L34O4l19qK0
4554a14K10K07o29R1L43j28K49k81j53N17m46L82q7j73j7N68n98J39R6lO2j29
4576A06M0J31k98L15l95k4K20p4k5q2J99j26J32l39J42P1M7L4o1k02J45P3L25
$$ plain form
4421 375 -142 -351 -291 93 222 -365 -373 94 439 246 -362 -47 381 -70 204 -54 15 -192 179 -156 -75 222
4443 222 175 80 -178 79 -3 153 -338 31 252 384 91 -96 -258 -28 -29 -411 -81 -231 -78 -25 121 -31
4465 -31 -164 110 198 -227 -302 -66 388 114 -146 -173 332 -64 -105 -62 231 123 214 135 -37 209 -183 115 -297
4488 -297 -82 123 -98 -206 -445 -13 404 202 -80 -79 325 305 -382 -235 103 -116 117 -285 -395 283 191
4509 191 272 -233 -117 23 266 2 -277 -45 79 -150 -160 -315 145 261 45 -208 -232 -18 418 -364 -210
4530 -210 -284 168 161 -124 -228 -313 292 -124 -91 -234 252 99 71 -105 -13 -95 161 -43 -205 129 193 -126 -134 -114
4554 -114 96 303 -326 -235 108 -20 229 -52 -205 312 -134 248 161 -12 -29 539 -59 80 176 173 235 106
4576 106 146 277 -21 294 -101 -125 95 21 -4 -86 113 -13 119 -220 -78 -7 40 74 13 -189 -44 29 354
4599C54j80J4k19J61j07j37K09n1K5J20l16j95L17n4k9K44K1k11J77j28K6j9p
4622A5l7p2p0O73n00r6P0J43n4l55p6N11p5K53n13K01J49j76L33l18K7J11L9l44
4646a61M2J85J34j56j11m7J70o1rk9P1j61M46j18o49M22J96k64L7n2K30NK4k42
4670i8K9M85p0j95o0j79O1J18l30J05L95k15N9l67M32j47J55l54K64j62M1L73
4692C40m28K31J97l18K61l49m2K46k3k61r4L8O01j24j75J27L4j88J53l90k7L6
4714a55K97j41j70K28K90k51j32J80R2j96k9j74q0N36l40j12J50J66j46K61k64
4735A0l75K64J4J61j17j88M34m30K37K66l40j05K70j22k57K82OK05m98n5N06j99
4757c1K41n24L35j6J88l03K2L22p6j43k78K70L83m32l0L8R0R6k12QK02l60M00
$$ plain form
4599 354 174 188 -31 130 23 -114 95 44 69 189 -127 -322 -5 -59 -88 156 177 -34 143 15 41 22 15
4622 15 -22 -94 -164 509 9 -87 -17 126 72 -283 -359 152 77 330 -183 18 167 -9 324 6 33 144 183 -161
4646 -161 -119 66 200 44 -67 -114 56 -5 -14 -43 28 -133 313 195 -454 -32 164 -100 -63 -115 115 120 144 -98
4670 -98 -69 416 346 151 91 -88 -27 91 -239 -134 261 46 105 -262 170 23 178 -176 88 -74 -33 340
4692 340 -88 143 340 22 283 -66 -108 138 115 -146 -240 -202 399 275 100 227 261 73 226 -164 -191 -155
4714 -155 142 1 -169 59 349 98 -34 146 238 42 13 -161 -241 295 -45 -157 -7 159 13 274 10
4735 10 -365 -101 -87 74 -43 -231 203 -227 10 276 -64 -169 101 -21 -278 4 10 215 -283 -338 168 -31
4757 -31 210 -314 21 5 193 -110 -88 234 158 15 -263 7 390 -42 -72 -34 56 152 -60 -52 150 -210 190
4780A90q8M8k65K01j99J81J21j15J50m07l8P7K56R4k27m8K75k61M82n01J6K10
4802A52Q7l9m80K33K23k13J14l83j0M16j02o4M7R8k1J71l18n0L13jj06k8j5O0
4826H4q4k26Q9L68J50n53J46k9K59J24n80K50p0J34J86n52m6M63P1r8k09m0L56
4849A93k01m1J45j84J00M4k1j56j4K37j76K26M4p8J1j7k27J9M5K60k56k06J35
4872a18l7M32k92j18Q9J29j96PJ04M0J44L3l51L24k6K58m62n9M48j02l78r8Q0
4895a49J31K74n01K5K66P1M4j51P3k6k55P7o5j16M16K9l26l6M90n07J49k3j73
4918b83K08ko4Q1J90J01j55k14L13l38J16O7j32J38N8K90o68J67J79L71k21j58
4940D4l70L21K17j11k65p8K85pL7k33J22L97k76k51Q1K42j02J14j06N1k1j20j04
$$ plain form
4780 190 102 150 -115 86 -113 68 189 74 224 -183 -221 -144 112 206 -21 -69 206 -55 427 -74 -58 152
4802 152 239 200 -280 -47 176 -37 77 -306 -316 100 -2 -66 -19 79 58 229 -89 -139 174 173 67 39 24 84
4826 84 0 -226 -137 231 381 -172 -26 -55 204 328 -252 -2 -72 62 248 -304 -350 113 184 86 -123 -163 193
4849 193 -8 -49 96 -88 12 56 35 -121 -135 102 -74 152 196 118 129 112 -115 -96 -51 209 -47 -253 -118
4872 -118 -155 277 -15 -133 -44 85 -111 -104 0 40 184 217 -134 190 164 422 -40 -99 349 247 -131 -229 -149
4895 -149 -18 256 -245 -220 46 117 161 10 83 57 -198 -121 -186 -302 114 143 -183 -219 271 -236 -87 -110 -283
4918 -283 -75 -77 -141 -60 130 231 76 -138 175 -163 -47 20 -112 26 84 374 -294 -127 52 423 202 44
4940 44 -326 -5 212 101 -164 -242 43 36 73 -160 -38 359 83 -168 -87 155 53 167 61 112 91 -29 -133
4963a33J61j14J38M4j91j33K17K00o20M6L00MJ4J80l60K52k17M98j75o24N37J18
4985A42k39J58j05k5L84n15K78k64Q3J97k23P0M0J33L0j76j56L27j94j03O3P5
5007b0N6P7p9l44K34K77j73k36K98j29N3j01J89j14J06m3O4l62K22K23j84k40
5029b26K0J95J70J14q53O44J56o0j38l75N31k74J22o4J31j82R7m8J03P4k04k36
5051c03O08l35K65j45l92L73k89J66J78L7l41QJ87K15l12M9K4nK00k60J55J89
5073B72j83O7o6R1j63K05m86K71J58n3j47L55p20O2N87n76K15J86o4K70m21J60
5095B0k73K25N2rj85K65jj48L25j97j52L3J15l23M28j46J3k9n2L11j12K2k97n
5119a20K56r8l01K39j31m5Kl27M27L7J58J14o09K29K49j98k24K28J59P0j4p7j14
$$ plain form
4963 -133 28 -86 52 96 -95 -228 -11 189 -431 -385 -85 -81 -67 113 -247 5 -212 286 111 -513 24 142
4985 142 -97 61 -44 -69 315 -200 78 -186 -103 94 -129 -59 -19 114 144 -32 -188 139 -55 -158 -95 -20
5007 -20 36 113 34 -310 -76 201 28 -208 90 -39 14 -87 102 -12 94 51 115 -247 -25 198 14 -226
5029 -226 -206 -11 159 273 -580 64 220 160 22 -353 178 -96 26 -38 93 -89 8 -40 63 137 -67 -303
5051 -303 305 -30 235 90 -302 71 -218 -52 126 163 -178 -170 17 232 -80 -31 -7 -12 188 -72 83 272
5073 272 89 156 90 181 18 223 -263 8 166 113 -34 321 -399 -337 250 -326 -111 75 11 281 -140 20
5095 20 -253 -28 24 15 -170 95 94 -54 271 74 -78 -45 70 -253 175 29 42 13 -39 272 160 182 -115 -120
5119 -120 136 38 -263 -24 -155 -200 -198 -525 -98 -61 97 211 -398 -169 80 -118 -342 -114 45 115 101 24 -90
5142i0J49j51K8J99k43J55l99J97rJ14M79k60q2j70N6Q4j46K42l24L42o0k11n3
5165a53K07J32j43J77k53K36j85l93L44mJ77J05k09o3o1j19J27j91K61j45j14
5186b67L66l27K14o9J04q4j67J19L70k71n5k18M49j43J60l86J86k45N28m11n6
5207b03k8M56n5n6Jk41J17L19m81K62k6j17P2l30L27K59j82j03K67j71O8k68k09
5230c22J11O0L07l93l13N12J92k35k17K78J71k33J68m03J97M48l67k36K71Q8J22
5251B06l31j42J95J82J45k7m67L32K11q0k76j43l2L18j50L04k82J27j66K7Q1k9
5273CJ53p8j20p9J69lJ4k70M1O3O6K29J39m02K18m2m1m0k24L90k4k54J00j52l5
5298a79K67j57j56K60K18P0l34J37k48L65l37LJ51q4Q3k61J89J47k25k62J94K42
$$ plain form
5142 -90 59 -92 -64 135 -108 47 -352 -155 -164 -50 429 169 87 -83 -27 57 -89 153 -171 171 111 -100 -153
5165 -153 54 186 43 220 -33 203 18 -375 -31 -35 142 247 38 -25 -86 -205 -78 -269 -8 -153 -267
5186 -267 99 -228 -14 -83 21 -63 -230 -111 259 -12 -67 -285 164 21 181 -205 -19 -264 264 -147 -203
5207 -203 -231 225 170 114 115 -126 -9 310 -171 91 65 -52 20 -310 17 276 94 -9 258 87 155 -113 -322
5230 -322 -211 -151 156 -237 -550 -38 154 -81 -298 -20 151 -82 86 -317 -120 328 -39 -275 -4 84 206
5251 206 -125 -267 -72 110 255 228 -239 93 304 224 -52 -195 -227 91 -59 245 -37 90 -76 -49 32 3
5273 3 156 78 -42 -121 48 45 59 -211 -170 -107 -41 188 327 -75 143 101 60 20 -204 186 162 -92 8 -144 -179
5298 -179 88 -69 -225 35 253 323 -11 126 -122 243 -94 -91 60 -24 59 -202 -13 134 -91 -353 -159 83
5320H3j41J76p8j50K21J96qk66o1J73k66K85k17l4M1M16n7k30k61R4J0L4J33N1
5344A44q4k7m32N44k2k68Q9J99l31J85K59j88j96N2J89j59J78j16J66q0k90K4
5366a64O4J67j24p5J97k89L16J08l39K99k48j6JJ43K52P3l73M5N3J12j99Qn1r4
5390a34Q3L60l91j35M45k09j93K49k83M01j81m0J5l39K97k00K68L06m08K15p5
5411E1K4r9j56K89m37K27J95k03j4J14o1K15J42k00j6J9k59K62l8R6m09K36K6
5434DM6p6J98N7j98L6rk11R4K64j25p2j07J21j94L7K98l38K04N5q6J12J9p1l41
5459b83L93J3l55K45j39K27j38K04k36K10o2n36K70K47o1J45j54j84M53m3j82
5480C4j68q7K57j47J68J12k89p0J90oK78n69K52L15k51k61J23J79L0j01J45l34
$$ plain form
5320 83 -58 118 40 -110 111 307 299 33 -28 145 -121 164 -53 -87 -46 370 313 83 -178 -84 -74 -40 93 144
5344 144 60 33 -399 145 123 -145 -56 143 -188 -3 256 68 -128 -76 113 -46 132 16 182 102 -188 -164
5366 -164 -100 67 -57 -132 65 -224 92 200 -139 160 -88 -104 -103 40 292 365 -8 37 90 202 3 11 -40 -134
5390 -134 -51 309 -82 -217 228 19 -174 75 -208 193 12 -28 -13 -352 -55 -255 13 319 -89 126 51
5411 51 75 -24 -180 109 -328 -101 94 -109 -123 -9 -70 145 287 87 71 90 -169 93 55 151 -258 -22 4
5434 4 50 -26 172 229 31 67 58 -153 -59 205 80 8 -99 22 -172 -135 163 -175 29 84 -2 110 129 58 -283
5459 -283 110 123 -232 13 -126 101 -37 167 -69 141 79 -457 -187 60 -1 144 -10 -194 259 216 34
5480 34 -134 -221 36 -111 57 169 -120 -190 0 -6 272 -297 -45 270 19 -242 -119 60 90 -11 134 -200
5502b00M30j61k89J78Q1J86k90L87n63O1P9q7J63J50r0K87k00k85J83L23j99q0
5524F4q4j5L25l01o5L51l77K93j74m9Q8J5K7n7K86k58j03q7J99j77L71j01k03
5547c2J15J13j49q6l11O02l3k85J4J99p9j33M5J1QK16J36k27j64j64jJ23N3J6
5571a3K83l02J57j90o3P4J7k51M56m26N52j99mk16L73l10Oj40p2N08j88J42k86
5594i2n7K25k4k32N8L71m38R7L08j56j53O6P0J03j99q8N06k58J2j00J20O4l1l24
5618a52M81l56k77L47l40L90j51L07m56M28j23l74M57j23m73K34M6l3J79P8k86
5639a97K63l41K22j40M6P3J78J04j53j55K41l17K54r8J07j46L80k97k1J04m3r9
5661c5j63K49o0j27J93j71J9k63L51Mq8J02j83L36J5J04k90J43P5j71k72J30j53
$$ plain form
5502 -200 230 69 -220 -42 39 225 -65 322 -241 -180 -101 -188 -25 125 35 322 122 -163 20 343 144 64
5524 64 -20 -35 290 -11 -76 275 -102 191 17 -32 56 71 98 41 327 69 -34 -121 78 -99 272 171 -32
5547 -32 83 196 47 -39 -350 252 219 -66 -52 147 68 -65 -20 -9 -1 215 351 124 -40 -204 -205 -82 -29 -13
5571 -13 270 -32 125 -65 -128 -54 -37 -288 168 -258 294 95 91 -125 248 -62 -56 -196 -268 240 52 194 -92
5594 -92 -149 76 52 -180 -122 249 -189 -92 216 60 -93 -27 43 146 -53 -141 365 107 119 19 139 203 172 -152
5618 -152 329 -27 -304 43 -297 93 -58 249 -207 221 98 -276 181 58 -415 -181 -135 -168 11 89 -197
5639 -197 66 -275 -53 -193 -147 -74 104 208 55 -100 141 -176 78 -20 87 -59 321 24 3 107 64 -35
5661 -35 -198 51 -9 -136 57 -114 -95 -358 -7 -3 -91 11 -172 164 179 283 -7 136 211 40 -232 -102 -255
5684b55K08j51J95j74L15N9r3RPR1m4l24J46m9k06K58l3J9O3R9j80j22J69J16
5708A23J07j35m24O11j25j71k48Q9J56JP6k06R0k89J43jK04n8J06pl97N55k5q8
5732H7j77n2J09O0K57o23K81M1Nj78J02J82J95m80M75k75m7Q1j6J04k14L6o6K73
5756A60l56M9n8K28R2l81J07M40k70J65j38P8l7j28k5J37Mm7Q3k50M73k94n6k6
5780e0j05J22J49k29j83K04J57J95l06j75K13k5K51m72K45k43L94j4k87j44N12
5801B09j62kk94K20m3n8J94l9o3O1j2j48k4L5j24J83m8k8K35r1J07Pj02J16J2
5826A41l08M3p1K38n8j7Q5n2J72o7k64J2l6L12k8k70K79k73J32K25j25k64n7M83
5850B32l02K72j77j46j45K55j95N6K62k62nMN3Q3K85J10m87J73j42q1J30K1Oj28
$$ plain form
5684 -255 -47 -198 -3 -177 138 197 104 113 120 211 167 -157 -11 -60 -266 -8 -41 -22 41 140 -40 -162 7 123
5708 123 230 95 -329 282 157 -14 -262 -173 -17 -16 60 -146 -56 -345 -202 -203 1 -57 49 42 -355 200 175 87
5732 87 -90 -142 -33 27 284 -339 -58 -17 -12 -190 -88 94 289 -191 284 9 -38 43 27 131 -83 -47 -113 160
5756 160 -196 -147 -205 23 115 -266 -159 281 11 176 38 116 79 -49 -74 63 67 20 103 -147 326 32 -24 -50
5780 -50 -155 -33 116 -113 -296 -92 65 260 -46 -221 -8 -33 218 -254 -9 -252 142 128 -159 -303 209
5801 209 47 45 -249 -29 -72 -130 64 25 -38 23 11 -137 -161 -126 -250 -67 -115 -143 92 1 108 115 13 129 141
5826 141 -167 -124 -195 43 -15 -32 53 1 173 106 -158 -146 -182 130 102 -168 111 -162 -30 195 70 -194 -251 232
5850 232 -70 202 25 -121 -266 -11 -206 -150 112 -150 -155 -151 -98 -15 270 380 -107 66 -76 -157 -27 -6 0 -128
5874a28O0J69P6m18K57j19Q1K23p6j98J80j10l16O1P4K71j7J04o15N60Pj26k84
5897b84K49K0K03j78R8n9r0k42K67J1NL32n57M56k81j10J00N5N9K08j92r7k10
5920b37J44j75J75L79j76M3j42q4J48L1k2K65n04L31m19K78K3r3K74k81k39L64
5942H3J32k07j64J79o4M7j70K44J36l38n2L11j92r7K35k29M08p9j83j81K98L5
5964A52m31l8L17k79J26n4K62r5k48J85k77L60j60%K90j65K5J85k5j32K98l42
5986d6K22K4n55N4K19O8N0n6J00Q5k42r8MJ71O2j16N2j66O7n3J34M18n64K22k19
6011a63K59j53q5O3J60L0n1O8k42L40m59M32o0J1l67J30l5k56J28R7j36N38j91
6034E8j06nk89L74J71k66J42k8J59k90J35k61K0lL94l54J54Mo6J96m42L70j18
$$ plain form
5874 -128 -68 101 177 -241 16 -103 -22 201 125 -73 107 -3 -319 -258 -184 87 70 174 -441 119 126 0 -284
5897 -284 -35 -15 188 10 108 49 -41 -283 -16 -5 0 332 -225 231 -50 -160 -60 -5 54 262 70 -27 -237
5920 -237 -93 -268 -93 286 110 153 11 -73 75 106 84 349 -155 176 -243 35 58 -35 239 -42 -281 83
5942 83 215 8 -156 23 -41 6 -164 80 216 -122 -174 137 -55 -152 83 -146 262 183 0 -181 117 152
5964 152 -279 -317 0 -279 -153 -207 55 -40 -288 -103 -380 -20 -180 -180 110 -55 -30 155 130 -2 296 -46
5986 -46 176 200 -355 -301 -82 -14 36 -20 80 165 -77 -175 -171 0 62 -54 -2 -168 -101 -154 -20 398 -166 56 -163
6011 -163 96 -57 -142 -79 81 111 60 128 -114 226 -233 199 139 150 -217 -87 -122 -378 -250 -153 -289 249 58
6034 58 -48 -53 -342 32 203 -63 79 51 210 -80 55 -206 -186 -189 205 -149 5 9 -57 139 -303 67 -51
6057e1J22j2J9j87J83J55k26J60k7k51O0l9n1L03j73j44K36k22K52l49L09o3J71
6080A75J26k08j55j6J25j60N45j18j67J62l56L45l87L84n03j12J31P0M23k54r3
6101d3K80k57j58K87k79J17j15J80J71l24j85Q3K82j60j23K23j33K86k41r9k6
6122b34K79J03j24K73l53j21k0K92k5j13J14J20k79L6K8K2o2k33N08o6k0k20o4
6145a59j08K48K1l04L58M16j79m28J28j40L71o1j17j2Q0k84K29j45J29n3J54K33
6167C77m45K05j10J95k87N32p05K50q2l7L19QJ97l86k68L49k58J70j19O9K35O4
6189B73j72Q7j81K13j34k8k8k68K93J7L5j09j21M7R1j04M9K92m05J48o1K6K95
6212B55j90J09rk59K42k73n8J07Q2m0q4M6K49r5Q1k20M5K49l12r8L43r2j61J11
$$ plain form
6057 -51 71 59 78 -109 74 229 3 163 136 -115 -55 -94 -145 158 -15 -159 77 -145 107 -242 67 4 175
6080 175 301 93 -62 -78 47 -113 432 314 147 309 -47 298 -89 295 -208 -320 -189 -119 304 50 -43
6101 -43 237 -20 -178 109 -170 -53 -168 12 183 -141 -326 -243 39 -121 -244 -21 -154 132 -109 -208 -234
6122 -234 45 148 24 297 -56 -177 -197 95 70 -43 71 191 -88 -52 -24 -2 -64 -297 211 145 125 -95 -159
6145 -159 -267 -19 2 -302 56 472 293 -135 -7 -147 224 163 46 34 114 -170 59 -86 43 -10 144 377
6167 377 -68 137 27 222 -65 467 -238 12 -70 -107 212 220 417 31 -237 112 -146 24 -95 -26 209 273
6189 273 101 188 7 220 86 58 30 -238 55 72 107 -2 -123 -76 15 -89 -40 252 -153 -5 -66 -40 255
6212 255 65 174 165 -94 148 -125 -183 -76 6 -34 -118 -72 177 82 163 -57 -12 237 -75 -173 170 78 -83 28
6236B8N2l61K75m4K34k70R0j72L34k19O0k13K62j36L15k31J16Nj19j89J49r8k0
6259a52J84j47J62j94L89m91J1K31l9J32r1j85J61N3L03l65K18q3J18j9k87m8
6281a39K19n7p7pP4L43k52m24M09J11m7L8J2l14K92j66k84J32J05L42ml72o2l1
6305a59J86l97K19J35m7J49p5Q0r8rl0L2k45L73Q5l07j11K79jK9k39J32L34M0
6329C55l91J98J9k62L80k78k63M09L17n23P8n7k8m2O0J41Mj74p0L37l31M6m4K78
6353A59m36J45O4K48j04n46N09K0o4K18j67k6L49l99J65k47J79q1j84L52j89K59
6375B24n8j61J24j91J40r7J47K5K2j01Pl53K58J21k33J13MJ70R9J39m29K8N7q2
6399b7Oj52OO7M5P2j8j23L56J24n04K21k25P6oQ6j81K74l24K84j88J77p6m8J61
$$ plain form
6236 28 80 -281 -6 -50 184 -86 4 -168 166 -53 7 -206 56 -80 235 4 120 125 6 -183 -34 -132 -152
6259 -152 32 -115 47 -147 242 -249 -238 -7 -46 86 -5 -190 -29 24 327 -38 180 97 215 196 -91 -139
6281 -139 80 23 -54 -61 13 356 104 -320 89 200 153 191 203 -111 181 15 -269 -137 -32 310 306 -66 -128 -159
6305 -159 27 -370 -151 -16 -63 86 11 91 -7 -16 -46 -14 -259 114 199 -108 -219 60 59 88 -151 -19 315 355
6329 355 -36 162 181 -81 299 21 -242 167 484 -39 39 -18 -46 -88 -28 113 117 -57 -127 210 -121 -75 -119 159
6353 159 -277 -132 -68 180 76 -470 39 59 -5 213 46 20 369 -30 135 -112 67 -14 -198 154 -35 224
6375 224 166 5 129 -62 78 -19 128 153 175 74 81 -272 -14 107 -126 -13 -9 161 260 399 -30 -2 55 -27
6399 -27 -21 -173 -167 -100 -55 17 -1 -124 232 356 -148 73 -152 -76 -82 4 -177 97 -227 57 -131 46 -30 -78 83
6424H3l57L40K3o9k86K11k17N74m62M24k37p5q0n9L60l21K88j88o9J78L04o66
6446c01O39l96K02j55Q4n72P01J4m18J98q6L51l95R6M7j74J37J75o0j16q4R0k98
6469c21K50L8m3j13L58m20N30k30l3J6q2L7K13k84R2k15J81q3J56m0k47K16J13
6492H9k04j1j24J07K86jM2o7j10J43j37j04N7q8O4Q4J92r3p4o6k19M44M7k42j74
6517a59L34j49j1j72l0K3n2K71%k1r1j87J51L75n86J99J68j09lJ63j04J62j1J29
6541B90l68J55Q0l34K66K92l20P4m9k39K0J64r3o2K11N8k63m0J51o2J41o4l94
6564c86M66p2K33k05O8Mj69p9M0L27j45q6k6N7J34j4l15J24j04O4K99j55j49J39
6588E0M9j8k75J41l0j70K91O5M6m37L77j30n6K06j57J27j07j54J16K67k09j5j89
$$ plain form
6424 83 -274 66 89 20 -266 -55 -272 302 -160 264 27 -48 -128 -187 173 -148 140 -48 -117 61 365 -301
6446 -301 338 -58 144 -11 73 -499 202 216 -202 -4 -90 261 -134 -38 9 -165 -28 147 87 -29 -113 -23 -321
6469 -321 -71 -33 -76 -189 169 -251 279 49 16 32 -50 -13 200 -84 8 -207 -26 -109 47 7 -240 -24 89
6492 89 -115 -126 -250 -143 143 142 184 117 7 150 13 -91 -34 -122 -58 26 218 125 51 -15 -234 210 257 15 -159
6517 -159 175 26 15 -157 -187 -164 -216 55 55 34 -57 -244 -93 282 -304 -105 63 -46 -49 114 10 172 161 290
6541 290 -78 77 157 -177 89 381 61 135 86 -153 -133 31 -62 -124 87 145 -118 -158 -7 -69 72 8 -386
6564 -386 80 8 241 36 104 108 -61 -140 -100 227 82 -4 -30 27 161 147 -168 -44 -148 -84 215 60 -89 50
6588 50 99 81 -194 -53 -83 -253 38 103 149 -288 89 -41 -97 109 -48 79 -28 -182 -66 201 -8 -23 -212
6611b12N1L08l9p1J12k29K14n7k06J25r6N9l34M33k34J87j33n1RK29n6Q0P9n48
6635c80L77R5j96L88j56k44K38k81R7M2j32r4L58k69o0N32m69K02J06j1j15M2
6657G0j17Jk6J00j32rL60k76J19L28m87O3K4k0r2L53k84K12j06k58K87Q1o2j45
6681a6r6K50l16K60k10J95J24l39k2K86k70J07o3J56K4l19L19j31pJ4P2J97m13
6704a98J11M2K27k42J62j77j0J13j8l01k2K54N45l21k76O2J62j62K31j06rK20
6726B87j83p3N1M2Q4l32J06J12m91M05j79K12k28K34m45N68l20o4J2K64m3r9J14
6749C4j91J91k56R7K4O1J10Mk7PN8l22J36J09Mj44K2P5j43J74J8m8J85j86j43
6774a51Q9nL08j83l70K21J19J05k40k06K52L05k88l86L63k34L29k22L40m83P37
$$ plain form
6611 -212 -161 147 108 37 149 -80 134 77 -129 -4 -100 -41 -375 58 -176 11 -122 -173 -164 65 9 89 168 -380
6635 -380 -3 92 -104 284 128 -116 122 -159 -62 -20 -152 -246 112 -157 -217 315 -154 48 154 143 28 70
6657 70 -47 -46 -72 28 -104 -113 247 -29 90 418 -69 -6 18 -2 -94 259 -25 187 81 -177 110 191 129 -16
6681 -16 -112 138 -178 82 -128 67 191 -148 -170 116 -154 -47 -110 46 70 -249 70 -61 -68 -54 18 215 -198
6704 -198 -87 -45 182 -60 102 -75 -85 28 10 -291 -313 -59 486 165 -111 -49 113 -49 182 76 67 287
6726 287 104 31 82 124 208 -124 -18 94 -397 8 -171 41 -187 47 -398 170 -150 -214 -202 62 19 -80 34
6749 34 -157 34 -222 -125 -101 -40 70 74 47 54 112 -210 -74 35 39 -105 -83 -8 -151 23 41 -7 178 -8 -151
6774 -151 -62 -67 241 58 -312 -91 28 133 -107 -313 -61 244 -44 -430 -67 -301 28 -194 146 -337 400
6795D00l16m30N88m10K74P7l14L10k34p2j62QJ42K55j03M9n8L9J22m86O1K60l70
6818c70L50M8L8m37L87J71q5j32j90J02q0O6j11L65k62j41L76O3K3j36R5k17j0
6841h7J71J4j45k7j50L39mj06J65j47K17j72J21l38l3L48l20L28K5k97J07j32
6863a23r2J25L71r5k46q3nj51O03m97L52n5M9j11J35q7k42Q4n2J73O6L5k92L59
6887B21j83j1K79m97J37M8K24l8j65L4n4J9l88L95J10M6k33J96k68j1NJ95r8J41
6911A04L5L3j62J39k11K69l55J26R1p3K39k14Q2j50K99k45O8r1J18j18j8L98j28
6934B36m38M22j61PN1j16K8j59M66k21R8l24J65k35K22k30J31R2q5K3K4Q8J56
6957B40l46K2K55r0nj00J99k60j1j40K65J88k06L22n99R1J03J91k46k43L61r1
$$ plain form
6795 400 84 -346 242 -168 106 183 -131 179 -55 -127 -289 -281 -139 116 13 62 4 43 165 -321 -260 0 -370
6818 -370 -20 28 66 -371 16 187 102 -30 -220 -118 -198 -132 -243 122 -140 -281 95 158 181 45 140 -77 -87
6841 -87 84 98 -47 -74 -224 115 111 5 170 23 240 68 189 -149 -182 166 -154 174 199 -98 9 -123
6863 -123 -215 -90 281 186 -60 -143 -148 -299 304 -193 159 104 153 42 177 90 -152 -68 -120 53 119 154 -138 221
6887 221 38 27 306 -191 -54 -6 218 180 15 49 -5 14 -374 21 131 177 -56 140 -128 -139 -134 61 -37 104
6911 104 139 172 10 149 -62 207 -148 -22 69 -4 235 21 103 -47 252 7 75 -16 102 -16 -34 364 236
6934 236 -202 220 59 66 117 1 29 -130 336 115 213 -111 54 -181 41 -189 -58 34 -51 -28 -4 84 240
6957 240 -106 -84 171 81 76 -24 175 -85 -96 -236 29 217 11 333 -266 -175 -72 119 -127 -370 -9 -100
6979a00M1R0M4j44O6L9R0J75j10k91J13L8p5L10q7j13k72j9L2K11j33K19j47Q5
7003F2l17J95J36K2k40K97k13o4N17m60m9J33P8J1j80P4j1J04q2OK62l76P4K96
7027B75k66j94JJ07J17j78K64j60K50k56j48K53R5l53J41L15m20K37j6q7M60m39
7049bN3J29O4k46K35k60J30J35k80m22O98j02m58K82N3J81om42L44M7%o4k03J18
7073a6K0lJ28J72j51m09N11j35k52j74Q0M14k86K77k82l2J71q8pn3J26l7J41j16
7097ao8K45j64p2K43k87K74j98R9k68K42r3N5q6K11K43l59K26l47K22k43J04k33
7120b55J58M16n36K97N8k16N4k74K49O4k29K13j41N6K21j83N0J10j03J7L1k39
7142a82j53L80k31k2K55j11Jk16l00M27l5J64j96K10j38R9K17m6P4j86J10r8M2
$$ plain form
6979 -100 -59 31 75 -69 -3 36 126 301 191 -100 13 51 -24 286 199 86 -186 -205 -173 38 -95 124 -23 62
7003 62 -255 -60 76 98 -142 155 -58 -122 395 -65 -114 19 97 108 -72 2 -9 95 13 19 281 -95 -21 275
7027 275 9 -185 -184 -77 40 -138 126 -34 216 -40 -188 65 160 -193 -52 263 -157 80 64 -23 437 -2
7049 -2 51 180 244 -2 233 -27 103 238 -42 -464 234 132 -326 -44 9 190 184 -258 86 133 133 69 -134 -16
7073 -16 4 1 129 301 150 -259 252 117 -135 -309 -229 185 -101 176 -106 -138 33 -55 -62 -115 11 -26 115 -1
7097 -1 -69 176 12 -60 183 -104 170 -28 71 -197 45 -48 7 -79 132 375 16 242 -105 117 -126 -22 -255
7120 -255 -97 319 -217 80 138 -78 -24 -298 -49 15 -214 -1 -142 -86 135 -48 2 112 9 26 57 -182
7142 -182 -335 45 -186 -208 47 -64 -63 -279 -579 -152 -187 -23 -219 -9 -147 -48 169 123 197 11 121 23 65
7165F5k56J55n8j86j24M83k90K96m8q2J19j13k1l4J03N9J79j45j05k63N03j34
7187A03j35k5N3l84N1L66l57M81j76J39j53J29N9R3n03J98L49l45J62J94n44J68
7209g7K88m47M2L26LJ9q3k35J33J15L3j27J44q1k03K30m0J76n4j2J07k57L56k85
7233G1R6l45L11k91K43j64J17j03L70n10K88k46K75k20m6L05R1k00j07R2nk49
7255b27j07J47j9K75R5k95K58r2j62R8J54J1j45m7O1l1k7J3O9q4K90m09K51J23
7279B00l78J53LJ32k17K43j75K46q0k36K91l28O8n6M1lM13n42L43j27k44M00J08
7302B55m17n2M90n80L02N3k96K17j8O6j22J65j44J70p0o8q6k5K33J23l91K32m2
7325eJ20j67Q0J09o0l01K7R3J26m4J36Lr4k63J50J12j41Q4P3O4l3p4j37J16K19
$$ plain form
7165 65 -191 -36 -94 -280 -404 79 -211 85 37 -45 74 -39 -60 -94 9 68 247 102 -3 -266 237 103
7187 103 -32 -57 -4 -388 -337 29 -328 153 -23 116 -37 92 151 244 -259 -61 288 -57 105 299 -245 -77
7209 -77 211 -236 -194 132 135 154 71 -164 -31 84 117 -10 134 53 -150 80 40 216 162 150 257 0 356 71
7233 71 167 -178 133 -158 85 -79 38 -65 305 -205 83 -163 112 -108 -154 151 242 42 -65 27 22 -227
7255 -227 -334 -187 -206 69 164 -131 127 35 -127 -29 125 136 -9 -56 5 -26 -53 -40 29 -55 235 -174 77 200
7279 200 -178 -25 -22 110 -107 136 -39 207 127 -109 182 -146 -78 -134 -93 -96 317 -225 118 -9 -253 147 255
7302 255 -162 -214 276 -304 -2 51 -245 -28 -46 20 -102 63 -81 89 19 -49 -135 -160 73 196 -195 37 -5
7325 -5 115 -52 28 137 77 -224 -197 -104 22 -22 114 117 23 -240 -90 22 -119 -35 38 102 69 -5 -142 -26 193
7350A93j52k01K43j71m1j0K23l86N67k36j17N6k16L90J74m51no3M30o77N73k44
7372a21J08N9q7J30m1Lk50J19K45k21J00M08l09K6l04k09L17J07J77k96J37j84
7394h6K74q5j42J0k55L04n1K98n58M52LJ47n55M65k86J33j52J73Q0kk68P1J67
7417A37r9J04R8j85l19P5J87L73l93k7N7n8K89j04J97o15M01j46K5Q9r8J30lO7
7441A82k47J8L50q9k38J8J3j25J07Q2j39m1J93k53M3K45l1j78OR8k37L11j10K27
7465B05j75j01L8Q5k51M35Q2l33P1N9Lr2j06j0J1J32j0k22Q1Q4J13q0k04K63o9
7490Ip2L45n07J1J83J37j76l7o8J25r4J72J51n9K01k72q2PQ0j99J18j55K97k2
7514I3k22Q0J88m0K4o8L9j60l51M60l36L35k44J63J63p5k59K25p3j27N4K89j70
$$ plain form
7350 193 41 -160 83 -88 -129 -139 84 -302 265 29 -88 -32 -248 142 316 -135 -140 -203 227 -450 123 -121
7372 -121 -13 46 -41 89 48 51 -199 -80 165 -56 44 452 143 169 -135 -344 -27 80 257 -39 98 -86
7394 -86 188 103 -39 -29 -284 20 -31 267 -291 161 164 311 -244 221 -65 68 -84 89 169 167 -101 -30 137
7417 137 38 142 240 55 -264 -189 -2 371 -22 -49 8 -50 239 135 332 -283 118 -28 -3 86 -12 118 115 182
7441 182 -65 -47 303 214 -24 -6 7 -118 -11 71 -68 -109 84 -169 -126 119 88 -90 -84 14 -223 88 -22 205
7465 205 30 -71 -33 52 -199 236 318 -15 56 115 118 26 -80 -90 -79 53 43 -179 -98 -14 99 19 -185 78 9
7490 9 -63 282 -225 -214 -31 106 -70 -107 -175 -50 -144 28 179 120 321 49 -33 -26 54 -145 -27 -182 115 93
7514 93 -129 -49 139 99 123 55 94 -66 -417 43 -293 42 -202 -39 124 49 -210 15 -58 -185 -131 158 -12
7537a2L9j00j72J63K68K41n14L63j56j74J22j98P6K56o30L06K0J05m2N9J09r3
7559C6j34k16N18m99K69N4j65K44j12R6J33k82J27k41K86j69k12L60M3l79K44
7580AL29k75k03Q7k81K67nnJ67r4o6p1K95L9m13K40J78j19r9Q0O1j22K72k29J25
7605A59j45Oo2j08L19j54n4K07l3J80l43JJ02p2K19l46P0n7N5R4K17r3m1L05j57
7630B69l82K20J30l59J62N0J23k32k06J17K51R8k05K3j05R4q0L40k65j78K49J66
7652B80l80K18j92q0K41j19J99l7n15L46K24l50K71P6l58J56J07o3j12R5j93O2
7674a24K95l56L61j83k7l9L14L0j38m4j53l7K37k85K24j92R08p53j87M0K02p1
7696B2J29m19N44j35rk5J18j53Qm76J44P44o95L09J69l51jj14j35O39n8k78M17
$$ plain form
7537 -12 27 -73 -245 -82 186 427 -87 276 120 -54 68 -130 -54 202 -428 -122 -102 3 -39 20 129 36
7559 36 -98 -314 204 -295 -26 28 -137 107 -5 91 224 -58 69 -172 114 -55 -267 93 136 -243 1
7580 1 330 55 -148 -61 -342 -75 -80 -85 82 -12 -78 -149 146 185 -228 12 190 71 -28 52 113 -9 263 34 159
7605 159 14 20 -42 -150 169 15 -39 168 135 315 -28 -27 75 3 222 -124 -54 -111 -56 38 255 162 121 426 269
7630 269 -113 107 237 -122 40 90 213 -19 -225 -108 143 241 36 59 -46 48 -32 308 43 -135 114 280
7652 280 -100 118 -74 -154 87 -32 167 130 -385 -39 185 -165 106 182 -176 -20 87 24 -88 7 -186 -124
7674 -124 171 -185 176 -7 -34 -73 241 271 133 89 -64 -101 136 -149 75 -117 791 38 -149 -109 93 22
7696 22 151 -268 276 141 132 107 225 72 80 -396 -252 492 -203 106 275 -76 -77 -191 -326 313 255 -23 394
7719C94n44j46lK28p8N2K6j18K72k09J52J62k6J22l63L5K11l22K55k02m3p5L22
7742A02j81k7R4RR5J58k38K88j8k70l76K74J9N3k3j93M0L77p4j58K82l91J31l6
7766f3K60l07o1N22k78j51lK80l19P9R8Pj80K47k61K85m9n98M43J3N5J22k76k0
7790a55j5K67J49J2j79j36K40k71J50J88l76R6K23j90k70L25o6L89m49j29J90
7811gmq4k5J41l9l64K87L3O5j17j30L50J65j05Nl32L17n3J29qm16L07j64K34o21
7836d36K59l6J86j1Jmj57L81k82l6L48j78Q8j85j46k3O2K13L4k75q0J77K79q4
7860I5k77M60n39J51K3O1j57J63J62j92l6k4Q4l8OQ5J54j67J7j64J30j48J61L1
7884D1j76K17p3j56J65j40J56p1K67k46n9K92m0j93KR7k90Q1j39K33L5j78q3J88
$$ plain form
7719 394 -150 -296 -299 -71 -149 -97 -71 -189 83 -126 26 188 162 284 -79 -44 167 -155 100 -102 -145 -220 102
7742 102 -79 -106 -12 -3 92 250 12 300 282 12 -364 -90 -71 -18 -41 -234 -194 183 109 -49 233 -158 -27 -63
7766 -63 197 -110 -171 351 73 -78 -81 199 -120 -41 57 64 -116 131 -130 155 106 -492 -49 -36 19 141 -135 -155
7790 -155 -170 97 246 258 79 -57 183 -88 62 250 -126 -30 193 3 -267 58 -8 381 -68 -197 -7
7811 -7 -11 -95 -120 21 -18 -382 -95 -62 3 -114 -244 106 271 166 171 -161 156 103 232 224 -192 115 -49 185 -436
7836 -436 -177 -213 -27 -38 -37 -41 -198 183 -99 -135 213 35 123 -62 -208 -231 -169 44 78 -197 -277 -100 179 95
7860 95 -182 278 -261 -110 -87 -26 -183 -20 142 -50 -86 -110 -26 -64 -58 27 181 14 31 -133 -3 -151 10 41
7884 41 -135 82 9 -147 18 -122 34 -37 230 -16 -75 217 177 -16 -14 83 -207 -126 -265 -32 3 -175 -258 -70
7908g0Q4J12K4k72j43M46j14j33K60m80K85j40K90j47J40k59J35j37j97J54K29
7929F7k6PN5k23J41NQ3j43K48j68k47L06K20l95J1L1j58M04j81M7J35J35j29j94
7953C1j37r2J92j1J79j00P7K5j28j40j71J81j41M1N1L33o3K7J85l23j69K20k36
7976a69J88j57N50k53r8j04J12N5J09l69j93L22j78K92j09K4K09k2m38K58J47
7997A76q6k16K39j37l7J20J24j8l85K28k1k57K57j77N5K25l9P7j14l19L96k32
8019a41J49j65K44k92J87J73k57J29j1k63J37J63K11m7k01R7l50K82J14m37K16
8040f2n0R2Q2K01k65j8j27j6J17J61j48L8K5k8J52r5j67p0M28k14J85k89J16O6
8064A14j67N2k53L74J82l68k1Q3O2R7l24K0L19k84K56r3j24J97n7j59R1K04q6
$$ plain form
7908 -70 14 126 150 -122 -265 181 67 -66 194 -286 -1 -141 149 2 142 -117 18 -119 -316 -162 67
7929 67 41 48 103 -120 21 26 109 -34 214 46 -201 105 325 -70 -59 -28 -186 218 37 84 219 354 225 31
7953 31 -106 -198 -6 -17 162 62 139 164 36 -104 -275 -94 -235 -194 -143 190 127 154 339 16 -153 67 -169
7976 -169 19 -138 412 159 61 -43 69 124 233 -136 -329 -7 -185 107 -2 22 231 209 -229 29 176
7997 176 90 -126 113 -24 -61 59 183 165 -220 8 -13 -270 -13 -190 -135 90 51 128 14 -305 91 -141
8019 -141 8 -157 87 -205 -18 155 -102 27 16 -247 -110 53 264 217 16 113 -237 45 159 -278 -62
8040 -62 -112 -20 62 263 -2 -20 -147 -163 -46 115 -33 5 30 2 154 59 -108 -178 250 36 221 -68 48 114
8064 114 -53 -1 -254 120 302 -66 -87 -4 58 155 -169 -149 170 -114 142 49 -75 122 65 -94 -3 201 115
8087A15j89R3M9j5o2K03k61L01k79J59r7j61J71L4j37k65k9K43K53R0k06p9J30
8110F1j29JK0k67N67J15l88l9l5K81j32k9m5J9j02K83m62K64K69k65j28OJ49O2
8134G6k09qJ62j74l15N79l24J81M0k59J74N9j16L13m00J4K30k20o9l5K30K04k35
8157a02R5M8k31M83j16J7k91K37j21k2J95n8j11M8j87K09j43J73J45j19N5l71
8179a67L19o3k72p9L51o3j12J22j09K14j11L3
$$ plain form
8087 115 -74 19 68 53 -9 194 -67 234 -45 114 17 -144 27 61 -76 -341 -370 -127 126 216 10 -69 61
8110 61 -68 -67 -47 -314 253 368 -20 -59 -94 187 55 26 -19 0 -102 181 -281 -17 252 -13 -141 -135 14 76
8134 76 -133 -141 21 -153 -468 111 -213 -32 8 -251 -77 -18 -134 179 -221 -207 23 -197 -266 -301 -71 133 -102
8157 -102 -7 41 -190 293 177 194 -97 140 19 -3 192 134 23 71 -116 93 -50 123 268 149 204 -167
8179 -167 152 89 -183 -262 89 26 -86 36 -73 141 30 63
8191F3
$$ Imaginary data points
##PAGE= N=2
##DATA TABLE= (X++(I..I)), XYDATA
0@%%%%Pj4J4j5K2k8L5m9N6o3Q4j05J20j42J72k04K37k80L26l72M30m97N66o42
28c42P30q24R27j044J174j314J464j632J819k019K241k489K754l046L376l738
44a963M137m587N097n672O329p090P984r051J0349j1971J4058j6862K0860k7047
58a5429L7974o2855K14687K3739m61723J16787K08089J33877r4207l23407r751
69b32219M48215Q598l57120o2506J81630J63276L1489l03694j33354L60628J58326
80B63269k96040j53700Q8454J86616J18323k38310k44815K55809K54544j53006
90H1144j97641k6444J50128K08684j36732k98325J03374K63659k3362j66106j15225
101a56846P8941K45337k5024k86121q991K28647P7854j07415j77985j2881K52351
$$ plain form
0 0 0 0 0 0 7 -7 7 -8 14 -14 21 -28 28 -35 49 -56 64 -78 94 -110 127 -153 173 -199 231 -266 300 -342
28 -342 388 -436 491 -553 621 -693 771 -861 958 -1061 1180 -1309 1445 -1601 1775 -1963
44 -1963 2174 -2413 2684 -2988 3341 -3749 4235 -4816 5533 -6438 7620 -9242 11618 -15429
58 -15429 22545 -40310 174377 198116 -263607 -146820 61269 195146 100939 -222468 -232219
69 -232219 215996 224594 -132526 -195032 -13402 149874 181363 -122331 -255685 104943 263269
80 263269 -32771 -186471 -98017 88599 206922 -31388 -276203 -20394 234150 81144
90 81144 -116497 -142941 7187 215871 79139 -219186 -115812 147847 124485 -41621 -156846
101 -156846 -77905 167432 142408 -143713 -152704 75943 153797 46382 -131603 -144484 107867
112A07867Q0325k54668j16765J56910J49763l483j87438j19818K11607J77276
122B01576j68265j72242M9635J49731R1033j45386j97024J31873K21949p6394
132H6486j80756l0228J25361J60194p6847k42963M0141K37778J4914j61900j10477
143a38297N8120K04722J8684k44895o0035K02292R8361r2171j45002k4189J91811
154F9401J01159j99788j31099J36309J33127k3916j43384r3236J57658J66877
164A73108j36992j74245O3018J46501N3311j16117j60638Q8252K05242m9899j80687
175h9146k1780J14248J13463m6527j84759M667K00940K8795j48071p5724N7632
186d6262J34939K0981j81188o8590J72474Q9806r7970j09493n259J35630R4624
$$ plain form
112 107867 188192 -66476 -183241 -26331 123432 119949 -67489 -187307 24300 201576
122 201576 33311 -138931 -89296 60435 151468 6082 -190942 -59069 162880 86486
132 86486 -94270 -124498 863 161057 84210 -158753 -118612 119166 134080 -27820 -138297
143 -138297 -80177 124545 143229 -101666 -161701 40591 138952 46781 -98221 -122410 69401
154 69401 170560 -29228 -160327 -24018 109109 85193 -58191 -151427 6231 173108
164 173108 36116 -138129 -75111 71390 124701 8584 -152054 -63802 141440 91541 -89146
175 -89146 -110926 3322 116785 70258 -114501 -109834 91106 119901 -28170 -103894 -46262
186 -46262 88677 109658 -71530 -140120 32354 122160 24190 -85303 -90562 45068 139692
197A39692j45930j33404J11510J29035l0246j09592p3176R4471J46174q0172j60681
208a12319M2739J28273K9182p8014j11996M1108J66457j6123j64226j9082J07274
219A3273P5431l4735j37017k1351J67097N3557j37892p4923O0978J02511K5862
230I2791j28405q4019J27940J02256q5348r9805O347R5250P5684r2962j24133
241a14404P9610J27337l3349j00807m1992P0062J15130m7100j48807J9611J29177
252E4468K4880p6913q3881K3314J32940J4719j41412l7889J00982O3282l3444
263D1046r5999k8761J19736O3844j12548p5736O3563Q1002J0539q9903p4380R4438
275c159J04184p2098r9427J5438Q0163N5454o3328j10613M7649J22591j8417r6227
$$ plain form
197 139692 -6238 -139642 -28132 100903 70657 -38935 -112111 -17640 128534 48362 -112319
208 -112319 -69580 58693 87875 9861 -102135 -61027 105430 89307 -74919 -94001 13273
219 13273 88704 53969 -83048 -104399 62698 116255 -21637 -96560 -35582 66929 92791
230 92791 -35614 -119633 8307 110563 25215 -74590 -68243 27007 102691 9729 -114404
241 -114404 -34794 92543 59194 -41613 -83605 -13543 101587 54487 -94320 -74709 54468
252 54468 79348 2435 -81446 -58132 74808 89527 -51885 -89774 11208 74490 41046
263 41046 -54953 -83714 36022 99866 -12682 -88418 -24855 56147 66686 -23217 -97597 -3159
275 -3159 101025 28927 -70500 -55062 25101 80555 17227 -93386 -45737 76854 58437 -37790
287c7790k8484N4427Q4565k0036j20101k636J16425K5417p6617n9198K0621R6361
299E2954K2940j14678m7484R6089O2349m2001p6053k1944R0387O7578q8323q3588
311h1774N5013P7627J716o8513o0485O1857R5183m7259r5320J5466P2219L5927
323F1657m6123q4985K6455J07093q642r3694k2156N4190O3379j1730r7047j5835
335f7438J03589L3312p3811m9246J9765P0941K8664q7867n5424Q0403O0246m3305
347A9829n8145j1921O2288O1386o4413q1770N0006P4625j0972n6954m3037M0387
359a8691Q5476k9406r5307J0436P4833K2575l6859o2765O295R1212J1327q9887
371c0761k4167N5334M2502j0106o7616k5421Q1937M3880o9229m8383L0842N3700
$$ plain form
287 -37790 -66274 -11847 72718 52682 -67419 -70055 46370 71787 -4830 -64028 -43407 52954
299 52954 75894 -38784 -86268 9821 72170 30169 -45884 -67828 22559 90137 1814 -81774
311 -81774 -26761 50866 52582 -15931 -76416 -14559 80624 33365 -61955 -46489 25730 61657
323 61657 15534 -69451 -42996 64097 55455 -38239 -60395 -6205 57174 45444 -51603 -67438
335 -67438 36151 69463 -4348 -53594 -33829 37112 65776 -22091 -77515 2888 63134 19829
347 19829 -38316 -50237 12051 73437 9024 -72746 -22740 51885 40913 -16041 -59078 -18691
359 -18691 66785 37379 -57928 -47492 27341 49916 13057 -49708 -43413 47799 59126 -30761
371 -30761 -54928 406 42908 32802 -34814 -60235 21702 65582 -3647 -52030 -21188 32512
383C2512J8448o1240n5852N9942O7967m0417o1385r50M8746M6676l8900p4266
395e8719K8897P6110o942n5420k7430K9647O1899j1654q0982j955P1104J9218
407D3773m0008m4142N793O9913J8941p6571l0764N5384L9717j6154n2443k4145
419e0706O1558M7217n7010n1151L1018M6948J1063m2737m8188M1146O5010l1980
431B2188n9835N359M1786L1775k6187o3154J5777P3130k842n7187j7929K8052
443i067M6345j426o8155j4231O6386K2599m2415l3804O633M8951K3916n7696l7419
456d9383N0299M0004k2747l9848j4934M1502M3831m1941n4426K8572M8536K85
468B9750l5871l4078K6146N8571j7344o0531J878M4295K1133k1733m7486L897
$$ plain form
383 32512 50960 -10280 -66132 -6190 61777 21360 -40025 -40975 7771 54447 15547 -58719
395 -58719 -29822 46288 39346 -16074 -43504 -13857 48042 36388 -44594 -46549 24555 43773
407 43773 3765 -40377 -34584 35329 54270 -22301 -53065 2319 42036 25882 -26561 -50706
419 -50706 10852 58069 1059 -50092 -19074 27874 38937 -3800 -51988 -10842 54168 22188
431 22188 -37647 -32288 9498 41273 15086 -48068 -32291 40839 37997 -19190 -37119 -9067
443 -9067 37278 35852 -32303 -46534 19852 42451 36 -33768 -27135 21816 45732 -11964 -49383
456 -49383 916 40920 18173 -21675 -36609 4893 48724 6783 -47643 -19071 29465 29750
468 29750 -6121 -40199 -14053 44518 27174 -33357 -31479 12816 33949 12216 -35270 -31373
480c1373O0982P876n4526j8637L1494L4159k774m9328j7999N4168K8341m1579
492H04l4241J2857L9337J8130m3392l8235L9903M3335k0901l8863q089L2791L6084
505C9520k8104n0411J8171M7234m55l3737k4771J9898M7154r022n3840j379M3297
518A3555J7100k2612l6106J582M9875J1832m9620k0279L1647K9434m774l8484
530a6850j8441M3896K9872l5834l2816J4279L1947J3094l2924l4249L0557M2103
542C4634j9106l7044k335K7635K8237j9982m5488J2323M6789p69l3521j8314J5868
555a1073L7814j735m7648p468M1927J6303k2874k7562J68L8536J6100m2146k3406
568c3064L1471K6172r153k8983j5436L2835L1367l0440l4456J6262L0162O576
$$ plain form
480 -31373 29609 37485 -17041 -35678 -4184 29975 27201 -22127 -40126 14042 42383 804
492 804 -33437 -20580 18757 36887 -6505 -44740 -4837 38498 17597 -21266 -29355 3436 39520
505 39520 11416 -38995 -20824 26410 25955 -7782 -32553 -12655 34499 25477 -28363 -29742 13555
518 13555 30655 8043 -28063 -26481 23394 35226 -14394 -34673 -3026 26408 21634 -16850
530 -16850 -35291 8605 38477 2643 -30173 -15894 16053 29147 -3777 -38026 -7469 34634
542 34634 15528 -21516 -23851 3784 32021 12039 -33449 -21126 25663 24894 -8627 -26941 -11073
555 -11073 26741 25006 -22642 -30110 11817 28120 5246 -22316 -22148 16388 32488 -9658 -33064
568 -33064 -1593 24579 15426 -13557 -28993 3842 35209 4769 -29687 -13425 16737 23313
580B3313k4801k9421K0235M1544j3554l8495n23K6421J9998j3057l7212L975M3146
593B1569L536l4781j4248J6966K7779M58l8458j2175L8567J8635k5688k2795L753
606a6882K9427J5607l2379k7040K7255K8804j1240k6351j0478K4081K8378k1209
618G973l5270J3206L1380K078k1787k1662J3348L5859o577l7812k220K8010J5072
631B1598j3073k8796L9L6847Q608l3506j4995J8825K2410k64k9483j4423L1380
644E167K1409k3939k2878P309K3436J2114k4049k5295K1106K9208j1659k5106
656a3177n575J9807K2511j4402l2842Q902L1271J921k2280j6184J1384K8273j952
669A7657l3115n528K7199J3334j3662k2321o43K9103J0972k8614j6853J8910K0133
$$ plain form
580 23313 -1488 -30909 -10674 30870 17316 -21179 -21702 4719 24717 11660 -25552 -21577 21569
593 21569 25105 -9676 -23924 -6958 20821 21279 -17179 -29354 9213 27848 2160 -20635 -16882
606 -16882 12545 28152 -4227 -31267 -4012 24792 13552 -12799 -23277 804 29182 7973
618 7973 -27297 -14091 17289 19367 -2420 -24082 -10734 25125 18548 -19264 -21484 6526 21598
631 21598 8525 -20271 -20232 16615 25223 -8283 -23278 -4453 17957 17693 -11790 -26213 5167
644 5167 26576 2637 -20241 -12932 10504 22618 -1431 -26726 -5620 23588 11929 -13177
656 -13177 -18752 1055 23566 9164 -23678 -14776 16495 18416 -3864 -20048 -8664 19609 17657
669 17657 -15458 -20986 6213 19547 5885 -16436 -17079 12024 22996 -5618 -22471 -3561 16572
682A6572k836k3130j2768K4364K1908j9521k3830P634K1837Q950j9682k2038J5273
695g267K7947p902k5597l937J7817J8531j0653k8389M287K9504L685k1968j3716
708a7658R738K4113N17k9240q087K5923J3631j3826j9742n05K4802J2155k5178
721c357j8303J8109K0028m690k0074j1149J9859K1840j6950k4224Q058K1022N858
734A6027j5544k0190J1282K7635o402k5998j850J7075J3785p372k4658P64K8140
747A2694M656k2088j1027J0322J8384J994k4325j0479K4039J4232j5628j5966
759a3192J541J8101J1903j9312j9238J6306J9724o395j7185p566J4484J9355j1731
772F795k4166O379K1033L513j4074j4901P295K3040j262k4724m080J7927J1306
$$ plain form
682 16572 13736 -9394 -22162 2202 24110 4589 -19241 -11607 10230 19180 -502 -22540 -7267
695 -7267 20680 12778 -12819 -16756 1061 19592 8939 -19450 -15163 14341 18026 -3942 -17658
708 -17658 -7920 16193 16710 -12530 -20617 5306 18937 5111 -14631 -15136 9666 21821 -3357
721 -3357 -21660 -3551 16477 11787 -8287 -19436 423 22263 5313 -18911 -10853 10169 16027
734 16027 483 -19707 -8425 19210 12808 -13190 -15040 2035 15820 8448 -16210 -15446 12694
747 12694 17350 -4738 -15765 -5443 12941 14935 -9390 -19869 4170 18402 2774 -13192
759 -13192 -11651 6450 18353 -959 -20197 -3891 15833 9438 -7747 -15313 -829 18526 6795
772 6795 -17371 -10992 10041 13554 -520 -15421 -8126 14914 13652 -11072 -15152 2775 14081
785A4081p479j8922k413K3767Q488k0963j2147J1479J5321J501j8876j1797J9809
798A849J5803j3855j6749K968J6027R199j4542j8617J1969K1164n482j7676n143
811a3085J1925J6540p562k2752L214K1493L311j4425j1864O047J9308J508k2889
824i231o037J8402J0337q672j5429k414J9619J0179j9326j3135J1730J4862l55
837A0530j5374j0641J5001J7488j2268j7986M128J4665P140j1081j6955Q438K0648
850A3733l708j8110l353J1421J2654n254j9580m43K1307M611j5136r840N464J5950
864I716K927j9108q571J7466J0939r263j3180j668J5186J0556j5455j4546J1276
877c725J4645k549j2732q289J1142J6146q960j8098L665J5007M328r616j3533
$$ plain form
785 14081 6602 -12320 -14733 9034 17522 -3441 -15588 -4109 11212 12713 -6163 -17960 1849
798 1849 17652 3797 -12952 -9984 6043 15242 700 -17917 -5948 15216 9734 -7942 -13085
811 -13085 -1160 15380 7818 -14934 -11720 9773 13084 -1341 -13205 -7158 12150 13658 -9231
824 -9231 -15268 3134 13471 4799 -10630 -13044 6575 16754 -2572 -15707 -3977 10885 10530
837 10530 -4844 -15485 -484 17004 4736 -13250 -9122 5543 12683 1602 -15353 -6915 13733
850 13733 10025 -8085 -11438 -17 12637 7383 -12197 -12640 8667 13278 -1858 -11698 -6234 9716
864 9716 12643 -6465 -15036 2430 13369 4106 -9074 -10742 4444 15000 -455 -15001 -3725
877 -3725 10920 8371 -4361 -12650 -1508 14638 5678 -12420 -8755 6252 10580 964 -12569
890a2569N082J9244r89j8298l573J1766J0222m105j6550j583J8049O267j4856
903a893r684O943J2898K406j5084r483J4696J2346r369j2696K27J2252R211j1675
917A095j4843Q857J5517k850j2406o085Q856J3831n246j7703J919J5211M059r621
931E91j1182L637J6277J275j7037m758J2214Q858m292j2995l060J5672P604j3863
945a059j0396P487J1367J756j2510r000J2112J2679q399j2816J275J0756P378
958A0630q537j3977O172J5434k112j2505m401P629J1755l333j6091m22J5615M282
972A0139j0198q990L076J3095L058j4923o561J1971Q834n169j0907k370J2205
985C260Q838j1753j1213P298J0840J69j0051q051Q767J3063o079j3691J349J0990
$$ plain form
890 -12569 -7487 11757 10768 -7530 -11103 663 10885 6780 -9770 -11353 6696 12963 -1893
903 -1893 -11577 -4634 8264 10670 -4414 -13897 799 13145 3776 -8920 -8693 3559 12770 1095
917 1095 -13748 -4891 10626 7776 -4630 -10715 -1859 11972 6726 -10977 -9058 6153 10212 591
931 591 -10591 -6954 9323 10598 -6439 -11197 1017 9875 5583 -7412 -10472 5200 12804 -1059
945 -1059 -11455 -3968 7399 9155 -3355 -12355 -243 12436 4037 -8779 -7504 3252 10630
958 10630 2093 -11884 -5712 9722 7610 -4895 -9296 -1667 10088 6755 -9336 -9758 5857 10139
972 10139 -59 -9049 -5973 7122 10180 -4743 -11304 667 9501 4332 -6575 -8945 3260
985 3260 12098 345 -10868 -3570 7270 7439 -2612 -10663 -1896 11167 5088 -8603 -7254 3736
999C736N279o891j1866L554J4751l18j2729m238P839R344k401j3262k052J3782
1013D528N277j0037q094L545J0842K915j2081p765J0725R505n559r961j875J0433
1027B398Q327r571j1280O085J1264k53r229o720O870J1928m648j3111N46J0868
1041C474M855o711r922K551J3085R56j2558m495Q208P973j990j1167l381J2656
1055C534O089r604q295M226R130K844r802q042R146R866n636r543n10Q485O954
1070H842o782j1179M470J1495k48r147n265N748J0058k587j2113o75J1015M155
1084G787o839q013J686J1276K071j1135n391Q110P383k592q733l657J0172P032
1098I157q677q599M613Q401K144q421p151O737J0176m439r671n49P592O097n057
$$ plain form
999 3736 9015 2124 -9742 -6188 8563 8245 -4484 -8722 -883 8461 6060 -7202 -9254 4528
1013 4528 9805 -232 -8326 -4781 6061 8976 -3105 -10870 -145 9360 3801 -6160 -8035 2398
1027 2398 10725 1154 -10126 -4041 7223 6970 -2259 -8979 -2109 9819 5171 -7940 -7394 3474
1041 3474 8329 1618 -8304 -5753 7332 8288 -4270 -8765 -557 7416 5426 -5741 -9122 3534
1055 3534 9623 19 -8276 -4050 5080 7924 -1878 -9920 -774 9092 3456 -6087 -6597 1888 8842
1070 8842 2060 -9119 -4649 6846 6598 -2549 -7814 -2066 7992 5405 -6708 -7383 3632 7787
1084 7787 948 -7065 -5379 5897 7968 -3167 -8558 -448 6935 4343 -4390 -8047 2125 9157
1098 9157 480 -8119 -3506 4895 7039 -1382 -8533 -1796 8380 3941 -5730 -6279 1313 7410 2353
1113B353j0072K662J1225K88q974m120M710Q101n72j0868j799J0028M116o554
1127E24o330J247R132K979r729o150Q070P365l687p416k681P406P635p081q717
1142g433L746Q313R44o460o238M774R785k996r923q1O868N044m162q589J093J0341
1158E026J476r199l994N624O516l71r074l362R305M995o243o309J642P319L239
1173F590p715o318O151P628k815p342k123O380O479n070q634K967Q308Q06o335
1188a043n051L748Q750j669r421j220P553M068l958p165O96Q637K330q267m091
1203f103N188N748m79p665l185P797N647o207o232K055O360K832o584n971N469
1218a330P437k897o952j061N099N803l742q131J821Q128L29n801l604K999O896
$$ plain form
1113 2353 -7719 -5057 6168 6456 -2518 -6638 -1928 6173 5601 -5267 -7066 2962 7078 524
1127 524 -5806 -4559 4573 7552 -2177 -8327 -257 7108 3421 -3995 -6676 730 8365 1284 -7433
1142 -7433 -3687 4626 5570 -890 -7128 -2354 7431 4435 -5488 -5569 1299 6343 2181 -6408 -5315 5026
1158 5026 6502 -2697 -6691 -1067 5449 5078 -3996 -7358 1947 6942 699 -5610 -3968 3351 6590
1173 6590 -1125 -7443 -1292 6336 3521 -3821 -5944 436 6915 1845 -6789 -3822 4486 5292 -1043
1188 -1043 -6094 -2346 6404 4735 -4686 -5906 1647 5715 1757 -5408 -4712 3925 6255 -2012 -6103
1203 -6103 -915 4833 4354 -3311 -6496 1301 6948 741 -5491 -3436 2924 5756 -828 -6799 -1330
1218 -1330 6107 3210 -3742 -4803 296 6099 2357 -5774 -3953 4175 4504 -1297 -4901 -1902 4994
1233D994n10q350j570P244L419l817n996K41P524K980p588m915N616N239o27o163
1249b279l253O092N706m981o688K206O179J696m756n451L501P502j912o960j165
1264d563N016M501k866o956N60Q289J110o176l695L132N984J00p312k441O728
1279A411L607l806n200N04O004K875o111m739M244N345q29n625k075M848M811
1294E264l697o860K374N779J182m286m752K823P016j106o994j072N218L519k268
1309B140o167K12O660J946o109l340L248M994j54n971k291N719L852l997m633
1324c891J017N058K602m927n419M404N675j678n446j488M247M759k897o340J093
1339c231O161Q92m193l963K156O221l55o552j270N141L174k361n149k18O055K523
$$ plain form
1233 4994 4484 -3866 -5436 1808 5227 1410 -4586 -4345 3179 6159 -1429 -6344 -728 4511 3884 -2279
1249 -2279 -5532 560 6266 1285 -5403 -3197 2982 4678 -78 -5529 -2028 5474 3562 -3398 -4563
1264 -4563 453 4954 2088 -4868 -4308 3981 5091 -1085 -4780 -1648 4336 4436 -2876 -5317 1411
1279 1411 5018 1212 -3988 -3484 2520 5395 -716 -5455 -1211 4134 3305 -2320 -4395 453 5264
1294 5264 1567 -5293 -2919 2860 4042 -244 -4996 -2173 4843 3737 -3257 -4329 889 4408 2140
1309 2140 -4027 -3815 2845 4791 -1318 -4658 -1410 3584 3430 -2541 -4832 887 4739 742 -3891
1324 -3891 -2874 2184 4786 -141 -5560 -1156 4519 2841 -2605 -4093 154 4913 2016 -4324 -3231
1339 -3231 2930 3822 -371 -4334 -2178 4043 3688 -2864 -4134 1007 4181 1820 -3329 -3547 2508 5031
1355E031o007l729L436M419J00n035k954N160M274l164n292J124M396K318l964
1370A13m678K872N753j275n512j160M003L709j843n466K82N915R98m675k880J979
1386a865M988N79o124j773N088L360l064l827o77N029K765m577m187L136M478
1401C329o14m387k110L502M702k654n057Q07L859K200l164m520J864N663n54n044
1417b178j283L705L506j823m855p09N900J464l966l287K152M264N98n066k674
1432d252M822L469k551m276r4M246K830m305m216K874M424j95m246k155L293M469
1448D137k372m935M12M783J019k954l754J205N722k72m941j496L764K994j545
1463A767m357p15M950K343m397l091J908M031O70m375k774M074L716k347l989
$$ plain form
1355 5031 -976 -4705 -1269 3150 3250 -1785 -4739 421 4695 1531 -3761 -2637 1759 4077 113
1370 113 -4565 -1693 4060 2785 -2727 -3887 116 3825 1982 -3484 -3202 2713 3711 -964 -3844 -1865
1386 -1865 3123 3702 -2422 -4195 893 4253 1189 -2638 -3315 1714 4479 -98 -4285 -1149 3329
1401 3329 2715 -1672 -3782 -280 4422 1768 -3289 -2482 1377 3577 413 -4107 -2243 3420 2866 -2178
1417 -2178 -3461 244 3750 1927 -2928 -3637 2263 3727 -239 -3526 -1374 2890 3488 -1578 -4252
1432 -4252 570 4039 1488 -2788 -2882 1364 4194 -111 -4327 -1453 2971 2776 -1470 -3625 -332 4137
1448 4137 1765 -3170 -2758 2025 3044 90 -3664 -2459 3263 2991 -1950 -3446 318 3312 1767
1463 1767 -2590 -3305 1645 3988 -409 -3500 -1592 2439 3109 -1266 -4040 34 3750 1403 -2586
1478b586L6L847K180l307l909K272M363p47l498j967K794M189j594n394J68M984
1494A831J076k953k736R60M531M52m685j851L386K690j084l725r98M299K497l598
1510I2l549K449L604r1l414k462K900M234k415m130L79L348K357k564m316J689
1526a889M495J19m451j317K698L276r16m371q65M862J274k789l255J565L718Q98
1542C052m199k254L368L033j574l483q37L744K720l238l914K214L617K04l122
1557f69k418K461M032j772l924l80L819J537k259l338J009M530J29l884j605K511
1573b21L078q20m230n64L989J993l210k805R86L659P81l372k883L577K897j717
1589A138k883p19L123K192k272l512J681L347L15l375j965K283L525j038m233
$$ plain form
1478 -2586 -2550 1297 3477 170 -3739 -1467 2896 2149 -1349 -3316 -522 3667 2073 -3321 -3153 1831
1494 1831 2907 -46 -2782 -1822 2709 3161 -1524 -3375 11 2701 1617 -2108 -3106 1193 3690 92
1510 92 -3457 -1008 2596 2505 -909 -3371 -471 3763 1348 -2782 -2403 945 3302 738 -3578 -1889
1526 -1889 2606 2725 -1726 -3043 -345 2931 2015 -2356 -3221 1641 2915 126 -3129 -1564 2154 3052
1542 3052 -1147 -3401 -33 3000 1426 -2057 -2894 850 3570 332 -3582 -1368 2249 2453 -669
1557 -669 -3087 -626 3406 1634 -2290 -2670 1149 2686 427 -2911 -1902 2628 2757 -1127 -2732 -221
1573 -221 2857 2037 -2193 -2757 1232 3225 15 -2790 -1804 1855 2636 -736 -3619 -42 2855 1138
1589 1138 -1745 -2464 659 2851 579 -2933 -1252 2095 2410 -965 -2930 -647 2878 1840 -2393
1604b393Q6K772K320k025l144N46L828O74l637j889K662K335n08l257j235L862
1620I97K029k828l009J069L374P88k912k642K842L597j767l576l93L119K176j948
1636I16l524O52L851L87l225j459J749L067m48m325l12L781J465j937k776L33
1652a805L224J294l501k042K596K661q99l200p62K824K281k146l348J210L267
1667A654Q22k685k403J723L413p43l449j66K324K152j941l397O87L853L33l221
1683a044j369J578K812P2l772q91L393J712j954k636O48K712J463l167k363K062
1699g44L114r47k653r98K700K552k508k942Q14L265L96k126k449J670K977k11
1715A910l575n31K489K045j464k890K0L233J249l028j703J605K661k85k836j310
$$ plain form
1604 -2393 -2307 465 2785 760 -2384 -1838 1990 2664 -973 -2862 -200 2135 1627 -1630 -2865 997
1620 997 3026 198 -2811 -1742 1632 2420 -492 -3134 -292 3305 1538 -2038 -2431 688 2864 916
1636 916 -2608 -1956 1895 2282 -943 -2402 -653 2414 1966 -2359 -2671 1110 2575 638 -2138 -1805
1652 -1805 1419 2713 -788 -2830 -234 2427 1528 -1672 -2434 390 2671 525 -2823 -1613 1654
1667 1654 2476 -209 -2612 -889 2524 1781 -1668 -1834 490 2642 701 -2696 -2009 1844 2177 -1044
1683 -1044 -2413 -835 1977 2049 -1723 -2614 779 2491 537 -2099 -1451 1261 2724 -443 -2806 -744
1699 -744 2370 1423 -1230 -2228 472 3024 516 -2426 -1612 1653 2049 -77 -2526 -856 2121 1910
1715 1910 -1665 -2196 293 2338 874 -2016 -1996 1237 2486 -542 -2245 -640 2021 1736 -1100 -2410
1731b410L047K093k125k782J034K373J038k363k338J792K630l02k982j017K607
1746B95K179j416k988K27K960P30k114k103P81L458J73l860l40K204J990j250
1762I26k691k28L173J242k780k053J655K844n67k476j706K658K388j529k969M44
1778a669K826N57j823k555J723K853n33k333j039J906K101p31l454L49L254M76
1794A908k177j938J080K639L22k949j152K505K235j970k128J54K110J583k184
1809C8k574J549K583l61j842j276J267K909j423k654N62K335O49j483k195N38
1825a378L275j90k765r64K115J536q27k518j43K597J636k573j864J221K255N3
1841A466k107j315J750K305j010k419k49K113J382j821k303J384K368k33j950
$$ plain form
1731 -2410 637 2730 605 -2177 -1143 1230 2268 -95 -2433 -641 1989 1687 -1295 -2312 295
1746 295 2474 1058 -1930 -1703 1257 1987 -127 -2230 -1449 2009 2182 -1678 -2018 186 2176 926
1762 926 -1765 -1993 1180 2422 -358 -2411 -756 2088 1521 -955 -2661 -3 2385 856 -2113 -1669
1778 -1669 1157 1714 -109 -2664 -941 1912 1379 -954 -1993 -87 2014 1283 -2171 -1822 1432 1908
1794 1908 -269 -2207 -1127 1512 1834 -1115 -2267 238 2473 503 -1625 -1471 639 2222 38
1809 38 -2536 -987 1596 1235 -607 -1883 -616 2293 870 -1784 -1222 1113 1762 279 -1916 -1378
1825 -1378 1897 1707 -1058 -2022 93 1629 802 -1716 -1859 738 2374 -199 -2063 -842 1413 1466
1841 1466 -641 -1956 -206 2099 1089 -1330 -1579 534 1916 95 -2208 -824 1544 1311 -639
1856f39j144J514K382r18k662j92K327J087j446j978O88K614M7k532r05J705J839
1873A787q58k153k71K151J564j976j916R27K194M42k227j564J498K304j177j915
1889a190k00J712J363j166k226M18K632J52k308q16J235K032l89k772q7K231J044
1906A665j114j845J33K543M77k314j461J583K087p80k364J13J792J378j589k098
1922a794P36K264J12j937j404J696J819n76k119k70K015J128r21k618P94K317
1938A242K78k143r71J034K093n20j659r87K218J279j701j543J18K110M08j445
1954a89j506J578J470k18j973p16J926J559j552k129P71J826O77j784p66M17K029
1971A420m50j837m54J409J374r50j962L93K153J93j559j804J397J875l9k249n91
$$ plain form
1856 -639 -1783 -269 2113 1195 -1467 -1659 668 1755 309 -1669 -981 1633 1680 -852 -1757 -52 1787
1873 1787 929 -1224 -1495 656 2220 244 -1672 -745 1449 1891 -336 -1900 -402 1902 725 -1190
1889 -1190 -1390 322 1685 519 -1707 -1289 1343 1495 -813 -1629 -394 1638 1249 -1523 -1610 621 1665
1906 1665 551 -1294 -1161 1382 1859 -455 -1916 -333 1754 974 -1390 -1277 515 1893 304 -1794
1922 -1794 -1058 1206 1318 -619 -2023 -327 1492 916 -1203 -1473 542 1670 749 -1869 -1075 1242
1938 1242 1520 -623 -1594 -560 1533 1013 -646 -1633 585 1864 163 -1380 -1262 848 1256 -189
1954 -189 -1695 -117 1353 1135 -838 -1554 372 1931 379 -1750 -979 847 1524 -260 -1026 -609 1420
1971 1420 970 -867 -1321 88 1462 512 -1450 -1057 1096 1289 -270 -2074 -677 1198 1159 -1090 -1681
1988a681K053J151j156j697M11J987N02j848j312J003J843L4j849p19J288J500
2004A510j308j773L97K198K83j484r02J54K098j91j992q2J342J200q03j945L42
2021i56J637N31j489j167J224J507j0k163n16J586J284j267j263L8J757O22j772
2038d17j150J025J730k43j489p91J226J504o89j507l41J800M05j114j382Q86J565
2055A018K90k296l26J713R92p97j781j8J783O15j462j339J007J665J09j786m72
2072a085R92J049o11j433K52J717K84j369j039O34J796l34j564m28J181J162l40
2089H64j734j61J423Q42j507r81R03J110K57j691o08J319J014o56j175j13J381
2106D87O84q23j718Q41J654k25j352o63P67J381j38k028M84J178N12p84j421O58
$$ plain form
1988 -1681 372 1523 367 -1330 -919 1068 1570 -278 -1590 -587 1256 1290 -559 -1278 10 1510
2004 1510 202 -1571 -1174 1024 1307 -177 -1079 -925 1173 982 -1010 -1092 250 1450 647 -1298 -956
2021 -956 681 1212 -277 -1444 -220 1287 1277 -886 -1402 184 1468 201 -1062 -1024 733 1355 -417
2038 -417 -1567 -542 1188 945 -544 -1335 -109 1395 706 -801 -1142 658 1063 -51 -1433 -547 1018
2055 1018 1308 -988 -1314 399 1391 594 -1187 -1205 578 1193 -269 -1608 -601 1064 1173 -613 -1085
2072 -1085 -93 956 345 -1088 -836 881 1165 -204 -1243 -609 1187 853 -711 -1139 42 1204 864
2089 864 -870 -1031 392 1234 -273 -1254 -351 759 1016 -675 -1283 36 1050 394 -781 -894 487
2106 487 1171 348 -1370 -529 1125 900 -452 -1115 -348 1033 895 -1133 -649 529 1041 257 -1164 -506
2124e06J349k22j030p35J218Q88m50j275m17J277J197j265r25L11R79P53j520
2141c73p23R75J287p05j268l58J421Q85j043j160O51J379j2j364q43R05J298l23
2159F29j588J94J193M68r88r62K73J624J80j542p30R74J250n41r85m45J490O94
2177A188j002j220N87R36L76j075p48Q93R69k70j438P9J094M90o83j185M73J073
2195E37K37j213l81N48J087P0j571k39J026O78m00j296K29J219J15o15r06M52
2213d23J349l67j321jR81Q50p14j084R6J326K81j334n07Q20J043l88r91n72R14
2232d2J001m63j264L78R21M02j099n12R72N70l32j060N1J013M39p81j421Q68Q63
2251E04K92q61r96J064Q45o89o56l23J009Q05p89r71K20R14L20p82p01N63Q40
$$ plain form
2124 -506 843 621 -409 -1144 74 962 512 -763 -1180 97 1294 29 -896 -585 394 1147 -373
2141 -373 -1096 -121 1166 461 -807 -1165 256 1141 98 -1062 -411 968 956 -408 -1251 -346 952 629
2159 629 -959 -765 428 896 -92 -1054 -781 843 1023 -519 -1249 -275 975 434 -551 -996 494 1188
2177 1188 186 -1034 -447 489 865 -210 -958 -65 904 634 -804 -725 369 859 176 -1009 -536 537
2195 537 774 -439 -820 -272 815 885 -686 -925 101 779 379 -917 -688 531 646 31 -875 -423
2213 -423 926 559 -762 -763 218 1068 354 -730 -634 692 973 -361 -868 -48 995 607 -384 -956 -42
2232 -42 959 496 -768 -390 531 933 -166 -678 294 864 532 -528 -477 536 975 194 -1227 -359 504
2251 504 796 -65 -1061 3 848 159 -497 -820 189 994 205 -766 -546 368 688 -94 -795 -232 608
2270F08k45r29m9O01Q43n58j015M34P12K7n52p54M26J166n01p53n52J255R17r65
2290A16p97O3J124J64o26q50L65J121m1j163k53P18N91n24o69J66Q39N12r36q39
2310i19L92J204r7j000m92Q85P93p04p67J72Q41K50j021m56M60J256k87r07m20
2329h17Q82K05j47l39m4M11O18q60n72O30M23o3p61k22P48N86n03p56J21Q94L0
2350D64o74l93M13R45k70p70k91P75P05n85j022n1J203J26n04o40J79R36k92n21
2370b67l86Q12M53l96q67L2Q97M34o95r25P58R93n68o17J00K25M77k94o17q5P85
2391B49Q24j164l86J98P30K09j120k36L06J281n51r29J8J104J53r49k48K24O84
2410C97K28q26l72N59Q23n09p65j11O90M44n37o92K66Q71Q6p00o70P74M54m73
$$ plain form
2270 608 363 -566 -615 -14 829 271 -744 -310 402 429 -123 -877 -451 715 214 -539 -1091 164 1081 116
2290 116 -681 -618 506 670 44 -806 -441 680 639 -524 -777 -59 532 8 -661 -495 344 856 -80 -919
2310 -919 -527 677 580 -420 -912 -27 766 62 -705 -533 308 558 -463 -919 -459 797 510 -397 -817
2329 -817 65 270 123 -216 -260 151 769 -91 -663 -33 390 327 -434 -656 92 678 175 -581 -460 434 464
2350 464 -210 -603 -190 755 485 -285 -576 199 904 319 -703 -754 449 575 71 -569 -390 546 254 -267
2370 -267 -653 159 612 216 -651 -619 278 712 17 -908 -150 843 275 -342 -242 -17 460 166 -451 -536 249
2391 249 1073 -91 -477 -279 451 660 -460 -696 -390 891 340 -589 -571 533 686 -263 -511 -287 397
2410 397 625 -201 -573 -14 809 300 -465 -576 114 558 21 -671 -405 466 552 -148 -818 -44 410 -63
2430f3n44J93Q07N28j003q43P03Q58O2q52l75O37O76n51p20K14M42L79l18j007
2450g77L99R99k7r87l1P15N12l25j110K26O69L10l79j091O14N94N50j431l44Q07
2470a07O70n19n68L13O50J91n00o69J02J033k30n32p07J009M91k38p92j45P81
2489B33M63r47l69M99O22j89p77J23L54N96m07o86o0O39O77r48n13M76L73L04
2509D63o82k10J10P91j47p31J52N24L66k71j173O32L60M29p87l96M11O41l9r67
2529e24Q7O93N34n47o66n4Q53M10p26n10L39P49l8j040j56P43P25q84j51n9O92
2550D70K6m77o75M66Q02l22p59J33P33M59m28q75K96L86J13o63n06Q19N22l3r42
2571d55k99R40L78o03m14J43P61K73j060j55J38R49m24m56k77N47P41q99m45M10
$$ plain form
2430 -63 -607 -414 393 921 -82 -925 -222 636 698 -154 -529 108 784 233 -487 -273 169 548 230 -777
2450 -777 -378 621 594 -393 -424 291 803 478 -632 -406 263 573 194 -897 -283 311 861 -570 -914 -107
2470 -107 563 44 -524 -211 439 630 130 -539 -437 596 366 -166 -873 136 627 389 -403 -548 233
2489 233 696 -251 -620 -121 501 312 -465 -342 12 608 201 -485 -545 94 771 -177 -690 -214 159 463
2509 463 -219 -429 -319 472 325 -406 -254 270 636 365 -808 -176 184 613 -174 -570 -159 482 443 -524
2529 -524 -437 256 790 243 -423 -477 376 786 60 -450 -111 638 600 -440 -596 147 872 -12 -163 -222 470
2550 470 496 19 -656 -190 612 290 -469 -336 397 856 428 -447 -151 235 348 -315 -821 -2 520 487 -455
2571 -455 -754 186 564 -39 -453 -310 451 724 -336 -491 -353 596 172 -284 -561 -14 727 -172 -617 -207
2591b07L62N94o05m57k59R26J01o83k73L71N33O3r40M9Q44J78n97l08j01P57J84
2612E32j049K03P87J39m53n61j12P22M43p79n53N55Q82k53m14m63L69O21m34l97
2632b15j0M30K84j64q55K47P52j26p83K74M4O46j52r11K56O21J27o78m12M57O82
2653E14k14p97KN92K68J14r04O1O48L84n29q86N70L72L45p09l08N13N08j2j018
2674d86J92M10K91j55p41J81Q50q8o09n57P09M70N2r95N0N18O24q03m07M67L24
2695B97K28q08j72N28N75j35p97k77O29L63j85o17M8P47N2p52o6J81Q41k27q05
2716c52j29P00Q4l52l07k55P88L32q38n09P10O56n6r93J35M78M72n61l30k28P17
2737A62K80q33n3L24O06N1j068K07K39P22m69q68J64Q39J55l53n74J32P00k9o15
$$ plain form
2591 -207 155 749 144 -313 -572 354 455 -228 -501 -130 403 466 -474 -425 419 597 0 -308 -409 348 532
2612 532 -517 -314 473 612 159 -402 -514 208 651 -128 -681 -126 756 503 89 -374 -5 616 182 -215
2632 -215 -225 205 489 325 -530 -283 469 343 -440 -166 -122 524 372 -539 -283 338 465 -213 -625 -168 514
2653 514 300 -497 -495 97 365 479 -425 -364 284 668 139 -747 -177 195 540 -169 -477 36 544 532 -486
2674 -486 -294 116 407 252 -489 -308 542 454 -155 -712 -3 467 519 -476 -426 92 716 -87 -494 -27 297
2695 297 525 -283 -455 73 648 513 -284 -561 68 431 246 -371 -323 424 476 -276 -342 -161 680 453 -352
2716 -352 -481 219 303 -49 -356 -611 177 509 -329 -838 -128 528 472 -521 -386 92 564 3 -327 -555 162
2737 162 442 -391 -444 -120 486 537 -531 -324 -85 637 168 -700 -536 303 458 105 -469 -337 363 334 -281
2758b81l22R00L21n73j65o5N45K46o75l31m7J021r1p85J28Q3M57j90q59K75Q88
2779D80j56k18o89M73K98K40o98j82L78O19l94o28J79O94J24m99p64N63N52O9
2799D41m95k81L00P09l44q82J86N64M04q55j64K52R01k66n48k84L15P44m48m19
2819a70j16O33J84l05p78L52Q07k04p15q1L5Q04j87o53O6N45N21n37m57L39M98
2840E81J8r48J92K31N15l89o01L16N18J29m47o59K87Q12J90q98n58N87P61l18
2860C19n05j52P31K46o99l26J57L83M27r83j80N57K05K10o27j49O02M62o49n05
2880d76p2Q12N9l50l78N88J64p2o56n0N82M43m43o42n5R57J96p64m12M51N85j87
2902B80p26j06O64N30m46o96K18N33J99n73j55j2Q45l03m29k32J81P59k60j089
$$ plain form
2758 -281 -603 297 618 45 -120 -185 360 606 -69 -400 -447 574 483 -302 -174 -91 366 176 -683 -408 480
2779 480 324 106 -583 -110 188 428 -270 -452 -74 545 151 -477 -298 396 520 21 -743 -180 372 441
2799 441 -54 -335 -35 674 330 -552 -366 198 602 -253 -417 -165 736 470 -78 -362 -47 697 249 -170
2819 -170 -286 347 531 226 -552 -200 607 403 -312 -393 -358 446 259 -394 -328 217 738 201 -256 83 581
2840 581 599 -349 -157 74 589 200 -401 -85 433 562 115 -544 -257 555 745 -153 -711 -124 637 319
2860 319 -186 -338 393 639 -60 -386 -229 154 581 -402 -582 -25 180 390 -237 -386 216 678 29 -476
2880 -476 -548 264 323 -27 -405 183 347 275 -381 -431 151 594 151 -491 -546 411 607 -157 -569 -118 467 280
2902 280 -446 -552 112 642 196 -500 -282 251 450 -123 -278 -290 555 252 -177 -409 -228 531 271 -818
2922h18O38N66Q6p25l29Q14K69o9q10o3M05K62J01r47J69M81L41l55m73L08N72
2943D23k48j48n58P93J55m57k83j8N74K10n32n18M24N95k34n81K93J82N12l41
2963B43p78J94N67J60k95n44K98P16j54r07k8Q37M7l85m55N7P72M6k86m72L56
2984a1L96Kn56r2K51K36J5n24K34L56J98m14k88k56R26j08n64k10L04P92l72n19
3006b04j55O95l9n60NK98P10k28o20m89P26J92j01n70l12R89J31j50o37P7Q37
3027E95l20n37m27Q70K14M9p62k62P95J96p51l5j04P98K17n97n99M84P22k58m76
3048a88JL88j12J1n21J72M26L4m90L1J32M06J42r02J78L81K07k9r09O08M16r4
3070B88o89o5N32M91k82q63K01L02P55o08l60rO67j09l65j63K65K12j16k69n3
$$ plain form
2922 -818 -180 386 472 -253 -582 232 501 432 -378 -441 -36 226 327 -620 -451 30 371 16 -457 -149 423
2943 423 175 27 -531 262 417 -40 -323 -341 233 443 -89 -607 -183 412 178 -403 -110 72 584 243
2963 243 -535 -341 226 386 91 -453 -155 561 407 -500 -528 309 356 -29 -484 -427 345 391 105 -367 -11
2984 -11 385 387 -169 -261 -10 226 241 -283 -49 307 505 91 -197 -453 473 365 -199 -409 -105 687 315 -204
3006 -204 -359 336 297 -263 -258 40 750 522 -98 -587 139 331 230 -340 -652 337 468 318 -319 -242 595
3027 595 275 -262 -689 181 395 444 -318 -580 215 411 -340 -375 -479 319 536 -61 -660 -176 546 288 -188
3048 -188 -187 201 89 100 -421 -249 177 211 -279 -248 -116 290 432 -470 -292 89 296 267 -642 -34 382 288
3070 288 -401 -466 66 557 275 -588 -387 -85 670 62 -298 -307 360 251 -114 -277 -12 200 84 -185 -238
3091b38O9O32k81n29k4O22o7l71j11L75K09K6p36j42O78mP2n06O5P23j31k93q32
3114g94M85P82n13k68k0N76Q1k07m40K88L13P6m01n18N80N18m08o49l8N68J35
3135A46J44n60K17j19Q15q35l72P16O2l2j91k21J28M99m86k20j25Q02k21n4o45
3156e52P00L20k61o38R5J83N46k19p03K31M21L68n39k0J97L53m10j83k52K14M64
3177C15k58m43m6R96l36k20k95J04O06o1m46m91M78K41k67k34j05O81J42k73n90
3198e02K68N71P1n16m19M40N11m83k57J79L19K15n68l74J38O96j78l52j15M91
3218A35K9Lm59l25P42J20m14l62L15N45K60p59j89N82L85n17o96J54N31N57o04
3239C3o02O20L02k3n20n30O76K82l7m35%O63Qk25q09N51J38M04o09k94L32N82
$$ plain form
3091 -238 -169 463 182 -347 -371 251 184 -187 -298 77 286 312 -424 -566 112 108 180 -326 -261 462 331 38 -794
3114 -794 -309 473 -40 -308 -328 248 329 122 -318 -30 283 359 -42 -560 20 538 130 -519 -557 11 146
3135 146 290 -270 -53 -172 643 -192 -564 152 214 182 -9 -230 -102 397 -89 -309 -434 368 147 93 -552
3156 -552 148 468 207 -431 -336 -153 393 174 -529 -298 123 491 -48 -68 129 482 72 -111 -363 -149 315
3177 315 57 -386 -432 564 228 8 -287 -183 423 362 -84 -575 -97 144 -123 -357 -462 219 361 88 -502
3198 -502 -234 337 408 -108 -527 -87 424 -59 -316 -137 182 397 -171 -545 -407 289 111 -241 -356 135
3218 135 164 167 -292 -617 125 245 -169 -531 -216 329 589 -170 -359 223 608 91 -605 -451 80 637 33
3239 33 -569 51 353 330 -190 -720 -44 238 201 -234 -234 429 437 212 -597 -46 92 496 -113 -407 -75 507
3261E07k95p87L53M97L8n44l27K20L88N38p56m9J31P20l80l84l30N91O13q59k03
3282c18K65L77k7o27k98N06M28k20m04M36J82k6l67l65N19J74j04l49r9M49L62
3303D94k65o36J14L17K27k56m53K37O40k49k92k72N63L04l64n05K01mM35k75k22
3324b61K98K50o8q3k38J8Q20n51m84J62N55j24k81n81M16J76M71p22l7N03J01
3345C40K2q30K39M67J60p44J07j85P20L9l86m71P52N0l58q7p1K47K02k53m59L36
3367a63L96k34M5q25Q07K75k29l97r8P19O7k50l48J10M30j33n60o9P5M55j33j76
3389b36K45o8J91l39m05N26K18P2l51k08R9O16j3q66K06M91J15l22l28J13M36
3410A92J06n06K9K34K84j69m70m4N16L84p87k15J49O83k61m52k47M36M35j53l30
$$ plain form
3261 507 212 -575 -222 275 313 -231 -558 -338 50 588 -168 -217 -86 634 254 -130 -460 131 744 -115 -318
3282 -318 -53 324 297 -330 -628 -122 306 86 -318 118 300 274 -93 -458 61 235 131 -218 -317 132 494
3303 494 229 -407 -293 24 251 -5 -458 -221 419 170 -122 -394 169 473 109 -396 -195 -199 236 -39 -261
3324 -261 37 287 219 136 -102 -84 736 185 -299 -137 418 294 13 -568 -152 24 495 -227 -264 239 340
3345 340 362 -468 -229 238 398 -346 -239 -424 296 335 -51 -522 230 280 -78 -165 -236 11 213 -40 -499 -163
3367 -163 233 -1 44 -781 26 301 72 -325 -423 296 363 113 -235 -125 305 172 -388 -457 -382 73 -60 -236
3389 -236 9 -59 132 -207 -612 -86 132 204 -147 -355 -256 360 347 -519 -313 178 293 -29 -357 -244 192
3410 192 298 -208 -179 55 339 170 -300 -344 172 556 -231 -446 -297 386 125 -327 -574 -138 297 144 -186
3431a86j6M19P2m39k12J0N32J51n19j35J60O75k30l47J76J0K6j70l19N6P89k80
3453B23l01n00L48O21O4n84k59N26J15l13l99J60M90K00o93k82M04O08m21m98
3473d91J92L04K73j55m23R2L26K25o51oK71L81j63n27j0M93J2p0o3k57O35r0m20
3496a22J0K01l0K45l01j98P45k38m69J37m71Q75j05m30K7J74J48k27k38k04N05
3517C4K36k51l14L84J93k9n51J25K66N7J50l98k87M73L58j99m01k94M88J41j39
3538D2l02nM62q0j94j44K22M95l05n69J27L71L00m46j04P6K94q2m39J49J81M51
3560E00o71j08L5O13k72l1n05M03L37j38l29K4N34m57K09j52J4L55K09q66n9M18
3582F3M93l33n49K57L8L07k57l57Q1L34J59k30m15L36K94k57r2k59L42J42m3k14
$$ plain form
3431 -186 -202 217 289 -150 -362 -352 180 331 -188 -323 -163 512 282 -65 111 121 147 -23 -342 -286 503 223
3453 223 -78 -578 -230 391 455 -129 -388 138 253 -60 -459 -299 191 391 -302 -584 -180 428 7 -491
3473 -491 -299 5 278 123 -300 -208 118 343 -308 -314 -43 338 175 -352 -362 131 143 73 10 -247 388 298 -122
3496 -122 -112 89 59 304 3 -195 550 312 -157 -20 -491 384 279 -151 -124 50 198 -29 -267 -471 34
3517 34 270 19 -295 89 282 253 -298 -173 93 150 300 -98 -385 88 446 247 -154 -448 40 181 42
3538 42 -260 -265 197 117 -77 -221 1 496 191 -378 -251 120 420 -26 -130 -54 240 158 -281 -132 49 500
3560 500 -171 -279 -244 369 97 66 -439 -36 301 163 -166 -142 392 -65 144 -8 6 361 570 -296 -355 63
3582 63 556 223 -326 -69 -31 276 19 -338 -257 77 236 6 -409 -73 221 -36 -128 -387 -45 97 54 -160
3604a60K5L13K55o72Km5M23K89q39K34K09L17l53j33K50K2r6m67M05K1J77l00
3626a23p5m9L56L94l19l71J32M50l07l07Q3k50P56n1m68j27J75M68k70k97j48
3647c48N35J97j67l64Q8J96m1l1j67M17J02n95K49k88L14K94l91n41O91K26m14
3668c8j06j09K14M84l32m81mN53m0m02J88K82p3P0j11m23N16M49m83k94n4N12
3690C18l6l20j04J49M58k08n64k10O25J58k42k11l74Q69p4k22k93M55o0k42j28
3711b56L26J75p6k32l20K17P73l97m67K15J6M19m66K01m19M94j50k54K5R9J20
3732D3K21n10l53M82N2n8J85m35K63M39k45j72n2J89K14k63q4J38L69j77o12K07
3754a59P2M97k47n54K83M71p4m40p6J47L29P4o24K40L45j4k74k10k36N27L40o43
$$ plain form
3604 -160 -135 178 433 -239 -237 -282 141 430 -409 -175 34 351 -2 -135 115 137 41 -426 -21 0 177 -123
3626 -123 -198 -247 109 503 184 -187 -55 395 88 -219 -136 -386 370 319 -149 -276 -101 367 97 -200 -348
3647 -348 187 384 217 -147 -59 137 96 65 -102 315 417 -178 71 -217 97 391 0 -541 150 376 -38
3668 -38 -144 -253 -39 445 113 -368 -372 181 141 -261 -73 209 136 206 95 -328 188 637 154 -140 -194 318
3690 318 282 -38 -142 7 465 257 -307 -517 108 266 24 -187 -561 308 234 12 -281 174 114 -128 -256
3711 -256 70 245 169 -63 -383 -166 607 210 -257 -42 -26 393 -73 128 -291 203 53 -201 -176 -77 43
3732 43 264 -246 -599 -117 -65 -123 62 -373 -110 329 84 -88 -140 49 263 0 -84 54 423 246 -366 -159
3754 -159 -87 410 163 -391 -108 363 289 -151 -227 -80 249 323 -301 -61 284 270 -4 -214 -450 77 417 -226
3776b26j40O77M0k66k46j07M36J25j50n98M33L26j05n4k15K83K15m00r2K1N3R1
3798A01J06o36k1O61K99n25m36L83J23L8j69k03L78L02m71p7j77L84L34j47p71
3819e24K91N45l22j5j50K08M55k06l73j33J28J62l84K81j6J51J24l24j70M60N89
3840G77n29k25k40M93Mo98K26p0L39J21l42J84K54m19L75n03J56J95L6j06j24
3861i6j16J30K07n27J31P72P4n12m18j28Q59k31l97J8L12L13j14m40j97M56k7
3882F9j62q7K43L52j57j20n74N72r1J55n50K39K8K49J91m25l41M50K17l32j51
3903b25L37K58k03p05M45M8J77j34J12j55J69p9N3l37L84p8q4k36J48M08K72k05
3925C70r41L24M23K91p23K78l50N06k63lq1P7J81k84J68jM27j5k93l69K04M01
$$ plain form
3776 -226 -366 311 351 85 -161 -268 168 293 143 -455 -22 304 199 145 -70 213 428 28 -64 -43 10 101
3798 101 207 -429 -450 211 510 -15 -451 -68 55 93 -76 -279 99 401 -70 -147 -324 60 394 247 -524
3819 -524 -233 312 -10 -25 -175 33 488 282 -91 -224 -96 66 -318 -37 -53 98 222 -102 -272 188 777
3840 777 248 23 -217 276 280 -418 -192 -262 77 198 -144 40 294 -125 250 -253 -97 98 134 28 -96
3861 -96 -212 -82 125 -402 -271 501 575 63 -355 -483 376 145 -252 -234 78 391 277 -163 -360 96 69
3882 69 -93 -180 63 415 258 138 -436 136 45 200 -350 -111 -83 166 357 -68 -409 41 258 -74 -225
3903 -225 112 370 167 -538 -93 -45 132 -2 110 -45 124 45 98 -239 145 67 -17 -253 -105 303 575 370
3925 370 -571 -247 176 467 -256 22 -328 178 -85 -88 -169 -92 89 -195 -27 -28 399 384 91 -278 -74 327
3947C27m71J0j40K39M39k14m54R7M6K99J14o14P1L40J81r3l94J33L00j57l6m00
3969c77N19J31l24j7j79L91K3j00m58M24K24q5m51K05M6L36m14j15J61L61n8n67
3991c24K73J68L58o43J40L34Q1j04l13q5j01N60J7p95J70M93J1J31p55M57r6J45
4013A22l65r9N90k83L89n01J19j06J43J9o6l21L90K5o7j00o5M01l35k62K03K98
4035A29K97k61m79J87j1N98m00j33R0j04M2n4J5o2M26l38k63l2N55kr9j49k44
4058b92M85K49n36l14K04L95j74l65O25j37l0j60j84l1L51J9k31k37N51k9J40
4079B99l83J32J92j74j79j99K01J75k2Q5m90J92L28k6l60K66J38M4M5n57M85J93
4101C85k56k97j86J37P16l51m86K95j4M32k17k73j85M27J14m23R4kK03j11J52
$$ plain form
3947 327 -144 -134 -274 -35 404 190 -264 -167 -121 178 292 -322 -251 89 270 177 -217 -84 216 59 23 -377
3969 -377 142 273 -51 -68 -247 144 167 67 -391 33 257 172 -279 -74 -28 308 -106 -221 -60 301 243 -324
3991 -324 -51 117 475 -168 -28 306 387 283 -30 -115 -216 344 361 -434 -264 229 240 371 -384 73 -23 122
4013 122 -243 -342 248 -35 354 -147 -28 -134 9 28 -38 -359 31 56 -11 -111 -176 225 -110 -372 -169 129
4035 129 426 165 -314 -127 -138 460 60 -73 17 -87 -45 -99 -84 -146 280 -58 -321 -353 202 200 101 -48 -292
4058 -292 193 442 -94 -408 -204 191 17 -348 277 140 110 -50 -234 -265 86 105 -126 -363 188 159 299
4079 299 -84 48 240 66 -113 -312 -111 64 42 127 -363 -171 157 131 -229 37 175 219 264 -293 192 385
4101 385 129 -168 -354 -217 499 148 -338 -43 -57 375 158 -115 -300 127 241 -182 -88 -90 113 2 154
4122A54l30J85M35l02m61M65L40k78k42K25j4L62o91o5K36O0K07o91J67R1N85
4143D38r3m34j68L21k25L97p76J99O56K9n25k74O62k53K26l14J4J57n7J19k61
4164a62j49L85J41m74R1J97J20Q7m50J88j5O57m53l94L02k11N57o11nK08L5m4
4186@j74k37K31P87l76l29J03K30K25m68k52K85J85j89k75J13J74P0J08m16j51
4207c56J53M93l49l63J53M21k39k0L7J54L24m69J59r1j26J51Kk36J22K18n4q7
4229cj64L44J20j08l42J99m2J11lm56L92J50j01J8k09K25P0R7n52k61K52L50P3
4252A60k98j63M24J10l57M0K3L95r3k70k11M91K02p66P6m5N43rk90k45L19K56
4274B92j77k03p2K58J15k00j07j64M89l02j8k25O08Mj71j62j59J58K66j83N6r
$$ plain form
4122 154 -176 9 444 142 -319 146 486 208 -34 191 177 539 -152 -217 19 79 286 -405 -238 -147 438
4143 438 345 -89 -257 64 -161 236 -540 -341 315 344 -181 -455 207 -46 180 -134 -120 37 -20 99 -162
4164 -162 -311 74 215 -259 -168 29 149 236 -214 -26 -41 616 163 -231 71 -140 417 -194 -199 9 44 0
4186 0 -174 -411 -180 607 231 -98 5 235 460 -8 -260 25 210 21 -254 -141 33 103 211 -205 -356
4207 -356 -203 290 -59 -422 -269 152 -87 -107 -70 84 408 -61 98 7 -119 32 34 -202 -80 138 84 -3
4229 -3 -167 177 297 189 -153 46 4 115 112 -344 48 198 97 115 -94 131 201 298 -254 -515 -263 87 160
4252 160 -138 -301 123 233 -124 -84 -61 334 241 -29 -240 251 453 -313 -237 -282 261 252 -38 -283 36 292
4274 292 115 -88 -160 98 213 13 -94 -258 231 -71 -89 -314 294 298 127 -35 -194 -36 230 47 103 94
4296I4NM31l93k43K9L39k32m54J23N05J62n26K12k22K21L7k64NK97K81k28k46
4318f7j33N06k35o4j73R9K42R8J8o66Q9N19J76o00L4L14L35n68p8O3K00J96kn87
4342b84K76K73L2j55m75N24J35n2m25j80N12K7k89k40Q9O18l73k75n6J88M20r7
4364A93k97J40Q3j08J75k81J49J80L1l40m36R70m33J40k88pK18J90k73j77J73
4385BJ39j18J21k70K34N8j05k24J29L08p9k97k5j56O42j65m47k30K26L70J30k46
4407cj02K73Q9m62j10J92J65L51l93l33K21M24m12L2J84J53j54M8l71J30K27J48
4429B97n11j53P1O21m14R7l9K43q4m2l47K72K12p9j97N6p6L19k50l43K64P1J94
4452A82j86j55K55K46j23k20l99M36M44l68k06j04L11J5k31m2o2J81j0j85K0K37
$$ plain form
4296 94 99 530 137 -106 -77 262 30 -424 -301 204 366 -160 52 -170 51 88 -176 -171 126 407 179 -67
4318 -67 -200 306 71 7 -166 -67 175 273 291 -375 -286 233 409 -191 -157 157 492 -76 -154 -91 109 305 303 -284
4342 -284 -8 265 297 142 -333 191 326 274 -151 -331 181 208 -81 -321 -232 386 13 -262 -318 -130 290 193
4364 193 -104 36 119 11 186 -95 54 234 265 -75 -511 459 26 166 -122 -129 89 279 6 -171 2
4385 2 141 23 144 -126 108 166 61 -163 -34 274 195 -102 -127 -283 359 194 -253 -483 -257 113 243 -3
4407 -3 -105 168 257 -205 -315 -123 42 393 0 -333 -112 312 -100 -68 116 269 115 163 -208 -78 149 297
4429 297 -214 -367 -296 325 -89 8 -31 212 128 86 -261 11 223 144 -53 3 -73 246 -4 -347 -83 -12 182
4452 182 -4 -159 96 342 219 -1 -400 36 480 112 -94 -198 113 128 -103 -145 -207 -26 -36 -221 -201 36
4474C6P6N3j94m9L43K6l56M7k15K45K50n89L77j89R9L13l38k72N84lk91j63J03
4497a07J69R2l33l95M25L29j38o8r1J68L27j92l01L39j78rk47N7K08k2p3k03J19
4520a24M80l6k71j11K18Q0J91p93K48L1R8J34j46l27M97K19l41k34K7J29R2j61
4542a00j34Q6K05j63j65J29L1K56l17pQ4J50K47m24J57j94K40r7n98O35j51L08
4564A78m64J52J01J86j8m42M6J74K59R6l82lL60j60L38n87j3K05O2L8l35P7J31
4587aj67l5L47qr0p1k14J38J81K2j81l85K74K59Q6L6l22N7k3L96m04q4L52L0m16
4612b23J90J0J21j44J51K12n79M51k55r6k7K34po8kq9J27m1K31j61J86j62k28
4635a69K38j50M05k22j6J50n44K98J9m30M93L9K64l83k61L76rK02m3n36L28J32
$$ plain form
4474 36 112 165 -29 -78 265 291 -65 -18 -233 12 262 -327 50 -139 -40 273 -65 -337 247 244 -47 -210 -107
4497 -107 62 154 -179 -574 -149 180 42 -26 -117 51 378 186 -115 224 46 37 -210 -153 55 33 -40 -243 -124
4520 -124 356 320 49 -62 156 236 427 -366 -118 -87 11 145 -1 -328 169 388 47 -187 -160 -31 61 -100
4542 -100 -234 -148 57 -106 -271 -142 -111 145 -172 -179 -95 55 302 -122 35 -159 81 -16 -614 21 -130 178
4564 178 -286 -134 -33 153 135 -307 -261 -87 172 268 -114 -117 243 83 421 -166 -179 26 88 126 -209 -132 -1
4587 -1 -168 -203 144 136 46 -25 -239 -101 80 102 -79 -464 -190 69 155 191 -131 -74 -97 299 -105 -189 163 193 -223
4612 -223 -33 -23 98 -46 105 317 -262 189 -66 -162 -189 45 38 -30 -32 -121 6 -35 196 35 221 59 -169
4635 -169 69 -81 324 102 86 236 -308 -10 9 -421 72 111 375 -8 -269 107 98 300 257 -279 49 181
4657A81n0l33J68K92j67o6j0m7K03J10k85j4Q1PJ30k85o6l3K50j20j74L3J15J72
4681I2K02n91K86O9Q7k43lO5J62j69K07l37M35O6m19K98J00P6j29k02JL14k49
4704A18j79l8J43q7j9J18p0j18Q7J21k26J28q5L01k76p2Q3J77J0j39j19l69P17
4727B06j35k54lM01j95o7j30J7L5K55j68J04k13N5J72j05o1K58j3J56l54l65L75
4750b9L0K7p2KL89k78R8m12J33p1k3K00r0N8N0k91l3K50K42k21k18K94J23J24
4774B82n87K50j55J74J37k77K67J17l75O22n35N6J11r4j11j37J5L82K03k02n35
4795c92M99n9k06J5Q1LJ8Opj4L21k16K5q7m5J39L5k57Kj43L87k72j87K36J28L31
4821C41k58MK1j95K21j33K4llK35l41K35L34l45n2J18n8J37j38j17M9J91k89k73
$$ plain form
4657 181 131 -202 -34 258 91 25 15 -32 171 281 -4 -18 63 70 200 -85 -151 -184 66 -54 -228 -195 -80 92
4681 92 294 -297 -11 58 145 -98 -101 -36 126 -43 164 -173 262 328 -91 207 307 383 254 52 53 367 118
4704 118 -61 -99 44 -43 -62 56 -14 -132 -45 76 -150 -22 -107 194 -82 -154 -71 106 116 -23 -142 -511 206
4727 206 71 -183 -186 215 20 -47 -177 -160 -125 130 -38 66 -147 -92 80 -25 -86 172 159 315 -39 -404 -29
4750 -29 1 28 -44 -42 347 69 167 -245 -112 -183 -206 -6 -96 -38 12 -279 -312 -62 180 -41 -259 35 158 282
4774 282 -305 -55 -210 -36 101 -176 91 208 -167 455 -80 -24 87 -7 -118 -255 -240 142 345 143 -392
4795 -392 107 48 -158 -143 -62 -59 -41 -35 -42 -56 265 49 74 -13 -58 81 116 -141 -139 -282 105 -167 -354 -118 10 341
4821 341 83 87 108 -87 134 1 25 22 19 254 -87 148 482 137 85 203 145 282 144 27 76 267 -22 -295
4845b95L7J84J91k30K14K10j51K6l92J10M69l28j44L00m13K52N9L32m10k79L49
4866I1j01J25Ml12L82r6J0k85J76J3J65J46l10L5L08l53q6j05J38K15k28j53K69
4889D8n8Q5O8p2j72jK60j13l1j06L70k06l48J96j8l7K21l21J53N1o4L37Pl4r4
4914A21j7l20P8M83k07j2J80k27j57J97l05L22j29J18j3l22K19J72K09l94k37
4935b41L76m6K05p7j55K03j44n3l0o3K06k07K01m09K90o8M03n70Q3P1l8o8J4J09
4959hl7L27m38L61k92K45j92J33l38N1M19j71q0K1r1J80l4q5N9O3j48j6J81J63
4983B73m1O6r7k52L77j00jq6j69J46o5l5R9j90J8J54j58j46J70j2j00J18K40N6
5007B65j08j17k49M44n21L90l69O7L46N8m21P8J10K31m60J96p8L63j61J80l7k14
$$ plain form
4845 -295 -258 -74 117 -113 101 311 160 186 -206 -96 373 45 -99 201 -212 40 99 431 21 -258 91
4866 91 -10 115 119 -193 189 93 103 -182 -6 7 172 318 8 43 351 -2 -88 -193 -55 160 -68 -221 48
4889 48 -10 75 143 71 -101 -102 158 45 14 -92 278 72 -276 -80 -98 -135 86 -235 -82 -31 -95 242 249 215 121
4914 121 104 -216 -138 345 138 126 306 79 -78 119 -186 136 7 125 112 -210 9 181 390 -4 -241
4935 -241 135 89 294 217 62 265 121 68 38 -25 181 -26 175 -234 56 -12 391 -179 -96 -25 -63 -131 -117 -8
4959 -8 -45 282 -156 205 -87 158 -34 99 -239 -188 231 60 -20 1 -90 90 56 -29 30 93 -55 -71 110 273
4983 273 232 298 201 -51 326 226 225 139 -30 116 51 16 115 -75 -57 97 -61 -207 -37 -49 -149 -31 209 265
5007 265 157 40 -209 235 -286 104 -265 -198 148 206 -215 -137 -27 204 -256 -60 -138 225 64 244 207 -7
5029gJ84l66L87k56K55j04pm55N18r7o5j90J48j99M63m8l1k00l2K54p4k53M1K34
5053A00J75k57j47Q1J06j43k98L04L2r8J84j79R7J08R8k55J80k6pJ77l12L6J88
5076A44r9K78k31k84M07k03J03L5J73j89K33m60q8q0L18K11m21M3K56M3J2l95
5098a94L31j2n1j07K12m1PJ39j49k53LL35m84J1J92K07L0m42J21Q3L74k44k5l88
$$ plain form
5029 -7 177 -189 198 -58 197 93 86 -369 149 52 -13 -203 -55 -254 209 161 130 -70 -102 152 78 -175 -134 100
5053 100 275 18 -129 -48 58 -85 -383 -79 -47 -145 39 -140 -43 65 163 -92 88 62 55 232 -80 -44 144
5076 144 45 323 92 -192 215 12 115 150 323 134 367 -93 -181 -261 57 268 -153 -110 146 189 201 -194
5098 -194 137 125 74 -33 179 138 145 284 135 -118 -115 220 -264 -253 -61 146 176 -266 -145 -62 312 68 43 -345
$$ [...]
8191E7
##END NTUPLES=NMR FID
##END=
