##TITLE=1H_DE-63-k
 D2O
 8 sc, 
 31.7.2024
##JCAMPDX= 6.0         $$ Bruker NMR JCAMP-DX V2.0
##DATA TYPE= NMR FID
##DATA CLASS= NTUPLES
##ORIGIN= UXNMR, Bruker Analytische Messtechnik GmbH
##OWNER= root
$$ XWIN-NMR		Version 3.5
$$ Wed Jul 31 16:34:52 2024 Russian Standard Time (UT+4h)  she@DPX200
##.OBSERVE FREQUENCY= 200.1315
##.OBSERVE NUCLEUS= ^1H
##.DELAY= (6, 6)
##.ACQUISITION MODE= SIMULTANEOUS
##.ACQUISITION SCHEME= undefined
##.AVERAGES= 8
##.DIGITISER RES= 18
##SPECTROMETER/DATA SYSTEM= spect
##.PULSE SEQUENCE= zg30
##.SOLVENT NAME= DMSO
##.SHIFT REFERENCE= (INTERNAL, DMSO, 0, 15.7039)
##AUDIT TRAIL= $$ (NUMBER, WHEN, WHO, WHERE, WHAT)
$$ ##TITLE= Audit trail, XWIN-NMR		Version 3.5
$$ ##JCAMPDX= 5.01
$$ ##ORIGIN= Bruker BioSpin GmbH
$$ ##OWNER= she
$$ F:/spectra/data/she/nmr/H-F/1/audita.txt
$$ ##AUDIT TRAIL=  $$ (NUMBER, WHEN, WHO, WHERE, WHAT)
(   1,<2024-07-31 16:33:09.96 +0400>,<she>,<DPX200>,
      <created by zg, POWCHK disabled, PULCHK disabled
       configuration hash MD5:
       00 E9 B6 7A A2 85 ED C7 34 08 36 98 17 FE 4E 26
       data hash MD5: 16K
       07 80 89 C2 BC 41 AB B8 AC AA D2 D9 40 FC 99 34>)
$$ ##END=
$$ 
$$ hash MD5
$$ 37 33 1B 99 55 DA D5 D8 9F 9A A4 3C 8C 53 F9 2B
##$RELAX= 
##$RELAX= 
##$RELAX= 
##$RELAX= 
##$RELAX= 
##$RELAX= 
$$ Bruker specific parameters
$$ --------------------------
##$DU= <F:/spectra>
##$EXPNO= 1
##$NAME= <H-F>
##$PROCNO= 1
##$TYPE= <nmr>
##$USER= <she>
##$AMP= (0..31)
100 100 100 100 100 100 100 100 100 100 100 100 100 100 100 100 100 100 
100 100 100 100 100 100 100 100 100 100 100 100 100 100 
##$AQSEQ= 0
##$AQ_mod= 1
##$AUNM= <au_zg>
##$AUTOPOS= <>
##$BF1= 200.13
##$BF2= 200.13
##$BF3= 200.13
##$BF4= 200.13
##$BF5= 200.13
##$BF6= 200.13
##$BF7= 200.13
##$BF8= 200.13
##$BYTORDA= 1
##$CFDGTYP= 0
##$CFRGTYP= 5
##$CHEMSTR= <none>
##$CNST= (0..31)
1 1 145 1 1 1 1 1 1 1 1 1 1 1 1 1 1 1 1 1 1 1 1 1 1 1 1 1 1 1 1 1 
##$CPDPRG= <>
##$CPDPRG1= <>
##$CPDPRG2= <>
##$CPDPRG3= <>
##$CPDPRG4= <mlev>
##$CPDPRG5= <mlev>
##$CPDPRG6= <mlev>
##$CPDPRG7= <mlev>
##$CPDPRG8= <mlev>
##$CPDPRGB= <>
##$CPDPRGT= <>
##$D= (0..31)
0 1.2 0 0 0 0 0 0 0 0.06 0 0.03 0 0 0 0 0.0002 0 0 0 0 0 0 0 0 0 0 0 0 
0 0 0 
##$DATE= 1722429189
##$DBL= (0..7)
120 120 120 120 120 120 120 120 
##$DBP= (0..7)
150 150 150 150 150 150 150 150 
##$DBP07= 0
##$DBPNAM0= <>
##$DBPNAM1= <>
##$DBPNAM2= <>
##$DBPNAM3= <>
##$DBPNAM4= <>
##$DBPNAM5= <>
##$DBPNAM6= <>
##$DBPNAM7= <>
##$DBPOAL= (0..7)
0.5 0.5 0.5 0.5 0.5 0.5 0.5 0.5 
##$DBPOFFS= (0..7)
0 0 0 0 0 0 0 0 
##$DE= 6
##$DECBNUC= <off>
##$DECIM= 24
##$DECNUC= <off>
##$DECSTAT= 4
##$DIGMOD= 1
##$DIGTYP= 9
##$DL= (0..7)
0 120 120 120 120 120 120 120 
##$DP= (0..7)
150 150 150 150 150 150 150 150 
##$DP07= 0
##$DPNAME0= <>
##$DPNAME1= <>
##$DPNAME2= <>
##$DPNAME3= <>
##$DPNAME4= <>
##$DPNAME5= <>
##$DPNAME6= <>
##$DPNAME7= <>
##$DPOAL= (0..7)
0.5 0.5 0.5 0.5 0.5 0.5 0.5 0.5 
##$DPOFFS= (0..7)
0 0 0 0 0 0 0 0 
##$DQDMODE= 0
##$DR= 18
##$DS= 0
##$DSLIST= <SSSSSSSSSSSSSSS>
##$DSPFIRM= 0
$$ [...]
##$SUBNAM2= <"">
##$SUBNAM3= <"">
##$SUBNAM4= <"">
##$SUBNAM5= <"">
##$SUBNAM6= <"">
##$SUBNAM7= <"">
##$SUBNAM8= <"">
##$SUBNAM9= <"">
##$SW= 24.0689530833862
##$SWIBOX= (0..15)
0 0 2 0 0 0 0 0 0 0 0 0 0 0 0 0 
##$SW_h= 4816.95568400771
##$TD= 16384
##$TD0= 1
##$TE= 0
##$TE2= 300
##$TE3= 300
##$TEG= 300
##$TL= (0..7)
0 120 120 120 120 120 120 120 
##$TP= (0..7)
150 150 150 150 150 150 150 150 
##$TP07= 0
##$TPNAME0= <>
##$TPNAME1= <>
##$TPNAME2= <>
##$TPNAME3= <>
##$TPNAME4= <>
##$TPNAME5= <>
##$TPNAME6= <>
##$TPNAME7= <>
##$TPOAL= (0..7)
0.5 0.5 0.5 0.5 0.5 0.5 0.5 0.5 
##$TPOFFS= (0..7)
0 0 0 0 0 0 0 0 
##$TUNHIN= 0
##$TUNHOUT= 0
##$TUNXOUT= 0
##$USERA1= <user>
##$USERA2= <user>
##$USERA3= <user>
##$USERA4= <user>
##$USERA5= <user>
##$V9= 5
##$VALIST= <valist>
##$VCLIST= <CCCCCCCCCCCCCCC>
##$VD= 0
##$VDLIST= <DDDDDDDDDDDDDDD>
##$VPLIST= <PPPPPPPPPPPPPPP>
##$VTLIST= <TTTTTTTTTTTTTTT>
##$WBST= 1024
##$WBSW= 4
##$XGAIN= (0..3)
0 0 0 0 
##$XL= 0
##$YL= 0
##$YMAX_a= 200158
##$YMIN_a= -198476
##$ZGOPTNS= <>
##$ZL1= 120
##$ZL2= 120
##$ZL3= 120
##$ZL4= 120
##$ABSF1= 10
##$ABSF2= 0
##$ABSG= 5
##$ABSL= 3
##$ALPHA= 0
##$AQORDER= 0
##$ASSFAC= 0
##$ASSFACI= 0
##$ASSFACX= 0
##$ASSWID= 0
##$AUNMP= <proc_1d>
##$AZFE= 0.1
##$AZFW= 0.1
##$BCFW= 1
##$BC_mod= 2
##$BYTORDP= 1
##$COROFFS= 0
##$CY= 11.3945322036743
##$DATMOD= 1
##$DC= 2
##$DFILT= <>
##$DTYPP= 0
##$F1P= 15.6554695791079
##$F2P= 12.8336369535428
##$FCOR= 0.5
##$FTSIZE= 0
##$FT_mod= 4
##$GAMMA= 1
##$GB= 0.15
##$INTBC= 1
##$INTSCL= 1
##$ISEN= 128
##$LB= 0.24
##$LEV0= 0
##$LPBIN= 0
##$MAXI= 10000
##$MC2= 0
##$MEAN= 0
##$ME_mod= 0
##$MI= 1.114404
##$NCOEF= 0
##$NC_proc= 0
##$NLEV= 6
##$NOISF1= 3.799351
##$NOISF2= 2.8
##$NSP= 1
##$NTH_PI= 0
##$NZP= 0
##$OFFSET= 15.70392
##$PC= 1
##$PHC0= -25633.59
##$PHC1= 1.387491
##$PH_mod= 1
##$PKNL= yes
##$PPARMOD= 0
##$PSCAL= 0
##$PSIGN= 0
##$REVERSE= no
##$SF= 200.130013532006
##$SI= 16384
##$SIGF1= 3
##$SIGF2= 2
##$SINO= 400
##$SIOLD= 16384
##$SREGLST= <1H.CDCl3>
##$SSB= 0
##$STSI= 0
##$STSR= 0
##$SW_p= 3612.71676300578
##$SYMM= 0
##$S_DEV= 0
##$TDeff= 0
##$TDoff= 0
##$TI= <>
##$TILT= no
##$TM1= 0
##$TM2= 0
##$TOPLEV= 0
##$USERP1= <user>
##$USERP2= <user>
##$USERP3= <user>
##$USERP4= <user>
##$USERP5= <user>
##$WDW= 1
##$XDIM= 8192
##$YMAX_p= 0
##$YMIN_p= 0
$$ End of Bruker specific parameters
$$ ---------------------------------
##NTUPLES= NMR FID
##VAR_NAME=  TIME,          FID/REAL,        FID/IMAG
##SYMBOL=    X,             R,               I
##VAR_TYPE=  INDEPENDENT,   DEPENDENT,       DEPENDENT
##VAR_FORM=  AFFN,          ASDF,            ASDF
##VAR_DIM=   8192,          8192,            8192
##UNITS=     SECONDS,       ARBITRARY UNITS, ARBITRARY UNITS
##FACTOR=    0.0002076,     1,               1
##FIRST=     0,             0,               0
##LAST=      1.7004516,     0,               0
##MIN=       0,             -198476,         0
##MAX=       1.7004516,     200158,          0
$$ Real data points
##PAGE= N=1
##DATA TABLE= (X++(R..R)), XYDATA
0@%%%%%%%%%%%Qj6J6j6K4l2L2m0N4o2P0q4R7j08J26j47J65j88K17k46K74l08L49
34A85l90M34m85N40n98O66p42Q20r07J006j114J232j365J516j683J873k096K354
52A246k657L023l474M037m769N762p146R019j3690K08807p0726k50103q933J21708
66g896J85222p7091k79716L1816K85871J3857k08765r7207J05169J83259L956
77A38475k57866o1573K68681R3008j88346j27395M4134J87849P0592k33846j32189
88a98476K11546J47687j08366j52814k5609J71597J37945j80411j80465J39143
98c8223J65208l7373j48627q9006J45901J67898j25572j84537O0191J72349L9259
109A27468j40929j30319R4782J92503m3561k11390j2801J63344Q4032q1956j68161
$$ plain form
0 0 0 0 0 0 0 0 0 0 0 0 0 8 -8 8 -8 16 -16 16 -24 30 -32 38 -46 51 -57 69 -78 87 -101 116 -130 144 -164 185
34 185 -205 229 -256 284 -314 352 -390 430 -477 529 -585 647 -718 798 -885 988 -1108 1246
52 1246 -1411 1612 -1862 2175 -2594 3168 -3978 5041 -8649 200158 129432 -120671 -129604 -7896
66 -7896 177326 100235 -179481 -147665 138206 152063 -56702 -153909 -48740 134519 138475
77 138475 -119391 -180964 87717 180725 -7621 -135016 -90882 96967 167559 -66287 -198476
88 -198476 13070 160757 52391 -100423 -126032 45565 183510 3099 -177366 -38223
98 -38223 126985 89612 -59015 -148021 -2120 165778 40206 -144331 -84140 88209 127468
109 127468 -13461 -143780 -48998 143505 99944 -111446 -124247 39097 123129 41173 -126988
120a26988K2128K18347J1460j84150n5863R9246J29061k4019j91096k5892J94287
131F6521O5061j44372j10341O3822J54513K2976j77270q6071J67273J18455j05623
142C4944j34742M485J46173Q6239j49615j35996J18883J46830m6313j36902m4912
153a10926J25413J26593j09113j65468P2995J52516l442j20274r2142R3885J63399
164A33436o7014j74276J7442J43127N9907r8739j31519N2969J69081o174j67774
175f9534m1139J24790Q6751n5007j35299o758J68826M3605j51567o8649Q3624
186b0357J07345n540j49510n0014J55713P9879j13056j01554L9792J21047L7877
197A01622j29407r1852J14799J14834o8435j13556n947J05625P8140r8387j22106
$$ plain form
120 -126988 -104860 113487 124947 -59203 -115066 -15820 113241 89222 -101874 -127766 66521
131 66521 131582 -12790 -123131 -59309 95204 118180 -59090 -145161 22112 140567 34944
142 34944 -99798 -95313 50860 137099 -12516 -148512 -29629 117201 70888 -66014 -110926
153 -110926 14487 141080 31967 -133501 -60506 92010 88568 -31706 -123848 -29963 133436
164 133436 66422 -107854 -90412 52715 112622 13883 -117636 -64667 104414 98240 -69534
175 -69534 -110673 14117 100868 45861 -89438 -96196 72630 116235 -35332 -103981 -20357
186 -20357 86988 81448 -68062 -118076 37637 117516 4460 -97094 -57302 63745 101622
197 101622 -27785 -119637 -4838 109996 41561 -71995 -77942 27683 105823 7436 -114670
208a14670P7158J28602k7918j09687m0463Q6089J06228o2908j42203L3538J32798
219F6564J2731r2355p8262N0832J33461k1200j45531r103J14068N3628o3398j01534
231h0099J8097J29914J7603j26468n0423R2599P7697l5217j04175k2279J22705
242C9954O1180j13037p8654O4501R0095N589j04577o2066J06357Q6776p8168r1464
254g3514K1590R1112M1687q7449q6858P4470J03928m2502r7415r792Q1134O6605
266H2996o4803j05730M3421J12896q404r2310m0447O1167Q9586l0127j18602M639
278f5718J11005K4504p4471o3940L0209J01649J828j14877k3132R3368M8159m8459
290B0125p9196L225J02370L0429j01345n4210P1893P1659k4415q5095k6553R2160
$$ plain form
208 -114670 -37512 91090 63172 -46515 -86978 -889 105339 42431 -99772 -66234 66564
219 66564 79295 -13060 -91322 -40490 92971 71771 -73760 -82863 31205 84833 21435 -80099
231 -80099 -62002 67912 85515 -40953 -91376 1223 78920 43703 -60472 -82751 39954
242 39954 101134 -11903 -90557 -26056 64039 69628 -34949 -97015 9342 96118 17950 -73514
254 -73514 -51924 39188 80875 -6574 -93432 -18962 84966 42464 -54951 -64743 16391 82996
266 82996 18193 -87537 -44116 68780 60376 -31934 -72381 -11214 78372 48245 -70357 -65718
278 -65718 45287 69791 -4680 -68620 -38411 63238 65066 -49811 -72943 20425 68584 20125
290 20125 -59071 -55846 46524 76953 -24392 -78602 -6709 64950 40535 -44560 -71113 21047
302B1047O2827q0904p6445M5587P6477P824p5508n7626P2426Q2288n4997q3090
314f0094J4799P3986L6485o3742p7240N2015R3501k7224q5202j3903O5057N8792
326F7230m3680r2571K2207R8019N268p7667l9055M5577P5138j5001r7629p428
338e9592R3032K7456o2378n3629K0574Q0725J3187r5372l2188Q1678M7508m0288
350B0713o5850o264Q2500L9704q4194n6694N9346O3401j6048o7132l0269O8798
362H011O3417o0465p3674L5805O7548O284n8219n2446N0964P9971l9618q1861
374e4283J2400O5743L0389m6033o9635L0999Q8302j2849q0504j5723N4540N0411
386E3757k7417p9213N412Q6970J4516p0435l5834L8999O1333n563q0440j8848
$$ plain form
302 21047 83874 2970 -73475 -27888 48589 56413 -19095 -76721 -4295 77993 22996 -60094
314 -60094 -45295 28691 65176 1434 -75806 -23791 69710 42486 -42716 -56619 8438 67230
326 67230 23550 -69021 -46814 51205 56473 -21194 -60249 -14672 60466 45465 -52164 -59592
338 -59592 33440 60896 -1482 -55111 -34537 46188 59375 -35997 -68185 13493 61001 20713
350 20713 -45137 -51401 31099 70803 -13391 -70085 -10739 52662 36614 -30518 -60787 8011
362 8011 71428 10963 -62711 -26906 40642 46926 -11293 -63739 -12775 67196 27578 -54283
374 -54283 -41883 23860 54249 8216 -61419 -30420 57882 45033 -35471 -51194 3346 53757
386 53757 26340 -52873 -47461 39509 54025 -16410 -52244 -13245 48088 42525 -37915 -56763
398e6763P9345L5325n7248n0095J7516O7181J9791p6827m1789O7903N2443l5130
410B1652n8725q397O4236M2753o4310n9163M6202O1273j1768n7305k8406N3427
422A469O0533m5060p1501K5055O4699P956n0719m7384L6359P4425k2637p7998
434d4803K601O0525K8947l4553o1782J4606Q0009N78p4428j9301M8008M3358j7091
447B6674o7702n992P7333K2955o3849l6964L3577N2724J941o7156k9506O7744
459A1779M3441m9138n0560J4493N5471K4290n8432m9086N2826N5905k8743n3980
471c1734p947N0264M1745m6000o1299L3356O2585p106n2739k6128M1142N5378
483E1517k8016o8972J0776O2844J3167m4971m1812K3885O4571o001o9751r883
$$ plain form
398 -56763 22582 57907 659 -49436 -31920 35261 55052 -21775 -63564 4339 56782 21652
410 21652 -37073 -45470 18766 61519 -2791 -61954 -15752 45521 33753 -23552 -51958 1469
422 1469 62002 16942 -54559 -29504 35195 43151 -7568 -54952 -18593 55832 33195 -44803
434 -44803 -42202 18323 47270 12717 -49065 -34459 45550 46128 -28300 -47601 407 43765 26674
447 26674 -41028 -47020 30313 53268 -10581 -47545 -13968 38756 40697 -26459 -55965 11779
459 11779 55220 6082 -44478 -29985 25486 49776 -8656 -57742 -4916 50989 22246 -31734
471 -31734 -39681 10583 52328 6328 -54971 -21615 40970 33864 -18875 -45003 -3861 51517
483 51517 23501 -45471 -34695 28149 41316 -3655 -45467 -21582 42989 36988 -32763 -42646
495d2646N5436K9901k9407n2368M936O6890J2220o4122k6668M2506M1970j2113
507B6535n7258j3363O3584L0566n2139m1336K5663M9363O557n5520l2805N2092
519A939M6327l5909m9216P184M8582K5118m4984m8378L7694N4962j8789n0428
531b5898j0857M1067M1458l3068n8826K0940N8488O89m6086k7589L0270N1969
543D2557j5358o3546O79N5850J7633l6655l8529J3781N7382L363o1248j6498M8409
556G820K9763k3001m5222l078N6131K1083n4621l1537L6268L8611o156m6887k0452
569d1278N0854L6587m2603m1889J9542M2646R806m2431l4757L8271M7503k5958
581A6293m7621M210M0408K4087l2289m6920K4158N4366j0757m7288j1418L3021
$$ plain form
495 -42646 12790 42691 13284 -39084 -34148 32742 44962 -19160 -45828 -3322 38648 26535
507 26535 -30723 -44086 19498 50064 -2075 -43411 -17748 31615 38172 -17348 -50153 1939
519 1939 48266 12357 -36859 -29675 18907 44025 -959 -49337 -11643 43319 24530 -25898
531 -25898 -36755 4312 45770 12702 -46124 -25184 33304 33993 -12093 -39682 -9412 42557
543 42557 27199 -36347 -35668 20182 37815 1160 -37369 -23588 33794 37157 -24091 -40589 7820
556 7820 37583 14582 -30640 -33718 22413 43496 -11125 -42662 -6394 32217 26061 -20826 -41278
569 -41278 9576 46163 3560 -38329 -18787 23859 33665 -8766 -43523 -5252 42251 16293
581 16293 -31328 -27118 13290 37377 5088 -41832 -17674 36692 25935 -21353 -32771 250
593B50L6644j9509n3585Q133N4561O214m0823k5804K2188M3945m589n3911r104
606c5390M9775K0424l1814l3576Q481M6293J1098n0680k2952M0530L1763j9402
618A4550l8931n780M3515K5589m1540l5871K8960L7749m747l7808k1175L7433
630A944L7537l1058m1495J3756L8647J0296l3642l1926K6571M4662j5720m5296
642b5724q89L6505K1278k3686m0543J2691M8955j339m3347j3552K8122L1494j1957
655A8008m5481q57M7398J2490l6467k4740J7648L7053J010m4700j4355M1369K3711
668C2087k6136l2080N302L9052J3596m1040k5655L2044L2300j4487l5282o821
680b7120L5800K5157l1359l5623K0987L6475k197l3321j9562K9261L5082k1750
$$ plain form
593 250 36894 17385 -36200 -28067 26494 32708 -8115 -33919 -11731 32214 27625 -26286 -35390
606 -35390 14385 34809 2995 -30581 -22100 24193 35291 -15389 -38341 2189 33952 14550
618 14550 -24381 -30161 13354 38943 -2597 -38468 -9508 28241 23494 -14314 -35489 1944
630 1944 39481 8423 -33072 -19316 19331 29627 -4015 -35941 -9370 35292 19572 -25724
642 -25724 -26613 9892 31170 7484 -33059 -20368 28587 27248 -16099 -29651 -1529 29965 18008
655 18008 -27473 -28330 19068 31558 -4909 -29649 -12001 25052 26062 -18638 -32993 8376 32087
668 32087 5951 -26129 -20827 18225 31821 -9219 -34874 -2830 29470 14983 -20299 -27120
680 -27120 8680 33837 2478 -33145 -12158 24317 22120 -11201 -30763 -1502 33580 11830
692A1830m0092Q504L5824J0933k8606k9232J9803M0260r450m0627m367L1900K1301
705B7981j9989l5653P917M2532L374l7806j5268K4114K8458q774l8957l860M0126
718A4195J4166l0764k3353J4081L2256L303l7647j6119L5309K3169k1993k8232
730b1629K373L2530J5166l3538k5836K6810K9601j1028k9872r062K9671K4299
742B9485k4864l3476J5591L3558k21k7506j9164K1708L3517j5029l7693N155L1882
755A2943J0497k1819k7253J1850L7796l220l7663p288K8427J9894j4302l1639
767b1777J140L7990Q830l4484j6930K1189K5390m499l2861r839L4978J8438k7059
780E06k4069J1467K8873N952l0916k0576K9009K6929j8706k8303J660K7784J6308
$$ plain form
692 11830 -28262 -19758 16066 26999 -1607 -30839 -11036 29224 19774 -20853 -25220 6680 27981
705 27981 7992 -27661 -19744 22788 26162 -11644 -26912 -2798 25660 16886 -22071 -25931 14195
718 14195 28361 -2403 -25756 -11675 20581 23884 -13763 -29882 5427 28596 6603 -21629
730 -21629 -19256 13274 28440 -5098 -30934 -4124 25477 14449 -15423 -24485 5186 29485
742 29485 4621 -28855 -13264 20294 20073 -7433 -26597 -4889 28628 13599 -24094 -18939 12943
755 12943 23440 1621 -25632 -13782 24014 20794 -16869 -24157 4270 24164 9862 -21777
767 -21777 -20637 17353 26183 -8301 -25231 -4042 21348 16849 -16012 -25851 9127 27565 506
780 506 -23563 -12096 16777 22729 -8187 -28763 246 27175 8469 -19834 -18174 9610 25918
793B5918k5775k8312K0342L1159p796k8351r442K3818K4576j7941l3418R723L3340
806A7841K282k6062j7628J6855L0643q009l5923l23L0766J1601j9457k4578P086
819a4906L3887K535l4402j0940K6408J8995j1293k8375k206L2622J2565k9793
831d903j8630J8023K3812j949k7996j2733K8872K1378k2535k4544Q900K5370P708
844B0773k5344k1021K1993K7309j3166k7179o60K3012J6781j8519k8140J3242
856a0919L1115l716k6789r694J8722K3318j1134l1538L317L1396N875k2781j7325
869b0153J2017K7326j515l2681o400K8222J3847j6484k2316L231K8710P657k9257
882g796j4571K2236J9176q081k4436n999K6680J6277k4150k1478J4558K3023L54
$$ plain form
793 25918 143 -28169 -7827 23332 15536 -12815 -22257 1561 26137 8196 -25222 -15499 17841
806 17841 20123 -5939 -23567 -6712 23931 15922 -20001 -20324 10442 22043 2586 -21992 -14906
819 -14906 18981 21516 -12886 -23826 2582 21577 10284 -18091 -20297 12325 24890 -4903
831 -4903 -23533 -5510 18302 16353 -11643 -24376 4496 25874 3339 -21205 -12305 13065 20773
844 20773 -4571 -25592 -3599 23710 10544 -16635 -17295 5717 22498 3979 -24161 -10919
856 -10919 20196 16480 -10309 -20003 -1281 22037 10903 -20635 -17318 14078 19953 -2828 -20153
869 -20153 -8136 19190 17675 -15006 -21406 6816 20663 4179 -18137 -14906 13804 21461 -7796
882 -7796 -22367 -131 19045 10964 -13472 -19471 7209 23486 -664 -22142 -7584 15439 15793
895A5793k3649j4055K2063K3261j6695k5443N918K2793R012j9917k1330J5023
907g226K7361p232k6440l461K0361J6658j3774k6167O685K9490O32k4510j1135
920a8758J5669K1544o288k7649k278K7127J0189j9975j7102P856K4159L025k7689
933a0170j0688K3927J6006j3477k0364M78K3719J0914k3827j7095J7246J9948
945A6617n253k1680p685K1174J7930j8038k2324J0027K2025K021j9055j4847J5749
958c339K2997j0527k4453K222K0235R484j4679k0237R127K5710k863k4127n411
971a5861J7640J4773q989k3327J794K5834M837k1525j1780J2366J8583j531k3745
984a0931o408K3246J2272j6823j6422N650K0034N188k1270j3395J8594J7176j0014
$$ plain form
895 15793 -7856 -21911 152 23413 6718 -18725 -12807 9986 18998 -919 -22249 -7226
907 -7226 20135 12903 -13537 -16998 3363 20021 6247 -19920 -13235 16255 16887 -7623 -18758
920 -18758 -3089 18455 12167 -15482 -17760 9367 19556 -419 -17521 -9665 14494 17519 -10170
933 -10170 -20858 3069 19075 5598 -14766 -14288 9431 20345 -3482 -20577 -3331 16617
945 16617 11364 -10316 -18001 3173 21103 3065 -19259 -9232 12793 14814 -4241 -19088 -3339
958 -3339 19658 9131 -15322 -13100 7135 16619 1940 -18297 -9170 16540 13677 -10450 -15861
971 -15861 1779 16552 7563 -15764 -13970 11864 16701 -4824 -16604 -4238 14345 12814 -10931
984 -10931 -17339 5907 18179 1356 -15066 -9416 10618 15806 -5464 -18859 -265 16911 6897
997F897j8816j661J9568J2063j8025j8319J2773J9893l046j9151q341J6413J7695
1010A7943j2365k1339N358K0431L752j6000j3948J1090K1003n628k2631q60J8544
1023E350R694j1847j8526N088K3192R53k1424p456J4529J4512n888k0242j900
1036a3965K2006P948j8349j2314R565J7135K92k0071q248J9212J2970j3610j5531
1049a2960L807J7273O646j7779j3847J4968J7094p551j7446k563J6108J2284j3673
1062B361j8082R024J8547j290j5907q308J2491J5966q058j9786K646J8582M994
1075A3180j4129j2695P985J8772k450k0033l828J6648J0075r901j5708K502J9128
1088I546M129j8493q800J2405J3111m148j7209l581J8339R432j5312j2380P593
$$ plain form
997 6897 -11919 -13580 5988 18051 26 -18293 -5520 14373 11327 -7824 -16165 248 17943
1010 17943 5578 -15761 -10403 10028 13780 -2220 -16168 -5078 15925 10297 -12334 -13194 5350
1023 5350 15044 3197 -15329 -10241 12951 13904 -7520 -14976 -447 14065 8177 -12065 -13965
1036 -13965 8041 15989 -2360 -14674 -5109 12026 12318 -7753 -16001 3211 16181 2571 -12960
1049 -12960 -9153 8120 14766 -3013 -16860 -1892 15202 7651 -9795 -12358 3750 16034 2361
1062 2361 -15721 -6697 11850 10560 -5347 -13655 -1164 14802 6744 -13042 -10396 8186 13180
1075 13180 -949 -13644 -5659 13113 10663 -9370 -13198 3450 13525 3624 -12084 -9582 9546
1088 9546 13675 -4818 -13618 -1213 11898 7750 -9459 -13040 5299 14731 -581 -12961 -5368
1101e368J5275J080j6575q779J5075J3355j0278j5112K436J4771P360j4099j3911
1114a4770J1221J6409n536j5239l127J2805J1745r923j6992O073J7176j17j3978
1127d253p630R536J4885n136j8498O22J7097M961j1983j1421N633J6652J14j8160
1141g581m988J4879R386q006j3396M3J6550N849j5970j0029J1787J1934k935j4503
1155f980n013J5277J0186j2451j3270O635J3592K006j3425r587J2025J4023q230
1168D788j4578J311J3389O922j1250j2866P268J6287l242j5100k894J0911J0730
1181A1676p413j5758L341J6922J557j3685p634Q576J2889k521j6931j525J5294
1194D788O468j0666j1011M038J4734K229j6005o800J3330R972o914j2875m36J4538
$$ plain form
1101 -5368 9907 10987 -5588 -14367 708 14063 3785 -11327 -8891 5880 13240 -859 -14770
1114 -14770 -3549 12860 7324 -7915 -11042 1763 13508 3585 -13407 -7334 9842 9725 -4253
1127 -4253 -11883 -2347 12538 7402 -11096 -10474 6623 11584 -399 -11820 -6187 10465 10579 -7581
1141 -7581 -12569 2310 11696 3690 -9706 -9663 6887 12736 -3234 -13263 -1476 10458 7523 -6980
1155 -6980 -11993 3284 13470 1019 -12251 -5616 7976 9982 -3443 -13030 -1005 13018 4788
1168 4788 -9790 -8479 4910 11832 582 -12284 -5016 11271 8029 -7071 -9965 946 11676
1181 11676 4263 -11495 -8154 8768 10325 -3360 -10994 -2418 10471 7950 -8981 -10506 4788
1194 4788 11256 590 -10421 -6383 8351 10580 -5425 -12225 1105 11077 4163 -8712 -9148 5390
1208E390O517j3897j0232R766J1874k349j2643n401J2738J0679j0401j2804M548
1221f215J3368K202j1720r488R602J3882o063j4157J98J2199O139q773j2089N033
1235e882J5605j655j3854m139J0424R634n123j4417Q94J5505L138j2326p874O747
1249c323J2146p78j5113l743J4148P112r153j0120K731J2592L609j3818p474J0974
1263b10R942n120j2016r99J1474Q178j1422j1148P821J2207j364j1451n847R669
1277b86J1302p558j3112L187J2305K826r695r236O782J3436l549j3644j073J1058
1291B743O625p134j1622L035J4204J081j3446n005Q857R888l760j2866j596J3613
1305D617N097j0625q471N696J0774N72j2780n216J2010Q239p853r862J401J1112
$$ plain form
1208 5390 11907 -1990 -12222 -2456 9418 7069 -5574 -10975 1763 12442 2041 -10763 -6215
1221 -6215 7153 9355 -2365 -11853 -2251 11631 5568 -8589 -8391 3808 9947 1174 -10915 -5882
1235 -5882 9723 8068 -5786 -9925 499 10133 5010 -9407 -8513 6992 10130 -2196 -10070 -3323
1249 -3323 8823 8045 -7068 -10811 3337 10449 1296 -8824 -6093 6499 10108 -3710 -11184 -210
1263 -210 9732 4612 -7404 -8403 3071 11249 -173 -11321 -3500 8707 7343 -4108 -9955 -286
1277 -286 11016 3458 -9654 -6467 5838 8664 -1031 -10267 -3485 9951 6402 -7242 -8315 2743
1291 2743 9368 2234 -9388 -6353 7851 8932 -4514 -9519 -662 9226 5466 -7400 -8996 4617
1305 4617 9714 -911 -9382 -3686 7088 7660 -5120 -10336 1674 9913 2060 -7802 -6401 4711
1319D711M822j1622q391Q708J0513l670j0965k294J0288P730q423j1009N049J1536
1333F983L55j0386n995P700J0707m981j2524J291J1629L631q418q836M650J2392
1347H198j149j2841k611J0022P031n631j0699R43J2690K749j1711o036P819Q748
1361G522k321j0961k965J1931O407r600q350M530R851J413j0653o286R619R048
1375I185o335r837Q80R619N103q865r447P062J0370k320j0045k716Q088P956o174
1390B524j0664K804J1125J120r194n725O050J0149l182j1468l35J0341M271p107
1404G09q105L052J0627P20j0939m176Q732O960m457r118q43J1166L718r430o572
1419g956O082Q297j064r729l691J0046O862p583q761L179R264K118q854o374O977
$$ plain form
1319 4711 9533 -2089 -10480 -1772 8741 5071 -5894 -8188 2100 9830 1407 -9602 -4553 6983
1333 6983 7338 -3048 -9043 -1343 9364 4383 -8141 -6850 4779 8410 -8 -8844 -4194 8198
1347 8198 7049 -5792 -8403 1619 8650 3019 -7680 -6737 5953 8702 -3009 -9045 -1226 7522
1361 7522 5201 -5760 -8725 3206 9613 13 -8337 -3807 6044 7457 -3196 -9482 137 9185
1375 9185 2850 -6987 -6107 3512 8615 -250 -9697 -2635 7735 5415 -4630 -7346 742 8698 2524
1390 2524 -8140 -5336 5789 6909 -2285 -8010 -1960 8189 5007 -6461 -6796 3545 7816 709
1404 709 -7396 -4344 6283 7003 -3936 -8112 620 7580 3123 -5995 -6838 4328 8046 -1384 -7956
1419 -7956 -1874 6423 5359 -4370 -8061 1985 8847 1264 -7497 -4318 4946 7064 -1790 -8164 -1187
1434a187R131m461r392R5Q371M940o811q986M839J0259j304r274l137O903P444
1449G430m523r706J216J0320J963q244n276M421R038j255j0537j929R632M457
1463G007n830p568J639R962J785r916m336P083O774l204q343j216R256M567q427
1478g67o742N306P504n96p800m141Q013O828n599q518K294P960K419p251o464
1493g554N790R147l342q927o15P469M868n719q180L170R417j76q213l498N818
1508e45O916l110q965K00R701K127p071n384L763P646k1r072k592P827N181n273
1524A328p142J427Q210K723q238n227O482O471k896p507j522P908N040o767p397
1539g107M185P842J22p688m024O358P018m194q349J447P706K441o315n757M003
$$ plain form
1434 -1187 7944 3483 -5909 -5814 2557 7497 686 -8300 -3461 6798 5494 -3780 -6917 -14 7430
1449 7430 2907 -6799 -5583 4737 6700 -1544 -6820 -2399 6639 5384 -5153 -7082 2550 7007
1463 7007 1177 -6391 -4752 5210 6995 -2921 -7257 -174 6600 3396 -4947 -6163 3093 7660 -767
1478 -767 -7509 -2203 5301 4705 -3095 -7236 777 7605 2006 -6512 -4218 3742 6161 -1090 -7554
1493 -7554 -1764 7383 4041 -4886 -5501 1968 6836 1117 -7063 -3893 5524 5348 -2865 -6363 -545
1508 -545 6371 3261 -5704 -5504 4197 6324 -747 -6131 -2368 5278 5257 -3815 -6407 1420 6601 1328
1524 1328 -5814 -4387 3823 6546 -1692 -6919 -437 6034 3138 -4369 -5891 2017 7057 290 -7107
1539 -7107 -2922 4920 5042 -2646 -6670 -312 6706 2512 -5837 -4390 3316 5757 -558 -6315 -2312
1554b312Q489j765q583j368O667N412m963p313J879Q628Q20p975l718N423O212
1569E533j878q240r52Q544L271o261n537K604P471P00q170l520P012N493m416
1584A654o707R63P209L197p514n226N217O708j860p170j918O440N532n434p281
1599f190L070P201P69o484m442N244P273l701p711L81O992L429n811n949L401
1614b528P990j111p829j711N842M883l439p073L15Q699J556p049m020M280O053
1629D858j095p522j860P384M137n466n595K304O638J312p243l727N997N830l734
1644B218o535J95O485L221n837n797M346O544j142o639k459N912N250l917p311
1659e466J831P400J199o133m130L753O962k109p746k99O742L215m394o143J939
$$ plain form
1554 -2312 6177 4412 -4171 -5539 1128 6540 1577 -5736 -3857 4771 5591 -2384 -6102 -679 5533
1569 5533 3655 -4585 -5537 3007 6278 17 -5520 -2916 4555 5255 -2915 -6435 577 6070 1654
1584 1654 -5053 -4090 3119 6316 -1198 -6424 -1207 5501 3641 -3529 -5447 993 6525 1091 -6190
1599 -6190 -3120 4081 4850 -1634 -6076 -832 6441 2740 -4971 -4590 2402 5831 20 -5929 -2528
1614 -2528 5462 4351 -3478 -5189 653 5536 2097 -4976 -4661 4038 5594 -1455 -5475 -1195 4858
1629 4858 3763 -3759 -5619 1765 5902 436 -5159 -2855 3783 5095 -2148 -5875 122 5952 2218
1644 2218 -4317 -4122 2363 5584 -253 -6050 -1704 4840 3698 -2941 -5400 512 5762 1845 -5466
1659 -5466 -3635 3765 4964 -1169 -5299 -1546 5416 3307 -4439 -4738 2004 5219 825 -5318 -3379
1674c379P921K80p106l130N648M980k789o563n19P494K450o085m370L233O358
1689D423m61o461k590N954M959m791n804J390O624J498n687n133N470N833k304
1704B920o606r97N986M226m848n971K624O903n61n714l256N093N236k771o818
1719d554P54O617J895n075m696L228O430j176o651j383N710L795l559n496O24
1734c537O956J220o222l694M623N190j629o257j190O109L786n379m613K737N331
1749C431O06n935l459N556M924l600n953R18N656K509m690n184L405O314j279
1764C219o239j105M674L893l046o018J582O634M55n749k772L648M932j406o379
1779c677m27O043K431m177m175J745N605P78o149k689N297L970k738n465J45N731
$$ plain form
1674 -3379 4542 4822 -2284 -5414 234 5214 2425 -4138 -4657 2837 5287 -798 -5168 -1935 4423
1689 4423 3962 -2499 -5089 865 5824 1033 -4771 -3381 3243 4741 -946 -6079 -609 5224 2920
1704 2920 -3686 -4683 1303 5529 681 -5290 -2666 4237 3676 -2038 -5294 -201 5035 2264 -4554
1719 -4554 -3800 2817 4712 -363 -5059 -1831 4599 3423 -3228 -4611 1099 4894 1335 -4161 -3537
1734 -3537 3419 4639 -1583 -5277 -654 4536 2907 -3350 -4540 1569 5355 -24 -4637 -1900 3431
1749 3431 4037 -1898 -5357 199 5123 1523 -4430 -3512 2144 4653 -37 -5221 -1816 4498 3219
1764 3219 -3020 -4125 549 4442 1396 -4622 -3040 3594 4049 -1700 -4472 -824 4108 2702 -3677
1779 -3677 -4104 1939 4370 193 -3982 -2237 3368 4146 -2003 -4692 605 4575 1837 -3628 -3483 2248
1795B248K626n300m350L673M902j056n347j597M877M140l855n338K029N119J062
1810C833n037l292L814N179k113n846j09N210K580l638m930K256N861o34n461
1825b327j756M187L860k073n401P59N511J138m748l358K975N100p53n571j604
1840d061M964L472l816l779J156M694J332n091l146M110M058k010m902m80M919
1855A420K491l637m367K448N197m93m879k016L988L840k651m833Q93M733J781
1870C915m225l530K979M616j102n330r19M459K952l293m056J457M849L91m461
1885a298k269L123M209j979m561n37N342J732l735l415J776M745q8n180j757M491
1901E99L078k924l808L61M622J671m439k681K866L812j146m252r63L925L319l277
$$ plain form
1795 2248 4874 -426 -4776 -1103 3799 2743 -2604 -4201 676 4816 961 -4377 -2348 2771 3833
1810 3833 -1204 -4496 -682 4497 2384 -3462 -3571 1639 4219 581 -4349 -2093 3768 3134 -2327
1825 -2327 -4083 104 3964 1891 -3510 -2751 2760 3898 -850 -4208 -1233 3867 3114 -2457 -4061
1840 -4061 903 4375 559 -3220 -2064 2630 3962 -1129 -4275 -165 3893 1883 -3019 -3499 1420
1855 1420 3911 274 -4093 -1645 3552 3059 -1820 -3836 152 3992 1341 -3492 -2599 2134 3915
1870 3915 -310 -3840 -861 3755 2653 -2677 -3596 863 3815 522 -3534 -2077 2772 3163 -1298
1885 -1298 -3567 -444 3765 1786 -2775 -3312 2030 3762 27 -3388 -1612 3133 3045 -2135 -3892 599
1901 599 3677 753 -3055 -2694 1928 3599 -840 -3521 -655 3157 2011 -2241 -3204 721 4040 763
1917G63m063J504M508K76m221k001K894M050k150m729N95L994J630k967l695K161
1933a451M509l20m761r36L923K596k533m166O36M660J335m555k478L054L721r83
1949B251m329j062M021K498l327l238J542L843P23m056k280L398L447k365l855
1964b789M04L981J767l680l097K395M060r51l926j155L885K350k309m125J110
1979b080M478M51l955k010K416L904r26m736m02M054J984l011l066J025M134N71
1995B831m151j639L267K824j823l962P9M277J306l409k685K141L441k39l841j516
2011c099L519K934k460l512Q27L390J162l688k528L158L061j190l682j00L128
2026I20K350k782l873J987M173l90l617j534K492L563j798l712m6M025J078l187
$$ plain form
1917 763 -3300 -1796 2712 2988 -1233 -3234 -340 3710 1560 -3169 -2574 1420 3050 83 -3612 -1451
1933 -1451 3058 2738 -2023 -2959 964 3560 1027 -3139 -2503 2157 3492 -1063 -3541 -487 3234 2251
1949 2251 -2078 -3140 881 3379 52 -3186 -1644 2199 2922 -1134 -3414 -16 3431 1066 -2789
1964 -2789 -2385 1596 3363 -317 -3414 -1019 3041 2090 -1836 -2991 894 3244 935 -3190 -2080
1979 -2080 2398 2849 -1106 -3116 -700 3204 2278 -2458 -2860 1194 3178 167 -2899 -1874 2260 2831
1995 2831 -1320 -2959 308 3132 1309 -2653 -2574 1703 3009 -400 -3085 -944 2497 2258 -1583 -3099
2011 -3099 420 3354 894 -2618 -1791 1599 2761 -927 -3455 -297 2764 1574 -2108 -2208 920
2026 920 3270 488 -3385 -1398 2775 2385 -1232 -2766 -274 3289 1491 -2221 -2267 1758 2836 -351
2042c51k520K044L374o30l779o33L083K338k276l106M57M099Q51m110k107K784
2058d82L219j438l211p36L778J990k791l236J544L602J03l593j608L260K747j966
2074A182l944P16L151J686l250k641K119L775o63m037m03K796K397k339l504R55
2090b004M024N28l864j373K497L022j307l616m39L780J491k741k654J379L591
2105B314j3l550j069K374K437j790l008P9L287J882l353k215J917L119q08k915
2121a312j158K880K423k435k846Q97L091R60k954k250K340L199j475l173k42K971
2137I16J620k015l243J212L509J47l624j068K602K392j267l265Q5L368J243l009
2153c97j951J443L263o32l496q27K954K538k569k599N44L284P18k920j770K011
$$ plain form
2042 -351 -2871 -827 2547 1917 -1862 -2495 588 2926 650 -2456 -1999 2100 2951 -1159 -3266 -482
2058 -482 2737 1299 -1912 -2648 1130 3120 329 -2907 -1363 2239 2342 -1251 -2859 401 3148 1182
2074 1182 -2762 -2046 1105 2791 -459 -3100 -981 2794 2131 -1906 -2309 487 2884 545 -2959 -2004
2090 -2004 2020 2548 -1316 -2689 -192 2830 1523 -2093 -2532 1248 2739 -2 -2656 -1277 2314
2105 2314 2301 -1249 -2318 56 2493 703 -2305 -2226 1061 2943 -410 -2625 -708 2411 1603 -1312
2121 -1312 -2470 410 2833 398 -2448 -1551 1540 2500 -454 -2704 -364 2835 1360 -1813 -2055 916
2137 916 2536 521 -2722 -1510 1999 2146 -1478 -2546 56 2448 1181 -2084 -1999 1369 2612 -397
2153 -397 -2348 -905 2358 1726 -1770 -2597 357 2895 326 -2273 -1729 1555 2273 -647 -2417 -406
2169d06K816j327k877k61K696J962k527k506J335K794K6k686j509K346K660j508
2185A028k915L62K920R89k640k145J689K894k90l384l62K647J429j604k729N45
2201a566L313L72k935k067K575K408p95k933l85K822J572k255k269Q86K887K01
2217A831k928j032K270K149j315k790M67K455J128k248k311J974K380n84k848
2232a402o26K613J839j654k650L36L069O14k559j946J948K654j173k570k89K543
2248G47J120j521k591J054K622L2k600j012K136K309j523k764M08K678R64k559
2264e00j617J618K258m36k256q41K073J648j476k447P74K218R47k595j585J888
2280c29K274q00k690l07K205J590j767k122J055K325N1k114j327J724K230j002
$$ plain form
2169 -406 2410 1083 -1794 -2055 641 2603 76 -2430 -1095 1699 1725 -961 -2470 -124 2536 1028
2185 1028 -1887 -1525 1395 2384 -256 -2401 -712 2182 1892 -1492 -1854 793 2222 618 -2111 -1566
2201 -1566 1747 2119 -816 -2883 -308 2100 1305 -1628 -2013 809 2381 126 -2143 -1257 1630 1831
2217 1831 -1097 -2129 141 2290 975 -1815 -1348 1107 2235 -13 -2324 -350 2030 1446 -1402
2232 -1402 -2028 585 2424 770 -1880 -1544 1525 2139 -420 -2366 -418 2236 1063 -1507 -1796 747
2248 747 1867 346 -2245 -1191 1431 1463 -1137 -2149 -13 2296 773 -1991 -1583 1095 2059 -500
2264 -500 -2117 -499 1759 1323 -933 -1774 299 1947 471 -1976 -1202 1016 1963 -632 -2217 -329
2280 -329 1945 1145 -1545 -1852 353 1943 176 -1946 -891 1434 1485 -629 -1956 -232 1998 996
2296I96k771N16K396N08j808j735J307K254k12k267r55K118J602j748k178M23
2312a554K793M55k317j428J706J759n19k323J49J523J595j640k069N81K819r5
2328A435k135j342K060K155j535k129J43J808J403j946j630J324J768j84k246
2343a051p28K010J671j681j872N01K337J09j867j187J688J766p78k285l29K230
2359E34J177j518j670P10K179j37k071j012J941J578r74k281L03J963R89j858
2375a47j580J232J908l88k319n09J733J905j631j734O39K107J16j795j332J480
2391c15J661l82k127M7J632R21j180k036R96K021J79k303n90J544J633q25k308
2408a432K85K004P01j867j346P44K049L23k350o78J671J465j170j854O30K055
$$ plain form
2296 996 -1775 -1259 1137 1645 -163 -1898 -591 1663 1451 -816 -1771 347 1949 201 -1977 -1554
2312 -1554 1239 1694 -623 -2051 -345 1414 895 -1428 -1279 244 1839 199 -1870 -1289 1530 1435
2328 1435 -700 -2042 18 2173 638 -1491 -1348 460 1863 -83 -1713 -389 1379 1195 -1051
2343 -1051 -1779 231 1902 221 -1651 -1150 1187 1296 -571 -1758 -70 1696 918 -1367 -1696 534
2359 534 1711 193 -1477 -767 1412 1275 -796 -1808 133 1711 737 -1544 -1241 722 1711 -147
2375 -147 -1727 -495 1413 1025 -1294 -1803 -70 1835 204 -1530 -891 1216 1332 -463 -1795 -315
2391 -315 1346 964 -1163 -1116 516 1437 257 -1779 -783 1238 1417 -886 -1476 68 1701 876 -1432
2408 -1432 -1147 857 1558 -309 -1655 -911 1138 1461 -889 -1567 104 1569 399 -1455 -825 1230
2424A230L36k096j054J603J350n38j914m60K132N96q16j925P49J669O49k170p23
2441a382J244J652q80k003L99J643P67j403j595J014J896k89k023l26J639J093
2457A446j319j391L4K526k30j484o51N60J995q46j530j53J666N16j266j286O59
2474g54J888j39j668p17J404J534r25j788P2J855Q03j632j837J378J645J04j712
2491d89r30K057Q34j005j777K85K038K86j394j125Q30J976q94j574o2J807P23
2508A586j417j692Q29J762K1j569j007J254J468o41j787K06J510Q47j508j017
2524a155P81J368K09k038m51J545J111o78j920M32J590O28j418j338J230J594
2540A490p39j426n41J700Q29p91j840N69J765J13j412r67J366R33k75j918K3J811
$$ plain form
2424 1230 1566 -530 -1584 19 1369 831 -1083 -1543 589 1185 369 -1556 -807 862 1511 -659 -1382
2441 -1382 -138 1514 634 -1369 -970 673 1440 37 -1558 -544 1352 1063 -960 -1286 353 1446
2457 1446 127 -1264 -1230 1296 1066 -418 -1069 -509 1486 640 -890 -1043 623 1139 -127 -1413 -754
2474 -754 1134 995 -673 -1390 14 1548 623 -1165 -1093 762 1565 -67 -1904 -526 1119 1223 -489
2491 -489 -1419 638 1472 467 -1310 -1025 1013 1299 -95 -1220 -390 1586 692 -882 -944 863 1586
2508 1586 169 -1523 -694 1068 1089 -480 -1487 -233 1235 594 -1193 -987 523 1370 -138 -1155
2524 -1155 -374 994 1203 -835 -1286 259 1370 692 -1228 -796 794 1422 4 -1334 -104 1490
2540 1490 751 -675 -1216 484 1313 522 -1318 -749 1016 1129 -283 -1250 116 1049 774 -1144 -1121 690
2558F90L33j399p81M38J768N2j516j189K101Q16n65j936K98J603M21j417r69P93
2576d59J435q7j560l12J194P54q51j108M49J386L22j504j077J347J607j323j232
2593a019Q1J570Q60j744j139P75J261K26j606l30J111J091q25j371K87J753J25
2610A106j094j159R28J513m69j551n46J404J255j154j520N75J444L13j534o38
2626a127J133J036m95j171k84J368J039j135j753Q38J365K56j316j069J385R33
2642A003p44j487K76J329N75j194p16K59J706k78j123q34J305R68p99j302K58
2659g98J493M7j070p18J035J057p49j078k52J563O09j063q96K31J334K96j540
2676d99m72O38J608p76j246l1J182P03j251r37O66J372k27j278n95J022J124l52
$$ plain form
2558 690 1023 -376 -1157 -719 1049 1101 -415 -1604 497 1313 748 -1188 -890 713 1134 -283 -1252 -459
2576 -459 976 889 -671 -983 211 965 114 -994 -545 841 1163 -341 -1418 -71 1536 213 -1019
2593 -1019 -938 632 1492 -252 -1391 -616 645 871 -735 -1065 46 1137 312 -1059 -772 981 1106
2610 1106 12 -1147 -219 1294 825 -726 -1272 132 1387 233 -1287 -712 732 1045 -489 -1127
2626 -1127 6 1042 547 -624 -908 460 1499 364 -1389 -551 814 1070 -246 -1315 70 1003
2642 1003 259 -1228 -952 377 952 -242 -958 -699 1007 729 -394 -1228 77 1045 246 -1056 -798
2659 -798 695 742 -328 -1046 -11 1046 297 -781 -1033 530 1139 76 -820 -589 745 1041 -499
2676 -499 -971 -333 1275 499 -747 -778 404 1107 -144 -1081 -415 957 730 -548 -1143 -121 1003 651
2694F51j572M43J149M03j279r22Q45J295n37j510K23R64R32j121j013L79J494
2711H24k45r74o70R67O21J71j334l55J716N13j337q78M40J262k01q17r22J262
2729D3P34p96p41K46J137L82j242q31Q10J352m67r79k83P12R54j060n96Q1J106
2748E62J85j093o17Q07J059l47j231J46P29O40p05j009O99O97l3r44l69O38J009
2767H23n85p19j93R39M41r35o15M76J152m04r74k48R27N87m24j485R88M84N75
2786H10r81r03R41Q06j73r96l90J073P30q68j037O02R66O5j407k85Q84Q14m50
2805B01j195N76N53N70q53o72O93R01P7j376k91Q42Q99o56q98M43P22J53r69l54
2825f34M97P71j07j088j01J148O4n61p76M4J438o0j045m55O94J040n38j020q6
$$ plain form
2694 651 -921 -478 671 1074 -205 -1127 -282 1013 476 -1034 -811 153 1085 -36 -1049 -670 824
2711 824 579 -395 -1065 -98 523 694 -640 -995 721 1234 -103 -981 -541 721 520 -297 -1219 43
2729 43 777 -19 -760 -514 623 1005 -237 -1068 -258 1094 627 -352 -635 77 1031 -29 -625 -544 562
2748 562 747 -346 -963 -156 903 556 -675 -529 200 840 135 -874 -175 522 489 -455 -824 -186 823
2767 823 238 -481 -674 265 706 -229 -844 -368 784 380 -594 -842 85 672 248 -1237 -249 235 810
2786 810 -171 -1074 -133 673 500 -496 -886 187 917 49 -988 -386 580 645 -762 -1047 -163 651 201
2805 201 -994 -418 135 705 -148 -820 -127 774 851 -525 -816 26 925 269 -629 -186 536 689 -280 -634
2825 -634 -137 634 527 -561 -662 486 550 -11 -787 -743 695 635 -410 -865 -171 869 331 -689 -775
2844g75J192L46r28o90L91J232j94j280k87J132P49o56q04l08J292J53q87m10
2862g32L31N70N13j226j71J111P3l25j119Q36M68P33j162p17O74R54o14q22o0
2881f85J218K63o96j051Q17P29R0o53o72N16Q75j00j178j26J059K58p19r50Q33
2900a72R18k53j019k53J185M45q35n11J99O54L24j165l75Q75P91k37j337L49R51
2919E34R7o86m91K73R67P3j176j61P51M96l87q23k04J213K67p98p12N10R65j39
2939E69j015k59J044M00o86m91j12J146L40j286k70L89J226m21r72l27O96Q17
2957G88r94n72K10J119J74j155n9N41O24n90p32L99O45L10p88q76N10J019N2r95
2977c70m08J045J18l88m43K40O01O9n40q45Q11J045l56q92k43J046O2m22j223
$$ plain form
2844 -775 417 763 -165 -855 -464 768 574 -706 -993 139 888 232 -572 -880 412 565 -322 -732
2862 -732 -401 169 682 -544 -715 396 469 144 -975 -139 329 1062 -100 -817 -143 811 197 -625 -685
2881 -685 533 796 100 -951 -134 595 685 32 -640 -124 751 651 -527 -653 406 664 -55 -1005 -172
2900 -172 746 493 -526 -779 406 851 16 -495 -296 358 682 -483 -858 17 808 571 -766 -417 534
2919 534 631 -55 -546 -273 694 767 -409 -570 181 677 290 -533 -737 476 743 -55 -767 -257 708 569
2939 569 -446 -705 339 739 53 -438 -550 596 936 -350 -620 -231 995 574 -398 -725 -29 788
2957 788 -206 -778 -568 551 725 -430 -489 52 676 86 -646 -247 398 708 -80 -956 -446 573 625 -370
2977 -370 -778 267 385 -3 -446 -206 395 464 -76 -921 -110 935 579 -313 -556 490 552 130 -1093
2996a093N01J194J6r48m67R97P39p35n76m31J171M55r86q27Q43O57j26q56l44
3015h16O81O24k47q01k05J345M57j340n86N54J064l17j165J83J091p1n10q78N31
3034d06J049N76j322r46R84P73l44r51j42J131L81m58j223O00J011k66j011K50
3052c14L64J017p99j118M02R80J28p34r66P22J128l25j319J25Q34M53k10j198
3070h30L09R77L75j000o28M96R32k42j078j12J229L77j025m23N07N76M16j303
3088d47m25J138L38r9j380L56J063L52r36p36L30J404l21j183k34P97N51l53j137
3107i22N90J120r0q85m38M99R60m18p72M8Q43L33r41m22Q8Q79R9q36m35P09Q13
3128H22l73j027k29R22P01r45o11N00Q54k07q79m3P73N69m06j100r5J052K54j050
$$ plain form
2996 -1093 -592 602 618 -330 -797 200 939 204 -372 -803 368 823 -163 -990 -147 510 384 -472 -816
3015 -816 -135 489 242 -559 -764 581 1038 -302 -888 -334 730 413 -752 -569 522 451 -59 -937 -406
3034 -406 643 1219 -103 -1049 -65 708 364 -587 -729 402 783 325 -898 -298 713 447 -564 -314
3052 -314 50 1067 268 -850 -448 532 660 -74 -1040 -318 810 485 -834 -709 125 578 368 -830
3070 -830 -521 456 831 -169 -797 -301 631 389 -689 -801 428 805 -220 -643 -136 440 856 -447
3088 -447 -872 266 604 505 -875 -519 544 896 -40 -776 -446 958 637 -546 -780 17 568 215 -922
3107 -922 -332 788 698 -187 -625 -126 834 416 -356 -308 535 868 -73 -495 -407 472 571 -265 -700 9 822
3128 822 449 -578 -807 115 816 -129 -740 -240 614 407 -472 -515 258 827 421 -679 -774 278 532 -518
3148e18r9J71J353l01p58m58R10M49p65r92M75J240n0r14l86M90R91l12q13OO03
3169C22K14k61q49J22J178j14q75k52M30R35o50p34k30J363K02o78j029P03P42
3188E39L2r64j33N82P39n19p82M7J057j93o52l48N43O23o06m40q9P45P43j020
3208i6o14L27Q69Q9r16m71Q50P50K9j630L91Q05L50o37j016O85Q01k51q24j02
3228f11O99N68m00q00K55P21K44n70q70O54Q08N3j242l15J175n8k73m28J13Q45
3248E68j40q00k65N52P79k30r40q7R37Q8m46p74P49O39j08r44j15M61N35n54n84
3269f79K29P92L14n39n94J16J065l19m58n39O65N44m80j036O58Q29J19j047l54
3288g14Q87O16n48l92k85Q02Q4o98n27P04M41K19r03l53Q66M19n59p39L20O92
$$ plain form
3148 -518 -617 -446 907 606 -152 -610 300 749 -16 -1008 -533 707 657 -257 -643 -153 838 526 -287 -281 322
3169 322 536 275 -574 -452 726 612 -263 -515 -85 850 200 -534 -764 599 801 123 -906 -203 539
3188 539 571 -393 -526 56 795 276 -506 -459 598 405 -247 -595 -52 571 -35 -475 -564 181 924 -96
3208 -96 -710 -383 486 575 -341 -812 38 788 817 -813 -422 383 733 96 -920 -235 566 315 -509 -611
3228 -611 88 656 256 -544 -289 432 676 106 -764 -110 698 751 -491 -806 369 311 38 -390 -277 568
3248 568 428 -372 -637 -85 694 464 -476 -563 374 462 16 -758 -9 630 522 -422 -537 -76 459 -95 -679
3269 -679 -450 342 656 117 -477 -361 704 385 -73 -612 53 597 117 -919 -261 568 687 -360 -714
3288 -714 173 789 241 -151 -436 366 450 -248 -775 -71 370 589 -314 -667 199 618 59 -680 -360 332
3308C32K99p55l92K72J120o26n57j34P17M40m79r44K31J135k85q62J5K83Q30o34
3328Fm06R7P41K97p98n24M88M80N7o52l89M61O19o55m59K60Q15J04p23k05K93
3349i3P68q9r19l39Q75J42l12j022O85P79M0r30l08N33Q24l93r27K14Q38K15r81
3370d00k39K92O95k9n80k00M67O09m35q89N89M28K27q81J2L52O78l75r37k5O81
3391D0R46j020n71L18Q53k36m61o10Q84N09l56q67K91O99K37l99o79P0J078mq03
3412h1k64L69R69r72o93N84L81J33o31k22J62N83m34m78J73N76J74l43n55J40
3432d29J030r7q00l83O77M54Q5r64P3N76M41j083j13M29N17K14q54L2N21K19n72
3453b7m31m1J023J74o56l75o2O39J26q72K06M81L93n84n34K66R83l18p29j46L35
$$ plain form
3308 332 631 -124 -516 -244 876 250 -307 -441 276 716 237 -707 -476 659 374 -488 -473 -190 640 6
3328 6 -400 -303 438 735 -63 -587 -99 381 438 -214 -603 -142 477 -178 -637 -377 438 542 -181 -386 -93
3349 -93 675 586 -333 -672 203 345 33 -989 -304 475 515 -415 -723 -190 634 241 -686 -472 366 581 -400
3370 -400 -639 -347 348 319 -261 -461 6 615 180 -709 -120 308 535 -346 -334 18 696 321 -616 -641 40
3391 40 986 -34 -605 -287 566 330 -131 -741 143 652 296 -571 -280 419 656 257 -422 -352 726 722 -81
3412 -81 -345 24 993 21 -672 -88 293 426 -205 -427 -265 318 -116 -594 -421 155 329 -14 -569 -429
3432 -429 601 504 -296 -679 -2 452 537 -427 -354 222 663 -420 -533 -104 413 627 -227 -195 326 545 -27
3453 -27 -458 -499 524 698 42 -333 -395 244 370 -502 -296 185 578 -6 -540 -274 709 391 -338 -484 -149
3474a49N77j79q73j84P85M59o81l08L41O86p4o97j29O50L84k96p31L26L37M32
3494F76r70k43M90L97K56j030k50P45N01p13l90J36Q89k22p45k82Q25M99n78m27
3514d36MP43J20n31o55O20R32n85m61j91M60R89j071n26L23N83L06n21o02L56
3534a43O73n31l30j88N21N06l03p07J30Q98J30p66m02N81J71J58r56K28P36N5
3554D61q61l02P55L24M8r52l83J081P06j046l73N52N63M5p91k68M56O67l88o84
3574c90j99Q53M26p57n66M18P91Q4j000l39O80N09m69l67k97O69L89m36l52J59
3594a94M78K83j115j92Q92L44m73o62M25P37K64q84o81M65J049l38q78N5P79J87
3614E41p89k38J71R85l53o07m8M63N31n99m80m7R87K14p71m95K83Q98k21r55L34
$$ plain form
3474 -149 428 249 -624 -808 -23 436 -245 -553 -212 474 400 -297 -426 224 608 312 -419 -93 244 676
3494 676 -294 -537 -47 350 606 -424 -674 71 572 -141 -531 -395 494 272 -473 -755 70 569 -9 -436
3514 -436 -432 311 431 -100 -755 -135 797 212 -249 -440 20 1009 -62 -588 -265 318 624 103 -499 -143
3534 -143 530 -1 -331 -519 2 508 205 -502 -372 526 656 -110 -512 69 240 398 -558 -330 406 461
3554 461 -400 -702 53 377 425 -527 -910 171 877 -169 -542 10 573 618 -173 -441 15 682 294 -390
3574 -390 -589 264 690 -67 -633 -215 576 660 -340 -679 1 510 41 -326 -623 46 435 -1 -353 -194
3594 -194 284 567 -548 -740 152 496 23 -639 -214 523 787 -97 -778 -313 736 398 -480 -425 354 541
3614 541 -248 -486 -315 670 317 -290 -338 125 656 57 -423 -470 517 731 -40 -535 -252 646 425 -530 -196
3635a96M64J25k99r17N21R45Pp78k34M57K49m2q48j53J021K58n98o64J18P99J23
3656C58l18q00P86M93n49n85L40M87K84o08l57L71N40k06q88J88Q73L57q36o74
3676g44K66Q17L75j245j25N38P03m43p36K43O56L22o99k67K78M20J06p42k17P45
3696B51O39o69r07K01P76M50r42j28J77N00j24m84l48O96O73r98k29K15M61L63
3716E73o78m77Q13N63n02p45n2R51J35q14l62N56N70L5r64k21L04Q76m68o45N3
3737d99P39J58p36j37K86P50l19q94O02O15L12q61n76M20M80nq01m13J050L87
3757E58l73o89L09P98l51l07k26M6R80l79n94m20Q58L22n75m79K69M21K84m37
3777A5o03O84O84m86q93k1P15O20q12n64K40J049l33q22K90M27L10m48p50rJ051
$$ plain form
3635 -196 268 393 94 -823 -302 643 650 -128 -362 95 344 302 -546 -699 322 580 -18 -682 -564 235 358
3656 358 40 -760 26 519 -30 -615 -275 212 496 -112 -469 -98 442 236 -652 -464 409 766 -70 -744
3676 -744 -478 339 714 -531 -656 -118 585 142 -594 -351 305 627 -72 -339 -61 359 465 -277 -494 251
3696 251 890 221 -686 -485 291 741 -201 -329 -152 348 224 -260 -608 88 761 -237 -466 -251 210 573
3716 573 -105 -582 231 794 292 -453 -505 446 581 -233 -595 -39 531 566 -398 -619 -315 561 93 -552 -499
3737 -499 240 398 -338 -475 -189 561 242 -652 -50 565 877 16 -560 -140 340 335 -466 -879 171 558
3757 558 185 -504 -195 603 252 -55 -281 -235 745 366 -228 -648 210 532 -43 -522 -253 168 452 15
3777 15 -588 96 780 294 -599 -620 95 715 -97 -661 -421 628 295 -527 -237 190 500 52 -698 -707 344
3798C44K12r56j67N89O15l53j243M64O75M54p53k63k15P69L2l89k39K81O82m73
3818F6n60L60O05p0m51n20L49N04k04k07l50N34N60k68q91K70O48J06n86l10M65
3839E0M85o46l23K10N73O36j087l86K10Q53k45l83n57N37O11m36n22O8R59k33
3859C74o99p6L51N01m76n48o7P26L31n63k61J4Q64K6o11k88O26K39m43l24l24
3880f28N83N63o01n95P22M51l13m80l25Q50L47k22n22j36M96L79p67OK06L80j43
3901B51m76k85M76L97l75l37q2Q67p0m59m94M16Q37m39o68j0M61P18p26m82J28
3922c52O06O7q10P9N97J30n09m05M72N51j79m22m46O82N24k26m15k63M83M93m95
3943A62p46K97Q44l51m53o8N79Jq2n77J04N83K08o19l81J13P62J2n01n31P73L50
$$ plain form
3798 344 556 -400 -567 22 637 284 -959 -495 180 634 -119 -382 -597 172 204 -185 -424 -143 539 66
3818 66 -494 -134 471 401 -50 -570 -221 283 79 -128 -478 56 616 348 -543 -273 375 481 -105 -415 50
3839 50 535 -111 -434 -224 349 985 -102 -488 -278 575 330 -53 -610 -73 538 102 -420 -352 607 374
3859 374 -325 -401 -50 451 -25 -573 -640 86 417 -146 -407 -393 471 497 -114 -402 224 463 20 -304 -628
3880 -628 -45 518 -83 -678 44 495 182 -298 -623 227 574 352 -170 -306 190 569 -198 -192 14 394 251
3901 251 -225 -510 -34 363 -12 -349 -431 436 366 -93 -587 -171 666 227 -441 -451 10 728 2 -480 -352
3922 -352 254 321 -489 -410 187 317 -192 -597 -125 426 247 -175 -621 61 585 359 -56 -319 164 657 162
3943 162 -584 -287 557 206 -247 -315 264 265 183 -394 -290 293 501 -118 -499 -386 376 388 -113 -644 129 479
3965D79n01l43j97O30M92m85n88N65K42O0q56J09O72K65q04j86J59M12L41p44
3985b78l21O90K71m23l58q3R04j3m31m49N91M45j48p34Q6L51M35p58q8J28M56
4006B73J74o76M0J15P55m27l94j48N92K4l34o93N39L45Q1q00n9P72K08j2p86N8
4028c53N84L42o96o30P10P09m98n89m6O45J98j02q54K30Q04k68o19q2O20N88n65
4049A28l61k50N89O08p90q14P17K89L5m91k45M75N09J45r09L29L74r4l72l04M56
4070B4L58n3o42r4L86K52l37l88J11Q49p3n57j3M7O00q2n96q6L99J12k7l77J7
4093a70O11k27m52l44P92K07j28p77k1J021l30k16k48N62J74l96l86k56M66M09
4113B91l31l89L24N04J73p63o7L20K20k17n03Q5N65J23m41k29L00J87J89k75n59
$$ plain form
3965 479 -22 -365 -562 68 560 75 -513 52 294 354 -502 -393 279 544 -260 -446 -287 125 466 -278
3985 -278 -599 91 362 -61 -419 -502 402 389 -42 -491 100 545 397 -337 -251 100 535 -223 -311 -183 273
4006 273 447 -229 -189 -74 681 254 -140 -288 304 328 -6 -699 -160 185 266 -534 -593 179 387 375 -411 -353
4028 -353 231 573 -123 -753 -43 666 168 -421 -467 178 376 274 -580 -350 454 186 -433 -515 105 693 128
4049 128 -233 -483 106 714 -76 -890 -173 116 151 -340 -585 -110 399 544 -365 -36 338 244 -128 -432 24
4070 24 382 329 -313 -407 -21 231 -106 -494 -383 466 393 -164 -177 -130 470 388 -208 -294 105 217 190 -187 -170
4093 -170 441 214 -238 -582 210 417 289 -488 -509 512 182 -34 -282 280 454 58 -328 -584 -118 291
4113 291 -40 -429 -105 399 572 -191 -258 62 282 65 -438 -353 212 335 -106 -335 -35 152 341 66 -493
4134d93M75J74n2l17O7L21J54l78l15M76M05j53o94L3M46J46l28k72K12K17M78
4155F02r17j4J37N85k69q30M35L10K42l78l91K88M18j49l69k8O17L21k29o42j14
4176c75M21L84p35j57M71L97j57m74l47O56K48k69o61N90L45R2j001K55L42K95
4196C20p2n19K27M04k5j80n15J57P06l02m66r4Q23J25q08j84L65J83K52m22k42
4217b67J50L35J13l57l24P55N9l21l55J66J62N67r43n6K07oJ51m03K47M11K13
4238E04o30J74m6J70J99p33k76P14M35m55l90K16K49L48o39m41Q19N1k40j38j57
4259b66M74M7l80k88M81M93n35k73k94K80N96q7n07q6M59K71m83k40N10P1l8o06
4281d01K6O68l7k34j76m9M13J74q22O9N20M06l29p24M15Q5L11k19n60M44N37l8
$$ plain form
4134 -493 -18 156 104 -213 -146 175 329 -49 -364 112 517 364 -330 -297 149 295 -33 -305 -93 124 602
4155 602 -315 -329 -192 393 124 -706 -271 39 281 -97 -488 -200 218 69 -300 -328 289 610 381 -261 -375
4176 -375 46 430 -305 -462 9 406 249 -225 -572 84 332 63 -598 -8 337 429 -572 -317 25 320
4196 320 248 -271 -44 360 335 155 -360 -203 503 201 -265 -359 464 589 -219 -403 -38 145 397 -25 -267
4217 -267 -117 218 331 -26 -350 405 464 143 -212 -46 116 683 -260 -316 -109 -115 36 -367 -120 291 504
4238 504 -126 48 2 172 371 -362 -638 76 511 56 -334 -118 131 479 -160 -601 218 269 29 -109 -266
4259 -266 208 255 -125 -413 68 561 26 -247 -541 -261 335 248 -259 -345 114 385 -98 -338 172 243 205 -401
4281 -401 -375 293 256 22 -154 -203 210 384 -438 -369 151 557 228 -496 -81 4 315 96 -464 -20 517 479
4303D79o95k35N71K71l48m29R5L59J49l08l9L40m8l76J97r2L19J52o43j60L17
4324a24O66n04l29r3L24M18q33K87n1N06J67n25PJ8M91l59l22o2K52K90J20n25
4346a81j18O30k34L2m52K03L07J69p42J33N53L60n01o41M72L18j73m97l24R63
4366B77l9l51j96J80M68l49j1l51K59L08j04k20M6K08K85n78k3K04K00R2q68L90
4388a73J18K05J08m55o8M74M5n01J6P0M21nn80J48M35j82K0n50J95O03L01j088
4410d43L5O66k16N4l39j5N67K77o34k80K01M44j90l22k56N44L06j64m02j45O83
4431C71l25J8l65L44L26l67l51J25N72j54l00l16J53Q34k8q15j53L88J45J2m20
4452c06k45M84L33j95l39J23P72k36o87j76M49L13l31k45L66J16J30m59m28M65
$$ plain form
4303 479 -216 -451 120 391 43 -386 -291 68 217 -91 -130 210 162 -214 -17 -109 210 362 -281 -441 -124
4324 -124 542 38 -291 -384 -60 358 -475 -188 -239 267 434 -91 -84 -66 425 66 -256 -318 -66 224 344 -181
4346 -181 -299 331 97 129 -323 -120 187 356 -386 -253 300 660 159 -482 -10 308 135 -362 -686 277
4366 277 238 -113 -309 -129 339 -10 -21 -372 -113 195 91 -129 -83 125 410 -168 -191 13 213 305 -563 -173
4388 -173 -55 150 258 -197 -265 209 254 -247 -231 -161 260 255 -325 -177 258 76 96 -454 -259 344 645 -443
4410 -443 -408 258 42 96 -243 -258 309 586 -48 -328 -127 317 127 -195 -451 93 399 235 -167 -312 371
4431 371 46 64 -301 43 369 2 -349 -224 348 194 -106 -422 -269 565 537 -278 -431 -43 102 114 -306
4452 -306 -551 -67 266 71 -268 -145 627 391 -296 -472 -23 290 -41 -286 80 196 326 -133 -561 -96
4472i6L78j97k89o5M51K16n07k49J69O01j72l26j98L03L13l1n26l5L98K13n09
4493a58r1N1M53K63o96k48P27l8k75j03j91O56j25m09k5K9L71r6m11K3M97j9l34
4516a49k28L73M60l08m18k65Q08K5o31j15K23M46%j03n76M85K63j5l98j50L21
4537D8M15n77l47K56M65J00m75R2o5M78l07n15K65M84J91o93j11J52O55m61m73
4558d23K37J72K34l09k57N8M66j28J27l27j27M38J17p67N33j00M04l84l46L06
4578g6J88K6m27k51N73M20n30j16l1O41m00k77J22j15N08k69j97N5M24K39o27
4599a20k69J69L68J59n47j00M93M5j10l22Q3M20J14n31K3K58L0j31l91j05P51
4620B87jr0k68J8J48L25p70n5O52K65n56r1k06N64j14j55k00K74N46k95k44m41
$$ plain form
4472 -96 282 85 -204 -269 182 398 -109 -358 -189 412 240 -86 -284 19 332 301 -225 -260 138 351 -158
4493 -158 -249 -198 255 518 -178 -426 301 263 -12 -115 -306 350 225 -184 -209 -180 191 95 -316 -293 204 185 -149
4516 -149 -377 -4 456 148 -270 -535 273 298 -333 -448 -225 221 221 118 -458 27 290 275 -123 -273 48
4537 48 463 -114 -461 -205 260 360 -115 -23 -88 390 83 -432 -167 317 508 -185 -296 -144 511 50 -423
4558 -423 -186 -14 220 -89 -346 -288 178 50 177 -150 -277 161 278 -489 44 -56 348 -36 -382 -76
4578 -76 112 138 -289 -540 33 453 -77 -193 -224 417 17 -260 -138 -253 255 -14 -211 -156 268 507 -120
4599 -120 -389 -220 148 307 -240 -340 153 198 88 -234 -151 269 383 -148 -125 133 163 32 -359 -464 287
4620 287 286 196 -72 -54 94 419 -351 -406 246 511 -45 -136 -342 222 108 -47 -247 27 573 278 34 -407
4642d07N28J82m56m68M92M27j05l33m24N06K86m1m11m11Q05J51l75m13J70N93
4662B96r2o25m5O81J7j49n48J20Q18j86lo43J35M73k99l96l8O13L29l33m09O5
4684b19N90q7m50k47O37J11k65l09k44Q65O7p74K1L52p7K76o45r8K63J74J57k37
4706a39j22N93K46q43j57L69K49j38l46o4K92L10k58m87J51M23J03k72n12L97
4726b05O43k51m98L7L21O7l50k06M54L47J07n40k70N82J93n00k24j02O33J97o33
4747a98k01M61J69m0l89M7R1N22n28k85L00K57M1o28K9O14K30o49j60K6M70jl50
4770a72k15J96Q75k49n10k85K48N55m75m42K32N78o5k14n6L11K27j07q30j35J098
4791E65j15l99m87J62N25K55l37o26L30M61k69n06N2O51N0n68j47K34N45l17o44
$$ plain form
4642 -407 121 303 -153 -621 -129 298 193 -140 -564 -58 228 187 -224 -635 170 321 -54 -467 -297 296
4662 296 204 -421 -466 215 232 83 -465 -345 473 287 284 -359 -224 249 -50 -446 -484 129 458 125 -284 -219
4684 -219 371 284 -166 -413 224 335 70 -239 -483 382 449 -325 -304 48 -29 247 -398 -496 -233 -59 98 -139
4706 -139 -261 332 578 -265 -422 -53 196 58 -288 -352 -60 250 -8 -495 -344 79 182 -90 -602 -205
4726 -205 438 187 -311 -274 47 114 -236 -442 12 359 466 -74 -344 238 431 -69 -293 -395 238 435 -198
4747 -198 -399 62 231 191 -198 -151 -60 462 -66 -351 -51 206 247 -381 -352 262 492 -157 -317 -291 179 178 -172
4770 -172 -387 -191 684 435 -75 -360 -112 443 -32 -474 -242 336 271 57 1 312 539 432 -398 -533 565
4791 565 450 51 -436 -274 251 506 169 -457 -127 334 65 -441 -389 262 312 -256 -403 -169 376 59 -585
4812e85Q00n9M24r23j25L46L41R3n99m7J67O77m26l05l11O46K35k45m14J90L91
4833B71q5p87L16L44L59m60l77L16M90j33m47k50L42N65j34p06R4M91P0l74n53
4854f48M17L89L1m02j07N17L77m93m85m1L77O43n97n02O11J76k51m98L01N96j27
4875B84J99p31N3K33M26m38k3L42l38K75n95J06L98J1j05m64jQ97j77l02n45M85
4897a0N30n17m46J93J61M56o95p2M70J20k53j77L6j0M33k69m43J60M91L22o13
4918a33n24P46J81K46p36o8M76L31o93J1j90O41R7o98j98O23L80k14p45Q6M15
4939C4M96q64Q7r5M93r9m57J58K50K71k70m00L36L53j42j81m64P05K44k88m91
4960c24J03M33O6m28k28J82M57M9o11j43L47L08k8o57M31M6M37p37l35L85P51
$$ plain form
4812 -585 215 156 580 -343 -468 -122 219 312 -287 -334 -167 510 84 -221 -532 114 349 104 -310 -120 271
4833 271 186 -601 -285 59 418 -42 -419 -103 387 254 -193 -443 -101 464 330 -376 -282 209 279 -95 -648
4854 -648 -231 158 189 -213 -320 197 574 81 -404 -445 -68 575 -22 -524 87 263 12 -486 -185 411 284
4875 284 483 -248 -195 38 464 26 3 345 7 282 -313 -207 191 202 97 -367 -368 529 352 50 -495 -10
4897 -10 520 3 -443 -250 -89 367 -328 -400 70 190 -63 -240 -204 -214 219 -50 -493 -333 158 480 -133
4918 -133 -657 89 270 516 -220 -288 188 519 -174 -163 -353 288 385 -313 -511 112 492 278 -467 -381 34
4939 34 530 -334 -247 -342 151 52 -405 -247 3 274 4 -396 -60 293 151 -30 -494 211 455 167 -324
4960 -324 -221 212 278 -150 -378 -196 261 310 -301 -444 -97 211 183 -474 -43 3 440 -297 -632 -247 504
4981E04m34l53K54K49M1l6p87M20K23K55l8l07K91K60K22j068P9O55O4p90J16
5002a80J62N72m04m08j12L69M54m39k75p0J052o18k30j0L46J99k19m91N4L87J55
5023B94l90n33L88N21p0l72n4K26N35l73n16O0L33L44o78o4K18M53j0m76j46M85
5045A75M21j69o39l07Q32k84r8l49K80L30j44n32L27J92K26l95lJ90J78K14p28
5066b83l3J81J73O4o84K26M78J27k38m41L36M70j74l59K6M36n1o37J66j91R05
5087D97K6p01l49O21K24j50k33l53N55L18o65k51K02M51ro3l98K46M83m59j19
5108a27l04N76K84p44o0L75o9J72m39R1N55j65o1m71J34M42R0j66o07K19M55j29
5130E1O1m80N40K00o15k73L10M96J18n54J5O7M86j80k71k62N35J80m97l74K29
$$ plain form
4981 504 70 -283 -29 220 261 225 -562 -142 81 336 298 -9 282 542 764 -304 -225 430 494 -296 -180
5002 -180 -18 554 150 -258 -370 -1 453 14 -261 -331 721 103 -127 -137 209 408 189 -302 -248 139 294
5023 294 -96 -629 -241 280 210 -162 -216 10 545 172 -344 -284 49 393 -285 -349 -131 322 312 -164 -310 175
5045 175 596 427 -212 -519 313 29 -69 -418 -138 192 48 -484 -157 35 261 -134 -137 53 231 445 -283
5066 -283 -316 -135 38 102 -582 -356 122 249 11 -430 -94 376 202 -157 -131 305 254 -383 -217 -408 497
5087 497 523 -178 -527 94 318 168 -65 -418 137 455 -210 -461 -259 192 183 120 -278 -32 451 -8 -127
5108 -127 -431 145 429 -315 -375 0 -69 103 -336 -245 310 145 84 -387 -253 189 279 113 -494 -275 180 51
5130 51 112 -368 172 372 -243 -516 -206 290 408 -146 -131 -64 422 242 -29 -291 244 424 -73 -447 -218
5151b18P65k25n20j69N51L3l07j87R3M89Oj58o34N18O12l62q06Q3L73P2k28l26
5173e45K58O75k96k63r1L91K70n66k63j49Q55n8l73k29L88M53l51k87n1K52N15
5194E35n74j03j32Q31l47l29m02K91M73j93k87L48M3j15R2n65J74P63m58l02R9
5215a58N8M55o61L0J72K03j50j40j76L99L05k65l56N2L91M72o31m55M77L06j16
5236B12l72j67L62L01J84o96j77M27K58k18o90L89N77l04l53r0N41L34m45l89
5256c16J09N48j58m73m73Q22O51l39q36L13L54p0k86j46PO42J8m60n35Q24K14
5277D10r7o86K86N16j65m85q5M08K03p3n63P7M60J05k81k43n7N74K59q24k78R30
5299C91J76l93m26k2M85M5l95K1L1N40j57p06K08L94J69m07l58J49L52L64m42
$$ plain form
5151 -218 547 322 -198 -367 184 217 -90 -277 -184 305 311 153 -481 37 649 287 -519 -436 -63 9 -219 -545
5173 -545 -287 388 92 -171 -262 129 399 -167 -430 -579 276 218 -155 -384 4 457 106 -181 -232 20 535
5194 535 -39 -142 -274 557 210 -119 -521 -230 243 50 -237 111 154 39 131 -434 -260 503 45 -257 -158
5215 -158 -100 355 -306 -276 -104 99 -51 -191 -367 32 337 72 -284 -232 159 631 0 -455 22 328 212
5236 212 -160 -327 35 336 520 -176 -353 74 332 114 -576 -187 390 86 -267 -357 184 518 73 -316
5256 -316 -207 341 183 -290 -763 59 710 371 -465 -152 202 132 -154 -300 -293 349 367 -93 -628 196 410
5277 410 313 -373 -87 429 264 -221 -306 102 305 232 -331 -254 206 311 30 -213 -270 304 563 -261 -539 391
5299 391 567 174 -252 -274 211 256 -139 -118 -87 453 296 -410 -202 192 361 -46 -404 -255 97 461 19
5320A9m51M28N35m26l11J16Q2L8J00n23J23M55Q9n25k40M42N27o06l17j78R76
5341C53M6r07K54M31j11L16p33l56J017J45j90q73N26L92J45m26j10J12R3n4m37
5362c67O1M91K07l66l42J54O47l89k64j89M24M94n55m73n2P35P0l41o06K96Q94
5383E29k57m57k56L97K62n39P7J70M44l75j16l17N85M71m26m62L26J36J06l12
5403a4k86R3O42J36p78Po5M26Pj90m6N10j41k67k20J31N46m97j97m11P11K34m36
5426a05j14J05L70o1r0j98l0O3K36n45j28P50k19j00r2j08O30l42k12m56R09L89
5448F52q82k65M62L19r8l50p0K39L17J27o62l8L33L46m88m66J03P12l0m38j03
5469b80L76j89M53q37L63L87p2l35j70L40M12m84m27J81M85M8k94k70L71J24J60
$$ plain form
5320 19 -432 -4 531 105 -206 -90 -8 30 130 -393 -270 185 274 -251 -491 -49 478 -128 -445 -623 353
5341 353 399 -508 -254 177 66 382 -351 -707 310 455 265 -608 -82 310 455 29 -81 31 124 70 -367
5362 -367 -306 185 392 26 -316 -162 485 96 -168 -357 67 561 6 -467 -519 216 286 -55 -661 -365 529
5383 529 272 -185 -441 -44 218 -321 -244 -74 370 -5 -121 -438 147 618 192 -270 56 192 298 -14
5403 -14 -300 -207 435 571 -207 -200 -265 161 168 -22 -68 442 301 34 -186 -55 491 -6 -203 -614 97 331 -105
5426 -105 -219 -114 256 195 105 -93 -123 -60 176 -369 -497 253 34 -66 -158 -266 364 22 -190 -646 263 652
5448 652 -230 -495 -33 286 188 -162 -232 7 324 451 -211 -249 84 430 -58 -524 -421 291 261 -177 -280
5469 -280 96 -93 360 -477 -114 273 201 -134 -304 36 448 -36 -463 -282 203 251 -43 -313 58 182 342
5490C42n07j95M90P6R6o68L7L72K22k49m96K62N39p6l94j72N66J06l71m07J79
5511b48Q43k26o21m0N10P3j03m65L2N94j78l2m42M7O23k36k06p0K13K98l36l20
5533b90J57L10j6j3k19n5N54j01m68PK58j0K59o25r1O81K73p63p25P42N17l42
5555D0m96J30L74N44m61k86Q1N91l32j90r7K25K56k37k94K05N8K54k52j74o5N34
5577D08l11m48J51J56K58n4m57jM53J76n16n8O3O18j79n74K63L63m2l67j97j01
5599c96L27M44m81k05J05O87o33%L07m3j4k89k90K46M26P8l99j00J78O06m22n93
5621d61L86K59O1m57l49O84K62o6o78J8L30L81k75j27jM54l58j88q1K8P03k60
5643B65j97n03O30l7j01k70J72K49k45j35l15O99J26k45l54J29M95n2m77l16O56
$$ plain form
5490 342 -165 -360 130 206 302 -366 -329 43 265 16 -480 -218 321 245 -149 -321 245 351 -20 -427 -248
5511 -248 595 369 -252 -292 218 291 188 -277 -245 349 171 139 -303 -256 367 131 -75 -145 68 366 30 -290
5533 -290 -133 177 161 148 -71 -126 428 327 -141 -134 124 114 373 -252 -343 338 611 -152 -877 -135 382 40
5555 40 -456 -326 48 592 131 -155 -74 517 185 -5 -102 123 379 142 -152 53 111 365 113 -61 -126 408
5577 408 97 -351 -200 -44 214 160 -297 -298 155 331 -185 -243 -180 438 259 -315 -52 311 269 -98 -295 -396
5599 -396 -69 375 -106 -311 -206 481 -152 -152 155 112 98 -191 -481 -235 191 269 -130 -230 -52 554 132 -461
5621 -461 -75 184 245 -212 -561 123 385 319 -359 -341 -11 370 95 -32 -33 421 63 -125 -206 -178 525 265
5643 265 68 -435 195 158 57 -213 -41 208 -37 -172 -487 212 338 93 -261 -132 363 311 -166 -482 174
5664A74K29l78k48O4M60k67j63k31K79O08n14K9p05O37J23l0m25J28O65l09m96
5685c70K56rO08o00K17m24L86OJ95k64j05K56K14l21m05L36P75o78m74K17M14
5706B30n1l23on3M65j93p4k29L74K82k47m57n0M45K44k15n91L57j6J34p3l75N38
5729A16N2j53l37J97L57j9k04j28K07J04j20k88j54N02j86k42J6J68K85j0l62
5750a99q1K66N02k53k76j87K25L64o80J58j20M21J09m76L12L9J24k83q5K6L57
5771B63Qm75J98j8M57l88M7l45M88R2k70k78J95J16J57n60L08M2J33Q7o70L14
5793i9M01j83j98j97K05L96j80m03J51K87K16k58l79k36O68j96j08j48L06J04
5813A49j02k95k34N57N30r28K01j17N81o3l79j26j9M48j70o30N63n6J37l01l6
$$ plain form
5664 174 403 25 -223 -159 301 34 -129 -360 -81 527 13 42 -663 -26 97 67 -358 -230 435 126 -370
5685 -370 -114 -123 485 -115 102 -322 64 70 265 1 -104 152 366 45 -360 -24 751 73 -401 -184 230
5706 230 179 -144 -150 -203 262 69 -5 -234 140 422 175 -282 -332 113 357 142 -449 -92 -108 26 -47 -422 116
5729 116 168 15 -322 -125 232 213 9 -119 88 192 72 -216 -370 132 -54 -296 -280 -112 173 163 -199
5750 -199 -280 -14 488 235 -41 -228 -3 361 -319 -161 -281 140 249 -227 85 124 248 -35 -120 -94 263
5771 263 271 -204 -6 -24 433 45 92 -253 235 327 57 -221 -26 90 247 -313 -5 37 170 257 -413 -99
5793 -99 302 119 -79 -276 -71 325 145 -258 -107 180 396 138 -241 -477 191 -5 -113 -261 45 149
5813 149 47 -248 -482 75 605 -323 -122 -239 342 279 -100 -226 -245 203 33 -597 -34 -90 47 -254 -290
5834b90L23L2M98n03l61K70K41p6m41K54J66L9l98J96J00J25j3j14r5L71k8k17
5856G9j98o3K76J36k19m25M15l5J8k58L56J87R2m72k57K42N14k27l75J65K50J67
5878C68m26k65J07L68P4n27K00O2K11j20l17J61L35j0m71Q9q2O55j65l86r5K96
5900F2J74j23k34Q3J60l0j05l44K96M71k40k90oP0J45r7m03K81K69L0q8k98Q8
5923a29R6j01O6J04L99j09m61j9J96k1N9j12r2N36K9m67P9j79J51L95o27j09J19
5946a97K85oj04k57N83p7l70j77L84K56k26k1l33K61K10L3l07r4L72j80J53o47
5968d59O09j12L03p49K05K31R3Q8k50l21J51N06l55k95J96N35l15k41j50K04L48
5989B22l74J46m2J59J22n04J45j3L88L3n35L99J2l77Q6n14N62K62J90m09M3p2
$$ plain form
5834 -290 33 65 563 60 -301 -31 210 134 -307 -53 113 152 -246 -50 50 175 162 48 -47 324 296 79
5856 79 -119 -182 94 230 11 -414 1 -34 -16 -274 82 269 361 -111 -368 -126 388 161 -214 -49 201 368
5878 368 -58 -323 -216 152 226 -301 -101 -39 172 52 -265 -104 231 221 -250 -161 -243 412 247 -139 -234 62
5900 62 236 113 -121 -38 122 92 -13 -357 -61 410 170 -120 -126 -56 89 -8 -411 -130 139 169 81 -217 -129
5923 -129 -33 -134 -68 36 435 326 -135 -154 42 21 80 -32 -124 412 441 -26 53 -126 25 420 -207 -316 -197
5946 -197 88 82 -22 -279 304 227 -143 -320 64 320 94 73 -260 1 211 244 -63 -157 215 35 188 -459
5968 -459 150 38 341 -408 -203 28 121 209 -41 -362 -211 295 -60 -355 -159 376 61 -180 -330 -126 222
5989 222 -152 -6 -48 111 233 -271 -126 -139 249 282 -253 146 158 -219 -133 -647 -85 177 367 -42 1 -71
6011g1K28l54r6N55q4J86n51k17M15L84j54n52J16M04j47m39J43JJ90K11m11O9
6033a74N6K21q6P1j44N8K46l30k95K39K79J44l88j57L58L27m22j93K0L43J8l97
6055b06j6K54j02K06l49K49O2p5J1k11K53J27O2m73K74M4K25j9m46L16Q8k15K32
6078B91m18R1Q5K68m56j38L45K21j99m45N66J48n6l46k46K47L9M1k09J42L86k04
6100A53R6m32l1J73N12m10j58j4K14K97o80L24L46j91l34m6L05K68m52k25J34
6121a51L93P7j59o71M15L51J41n50k00L82L88j96m58Q5M76j08j72k60J80K78k19
6142B2m83L86J84P5o0l95J66MM66m53m6QL67K7m98L61k74J2M06l87j38N15Np16
6166d46K26L42j86J89n51J60L23J78l56j94J40K08J60m84J45M13J17l19l09N33
$$ plain form
6011 -71 157 -197 -293 262 178 364 -187 -404 11 395 241 -311 -195 209 62 -377 -234 -233 -43 168 -243 -174
6033 -174 -118 103 17 88 -56 2 248 -82 -377 -138 141 285 -103 -260 98 425 3 -190 -170 173 191 -206
6055 -206 -222 32 -70 136 -213 36 98 23 34 -177 76 203 265 -208 66 110 335 316 -130 186 274 59 291
6078 291 -127 -36 49 317 -139 -277 68 289 90 -355 211 359 303 -43 -289 -42 -3 38 -171 -29 357 153
6100 153 249 -183 -214 -41 471 61 -97 -111 103 400 -280 44 390 199 -135 -181 124 392 -60 -285 -151
6121 -151 242 319 160 -511 -96 255 396 -154 -354 28 416 220 -238 -153 323 215 43 -217 -37 241 22
6142 22 -461 -75 109 184 124 -271 -105 -101 365 -88 -134 -126 241 268 -230 131 -143 -131 275 -112 -250 265 270 -446
6166 -446 -220 122 -64 125 -426 -266 57 235 -121 -315 -175 33 193 -291 -146 267 384 65 -244 289
6186B89k72J15j02m05J67K80J58m55l2K5M70j94K1l8J6K13ro90K97L77j64l2o9
6209c4J11J61l73L18j57K8K49n21p9K85J22J53l92K12m6kk41K1L39L0M3k77o4
6232a14K71J72l99r6j39M09K40m51j36j2N33k30m84M02L20k20k2J1j84L69k0m14
6254a94mM68j09M8j98k59L9M22k21k43L14L53n11j22j37L54L59k76j88K55K22
6275C72k02l97J07K66J5j66j81J24L37j37j56j09J57M16k92k31J55k87K48J32
6295A71k46L3K90L4l6q06L64K58N1o05L15O2M78n31K04K36n74N63nq44K97N27
6317B36p0o16L16J47K76K4o78L2M76J49k50o6J53K67L4m89j64J28K83k45J7l2
6339g2j55R4q7L19ON6l8l81m14J108n48Q5J0N0O00l39o61P5M82k70J08L9j33O7
$$ plain form
6186 289 17 132 30 -375 -208 72 230 -225 -257 -232 238 44 65 27 43 256 247 -443 -146 231 67 35 -34
6209 -34 77 238 -135 183 26 54 303 -218 -297 -12 110 263 -129 83 37 35 -206 -185 154 184 227 -50 -114
6232 -114 157 329 -70 -166 -305 104 344 -107 -243 -255 278 48 -436 -34 286 66 44 55 -129 240 220 -194
6254 -194 -198 270 161 209 11 -248 -209 213 -8 -251 63 416 -95 -217 -354 0 359 83 -105 150 372
6275 372 170 -227 -120 146 161 -5 -186 -62 275 138 -18 -127 30 446 154 -77 78 -209 39 171
6295 171 -75 -42 248 282 246 -560 -196 62 113 -492 -177 -115 363 -168 36 272 -302 261 256 -588 -291 236
6317 236 166 -450 -134 13 289 313 -365 -333 143 292 42 -24 129 396 430 -59 -223 -95 188 -57 -40 -72
6339 -72 -227 -133 -220 99 105 161 123 -258 -672 436 -112 -27 -17 33 633 294 -367 -292 190 -80 28 67 -66 1
6363AJ94l80M3J41J78l7j77j69K15K88m32J96N3J2p5j05k13L04J11m27L33n4J54
6386A54m9m73M02P3J82k08n6J19k07N52l23l15M8K00J54j35m07L26j77K63k13
6407i0L05j83j88k4L42k07Q0L42n78j78M57j52K87k39K3J81j26R0n56L07L44l31
6429i4lM1J02r8k20j52K91J86j09j17%L37o9P9l86J49m4L13qm29K23KJ50p0j32
6454e8qK67p6J05m21K37KNl02K79O3q5j74K56J25j72J83l60J39J59R7l84O2J79
6478A18j00j55j38N3O8J30N8j31K62j10k3j88L64J89l05J37l70K7M02l79m2n9
6500a92L03m2J8l18L29k55J94K11j99lP3J27k57k19K56J46m24L45j67K32J73j34
6522A97n00K45J79o0n5o7K26j43ol00P8K10Q5N0m39M58rk40j21J60q1L29j68j32
$$ plain form
6363 1 195 -185 -142 -1 177 140 -37 -206 9 297 -135 61 114 126 51 -54 -267 37 148 -279 54 0 154
6386 154 105 -368 34 107 289 81 25 144 -63 489 166 -149 -101 99 253 118 -289 37 -140 123 -90
6407 -90 215 32 -156 -180 162 -45 35 377 -201 -379 78 -74 213 -26 -3 178 52 142 -414 -107 237 -94
6429 -94 -97 -56 46 -52 -272 -424 -133 53 -56 -173 -173 164 95 174 -212 -63 -107 206 198 -231 -8 -6 144 74 -58
6454 -58 -66 201 125 230 -191 46 48 53 -249 30 93 8 -166 90 215 43 226 -134 5 164 261 -123 -61 118
6478 118 18 -137 -275 -222 -154 -24 34 -97 165 55 32 -156 208 397 92 229 -141 -114 288 -91 -133 -192
6500 -192 111 69 87 -231 98 -157 37 248 49 46 119 246 -11 -230 26 172 -252 93 -74 158 331 197
6522 197 -303 -58 121 61 6 -61 165 22 16 -284 -206 4 89 139 -300 158 149 -91 -212 -52 -133 196 28 -104
6546a04N9J75j93Q8n7m14O13j85k2O4L60r3k14j48p0K50j59p5q2K80oro6q3K16
6571A25k07J69m55L29J57J66n46J07K98L7k66N9k87J38L06l00j51L06J82m4J17
6592B40l20K26o7k74K42k05J54l0j29m6L15j66j64o9L23n6J45j79m29M24M34j16
6614B53j94m64M39J56l60J16J23j15L39m74J79q5P0M8j8l01L54J85k51o1K5J2
6636b4J24m6j93RK01j01k4m9O5P5m0N6K15j5l57J65l18L58j77M7l35M73j68J76
6660A17j86p2K45J73j64m31J88L06M3j32n21L04K37jj11j60K77l56K36j92L36
6681A36rP4j16m55M58K80k91k05K97k62L12k04J35k34K02k27K04k35L40L6l43
6702a07k5K7K00j33P3L9m1J91k44J4J87k58J74O0j57J25j98K60k04Pj15o4J06
$$ plain form
6546 -104 -45 130 -63 25 -32 -446 167 -18 -40 24 384 291 77 -71 -141 109 -50 -125 -207 73 67 58 -8 -91 125
6571 125 -82 87 -368 -39 118 284 -262 -155 143 180 -86 -27 -314 -176 130 -170 -321 -15 167 123 240
6592 240 -80 146 79 -195 47 -158 -4 -34 -163 -209 106 -60 -224 -293 30 -26 119 -60 -489 -65 369 253
6614 253 59 -405 34 190 -170 -54 69 -46 293 -181 -2 -87 -17 31 13 -288 66 251 0 -61 -36 -24
6636 -24 100 54 -139 -130 71 -30 -54 -103 -38 37 -3 53 268 253 -104 61 -257 101 -76 -29 -364 109 -59 117
6660 117 -69 -141 104 277 113 -318 -130 176 219 87 -434 -130 107 106 -5 -165 112 -244 -8 -200 136
6681 136 127 201 85 -370 88 368 77 -128 169 -93 219 15 150 -84 118 -109 95 -140 200 236 -107
6702 -107 -132 -105 95 -38 35 74 33 224 -20 -6 181 -77 97 157 0 125 -73 187 -17 -10 -125 -189 -83
6725h3R5n7J55p7j04k19J49L36j82%j50L24m40K47q6N68k13j22j01j87O8J78O
6748A05r2j03k07J07K28k43K77k03K49l13J82N8k06N92m66p4M3J88j4k24L1K49
6770A64j56K2j28J98o7k61k6J34J56R0l50Q0oL35m38K77r3k1J95j13k00K37k8
6793AK76n52K03k0J01L19m82P7J41K32j29m28q4O45j61l88J93L88o51L43k59R2
6815a43L70r6k38n1M09k75Q4k4k40J97L56l35k21K4M61l37J89l14K85l5K3j81
6837i2p8J29m2k5M2Q5J07R8k62j20J19N7J65k86j21J32j51J84J3J97R1k12k78
6860b48K33J02K0L7m23O3M12j58j11J66r1R2j14Om51P31O7l62P0r4K52j7m12J35
6884i5K8K4J3j92K85K01l27m3J46j07J0M41k29L2j41J16j41k29p4K53N9nK2j17
$$ plain form
6725 -83 12 -45 110 33 -71 -290 -141 195 13 13 -137 187 -253 -6 -92 476 263 141 40 -147 -79 99 105
6748 105 13 -90 -297 -190 38 -205 72 -131 118 -195 -13 45 -161 431 -35 -109 -66 122 108 -116 -85 164
6770 164 8 30 -98 100 33 -228 -254 -120 36 126 -224 -144 -150 185 -253 24 -69 -90 105 -8 -208 29 1
6793 1 277 -275 -72 -92 9 328 -154 -77 64 296 167 -261 -345 300 139 -249 -56 332 -319 24 -235 -143
6815 -143 227 131 -107 -158 251 -24 60 36 -204 -7 349 14 -207 -183 278 -59 130 -184 101 66 89 -92
6837 -92 -170 -41 -83 -108 -66 19 126 224 -38 -158 -39 18 183 -103 -224 -92 -243 -59 -46 151 242 30 -248
6860 -248 -15 87 107 144 -279 -216 196 38 -73 93 2 94 -20 -14 -465 266 333 -29 41 -53 199 182 -230 -95
6884 -95 -67 -43 -30 -222 63 264 -63 -106 40 -67 -57 384 155 187 46 162 21 -208 -282 -29 30 25 47 -70
6908g0L44l04J90k12oM72l66m00L38J74n6j70N2k6J77k9l6L4q3J68m30N74k72
6931F3Kj00J40j12K8K4j56o3nL52l25J1O0m2O13n64n9J48Q4m5N2N5m25OmM19j75
6958a8J45k32j87L08k60K05J39j80l72N68l06R0k6K61l52K51L77n28K24J57j00
6979A64j91k30M30l2j80N7N0J28L68p39N5K74k14J9p7kL96o17M15j46J51m7J32
7002A64j37l23L81K9j44j24L24k94J22K14j35j38O6j42J42k02L22m5j77K91k62
7023f8J91J82m97J85L6n0j48l7J65k12O26j66l38L12j78R3m6k66LK89O9m21L35
7046E9J42K06n26P3K91o6l10J82j79L55J27k81l67K44J16j13k92K97J69l4J70
7067B63l99KM26k75k0j53O7J71l9j58L64m39K75j10j80K00J30P6n95J80J30%O7
$$ plain form
6908 -70 274 -30 160 -52 -58 414 48 -352 -14 160 104 -66 -14 -40 137 108 72 106 23 191 -239 335 63
6931 63 65 -35 105 -7 21 45 -111 -174 -179 173 -152 -141 -81 -123 490 -74 -133 15 99 54 106 161 -264 -258 -262 157 -18
6958 -18 127 -105 -292 16 -244 -39 100 -80 -452 116 -190 -100 -126 135 -217 34 411 -117 107 264 164
6979 164 -27 -257 173 141 -39 18 68 196 564 -175 -120 154 -60 -41 -118 -120 276 -341 74 -72 79 32 164
7002 164 27 -296 85 114 -30 -154 170 -124 -2 212 77 -61 5 -137 5 -197 125 80 -97 194 -68
7023 -68 123 305 -192 -7 29 -21 -169 -206 -41 -253 373 207 -131 181 3 96 50 -216 -213 76 145 -276 59
7046 59 201 407 -119 -46 245 179 -131 51 -128 227 354 73 -294 -50 66 -47 -339 -42 127 93 263
7067 263 -136 -134 292 17 -3 -156 -89 82 43 -115 249 -190 85 -25 -205 -5 125 201 -394 -214 -84 -84 -17
7090a7jm1J19k6j97L09m21M61l46j82L68j54K55l89M77m49L95k01q7j47N4O6m6
7113b00J56K44j03R7k10k75N22k37M65n11l4%K54k12j80K32j2J62l64N8L40k45
7135e3L69l70oK4j0k95P5Q8J65j85O18n02M9L05j75r4J9K43l74J57l2p9Q9J09
7159A35k22K25r7j42N7L7j24K49k2J1k34R5JK21k60L23j30K8k80jM6J11J81n05
7183b97K31k9l0j8P7J9q3M29m4m82Q3J24K22q0l38J47K53M0k16l2R2J51l42J9
7207a04M6L69l68m2K01j89L04l71O4R8j79J22j40LL2L89j43l46K75J37J90l95
7229d7j71K36Q3k86J31j10m3P6J1R3j14M19j2k39j9j24L67l98j96o5L31K5Mlj98
7254b49M21n5j40J14o9K92j34k59J1J54k60L3j46L64K36j29k56JM22k52j53R0
$$ plain form
7090 -17 -18 -59 60 34 -163 146 -275 186 -160 -342 26 -128 127 -262 215 -234 161 -40 -127 -274 -220 -154 -200
7113 -200 -44 200 97 194 -16 -291 231 -6 459 -52 -86 -86 168 -44 -224 8 -4 158 -206 -148 192 -53
7135 -53 316 -54 -60 -36 -46 -341 -266 -178 -13 -198 420 -82 -33 272 97 3 22 265 -109 48 16 -63 26 135
7159 135 -87 138 41 -101 -44 -7 -131 118 96 107 -127 -32 -31 190 -70 253 123 151 -129 -130 -84 27 208 -297
7183 -297 -66 -95 -125 -143 -66 -47 -130 299 255 -227 -144 -20 202 122 -216 -69 184 224 8 -24 68 219 -123 -104
7207 -104 -58 311 -57 -99 102 -87 217 -154 -90 8 -171 -49 -189 -186 -154 235 92 -254 21 158 348 -47
7229 -47 -218 18 101 -185 -54 -164 -207 -131 -120 -27 -141 278 266 27 8 -116 251 -147 -343 -408 -77 -52 -48 -51 -249
7254 -249 172 117 -23 91 22 314 180 -79 -68 86 -174 -141 -287 77 313 184 -72 -71 351 99 -54 36
7276C6K35J43%k52k14J70k38l5J63l97M48K47m90J72l01O61k90k45j20J31J84
7297Hj3J53j14J5j76l6J66N3L8l73M17k33O5k28O31k29j53J52k15j80M27j41p8
7320d4L99j61l06K2J39J32j69j97P9J28J0k53L80k2n2r6o8J04j22LR7q0j07K54
7344G0l08J99K47P0r0k97j90L49J34j95k64J87k35M09%l62M55q4r8j12K17k17
7366a15J05j47J65r6j5N9j18JK89m1k25J33m6N0K27m65L13J14p6j01O4o0J56k27
7390e6q0J10rK53J50m51J61k22L80n14L68l9K65J56p24K6R2L44m8j92J21J1k3
7413G9k76m0j0K64Nj05K10l8j3m26L09k4j3L81m09j40M49q9n75J41K19K70j13
7436E6Q1k69k41O92j49k49r2O9K31l43k0J74K15On53N34r9j45L42n89L71j75J54
$$ plain form
7276 36 271 414 414 162 -52 118 -120 -155 8 -389 59 306 -184 -12 -313 348 58 -187 -307 -176 8
7297 8 -5 148 34 49 -127 -163 3 56 94 -279 138 -95 -30 -258 373 144 -9 143 -72 -252 175 34 -44
7320 -44 355 194 -112 -90 49 181 12 -185 -106 22 32 -221 159 137 85 -11 -79 25 -97 -94 3 -77 -184 70
7344 70 -238 -39 208 278 188 -109 -299 50 184 -11 -275 -88 -323 86 86 -276 179 95 -3 -115 102 -115
7366 -115 -10 -157 8 -88 -103 -44 -162 -161 128 87 -138 -5 -51 -1 226 -239 74 188 112 11 75 15 171 -56
7390 -56 -136 -26 -35 218 368 -83 78 -144 236 -278 90 51 316 472 -252 -226 -134 210 162 -30 91 102 79
7413 79 -197 -237 -247 17 22 -83 127 89 76 -350 -41 -65 -78 303 -106 -246 203 114 -461 -320 -101 169 56
7436 56 137 -132 -373 319 170 -79 -171 -102 129 -214 -234 -60 155 161 -392 142 43 -102 240 -349 22 -153 1
7459Aj30K61m24L56l8k11L82n2j92j00j53N51k46J79J6l21l1J83J42l44n0J44
7481g7k8q8J94l3r1K41M1k70P7L12l20j09N0k6O3r1K90l68K93j71K09j69j61J14
7505a18K60k19r0j54J79L32m17J92K19ok41m5P9j16K53k42j18N87l52R0l68M73
7527A78k16J33J0j58o9J34NL4P2O7k46j7J55r7N7J5J28k79Q9k84K61l3K03m0k66
7552a64M23l54J15k41L97O2k80N8J39lo4j34J41m01L48k3k17K20J78n3k73k9J73
7575A8rj58K21k57L62k88p6J89M3k40m5J1K58k54M55k84M2K53j8j21l15K51K77
7598C15l28M3o8M5J42l69K20j20q8L19L7j40N9o9l1j69L61Rj05l2J38R1j83P2
7622A49j19M0j51Q6K0o0N9P2m67L75p5N0m1j92J74K3O0KJ74mk03J32l05R5NN5
$$ plain form
7459 1 -129 132 -292 64 26 -185 197 145 -47 -147 -300 251 5 184 200 -121 -152 31 173 -171 -221 -77
7481 -77 -105 -193 1 -32 -123 118 159 -111 -34 278 -42 -151 -101 -127 -64 -155 135 -233 60 -111 98 -71 -232 -118
7505 -118 142 -77 -167 -321 -142 190 -227 -35 184 178 -63 -108 -29 -145 108 -134 -252 335 -17 73 -295 178
7527 178 -38 95 105 -53 -122 12 17 51 123 190 -56 -73 82 -15 42 57 185 -94 -5 -289 -28 -61 142 102 -164
7552 -164 259 -95 20 -221 176 238 -42 16 155 152 88 -46 95 -306 42 19 -198 22 200 147 -126 -155 18
7575 18 9 -149 72 -185 177 -111 -187 2 45 -195 -240 -229 29 -225 230 -54 -12 241 223 102 -213 38 315
7598 315 -13 30 -38 7 149 -220 0 -120 -208 111 148 8 67 -2 -33 -202 159 168 63 31 169 260 77 149
7622 149 30 70 -81 5 25 -35 24 96 -371 4 -71 -21 -62 -254 -80 -57 3 5 179 175 -28 104 -201 -106 -101 -46
7648d6M0l73J97K3L34k5n38M69Q3k51J02k60K80J30n8j87K14O6r9L9l5j59k07
7671b61M71l45j23K39R3q1j81K59p3j55k23M75k49J30J05P4k14J30k13J60Lj67
7693a46P5Q3j57j44K93o2J01k79J93N32o63K86k75o5K53J8j15j80J37J98J60k84
7715d1j56J65m2QK2K66j56O8j63j72L52N6l36J13qj1p9L4M4J57k19M0J65k4K1
7740A04K00k47k0Q3o9J2o6p9K19p1K15k25j9J08j46j28j67K23J59q9r2l6K35l46
7764b42L17j3j08J15j41NJ15l88L23J07j44P5J9J47l44M66l35k29N93k82k39J96
7786A3k3N4k19L97l31L94j90l94J09J31J64m90J51J66j6J6J49k25k7L37k22pj97
7809b60L14o3O3l49L17j26k09K95j15oM38k39K9Rk93K63k80K04J50j93J26j67
$$ plain form
7648 -46 -6 -379 -182 -159 175 150 -388 81 164 -87 15 -245 35 165 107 -80 134 200 101 140 105 -54 -261
7671 -261 210 -135 -258 -19 74 -7 -188 71 -2 -157 -380 95 -154 -24 81 155 -59 71 -142 18 21 -146
7693 -146 -71 12 -145 -289 4 -58 43 -236 -43 489 -174 112 -163 -228 25 43 -72 -252 -115 83 243 -41
7715 -41 -197 -32 -74 -66 -44 222 66 134 -29 -201 151 207 -129 -16 -24 -35 -114 -80 -36 121 -98 -58 107 83 104
7740 104 304 57 37 120 51 63 -3 -82 137 66 281 56 37 145 -1 -129 -296 -73 86 -3 -95 -131 104 -242
7764 -242 75 62 -46 69 -72 -67 48 -340 -17 90 -54 21 40 187 -157 309 -26 -255 338 56 -183 13
7786 13 -10 44 -175 222 -109 285 95 -299 -190 -59 105 -385 -234 -68 -84 -68 81 -144 -171 166 -56 -63 -260
7809 -260 54 -9 54 -295 22 -104 -313 -18 -133 -139 299 60 89 98 -195 68 -212 -8 142 -51 75 -92
7831i2J74K6Q6j08J8k32P9j43J9K58k87L35Q7l73J76j76n3J72m8L09k63j33lM87
7855C15j23j79k05K21q4L11k43m80N91j02K34j53l0k9N7j23J5Q8j94J9J3K64l26
7878a43M56k76j42K47K9Pm4m29J74m9K21l4J78q2o0l47L35m2O1j27L18j6j64N9
7902A30l06J11K0K54j97k2R7l57K48p3J89l24J04J78j06Km3k0J73j35L21nm96
7925b57J09RL39m42K70K9j60L06m25N08k77j94L06j33K0j20rq6M95l32J14l23
7947b53J5K11J07K78m80J68K44n3j80n2k25J02K51j20K26p6k43K01m93K42m3L25
7969A52m15K82j46J84l52K64k2M14k93J56M5j51K1j52K42k18K54l8l52L57J47
7990C79l09k60J9L6K93nl63N9K13N6j80K21l6Qj03OP5j28M6J49k37N26k82k21
$$ plain form
7831 -92 82 108 194 86 104 -128 -49 -192 -173 85 -202 133 220 -153 23 -153 -206 -34 -82 227 -36 -169 -172 315
7855 315 192 13 -192 29 -55 256 13 -467 124 22 256 103 73 44 101 -22 -7 81 -113 -94 -81 183 -143
7878 -143 313 37 -105 142 171 178 134 -295 -121 -170 51 17 195 113 53 -294 41 -1 60 -67 251 235 71 130
7902 130 -176 -65 -45 209 12 -10 87 -270 -22 -95 94 -230 -126 52 -54 -52 -95 -115 58 -77 244 239 -257
7925 -257 -148 -139 200 -242 28 57 -103 203 -222 286 9 -185 121 -12 8 -112 -121 -207 288 -44 70 -253
7947 -253 -238 -27 80 358 -122 46 290 237 57 5 -220 -118 133 13 239 163 -80 121 -372 -130 -173 152
7969 152 -263 19 -127 57 -295 -31 -53 361 68 224 269 118 139 -13 229 11 265 227 -125 232 379
7990 379 70 -190 -171 -135 158 153 -210 -151 62 118 -62 159 123 131 28 34 109 -19 27 176 -61 465 183 -38
8014c8l9O5Q3M07k88m3K25l35R0Qj53k8J00L2n7j28j28L22o2k67M87j13j11j25
8038i6r1J15L20J13k47k3n3Q6J77m32m1M9P6l9R5q6j72J79J21mO6j22P0p6j20
8063a35j4L09l25L44o6n0J59m54L12o3m3J06j27J00K78m93L12j28j65J50M5l42
8085b90L7N19m15M19j68l8J98j34l54J77J31j90NK6j35l5j09L47j72L26j59K12
8107A98l74J83J24J6K07k00l49j31K00K0P0k83O25l93J24k15P3J72l22J60j47
8128b42M72j84k17J20j06J71K30J3j97j55L09n8k71%K44k10j18m2J57PM11j92
8150A42j43j07j29J16k2K43p9K49m33RK92j54j81m1J82j09L5L29k71R3lJ96m8
8173A66j1J09k93K70k75o7M48k45o1p7J05j00J18O1j76K27m72J40
$$ plain form
8014 -38 -77 -12 71 478 190 147 372 37 127 135 -18 -46 54 86 29 -99 -227 95 33 -234 253 140 29 -96
8038 -96 -187 -72 248 361 114 91 38 124 301 -131 -172 -123 -47 -86 9 -77 -249 -70 51 47 113 -9 61 -15 -135
8063 -135 -149 160 -165 179 113 63 222 -232 80 17 -26 80 -47 53 331 -162 150 22 -143 7 52 -290
8085 -290 -253 266 -149 270 102 64 262 128 -226 -49 82 -108 -103 -77 -212 -247 -356 -9 -181 145 -14 198
8107 198 -176 7 131 147 354 154 -195 -326 -126 -106 -36 -319 306 -87 37 -178 -105 67 -255 -95 -242
8128 -242 230 46 -171 -51 -157 14 244 257 60 -95 214 156 -115 -115 129 -81 -199 -241 -84 -77 334 142
8150 142 -1 -108 -237 -121 -143 100 21 270 -163 -154 138 -16 -197 -238 -56 -165 -130 199 -72 21 18 214 166
8173 166 155 264 -29 241 -34 -101 347 102 41 -36 69 -31 87 148 -28 199 -273 -133
8191a33
$$ Imaginary data points
##PAGE= N=2
##DATA TABLE= (X++(I..I)), XYDATA
0@%%%%JjQj6J6j6K4l3M1m9N8p3Q8j05J26j50J73k02K36k71L11l58M09m65N30n99
30c17O73p60Q55r54J064j187J321j466J629j809K003k218K456k718L008l335L707
47A952m124M602n159N808o582P526q705J0222j2260J5167j9667K7619m5765J59739
61A30373J2844l29732P3779J58992J13605j06526k34349M5736L02500j9096k47734
72i9608n7568J64825J36236m3050k28057l6107K71090Q0736k42930j05292J15859
83d3866J57281J8968k15065j09773K35570J42849j66631j50173M2813J60533Q8469
94A60975j80157j69312J67064J77178r5190j54728k7789J47446J37212j39815
104B2884j82365R9392J80788j2134j59210q7754J18245J65832o9528k09568J6432
$$ plain form
0 0 0 0 0 0 1 0 8 -8 8 -8 16 -17 24 -25 33 -40 48 -57 69 -81 92 -110 126 -145 166 -192 217 -248 282 -317
30 -317 356 -404 451 -503 561 -626 695 -771 858 -951 1052 -1166 1290 -1428 1580 -1755 1952
47 1952 -2172 2430 -2729 3079 -3503 4023 -4682 5540 -6720 8447 -11220 16399 -29366 130373
61 130373 143217 -186515 -112736 46256 159861 53335 -181014 -135278 167222 148126 -99608
72 -99608 -157176 7649 143885 100835 -127222 -163329 107761 188497 -54433 -159725 -43866
83 -43866 113415 132383 -82682 -192455 43115 185964 19333 -130840 -88027 72506 160975
94 160975 -19182 -188494 -21430 155748 60558 -94170 -121959 25487 162699 22884
104 22884 -159481 -60089 120699 108565 -50645 -138399 -20154 145678 76150 -133418 -116986
115a16986J95360M5766j22154j26286M7452K02607m396k11953k9953J43724Q9463
126A12644n7817j65596l642K01049M5307j74061q6576J06162J34424j9160j69504
137g6770n8742J77693J05931j43926j28192N7179J40657M5671j50706j16754J39905
148h054J45442q6351j43434J570J31216Q8691j18411j53308R4696J63894m3231
159G2720j36273m3596J05876J34641q1905j76310M6232J62384J9626j22069r9194
170a17868P5842J55019k9929j73349j7361J50711O4353r1099j10612K1551J55856
181H3114K8239j67998n5888J21357Q5696m2536j30438k5635J58832O6910j40422
192a8769r0165P8566J12043K70j27304o8410J25071J06490r5665j15869L3712
$$ plain form
115 -116986 78374 124140 1986 -124300 -76848 125759 121363 -90590 -120543 23181 112644
126 112644 54827 -110769 -114411 86638 131945 -42116 -128692 -22530 111894 92734 -76770
137 -76770 -135512 42181 148112 4186 -124006 -66827 73830 119501 -31205 -147959 -8054
148 -8054 137388 51037 -92397 -90827 40389 129080 10669 -142639 -47943 115951 72720
159 72720 -63553 -107149 -1273 133368 51463 -124847 -78615 83769 103395 -18674 -117868
170 -117868 -42026 112993 83064 -90285 -107646 43065 107418 16319 -94293 -72742 83114
181 83114 111353 -56645 -112533 8824 94520 51984 -78454 -104089 54743 121653 -18769
192 -18769 -108934 -30368 81675 81945 -45359 -113769 11302 117792 22127 -93742 -60030
203f0030J09140M4172j02599j04628R1235J29693n6241j20971n080R7717P5538
214I7946p4413j29596M9506J42513j3165j14189m4305P0146J09662l4400j46062
225h6357P604J33801K9555q9004p9007L9635J18862O55j32376l4217J13048O4108
237H6307o5138r1025M852J15597M4998j22992p0950R2963Q3480l0071r7238l7643
249h6860J08480P8323r6571r0424N2730R0952J1433q9882o7800Q2688R9015o1243
261C0841j02910J7901Q9893L8928p2414r0014N5077J14019k7901j05513j4592
272f6685P7150O6236m5357j07773J7339J18960R074r5791m3108N1940Q4403j1726
284E4662j12565j3192J08644L4378p2239o3659K4333R3162J5229j05585m3492
$$ plain form
203 -60030 49110 93282 -9317 -113945 -22710 106983 50742 -70229 -75309 22408 97946
214 97946 23533 -106063 -56557 85956 72791 -41398 -85703 -15557 94105 59705 -86357
225 -86357 -78753 55048 84603 -4401 -83408 -43773 75089 75744 -56632 -90849 22199 86307
237 86307 21169 -69856 -65004 50593 95591 -27401 -98351 -5388 78092 48021 -49217 -86860
249 -86860 21620 99943 3372 -87052 -34322 56630 68063 -21819 -89619 -6931 92084 30841
261 30841 -72069 -54168 35725 74653 2239 -87775 -32698 81321 53420 -52093 -66685
272 -66685 10465 76701 31344 -76429 -59090 59870 68944 -26847 -69955 -18015 66388 54662
284 54662 -57903 -71095 37549 71927 -312 -63971 -39638 53524 68753 -36832 -80324
295h0324Q9666O3795m9802p8115k476R0308M7548q9268p2210O6105P7124j9772
307D2579p6222l5381P4966P4066o6536q4639L7660P8820J0688o8935n9093N8914
319a3113Q8606m1691r1905P957P5488L7244n4288p8583L3453R9104r035r0794
331c7557k0817O1973N7571k9361q9210K520R8961J7024q0188l9346M1305O7760
343E0635j351r0692k4160R2229L9696o3223n6339J6257P5265K4736q5960n0441
355g3348P4942O1167l9218o5047p685O8652M9213o6676p1082N0533P1629j6450
367C6630o2983l0315N4254O9915m6853q3767K8555P4983Q045n5406n1833L8194
379b0581Q2292k2993q7843l2O8570L2958m0279o6355J5721Q6406M954q1754k4631
$$ plain form
295 -80324 9342 73137 23335 -54780 -57256 33052 80600 -8668 -80878 -14773 62351 42579
307 42579 -33643 -69024 5942 80008 13472 -71167 -33507 45313 56001 -12934 -72027 -13113
319 -13113 75493 33802 -58103 -50146 25342 62586 8298 -70285 -36832 62272 53237 -37557
331 -37557 -58374 3599 61170 31809 -57401 -54881 44080 61104 -19084 -58430 -17125 50635
343 50635 49284 -41408 -65568 26661 66357 3134 -53205 -36948 38317 63053 -22907 -73348
355 -73348 1594 62761 23543 -41504 -49189 19463 68676 2000 -69082 -18549 53080 36630
367 36630 -26353 -56668 -2414 67501 20648 -63119 -34564 40419 48464 -6942 -58775 -20581
379 -20581 61711 38718 -49125 -49157 19413 52371 12092 -54263 -38542 47864 52818 -28936 -53567
392e3567N6030M8157k2015p2092q614Q2965K7938p1263m2355L8291N9388K343
404D5206p3239l3476P5670M8370n4413n5564J3253O1458K7276o5822n3341N7925
416f697O1698l0224n9005r063N5923M6310n0013o8967L6198P0109r913n8544k8210
429e0398M3333O3925k9363p9909J4642P1130J1910m7604m6032K3479P3286o872
441D1527q0325r273O2199L1563l2185n6054M482P4794J5463p3543k9762N0132
453i82M4765j6090o1313j6367O9363L7780o0871m7192L3119N3048O058n7689l9033
466e5404N7840N4138m3322n5725J1338N1269K6176m7609n3852M0682O4122k1248
478B8405n8872q884M6695M2261l4681o4852J9621O8046M52n5039k7425L4350N5408
$$ plain form
392 -53567 2463 50620 28605 -43487 -52101 30864 58802 -12461 -54816 -16525 42863 45206
404 45206 -28033 -61509 14161 62531 8118 -47446 -34193 27265 54541 -11281 -64622 -6697
416 -6697 55001 24777 -34228 -43291 12632 58942 8929 -60038 -23840 46269 36356 -22188 -50398
429 -50398 -7065 56860 27497 -52412 -37770 33360 45270 -2334 -48366 -24887 48399 41527
441 41527 -38798 -48071 14128 45691 13506 -42548 -38066 36728 52191 -21352 -51114 -982
453 -982 43783 27693 -33620 -49987 19376 57156 -3715 -50907 -17788 35260 41318 -16371 -55404
466 -55404 2436 56574 13252 -42473 -31135 20134 46310 -1299 -55151 -14469 49653 28405
478 28405 -30467 -39351 7344 49605 14924 -49928 -30307 37739 38191 -16848 -44273 -9923 45485
491D5485j4740o9828j278O4810J9272m3485m1656J6744O0894M570o8105j9549
503d6866N5347L4155k7538m9725j503O2109K3034o0242l6923M0536M5620r660
515B8344n3286k0929N5512M1111m5462m9100K3041M9543R218m7160l8740M1772
527f136N4076k9665n4247M773M6192K6682l6969n1875K8124O0508j1248n3484
539b3269j3836L8298M0871k2718o0321Q299O1905P839m7163k7667K4940M9149
551C6327m464o1456j0505N7006K3012l6655l7703R630N1630J2912n7364k6903
563d4533M7210L5571k1974m2895p832M9486L0440m8637m0453L2546M2408m788
575B6549m2896k3340M1032M3089l3391m9126J6399M4631R448l6041l6921K8516
$$ plain form
491 45485 30745 -39083 -40361 24449 43721 236 -41420 -24676 36218 40788 -27317 -46866
503 -46866 8481 42636 15098 -34627 -36130 25979 49013 -11229 -48152 -7616 38004 28344
515 28344 -24942 -45871 9641 50752 5290 -43810 -20769 28774 37992 -9168 -47908 -6136
527 -6136 47940 18275 -35972 -31199 14993 41675 4706 -47169 -19045 41463 30215 -23269
539 -23269 -37105 1193 42064 19346 -40975 -32676 29229 37068 -10095 -37762 -12822 36327
551 36327 31863 -29593 -40098 16908 39920 3265 -34438 -24808 26822 39734 -17630 -44533
563 -44533 2677 38248 16274 -26621 -34453 15033 45473 -3164 -43617 -11071 31337 26549
575 26549 -16347 -39687 1345 44434 11043 -38083 -21684 22947 32395 -3646 -40567 -12051
587a2051N2707j8663n2062M65M0305K4401k5448m7076J3858N6160j390m9135j5416
600c3345L1376L5293j2931n0514k714N3964J4375m1513k6796K0158M0110K369
612B9832m9922j7762M7363K7408l0846l5272O302M1882J7288m4861l1360L7129
624b819L6979j7433l8086q436L7394L1020l5220m1031K3684M0734k401l5949k2214
637c3778L1067L9596k2157m6393Q389M1933J0838l0485l1858J8307M6197o994
649B4662m7799n547L6307K2459j9758l9580N309M8076O220m2913j7962K6835L1521
662B7830q443m1824p919M4430J8999l5126k7759J6315L5687M885m1218k0516L8157
675C498K9797k4328l4475M002L5870J7129l5044l1045K6958L6915j1773l5908
$$ plain form
587 -12051 40656 21993 -30069 -29604 10701 35102 9654 -37422 -23564 32596 31206 -17929 -33345
600 -33345 -1969 33324 20393 -30121 -32835 21129 35504 -6009 -32805 -12647 27463 29832
612 29832 -20090 -37852 9511 36919 6073 -29199 -22897 18985 36273 -8588 -39948 -2819
624 -2819 34160 16727 -21359 -29795 7599 38619 3399 -37632 -13948 26786 24385 -11564 -33778
637 -33778 -2711 36885 14728 -31665 -23276 18657 29495 -990 -32848 -14541 31656 24662
649 24662 -23137 -28684 7623 30082 10324 -29256 -23947 24129 30349 -12564 -30526 -3691 27830
662 27830 19387 -22437 -30356 14074 33073 -2053 -29812 -13497 22190 27075 -14143 -34659 3498
675 3498 33295 8967 -25508 -21506 14364 31493 -3551 -34596 -7638 29277 17504 -18404
687a8404q575L0969K9142k6249l9126J6536L8693L69l2168k0722K4489L6206j5603
700A5557m1779L109L7319J2881k6341k8705J3457M0195k213m1305r241L2057K1451
713B6442j6236l4195J188M1826R074l7079j8397K3164K7922n482l5481j0609L7554
726I691K0554l0049k6014J2845L0438P303l4003k1456L1442K8196j9308l0199
738b0560O48K9589J8009k7381l0579K0810L4268q140l1209r057K4806K6979j8160
751A0023l7125J0115L6358K346k7743j8736J6624L3634p418l9231j840L3804J3532
764B4343k1237k6459P487L5735M488l8108j2337K8659K0795j2723k9536l333L4794
777A2568J5570l2581k1868K0294K6778k914l0427j3900L0893K4291k4903k8189
$$ plain form
687 -18404 -26979 3990 33132 6883 -32243 -15707 22986 23355 -8813 -29535 -5046 31160 15557
700 15557 -26222 -23113 14206 27087 746 -27959 -14502 25693 23480 -17825 -27066 4991 26442
713 26442 10206 -23989 -22801 19025 28099 -8980 -27377 -4213 23709 18227 -17254 -27863 9691
726 9691 30245 196 -25818 -12973 17465 24768 -9235 -30691 751 28947 9639 -20560
738 -20560 -19912 9677 27686 305 -30274 -9464 24804 16664 -14545 -23602 1204 28183 10023
751 10023 -27102 -16987 19371 21717 -6026 -24762 -8138 25496 18078 -21153 -22993 10811 24343
764 24343 3106 -23353 -15866 19869 24357 -13751 -26088 2571 23366 10643 -18893 -22226 12568
777 12568 28138 -4443 -26311 -6017 20761 17847 -12580 -26480 4413 28704 3801 -24388
789b4388J1025K7940Q007k6998k3503K4098L0665j5185l0164p21K6332J7738k1443
802C403l0001J4447L4537m569k9953r498K1337K4680j2297l4674L612L4763N566
815B1353k5455j7937J2857L0234k312l5105o807L1118J5242j9009k4183M068L1022
828A5086Q248l2207j6149K5055K0889r919k5677n956K8980J7855k6971k3483J6569
841g680K5295j052k5435j5121K4142K5378j8510k8058P311K5414Q504k0677k3519
854b4008J6101L0882r183k9569k613K2984J6739j5255k8120P760L2496P33k7882
867h935j0996J7326K2504o352l1074k652L1264R910k2532j7943R548K6018L026
880A9112l0160j1664K6773J7292j5796k2003P81K5843J2032k6246j9703K0847
$$ plain form
789 -24388 -13363 14577 22584 -4414 -27917 -3819 26846 11661 -18503 -19224 7108 24846 3403
802 3403 -26598 -12151 22386 17817 -12136 -21634 -297 24383 12086 -22588 -18976 15787 21353
815 21353 -4102 -22039 -9182 21052 18740 -16365 -23172 7946 23188 4179 -20004 -15936 15086
828 15086 23334 -8873 -25022 33 20922 11003 -14674 -20630 8350 26205 -766 -24249 -7680
841 -7680 17615 16563 -8872 -23993 149 25527 7017 -21041 -13730 11684 20188 -489 -24008
854 -24008 -7907 22975 13792 -15777 -18390 4594 21333 6078 -22042 -14282 18214 18947 -8935
867 -8935 -19931 -2605 19899 13547 -17527 -20179 11085 20995 -1537 -19480 -9932 16086 19112
880 19112 -11048 -22712 4061 21353 5557 -16446 -15665 10178 22210 -4036 -23739 -2892
892b892K1946p042k3477p811K3192J9834k0441k5000J1850K4390J539k1397j5779
905b1088J7549K5706j2034k7494K522K3594R796j6952k1998J0255K8630l030k7638
918a2182n491J9566J6751j0079k5953J837K8616O367k4805j3513J4111K1210k565
931A3870k6540p121K6715J3282j9391j8072O816K2545N877k4731j4374K1122J9106
944A9104j1951k1023j006K1387J3779k0268k0701J4654K2341m022k1102q295J7559
957D56J9649j4093k4341O743K3304L581j8096j4897J1725K3892n861k6121p81
970a4840K1280R992j3337j9453M975K5364J511k3774q767J7722J4857o726k1760
983a2956k642K4364R549k0792j4551J1568J8851m08k1420r553K1047J5390j5007
$$ plain form
892 -2892 19054 12012 -11465 -19276 3916 23750 3309 -21691 -9841 14549 16088 -5309 -21088
905 -21088 -3539 22167 10133 -17361 -14839 8755 18551 1599 -20399 -10144 18486 15456 -12182
918 -12182 -17673 1893 18644 8565 -17388 -15551 13065 19432 -5373 -18886 -4775 16435 13870
931 13870 -12670 -19791 6924 20206 815 -17257 -10441 12104 17981 -6750 -21124 -2 19104
944 19104 7153 -13870 -14876 6511 20290 22 -20679 -6025 16316 12294 -8808 -17103 456
957 456 20105 6012 -18329 -11586 11718 15299 -2797 -17694 -5969 17923 12062 -14059 -14840
970 -14840 6440 16432 3095 -16358 -11383 13981 15492 -8282 -17049 673 15530 8804 -12956
983 -12956 -15598 8766 18315 -2477 -17028 -5460 13391 12983 -8437 -17990 3057 18447 3440
996C440j8140M417J9434P111j8862j6120J5408J9883q013j9812k526J7701J3249
1009A7170j4511j9825R235K1221j227j8448r093J3773J7874q152k2855K520K1189
1022H871N601j5301j4475Q357K1524k194k2685m491J8274J1092j0073j7983K135
1035a1348K2056N085k1101j0563J4232J5092m596j8705n140K0451J1079j7139
1047e97j4448R150J6207J808j7601j0810J6824J5915j1679j7362K862J6493P617
1060A4379j4867j5600J1030J9525n447j8010l146J4242J2407j0098j8928N489
1072i024K0313O07j6456q753J0434J6419m996k0143m67J8878O340j3304j2469
1085a2621N401J8494O57j9630o054J5366J1279q404j5366j46J8744O593j7499
$$ plain form
996 3440 -14700 -10283 9151 16262 -2600 -18720 -3312 16571 8558 -11254 -13780 3921 17170
1009 17170 2659 -17166 -7931 13290 12063 -6385 -15478 -1705 16169 8017 -14838 -12318 8871
1022 8871 14472 -829 -15304 -6947 14577 12383 -10302 -14793 3481 14573 4500 -13483 -11348
1035 -11348 10708 15793 -5308 -15871 -1639 13453 8857 -9848 -14988 5463 16542 -597
1047 -597 -15045 -5895 10312 12120 -5481 -16291 533 16448 4769 -12593 -9731 6762 14379
1060 14379 -488 -16088 -5058 14467 9020 -8990 -12136 2106 14513 4415 -14513 -9024
1072 -9024 11289 11896 -4560 -13313 -2879 13540 8544 -11599 -12066 6812 13152 -152 -12621
1085 -12621 -7220 11274 11931 -7699 -13753 1613 12892 4488 -10878 -11024 7720 14313 -3186
1098c186j0789J1757J3750k946j6114n812J6817J1358j3847j4152P002J5014K650
1111A1502j4783j1027J2656J6113r101j6266J290J4156Q030j1752j4713Q311J7610
1124A2026l370j6552l061J1960J1569p261j7256K669J8505K183j5072q045Q604
1137c101J4212k188j8081k648J7311O675j1650j1777M152J5700L054j6948p788
1150a3077J4030J1085p087j3571j402J5422P894j4440j1758R668J3460k269j3454
1163e499o141J2910J2138j0377j4952N199J4242K788j2830r586R129J5206n665
1176F562j6096O1J3379P078q987j3824N276J6682p04j5420m798J1193J0615n644
1190E373j5526O89J6517M186j3328q484O903J3170o90j5840m550J4986P883r649
$$ plain form
1098 -3186 -13975 -2218 11532 8586 -7528 -13340 3477 14835 988 -13164 -6162 8852 11502
1111 11502 -3281 -14308 -1652 14461 5360 -10906 -9616 4540 12570 818 -13895 -5584 12026
1124 12026 8656 -7896 -10957 1003 12572 5311 -11945 -9276 9229 11412 -3660 -11705 -3101
1137 -3101 11111 8923 -9158 -11806 5505 12180 530 -11247 -7095 8605 11659 -5289 -13077
1150 -13077 953 12038 4951 -8620 -10022 5400 13294 -1146 -12904 -3236 10224 7955 -5499
1163 -5499 -11640 1270 13408 3031 -11921 -6722 7520 10308 -2522 -12108 -2979 12227 6562
1176 6562 -9534 -9473 3906 10984 1997 -11827 -6551 10131 9427 -5993 -10791 402 11017 5373
1190 5373 -10153 -9464 7053 11239 -2089 -10573 -3670 9500 8810 -7030 -11580 3406 11289 1640
1204A640j1867L667J3645L921j4932q439J2224J1185o084j2789j481J2685Q774
1217A2149j2250j2383Q292J3341j305j2338o318J1003J1634p926j4442L376J3898
1230F731K458j0525r313O907J4127l406j4781j436J2476P182q033j2632L623J4973
1244H351J124j4393n222R698J0027l839j3857j487J4693N879j1839q791O073J1392
1258G809M25j3110o216J2826Q983q616j0762J885J2121M763j1702r887R495J1788
1272I802m244j2191j945J0613Q706q740j2960O204J2601n1j1511n622Q065J1493
1286A0220m917j4248J200J2928L675r394q963M956J3527j206j4079k969J1110
1299A840P590o414j1503J124J3636L311j2738o776Q680R635k310j2372k723J2600
$$ plain form
1204 1640 -10227 -6560 7085 11006 -3926 -12365 -141 11044 4960 -7829 -9310 3375 12149
1217 12149 -101 -12484 -4192 9149 7844 -4494 -10812 191 11825 3899 -10543 -7167 6731
1230 6731 9189 -1336 -10649 -3742 10385 6979 -7802 -9238 3238 10420 2387 -10245 -6622 8351
1244 8351 9475 -4918 -10140 -442 9585 5746 -8111 -9598 5095 10974 -865 -9656 -3583 7809
1258 7809 8234 -4876 -11092 1734 10717 2101 -8661 -6776 5345 10108 -1594 -11481 -1986 9802
1272 9802 5558 -6633 -8578 2035 10741 2001 -10959 -4755 7846 7795 -3716 -9338 -1273 10220
1286 10220 5303 -8945 -7745 5183 8858 -536 -9499 -4543 8984 7778 -6301 -9270 1840
1299 1840 9430 3016 -8487 -7363 6273 9584 -3154 -9930 -1250 8385 6075 -6297 -9020 3580
1313C580O778r831r862N316J0603J658j1940o804J0903R690p029j0880J095J0719
1327C996N501r701r737O700J1846k794j0920k944Q865Q599o443j2205L321J2706
1341F790Q10j0093o002O395J0827l082j2720q20J1738M577p854q939L325J1978
1355F930J379j3200l875R780P099m285j0558m91J1767M665j0833p514P282R167
1369G313j453j0446m090J0321P782q335r576L821J0132K015r418p592Q329J0184
1383H987m998j0283j13R175N682p348j0066N016J1160j314j0106l310P472Q239
1397H193m554j0954J286J1236K204q669o465M991R869j413j1249k130J0251N106
1411G702o700p866J831J0201K591j0491n649Q177P697l277r740j139R679N439
$$ plain form
1313 3580 10358 527 -9335 -4019 6584 8242 -3698 -10502 401 10091 3062 -7818 -6723 3996
1327 3996 9497 -204 -9941 -3241 8605 5811 -5109 -8053 812 9411 2968 -9237 -5916 6790
1341 6790 7600 -2493 -8495 -2100 8727 5645 -7075 -7895 3843 8420 566 -8373 -5048 6930
1355 6930 8309 -4891 -8766 1014 8113 3828 -6730 -7221 4546 9211 -1622 -9136 -1854 7313
1369 7313 5860 -4586 -8676 1645 9427 1092 -8484 -4663 5469 7484 -1934 -9526 -1197 8987
1383 8987 3989 -6294 -6407 2768 8450 1102 -8964 -3948 7212 5898 -4208 -7518 -46 8193
1397 8193 3639 -7315 -6029 5207 7411 -1258 -7723 -2732 7137 5724 -5525 -7655 2596 7702
1411 7702 1002 -6864 -5033 5168 7759 -2732 -8381 -204 7493 4216 -5524 -6663 3016 8455
1425H455r023p671N577Q947o96r090m255Q407Q095o500r402K458R085K555p870
1440i28p227N893J0093l508r666p40Q229N358n954q677K470J0520K58r323l524
1455f726O259P465l023j0029j76J0038L520p831o174L966Q425J73r876l309Q656
1470A358N823n672p619J235Q862L192r103n779O654P662l050q269j387P945N841
1485G693p022p880M208Q096L39p756m924O444Q332m553r111J492Q060K870o422
1500a34o700M278Q829j633r045j949P696M976m073q494J671R788J078q621m041
1515f374N364O818j965q631j202Q711L866o882n785L162P870O60q562l874P490
1530F66O199m836p142N09P634L099p215o093N380P718j728q037j989O737N761
$$ plain form
1425 8455 -568 -8239 -2662 6285 5589 -3501 -7756 651 8746 2246 -7156 -4698 4387 6942 -928
1440 -928 -8155 -2262 7831 4323 -5343 -6083 2146 7504 1550 -7127 -4657 5863 6121 -3202 -6726
1455 -6726 -467 6998 3975 -6054 -6230 3808 7328 -503 -6677 -2711 5714 5887 -3989 -7298 1358
1470 1358 7181 1509 -6110 -4875 3987 7179 -1924 -7703 -1049 6613 3563 -4706 -6093 1852 7693
1485 7693 671 -7209 -3001 5095 5434 -2322 -7246 -802 7530 2977 -6134 -4642 3418 6288 -134
1500 -134 -6834 -2556 6273 4640 -4405 -6354 1342 6318 2245 -6249 -4578 5210 6288 -2333 -6374
1515 -6374 -1010 5808 3843 -4788 -5990 2721 6587 -295 -6080 -2918 4952 5612 -2950 -6824 666
1530 666 6865 2029 -5113 -4604 3030 6129 -1086 -7179 -1799 5919 4191 -3846 -5835 902 6663
1545F663n307p710K776Q173K03o752m271N269P454k928q655Q3P918K809n504o231
1561f010K799Q438m98q112k570O381N663l968p564M63Q663K306p583m595M835
1576a352O327p91q438j517P724M541o000o333K683P226J438p787m121O014O449
1591F063l537p239K80O684L848o277o015M302P312j522p247k091N978N934m849
1606A624p364J755P944Q78n823m900M708O926j923q076o37P312L394n143o027
1621e352J846Q107M99p820k852N813N331l106o856m68Q010K732o796m915M222
1636a605O125o34p076k487O814N264n442o166J990O451K036o337m969N139O728
1651E831k917o735n56N984M030n004o314K956P605n90p184k373M899N718k962
$$ plain form
1545 6663 1356 -6354 -3578 4595 4798 -1954 -6225 -956 6498 3570 -5085 -5002 2916 5725 221 -6010
1561 -6010 -3211 5227 4729 -3383 -5953 428 6091 2123 -5441 -4978 3685 5991 -1592 -6187 -1352
1576 -1352 4975 4184 -4254 -5771 1953 6494 494 -5839 -3156 4070 5508 -2279 -6400 -386 6063
1591 6063 2526 -4713 -4433 2251 6099 -178 -6193 -1891 5421 3899 -3348 -5439 539 6473 1624
1606 1624 -5740 -3985 3959 4837 -986 -5886 -1178 5748 3825 -4251 -4888 2424 5818 675 -5352
1621 -5352 -3506 4601 5100 -2720 -5572 241 5572 2466 -4390 -4858 3152 5884 -912 -5827 -1605
1636 -1605 4520 3886 -3190 -5677 1137 6401 959 -5207 -3217 3234 5270 -1067 -6036 -897 5831
1651 5831 2914 -3821 -4377 1607 5637 633 -5681 -2725 4880 4290 -2894 -5267 -368 5350 2388
1666B388p330P61P332K077n698n051L686O906r09p993j811O768M338m420n528
1681d484Q96P008J952p184l635M939N216j800o594j438P209L556n754n366L157
1696b322O487J6o374k965N493N216l631o368R18O106K310n479m720L826O766j925
$$ plain form
1666 2388 -4942 -4181 3151 5228 -470 -5521 -1835 5071 4162 -3831 -5642 1126 5464 1044 -4484
1681 -4484 -3588 3420 5372 -1812 -5447 -508 4708 2908 -3686 -5124 2085 5641 -113 -5479 -2322
1696 -2322 4165 4181 -2193 -5158 335 5551 1920 -4448 -3530 2576 4886 -593 -5313 -1487 5279 3354
$$ [...]
8191h7
##END NTUPLES=NMR FID
##END=
