##TITLE=1H_DE-62_EtOH
 D2O
 8 sc, 
 19.7.2024
##JCAMPDX= 6.0         $$ Bruker NMR JCAMP-DX V2.0
##DATA TYPE= NMR FID
##DATA CLASS= NTUPLES
##ORIGIN= UXNMR, Bruker Analytische Messtechnik GmbH
##OWNER= root
$$ XWIN-NMR		Version 3.5
$$ Fri Jul 19 16:22:35 2024 Russian Standard Time (UT+4h)  she@DPX200
##.OBSERVE FREQUENCY= 200.1314
##.OBSERVE NUCLEUS= ^1H
##.DELAY= (6, 6)
##.ACQUISITION MODE= SIMULTANEOUS
##.ACQUISITION SCHEME= undefined
##.AVERAGES= 8
##.DIGITISER RES= 18
##SPECTROMETER/DATA SYSTEM= spect
##.PULSE SEQUENCE= zg30
##.SOLVENT NAME= DMSO
##.SHIFT REFERENCE= (INTERNAL, DMSO, 0, 15.7039)
##AUDIT TRAIL= $$ (NUMBER, WHEN, WHO, WHERE, WHAT)
$$ ##TITLE= Audit trail, XWIN-NMR		Version 3.5
$$ ##JCAMPDX= 5.01
$$ ##ORIGIN= Bruker BioSpin GmbH
$$ ##OWNER= she
$$ F:/spectra/data/she/nmr/H-F/1/audita.txt
$$ ##AUDIT TRAIL=  $$ (NUMBER, WHEN, WHO, WHERE, WHAT)
(   1,<2024-07-19 16:21:28.71 +0400>,<she>,<DPX200>,
      <created by zg, POWCHK disabled, PULCHK disabled
       configuration hash MD5:
       00 E9 B6 7A A2 85 ED C7 34 08 36 98 17 FE 4E 26
       data hash MD5: 16K
       64 AB 38 81 06 74 A3 39 48 16 0D 19 1D 49 A3 79>)
$$ ##END=
$$ 
$$ hash MD5
$$ 3C DC B5 64 CE B4 8C 8D 06 16 23 BF EC AC 51 DD
##$RELAX= 
##$RELAX= 
##$RELAX= 
##$RELAX= 
##$RELAX= 
##$RELAX= 
$$ Bruker specific parameters
$$ --------------------------
##$DU= <F:/spectra>
##$EXPNO= 1
##$NAME= <H-F>
##$PROCNO= 1
##$TYPE= <nmr>
##$USER= <she>
##$AMP= (0..31)
100 100 100 100 100 100 100 100 100 100 100 100 100 100 100 100 100 100 
100 100 100 100 100 100 100 100 100 100 100 100 100 100 
##$AQSEQ= 0
##$AQ_mod= 1
##$AUNM= <au_zg>
##$AUTOPOS= <>
##$BF1= 200.13
##$BF2= 200.13
##$BF3= 200.13
##$BF4= 200.13
##$BF5= 200.13
##$BF6= 200.13
##$BF7= 200.13
##$BF8= 200.13
##$BYTORDA= 1
##$CFDGTYP= 0
##$CFRGTYP= 5
##$CHEMSTR= <none>
##$CNST= (0..31)
1 1 145 1 1 1 1 1 1 1 1 1 1 1 1 1 1 1 1 1 1 1 1 1 1 1 1 1 1 1 1 1 
##$CPDPRG= <>
##$CPDPRG1= <>
##$CPDPRG2= <>
##$CPDPRG3= <>
##$CPDPRG4= <mlev>
##$CPDPRG5= <mlev>
##$CPDPRG6= <mlev>
##$CPDPRG7= <mlev>
##$CPDPRG8= <mlev>
##$CPDPRGB= <>
##$CPDPRGT= <>
##$D= (0..31)
0 1.2 0 0 0 0 0 0 0 0.06 0 0.03 0 0 0 0 0.0002 0 0 0 0 0 0 0 0 0 0 0 0 
0 0 0 
##$DATE= 1721391688
##$DBL= (0..7)
120 120 120 120 120 120 120 120 
##$DBP= (0..7)
150 150 150 150 150 150 150 150 
##$DBP07= 0
##$DBPNAM0= <>
##$DBPNAM1= <>
##$DBPNAM2= <>
##$DBPNAM3= <>
##$DBPNAM4= <>
##$DBPNAM5= <>
##$DBPNAM6= <>
##$DBPNAM7= <>
##$DBPOAL= (0..7)
0.5 0.5 0.5 0.5 0.5 0.5 0.5 0.5 
##$DBPOFFS= (0..7)
0 0 0 0 0 0 0 0 
##$DE= 6
##$DECBNUC= <off>
##$DECIM= 24
##$DECNUC= <off>
##$DECSTAT= 4
##$DIGMOD= 1
##$DIGTYP= 9
##$DL= (0..7)
0 120 120 120 120 120 120 120 
##$DP= (0..7)
150 150 150 150 150 150 150 150 
##$DP07= 0
##$DPNAME0= <>
##$DPNAME1= <>
##$DPNAME2= <>
##$DPNAME3= <>
##$DPNAME4= <>
##$DPNAME5= <>
##$DPNAME6= <>
##$DPNAME7= <>
##$DPOAL= (0..7)
0.5 0.5 0.5 0.5 0.5 0.5 0.5 0.5 
##$DPOFFS= (0..7)
0 0 0 0 0 0 0 0 
##$DQDMODE= 0
##$DR= 18
##$DS= 0
##$DSLIST= <SSSSSSSSSSSSSSS>
$$ [...]
##$SUBNAM2= <"">
##$SUBNAM3= <"">
##$SUBNAM4= <"">
##$SUBNAM5= <"">
##$SUBNAM6= <"">
##$SUBNAM7= <"">
##$SUBNAM8= <"">
##$SUBNAM9= <"">
##$SW= 24.0689651099613
##$SWIBOX= (0..15)
0 0 2 0 0 0 0 0 0 0 0 0 0 0 0 0 
##$SW_h= 4816.95568400771
##$TD= 16384
##$TD0= 1
##$TE= 0
##$TE2= 300
##$TE3= 300
##$TEG= 300
##$TL= (0..7)
0 120 120 120 120 120 120 120 
##$TP= (0..7)
150 150 150 150 150 150 150 150 
##$TP07= 0
##$TPNAME0= <>
##$TPNAME1= <>
##$TPNAME2= <>
##$TPNAME3= <>
##$TPNAME4= <>
##$TPNAME5= <>
##$TPNAME6= <>
##$TPNAME7= <>
##$TPOAL= (0..7)
0.5 0.5 0.5 0.5 0.5 0.5 0.5 0.5 
##$TPOFFS= (0..7)
0 0 0 0 0 0 0 0 
##$TUNHIN= 0
##$TUNHOUT= 0
##$TUNXOUT= 0
##$USERA1= <user>
##$USERA2= <user>
##$USERA3= <user>
##$USERA4= <user>
##$USERA5= <user>
##$V9= 5
##$VALIST= <valist>
##$VCLIST= <CCCCCCCCCCCCCCC>
##$VD= 0
##$VDLIST= <DDDDDDDDDDDDDDD>
##$VPLIST= <PPPPPPPPPPPPPPP>
##$VTLIST= <TTTTTTTTTTTTTTT>
##$WBST= 1024
##$WBSW= 4
##$XGAIN= (0..3)
0 0 0 0 
##$XL= 0
##$YL= 0
##$YMAX_a= 695228
##$YMIN_a= -535913
##$ZGOPTNS= <>
##$ZL1= 120
##$ZL2= 120
##$ZL3= 120
##$ZL4= 120
##$ABSF1= 10
##$ABSF2= 0
##$ABSG= 5
##$ABSL= 3
##$ALPHA= 0
##$AQORDER= 0
##$ASSFAC= 0
##$ASSFACI= 0
##$ASSFACX= 0
##$ASSWID= 0
##$AUNMP= <proc_1d>
##$AZFE= 0.1
##$AZFW= 0.1
##$BCFW= 1
##$BC_mod= 2
##$BYTORDP= 1
##$COROFFS= 0
##$CY= 11.3945322036743
##$DATMOD= 1
##$DC= 2
##$DFILT= <>
##$DTYPP= 0
##$F1P= 15.6554695791079
##$F2P= 12.8336369535428
##$FCOR= 0.5
##$FTSIZE= 0
##$FT_mod= 4
##$GAMMA= 1
##$GB= 0.15
##$INTBC= 1
##$INTSCL= 1
##$ISEN= 128
##$LB= 0.24
##$LEV0= 0
##$LPBIN= 0
##$MAXI= 10000
##$MC2= 0
##$MEAN= 0
##$ME_mod= 0
##$MI= 1.114404
##$NCOEF= 0
##$NC_proc= 0
##$NLEV= 6
##$NOISF1= 3.799351
##$NOISF2= 2.8
##$NSP= 1
##$NTH_PI= 0
##$NZP= 0
##$OFFSET= 15.70392
##$PC= 1
##$PHC0= -25643.77
##$PHC1= 17.78749
##$PH_mod= 1
##$PKNL= yes
##$PPARMOD= 0
##$PSCAL= 0
##$PSIGN= 0
##$REVERSE= no
##$SF= 200.130013532006
##$SI= 16384
##$SIGF1= 3
##$SIGF2= 2
##$SINO= 400
##$SIOLD= 16384
##$SREGLST= <1H.CDCl3>
##$SSB= 0
##$STSI= 0
##$STSR= 0
##$SW_p= 3612.71676300578
##$SYMM= 0
##$S_DEV= 0
##$TDeff= 0
##$TDoff= 0
##$TI= <>
##$TILT= no
##$TM1= 0
##$TM2= 0
##$TOPLEV= 0
##$USERP1= <user>
##$USERP2= <user>
##$USERP3= <user>
##$USERP4= <user>
##$USERP5= <user>
##$WDW= 1
##$XDIM= 8192
##$YMAX_p= 0
##$YMIN_p= 0
$$ End of Bruker specific parameters
$$ ---------------------------------
##NTUPLES= NMR FID
##VAR_NAME=  TIME,          FID/REAL,        FID/IMAG
##SYMBOL=    X,             R,               I
##VAR_TYPE=  INDEPENDENT,   DEPENDENT,       DEPENDENT
##VAR_FORM=  AFFN,          ASDF,            ASDF
##VAR_DIM=   8192,          8192,            8192
##UNITS=     SECONDS,       ARBITRARY UNITS, ARBITRARY UNITS
##FACTOR=    0.0002076,     1,               1
##FIRST=     0,             0,               0
##LAST=      1.7004516,     0,               0
##MIN=       0,             -535913,         0
##MAX=       1.7004516,     695228,          0
$$ Real data points
##PAGE= N=1
##DATA TABLE= (X++(R..R)), XYDATA
0 0 0 0 0 0 0 0 0 8 0 8 -8 13 -16 16 -24 24 -32 40 -47 58 -64 77 -91 101 -122 134 -156 178 -200 229 -253
31 -253 291 -324 361 -408 450 -503 559 -618 687 -759 844 -932 1032 -1145 1266 -1410 1566
48 1566 -1748 1961 -2201 2500 -2855 3301 -3875 4643 -5741 7425 -10387 17047 -64166 172930
62 172930 519881 542328 430765 223136 -8852 -296377 -506828 -535913 -333025 -31230
72 -31230 247336 415359 475381 397168 179828 -136585 -413025 -525836 -429519 -198277 76089
83 76089 317680 471238 466414 279039 -23368 -293595 -425952 -408282 -287243 -92467 146677
94 146677 362853 454707 371840 154363 -102633 -314241 -424683 -399168 -230292 30893 282789
105 282789 423884 406059 249924 19413 -209857 -363784 -389438 -279700 -81459 126889
115 126889 287043 365036 338746 194022 -41740 -274718 -396547 -359230 -200860 5823
125 5823 202039 340645 371032 264111 53346 -169953 -316598 -347578 -270124 -114391 78803
136 78803 250897 338539 305239 167146 -20723 -200052 -321162 -343058 -241768 -38989 183125
147 183125 322860 328379 221835 59813 -110408 -253071 -321490 -277110 -127134 63301 215362
158 215362 286756 271380 175420 15097 -164340 -292585 -311443 -215062 -48383 127068 257200
169 257200 301051 238971 86833 -95616 -232044 -276859 -232266 -125978 15296 162197 265511
180 265511 273497 174453 14014 -138373 -235863 -260954 -207640 -78973 90290 231639 279898
191 279898 220188 88846 -59908 -181053 -244516 -227873 -132026 10129 144065 223614 230077
202 230077 167393 50657 -92412 -211698 -253917 -196047 -67759 73438 179976 228731 208070
213 208070 115012 -27003 -161406 -228456 -207162 -120684 -6943 104098 187830 214577 165498
224 165498 53317 -77028 -176251 -213715 -182458 -90260 37501 155958 216022 192149 100724
235 100724 -16079 -120029 -184991 -194196 -137864 -28456 92123 173287 188044 142905 59131
246 59131 -43585 -140330 -195402 -179208 -92047 26981 128917 181149 173811 110274 8064
257 8064 -100220 -170514 -177154 -121599 -32318 62028 137843 172547 148831 68709 -37587 -125989
269 -125989 -166000 -151530 -91251 -470 97217 164496 169764 108658 11255 -80891 -140295 -154495
281 -154495 -121833 -47379 46890 124408 155372 131563 66827 -16454 -96400 -148115 -148660 -93391
293 -93391 -3175 83841 137117 143652 105658 32222 -56212 -126963 -149421 -114975 -42712 35871
305 35871 98452 131666 126055 76052 -4858 -85353 -132355 -130225 -85865 -16270 59588 118650
317 118650 137485 104801 32790 -46839 -104620 -125750 -107913 -55459 18524 88573 125700 115611
329 115611 66667 164 -63173 -108659 -120715 -90733 -24303 52287 106828 120385 93875 38904
341 38904 -28005 -87525 -118144 -105153 -53103 14602 72687 105870 105575 71710 11583 -54942
353 -54942 -101192 -109131 -79600 -25646 34610 86074 110357 95329 43450 -23787 -78142 -102218
365 -102218 -92567 -55197 296 58324 98062 100741 66290 11200 -43271 -83134 -97340 -80705
377 -80705 -33601 27475 77910 97735 83126 42822 -10032 -60941 -93331 -92666 -56430 -876
389 -876 51767 83135 86903 65102 21250 -32014 -76169 -91987 -73789 -30701 19135 61437 85172
402 85172 81381 47992 -3974 -54533 -83226 -81370 -53746 -9863 37918 74337 84776 64525
414 64525 20632 -27289 -62730 -78209 -69072 -37232 10167 55278 79516 74364 44549 1455
426 1455 -40604 -71267 -77677 -55877 -12845 33755 65624 74728 59453 25907 -16566 -55515 -74841
439 -74841 -65553 -33766 7514 43901 66580 69392 48345 8024 -36623 -65966 -70194 -50735 -16300
452 -16300 22642 55834 70363 59447 26259 -15490 -48233 -64106 -59818 -37050 -933 37677
464 37677 63427 64896 43075 8243 -27269 -54024 -64961 -53162 -21074 19826 52347 63404
476 63404 52825 26565 -6954 -39399 -59710 -58947 -36135 -1052 32269 53266 57449 43957 14859
489 14859 -21124 -50773 -60758 -48139 -20261 12915 41727 57648 53823 30029 -5690 -36990
501 -36990 -53131 -51256 -34514 -7248 24169 48451 56346 42674 14240 -17261 -42170 -53268
513 -53268 -47135 -24659 8320 38451 53631 48999 28449 -505 -28446 -47870 -51323 -35547 -7338
526 -7338 21905 41894 48244 39836 18985 -10501 -38009 -52029 -45617 -23198 5521 30955 46631
539 46631 47172 31458 3181 -25899 -44354 -46355 -33122 -10659 15217 36978 47039 40310 18465
552 18465 -8746 -32064 -44169 -42845 -27103 -382 27858 45287 45006 28586 4527 -19866 -37585
565 -37585 -43935 -35223 -13470 13539 34314 42205 36546 19803 -2883 -26418 -41919 -42112 -26331
578 -26331 -1563 22517 38515 42065 31024 8925 -16864 -36198 -41067 -32035 -13828 8039 27466
591 27466 39286 37450 21896 -2029 -24091 -36970 -37819 -26688 -6491 17164 35852 41013 30319
604 30319 9324 -13281 -30299 -37618 -32843 -16450 5961 25844 35983 33696 21408 2348 -17819
617 -17819 -34002 -37857 -27646 -6953 15073 30809 35754 29493 13559 -8740 -27851 -36464 -31721
630 -31721 -15722 3232 20398 31524 32988 22976 4499 -15902 -30472 -33769 -26416 -10131 9720
643 9720 27703 35388 30497 13598 -6807 -23027 -31600 -30273 -18693 -403 18578 30227 31009
656 31009 21249 5735 -11168 -25630 -32367 -27604 -12434 8063 24646 31982 28094 15740 -2296
669 -2296 -20135 -30329 -29490 -18025 -1644 14461 25518 28933 23034 8541 -9339 -23977 -29475
682 -29475 -24851 -12732 3288 19551 29549 28851 16568 -1362 -17506 -26721 -27133 -18619 -4774 11537
696 11537 23935 27827 21811 8736 -6234 -19519 -26419 -25367 -14550 2131 18013 26510 25723
709 25723 16891 2473 -13415 -24913 -27404 -19276 -4735 9643 20166 24497 21275 11420 -3308
722 -3308 -17629 -25290 -23684 -14484 -332 13868 23566 25664 18029 3345 -11503 -21699 -23786 -18687
736 -18687 -7414 6358 18468 23863 20671 10375 -2453 -13701 -21246 -22668 -16382 -2753 11773
749 11773 22233 23503 16756 5196 -8064 -18457 -23289 -19129 -8412 5073 16213 20943 19582
762 19582 12150 539 -11686 -20756 -21459 -15085 -3896 8325 17953 22173 18298 7564 -6388 -17201
776 -17201 -21307 -17865 -9297 1945 12833 19487 19577 12564 1430 -9580 -17237 -19556 -15314 -5925
790 -5925 6401 16280 20723 16957 7982 -3627 -14007 -19393 -18153 -10339 1111 11603 16935 17361
804 17361 12433 3470 -6942 -15649 -19123 -14976 -5988 4659 13460 18185 16865 9702 -1803 -12102
818 -12102 -17925 -17031 -10184 -666 8667 15779 17201 12976 3675 -6065 -13344 -16503 -14489 -7892 2360
833 2360 12002 17115 16186 8873 -585 -9391 -15436 -16338 -11287 -2332 7481 14130 15426 11956 5013 -3568
849 -3568 -11220 -15590 -14405 -7841 1343 9840 14815 14711 10118 1174 -8242 -14506 -15112 -10530 -2838 5142
865 5142 11656 14622 12407 5910 -3038 -9863 -13433 -12540 -7747 -672 7891 13644 14219 9565 1812 -5990
881 -5990 -12124 -13612 -11243 -4060 4337 10587 13514 10991 5944 -1101 -8115 -12611 -13113 -8465 -1034
896 -1034 6879 11790 12593 9989 3598 -4363 -10679 -12906 -10342 -4145 3002 9064 11920 11188 6778 -264
912 -264 -7044 -11267 -11486 -8145 -1791 4673 10275 12449 9706 3499 -3496 -9012 -11433 -10402 -5535 1437
928 1437 7772 10906 10436 6104 392 -5232 -9503 -10928 -8315 -3089 3803 8944 10658 8970 4853
943 4853 -1462 -7845 -11208 -9969 -5640 754 6183 9326 9789 6724 1604 -4396 -8613 -9807 -7666
958 -7666 -3114 2383 6920 9778 8972 4781 -1319 -6728 -9578 -9163 -5634 -341 5174 9149 9246 6644
974 6644 1943 -3276 -7346 -8809 -7629 -3475 1861 6851 9001 7815 4837 -281 -5105 -8362 -9048
989 -9048 -5614 -454 4083 7413 8343 6507 2466 -2516 -6499 -8307 -6938 -3374 1167 5409 7925
1004 7925 8175 5137 42 -4480 -7605 -7681 -5441 -1443 3231 6880 8063 6106 2216 -2206 -5594 -7501
1020 -7501 -6747 -4284 452 4579 6781 7210 4752 756 -3707 -6734 -7711 -5747 -1569 2649 5801 6974
1036 6974 5620 2613 -963 -4792 -7435 -6384 -3430 462 3855 6250 6770 4863 1113 -2862 -6031
1051 -6031 -6832 -5144 -1637 2012 5150 6592 5846 2939 -975 -4316 -5919 -5800 -3717 -417 3126 5763
1067 5763 6022 4368 1213 -1709 -5126 -6014 -5481 -2071 1468 4789 5754 5301 3005 -568 -3764 -5465
1083 -5465 -5311 -3340 -33 3009 4945 5625 4444 1315 -1830 -4712 -5727 -4623 -1929 1074 4042
1098 4042 5517 4965 2882 -437 -3396 -5062 -5034 -3459 -790 2296 4744 5288 4030 1468 -1586 -4266
1114 -4266 -5538 -4330 -2387 1151 3880 5131 4826 2682 53 -3089 -4491 -4658 -3326 -561 2033
1129 2033 4428 4711 3561 1704 -1397 -3744 -4959 -4295 -2150 718 3076 4510 4496 2827 191 -2708
1145 -2708 -4395 -4501 -3154 -951 1762 3692 4411 3589 1465 -1428 -3115 -4521 -4180 -2381 124 2840
1161 2840 4302 4344 2524 507 -1923 -4070 -4590 -3566 -1022 1419 3412 4073 3448 1680 -862 -2983
1177 -2983 -4123 -4025 -2178 102 2416 3834 4292 2734 747 -1990 -3580 -4023 -2968 -686 1078 3088
1193 3088 3857 3570 1758 -656 -2861 -3854 -3687 -2310 -151 2026 4003 4199 2717 304 -1865 -3562
1209 -3562 -3973 -3334 -874 1073 3235 3954 3483 1506 -189 -2707 -3796 -3924 -2188 -288 1937 3537
1225 3537 3761 2759 818 -1442 -3373 -3960 -3138 -1217 660 2897 3741 3519 1935 -592 -2159 -3267
1241 -3267 -3541 -2316 -525 1588 3637 3698 2835 1064 -1359 -2892 -4015 -3027 -1441 491 2780 3778
1257 3778 3048 1774 14 -2073 -3140 -3429 -2506 -701 1398 3037 3553 2928 1250 -817 -2718 -3291
1273 -3291 -3187 -1596 508 2024 3087 3465 2173 106 -1891 -2999 -3022 -2529 -894 909 3075 3692
1289 3692 2987 1543 -492 -2715 -2925 -3112 -2050 8 2027 3062 3324 2374 531 -969 -2614 -3540
1305 -3540 -2911 -1041 1116 2330 3196 2862 1800 -10 -2303 -3227 -3508 -2063 -274 1831 2695 3124 2236
1322 2236 802 -1094 -2532 -3224 -2616 -1483 277 2147 2599 3287 2114 89 -2039 -2818 -2918 -2280 -730
1339 -730 1164 2629 3082 2856 737 -750 -1896 -2788 -3222 -1454 21 1641 3013 2777 1834 529 -1146
1356 -1146 -2381 -2934 -2317 -960 1241 2523 2682 2343 1392 -466 -1881 -2717 -2615 -1531 -155 1413 2429
1373 2429 2874 2193 779 -1069 -1961 -2792 -2156 -1130 409 1984 2872 2650 1345 -323 -1298 -2255 -2607
1390 -2607 -1924 -694 1142 2554 2498 2098 1130 -646 -1925 -2557 -2632 -1197 70 1585 2421 2127 1623 509
1408 509 -1096 -2095 -2705 -1862 -1045 506 1846 2307 2394 1235 -349 -1920 -2500 -2374 -1152 -290 1258 2309
1426 2309 2654 1875 587 -977 -1989 -2223 -1969 -850 138 1621 2408 2221 1605 53 -1377 -2261 -2485
1443 -2485 -1902 -217 1091 2124 2014 1546 732 -419 -2002 -2356 -1994 -869 304 1386 2102 1984 1552
1460 1552 52 -1067 -2539 -2434 -1562 -610 946 1796 2054 1894 703 -264 -1506 -1892 -2081 -1117 -3
1477 -3 977 1954 2167 1699 662 -784 -1366 -2328 -2069 -647 328 1838 1975 1798 1258 -42 -847 -2119 -1934
1496 -1934 -1305 -82 892 1556 1981 1743 818 -524 -1638 -2004 -1717 -834 218 1458 1876 1746 1269 -18
1514 -18 -1079 -1558 -1827 -1248 -596 600 1883 1630 1899 887 -465 -1399 -1681 -1743 -1000 -3 1022 1701 1842
1533 1842 1281 361 -532 -1542 -1966 -1576 -524 340 1198 1649 1561 952 -11 -1175 -1676 -1872 -1255 -76 717
1552 717 1531 1669 1050 571 -444 -1508 -1379 -1298 -679 188 905 1547 1561 888 88 -723 -1454 -1587 -1543 -573
1572 -573 692 1387 1765 1033 483 1 -1350 -1394 -1347 -899 7 905 1394 1261 1285 427 -241 -1154 -1637 -1613 -557
1593 -557 289 1063 1690 1365 967 145 -1009 -1268 -1261 -981 -308 428 1327 1477 1300 650 -492 -1127 -1510 -1393
1613 -1393 -750 52 1009 1541 1196 1134 102 -578 -1143 -1367 -1020 -202 258 1063 1038 1004 737 38 -805 -1437
1633 -1437 -1219 -862 142 878 1176 1340 709 91 -385 -905 -1200 -780 -601 444 796 1185 768 252 7
1652 7 -797 -1193 -940 -805 204 429 970 1344 966 245 -393 -1159 -1178 -840 -622 132 834 1005 896 582 169
1673 169 -815 -903 -1049 -958 -95 430 894 1265 951 455 11 -533 -1173 -977 -684 141 482 987 1147 496 68
1694 68 -409 -635 -1006 -1009 -347 383 460 991 1094 194 -393 -773 -1191 -1060 -543 35 682 656 763 809 394 -431
1716 -431 -502 -925 -701 -228 90 344 1026 781 116 340 -421 -1047 -671 -747 -290 320 710 853 677 257 -30
1737 -30 -913 -661 -665 -699 -141 469 871 488 525 36 -338 -809 -658 -778 -500 249 767 1112 648 524 143 -441
1759 -441 -875 -831 -364 -47 423 541 938 745 397 -339 -747 -553 -623 -115 283 177 820 605 525 -18 -294
1780 -294 -362 -653 -555 -72 236 694 574 386 -29 -219 -436 -670 -457 -282 22 152 671 659 218 361 -503
1801 -503 -394 -636 -697 -141 65 446 665 426 92 -141 -189 -372 -442 -499 -41 357 580 658 734 59 -364 -418
1823 -418 -475 -345 -107 70 133 524 254 340 -96 -328 -457 -447 -523 -278 162 448 653 656 289 81 -447 -551
1845 -551 -505 -615 142 207 542 354 300 -152 -279 -497 -400 -339 -131 253 18 658 289 -7 -55 -410 -317 -36
1867 -36 -143 -66 111 284 412 266 112 -426 -499 -384 -380 236 206 381 456 462 -9 113 -159 -369 -404 -160 257
1890 257 -76 277 601 251 -18 -169 -200 -327 -479 -16 40 80 368 88 411 -297 -181 -448 -422 55 -96
1911 -96 487 269 551 201 -115 -298 -496 -281 -321 -43 338 2 -5 4 7 -40 -316 -268 -628 -227 -76 352 429 186
1935 186 459 271 -293 -324 -143 -40 -155 183 401 413 390 170 -156 -412 -380 -177 -286 -169 -181 185 224 213
1957 213 219 -203 -539 -209 89 -13 456 409 411 142 183 -62 -221 -73 -316 -355 -4 331 1 344 252 57 -240
1980 -240 -377 -487 -181 114 -2 343 192 169 182 -29 -454 -369 -86 -133 68 65 194 481 351 189 -194 -293
2002 -293 -461 -241 162 242 120 306 282 73 29 -140 -377 -385 -387 -24 107 176 154 113 225 94 -362 -312 -440 84
2026 84 60 166 362 340 -29 -60 -479 -480 -206 -269 8 405 298 372 -122 105 64 -142 -140 -367 147 153 62 237 197
2051 197 111 88 -536 -201 -345 109 -129 273 414 350 283 105 66 -500 -254 -380 -64 -205 -104 190 287 -24
2073 -24 -96 -356 -537 -347 -421 -167 -96 405 227 317 99 -163 -169 -416 -361 -317 -53 -56 447 590 -106 -14 -74 -206
2097 -206 -170 -346 -157 -89 119 536 313 -5 -13 -425 -416 -514 -271 -201 -28 285 301 348 -44 -105 -241 -376 -351 -152
2121 -152 -469 406 457 414 51 202 -242 -458 -492 -267 -212 304 254 459 249 223 133 -504 -368 -161 -83 123 300
2144 300 206 639 388 112 -46 -304 -336 -424 -360 7 292 391 621 206 8 -221 -591 -483 -246 -41 -107 165
2166 165 406 293 240 -123 -347 -538 -368 -147 -139 -171 355 593 234 -48 -85 -328 -507 -583 19 13 82 574 368
2189 368 525 86 -308 -652 -547 -129 207 392 603 380 337 278 -321 -325 -517 -500 -423 136 430 175 276 293
2211 293 -100 -254 -379 -359 -225 -144 223 342 512 333 87 -198 -641 -304 -781 -391 172 170 512 445 285 250
2233 250 -186 -422 -493 -520 -94 191 367 380 -28 133 -48 23 -350 -188 -197 -94 70 195 417 294 -13 52
2255 52 -148 -511 -127 -496 82 133 -68 259 138 178 -230 -156 -255 -321 -78 -15 284 614 306 213 -193 -162 -159 -129
2279 -129 -473 -150 47 538 377 105 477 -125 -264 -314 -417 -172 -187 239 133 76 80 -146 -182 -406 -342 -124
2301 -124 106 433 603 386 400 -378 -60 -257 -375 -381 -45 -284 171 232 325 203 -82 -255 -188 -298 -276 96
2323 96 35 202 498 314 7 49 -176 -594 -369 59 -113 429 343 474 358 7 11 -467 -417 -458 -204 -30 255
2346 255 392 161 -95 46 76 -74 -301 62 -215 -73 243 366 233 73 108 -176 -426 -201 -275 109 179
2367 179 144 273 -56 -75 -367 -306 -185 -269 -173 -51 505 248 439 87 -118 -49 -430 -58 -210 -50 270 356
2389 356 367 417 -34 127 -90 -339 -400 49 172 -82 275 38 271 24 -356 -111 -320 -163 -9 271 202
2410 202 133 228 -39 -60 -341 12 -250 -109 42 -87 449 231 418 -47 -251 -215 -1 -515 -153 -87 57 365
2432 365 457 232 -56 -299 -173 -290 -321 -300 321 159 148 352 235 121 -245 -240 -272 51 -76 138 43 292 271
2455 271 40 -266 -461 -111 -29 87 0 175 163 273 379 -226 -261 -359 -267 4 218 -161 219 306 106 -171
2477 -171 -370 -135 -451 -206 -239 253 87 243 323 118 -109 -18 -107 -328 -319 -211 133 -48 6 297 45 127 132
2500 132 -462 26 -121 21 292 211 528 133 269 -330 -156 -531 -27 94 191 59 194 294 166 66 -131
2521 -131 -180 -176 -376 -31 219 158 422 3 297 -118 -191 -277 -133 42 -86 379 397 210 18 -4 -174 -25 -392
2544 -392 -122 213 -61 246 281 296 -44 90 -23 -349 -135 -91 -264 51 120 213 69 -116 -170 -333 -234 -334
2566 -334 -329 12 69 340 61 -53 92 -258 -154 -42 -218 198 344 219 159 -7 -109 55 37 -47 166 50
2588 50 1 393 232 -29 130 -74 -321 -91 -19 -47 -180 153 265 27 405 -140 -333 -109 -223 -19 54 30
2610 30 238 345 469 -254 24 -90 -198 -71 -121 -56 70 124 338 374 109 -109 -467 -132 -55 -162 210 146
2632 146 222 277 249 -81 -268 -495 -379 75 -115 -73 354 -111 -127 127 -97 -104 -365 -327 -348 -195 504 209 253
2655 253 45 -338 -81 -136 -76 215 236 119 169 178 55 81 -224 -76 -128 -130 19 -18 104 334 234 86 -544 -13
2679 -13 -380 -151 -173 -150 108 99 266 134 170 -83 -196 -303 -207 -401 -51 -158 134 47 155 -120 -23 59 -80
2702 -80 99 97 207 428 243 137 -77 -248 -189 -324 31 29 -178 282 198 306 106 -102 -70 -71 -296 -200 24 -111
2726 -111 94 266 344 -55 -81 -110 -382 -12 -202 -118 157 -11 12 -19 195 -45 -318 -109 151 -210 82 61
2748 61 214 139 -13 -306 -12 -209 -254 192 5 263 576 369 95 68 -107 -169 -344 -205 441 266 202 210 131
2771 131 214 -337 -170 -301 -165 12 -105 137 -15 291 327 157 -216 -365 -347 -39 -95 49 366 132 -127
2792 -127 218 -180 -213 -245 -130 -430 -73 122 344 -13 -52 -192 -175 -94 83 -116 -31 -173 -108 -39 294 35 -412
2815 -412 90 -123 -204 1 -72 111 346 17 -17 -64 -256 -297 -138 26 -151 -81 289 276 201 344 38 -210 -349
2838 -349 -91 35 10 338 0 94 131 -31 -102 -70 -252 -352 -273 125 462 -183 81 166 136 -111 -163 -274 85
2861 85 372 57 243 287 -200 -50 310 321 -167 -39 -106 247 278 47 -72 -35 127 71 -205 -480 -267 9
2883 9 -181 115 192 138 -208 -303 -8 -517 -203 -293 -129 83 276 285 24 74 -227 -190 -375 -98 47 258 228 542
2907 542 71 80 -324 -146 -248 -491 -171 42 -7 358 350 -163 3 -163 -454 -410 -210 145 281 149 448 409
2929 409 -115 -49 -157 -244 -250 -164 342 274 96 237 248 54 -90 -557 -178 -176 -135 319 160 327 171 -195 5
2952 5 -191 -175 -252 -157 38 270 158 247 153 202 -29 -234 -201 -57 -223 313 154 -176 452 -167 96 -291 -372
2975 -372 -217 -206 -180 86 465 202 457 -213 15 -62 -447 -109 -245 148 226 222 247 146 63 388 -249 -116 151
2998 151 -172 233 321 272 79 8 -292 -101 -290 -179 -418 -100 177 340 96 -99 146 -156 -191 -39 -273
3019 -273 -162 25 -29 271 394 181 -64 144 -330 -382 12 0 -25 475 183 137 -88 -37 -193 2 -209 140
3041 140 229 271 280 234 36 -259 -105 11 -100 -243 160 287 316 339 150 55 1 -129 -269 -386 -50 291 -83
3064 -83 -10 40 51 13 -103 -357 -93 -52 -129 162 143 298 191 -202 -252 -64 211 -148 -188 -31 -72 216 361 5
3088 5 230 -220 -108 -394 -166 271 105 -18 260 343 -26 -69 -18 -165 13 -7 -33 5 321 244 317 25 115 -9
3112 -9 -356 -218 72 5 -6 193 -59 63 -143 -10 2 -424 -185 -110 181 76 -99 -175 290 189 -69 0 -144
3135 -144 -238 -121 102 249 206 136 29 -226 -172 -251 -20 93 -115 220 -54 116 216 56 -164 38 -136 -123
3157 -123 -412 171 246 -86 80 -90 89 -13 -127 -142 -46 -48 -15 250 397 219 -14 -17 -95 -432 -390 -70 -310
3180 -310 -270 343 139 -96 -67 -52 -139 -409 -198 76 101 58 472 168 -177 -113 -234 -153 -400 -188 193 183 94
3203 94 12 -191 -103 -128 -46 34 100 -145 213 101 140 312 54 194 -130 -106 -42 25 -120 161 281 161 -151 -317
3227 -317 45 -29 -23 -104 155 23 -22 131 302 185 53 -24 -196 -131 65 64 31 181 216 133 -216 31 -140 -306
3251 -306 -217 -190 -12 295 164 142 68 -54 208 -72 -163 23 -174 62 90 122 44 -299 63 -531 28 -19 21
3274 21 216 -77 167 70 230 -183 -136 -243 -273 125 57 121 143 113 245 -32 -80 -8 -244 -130 186 75 2 205
3298 205 105 217 156 49 -139 -350 -140 -109 241 83 -27 255 -260 -13 -46 206 -98 95 -59 -83 -90 125
3320 125 132 -114 -14 -177 6 -255 182 56 -11 156 -246 -99 35 -152 80 331 -231 -149 -76 20 182 -181
3342 -181 -61 -164 122 164 53 -29 14 210 -119 179 283 -74 -73 258 44 120 21 -24 3 -531 164 250 315 -253
3366 -253 39 -29 174 -326 -114 123 -74 229 -54 392 -24 62 0 -61 134 -31 -153 -11 -190 125 73 -82
3388 -82 81 34 -51 341 15 0 132 -82 -146 305 -35 158 64 127 -51 450 14 -44 -77 -186 -100 -121 95 300
3412 300 -37 -59 -128 -221 79 -40 87 -175 82 -109 -1 -337 -343 5 88 219 -62 142 283 -185 156 -17
3434 -17 62 3 -372 75 174 -169 -310 12 74 134 96 159 221 4 67 -126 23 29 -110 56 -78 181 36 -11
3458 -11 272 -46 123 -205 26 106 118 -55 -149 197 0 -141 137 -236 68 -113 79 -93 72 -32 61 -141
3480 -141 -180 -61 -33 260 -40 99 52 103 -258 -162 -196 85 -130 -130 242 -164 -11 -304 361 229 9 -149 -152
3503 -152 117 95 -49 123 241 -157 387 287 18 11 -71 198 127 201 -36 376 238 23 34 -235 -356 68
3525 68 -177 -3 90 -193 88 -281 -145 -155 -56 -66 -99 256 -102 170 34 81 162 106 -139 128 -108 -19 148
3548 148 34 370 -138 -200 -87 71 -283 15 -1 163 -173 168 73 58 131 -51 -106 102 159 -170 197 50
3570 50 64 28 -21 -122 154 129 -284 -63 97 -133 -108 38 38 -175 215 -189 181 38 -103 70 -175 84 -40
3593 -40 126 -34 176 -235 133 -53 -24 -68 339 -83 142 -130 -45 84 -284 -228 -181 -12 79 -96 114 22 48
3616 48 -12 109 -380 358 241 -80 -303 -264 55 -74 -29 -76 -124 3 -153 -443 186 -27 160 -212 46 50 35
3639 35 -219 140 -92 -231 25 51 82 118 131 270 127 -23 267 207 186 -72 -17 192 30 -70 -137 -91 146
3662 146 -95 -193 -52 105 28 34 201 -40 -115 322 57 465 163 10 13 83 371 206 3 134 49 -236 11
3685 11 -55 -229 38 367 11 115 -243 -163 -227 98 74 -47 198 -34 118 -240 -51 397 -279 -251 -106 39
3707 39 -157 -66 -273 279 -101 -121 -137 60 161 -235 0 10 77 23 -148 -169 -172 6 -157 86 -23 -66 25 11
3731 11 139 -117 -315 -148 19 -143 156 59 -52 -316 -12 149 -97 -74 -139 149 32 42 32 240 124 86
3753 86 -239 46 -77 -295 -40 -295 82 95 138 112 70 -47 -232 -197 -129 -122 60 -14 228 266 -200 -156 208 -190
3777 -190 -81 -48 -41 454 -15 191 -108 235 166 152 -206 -72 -76 1 244 372 -211 53 -67 195 50 -18 -101
3800 -101 208 221 -163 -46 180 -173 -47 -131 -72 -113 127 -73 -142 147 182 233 29 64 141 125 76 7 -28 -31 -14
3825 -14 215 -346 105 4 80 -189 136 -47 121 -183 -84 232 -80 -173 -218 -242 202 -351 -2 -250 160 -217
3847 -217 -45 -1 -223 181 -22 -177 -207 -11 -155 -23 -203 -104 84 190 -45 221 -143 52 -131 -9 -122
3868 -122 -5 135 -133 287 91 -203 66 -8 33 1 -17 179 -255 143 -308 -18 124 75 -154 338 -116 -62
3890 -62 -100 33 -63 180 61 -90 -34 -117 -98 10 -97 -264 -121 179 -12 -118 248 117 295 -130 -45 19 28
3913 28 -15 150 -198 69 104 -64 245 142 -185 241 -79 -73 -71 -221 -152 -19 -115 -242 -41 -8 -45 75 209 -90
3937 -90 -22 -91 -106 83 68 213 -43 177 94 -256 -13 -68 269 142 110 77 28 22 192 -69 174 13 208 85
3961 85 -173 -136 -47 -171 -326 -8 -38 88 65 24 -121 -41 31 20 -274 277 -112 -187 32 -130 -44 258 -273 -202
3985 -202 165 182 -425 -141 55 -8 106 -19 84 -297 189 -34 -100 -312 -149 187 -216 -130 34 -57 -43 55
4007 55 -72 -209 -66 19 -14 -78 177 227 125 197 -421 20 64 -197 211 290 -172 196 128 -23 231 -97 -193
4030 -193 -53 -174 -30 -131 122 -225 19 -170 -19 350 -156 -334 74 -97 -204 -204 -7 204 252 18 -194
4051 -194 -136 3 -324 395 -196 398 -115 208 -11 -30 -153 -156 90 -205 -20 -91 365 82 286 -85 -14 110
4073 110 -67 257 355 -315 -87 -358 -126 229 -82 39 42 -322 -132 56 -13 -221 66 130 -79 -117 316 -206
4095 -206 114 -93 102 19 -96 123 164 1 -127 -146 -49 -229 25 62 -182 51 -10 87 -38 -100 60 -184 104
4118 104 252 187 -92 -121 -152 -350 118 -44 256 123 148 -113 -54 -257 -147 19 58 137 -217 87 294 200 -152
4141 -152 -72 8 -52 52 20 -186 -153 304 -306 -44 272 -118 -49 -170 -33 -323 -89 -149 -4 -193 -278 -50 -50
4164 -50 92 -207 -117 119 -56 171 79 -128 -185 126 -222 -205 278 124 134 -76 120 -229 150 115 -85 188
4186 188 -354 79 -83 55 66 -69 181 115 66 68 52 21 -63 -133 172 -179 -1 293 -68 130 -256 -162 -19
4209 -19 -107 -206 -32 -65 169 -195 -17 -130 82 51 117 -272 -130 46 112 277 168 116 -241 1 93 -76 128
4232 128 19 122 -487 -137 -44 209 46 -98 50 142 -188 19 105 -94 -310 -490 -92 -206 493 -78 -306
4253 -306 268 -6 106 189 93 131 -515 161 -129 -30 136 -112 -175 -39 -89 262 139 30 127 -351 -215 214
4275 214 307 44 58 218 -185 66 300 -152 131 -80 166 -147 -3 133 77 117 79 -99 -14 -80 98 263
4297 263 144 -62 315 -6 -186 271 -342 -28 -145 -54 -81 63 344 -30 101 234 -11 202 -22 125 -2
4318 -2 20 39 33 -119 179 208 -116 159 66 76 119 -185 114 23 -227 -121 -118 -237 49 -126 -217 120 -157 50 78
4343 78 98 14 -317 -149 -143 73 86 230 -71 186 -60 240 244 -122 188 30 -227 -353 261 209 156 -182 -167 -146
4367 -146 -87 -40 -26 -33 -62 -463 -148 -221 -81 70 -88 -248 -71 -233 -24 -247 -96 -202 165 -32 335 148
4389 148 -396 -4 -440 236 -99 -65 472 52 -227 -48 -18 -162 11 -79 -324 -67 304 -220 268 -21 -32
4410 -32 -102 -125 -81 34 199 87 93 -224 32 -37 27 234 2 -192 173 118 94 -293 -51 -233 48 212 -146
4433 -146 -48 74 -4 128 84 -114 -108 -396 -342 -12 -11 75 124 160 210 -32 178 -118 -15 144 -10 -23 360 328 203
4458 203 165 -207 -2 -116 158 -208 -53 215 193 -77 95 440 61 -127 12 5 -63 -178 -100 33 133 121
4480 121 42 14 85 -119 93 -213 -454 166 466 260 48 -9 -60 -248 -88 -2 -34 35 34 0 40 11 140 163 147
4505 147 -106 -211 63 49 -9 157 13 334 -91 -109 154 -258 -467 -372 136 -266 63 218 -24 -104 115 114
4527 114 -273 14 122 166 63 -273 159 229 84 24 -74 69 117 141 19 -197 203 -6 -18 -144 -33 -131 261
4550 261 -97 207 -155 59 56 -15 -270 -71 -49 223 386 4 292 167 13 165 -130 -158 93 61 77 -71
4572 -71 8 -52 -10 -108 75 -111 -72 -69 -12 -20 163 84 28 98 51 -57 63 -59 -3 22 -84 -370 -139 -354 85 -5
4598 -5 170 265 -129 298 413 -251 -161 -284 -66 16 -136 -113 133 166 -68 -444 95 107 218 261 -54 -84 -390
4621 -390 160 14 29 74 55 97 -26 442 131 -54 -105 39 -71 -198 48 255 77 117 120 51 126 -31 54 77
4645 77 92 40 -72 79 54 -163 -31 39 -480 -25 -85 -33 38 -21 137 -44 -147 167 -107 -118 -33 302 -25 -210
4669 -210 -376 78 319 202 64 22 -85 107 -127 195 2 -171 -194 252 -42 16 -62 -86 -429 233 107 -79
4691 -79 19 6 -71 95 -131 -23 -123 -149 -250 136 -297 -283 -27 -41 -215 -128 346 34 335 91 -78 -170 52
4714 52 -97 -85 390 -82 -172 -152 -80 128 258 12 142 -98 -78 36 217 396 147 25 -94 132 300 81
4736 81 74 72 74 -362 90 68 -121 -100 -277 -121 -5 -20 -158 -277 97 260 55 -36 165 -17 -111 -192 -317 -217
4760 -217 263 64 10 98 102 83 50 24 -105 -46 -40 118 -34 -217 32 -11 -180 -229 -233 -112 94 79 293 272 191 167
4786 167 120 104 -200 -115 -280 13 30 103 -360 -84 214 106 371 -44 -326 144 1 109 122 10 -50 -4 53
4809 53 -212 -156 110 74 -311 -155 130 122 9 44 -33 104 231 -116 126 -12 139 -110 76 -66 17 57 -22
4832 -22 140 84 -242 -32 358 -507 48 -14 -8 13 16 267 -52 -245 144 -4 10 261 -141 257 350 97 -311
4855 -311 236 -216 96 126 -176 -161 62 69 79 -444 20 -165 237 -146 12 -28 91 -51 29 82 -13 27 -45 -43
4879 -43 13 208 72 -16 -138 -170 279 43 126 214 -128 -226 433 -122 16 -64 -240 14 -18 208 -90 335 31
4902 31 38 -178 -195 138 -8 -64 65 89 -138 93 97 42 54 2 -331 -1 245 -28 130 -23 -179 145 21 -65
4926 -65 -80 232 55 -48 -186 -71 -301 134 152 78 -12 -71 148 154 -261 -7 7 120 85 -238 98 -82 -101 -49
4950 -49 -87 -71 -132 74 95 314 -4 -1 6 233 -54 212 66 -3 -314 -191 -103 -6 -314 48 39 105 -16 -94 130
4975 130 -26 254 -371 29 322 -261 -20 -84 -56 -344 224 188 282 61 132 -204 -64 1 -54 14 -6 -169 47
4998 47 100 95 -107 60 152 36 -110 -28 -45 268 135 -89 164 -33 13 -12 51 -35 -95 -39 5 134 210 18 -242
5023 -242 -4 -67 139 170 -39 169 246 -257 236 -36 164 -21 8 -53 186 135 -50 -57 53 -224 -98 -63 25
5046 25 109 -73 -5 -311 -60 -20 69 274 41 219 -19 72 194 -212 45 1 97 72 140 -38 -131 -130 -38 -318 -84
5071 -84 1 -165 -273 119 -261 -62 12 95 149 138 4 229 -123 11 -255 -354 -47 5 177 6 -57 16 -218
5094 -218 -2 -107 95 -123 -86 -144 37 73 184 153 -110 -67 -250 -1 -95 100 -105 -119 178 317 246 -115 -52
5117 -52 212 281 -248 -8 -220 -85 -191 -254 -34 -424 -146 -171 -214 -39 -71 -130 173 -83 -23 66 33 -116 -505
5140 -505 -109 4 104 -59 -1 -18 -14 258 44 155 -145 -404 177 -76 256 -35 -63 -89 -14 87 85 143 -330
5163 -330 -4 78 383 -28 169 -264 104 -230 56 -199 -183 104 -6 -143 -178 26 45 346 -206 184 -198
5184 -198 252 -209 -46 -190 47 -4 -24 221 -177 -152 -135 68 -453 64 -309 48 -109 84 205 103 129 -8
5206 -8 170 -20 -14 -16 15 -36 -43 215 66 177 -342 -57 182 177 -71 93 -51 194 -98 -340 -282 164 17 70 -69
5231 -69 -5 -291 6 -171 -161 228 -53 -30 189 -23 182 198 149 337 183 149 94 -72 293 144 -451 -52 -64
5254 -64 -301 5 -224 -195 76 -107 73 -241 -3 105 -352 76 -147 46 154 21 -93 -148 -90 35 41 -54
5276 -54 -23 -98 -13 125 -46 156 177 252 -238 -26 -99 1 -138 -93 173 6 255 281 68 -180 196 52 -138
5299 -138 -15 69 -105 95 16 -325 121 267 93 -54 -75 -224 158 106 47 -129 135 -98 -236 -185 85 116
5321 116 149 -72 122 -165 -25 -23 215 40 97 141 -261 330 -33 326 -62 -40 144 75 361 31 77 213 108
5344 108 -104 -199 82 -78 -107 89 134 -112 7 237 152 35 -41 -3 274 -24 -181 67 83 81 42 -123 -169 -58
5368 -58 -82 121 -123 -46 -36 -93 87 97 -7 -182 -108 88 153 -47 -6 -12 56 -13 -8 -180 152 277 -134 -229 186
5393 186 29 82 -178 -153 318 191 -20 -40 12 80 -34 -232 93 -175 -127 100 -131 -71 81 26 23 -115 81
5416 81 94 51 127 -8 119 -192 3 150 174 -18 -9 -11 24 214 -72 231 -186 -73 89 -1 -35 312 146 25
5440 25 -60 136 121 170 -190 -87 -140 38 52 -188 297 60 36 -128 139 -66 37 162 207 11 -186 157 -151
5463 -151 211 152 408 265 -69 271 -34 -38 64 135 127 186 -95 -73 -27 -390 -80 -84 -158 -139 113 -234 72 84 35
5488 35 -7 -348 196 31 172 4 -86 -44 -245 -94 68 -20 -334 219 182 -30 105 71 -4 227 -4 237 62
5511 62 199 10 -169 -189 120 10 54 278 -190 97 -50 217 13 19 -28 122 -12 245 -128 135 -86 243
5533 243 85 -189 -55 135 218 29 -311 -110 248 45 -103 -170 4 319 -77 -145 -146 -189 -65 -231 -8 -47
5555 -47 -168 -55 63 202 -104 -391 -256 201 48 -138 -131 6 146 37 189 48 -148 36 -18 82 31 47
5577 47 -119 -55 -20 -122 -57 186 66 -30 -119 235 135 80 -124 -168 291 98 173 13 -90 333 85 52 -34 133
5601 133 -113 -177 -45 -135 115 102 -29 -223 -30 -248 -127 12 -123 -178 74 30 37 22 -13 -34 177 268 216 281
5625 281 -129 62 25 353 -195 -144 -94 34 162 22 -206 154 114 -23 -20 -131 -94 168 -28 256 140 215 -30
5648 -30 -76 36 163 -3 -99 -111 -71 -273 6 69 6 159 -157 -122 103 124 -177 -384 110 34 -11 247 -236 315
5672 315 -42 -1 75 -76 255 -161 113 -32 -126 -268 42 90 159 -407 251 93 41 174 4 -31 -170 -132 -201
5695 -201 50 -203 158 257 219 -148 -175 -75 255 14 89 75 -55 140 2 -47 230 -93 -12 128 150 -216 -138
5718 -138 109 -135 124 276 20 95 -130 99 -133 -76 -103 -46 78 -29 253 167 188 247 39 103 15 133 -174
5741 -174 -341 -98 -8 318 -227 156 119 -210 56 92 -176 -49 -102 33 36 122 173 -134 -314 -1 -111 53 -178
5764 -178 309 -376 77 195 -135 153 -93 77 -3 156 153 299 170 94 135 -77 93 -29 -390 -161 -15 -146
5786 -146 -107 270 99 -400 21 -83 182 64 65 90 42 -321 13 263 -77 41 -41 -126 68 -92 -51 -211 -446
5809 -446 -31 40 197 -220 -254 -88 1 74 181 -20 26 129 342 -269 -175 -41 -154 56 58 201 -351 174 -23
5832 -23 7 294 226 68 -43 11 -251 -152 7 296 -85 20 -121 -183 -35 108 -175 108 -42 -108 76 162 -11
5855 -11 95 141 -322 -37 -213 319 93 -176 -143 -50 164 35 -22 -170 3 184 -40 169 -47 74 -218 -163
5877 -163 -114 385 -49 9 163 -132 132 -25 -85 -262 67 132 66 -141 -208 -97 -1 302 -38 -125 40 13 222
5900 222 109 221 -64 -45 -30 72 -289 75 -222 41 159 -19 -48 130 68 129 14 120 353 -84 -127 -182
5922 -182 -39 212 -89 300 -181 89 -249 -100 -1 -324 -54 -128 -200 -151 42 -250 275 289 15 -137 58 -123
5944 -123 -358 -41 28 -76 3 -151 -91 -93 -80 224 39 -85 97 -113 37 335 -75 124 -19 -366 -77 -145
5966 -145 -129 23 149 -116 69 166 97 66 -122 196 16 65 37 -34 -265 121 -74 -308 -48 276 45 80 118
5989 118 39 131 -107 173 56 -102 -105 -128 369 129 -40 -206 -142 60 45 62 -80 203 -139 258 -148 -164 -128
6012 -128 -12 -270 -10 3 -62 267 -52 -210 103 8 -20 117 27 -65 14 -38 -33 -105 -140 168 29 -145 177 63
6036 63 -13 -296 47 -34 -97 212 -141 24 -50 -131 -152 -87 5 -54 123 137 -180 -43 22 -110 -132 -112 -17 -222 219
6061 219 12 -185 275 -158 58 -101 -156 -178 51 144 365 27 -422 133 100 287 -41 437 -260 137 30
6082 30 62 33 -208 52 102 102 244 -237 -61 -105 -302 -17 75 135 -55 -52 8 -83 -212 97 -169 -90 -246 -72 -95
6107 -95 59 88 64 25 -68 -114 -127 291 -16 -75 -325 14 -71 -29 14 235 -387 -17 52 50 248 -179 238 67 50
6132 50 -332 0 134 -2 -103 -75 126 83 180 59 213 -173 -174 128 100 200 -159 -248 153 432 -179 183 125
6155 125 146 122 47 -15 -46 -163 110 -125 -26 24 -10 39 17 66 -120 17 341 -372 -79 166 55 228 57 133
6179 133 -171 -147 100 -23 -17 -85 75 11 -18 51 -61 279 130 199 25 -19 44 -75 -19 50 157 -35 -33 101 122
6204 122 -289 64 59 -162 -316 -2 243 174 48 -46 -37 183 148 -127 -142 -63 267 -139 -9 -235 -225 213 49
6227 49 -21 57 257 -13 249 3 -66 153 133 -107 -9 -113 -311 -4 64 111 157 -107 -187 144 65 -194 189 -138
6251 -138 -13 -204 15 -229 -153 -132 178 146 -73 -30 -161 122 127 24 -105 -41 137 -10 -201 -132 -373 -73 -266
6274 -266 30 249 4 232 -207 -58 318 120 44 -96 276 165 153 -60 -62 313 130 107 -188 -520 -45 -137
6296 -137 129 61 293 376 43 72 38 408 52 -29 -278 25 -212 33 85 -267 24 134 22 153 235 166 225
6319 225 102 283 -300 168 78 104 78 -50 -15 -155 -17 22 125 109 -242 -273 -103 -241 173 -149 -418 182
6341 182 96 207 61 173 118 125 -209 17 57 69 -5 25 -70 134 81 -202 125 -164 347 -154 -192 -272 -137 -143 -104
6366 -104 101 -222 -100 155 189 -209 248 -184 143 47 171 -209 95 -230 49 196 155 -4 -256 130 182
6387 182 -122 -13 -17 -156 -126 124 -195 -129 -51 -97 -56 53 194 -16 -1 59 -160 83 45 382 124 -113 166
6410 166 30 281 302 -59 131 -3 -66 -15 -245 123 -68 268 165 78 118 -98 -98 -48 66 -205 -183 -300 223
6433 223 66 -28 46 15 51 112 -200 -73 -17 123 195 -132 -219 161 -29 90 -107 -205 -96 -135 8 -256 -66
6456 -66 208 -34 31 43 -207 -91 304 -138 -244 66 155 137 -36 15 133 5 -82 -332 -70 -233 -158 -38 -110
6479 -110 -111 -56 75 145 172 110 -107 174 65 -19 -228 290 -187 -78 87 49 -202 -320 76 -145 145 -89 266
6502 266 -117 -134 -242 -160 69 -216 -68 -46 -4 71 -36 -165 66 -113 22 23 18 -18 -113 -306 -39 309 -92 -18
6526 -18 -94 -177 121 -15 198 481 15 220 119 170 138 18 226 -160 23 -86 -342 -1 273 266 -39 -58 146
6549 146 -183 43 8 -11 166 47 -255 162 -146 119 31 -30 -68 30 -251 33 96 238 -38 -31 48 11 24 -154
6573 -154 114 172 87 -150 -78 -13 359 256 143 -34 -2 217 -84 39 -20 -125 -92 -98 -208 149 -173 99 380
6596 380 -160 -2 -31 298 -69 128 79 67 -32 372 103 162 -26 -244 -93 115 -229 36 -184 -44 151 -116
6618 -116 -113 -88 -243 -322 156 50 125 95 123 63 25 -49 289 -290 -111 214 -54 245 -146 -28 -68 19 -77 -5 -9
6643 -9 -338 -72 -253 -356 -32 60 296 -142 2 76 258 -82 202 167 -130 99 -51 -97 153 27 -52 311
6665 311 -23 403 -94 197 -9 149 -291 150 -38 -60 -266 -93 -371 9 159 203 161 574 24 82 140 -90
6687 -90 93 175 227 77 46 -191 146 -266 156 -53 -29 -129 93 -12 -193 152 292 -119 -34 -104 -25 19 -47
6710 -47 -70 34 18 162 -198 46 423 77 107 -314 51 140 -71 133 -186 226 -302 -60 -188 173 417 132
6732 132 -304 -73 144 181 47 -66 14 -29 55 -122 155 160 -411 119 143 177 83 -202 -55 -151 81 -102 17
6755 17 -4 -37 104 246 179 -288 103 -62 -143 262 146 -82 234 -184 294 -172 -196 66 -26 123 -124 80
6777 80 -191 88 -84 -138 86 411 260 -31 360 55 137 -184 -192 -50 -159 -170 24 16 39 82 23 32 58 26 211
6802 211 -82 46 88 316 -93 -104 214 113 170 205 122 -99 82 -211 -317 53 57 98 44 31 58 -96 -21 -213
6826 -213 80 -192 -51 84 -237 -146 -229 -110 -20 -54 77 53 255 -232 -85 61 144 -221 37 -143 306 28
6848 28 6 272 46 39 226 169 -157 167 1 34 204 -189 92 -143 -115 -282 183 -10 98 20 -254 192 84
6871 84 -176 347 -148 143 -141 74 55 -254 -102 -105 336 -25 262 -108 -377 -72 -154 -193 114 -19 87 -92
6893 -92 101 -12 198 148 -145 -235 -36 -45 -16 -81 -85 -44 -95 41 -64 -16 -239 -70 104 -59 221 -104 -52 -61 161
6918 161 118 -48 -183 298 38 40 -126 -120 28 76 -73 -110 -9 -323 271 -38 -49 -318 126 -136 145 40 175
6941 175 -47 -45 21 -146 216 97 -56 -171 -49 -162 -2 58 -124 102 -163 -91 -55 -156 150 93 355 178
6963 178 8 136 75 -80 123 87 108 -193 68 -294 -130 63 -159 -404 -81 -62 121 -188 -5 25 -131 40
6985 40 245 148 55 77 174 -223 -121 -55 -132 46 148 -147 36 124 141 19 -331 135 105 -106 -127 258 20 -215
7009 -215 -296 281 -156 -136 -151 124 -202 -90 176 57 -141 181 367 87 50 102 -36 -27 166 229 -30 -19 76
7032 76 -19 -196 -20 -303 281 -174 137 132 -20 33 228 5 64 85 89 -101 -109 118 345 -77 5 -82 -86 -23 -344
7057 -344 -400 53 317 -34 -58 24 -192 -169 14 30 -306 229 -58 106 -212 112 172 193 70 103 -33 -328 17
7080 17 96 -154 -73 221 -273 23 201 83 87 199 31 -135 -44 252 -173 181 -10 17 27 -138 71 -146 -59
7103 -59 -128 -133 -15 28 92 -32 -359 53 -170 -25 201 -4 -26 -38 202 54 60 155 51 95 -118 68 87 -250
7127 -250 -41 -552 -79 -7 214 -116 9 -11 -60 65 -9 11 -127 -79 -208 168 -222 -136 201 -51 -12 -251 -118
7150 -118 -111 234 2 131 -82 -182 -17 11 -3 -152 -82 -53 -323 190 -1 221 -30 20 116 22 6 232 277 28
7174 28 -189 -140 -248 -273 -73 -76 -66 -112 -294 29 -154 -142 430 93 155 -172 -10 -74 -18 -242 -235 -180 -81 -419 216
7199 216 48 -16 120 107 -28 124 -45 -48 176 -214 -191 50 441 -179 -140 143 -13 25 -292 5 102 82 130
7222 130 108 171 150 -66 64 -283 -55 -33 -21 75 -65 -104 253 106 343 246 -177 -191 59 -87 -76 90 -289
7245 -289 161 -86 25 -35 73 -262 22 74 11 72 -135 238 145 194 -87 -289 96 -183 78 -248 -160 2
7267 2 -70 -86 -145 298 14 -78 -127 -58 18 -236 -96 70 48 27 81 -89 -227 -49 216 -189 141 8 119 -40
7291 -40 33 -178 208 -158 73 -6 119 -80 175 41 -49 -136 337 -167 -149 195 238 272 -146 21 4 149 -163
7314 -163 -32 -297 78 18 331 60 -75 -26 255 207 -84 -142 47 -159 -25 -89 -209 39 170 -40 -100 -121
7336 -121 -16 -79 143 -172 210 107 9 281 156 -149 -170 -153 305 45 82 147 23 -139 -50 -83 44 243 272
7359 272 -126 110 -87 -449 197 -90 166 41 17 -30 187 194 -9 34 255 17 -14 67 31 82 -29 -129 -121 -34
7383 -34 139 215 -95 -52 -10 -227 64 148 -89 120 -58 47 175 -297 34 -46 43 265 113 169 139 -374 -117
7406 -117 81 255 -42 148 -104 136 -96 223 89 -281 -54 154 122 362 -96 278 -106 -125 223 52 6
7427 6 48 143 71 184 -163 136 -40 161 -19 80 106 159 85 320 195 -223 -264 -143 46 50 76 -131 249 -168
7451 -168 141 -209 -97 -42 220 -86 -319 -163 108 213 -187 -254 236 -15 151 383 112 251 50 -127 -209
7472 -209 224 -207 200 -353 -119 169 9 -149 -43 -236 -70 43 -29 -84 62 -254 109 -140 163 -16 24
7493 24 -153 -103 -77 -161 -199 122 -16 98 227 -86 132 160 85 -59 -14 221 -3 -184 -105 163 -223 -26 195
7516 195 65 -6 228 207 -72 -138 131 -62 -83 38 -147 -263 75 2 -186 385 15 196 32 4 81 94 -89
7539 -89 -115 -23 -132 -54 155 -98 295 -161 37 63 -139 196 0 -131 153 50 -191 -120 -110 281 -60 -162
7561 -162 -21 114 238 218 -26 25 -42 -161 -55 -28 99 -333 78 366 -180 -1 -331 -38 124 -135 -286
7582 -286 -85 363 161 -199 301 -160 -273 203 -203 119 -7 -52 8 -58 216 175 -116 113 141 -56 11 -310
7604 -310 -13 233 109 39 63 -142 77 -11 -330 192 139 -85 46 -108 118 -136 -138 81 -194 120 66 156 22
7627 22 252 -6 107 151 -97 -189 120 305 -92 6 5 144 72 86 -73 -198 -206 -56 -69 -39 154 -171 67 -52
7651 -52 9 43 178 -237 39 86 -158 -165 169 -3 184 37 -136 168 -87 -6 242 262 206 -10 108 83 173 132
7675 132 -47 43 159 -179 -131 -10 -96 -81 -64 90 103 -59 34 189 -24 16 -172 54 35 -32 -9 -34 100 210
7699 210 -269 76 -129 -166 -145 109 -25 -50 -71 6 -161 -106 -70 245 51 -50 -319 -7 -207 33 -294 59
7721 59 375 -30 85 -22 196 192 278 -102 -17 -233 -101 223 -140 -39 -141 -15 90 -194 66 -114 251 -136
7743 -136 114 121 186 -58 193 -318 -81 -88 -94 107 320 100 -278 12 -73 310 -144 114 309 -74 138 250 -194
7766 -194 74 -63 29 125 -106 373 -59 -65 23 -255 161 280 5 380 89 18 66 104 40 -217 54 74 192
7789 192 -34 28 -33 125 133 244 -308 -80 -150 60 221 29 -96 -86 -1 -234 307 90 142 -118 106 -98 -186
7812 -186 -44 65 -321 -4 -21 -124 -77 -254 160 -99 160 129 -93 -178 -80 -43 45 60 162 -218 -28 -6 -231
7835 -231 261 82 -113 -35 -7 123 -206 221 240 85 -116 70 -267 -135 -31 170 87 -315 -136 -200 20 -119
7857 -119 -82 -37 -66 -188 25 17 154 110 92 23 159 -18 109 -62 115 -55 -116 -67 -51 121 94 -178 79 155
7881 155 85 65 -168 -150 43 -70 204 112 -75 -46 145 53 178 3 -119 -38 266 299 -184 134 235 -126 -301
7904 -301 58 -63 298 -129 43 -61 -128 -148 -45 -83 -391 20 -216 73 205 -80 47 -108 57 -27 28 -23
7926 -23 -17 -78 20 15 118 -24 -16 -137 79 -57 2 -43 -31 250 -93 190 63 -184 -131 111 -4 -4 44 257 291 -12
7952 -12 -330 -229 -125 -71 38 -231 205 16 -173 214 44 -189 157 121 -237 86 102 134 -12 -321 50 -133
7974 -133 -31 26 12 -168 -118 40 -14 -50 154 -126 -136 -65 73 -94 26 182 242 254 220 -9 292 182 17
7997 17 18 -314 -3 22 -90 -101 125 -120 -102 83 -70 -134 36 17 101 123 -55 -25 174 37 107 -71 -237 -28
8021 -28 -54 270 -14 -75 -303 -65 46 425 128 122 250 53 13 2 -17 -101 164 -311 -237 -261 -108 -170 -76 120
8045 120 38 76 48 203 89 -139 94 -136 2 -367 -64 -102 -152 137 -16 -62 -95 88 -102 71 -108 -40 -266
8068 -266 190 27 -306 -11 -198 -18 64 -41 -135 44 -89 -8 106 -360 75 -261 -179 -46 -147 248 -234
8089 -234 27 189 171 159 350 -22 -57 -207 -105 49 -381 198 23 3 -51 30 -85 36 -230 -71 62 288
8111 288 -30 -118 -321 -20 -137 -365 7 46 -55 -17 363 188 -158 205 -294 -163 -171 -67 -32 -36 -88 -54 130
8134 130 -51 -99 -112 -87 -108 105 -150 276 -9 236 -97 126 -33 81 75 -194 -52 -233 -182 93 -85 -164 55
8157 55 31 -79 79 -123 -69 205 -253 -307 84 126 336 58 200 185 -291 -172 -94 51 -231 77 147 21 205
8180 205 -252 -62 87 33 191 24 -38 25 -259 2 -271
8191b71
$$ Imaginary data points
##PAGE= N=2
##DATA TABLE= (X++(I..I)), XYDATA
0 0 0 0 0 -8 8 -8 9 -9 16 -24 24 -40 40 -56 65 -80 96 -112 136 -160 185 -217 249 -289 331 -379 435 -489
28 -489 556 -625 706 -795 890 -997 1109 -1238 1379 -1529 1700 -1879 2083 -2308 2552 -2829
44 -2829 3132 -3477 3866 -4303 4815 -5402 6100 -6940 7968 -9278 10987 -13346 16813
57 16813 -22446 33191 -61258 295274 695228 319908 19250 -281352 -407185 -501213 -419947
68 -419947 -199269 156940 421434 523463 421418 230376 -27102 -278121 -478862 -504161
78 -504161 -335185 -22962 271192 451954 471677 358956 122670 -170312 -417851 -491435
88 -491435 -371193 -132298 107966 297162 406839 407290 261127 4238 -260025 -417588 -423764
99 -423764 -294029 -73743 177953 378286 445832 344101 116154 -142912 -338260 -411692
109 -411692 -347220 -168770 65170 267197 367604 344568 222145 38779 -168807 -342636
119 -342636 -403666 -304596 -82125 158632 320534 368308 305945 147315 -71787 -275031 -375138
130 -375138 -329475 -170338 31047 209349 319619 331232 232467 49996 -149215 -291341
140 -291341 -333640 -270102 -119934 80519 269132 363657 313093 139245 -70890 -231338 -304772
151 -304772 -288938 -187929 -16999 170797 295669 306443 210382 57546 -104500 -238385
161 -238385 -304823 -267085 -126301 64946 227675 303114 273856 156028 -16312 -187044 -290391
172 -290391 -282475 -172090 -13742 132430 230795 265218 219468 91544 -80364 -223568 -276458
183 -276458 -230015 -115737 28584 169282 264357 267491 164379 -2405 -159067 -246296 -246872
194 -246872 -170962 -43227 99834 210932 247260 195430 82909 -49914 -166065 -235516 -228857
205 -228857 -136863 13063 158037 235436 225430 145305 25596 -105150 -208305 -239353 -177435
216 -177435 -49215 86072 177758 209020 180027 96755 -24364 -144555 -214001 -204934 -124912
227 -124912 -7069 111473 195659 215031 154808 34212 -95550 -182499 -201766 -157871 -68682
238 -68682 43981 147015 200172 177664 89765 -21814 -117536 -174482 -182147 -132593 -30619
249 -30619 89636 176446 193002 139581 42934 -63412 -149344 -187278 -158637 -72065 36926
260 36926 125269 166794 156253 98178 6423 -93737 -163704 -172180 -117479 -26928 66592 137952
272 137952 168450 142933 61678 -46414 -134369 -166761 -139374 -70699 15880 98134 150792 152288
284 152288 98015 9995 -76653 -134555 -148747 -116726 -43383 49432 126682 155708 126911 57352
296 57352 -26851 -100587 -144107 -139192 -81537 7299 89862 133776 130741 89658 23616 -52873
308 -52873 -117025 -141524 -112422 -42439 38448 101983 131747 120377 67230 -13166 -90431 -132477
320 -132477 -123754 -74681 -5317 63494 113506 127041 93802 25473 -49555 -102744 -119613 -100248
332 -100248 -50897 18099 85666 123974 114103 61917 -8598 -71868 -110430 -114161 -79538 -15869
344 -15869 54795 103741 113259 84210 30670 -31775 -85527 -112482 -99052 -49225 16360 72967
356 72967 103259 100885 66222 6726 -58741 -102753 -107095 -72291 -16134 41104 84444 102521
368 102521 85955 37032 -25880 -77267 -98175 -86788 -49135 3752 58265 95258 97335 62899
380 62899 7127 -47234 -84220 -93820 -73896 -26664 31925 79356 94956 76459 34204 -15599
392 -15599 -60381 -87268 -85709 -52642 854 52618 82955 84022 60060 16823 -33899 -75328
404 -75328 -89487 -70324 -25705 24847 64228 82388 74948 41119 -8963 -55556 -80574 -76283
416 -76283 -47697 -5679 37948 71292 81105 61476 18097 -29589 -64788 -77271 -65423 -32157
428 -32157 13875 56938 78391 70566 37915 -4073 -43152 -68910 -72877 -50692 -9546 34975
440 34975 64620 70727 54618 22562 -18185 -54816 -73734 -64653 -30896 11774 47627 66584
452 66584 64614 42168 3219 -38344 -65057 -66371 -45196 -11582 24517 53420 66351 56155
464 56155 24271 -16764 -49438 -63209 -57206 -33359 2506 39399 63467 63757 39342 2593 -31412
477 -31412 -54512 -60406 -47026 -16628 20702 50360 60607 49756 23541 -8855 -39516 -58474
489 -58474 -57261 -34314 1035 34492 54322 55812 40036 10240 -24649 -51337 -58381 -43561 -14964
502 -14964 15925 40482 53213 49192 27978 -5251 -36134 -53327 -51081 -32532 -4198 26184
514 26184 49210 55263 40435 10529 -20970 -43523 -51485 -42668 -20006 10936 38269 51413 45288
527 45288 25151 -1608 -27189 -45824 -49693 -35773 -7145 24061 44876 49178 37502 14225
539 14225 -13802 -38836 -49990 -42167 -19400 8812 31920 44365 43093 28268 2587 -25056
551 -25056 -43131 -45271 -32292 -9521 16213 38386 47664 39407 15894 -12876 -35012 -43391 -38670
564 -38670 -22066 2538 27131 42866 42349 26749 2765 -19977 -36173 -42000 -34089 -13118 13408
577 13408 35109 43553 36188 17432 -6579 -29240 -42198 -39756 -22206 2021 23760 36623 38024
590 38024 28011 8328 -15602 -34924 -40496 -31542 -12893 9885 28428 39087 36957 20390 -4019
603 -4019 -26900 -38562 -36032 -22757 -2400 19144 34403 37491 27470 8098 -12723 -28706 -36038
616 -36038 -32081 -16646 5985 27090 37365 33762 19170 -559 -20414 -34210 -36445 -24659 -4118
629 -4118 17393 30891 33686 26169 10593 -8144 -25544 -34693 -31121 -16332 3684 21351 32594
642 32594 33389 22111 2096 -18708 -32143 -32684 -23074 -6548 11573 26456 33212 27247 11566
655 11566 -7516 -22420 -30263 -28466 -18156 -1177 17463 30955 32311 21732 3506 -14425 -27481
668 -27481 -31654 -24493 -8924 9934 24546 29724 25294 13147 -2830 -18547 -28865 -28598 -17993
681 -17993 -1491 14915 25951 29066 22519 7604 -11095 -25833 -29805 -23359 -9282 6560 20056
694 20056 27065 25448 14403 -1696 -16154 -25540 -25914 -18354 -4885 11233 24667 28441 21697 7603
708 7603 -8262 -21150 -27161 -23989 -11970 4827 19004 25708 23286 13832 762 -12338 -22812
721 -22812 -25423 -19266 -5536 9400 20387 25076 21454 10018 -5296 -19221 -25841 -22718 -11625
734 -11625 1901 14736 22649 23407 15512 2135 -11461 -20732 -22660 -17817 -7497 5203 17774
747 17774 24340 21648 10511 -4005 -16244 -22305 -21868 -13521 -681 12795 21202 21729 14815 3862
761 3862 -8020 -17500 -21737 -18330 -8331 4671 15647 20679 19436 11930 -249 -12867 -21426 -21766
775 -21766 -13510 -1065 9968 17859 20030 15434 6189 -6139 -15993 -20021 -17255 -8975 1879 12322
789 12322 19191 19844 12211 841 -10774 -18442 -19605 -14448 -3886 7870 16548 19274 14686 5986
803 5986 -4126 -12824 -17780 -17136 -10180 412 11178 17623 17564 12232 2756 -7849 -16355 -18906 -14152
818 -14152 -4727 6220 14176 17248 14940 7563 -2283 -11546 -16593 -15849 -9458 -823 8011 14936 17180
833 17180 13087 3446 -6913 -14471 -16501 -13509 -6284 3412 12213 16590 14690 7695 -1594 -9359 -14349
848 -14349 -14765 -10396 -2280 6929 13722 15546 12155 4641 -4510 -12245 -15935 -13819 -6571 2949 10618
863 10618 14141 13309 8477 258 -7849 -13537 -14217 -9886 -2500 5178 11414 14475 12486 5822 -3041
878 -3041 -10882 -14486 -12616 -6850 1059 8338 13407 13205 8306 725 -6249 -11345 -12849 -10360 -4057
893 -4057 3822 10409 13011 11317 5603 -1597 -8575 -12756 -12340 -7768 180 7622 11895 11978 8408 2187
909 2187 -4564 -10213 -11884 -9836 -3887 2841 8422 11541 11225 6586 -306 -7339 -11894 -11466 -7418 -959
925 -959 5240 10350 11744 8669 2885 -3869 -8750 -10972 -8906 -4772 1227 7417 10854 10610 6261 232
941 232 -5947 -9715 -10626 -7596 -2004 4577 9389 10562 8091 3239 -2555 -7431 -9922 -9429 -4852 954
957 954 6024 9621 9459 6645 1401 -4827 -9176 -10313 -7417 -2574 3064 7799 9868 8242 4032 -1587
973 -1587 -6648 -9016 -8120 -5362 -580 5023 8514 8782 6110 1674 -3537 -7450 -8891 -7287 -3012 2243
989 2243 7201 8795 7311 3776 -859 -5153 -8125 -8013 -5104 -389 4545 7231 8166 6126 2103 -2836
1005 -2836 -7246 -8380 -6738 -3126 2000 5433 7627 7486 4217 -608 -5008 -7149 -6879 -4781 -1060
1020 -1060 3174 6383 7869 5984 1993 -2280 -5402 -7350 -6945 -3209 967 5022 7212 6442 3823
1035 3823 56 -3472 -6476 -7027 -4963 -1348 2894 5588 6814 6085 2455 -1475 -5162 -6853 -6123 -3208
1051 -3208 831 4225 6155 6245 4327 540 -3256 -5804 -6576 -4590 -1603 1787 4975 6336 5589 2635
1067 2635 -1155 -4338 -5954 -5595 -3660 -158 3851 6048 6017 3774 676 -2811 -4939 -5865 -4447 -1719
1083 -1719 2047 4576 5738 4972 2785 -452 -3710 -5340 -5416 -3069 218 2970 5090 5581 3823 653
1099 653 -2379 -4828 -5645 -4211 -1705 993 3886 5443 4508 2653 -378 -3774 -5092 -4748 -3062 -270
1115 -270 2493 4699 5262 3885 1261 -2016 -4284 -4945 -4190 -1901 1040 3655 5073 4585 2037 -329
1131 -329 -2635 -4511 -4603 -3439 -717 2514 4682 4636 3778 1083 -1427 -3919 -4804 -3739 -1652 804 3146
1148 3146 4747 4341 2557 -286 -2819 -4080 -4127 -2838 -654 2062 3897 4899 3666 1244 -1276 -3551
1164 -3551 -4573 -3841 -1725 423 3107 4209 3931 2333 -43 -1936 -3862 -4282 -3184 -856 1699 3501
1180 3501 4199 3088 1433 -1474 -3397 -4201 -3925 -1835 413 2731 4060 3737 2434 65 -2081 -3973
1196 -3973 -4081 -2716 -670 1689 3269 4265 3488 1609 -973 -3011 -3863 -3509 -1600 -60 2302 4033
1212 4033 3636 2698 267 -1916 -3390 -3630 -3033 -1093 1082 3270 3706 3427 1546 -575 -2883 -3932
1228 -3932 -3767 -2030 -91 2168 3649 3366 2529 554 -1487 -3255 -3778 -2466 -977 1072 2758 3916
1244 3916 3317 1710 -450 -2404 -3687 -3609 -2324 -23 2061 3608 3706 2422 655 -1470 -3039 -3696
1260 -3696 -3077 -1567 610 2616 3572 3368 1997 136 -1970 -3407 -3776 -2541 -497 1799 3216 3563
1276 3563 2755 1093 -911 -2674 -3585 -3302 -1678 375 1946 3050 3226 2374 7 -1663 -3480 -3412 -2287
1293 -2287 -688 1508 2903 3414 2863 1308 -940 -2124 -3325 -3080 -1788 -7 1987 2911 3467 2271
1309 2271 396 -1458 -2928 -3452 -2369 -827 915 2628 3184 2952 1571 -422 -1900 -3019 -2906 -1918
1325 -1918 -116 1578 2734 3102 2496 845 -1299 -2628 -3173 -2549 -1155 782 1857 3116 2657 1616
1341 1616 154 -1832 -2838 -2871 -1840 -555 1145 2263 3181 2492 1106 -569 -2246 -3139 -2791 -1789
1357 -1789 217 1726 2991 2853 1812 31 -1474 -2285 -2899 -2167 -637 1090 2040 2564 2288 1426 -222
1374 -222 -1747 -2871 -2726 -1406 151 1629 2527 2958 2146 545 -1301 -2289 -2594 -2395 -789 410 1883
1391 1883 2855 2280 1465 -162 -1806 -2611 -2439 -2211 -852 1081 2726 2558 1857 631 -947 -1888 -2720
1408 -2720 -2199 -1154 229 1251 2392 2230 1592 159 -1072 -2030 -2508 -1856 -748 1205 1773 2432 1977
1425 1977 1065 -110 -1723 -2479 -2060 -974 -15 1375 2280 2268 1916 432 -1007 -1896 -2370 -1911 -913 626
1443 626 1782 2546 2295 1091 -369 -1289 -1816 -1844 -1575 -189 1094 2041 2109 1694 682 -479 -1685 -2458
1461 -2458 -1919 -1247 226 1577 2024 2085 1094 15 -1171 -1896 -2090 -1271 -384 653 1572 2112 1812 889
1479 889 -526 -1515 -2288 -1926 -1213 -217 1239 2015 2030 1398 551 -670 -1550 -1896 -1542 -857 413 1344 2151
1498 2151 1620 999 -276 -1196 -1759 -1989 -1151 46 998 1867 1833 1457 500 -486 -1757 -1918 -1625 -859 331
1517 331 1251 2105 1917 1205 318 -1044 -1734 -1934 -1348 -341 708 1527 1614 1441 809 -508 -1351 -1561 -1431
1536 -1431 -1072 125 679 1359 1540 1148 382 -929 -1637 -1764 -1599 -794 556 1420 1525 1338 1027 -194
1554 -194 -778 -1508 -1373 -940 159 686 1273 1423 1470 707 -288 -1559 -1627 -1445 -488 -124 857 1811 1429 766
1574 766 311 -963 -1326 -1508 -992 -5 570 1469 1250 1470 563 -89 -979 -1432 -1644 -965 431 1122 1417
1593 1417 1261 768 237 -918 -1449 -1530 -1189 -452 427 947 1326 1331 710 168 -930 -1693 -1324 -1016 60 741
1613 741 1293 1416 1199 496 -283 -950 -1392 -1252 -771 253 597 1239 1474 670 81 -997 -1361 -1158 -1229 -235
1633 -235 575 1040 1139 1027 748 -140 -853 -905 -860 -562 0 798 1501 1445 813 459 -430 -976 -1448 -836 -373
1654 -373 159 970 1107 974 582 9 -520 -1120 -1010 -579 -79 663 915 1261 734 258 -674 -898 -1032 -875
1674 -875 -750 -21 1130 1211 699 442 183 -641 -847 -1136 -502 -467 484 785 1072 854 468 -81 -569 -1050
1694 -1050 -983 -439 -6 856 1010 929 768 329 -450 -700 -1015 -714 154 423 764 1105 754 354 -226 -550
1714 -550 -660 -1152 -615 -264 434 965 849 766 20 -390 -872 -1063 -617 -384 99 492 923 795 351 134
1734 134 -301 -644 -640 -520 -195 483 530 696 548 155 -385 -667 -719 -534 -290 -150 432 774 705 381 -16 -254
1756 -254 -642 -855 -440 3 357 262 823 616 633 35 -341 -850 -681 -573 138 433 510 735 617 187 -334
1777 -334 -433 -704 -433 -515 465 482 566 798 685 113 -185 -637 -698 -570 46 409 503 698 262 170 -49 -529
1799 -529 -785 -662 -47 -125 335 574 361 315 -44 -321 -501 -570 -337 -41 475 401 784 171 61 -176 -709
1820 -709 -411 -600 -348 -70 462 332 344 320 153 -37 -455 -594 -377 -311 307 526 611 278 141 38 -397
1841 -397 -276 -540 -63 56 300 349 452 345 210 -217 -518 -572 -651 -162 -11 269 463 342 352 -36 -268
1862 -268 -637 -306 -364 -37 93 388 384 270 -75 -33 -500 -619 -510 -103 234 98 326 382 309 258 -416 -476 -535
1885 -535 -30 12 122 82 583 254 46 -391 -421 -281 -415 -204 -85 356 187 340 333 -247 -387 -232 -570 -211
1907 -211 111 189 401 374 331 112 -187 -157 -584 -428 -36 -95 -45 395 289 -78 -147 41 -177 -237 -242 -28 391
1930 391 347 677 -24 215 -404 -251 -492 -243 -147 -108 262 528 309 107 -7 -161 -73 -571 -136 -107 206 418
1952 418 556 412 -84 -192 -239 -358 -469 153 291 176 64 426 -77 2 84 -428 -203 -22 -142 201 187
1973 187 224 531 135 126 -380 -560 -730 -160 119 390 612 174 191 216 -30 -331 -195 -421 -181 -42 193 574
1995 574 288 288 114 10 -108 -300 -257 -178 293 107 269 370 227 219 -234 233 -99 -163 55 336 213 206 -142
2018 -142 -73 -431 -375 -59 -164 101 213 339 235 259 -218 2 -468 -123 -320 -217 -73 224 481 302 184
2039 184 -166 50 -186 -175 85 -237 413 298 311 -106 -89 -155 -124 -241 -415 -211 209 420 185 157 361 -93
2061 -93 -195 -238 -234 -248 -294 415 325 616 354 62 -191 -233 -525 -400 -471 -103 348 246 422 428 -87 -237 -139 -271
2085 -271 -524 52 156 144 581 468 -18 -211 -266 -432 -225 -345 142 83 157 320 454 118 -34 -433 0
2106 0 -334 72 -26 311 295 362 -83 -71 -248 -605 -463 -218 -22 110 49 422 462 196 -433 33 -402 -290 -109
2129 -109 16 9 298 404 422 -5 11 -148 -260 -340 -310 131 254 309 340 164 -186 -124 -558 15 -140 134 80
2152 80 362 363 445 -7 -132 -413 -597 -250 -79 49 49 317 112 240 38 -401 -445 -202 -338 151 -166 90
2174 90 187 341 17 -3 -245 -423 -378 -166 133 570 311 96 252 125 -317 -446 -361 -727 -243 245 444 526
2196 526 712 634 94 -436 -473 -453 -455 64 103 614 434 286 374 -289 -400 -667 -442 -190 318 -26 713 732 103
2219 103 296 -225 -197 -491 -130 54 271 341 384 453 501 -270 -220 -330 -74 -95 -25 269 164 530 457 -12 -112
2242 -112 -282 -542 -356 -157 12 165 413 206 69 33 -310 -268 -227 -584 -73 393 466 201 175 195 -180 -566
2264 -566 -322 -166 -461 -6 -40 281 367 580 -139 -309 -237 -239 -534 -242 143 202 652 321 389 -235 -280 -486 -361
2287 -361 -61 43 95 506 90 724 123 22 -326 -362 -208 -247 -79 424 731 379 -80 -81 -397 -355 -679 -310
2309 -310 -150 -49 255 732 213 235 -191 -385 -120 -266 -63 79 405 149 221 502 -53 -151 -473 -397 -420 -181
2331 -181 135 145 18 331 4 -82 -417 -492 -389 -315 -87 69 208 316 406 318 -255 -200 -500 -628 -72 -4 331
2354 331 326 362 307 -6 -131 -90 -324 -281 -42 64 442 377 385 257 164 -261 -332 -111 -333 -2 206 251 637 269
2378 269 25 246 -273 -309 -477 -206 -87 152 344 360 49 171 -299 -423 -86 -105 -34 -47 558 193 194 -69
2400 -69 -386 -251 -283 -194 -125 -148 364 215 360 230 -122 -210 -320 -59 -255 -378 271 324 386 241 392 -54 -257
2423 -257 -121 -58 -53 192 109 464 363 257 241 -329 -523 -236 -203 -36 65 238 24 7 -40 14 -273 -398 -440
2446 -440 -30 208 3 378 -51 134 36 -155 -282 -458 -237 -128 -59 128 268 433 205 -271 -188 -207 -426
2467 -426 -62 27 10 51 91 55 74 -291 -154 -181 -86 120 -58 298 312 377 281 63 -55 -431 -153 60 -334 51
2491 51 -41 223 84 128 -35 -310 -366 -321 -165 446 35 253 275 382 189 16 -83 -179 -313 6 345 8 332
2514 332 50 -89 -97 -202 -284 -356 -234 85 88 222 321 310 -136 136 -252 -397 -294 -472 61 200 144 190 103 -88
2538 -88 -225 -271 -206 150 -131 -164 -149 340 359 -181 105 58 -367 -37 -225 -14 91 326 224 46 -182 123
2560 123 -56 -517 -159 21 9 348 361 66 193 45 -58 30 -270 -113 -235 16 227 137 3 60 -111 -19
2582 -19 -618 -61 199 -98 -76 221 81 183 -88 -63 -138 -129 -86 115 89 411 277 282 -209 -81 -95 -354 -219 -220
2606 -220 -26 332 174 290 149 280 -76 -72 -142 -140 114 395 50 -182 -18 163 -328 -207 -170 -304 -218 -25
2628 -25 -128 314 96 -290 130 -120 -216 -533 -97 -105 365 39 217 196 60 -29 -137 -374 -129 -36 -62 44 109
2651 109 188 -96 138 -369 -237 -157 -106 -198 206 92 -127 221 71 112 -272 -208 37 -208 141 220 317 109 88
2674 88 181 2 -54 -152 10 -21 -142 56 181 208 99 -159 -430 -102 -329 -87 -322 110 94 380 244 85
2696 85 125 -268 -10 -371 213 168 182 207 179 265 -48 -75 -216 -237 -253 30 89 317 44 -231 33 -103 -1 -115
2720 -115 -32 181 42 306 129 -42 215 -141 -295 -420 11 133 -14 31 392 -66 -113 22 -256 286 -362
2741 -362 -231 173 -183 61 179 -50 19 35 -319 -329 -407 171 220 470 -107 76 382 102 -182 96 -243 -259
2763 -259 188 85 -15 -80 137 196 -137 -160 152 -57 -34 -163 196 230 198 290 -25 -80 -268 -92 -14 -173 -148
2786 -148 219 -70 185 175 46 7 -82 -362 -168 -42 77 225 33 104 -7 -76 -66 -334 -74 179 79 329
2808 329 202 229 153 98 -105 -357 -233 -269 242 133 397 253 274 74 -366 -24 -202 -270 -58 118 102 125 350
2831 350 74 40 -136 -20 -20 229 87 364 510 -5 328 401 -49 -52 -141 -117 -19 -1 249 319 132 13 -122 10
2855 10 -375 70 -303 60 257 -15 165 309 321 -100 -470 -304 -114 -178 -62 204 279 109 -56 -91 -180 -387
2877 -387 -195 -126 -230 -275 -35 -99 -39 306 87 -3 34 -325 -57 325 374 -39 172 170 -25 -86 -403 -399 -296 -292 171
2902 171 103 260 -38 92 50 144 -46 -261 116 19 78 244 258 286 45 -246 -28 -378 -206 -264 -17 243 -6
2925 -6 -40 -128 -155 -425 -416 -126 100 -28 -30 -24 230 387 58 -232 92 63 -78 -81 17 209 122 -63 150 -39 -112 22
2951 22 -92 -238 41 50 262 82 631 91 -235 24 -121 -346 89 124 190 406 301 332 -69 -221 -415 -64
2973 -64 -11 -110 116 188 43 383 16 -327 -309 -176 -144 -180 73 196 342 185 271 -143 -48 -384 52 -175 0
2996 0 160 40 47 266 303 -107 -169 -326 -302 -3 -266 255 36 189 216 291 87 -80 -138 -170 -30 105 -139 -99
3020 -99 238 112 -2 50 -320 -61 90 269 119 75 174 411 -66 -61 -101 95 -31 -67 14 96 26 190 -274 146
3044 146 -193 -103 173 -572 65 -181 232 108 -10 0 222 157 -92 -326 -250 286 -12 154 -30 254 -22
3065 -22 -191 20 -135 -104 -420 171 65 -47 421 69 -245 -8 312 -310 -194 -132 -16 298 566 89 -71
3086 -71 29 57 -500 -230 71 -5 -117 260 315 274 141 2 -176 -339 -205 45 83 95 67 9 372 -203 -516
3109 -516 -290 -56 102 46 169 101 226 225 -112 93 -149 -164 -10 -9 228 118 179 225 112 -225 -280 -142 -91 -264
3133 -264 218 195 -102 232 268 31 30 -180 142 -158 -119 61 -52 134 -185 -101 -33 139 133 -88 -259 124 186
3156 186 -11 -3 23 230 -131 -163 -350 -262 -20 -70 298 123 358 255 21 -340 14 -177 -120 199 200 296 350 366
3180 366 5 -51 -165 -22 115 -10 7 127 79 268 19 89 74 -9 -237 -253 15 121 20 48 193 288 131
3203 131 -175 -98 -75 -345 -47 235 138 54 259 -13 48 -258 -157 88 -215 190 -186 25 -39 -102 33 -113
3225 -113 -244 357 -291 115 -189 98 356 114 -45 184 -101 -235 158 -210 110 -2 113 201 122 -70 -238
3246 -238 -292 -322 -59 25 -11 -38 -231 189 -261 2 -157 327 -203 271 -12 14 -55 -64 -66 -80 237 130 -243 -346
3270 -346 104 -200 279 -29 203 65 -220 -134 -38 -217 -120 -164 265 -87 -59 151 -210 280 -12 -381 -60 22
3292 22 128 8 56 243 -56 -100 -105 -228 -19 143 -124 -57 -288 -183 198 10 -69 -206 -250 -59 69 22 100
3315 100 14 134 79 -59 350 61 -65 161 59 18 305 -167 78 1 67 127 129 17 -128 -66 -33 334 14
3338 14 410 215 -188 -218 20 -202 113 -245 -29 -327 62 136 -227 -61 -22 -109 -84 26 -174 -100 215 10
3360 10 28 115 -415 131 -162 23 -49 -6 174 -15 -205 119 138 233 -195 -91 -202 288 171 -137 199 -43
3382 -43 -15 168 -65 -165 166 -135 343 93 45 -147 184 -375 65 56 -478 -174 37 -10 285 -327 -146 -136
3404 -136 -478 -187 -60 259 -15 63 89 261 -132 -3 -29 -185 -82 236 73 237 4 104 88 40 -98 306
3426 306 -88 -82 154 119 256 259 90 147 -23 8 -28 13 49 -45 174 -127 53 -155 -36 -1 -123 113 144 -17
3450 -17 285 105 -61 -162 -183 -292 70 9 -297 17 -52 -36 86 -173 -32 267 -114 -275 153 -33 16 54
3472 54 -3 -205 41 -268 -130 55 6 18 -252 162 5 139 117 -151 -109 186 5 175 -95 31 -382 -7
3494 -7 368 -108 243 -176 30 179 9 83 189 48 167 169 99 -143 68 53 -216 186 49 79 -114 -285 66
3517 66 -200 89 -76 26 -190 -30 55 81 184 10 330 207 -33 153 -126 -210 -19 90 -80 -18 72 -254
3539 -254 1 40 -108 208 -190 78 -8 205 -219 45 4 32 -7 156 204 -192 143 -134 462 44 -82 168
3561 168 -36 17 13 174 58 27 -36 0 170 -2 233 -419 -40 5 -15 -109 0 -381 -122 318 199 23 189
3584 189 -190 147 76 -50 350 -234 60 327 -100 -48 122 -121 183 190 -52 117 -14 -70 -295 -282 171 218
3606 218 -240 -60 249 315 -17 73 25 93 6 91 -276 -84 -207 -415 -163 134 341 -281 -188 -134 -29 368 -260
3629 -260 -66 57 45 225 -28 11 82 -28 8 -114 -246 85 -121 131 157 144 -318 -259 -187 -74 -276 92 40
3652 40 23 53 -13 190 -84 -151 0 218 -91 -85 70 179 109 76 11 -111 123 -188 -9 88 361 80 23 73
3676 73 79 127 -254 249 -15 -3 -109 -121 203 270 290 -9 105 -118 352 202 5 302 -2 -238 -312 -141 -246
3699 -246 103 37 -353 18 306 279 34 -11 -200 75 171 -33 151 -78 -33 -50 2 93 315 -204 123 -162 -61
3722 -61 58 32 -131 296 157 -32 140 47 -138 117 -45 45 122 27 122 335 155 207 -32 -258 115 43 -205
3745 -205 -47 -82 -172 -212 52 194 -142 88 1 55 170 -115 88 70 4 13 -131 14 114 -317 -109 -72 85
3768 85 166 452 -162 127 141 167 61 -190 -222 -25 219 -20 254 130 -7 90 -28 -187 -61 115 -7 2 -17
3791 -17 -57 -38 206 100 -162 -190 -91 -85 -157 141 76 300 -78 -45 -313 -63 -165 -227 11 -52 140 -176 78 -143
3815 -143 -31 358 -104 102 84 99 162 -106 -117 -23 32 146 -21 -168 -156 165 8 56 241 -224 71 -64 -254
3838 -254 108 -72 107 -14 -51 187 200 -116 131 -9 -12 -129 -156 24 -3 204 -40 51 -36 -56 213 -305 -61
3861 -61 152 -49 -10 78 -224 33 -26 -12 161 271 75 -122 -169 62 156 -8 101 68 90 -230 17 18 385 -137
3885 -137 7 -74 -134 157 -212 -1 61 -250 54 -45 90 -31 -47 -54 186 -136 -268 -78 -15 181 6 -67 -243
3908 -243 -34 -233 -263 -62 62 -18 47 120 -32 152 -207 46 -23 -360 188 316 88 -270 -341 55 197 296
3930 296 250 -239 -183 -160 169 -264 80 -325 -125 -50 -320 -166 -156 104 -128 -77 58 77 96 128 123 -14 144 300
3954 300 -136 -13 -41 -58 12 -50 305 -84 -143 12 108 -241 -34 -47 61 -157 498 -32 -7 44 -146 -69 -183
3977 -183 -45 106 239 135 -84 -138 150 -63 94 -6 -136 -298 256 -83 151 -16 -18 -138 260 -118 -134
3998 -134 -189 24 16 112 141 362 -394 7 -107 -13 20 35 152 -111 -172 29 56 119 -33 122 82 -111 197 -116
4022 -116 -24 -132 -157 -42 31 -158 232 -180 -166 7 107 114 -10 163 55 -134 -235 -186 -95 77 152 -235 30
4045 30 -212 85 -194 33 -93 151 43 -66 -87 -141 109 40 136 2 -115 -392 -121 102 -127 39 306 -39
4067 -39 29 1 121 -60 212 35 -250 -173 168 227 158 -2 -94 -134 -215 10 49 -117 36 -155 -235 215 -15 -192
4091 -192 93 137 -150 85 -269 -177 67 -5 -279 139 -244 45 -125 -242 28 90 158 64 284 -87 155 -62
4113 -62 -102 35 -6 59 -150 125 231 10 193 -160 -74 9 37 -9 255 -17 -136 -256 254 -19 89 -146 -93
4136 -93 -138 -66 112 104 236 -187 -325 164 -132 -49 -300 -45 -100 -83 84 -305 -52 -367 -301 129 -217 199 -24
4159 -24 161 195 151 52 -32 118 -102 -280 85 -39 65 11 163 163 119 -90 -274 -135 -34 -152 -119 -154 -178 -131
4183 -131 78 56 -104 -99 -150 60 7 103 -165 48 -24 -20 -45 -108 -246 -28 104 -40 -279 116 -50 113 114 -295
4207 -295 69 -10 87 227 181 -114 -81 52 -313 42 177 39 42 -222 205 253 13 71 -62 -166 78 36 -379
4230 -379 22 75 12 -41 -8 125 -14 -310 190 153 -118 22 -104 -302 26 149 73 8 177 -41 15 24 -51 236
4254 236 -91 -154 80 89 372 -54 54 -255 337 -69 214 177 -59 -7 -40 151 49 -5 -221 7 -6 -153 179
4277 179 192 25 151 157 -151 -123 -8 152 -135 -364 11 -345 -110 -209 58 6 94 368 -42 -52 -179 38 5
4300 5 -42 -49 -23 294 56 97 -90 42 135 -65 150 -218 183 -74 54 366 68 344 61 -90 141 18 -69
4323 -69 -211 134 15 116 -214 -50 71 -30 233 43 236 -255 -164 149 259 -31 168 -21 42 61 -96
4344 -96 -200 3 14 113 10 -34 242 138 67 -107 91 -259 -187 35 22 421 143 241 -178 -110 -60 126 -389
4367 -389 -24 246 121 -375 129 26 -70 108 -34 -169 -348 279 -87 -9 88 -97 299 34 104 -294 53
4388 53 201 -110 136 56 223 -304 -217 -300 -126 74 -79 22 -184 -102 -120 -275 -117 -154 8 107 -220 115 156
4411 156 58 -90 -47 -192 -254 56 95 68 125 -148 -115 149 -61 131 78 80 225 -23 -210 -39 -46 -73 198 -12
4435 -12 91 113 -50 155 153 401 -8 39 -6 191 54 242 168 -208 101 133 -62 114 -76 -104 281 84 -63
4458 -63 59 114 -67 -232 -251 282 93 -86 -95 247 109 -135 88 140 -427 44 71 116 7 107 -142 -173 -58
4481 -58 -110 -173 71 317 75 162 202 79 -130 -214 48 210 100 202 4 -47 -183 -64 170 110 96 -58 71
4504 71 -167 195 163 96 92 -36 -115 52 -18 -134 180 -116 -71 290 31 166 -115 207 -316 123 -66 224 18
4527 18 350 185 25 152 -227 86 -15 -74 -28 -120 -97 115 229 166 -380 33 230 -130 124 123 272 60 -196
4550 -196 -131 -183 127 -109 22 27 -87 -177 34 -142 -107 -18 -2 -99 71 -20 215 33 21 -83 -44 -48 -6 90 215
4575 215 135 -178 -48 99 28 -296 50 -75 -60 -116 137 -336 -78 102 171 -133 68 -143 -151 241 90 -179
4597 -179 33 -187 -156 104 -212 105 -302 100 15 -43 61 235 -126 81 -16 14 -111 -292 -93 138 40 -19
4619 -19 206 77 -109 -29 -75 109 295 -37 -143 233 -199 158 162 167 -184 64 -120 -113 353 188 -105 -97 -26 -154
4643 -154 32 175 -56 106 32 191 -281 -100 -211 -181 122 53 155 125 50 221 -91 -37 -180 34 29 -43 -60
4666 -60 196 -135 -119 -177 -310 -86 -240 -64 11 111 21 122 92 3 -309 -174 209 -184 178 -131 -11 109
4688 109 236 -20 118 12 -21 -170 -9 125 344 -123 82 39 250 -84 219 -96 0 -38 -12 46 -121 13
4710 13 28 141 -164 98 -193 111 -85 44 -122 -30 -25 -215 127 62 -328 78 80 -143 279 -58 67 -230 -333
4733 -333 130 -324 319 155 -117 -28 -215 10 -96 -228 50 140 137 -220 -306 -172 7 -146 -103 222 -117 -86
4755 -86 73 -164 187 2 108 129 19 115 242 279 85 304 -7 230 -77 -78 -74 -140 -2 -36 39 -83 112 -167
4779 -167 1 411 -153 -220 49 -20 -42 -33 -122 -1 -220 -66 -270 329 -15 64 70 116 221 187 4 -228 -84 -51
4803 -51 -104 229 85 -213 -125 62 -26 -1 216 46 3 -274 273 67 19 232 -323 -125 193 -83 10 -51 -4
4826 -4 -318 -74 37 -146 -22 121 -23 -38 -22 40 269 -227 42 148 -298 -160 56 4 92 -109 -56 -160 -387
4849 -387 68 89 -32 -168 -45 283 -79 20 -321 -121 28 -25 14 102 240 -175 240 18 -178 199 -88 118
4871 118 52 -217 149 126 -3 0 88 -67 279 -5 185 -61 -201 90 154 406 12 -147 -113 -138 -238 41 38
4894 38 63 147 -76 144 46 62 90 -88 -14 -77 137 140 -244 -83 -97 87 -48 15 42 20 44 64 104 -162 -224 1
4920 1 -126 42 -55 -274 -294 -180 107 -157 1 66 -202 25 25 -317 90 227 98 -33 66 -188 75 9 11 28
4944 28 26 248 360 -49 -77 -201 -118 114 -178 117 130 73 65 17 97 117 -2 -61 -92 265 260 -31 146 -53 -147 88
4970 88 -211 81 -544 -76 314 194 152 -118 145 15 -2 -142 -110 257 44 -110 -155 -149 277 301 143 100 20
4993 20 66 115 -13 127 119 119 -21 -92 -158 145 -35 11 136 141 -153 -146 -45 -153 -138 -217 179 234 -218 255 84 389
5019 389 -32 -81 22 63 57 376 206 146 108 -119 -7 98 -2 138 138 14 300 45 -236 -53 182 285 94
5042 94 -14 9 203 291 332 149 -60 65 -47 -16 -211 -2 -182 -278 -165 -325 45 113 -155 192 -26 -327
5064 -327 52 -73 -156 -142 199 81 25 100 -258 -75 -2 102 257 12 113 27 253 -132 128 -9 -43 21 -69
5087 -69 287 99 88 98 29 58 144 -42 -167 218 -27 -72 -83 -143 127 58 -252 118 59 59 60 187 -168 -126 4
5112 4 -249 194 168 -242 193 108 158 144 -197 -183 315 76 132 58 -124 271 44 0 105 -145 -247 293 -321
5135 -321 -4 12 60 -186 -225 24 -29 -115 159 161 91 -43 -166 179 55 70 -168 509 48 -168 70 -275 14
5158 14 -180 -202 -111 159 -75 144 -354 36 -143 127 -69 126 -63 -148 -54 -8 6 -65 -170 -38 39 -15 307
5181 307 370 32 108 51 -85 -88 103 -152 -72 -343 2 86 -242 48 106 -183 -185 -67 155 70 143 -35 215 -237
5205 -237 168 -263 -115 39 -3 -17 49 155 -262 39 25 -38 109 -58 63 115 270 39 -177 203 -314 16
5227 16 178 -27 -152 32 218 144 106 217 190 33 -297 268 35 -2 -2 -45 338 102 -126 72 -20 161 138
5250 138 -18 -62 224 57 62 232 2 0 -82 111 26 90 -30 -248 -22 66 -97 -204 28 -33 -139 -111 63 -195
5274 -195 -45 137 174 38 -119 -72 -113 -118 129 51 53 -73 127 214 -281 -33 128 82 -28 -29 127 43 162 82 -30
5299 -30 174 16 0 63 -91 -17 -87 7 217 34 -123 -20 -74 -175 -32 -5 -54 -132 -64 -39 19 -166 -251 4 202
5324 202 -297 -263 -57 65 141 -14 50 -9 -97 -180 -25 -242 -52 -23 143 317 -61 -116 35 -23 55 159 -19
5347 -19 114 11 117 -130 128 123 -100 -339 -132 -90 164 55 -64 -189 -207 -53 -144 -120 82 124 166 -415 5
5370 5 17 -201 -402 -318 132 -103 50 -40 97 -38 -19 119 -347 -251 175 396 -174 90 -117 -250 55 161
5392 161 -202 -153 102 -281 92 28 -144 50 -103 -197 -51 81 -167 88 59 42 133 -121 58 138 -50 -120 -62
5415 -62 -167 -168 -214 14 -181 39 47 112 -481 47 -58 -249 176 168 -34 -78 310 -177 -194 151 121 130 51 -168 -257
5440 -257 303 -51 -85 92 -174 126 -2 108 20 -178 -97 174 208 -173 -177 64 193 -212 115 130 101 -61 -135
5463 -135 18 -185 -77 11 43 183 213 -44 352 -204 -211 -263 -156 -104 -249 -99 -16 -72 82 -189 1 153 112
5486 112 19 -137 126 87 -124 221 80 128 -101 -199 183 55 7 26 -112 -42 -157 436 260 209 -102 167 -37
5509 -37 -143 259 326 83 -71 -158 -269 -144 -24 77 -159 84 -269 35 -89 99 28 195 253 -103 271 68
5531 68 138 -52 -56 26 -264 -233 126 51 -92 167 -116 164 262 -603 -2 -13 -187 168 -206 7 -138 301 -66
5554 -66 -144 -134 -81 -130 145 141 -2 51 54 -57 23 188 51 188 -209 109 57 5 19 -180 -68 -13 43 -125 54
5579 54 39 51 186 67 132 49 122 -196 111 -177 -96 -200 -136 -37 113 -332 110 118 -288 60 316 1 55 -124
5603 -124 181 34 -240 124 -230 173 58 292 76 -344 -304 -46 71 -21 -11 417 -124 107 269 -78 147
5624 147 -36 97 86 200 194 40 90 261 24 -12 -370 -177 90 59 -60 166 229 -39 93 -114 204 140 95
5647 95 173 -125 -215 -99 -32 -48 -105 73 116 -157 -88 133 -55 115 104 74 16 -32 35 89 151 131 -291 -220 371 38
5673 38 -200 113 103 -140 -413 -110 -27 -314 -83 73 -98 -53 -148 36 -66 -359 36 116 62 112 16 -73 -266
5696 -266 -10 111 231 248 30 -95 270 -152 -72 55 -317 -8 388 -124 99 110 -169 282 -26 -42 -194
5717 -194 -77 418 -300 1 159 -79 217 -58 -26 55 -128 -120 -3 -195 -78 1 -39 -120 169 -160 164 -120
5739 -120 -116 131 281 -73 158 3 143 148 -16 -91 -175 69 11 173 142 104 189 111 136 99 -43 -157 252 -89
5763 -89 -55 271 -273 15 367 137 69 -427 -342 57 1 211 -128 8 -204 -260 -438 19 -79 71 57 18 -37
5786 -37 -143 106 -314 10 -104 -55 34 172 -138 176 -90 144 200 119 71 104 63 -356 162 -66 309 -136 -383
5809 -383 43 -175 -52 -55 -309 -167 88 -23 -3 70 -99 -55 -72 122 -25 -268 -50 96 91 -132 192 -29 -86
5832 -86 31 -9 -64 -101 119 -219 -182 -139 -62 -50 186 50 -2 -101 44 -28 -6 -13 -69 -44 315 -55 -145 -11 -33 -210
5858 -210 -147 -97 136 -140 104 41 98 -100 -147 205 140 90 10 -23 44 -193 -40 -14 118 -123 -74 -54 -110 -105 184
5883 184 229 250 -211 -267 -303 16 189 -10 -316 -145 -223 -13 -13 -12 -52 30 -26 -216 223 316 44 -371 34 180
5907 180 138 -186 -17 -14 -152 -98 46 66 41 -230 201 132 -329 44 79 -125 117 -178 35 58 -119 185 -373
5930 -373 65 -16 -205 -161 -21 -330 50 -65 -239 -188 -233 -261 21 238 -151 -64 -70 -51 -166 -291 288 61 30
5953 30 -273 -2 123 24 51 95 -155 47 -105 -94 -74 -42 -349 84 39 -158 -9 -110 184 137 -30 -131 56
5976 56 -56 -83 174 -110 -28 135 -48 202 54 -239 -236 36 -67 -93 -84 -331 9 6 -278 160 -130 60 -35 -7
6000 -7 49 133 -235 -170 166 -134 29 0 14 -24 -24 209 -107 111 71 33 43 53 -28 137 90 -13 109 186 147 -301
6026 -301 -244 -143 -46 -11 159 189 -62 211 16 -235 65 317 58 -130 64 205 64 -62 -156 -377 138 174
6048 174 -85 -54 -69 299 -98 71 129 -137 -88 -197 6 24 -201 139 24 -73 -76 -228 -79 66 16 239 -112
6071 -112 141 -34 88 29 -47 -83 137 -350 -89 207 26 188 0 49 -151 -10 283 140 -70 -47 6 -71
6093 -71 7 13 -180 -5 -137 59 148 86 -61 -121 -132 -60 145 -36 -20 -341 -120 179 349 -121 -27 20 -134 -217
6117 -217 271 45 200 4 -8 9 146 139 -88 14 -49 139 -62 -192 364 380 -38 -92 -235 83 -28 -186
6139 -186 323 -138 49 155 -92 53 127 -206 -213 256 59 51 -80 -117 -62 -56 -201 -57 141 93 -118 22 157
6162 157 63 -32 -16 136 -125 38 -169 -40 -17 19 -111 -142 -249 56 -126 51 -50 -21 129 173 -7 246 198
6185 198 415 -15 6 159 -24 320 104 72 25 -66 -241 -77 79 -44 -212 65 -103 375 -39 -13 281 -278
6207 -278 -306 -164 -47 48 -7 -170 274 -13 141 -192 -335 -113 50 94 -233 81 -148 4 -99 -140 380 224
6229 224 69 -69 -110 95 -257 117 7 -64 286 -311 -65 91 60 24 -181 27 -217 29 -122 154 -144
6250 -144 -325 69 -340 166 -89 99 13 273 -29 296 -17 -95 164 -37 296 -147 -48 -51 -61 -55 -308 -325 -15
6273 -15 -168 292 -72 -245 -44 -217 -48 -118 -54 -79 29 159 188 -181 193 92 192 178 -59 -116 -36 -305 -89
6296 -89 4 -36 -44 -135 -124 43 -86 78 -73 168 -80 102 -116 90 -42 31 -11 -163 283 -115 24 45 132 76
6320 76 112 57 306 274 2 -201 -265 -87 -19 -23 12 -36 -20 193 -55 -11 51 163 -191 -87 10 48 85 97 12 122
6346 122 -49 335 -274 32 76 28 -96 -423 -44 176 458 -17 103 -140 -210 62 458 5 -22 69 -188 329
6368 329 60 29 -57 20 -25 4 -23 38 -270 78 -204 78 79 -58 -234 204 -244 -172 -238 -40 -47 -89 36 -106 46
6393 46 74 230 15 -119 21 -86 12 49 -68 121 128 -43 81 -73 45 -107 170 247 -225 25 43 219 172
6416 172 -67 119 207 -225 97 25 39 74 176 4 132 48 90 -149 -194 -24 -109 171 306 214 543 71 -71
6439 -71 -20 -67 16 -232 -158 94 -172 -117 28 -121 67 -132 -45 138 71 35 92 -197 -199 37 166 2 51 107 160
6464 160 83 350 64 -30 44 -61 -68 -124 -136 276 43 119 -262 -134 345 30 -107 328 291 -361 42 94 -254
6487 -254 -39 179 38 102 201 247 -70 -225 -24 -303 -233 -4 48 -116 70 -133 -56 76 -302 71 -34 46
6509 46 -18 28 0 203 -290 -86 -44 97 -146 -4 -134 -295 241 -187 -197 -110 -313 8 32 257 348 -75 -196
6532 -196 10 151 -52 -321 -76 -319 -72 -109 -247 -51 34 21 -88 -60 60 -3 -83 -85 15 43 -68 -54 50
6555 50 -45 -17 21 173 130 388 -30 -357 2 228 -54 39 14 -18 -148 208 351 -59 144 396 -38 -271 9
6578 9 87 67 -175 238 -77 -27 31 -215 24 -144 40 3 155 313 -216 -35 7 -47 -77 54 156 -92 -31 4
6602 4 -32 0 -91 31 -396 56 110 -217 -14 -179 -36 -36 -199 -352 -67 169 90 49 -177 -451 2 -60 -92 68
6626 68 102 -292 214 -39 -131 101 -206 325 -79 184 -16 -212 64 134 350 -28 -244 254 251 117 -199 5
6648 5 42 36 247 -10 33 13 312 40 -34 55 -3 -66 219 139 -91 55 24 98 72 -226 2 275 375 20 74
6673 74 -32 -60 -171 -208 96 -83 -60 43 -277 101 87 92 -15 260 -177 -231 -49 83 -109 272 44 121 -36
6696 -36 80 -260 69 -277 -16 344 162 -108 124 359 -136 -17 55 182 -23 26 175 48 -243 -78 124
6717 124 233 131 -46 40 -12 63 -222 60 332 157 63 -202 -182 -177 -25 -198 -308 -190 58 -380 116 107 -6
6740 -6 -9 -124 130 -175 -128 51 -178 -59 197 -10 -79 34 -25 180 65 95 -88 160 31 -12 186 49 13
6763 13 86 -54 73 234 -179 -100 173 20 101 218 -46 -107 226 104 -84 -117 -148 -3 -97 225 338 140 264
6786 264 -266 28 -243 -12 -332 46 142 -190 -5 280 124 -397 -102 -269 157 239 358 47 -150 -24 8
6807 8 -51 -144 -22 -131 267 99 -240 115 41 -141 -29 78 -165 146 -75 -1 67 -58 264 70 -144 288
6829 288 -106 -39 -291 -195 -170 12 -240 252 41 -155 -75 200 55 44 132 -50 17 -103 -6 -282 133 -233 -259
6852 -259 54 -240 -29 -227 55 157 36 -152 205 44 35 -112 151 -90 -54 -125 -144 13 52 -16 431 8
6874 8 18 -247 34 -219 -111 70 -64 260 -333 20 -213 -176 -177 270 131 -243 -249 80 -252 356 -446 -55 -138
6897 -138 -25 296 324 5 234 -64 181 4 -248 209 257 28 290 -29 283 143 62 156 -124 26 149
6918 149 -132 -14 48 11 -99 41 121 -50 78 -44 -146 201 -241 -111 -34 -112 14 -112 33 -45 140 97
6940 97 -185 -164 -80 -64 -144 122 -25 -59 -16 5 13 87 299 102 -127 -65 -54 -148 -78 125 -40 138 70 111 -171 14
6966 14 153 -6 39 -86 -249 331 171 255 237 99 -53 30 21 -144 -114 -258 22 -75 53 -132 -77 -174 89 273
6990 273 -198 95 126 -61 -59 126 -127 -14 -67 41 -72 -88 188 -101 -136 185 61 44 59 101 65 -69 -194
7013 -194 -143 176 -153 -1 58 156 4 -28 -226 -142 130 112 -109 -68 33 -13 -248 98 207 -54 188 -42 -50
7036 -50 169 83 -260 14 -244 26 -51 30 270 147 100 -51 -28 -1 -45 350 -201 -174 -5 -184 -37 54 27 -192
7060 -192 3 -22 -181 143 -171 352 20 173 69 78 -210 132 43 -24 233 115 482 -37 -144 -90 -67 67
7082 67 55 28 -80 273 -26 -150 -256 -344 214 -87 9 -102 -145 -383 110 -5 -158 18 -271 176 301 6
7104 6 154 130 209 -92 172 -315 234 186 19 115 190 65 -189 22 -121 49 117 268 -51 -90 -14 -127 71
7127 71 3 37 162 -88 466 -327 33 -172 -172 62 -32 -64 -35 -214 127 -124 190 -444 -139 -41 473 163 65
7150 65 121 -44 11 113 -112 100 -151 -158 -123 -207 208 -36 138 144 -42 -28 194 -165 258 33 301 -17 46 147
7174 147 -99 -26 61 156 122 -139 75 -172 -99 55 -4 -27 277 5 130 39 -204 -110 352 -8 36 78 140 -280
7198 -280 -230 288 120 -255 -21 -77 46 -5 -132 -8 -243 -56 73 -145 -274 61 -39 -405 -43 -6 -24 -221
7220 -221 95 -47 -193 153 -13 291 -87 285 19 49 73 -48 -299 29 -77 118 -207 -294 46 -115 -191
7241 -191 42 303 205 -126 7 -3 -285 165 -101 -216 -310 90 -40 -115 -75 -56 212 -135 -82 -32 -106 195 -20
7264 -20 280 -105 -59 123 60 307 15 15 -86 -130 19 -50 -170 -152 -218 95 -139 -178 -325 235 205 -331 -303 -229
7288 -229 183 -1 151 -22 -47 -166 68 -254 3 -220 -112 2 -202 -104 -44 164 219 -99 109 -83 -348
7309 -348 -231 193 -23 387 60 -157 -92 -185 -84 10 -105 -81 -112 383 94 218 82 -191 -74 -22 -93 88
7331 88 140 86 -195 -376 -117 -98 217 89 -73 259 149 198 260 27 117 213 71 153 -7 -149 -151 -148 161 -120
7355 -120 12 -189 147 -100 16 -64 34 -9 -18 79 99 146 55 171 -18 104 121 -38 -347 -123 127 -172 -221 -7
7379 -7 -26 66 -92 24 -295 131 62 -18 8 -263 31 273 428 -206 -86 7 21 182 243 55 -80 28 91 74
7403 74 9 125 137 -59 52 -130 -72 -379 31 441 87 -150 114 103 86 165 -79 -161 506 105 -212 301 165
7426 165 -339 116 -268 277 -204 -203 52 -105 114 -293 -200 36 190 204 168 175 160 169 11 -312 312 -409 -306
7449 -306 -227 -213 5 0 124 119 84 -4 290 -104 -125 -214 -287 -58 -256 -56 127 239 -110 -31 -141 58 45 -8 -108
7474 -108 -45 -254 32 190 99 -93 273 411 -36 -77 124 92 146 25 -14 -48 -307 -5 291 -15 -93 167 140
7497 140 -139 -329 -115 -155 328 -64 -152 421 204 -2 84 -128 146 9 -62 76 -58 -22 -12 313 253 -227
7519 -227 -140 211 -76 -223 183 215 -329 -32 286 54 -21 -203 165 65 -166 117 -32 79 -94 -240 -118
7540 -118 -23 111 186 -272 142 94 -36 175 -132 -14 -335 -164 -169 3 84 27 -66 284 195 57 -36 -185 129
7563 129 72 33 -361 -59 -164 -93 4 -296 320 94 -60 -106 -15 -50 -128 -5 -25 10 43 106 55 -201 -20 -119 -5
7588 -5 -79 38 -307 -98 115 -38 -21 171 -491 18 -22 -68 -11 33 85 144 23 347 -58 95 -201 -71 132
7611 132 80 -477 32 -102 103 -55 -190 64 109 -137 -48 -128 -157 67 -328 60 -295 185 48 -255 -16 -118
7633 -118 -60 268 -208 150 -134 -105 -164 74 -270 -163 -71 205 361 -209 172 44 355 -55 -96 85 111 -92
7655 -92 -191 28 159 -104 132 -250 -127 -196 141 108 -126 161 -25 -110 -88 -393 -72 99 14 -49 -31 -167 -154
7678 -154 -59 354 -17 -174 268 -206 -59 136 -124 56 -206 79 76 63 -105 202 -127 -225 86 -212 -173 -35
7700 -35 -288 -69 -155 -125 352 454 -24 -144 17 -87 99 -84 32 -256 -128 60 -204 62 96 206 -23
7721 -23 286 2 -51 157 112 -106 -228 58 67 188 -276 19 205 105 176 -248 318 135 -230 -345 -134 154
7743 154 -22 130 -40 25 -34 -133 213 -116 10 -142 228 207 -72 170 146 -88 -120 -29 100 -248 217 -312
7765 -312 -49 17 -27 -175 -207 -260 -223 102 -111 145 316 138 -93 112 163 136 -72 34 0 -36 476 -348 151
7788 151 53 87 164 -79 70 19 -269 -93 -198 -105 99 -77 -161 -51 154 -197 -205 54 242 -5 47 95 -75
7811 -75 268 246 36 2 212 -121 -63 126 -38 185 -103 0 179 -27 103 218 -28 160 -138 -150 -48 192
7833 192 -78 271 79 -50 -244 -384 -303 -141 -65 137 246 -93 106 -192 0 -40 83 159 -181 360 209
7854 209 235 390 166 -109 -99 -43 90 -174 -65 -232 310 -242 13 -131 163 5 121 177 27 -146 38
7875 38 -336 -156 -249 79 -66 -74 -62 -115 137 106 -202 -163 47 69 44 182 188 -38 69 -151 -144 69 171 -276 177
7900 177 90 88 -198 -59 201 -325 -169 -75 31 -76 -377 52 74 107 63 272 63 16 313 41 226 144 95
7923 95 39 34 57 -45 -21 -30 96 237 -171 -136 -61 153 142 -13 83 51 -81 77 152 134 -358 -37 66 -1 58 -57
7949 -57 -74 -33 -11 -53 111 -62 32 -364 -256 100 -360 -41 178 -6 -214 163 -21 -228 -32 -78 114 73 61
7972 61 -189 16 113 -28 117 -329 144 -58 -33 -84 16 -84 -41 -84 1 -111 -253 43 208 -160 -44 124
7994 124 124 -84 -43 45 97 3 155 -93 5 -51 -135 -177 53 3 -30 -14 -32 -121 -243 172 -39 -217 -76 -39 29 -290
8020 -290 -254 -68 -53 173 -127 -67 90 358 -2 -27 -4 -132 -48 371 221 -106 138 -152 -68 -158 28 100 210
8043 210 -41 161 -159 -209 124 -19 -87 272 95 126 -46 91 -129 -250 -145 -168 -121 -146 -38 -383 33 -21
8065 -21 110 -51 223 -140 20 51 -197 43 -172 13 170 -109 177 81 96 82 24 279 -10 137 -166 19
8087 19 142 -137 -40 -28 -89 -215 35 -148 -329 -36 -167 50 36 77 -116 18 8 98 115 -58 -52 17 90 47 207
8112 207 188 -157 72 -362 3 117 273 -10 -348 -318 -65 29 -161 199 -192 -9 163 117 2 250 -153
8133 -153 -306 -28 16 -436 1 360 -144 -254 -168 -519 -140 123 -28 111 -85 161 -232 -115 1 -79 -41
8154 -41 336 2 -66 337 91 -272 134 -42 283 174 51 -213 -23 -128 -58 -109 -137 369 -110 182 74 -36
8176 -36 61 148 -171 -106 -129 69 32 126 -372 28 46 7 219 156 101
8191A01
##END NTUPLES=NMR FID
##END=
