##TITLE=1H_DE-62_EA
 D2O
 8 sc, 
 19.7.2024
##JCAMPDX= 6.0         $$ Bruker NMR JCAMP-DX V2.0
##DATA TYPE= NMR FID
##DATA CLASS= NTUPLES
##ORIGIN= UXNMR, Bruker Analytische Messtechnik GmbH
##OWNER= root
$$ XWIN-NMR		Version 3.5
$$ Fri Jul 19 14:06:00 2024 Russian Standard Time (UT+4h)  she@DPX200
##.OBSERVE FREQUENCY= 200.1314
##.OBSERVE NUCLEUS= ^1H
##.DELAY= (6, 6)
##.ACQUISITION MODE= SIMULTANEOUS
##.ACQUISITION SCHEME= undefined
##.AVERAGES= 8
##.DIGITISER RES= 18
##SPECTROMETER/DATA SYSTEM= spect
##.PULSE SEQUENCE= zg30
##.SOLVENT NAME= D2O
##.SHIFT REFERENCE= (INTERNAL, D2O, 0, 15.7039)
##AUDIT TRAIL= $$ (NUMBER, WHEN, WHO, WHERE, WHAT)
$$ ##TITLE= Audit trail, XWIN-NMR		Version 3.5
$$ ##JCAMPDX= 5.01
$$ ##ORIGIN= Bruker BioSpin GmbH
$$ ##OWNER= she
$$ F:/spectra/data/she/nmr/H-F/1/audita.txt
$$ ##AUDIT TRAIL=  $$ (NUMBER, WHEN, WHO, WHERE, WHAT)
(   1,<2024-07-19 13:58:57.51 +0400>,<she>,<DPX200>,
      <created by zg, POWCHK disabled, PULCHK disabled
       configuration hash MD5:
       00 E9 B6 7A A2 85 ED C7 34 08 36 98 17 FE 4E 26
       data hash MD5: 16K
       10 09 77 14 68 49 3C C7 6E CE 4B 0D 3B 43 A6 0F>)
$$ ##END=
$$ 
$$ hash MD5
$$ 16 EC CE 7F E8 8C 31 5D 81 A6 3F 37 DB 73 09 62
##$RELAX= 
##$RELAX= 
##$RELAX= 
##$RELAX= 
##$RELAX= 
##$RELAX= 
$$ Bruker specific parameters
$$ --------------------------
##$DU= <F:/spectra>
##$EXPNO= 1
##$NAME= <H-F>
##$PROCNO= 1
##$TYPE= <nmr>
##$USER= <she>
##$AMP= (0..31)
100 100 100 100 100 100 100 100 100 100 100 100 100 100 100 100 100 100 
100 100 100 100 100 100 100 100 100 100 100 100 100 100 
##$AQSEQ= 0
##$AQ_mod= 1
##$AUNM= <au_zg>
##$AUTOPOS= <>
##$BF1= 200.13
##$BF2= 200.13
##$BF3= 200.13
##$BF4= 200.13
##$BF5= 200.13
##$BF6= 200.13
##$BF7= 200.13
##$BF8= 200.13
##$BYTORDA= 1
##$CFDGTYP= 0
##$CFRGTYP= 5
##$CHEMSTR= <none>
##$CNST= (0..31)
1 1 145 1 1 1 1 1 1 1 1 1 1 1 1 1 1 1 1 1 1 1 1 1 1 1 1 1 1 1 1 1 
##$CPDPRG= <>
##$CPDPRG1= <>
##$CPDPRG2= <>
##$CPDPRG3= <>
##$CPDPRG4= <mlev>
##$CPDPRG5= <mlev>
##$CPDPRG6= <mlev>
##$CPDPRG7= <mlev>
##$CPDPRG8= <mlev>
##$CPDPRGB= <>
##$CPDPRGT= <>
##$D= (0..31)
0 1.2 0 0 0 0 0 0 0 0.06 0 0.03 0 0 0 0 0.0002 0 0 0 0 0 0 0 0 0 0 0 0 
0 0 0 
##$DATE= 1721383136
##$DBL= (0..7)
120 120 120 120 120 120 120 120 
##$DBP= (0..7)
150 150 150 150 150 150 150 150 
##$DBP07= 0
##$DBPNAM0= <>
##$DBPNAM1= <>
##$DBPNAM2= <>
##$DBPNAM3= <>
##$DBPNAM4= <>
##$DBPNAM5= <>
##$DBPNAM6= <>
##$DBPNAM7= <>
##$DBPOAL= (0..7)
0.5 0.5 0.5 0.5 0.5 0.5 0.5 0.5 
##$DBPOFFS= (0..7)
0 0 0 0 0 0 0 0 
##$DE= 6
##$DECBNUC= <off>
##$DECIM= 24
##$DECNUC= <off>
##$DECSTAT= 4
##$DIGMOD= 1
##$DIGTYP= 9
##$DL= (0..7)
0 120 120 120 120 120 120 120 
##$DP= (0..7)
150 150 150 150 150 150 150 150 
##$DP07= 0
##$DPNAME0= <>
##$DPNAME1= <>
##$DPNAME2= <>
##$DPNAME3= <>
##$DPNAME4= <>
##$DPNAME5= <>
##$DPNAME6= <>
##$DPNAME7= <>
##$DPOAL= (0..7)
0.5 0.5 0.5 0.5 0.5 0.5 0.5 0.5 
##$DPOFFS= (0..7)
0 0 0 0 0 0 0 0 
##$DQDMODE= 0
##$DR= 18
##$DS= 0
##$DSLIST= <SSSSSSSSSSSSSSS>
##$DSPFIRM= 0
$$ [...]
##$SUBNAM2= <"">
##$SUBNAM3= <"">
##$SUBNAM4= <"">
##$SUBNAM5= <"">
##$SUBNAM6= <"">
##$SUBNAM7= <"">
##$SUBNAM8= <"">
##$SUBNAM9= <"">
##$SW= 24.0689651099613
##$SWIBOX= (0..15)
0 0 2 0 0 0 0 0 0 0 0 0 0 0 0 0 
##$SW_h= 4816.95568400771
##$TD= 16384
##$TD0= 1
##$TE= 0
##$TE2= 300
##$TE3= 300
##$TEG= 300
##$TL= (0..7)
0 120 120 120 120 120 120 120 
##$TP= (0..7)
150 150 150 150 150 150 150 150 
##$TP07= 0
##$TPNAME0= <>
##$TPNAME1= <>
##$TPNAME2= <>
##$TPNAME3= <>
##$TPNAME4= <>
##$TPNAME5= <>
##$TPNAME6= <>
##$TPNAME7= <>
##$TPOAL= (0..7)
0.5 0.5 0.5 0.5 0.5 0.5 0.5 0.5 
##$TPOFFS= (0..7)
0 0 0 0 0 0 0 0 
##$TUNHIN= 0
##$TUNHOUT= 0
##$TUNXOUT= 0
##$USERA1= <user>
##$USERA2= <user>
##$USERA3= <user>
##$USERA4= <user>
##$USERA5= <user>
##$V9= 5
##$VALIST= <valist>
##$VCLIST= <CCCCCCCCCCCCCCC>
##$VD= 0
##$VDLIST= <DDDDDDDDDDDDDDD>
##$VPLIST= <PPPPPPPPPPPPPPP>
##$VTLIST= <TTTTTTTTTTTTTTT>
##$WBST= 1024
##$WBSW= 4
##$XGAIN= (0..3)
0 0 0 0 
##$XL= 0
##$YL= 0
##$YMAX_a= 236845
##$YMIN_a= -169455
##$ZGOPTNS= <>
##$ZL1= 120
##$ZL2= 120
##$ZL3= 120
##$ZL4= 120
##$ABSF1= 10
##$ABSF2= 0
##$ABSG= 5
##$ABSL= 3
##$ALPHA= 0
##$AQORDER= 0
##$ASSFAC= 0
##$ASSFACI= 0
##$ASSFACX= 0
##$ASSWID= 0
##$AUNMP= <proc_1d>
##$AZFE= 0.1
##$AZFW= 0.1
##$BCFW= 1
##$BC_mod= 2
##$BYTORDP= 1
##$COROFFS= 0
##$CY= 11.3945322036743
##$DATMOD= 1
##$DC= 2
##$DFILT= <>
##$DTYPP= 0
##$F1P= 15.6554695791079
##$F2P= 12.8336369535428
##$FCOR= 0.5
##$FTSIZE= 0
##$FT_mod= 4
##$GAMMA= 1
##$GB= 0.15
##$INTBC= 1
##$INTSCL= 1
##$ISEN= 128
##$LB= 0.24
##$LEV0= 0
##$LPBIN= 0
##$MAXI= 10000
##$MC2= 0
##$MEAN= 0
##$ME_mod= 0
##$MI= 1.114404
##$NCOEF= 0
##$NC_proc= 0
##$NLEV= 6
##$NOISF1= 3.799351
##$NOISF2= 2.8
##$NSP= 1
##$NTH_PI= 0
##$NZP= 0
##$OFFSET= 15.70392
##$PC= 1
##$PHC0= -25643.18
##$PHC1= 17.78749
##$PH_mod= 1
##$PKNL= yes
##$PPARMOD= 0
##$PSCAL= 0
##$PSIGN= 0
##$REVERSE= no
##$SF= 200.130013532006
##$SI= 16384
##$SIGF1= 3
##$SIGF2= 2
##$SINO= 400
##$SIOLD= 16384
##$SREGLST= <1H.CDCl3>
##$SSB= 0
##$STSI= 0
##$STSR= 0
##$SW_p= 3612.71676300578
##$SYMM= 0
##$S_DEV= 0
##$TDeff= 0
##$TDoff= 0
##$TI= <>
##$TILT= no
##$TM1= 0
##$TM2= 0
##$TOPLEV= 0
##$USERP1= <user>
##$USERP2= <user>
##$USERP3= <user>
##$USERP4= <user>
##$USERP5= <user>
##$WDW= 1
##$XDIM= 8192
##$YMAX_p= 0
##$YMIN_p= 0
$$ End of Bruker specific parameters
$$ ---------------------------------
##NTUPLES= NMR FID
##VAR_NAME=  TIME,          FID/REAL,        FID/IMAG
##SYMBOL=    X,             R,               I
##VAR_TYPE=  INDEPENDENT,   DEPENDENT,       DEPENDENT
##VAR_FORM=  AFFN,          ASDF,            ASDF
##VAR_DIM=   8192,          8192,            8192
##UNITS=     SECONDS,       ARBITRARY UNITS, ARBITRARY UNITS
##FACTOR=    0.0002076,     1,               1
##FIRST=     0,             0,               0
##LAST=      1.7004516,     0,               0
##MIN=       0,             -169455,         0
##MAX=       1.7004516,     236845,          0
$$ Real data points
##PAGE= N=1
##DATA TABLE= (X++(R..R)), XYDATA
$$ [...]
2452b401K060K041J368O51p38j930k241j744o58M28J733J898J988R91N1j714j595
2469A88k020j482M2P69J559K021J920O57l63j553k289k072r06N12R83J925K202
2486B093R86M63j102j885j661j334j002J69J787J868K362N30j48j261j785k110
2502b030j730J11J195J811K355J334M56m19j535k363j680q39K00J290J544K467
2518B167J109K37r69j887j968j733m64N71J541K336J893O22k60j403j786k230
2534b224j106p3J167J693J970J924R5o18j433j771k162j201N11J484K237J705
2550B198J081nj052k044j726j587m72J061J715J609J506J235k47j550k000k090
2566b368j086M16P51J820K084J432L79j007j533j850k177l66N35J721J875J716
$$ y = [-2401, -341, 1700, 3068, 3719, 2981, 1051, -1190, -2934, -3592, -3164, -1431, 467, 2455, 3446, 3497, 1783, 188, -1832, -3314, -3272, -2503, -944, 1077, 2997, 3654, 3291, 1738, -551, -2623, -3529, -3017, -2034, -109, 2093, 3079, 3542, 2440, 555, -1106, -2440, -3442, -3273, -1486, 382, 2744, 3274, 3126, 1865, 80, -2030, -3760, -3649, -2454, -643, 1712, 3046, 3502, 3083, 1548, -815, -2495, -3334, -3134, -1844, -300, 2167, 3276, 3513, 2544, 657, -1311, -3044, -3508, -2937, -1396, 940, 2833, 3455, 3195, 1792, 6, -2224, -3330, -3403, -2236, -543, 1427, 3351, 3446, 2828, 1395, -376, -2538, -3739, -3228, -1744, 493, 2198, 3279, 3274, 2222, 178, -1548, -3135, -3607, -2546, -831, 778, 2284, 3519, 3272, 1722, -278, -2368, -3454, -3038, -2287, -467, 1617, 3049, 3428, 2421, 888, -962, -3139, -3505, -2970, -1249, 626, 2342]
2582B342O91J78j303j589j790j934j98R65K057K066J367N68o44j883j740j709
2598b556n13P8J147J695J781J416O36j166j483k241j616q38O39J557K031J806
2614B373J142l11j241k186j914r41k54J286J238K236J410L45n70j387j883j581
2630b238j017Q5J186K151J632J439j88o95j896j844j574n84Q44J793K067J224
2646B385Q89k46j261j931j912r87j95P48K017J635J808N93r28j934k175j223l46
2663c063J94J215J857K003R51q3j121j469j766j636m24R22J266K393J106J211
2679C556n65j332k159j768j063K11J061K211J547R35M13p22j465j825j679l26
2695b970M53Q99J785J932J295j46r42k409j872j020J7Q11J650J712J500M02n21
$$ y = [2342, 3033, 3211, 1908, 319, -1471, -3405, -3603, -2638, -581, 1485, 2852, 3420, 2776, 893, -847, -2556, -3069, -2991, -1844, -149, 1632, 3048, 3684, 2518, 1035, -1206, -2822, -3660, -3021, -1464, 567, 2373, 3515, 3204, 1963, -223, -2137, -3078, -3332, -2046, -808, 1428, 2838, 3183, 2613, 1226, -657, -2238, -3255, -3170, -1984, 167, 1799, 3238, 3050, 2355, 459, -1385, -2959, -3543, -2699, -906, 1161, 2385, 3274, 3028, 1767, -164, -2076, -3063, -3258, -2510, -493, 1142, 2950, 3543, 2615, 681, -1494, -2717, -3063, -2869, -1654, 203, 2206, 3157, 3074, 1953, 484, -1282, -2918, -3342, -2420, -1154, 1239, 2345, 3556, 2991, 1659, -500, -2268, -3331, -3120, -2059, 152, 1699, 2634, 3047, 2325, 860, -965, -2644, -2970, -2517, -1618, 167, 2099, 3394, 3248, 2306, -103, -1975, -2995, -2978, -2167, -517, 1195, 2695, 3097, 2576]
2712B576j645j454j625j055n1J206K066J825J321J02j121j488k145j429o45J024
2728b538J765J631J652L36K34j431j737j586j730N90N60J658J746J318R74p07
2744B735j729j649k045o03N64J098J830J573J288L0q99j929j653p38q98M84J407
2761a134J861J768P10k07j419j921j864r16R8R24K173J511J174L80o87j424j922
2778h95j663o49L83J089J958J446J413O6j059j901k087q12j06L77J543J939J537
2795B579N08p73j098j555j595r89O2P75J857J942J502k8j316j168j892j158j068
2812c415N73J511J947J562M22R6r92j799j776p22o43J191J354J580J505P18o97
2829B415j342j875j661m45K42R86J666J834J224M5j142j548j545j173p11M59J423
$$ y = [2576, 931, -523, -2148, -3203, -3254, -2048, 18, 1843, 3164, 3266, 2145, 657, -1488, -2917, -3562, -2538, -773, 858, 2510, 2846, 3080, 1649, -88, -1674, -3404, -2814, -2254, -596, 1150, 2468, 3442, 2735, 1006, -643, -2688, -3291, -2727, -1629, 201, 1774, 3062, 3092, 2193, 264, -1389, -2127, -3025, -2541, -1134, 727, 2495, 3205, 2998, 1579, -342, -2206, -3122, -3024, -2100, 73, 1584, 2758, 3138, 2451, 1027, -895, -2558, -3207, -2824, -1735, 223, 1669, 3082, 3148, 2089, 188, -1899, -2711, -2817, -2440, -897, 1042, 2579, 3087, 2314, 1216, -339, -1934, -2923, -2861, -2086, -229, 1713, 3215, 3187, 1871, 703, -1189, -2347, -3415, -2842, -1331, 616, 2178, 2600, 2696, 1704, -95, -1871, -2593, -3236, -2045, -691, 889, 2394, 3112, 2415, 1073, -802, -2463, -2908, -2666, -1680, -14, 1820, 3044, 3089, 1947, 399, -1146, -2319, -3030, -2571, -1148]
2846a148K032J182J230k04j821j752j305j172n8J394J621J401J202J92m87j361
2862I46j741j688r51N46J387J751J668J001j4j166j564j306j860r7Q81J305J807
2879I05J452P11p38r83j722j374j223O1N78J831K080J019N82q36j674j529j790
2896b650o4j8J885J634J147R86k88r11j424j717j482M4N33J815J721J346Q03j007
2914B353j555j674j214p01L01R22J677J235J515L64j182j234j839j470m77L44
2930b635J256J851J849N11j84j543j758j255j036J99Q91J586J466J252L9l79j167
2947I43j599j399q46L65J009J763J693R86k40o31j614k218o19n29O99J609J526
2964H98R87O18j13r80j726j134j154j83R46J497J520J424N06j025j512j762q91
$$ y = [-1148, 884, 2066, 3296, 3092, 1271, -481, -1786, -2958, -3016, -1622, -1, 1400, 2602, 2794, 2307, 946, -795, -2483, -3434, -2888, -1501, 250, 1918, 2919, 2905, 1739, 175, -1131, -2991, -3088, -2207, -902, 905, 2357, 3068, 2330, 1347, -375, -1749, -2972, -2911, -2333, -502, 1578, 2597, 3179, 2343, 669, -860, -2650, -2714, -2732, -847, 787, 1934, 2920, 2632, 1721, 297, -1420, -2902, -2858, -2325, -510, 1211, 2557, 3360, 2353, 798, -876, -2090, -2791, -2490, -1568, 109, 1344, 2859, 3223, 2041, 807, -1032, -2502, -2979, -2635, -1379, 472, 2321, 2832, 2648, 1105, -653, -1908, -2944, -2745, -1854, -268, 1198, 2450, 2489, 2110, 943, -656, -2055, -2901, -2536, -1527, 236, 1929, 2915, 2675, 2044, 430, -1788, -2407, -2936, -2237, -628, 898, 1885, 2503, 2390, 1410, -316, -1450, -2604, -2787, -1841, -344, 1176, 2600, 3106, 2081, 569, -1193, -2084]
2981b084n76L94J412J211J390Q69Mj125j144j733r31k51K04J811J391J537L31
2998B710n40j000j877j401n83J34J119J615J073R39M16o66j616j394j275j63K82
3015b227Q78J517J832J151p66q72j415j774j093L83P71J451J411J259q5m71j345
3032F05j317j039p22K03O96J616J530J181k12p93j299k006j289M88N53R82J758
3049I35J326qn8j126j541j198j241K32J041J473J545Q35L56n51j449j499j534
3066b462m6J66J300J574J187R95l28j194j071j332p67m54M66J235J393J433N39
3083B634o33r26j861j132p38J61J171J443J464P37N70j168j268j444j062m51K96
3100b207J288J567J346N95k24j059j372j512q16nM06J949J292J268o1l80j371
$$ y = [-2084, -2660, -2266, -854, 357, 1747, 2616, 2620, 1495, 351, -1382, -2313, -2564, -2360, -549, 842, 2379, 2710, 2170, 1170, -707, -2108, -2691, -2557, -1438, 177, 1250, 2189, 2605, 1939, 323, -1071, -2346, -2509, -2227, -1349, 168, 2000, 3151, 2385, 1513, 98, -1676, -2769, -2386, -1615, -164, 1247, 2506, 2421, 1950, 605, -712, -1751, -2473, -2270, -1574, 42, 1572, 2753, 2541, 1748, 449, -1557, -2846, -2358, -1805, -823, 935, 2261, 2253, 2195, 1069, -472, -1670, -2911, -2679, -1638, -165, 1380, 2215, 2571, 2020, 571, -928, -2462, -2508, -2342, -1042, 532, 1719, 2714, 2386, 1192, 121, -1211, -1978, -2432, -1966, -731, 662, 2095, 2634, 2001, 1075, -786, -1918, -2656, -2495, -1324, 119, 1583, 2320, 2890, 1722, 454, -990, -2052, -2503, -2207, -919, 648, 1994, 2589, 2365, 1306, -66, -1578, -2394, -2399, -1993, -44, 1248, 2516, 2455, 2075, 704]
3117G04j488q94n75j2R76J142J686P55K23j029r15k073p25l30N86J359J368J345
3135B103M46m06o63j859j449p95L11P57J649J039Q70N57m89j106j888r61m46J96
3153b134J008J555J394Q33l06q20j572j132r76k70O66J094J318J152M98l81q88
3170A039j471j348o93K24R16J414J210Q16L29q99j259j205j224m98M75J515J005
3187C46J382R25p54q12j310j249q47P1M27J487J308J200M0m00j145j660j114l81
3205b486J44J038J528J131J025j75p03j311j405n51n84M59J113J763Q57Q76l88
3222B331j221j447j414o63M76Q16J141J056J149J4l33j490j224j112m32P24O89
3239i40J232J295L05L45j129q35j717q28L68N32R84J121J244M13k96j071j750
$$ y = [704, -784, -1678, -2253, -2265, -1289, -147, 1539, 2294, 2517, 1488, 573, -1500, -2225, -2555, -1969, -610, 758, 2103, 2549, 2143, 1480, -379, -1828, -2623, -2312, -1555, 94, 1133, 2003, 2560, 2071, 965, -923, -1884, -2330, -2134, -1126, 429, 1823, 2656, 2350, 1530, -42, -1174, -2150, -2420, -1754, -660, 658, 1810, 2308, 1927, 1039, -432, -1780, -2473, -2249, -1333, 81, 1291, 2107, 2436, 1537, 278, -927, -2151, -2649, -2174, -659, 346, 1728, 2653, 1899, 1087, -223, -1472, -2319, -2248, -1821, -334, 974, 2174, 2214, 1814, 669, -991, -2105, -2486, -2342, -1304, 224, 1355, 2380, 2205, 1502, 191, -1214, -1765, -2349, -1890, -777, 986, 1843, 2719, 2331, 1110, -337, -1751, -2414, -1938, -1122, 19, 1075, 2224, 2238, 1905, 415, -809, -1921, -2353, -1629, -940, 292, 1587, 1892, 2237, 1108, 273, -1444, -2272, -1904, -1372, -388, 733, 1977, 2390, 2094, 1023, -727]
3256g27j060n40L38N59J177J677O00k38l96j134j190r79o15Q33J010J331J092
3273A738N51k32r18j107j586o93R1R03P80J444R63M24n66q76j525r38o56m7J430
3292h20R71J172J169o05m16j354j250n49k44K53J189J223J081K39j73r44j405
3309d63j323n59K08O88J273J410O39k1l29j231j205j148k12L94J064J176J264
3326A625L44n0o91j531j070q58K77K16J320J276Q57M72o71r31j067q99o86M3Q81
3345a143J189J264O72k7n79j173r72q81m87M63Q01J521R72K94n6o53j563q13j111
3364b282kJ203P21J472N63N21o85r00j373r79n5j7P98J214J168N94l3o99j527
3383b98p60p28k51Q15Q30J024R28P26l53j343j034j046l60j40J045J067R72N59
$$ y = [-727, -1787, -2327, -1989, -1430, -253, 1424, 2024, 1786, 1390, 256, -934, -1913, -2528, -1695, -685, 646, 1738, 2289, 2057, 1139, 32, -1554, -2247, -2156, -1253, -473, 971, 1934, 2358, 1792, 916, -609, -1547, -2203, -2250, -820, 151, 1323, 2492, 1887, 1471, 117, -1133, -1682, -1926, -1673, -484, 739, 1820, 2059, 1886, 942, -463, -1786, -2345, -2137, -1449, -176, 1234, 1873, 1852, 1523, 292, -913, -2061, -2273, -1879, -815, 361, 1625, 1969, 1919, 1228, -303, -1373, -2231, -1954, -1738, -418, 858, 1715, 2187, 1516, 585, -482, -1381, -2067, -2024, -1143, 46, 1310, 1982, 1955, 1376, 203, -769, -1650, -2137, -1674, -873, 648, 1620, 1914, 1858, 1205, -358, -1171, -2282, -2284, -1081, -360, 1112, 1675, 2196, 1511, 611, -762, -1741, -1796, -1813, -1015, 199, 1367, 1961, 1928, 1229, -298, -1058, -1786, -2037, -1222, -392, 632, 1560, 2286, 1933, 590, -444, -1490, -1850, -1990, -945, 122, 1094, 1653]
3401A653R3k85j286n51j622o4J67J245J305N50M06L39p44j049j527n15K19M03
3419a263J034J024P88N54o98n99j426p48n25J73M59J359J073O50O2n72j014j237
3437i06p20k77L28J080J160J082J58j18q06j273r44p85J75M80J407Q87P09J61
3455A798l95r00j469o14k87K02Q79R95R53Q68l10o02o57j669o86p9N54J248O58
3474D87J244N5q2p83j361q82l29J1N93J212R47M88K71q99o48j065q75l92M21J032
3494e55R38R79N37l06p91p01j297o81N9M06J181J072P87R4l63p03j025j133j13
3513a615p9R67P88J042R66l0j242q60r62o19r0M88P96J168J081k87J09j165o21
3532a65j200j34j82O98P96J292M47K52l19j131r40j158j90O26Q59P69P94N05k5
$$ y = [1653, 1746, 1461, 175, -376, -1998, -2062, -1895, -650, 655, 1205, 1611, 1950, 1206, 157, -1370, -1885, -1666, -1263, -229, 795, 1583, 2137, 1439, 840, -586, -1334, -1859, -1686, -1227, 132, 1205, 1855, 1917, 1345, 331, -906, -1626, -1903, -1575, -495, 665, 1747, 1905, 1787, 981, -292, -1236, -2021, -1846, -1366, 41, 928, 1637, 1798, 1403, 503, -966, -1580, -1867, -1665, -786, 209, 1162, 2030, 1720, 1118, 461, -1208, -1894, -1973, -1419, -171, 487, 1731, 1786, 1704, 921, -440, -1322, -1651, -1640, -1047, 165, 1112, 1600, 1871, 972, 324, -741, -1616, -2008, -1587, -555, 383, 1362, 1899, 1593, 802, 101, -1196, -1877, -1818, -1412, -231, 841, 1628, 1722, 1359, 656, -369, -1502, -1615, -1694, -727, 61, 1103, 2069, 2039, 797, -63, -1025, -1644, -1734, -1246, -450, 718, 1799, 1512, 1621, 456, -165, -1365, -1499, -1681, -983, -187, 1105, 1552, 1804, 1485, 354, -586, -1744, -1934, -1308, -449, 320, 1114, 1619, 1594]
3551A594l85j391r53l76j32K20Q39J533L84M04j51r13j408p33n43O76M69Q92J293
3570A319ON40j022o39o94r07l56R2J042Q62O33R58m38n98j054j142l83J96M99
3589a086J071P94N76Q6j34q52q98o14o54L26N49Q72J079L39K80n55j159r00p71
3608a651L3L80P59R79O88J95L03r62p23j022n13K42K24R12J137P09k91k54p11
3627D34q02r33k49J18J004O88J086K9nn68j057o67k70m10N09O74Q02R33J8j49
3647A185p58p74r68j49Q7N98Q85P47N94J22m37j043r83m69j58M34M00J109Q06
3666A228O62p63l65p45r63o94R4Q55R19Q57M07j29l89n69q87n69p37N68O58R10
3686C48O12P79o23j88j059o00n93k79K58J223Q25O31J00k20o17q33r16k2j26M63
$$ y = [1594, 1209, -182, -1135, -1511, -1643, -1423, -584, 949, 1333, 1737, 1586, 673, -735, -1468, -2011, -1335, -866, 26, 1319, 1325, 1865, 843, 204, -490, -1397, -1753, -1661, -619, 243, 876, 1834, 1396, 798, -256, -1398, -1781, -1585, -1086, -15, 779, 1355, 1441, 1307, 455, -443, -1057, -1711, -1385, -836, 36, 1115, 1454, 1734, 1179, 20, -880, -1651, -1618, -1238, -479, 500, 1188, 1383, 1686, 724, 1, -1021, -1534, -1292, -1068, -156, 981, 1690, 1399, 1145, 434, -368, -1301, -1550, -1432, -428, 260, 1346, 1375, 1370, 802, -255, -922, -1192, -1602, -1093, -419, 383, 1316, 1334, 1185, 427, -347, -1315, -1464, -1377, -779, 106, 853, 1447, 1569, 1132, 89, -894, -1363, -1521, -1087, -687, 422, 1228, 1890, 1127, 762, 17, -946, -1640, -1546, -691, 228, 1085, 1492, 1363, 974, 405, -482, -1051, -1788, -1220, -562, 348, 960, 1739, 1116, 928, -131, -731, -1324, -1603, -1345, -122, 703, 1334, 1434, 1214, 597, -236, -1152, -1174, -1300, -837]
3706h37P30Q40N65J91l96p46r10o04m06O6J372P41P33J83k80r14m43q51m64K42
3726a188N9J070P46O86J05m99o30j186o3o25K04N96Q85P28N1N00j004l64n57p76
3746a262M5O1Q44P32Q14L11k45n67j108l07n60k43N59P23J021K56J43j86p44q90
3766f03p08j3K4P23P31Q24N32l07l38r74l83p40k16P02N59O55P33P6q9n96j119
3787e27l29m72J96K85J089O24J90K99m96o66m50p25n25N44J046L87P03K41j61
3806A253n46q55m72n41j90O92L73Q91K08M15l06n43q66j036J31L13L26Q70R44
3825A061R7P2m04o50p97k95k35p3Q34O49N48O11l59o14r13l77k99j06K34Q74J085
3846I43J11R1k23n36r06n28o7M1M07Q69N71L41L36p58p15r49j40k11P82P79K76
$$ y = [-837, -107, 733, 1298, 1489, 1093, 347, -563, -1167, -1573, -1507, -135, 606, 1339, 1522, 1242, 328, -115, -966, -1430, -1188, -1129, -59, 687, 1373, 1478, 979, 349, -837, -900, -1525, -1321, -725, 160, 888, 939, 1439, 435, 71, -486, -1262, -1217, -1156, -312, 420, 1234, 1545, 1300, 733, -375, -682, -1242, -1485, -926, -203, 818, 1074, 1217, 1031, 287, -603, -1311, -1324, -1300, -577, 154, 978, 1510, 1203, 865, -109, -492, -1232, -1448, -746, -187, 468, 1201, 1277, 1188, 592, -527, -856, -1328, -1132, -847, 242, 866, 1056, 1355, 859, 193, -257, -982, -1507, -963, 83, 470, 1173, 1414, 1253, 707, -148, -620, -1161, -1351, -659, -286, 605, 813, 1228, 922, 379, -487, -1523, -1392, -1079, -753, 117, 1061, 1158, 1230, 826, 176, -621, -916, -1151, -1224, -390, 259, 807, 1418, 1059, 445, -468, -845, -1144, -1250, -1016, -142, 943, 1054, 1145, 922, 386, -520, -1048, -1115, -1074, -667, 202, 773, 1114, 1450, 692, -23, -972, -1112, -1323, -541, 238, 514]
3867E14M35L78m97l76q09p98k85l0O01J044P79N3K33o96m63r36k67J89j31O69
3887c93Q60N87J66j76p26j26j061k63J70K32Q01N25J73M83l69n06p42p78k1L02
3907h62J64J117L96N37k00o02o34k78o58j16M71M44O07L09M42k69m22o59p75J35
3927h53k44L10J019O20J43K59n41n24q08m79J37o9Q04O62N17L55j51n67q08o06
3947h24k58J15K17O51M53P59J00L2j160o85q2l71R3L12N28O63N53k12r7m51j087
3968g51k46l55M35M56Q21N24K65l39m49j069j8k17L4J51P79N51L27J54k02l39
3988E12j052qn10M37K42L79P34M12k57l07n63n90n41K73K13O35K28L75J19K87
4008A018m83o52o87k79L34J92O87N27L94k42j41o20m78k86k46J22O98K56M70P05
$$ y = [514, 949, 1327, 830, 454, -355, -1153, -1438, -1468, -867, 177, 956, 1009, 1242, 546, 83, -853, -1120, -931, -1062, -393, 467, 1054, 1220, 1044, 318, 192, -869, -1132, -962, -730, 71, 596, 769, 1252, 883, 377, -365, -1143, -1164, -862, -698, 419, 815, 1352, 1152, 550, -84, -362, -1020, -1136, -665, -221, 386, 695, 1137, 868, 446, -213, -988, -853, -1097, -787, 232, 852, 995, 1254, 713, 189, -619, -1098, -961, -1030, -226, 436, 953, 1308, 1157, 590, -218, -824, -1082, -967, -750, -99, 354, 1113, 1213, 1245, 85, -600, -682, -1053, -960, -648, -120, 543, 1096, 884, 787, 336, -751, -997, -1352, -917, -461, 360, 884, 1149, 810, 361, -708, -726, -943, -909, -758, 21, 572, 899, 1053, 851, 512, -540, -548, -1058, -621, -379, 0, 734, 1146, 889, 582, 19, -571, -1112, -839, -626, 9, 237, 612, 731, 1018, 535, -117, -804, -1083, -749, -557, 130, 657, 1051, 809, 668, 48, -430, -716, -962, -840, -142, 114, 584, 1289]
4028A289j14o03p47m16j88l18N94J70R05M69l11j00m51o18k02k88J77J91P81N21
4048G41j05K06j94k58p30k99m34N75K50O23M70L03j32k21j043j47n17L6N30L45
4068aQ73j9j42j92k45o56l40j78L6M49O94M50M03k54n60j65r54K2j08R0N63P43
4090E09R0M7J88n86m61m04j45j85N24O38L11K15K07l06l49m37p44O6J80K08Q34
4111D00O3M98m66j6m16n47l41j86K99M18Q25K43K80n36k00n97O7q49J90O49K48
4132B6M35R0Q7j86j44o37m18k9QN80M70N33K74j80j96p40k64m08l05O49M13K60
4154C18O01K9m48o89J78o84j10L5L14M57P71p5M2k24o69l64j63m0K2M23N25L42
4176E91J90j48k56o65p0k46m01N57P08K50J26J55n69j73k91k79k43J20N64K78
$$ y = [1289, 1175, 572, -175, -591, -779, -1097, -503, -333, 572, 1041, 730, 630, 179, -439, -641, -929, -752, -561, 220, 741, 636, 842, 648, 390, -340, -639, -1073, -498, -248, 375, 845, 1148, 1016, 795, -248, -395, -912, -876, -346, -1, 872, 853, 711, 519, 274, -382, -722, -900, -864, -415, 279, 729, 1132, 878, 318, 153, -801, -779, -887, -797, -234, 509, 599, 646, 834, 248, -213, -617, -762, -947, -423, 215, 526, 741, 948, 642, 293, -144, -888, -822, -642, -434, 400, 463, 961, 495, 479, 63, -484, -825, -1011, -712, -294, 531, 774, 1054, 518, 318, -279, -212, -1061, -871, -222, 26, 461, 551, 638, 452, 308, -329, -747, -776, -768, -188, 282, 815, 1089, 909, 713, -27, -291, -699, -1004, -355, 58, 318, 919, 948, 500, -189, -11, -695, -805, -770, -456, 1, 772, 697, 739, 515, -154, -518, -681, -721, -699, -276, 249, 591, 781, 633, 377, -288, -358, -604, -1005, -448, 260, 510, 636, 791, 222, 49, -242, -521, -764, -644, -80, 198]
4196A98L85q2R7p0n23n88O2l02N33J58N90L17J22l53j59m51p29Q2l1M04O39N98
4218H97n7j85l06m69j86m45K84J94K55K66J10M96m34l3m76l49j27J02k79Q31Q5
4239A74J45K94j94k12l00o16j41M38Q4M60K42M66k00k04j52m84k70M7j5J76N87
4260C25K69R0l8n12k93m27k44J49O39k20O79J67M13o16n23j76l21q4K81K10M04
4281A72K98K92k22m83j91o44K57k01N08O0O55K05j8j79j89m21k61M2k28J69L83
4302DJ68M01R4l43o60R2j00k36L94k37O14rK46j15J42p11l99J38p8L20K35L28
4324B88J17K33k58j34k62n12N6Q8J5P27J34J33k21l49L3m75k41K17m8K97L91L23
4346E52ok35J35l95j90l79j16L01J94J21N00K7m5n62l56k26L25J30K88R4L64L34
$$ y = [198, 583, 501, 598, 528, 5, -583, -521, -823, -290, -132, 458, 775, 897, 544, 385, -66, -795, -713, -744, -340, 299, 897, 840, 655, 349, -120, -306, -751, -467, -273, -18, 248, 358, 854, 420, 387, -89, -438, -565, -463, -742, 89, 174, 319, 613, 419, 207, -93, -709, -850, -412, -328, 132, 374, 840, 640, 436, 284, -200, -470, -423, -438, -262, 325, 594, 684, 646, 134, -159, -586, -830, -681, -42, -262, 417, 584, 997, 381, -142, -318, -639, -723, -442, -232, 172, 470, 762, 540, 57, -134, -778, -521, -722, -214, -154, 501, 706, 688, 509, 320, -101, -362, -320, -548, -379, 4, 172, 573, 667, 324, -336, -244, -344, -580, -186, -423, 191, 182, 428, 313, 455, -256, -655, -517, -595, -275, -40, 288, 405, 638, 380, 246, -16, -528, -472, -384, -369, 358, 492, 625, 404, 55, 88, -387, -628, -411, -459, -162, 229, 552, 546, 311, 446, 51, -139, -518, -634, -333, -139, -18, 482, 509, 464, -98, -454, -680, -355, -225, 63, 157, 521, 855]
4368H55m49j21m8n13p5j82Q1L83N48j00q2N7k11k11m04L5n7J97K17N40K34k69
4390D25k01l08k15j93l09M44L96P7K51O6j31M6m48m24J98o4J70NL24J70M6o0o5
4413B00l84qN6j25j15K21O17N5K04k29j58n99k38q0O2K84L56N49j81k2k90k51
4435g6k85Q6K21p9o5N72j13J82p8l26p5k16k52K96J14L36Q5J54k40r5k91O1m21
4458e05K89J51N1J49J79R5J94n19n03j4K2j64K20N80l8L18o8K1n57j17J91k60
4480b85P4j08N4N22K13j75j03m26Q2J00n02K90J31M67j59L70p1n54j90j96q5L43
4502b08mK87J63J84k20K40p6o10n3k32L55K28mJ84Oj76K71m38k00n7j77J89K24
4525a24J59K70pj3k0j92q1l03j16M17q5M59k0l63K34m3m37R5n0j95K81K82K36
$$ y = [855, 406, 285, 237, -276, -351, -533, -452, -69, 479, 379, 297, 354, 143, -68, -472, -437, -494, -297, -80, 460, 694, 425, 224, -84, -299, -492, -801, -357, 39, 116, 367, 433, 302, 348, -100, -524, -326, -390, -220, -215, 109, 279, 325, 265, 200, -184, -192, -136, -261, -376, -155, 462, 517, 721, 492, 334, -265, -503, -583, -521, -237, 119, 668, 487, 465, 175, -76, -361, -275, -54, -133, -198, 374, 261, 443, 365, 39, -36, -252, -504, -208, -94, 242, 327, 481, 241, 146, -145, -84, -505, -216, -65, -14, 135, 314, 409, 603, 84, -419, -433, -411, -575, -355, 225, 187, 505, 437, 458, -99, -216, -25, -285, -211, -319, -265, 257, 470, 295, 192, -234, -152, -52, -554, -264, -133, 334, 175, 545, 474, -80, -270, -466, -551, -208, -212, 75, 238, 422, 202, 442, 366, -244, -297, -529, -174, 54, 50, 234, 240, 64, 335, -103, -303, -360, -537, -348, -124, 35, 305, 298, 285, 265, 73, -8, -311, -427, -10, -95, 364, 344, -19, 215, 172, -265, -170, -220, -415, -134, 148, 384]
4548C84k8j53o1k1l23J14k99M36p3J5O1J94J1j97j94L1J19k56L56j65NM79j85
4571B50m29r4j49L05q7k75K65N89j17K81p3j86l45p4j8k78J09L09K04j73j11J82
4593H5j16m01K62O2j80J93M06j88K91pm39O7m88Q1j19J44N97L0l14J99O5j50Q7
4616A67m84j80J68j29M05L41j02J30Kj68l85R3l19J74L02L2L61m00L51o47N80
4637B92l99j39P9J37K17j55J13R7R0l47j59K82k21k96K04K18K25j82J97J69k20
4658B02m51r6PJ4L3N14O6J26m38J37p8l23j4M4N9K71k18L53K02q7k21l47J02j35
4682b78k13M43OJ16J34j87J15k12m6K21p47K06O0L58K09K08j25k24Q2l06j95M70
4704I5nl96P60l37j23K30j09J46n02Q3PJ06Qp4L50k61K11k24J70k35O7j47J30
$$ y = [384, 356, 203, 142, 121, -202, -88, -387, 49, -24, -9, 52, 246, 257, 60, -134, -103, 16, -240, 116, -49, -44, 435, 250, -179, -273, -422, -117, -204, -479, -214, 375, 258, 539, 466, 280, -65, -139, -157, -435, -326, -17, 187, 14, -97, 85, -31, -432, -170, -108, -288, -95, 311, 123, 414, 407, -32, 35, -453, -372, -491, -347, 250, 280, -34, 165, 230, 80, 167, -317, -497, -329, -458, -53, 288, 186, 316, 318, 150, -235, -142, -461, -287, 15, 47, 408, 8, 359, -288, 292, -107, -246, -167, -30, 187, 32, 145, 242, 332, -15, -174, 108, -113, -409, -205, 13, 238, 56, 253, 422, 202, -249, -345, -338, -324, -291, 223, 289, 415, -23, 114, 36, -287, -301, -257, -198, 73, -145, 208, 410, 323, 102, -245, -143, -278, -491, -48, -42, 74, 208, 21, 136, -76, -122, 99, -648, -442, -382, -24, 185, 393, 268, 44, 126, -180, -375, 95, 90, -306, 454, 117, -6, 224, 115, 261, -241, -158, -151, -45, -37, -111, 239, -22, 189, -35, 135, -100, -33, -180, -50]
4727e0j2L55j13J25l22R3J62l49k3qj88L48j37K79m9k2m06O3R3O0J22J35O4j36
4751H4J37l32j74K17j74N7L50j69j64J58L23j17l39M14l83J41k48rk8J52K47K5
4773A68n4j74J14l90J21j1j18L67J05o4R8K99n19k3l26L89M1j31j8L33R5J56j39
4796C19M6l01n2j69j45J67M16m68K08Jr1R7m8l49lL16k87O76pq8m9m7j15k05P2
4821a06j04R4K09J27m3j13j7J11m52J93k38j62P36j08l05K25J35P5n41L13n08
4842d79K06J38R0J78J28r4k37L1j19J13j97q8K52P9K59j69N6j81J89l39N5j30
4864b59K26j56K02J74j08J13L4P3l88j75J85j59K24j54K36Q4j6k29J45J05r1k87
4886b21P4J3K68J06m24L71m49M3r1O6j0J97k18M10k09K49l05L86m20Pm75N65J04
$$ y = [-50, -62, 293, 180, 305, -17, 76, 238, -111, -134, -142, -330, 18, -119, 160, 111, 89, -317, -254, -161, -101, 21, 156, 220, 84, 221, -111, -285, -68, -242, -185, 165, -4, -168, -10, 313, 196, -143, 271, -112, 29, -219, -228, -256, -104, 143, 168, 114, -60, 54, -336, -215, -226, -344, 23, 128, 64, 162, 461, -58, -81, -407, -18, 23, -108, -126, 207, 302, 458, 319, 365, 64, 12, -157, -302, -135, 281, -187, 21, 22, -69, 28, -20, -369, -372, -56, -343, 333, 326, 238, 189, 142, 27, -178, -106, -210, -116, 93, 220, 177, 64, 47, 158, -294, -101, -339, -501, 235, 127, -178, 47, 182, 257, -284, 29, -479, -273, -135, -45, 133, 261, 167, -70, -39, -158, -45, -242, -330, -78, 1, 260, 91, 147, -34, 155, -184, -129, -259, -33, -189, 13, 187, 79, 192, 226, 299, -89, -264, -79, -238, -14, -168, 68, 152, 136, -93, 52, 157, 66, -221, -147, -134, 134, 240, -184, 187, -262, -219, -310, -244, -254, -57, -275, 135, -74, 175, -130, 256, -164, -157, -632, -67, 37]
4909C7j05K45j11j05J68m78J69j93L13k63K05K27p8Q9k6k12n4j77M43l37J30p4
4931a87K98P0l52K60l8j40j86p8M98j92K71N5p2P8k66k65k05M49m40J95K23L44
4953C20j35j26N4r6j73N4m82M38J16q9K82j77K65mj48k73l93M32m5J31J72O7P7
4976B67k36J50p1l69o9L73k86m8M95O0No8k07j48j8J46J3l63N71k19o0K73k83
4999i2j50J39K47l22j91N80l36M18j43j16j50j34k9l25K39K54J8L31l5k5K89q06
5021c39J60j1j98J7J7N19j42L09j79nm30M0R1k9J00K47K06m71J14K8M0n9q6J56
5045I5n80K34K84J66J99n11J89ok19k1J42m2j36K90L62j75k45K10l24j71N2O7
5067a40L43l83L42O7J36R1l64j44l31j6J44R8J67K82Ql57L68l96m48K56J91j29
$$ y = [37, -68, 177, 66, -39, 129, -349, -180, -373, -60, -323, -118, 109, 31, 120, 94, -118, -172, -349, 94, -243, -113, -187, 111, 181, -171, 89, 51, -89, -275, -353, 145, -47, 224, 279, 207, 285, 19, -246, -451, -2, -442, -247, -24, 320, 185, 59, 113, 17, -156, -102, -584, -146, -30, -119, 163, -14, 251, 247, 99, -174, -567, -135, -180, -49, 123, 190, 267, 31, 181, 110, -259, -328, 45, -241, -289, 206, 266, 271, 203, -4, -152, -170, -24, -11, -374, 197, -22, -82, 191, -92, -242, -103, 144, -178, -369, 211, -125, 293, 150, 34, -116, -250, -279, -604, -365, -111, -93, 238, 203, 178, 467, -339, -179, -190, -388, -371, -354, 165, 23, 332, 153, 148, -282, -242, -151, -180, -80, 167, 373, -98, 16, 44, 84, 25, -61, 95, -485, -251, 33, 199, 398, -113, 76, 70, -149, -170, -28, -70, -206, 84, 446, 271, 26, 236, -88, -259, -207, -140, 203, -180, 162, 229, 365, 456, 92, -52, -383, -399, -255, -157, 10, 292, 300, -57, 311, -85, -533, -277, -86, -215]
5089b15R4L02j47p4J67J83l20J50l82K64l50M75J30j68R8J70k04n52L85m68M20
5110d2J0J91J07R0j25Q8k12l24l44L90j72K90J86K4p7R0Q9k64l34o3K29j33P4
5133b32N28Q3m77L60m15n7J54J0n1k8K21J38r6J13r3R8k69j59K14j07j03J69J8
5156A9K51J78o22K02m88n8L16k15O20J3l3J31j6n33L9m1k2J3L27k5J17K18q7k23
5180H1k19j30O6K61m93L29J81K27O9k19n2mr7l01j82Q3O95j05J33j55j56L18l78
5203d8j19J42k10J12N57l14J30j03n8l41J80j49m3L65l21K11k5M85m1l89q6k16
5225b81K73J36m65M84R0j59J81k01L4k08k5m09L41L99O2J49j70K70q19J21R2j78
5247b83j34N62l71L38K00j45j92J09k84l99K67Q6J25K20L23k92L09k64o8j65k8
$$ y = [-215, -121, 181, 34, -40, 127, 310, -10, 140, -242, 22, -328, 147, 277, 109, 207, 377, 173, -379, 6, -462, -42, -32, 159, 266, 356, 231, 319, 107, -217, -561, -171, -343, -53, 133, 157, 80, 170, 259, -5, -339, -402, -173, -306, -232, 296, 379, -98, 262, -153, -210, -56, -46, -97, -125, 96, 234, 138, 251, 158, 256, -13, -172, 42, -65, -168, 1, 19, 270, 448, -174, 28, -460, -518, -202, -417, 203, 216, 183, 314, 298, -235, -196, -237, -259, -246, 81, 56, 173, 391, 304, 81, -138, -268, -202, 59, -434, -105, 76, 303, 372, 153, 101, 97, 0, -301, -483, -400, 295, 190, 323, 168, 12, 330, -48, -167, -25, -235, -123, 434, 120, 250, 147, 89, -252, -72, -221, -264, 101, -220, -9, -34, 451, 410, 21, -65, -281, -8, 128, -337, 147, 237, 78, 259, 58, 92, -116, -141, -550, -209, 190, 252, 401, 231, 501, -318, -197, -105, -283, -417, 145, -226, 112, 312, 167, -25, 84, -200, -599, -332, -246, -121, 99, 422, 130, 439, 175, 107, -58, -86]
5268h6k96L88N8Q1K24j63k93Q0k01l42L85K1r6J03J16M14l37M7j72j42k17L48
5290h0j37J69M53m18p8K09l7J26l44j14j03K76j32N71j36OQ9k77Qm31J00Q4J08
5313h8J13J14Q5l5l5r4q8j70m8J76K00j21M34l06K03j58k1n45J64l22M04P9P4
5336A5K30o3P2q5k97J81r8l73K71J36J38P0J20l03m8j83k08L49k30R1L80j01Q9
5359A53l6K60n68ok35J9K55KM73L9L5K8j82p39L55k26J99L06j0O3j72M2q6o1K69
5384A77l97J1J01k7K91K84l77L18j66j59n76R2J81N8M10j59Q8n6J15j40k99O4
5406a66k7J53r1rJ55L26J24n37n8j1J81m45J93P15m07L26j42j34J5k54Q5l69K88
5429h9o7K64L04j01Om4o9J58n27l34M63K22j28J97P9K72j91n61m43L26R6K62J96
$$ y = [-86, -382, 6, 64, 145, 369, 206, -87, -7, -208, -550, -165, -144, -240, -137, -21, 393, 56, 103, -69, -211, -428, -80, -217, -48, 405, -13, -91, 118, 81, 207, -137, -251, -354, -78, -210, 361, 225, 231, 320, 43, 51, -380, -280, -196, -88, 25, 139, 224, 189, 154, 60, -28, -198, -246, -70, 130, 9, 443, 137, 340, 182, 161, -384, -220, -542, -138, -59, 15, 245, 182, 254, 169, -128, 53, -45, -418, -147, -11, 127, 197, 317, 14, -34, -217, -425, -76, -306, -215, 165, 64, 153, 117, 377, -191, -197, -432, -413, -158, -156, 317, 356, 391, 419, 237, -502, -147, -373, -174, 132, 122, 185, 13, 55, -31, -92, 177, -220, -209, -108, -135, 156, 440, 63, 381, 215, 56, -520, -428, -247, -189, 221, 62, 150, 94, 209, 69, -230, -166, -193, -40, -131, -140, 15, 341, 465, -72, -130, -141, 40, -405, -212, 503, 96, 422, 280, 146, 161, -93, -8, -377, -89, -156, 108, 412, 311, 317, 273, 204, 362, -165, -499, -36, 186, 58, 255, 334, 606, 415, -146, -589, -263, -167, 95, 291]
5452B91l73L22R4r1j48j8j90m30L52k65M52O0K89J47J27n54j10k11J99k65J51
5473a71J89J79J02k63K27r5m47P7N0M7L26K25j74k7J48m25k53m4L10m2k90L99
5495D8R9K00j14r5j27k23j78k7K47J60J15K16Mj94j94o7K37m33J70P8j42J35M66
5518C81J02l90J05k66l03N19k87J37L15j30L5J3j68p3k09q5o0L94j21K96J00m14
5540a09N54l16j37l16N3K31k13L27M3L41q7J1n31l3Pj75K2L27j7M34J37l80L0
5563B03k06Lj38l31p8L04M63R2jR3m13J17n14J81J99K17k3K44m20K77j24n10J54
5586b11q6K39j4P9N14k45j93j0K80n35n6j39J61M31k94N71l85O8J36M5o67J77
5608a34n47M07M10J64J4q8l02J03j19r7K7k18K84K68K58JR5l76l42P9J53k24L3
$$ y = [291, -82, 240, 334, 243, 95, 77, -113, -543, -191, -456, -4, 56, 345, 492, 619, 65, -45, -256, -57, -322, -171, 18, 197, 299, 36, 263, 168, -279, -202, -152, -105, 221, 446, 272, 245, 393, -32, -285, -329, -19, -61, -351, 48, 147, 347, 233, 138, 11, -212, -390, -417, -170, -10, 105, 321, 325, 131, -63, -130, 107, -326, -156, -78, -220, -85, 381, 483, 93, 198, -68, -371, 148, -139, -2, 313, 183, 218, 231, 63, -10, -219, -304, -364, 30, -91, 205, 305, -109, 445, 129, -8, -324, -271, -40, -253, 74, 117, 458, 371, 382, -149, -182, -175, -350, -328, -1, -18, 416, 553, 173, 203, -3, 0, -138, -469, -547, -243, 220, 312, 311, 404, -9, 108, -406, -225, -26, 191, 168, 412, -8, 269, 145, -365, -211, -297, -58, -72, 7, 521, 276, 83, 73, 353, -182, -238, -377, -216, 215, -79, 492, 107, 175, 311, 356, -311, -134, -681, -274, 136, 300, 314, 226, -76, 27, -92, -189, -162, -380, -96, 172, 430, 431, 526, 150, -192, -113, 40, -184, -151]
5631a51N2p3L74K9K29k50K1l54j84J52j12j39N61R5J74pm69k65q3J09j38J88L93
5654A52p8j4j19j09L12r1m07M7J73K04j7nn3M51k40k52k28m9J24J87L2K47j47
5677A20K1N7p1q0k66N2j29J04L36M2k43M5J7J10m56N4M5J0K9K12J74j27RK20n34
5702b49K11Kl68K91K74K77N9l39k18O5Q9m27P6R4l39O97o3N0Qq6j56jk33j66N18
5727F6J9L22m15L47l65J47J37o65n3J92L0J45L15J29o1k08om66n4J87K04n7J59
5750D9L99k53k10K41ll88l86K54R1M27j19K60J35l61j95kN0j7j14K71Q7JJ70k73
5774A14M2Om25m34K63K88K07O9K2J95j50k06J77k86m18K28J49J15L11k2j3J42
5796C74n92L29m05l13N40J37Q5K61J33l14j79O1k58k48M29O7o1m4L85m9j2l73
$$ y = [-151, -99, -172, 202, 231, 460, 210, 231, -123, -307, -155, -267, -406, 155, 250, 424, 417, -52, -317, -400, -291, -429, -241, 152, 74, 60, -59, -168, 144, 53, -354, -307, -134, 70, 53, 48, -5, 446, 206, -46, -274, -323, -199, -12, 20, 267, 120, 141, 198, 127, 47, -219, -167, -296, -192, 144, 186, -57, -12, 5, 115, -341, -287, -242, -232, -203, 9, 183, 56, 65, 285, -249, -38, -36, -404, -113, 161, 438, 497, 158, -60, 5, 94, -333, -257, -163, -502, 195, 132, 182, 190, 104, -52, -53, -286, -452, 66, 85, 407, -8, 339, -26, 121, 258, -407, -460, -268, -238, -93, 222, 351, 290, 82, 76, -390, -444, -257, -53, -110, 49, 448, 195, -15, 226, 223, -165, -551, -297, -206, 221, 102, 362, 497, 136, -59, -61, -11, -28, -142, 129, 216, 217, 387, 114, 156, 162, -263, -697, -434, -146, 61, 130, 152, 347, 197, -9, 168, -118, -536, -308, -159, -44, 267, 245, 232, 374, -218, 111, -294, -607, -67, 70, 155, 416, 549, 235, 56, 117, -141, -389, 40, 107, 46, 2, 387, 338, 326, -47]
5818d7M1l78K25O8k6K07J67J05k45J45l36j17j06m0L88q0M9L83J00m6k63l49j70
5841c25K43j74Q0M09J64N3j53K42m93m47K02n9l8K89k48N78j75K59j81k88j12
5862a74nj97P2J66L04N03m45lJ96r22N67n80N07j47M13k5pj51m2l8j86j12J39
5885a67O0L8M22Q9k70K21k04j94q5n8n7K12Q7J66j34n2qm62K39K47k52J9L01k63
5909a05M96k42K49k47J7l59j03j00%K33J89L84l31J55K3m96j19j06J07M5J15L19
5931A24K94n84O55k57l70j09N1M3r1J98j57P08l05O3k92J17m15k0k0L76Q4L39
5953D32q7l49J83m73K82m55K29Q2M47K2k18K10j04l63j44K39j45k85N74l58N40
5974B59jk72K98k19j20k23J94M8Jj1K49K21l33j72pk30j22J88J55K09O1K71rl44
$$ y = [-47, -6, -384, -159, -91, -117, 90, 257, 362, 117, 262, -74, -191, -297, -337, 51, -29, 20, 403, 503, 457, 194, -155, -325, -82, -256, -176, 233, 397, 450, 297, 539, 46, -401, -199, -258, -296, -7, -255, 323, 148, 407, 226, -62, -174, -179, -376, -304, -138, 166, 669, 224, 221, 417, -505, 62, -518, -11, -158, 255, 230, 223, 72, 30, -8, -194, -306, -167, -107, -69, 353, 442, 172, 393, 189, -5, -90, -148, -205, 7, 94, 260, 126, 74, 66, -396, -157, 90, -162, -143, 158, -105, 391, 149, 398, 151, 168, -191, -294, -394, -394, -161, 28, 412, 81, 236, 259, -237, -356, -462, -355, -310, -195, 124, 418, -166, 489, 232, -138, -247, -196, -153, -244, -46, -203, 505, 200, 263, -29, 88, -327, -347, -367, 9, 93, 432, 345, -4, 179, -294, -12, -467, -238, -156, 291, 313, 95, 305, 201, -162, -306, -67, -212, -497, 77, -281, 259, 258, -14, 284, 65, -55, -278, -84, -36, -35, -46, 203, 424, 91, -81, -88, -318, -440, -252, -97, 112, 173, 444, 435, 91]
5998I1k27J44r8l08L11J65J36o2jJ70o10J75j49j96J85J26J42J50J86NM9k46k84
6021a46j39l4k1L98J28K92k12P0k74j20j61m32M72k61Q02m84N02l20K75k32j65
6042f2l23L05J05l63N11L48k52j64o5q4N4k20K15J57k09J72J34K04k14jl32j88
6064b72n2k1j46N87J95k24%L04m32q0l58K5M73rJ95j38M28l22k50K58l73m17J71
6087d58L05j2L69j15J65l2m4m7m04j31K94q0J32K15K37J0K14o35J26j38r3Rj26
6110b39K48K01J85l37J48n00N7j45J65K63k89L71L15j10k57k21j93kM19j80k1
6131a22M32k87K79k68L84o14K08m34N3N44m3O1j0J22p7j07j27m13J13p1J57J40
6153h0Q5K51N1k18J49l16n31N22j36K21J78Q3lP7j99j06l69M21n41L46j35L49
$$ y = [91, -136, 8, -90, -398, -87, 78, 214, 152, 151, 321, -289, -114, -263, -459, -274, -148, -6, 144, 330, 335, 384, 138, -146, -285, -319, -340, 58, 186, 478, 266, 336, 62, -58, -219, -651, -179, -440, 362, -122, 380, 60, 335, 103, -62, -385, -80, 25, -338, 173, 521, 269, 105, 40, -44, 10, -210, 5, 162, -47, 125, 259, 463, 249, 248, -84, -272, -324, -345, -491, 96, 291, 67, 67, 371, -61, -141, -499, -474, -1, -10, 185, 47, 475, 153, -97, 161, -212, -629, -458, -153, -165, 204, 89, 254, 222, 178, 131, -273, -404, -110, -190, -58, 157, 394, 404, 618, -17, 109, -29, -122, -113, -239, 9, 210, 395, 58, 206, -294, -237, -382, -217, 46, -243, 128, 443, 333, 76, -145, -338, -340, 79, -101, -122, 310, 23, 302, 34, 418, -196, 12, -422, -369, 175, 132, 193, 183, 305, 228, 121, -6, -419, -306, -377, -220, -80, 5, 256, 307, 89, 238, -78, -609, -87, -223, -2, 176, 259, 256, 333, 134, 28, -341, 80, -461, -115, -250, 99]
6175I9K4K11j88Ol39j19J36j51L52m19O13j01j44J51k05o0k56M2J84L3L00J45
6197C14k45m2Q1m07O0k35L20m3L92l1K75k82Pk13n5J10l20K07L0q0L44O2K4l39
6221f6O0K4k26N5k4k28N80J34r9J75m49j77M7O1Q4j48M07k7K11j47j24r3j08J56
6245G8j81k59L22K8J77kn7P7m10l3J91m0M4R6Ln7K84k97k93J12q7j03K50J67o7
6270e7L75j89J85j04m38j03K37j62K06L9J16P0m1o6J08n41R3o7L17L38l02L41
6292C55j37k12K06p9m98K75j60L3K78r7K62j62N4o0l11L89j77j55l2N3K67L4J77
6315C03n24J72n6r3q1l5L39J00RJ12j20j9l08J55l42K85K05m29N40M0K41m86r7
6338h9j23L1j45K08o2K13n6K71J05m80P8r6k98Q0L55K68k4QL34l38k49J12Q0n69
$$ y = [99, 123, 334, 146, 152, -187, -306, -170, -321, 31, -388, 225, 124, -20, 131, -74, -134, -390, -348, -164, -131, 169, 314, 69, 27, 108, -299, -239, -474, -154, -197, 195, 164, 439, 157, 164, -49, -104, 6, -314, -107, -77, -157, 187, 249, 273, -66, -6, 18, -208, -153, -177, -405, 175, 309, 210, 385, -64, -241, -194, -133, -49, -197, 210, 183, 394, 247, 123, 30, -78, 78, -103, -362, -40, -12, 165, 163, 106, 183, -227, -260, -69, -109, -65, 31, 34, -23, 261, -36, -329, -217, -304, -407, -157, 10, -57, 318, 129, 314, 210, -228, -331, -94, -256, -50, -11, 105, 175, 134, 68, 176, -365, -272, -339, -22, 316, 14, 355, 218, 6, 212, 133, -365, -90, -250, -217, 61, -36, 226, 64, 118, 58, -253, 136, -41, -196, -228, -175, 92, 126, 303, -221, -49, -105, -198, -279, -314, 25, 125, 134, 246, 126, 107, -201, -46, -388, -103, 102, -327, 213, 253, 494, 8, -89, -212, -181, -326, -118, -180, 33, -23, 248, 353, -127, -49, -145, -443, -363, -8, 260, 236, 244, 578, 240, -9, 103, 183, -386]
6362c86K18M2M7j36L20J37q7j55j72k2j26K10J14j6j2K37N8l04mj58R1j95M21
6385A22o6J90Kj97Q8j46l10q7j05L13L19J34Q6j3k13J60k96k79J14j18k5O03j6
6408B60R8J2j62j41r3l62L69p7K8K96k86L21m0k2l28K46j57P6l42J06j83M61K56
6431C36o8n7q2n22L11n7K26l71J69L20j46J52Om54L74o43N77j54j87O66k60J50
6453B86m17P3qn12L69J19P2R7j10L56j72l28J93m40N24m47l2J31L60Q9N1k81j75
6476b02K32m35q5P0J45J84K28k6M6k34o6P1j57mJ8L04K5k06K74r5Nk98o5L19r7
6501d9j52N34m6l29L74J1m15j88MK44K84m39J44N88j50j36Rj49m08M18k25J49
6523G3J51k90K89j50J07K7n09J09j64J07P3o5R3L04o9j47o3r0J94J55k18k40J24
$$ y = [-386, -168, -126, -79, -215, 105, 242, 155, 0, -172, -194, -320, -110, 4, -12, -24, 213, 271, -33, -37, -195, -104, -299, 122, 56, 246, 248, 51, 139, -7, -317, -404, -509, -196, 123, 257, 343, 330, 117, 277, -19, -298, -184, -302, -327, 276, 260, 358, 370, 208, 67, -26, -388, -19, -96, -68, 228, -58, 263, 223, 201, -127, 119, -38, 38, -304, -198, -381, 80, 336, 268, 211, 129, -393, -82, -139, 87, -284, -115, 205, 59, 211, 217, -237, 137, -506, 71, -83, -270, 396, 136, 286, -131, -58, -66, -578, -209, -90, -18, 79, -31, 325, 153, -175, 18, -422, 102, -345, -377, -246, 114, 203, 254, -27, -202, 30, -405, -490, -420, -275, -91, 137, 111, 157, -77, -143, -72, -229, -233, -215, 89, 114, -92, 182, 87, 92, -206, -271, 48, -49, -201, 333, 287, -42, 332, 343, -72, -260, -256, -12, 272, -167, -23, 565, 415, 279, 288, 139, -269, 149, -76, 73, 224, -66, 223, 73, 180, 207, -302, -193, -357, -250, -177, -242, -149, 155, 86, -61, -124, -214, -20, 135, -83, -323, -199]
6546a99K81K51l44K58m75j22Q5K82j69K15l7L79k23l66L02j88K07m31L14j8l6
6567c4J61Q9J81l37k7k67k49M80j41J91OJ1L03l79jm5n1l05L66j01K09j58L74
6590B76Qm41J66k05Q3k45J53R6K90q1m3k80L37k79M7j41R7j71L25m7n6L60J71
6613D20o71pNL68Om9j77K61J6l06L75l24L71k48j23k90M09j65N67k16k81M11p00
6636c48K51m36N23q7J84j29L11k05O7k47l3J54k33J5j0N51j87O1j62k23k2r0J41
6659a54j00K95J65k01l09N52L6l34J45K0l10K40j9K8o7L50j84k55k02L93j90j67
6681b68j22P63k61J86L3qo15K50J66k05oj02J9J94K99l13Q3k38L6J89j34j19j87
6704c60K95J52j33jK34p6j8n03NL27K1L02j34j65K94l4k13k96K96nk29M06l21
$$ y = [-199, 82, 333, -11, 247, -228, -350, -265, 17, -152, 63, 26, 405, 182, -184, 118, -70, 137, -294, 20, 2, -34, 127, 216, 397, 60, 33, -234, -483, -3, -144, 47, 53, 64, 367, -12, -13, -58, -109, -414, -48, -149, 60, -98, 276, 284, -157, 9, -196, -113, -358, -205, -109, 181, 100, 57, -223, 114, -165, -118, -259, -162, -333, -8, -55, -111, 249, 420, -251, -258, -253, 115, 121, 72, -105, 156, 172, -134, 241, -83, 288, 40, -83, -373, 36, -129, 438, 222, -59, 352, -348, -97, -533, -10, -97, 87, -42, 269, 64, 131, -116, -149, 5, -228, -213, -223, 328, 141, 202, 40, -183, -205, -295, -154, -254, 41, 206, 5, -304, 248, 284, -50, 95, 115, -195, 45, 26, 54, -13, 337, 153, -102, -304, 89, -101, -268, -390, 373, 112, 298, 331, 323, -292, -42, 124, -81, -87, -189, -170, 24, 323, 10, 93, -145, -109, 80, -54, -173, -360, -65, 87, -46, -47, 187, 111, 93, -410, -405, -78, -57, 245, 111, -54, 240, 206, -7, -303, -7, -12, -241, 165, -156]
6727a56K88l36M71l00J24k29J05Q8LJ30K15l34k63K64K67m71J29l21J95J80L6
6748H5k9mJ04k55n0j04j76M80L0L06j16K7J10l39k25J07j96k32O06n4K15Q7r2
6771B85p3r0k52k36K62R7j01l1J73k82M76j13K5l05o6K21J10k21l3J32l0L4J64
6794A46r7l72J99J17j32k8K27J62j09m96L42n1j38K97l16L66j56L5L4J51j47O7
6816A01j83L6N5n0n9K26n3k4Q1k33j23q6J87L4J44pK4p2k24J11J76m28L83k62
6840b46K38L48j81k69K64l54K26K88j62r2L1J9k50J42J20P6l16J69j57J9K10l72
6862b49K30l38M18J24j47j90Q8Lj87N16m61K34p0L68q4p13M22M8k02m61L75L80
6884A04j79K06J96j73k90m9N15m54L7M54m15r0L62k88j7L03k51J03j24n6j17L31
$$ y = [-156, 132, -204, 267, -33, 91, -138, -33, 55, 58, 188, 403, 69, -194, 70, 337, -134, -5, -326, -131, 49, 85, 56, 52, 156, -99, -149, -253, -429, 51, 81, 387, 271, 298, 408, 69, -156, -49, -245, -477, 129, 75, 290, 377, 285, 212, 122, -130, -366, -104, -7, -108, -139, 34, -248, 228, 115, 140, -165, -231, -10, 100, -121, -154, -22, -52, -18, 146, 49, -323, -124, -7, -139, -167, 60, 222, 113, -383, -41, -92, -230, 67, -249, 117, -39, -4, 30, 181, 34, 101, -82, -46, 9, -41, -100, 126, 73, 49, 130, -103, -226, -312, -125, -91, 53, 46, 70, -2, -226, -115, 61, -367, 16, -246, -8, 340, 159, -110, 154, -200, 26, 314, 152, 60, 91, 110, -140, 2, 122, 198, -118, 51, -106, -87, 123, -249, -19, -357, 61, 185, 38, -152, -64, -61, -248, 268, -193, 41, -29, 339, 255, -458, -36, 12, -190, -651, -276, 104, -75, 131, 327, 154, -136, -185, 330, -124, -87, 367, -48, -138, 224, -64, -81, 222, -29, 74, -50, -106, -223, 108]
6906A08k29P2q5K13Q8k55J43k16L71k81J09l1J5j03O3R3m49N48j16n06K72K72
6928I6J12n26J63N4K08k49J23J16k47L32N2j74Q9q3nj79n5K28J58j05k32j39J27
6951a36J75k00L06q7k35L37l51Q0ML88m42J80q3j48K48j85R4j01K98j6j09j02
6973h5J99k18O6M2j14K63J03k07N6p2k08K08j83L08j83Q7J75l31K37p9m7k62O41
6996C96p04J92m3J4J1K03j74K10pM8j70J51k44M6J32J8jk16k3L85o3Ql60L39q6
7021F2L70k60n13N6M73j03p5J10j88J12j3k66J89P9k83K34J50j20j01J25J7l6
7043A9K88m53K60K95j85k94j81J55O3O3j5J35k20L30l5l29M7l8M5K75j16L3j55
7066a3k09Q7J53q7J04J2j38LJ79q6k56K88m14M80P2j53o6k47M66J02m13M8K4J08
$$ y = [108, -121, -49, -134, 79, 167, -88, 55, -161, 210, -71, 38, 7, 22, -81, -18, 75, -374, 174, 58, -448, -176, 96, 208, -318, -155, -101, 107, -142, -19, 97, -150, 182, 234, 60, 149, 66, 61, -118, -173, 55, 213, 108, -124, -263, -136, 39, -161, 145, 58, -177, 160, -191, -111, -107, 281, -161, 19, -64, -212, 36, -149, -55, -156, 142, 126, 17, -85, 114, -104, -38, 4, -110, 153, 256, 49, 105, 33, -175, 33, -150, 158, -25, 62, 237, -94, 143, 64, 17, -245, 396, -308, -116, -159, -145, -134, 69, -105, 105, 98, 146, -24, 127, -117, -71, 61, 79, 78, -138, -161, 224, 161, 169, -191, 148, 62, 432, 172, -341, -285, 188, 85, 10, 120, -68, 44, 31, -235, -46, 33, -250, -16, 134, 14, -87, 38, 55, 19, 307, -146, 114, 409, 224, -70, -251, -96, -33, 30, 15, 150, -70, 260, 225, -104, -57, -95, -50, 225, 109, 142, -13, -222, -135, 18, -69, 35, 47, -91, -88, 91, 5, -251, 37, -377, 103, 175, 22, -44, -291, 175, 277, -136, -88, -64, 44]
7090D4J99o45J71J68J86j36kJ81l52J09O5j90J58J49j53J43J35j35O5j74L39n61
7112b36J79M32l2n27L69l18K97J52m93L97J5m5j26J4J91j30q0J38n02J39j45L65
7134E4o2j67K70j0j0K7j17J05j92J17N4j71R2j61j50L22j26L21P7m10P9J87mQ3
7158B08k57L14k84k9P1l43L41m9M9j01l0L60n23M52l3M3l79K31MP2o7q2K63r9
7182A32kl26J62J82l62O3K25N8k96K78Q9j74k23l6J83N8p5L25o2nr0r2k13J7J21
7207f3m0J28L1K3J3n5K4J42k49j21R8k28N6L95M7j27J04o4j83J56j51k31M71k44
7231f8L34Pj7k28J58l69J97P0j16N7J48K10m63J72P7j19Rq9q2p4J37qMk8J23J77
7257B19k96J53k05J45k4J00k92K08j67K98j68L19n96M34k06L0L74k88oJ56l72
$$ y = [44, 243, -402, -231, -63, 123, -13, -15, 166, -186, -77, -12, -202, -44, 105, -48, 95, 230, 95, 160, -14, 325, -236, -57, 375, 343, -184, 185, -133, 164, 316, -177, 220, 235, 190, 64, 78, 269, 139, 59, 197, -305, -166, -311, 54, -8, -175, 95, 85, 75, 102, -15, 90, -102, 15, 69, -102, -10, -171, -321, 1, -125, 196, 273, -137, -58, 129, 125, 208, -49, 265, -19, -48, 23, -320, 21, -28, 21, -80, -110, 250, -273, 179, 146, 189, -190, 41, 45, 117, 50, -32, 231, 132, 130, -196, -34, 148, -214, -151, 74, 132, -164, 114, 203, 29, -194, -230, -47, 11, -64, 261, 199, 194, 104, 12, -201, -184, -63, -103, 25, 56, 79, 92, 37, 61, 203, -46, -167, -69, -297, -241, 154, 201, 74, 178, 114, -69, 87, -64, -295, 176, -68, 266, 273, 256, 28, 186, -183, 14, 84, -32, 25, 173, 383, -80, 92, 169, 50, 59, -30, -112, -186, -49, -57, -53, -81, 42, 219, -77, 76, -129, 16, -8, 92, -200, 8, -159, 139, -29, 290, -306, 128, -78, -48, 326, 38, 32, 188, -184]
7278a84J78M82p62J55J97m0l0M5k35j82N44l25j9L03l7R0j07J5l4J69j88K71l39
7301c3QK3j06J83O0j46j27L42j77m6K08l98M9L64j12J30j7j24k8j04j04k66K70
7324a51K96k68j64N11K9j20m8nl98L57j6j43M26l62J49J59j29j98k40K33o5K56
7346A09m5k3k14L34n1J55j17J1j59k62M3O5L14l1j45J19J84l89OK33j87k83K28
7369a05J56j86L23m4j45J88m83L01k99J92K55j83K4K04j83J60m63J0L91l03J85
7390ep0K35k66L4p9J58jp8J7L4K39l26N24l00J37k32n6J86j36k60K32j16m3J10
7414f2K58k07K09r5k01j91J39K68k09J10L7j20J15j02JK42n41N22j92K57K32l62
7436A08j36N2l58P8J27M0K58j20p6R8j0j40R6l47L46J5j68K17k07J81P9j22q8
$$ y = [-184, -6, 476, -286, -131, 66, 26, -4, 41, -194, -376, 168, -157, -176, 127, 90, 180, 73, 88, 54, 223, 35, 306, -33, -25, -2, -108, 75, 135, -11, -138, 204, 27, -19, 189, -209, -160, 204, 92, 222, 205, 81, 53, -51, -155, -421, -151, 145, -123, -287, 224, 253, 133, 85, 80, -318, 39, 23, -120, 306, -56, 93, 252, 123, -75, -315, -82, -147, 109, 64, 41, -173, 161, 110, 265, 148, 159, 0, -262, -219, -154, 160, 129, -16, 103, 287, -102, -96, 137, -50, -333, -105, 51, -135, 188, 144, -1, 187, -296, 5, -294, -102, 153, -30, -6, 198, 15, 175, -288, -278, 113, -190, -5, -75, 160, -106, -72, -151, 7, 6, -72, -55, -21, 218, -108, 416, 116, 253, 21, -35, 151, 15, -245, -13, -129, -172, -62, 196, -11, 198, 103, -98, -289, -150, 118, -91, 19, 56, -64, 51, -51, -50, 192, -349, 173, -19, 238, 470, 108, -28, 24, -334, -256, -129, -89, 169, 49, -27, 71, 61, -79, 17, -330, 16, 31, -137, 80, -127, 54, 133, 11, -77]
7459g7N0J76m99R8k49N52n4J88k19J35j83o6K65k96J53L0K6J03k25M17k90j27
7481i2l1j68K27j49L05J05J69k77J79k86J70k73K3L2k0k0J18j9J17N0k97J60K1
7504D4j89K25m87L88K35J33j27j32q7k52J20P7j84J54L10m6o3k22j33M23m42K78
7526B3r8P8J9Q2J32R6k75Lm5l84L03J74J10n53N76n9Q1k00J8l11JM5J64o7Q5J56
7552A54k11K4m4j00PL7k37N97M9j43k5K19L2m83J1j90L45k18q7K76L20o9l84M18
7576B98m03J7J05j17L5J05J51k31K66j62k39Q5k33J79J42Q8l72M87K3k81k01M84
7598B26k46l53L47J63k25k6N7J56O8l19L90l94K94j87r7K87J23k01o4N5n9j02
7620a07L48l83K51lp8j85M60Q5m93q1n2L29n9K8J7k72L62n6M2j72k50K97k7R0
$$ y = [-77, -27, 149, -350, -252, -501, 51, -3, 185, -34, 101, -82, -148, 117, -179, -26, 4, 30, 133, -92, 325, 35, -92, -123, -291, -64, -213, 92, 197, 366, 89, 268, -18, 152, -121, -98, -66, -86, -106, 12, -7, 110, 160, -137, 23, 44, -145, 80, -407, -19, 216, 349, 222, 90, 3, -249, -129, -52, -236, -82, 228, 182, 119, -103, -236, 187, -255, 23, -75, 3, 22, 104, 236, 332, 57, 60, 15, -369, -66, 108, 218, -335, 241, 182, 263, 63, 81, -230, -229, -184, -20, -87, -2, 154, -57, -33, -77, -177, -170, -133, -370, 227, 276, 133, 108, 327, 359, -124, -113, -303, 42, -176, -263, 13, 333, 264, -120, 298, -105, -88, 17, -100, -65, 40, 191, -40, 226, 64, -175, -90, -323, -144, -2, 86, -286, 201, 224, -57, -258, 226, -20, -373, -26, 137, -88, -114, -57, 99, 167, -152, 238, -156, 138, -49, -146, 141, 264, 63, -1, 54, -5, -107, 241, -142, 109, 106, 28, -157, 303, 388, -105, -186, -238, 91, 32, 60, 77, -195, 167, 111, 153, -19, -269, 28, 1, 91]
7644I1l48O49o76O99m91K19q4J10m46j85K86K30R0K4J60q8p6j24l56L7K89q5N9
7667a6M84l33k02n1K95k42P7j61K73pK4J87j46Q9k73j31j04j57K50L43k2J72%
7690C49l35M03l99K9j47O2l54L12L55k93J44J61m02j30J43J07l22M51j69K62m35
7711b08M73j58l78K00j57j8J03O0j30L37n0j22K89l63K62l79J87j39J67K87o1
7732B02p8O4l54M90k63k78O1J50J29Q4r2P8J6K25n51r9J45l76M05lN09l84n3Q0
7756A07J61m61K71j58r6m3K34O84o58J58k86J43r8J1l38M17j54J23K14J25l12
7777D4j76Q0L5j45Q2K46j00l05M47J11j22k33k4M9j55J6K91j50Q0J76m6j52N7
7800A06l24K56l7j5j8R0J09k90N0O6j26m22L81K24k94L19qm6L05n25K95j26k62
$$ y = [91, -257, 392, -284, 415, -76, 143, 59, 169, -277, -462, -176, 54, 144, 168, 328, 240, 164, 40, -316, -279, 10, -75, -16, 468, 135, -67, -118, 177, -65, 12, -149, 124, 117, 141, 328, 182, 271, -2, -133, -237, -394, -144, 199, 177, 349, 349, 14, 417, 18, 47, -100, -38, -392, -80, 275, -18, 126, 287, -115, -245, -102, 5, -317, 134, -35, 227, -208, 265, 107, -271, -71, -228, -246, -143, -83, -213, 124, 74, -48, 241, -122, 140, -239, -52, -191, -24, 263, 202, 124, 188, -166, 324, 61, -217, -156, -6, 123, 207, 115, 193, 209, 434, -117, -216, -71, -447, -42, -45, 464, 80, 27, 107, 268, -193, 78, -80, -176, -219, 15, 699, 41, 199, -87, 56, -42, -31, -369, 48, -106, 17, 231, 356, 44, -132, -52, -17, -162, -80, 166, 66, -239, 208, 319, 197, -36, -60, -11, -166, -150, 141, -9, 71, 247, 201, 49, 106, -218, 38, 1, -14, -32, 58, 167, -123, -73, -7, -133, -555, -174, 50, -244, 75, 67, 21, 326, -199, 96, -30, -292]
7823b92K28k6K87l93J25J71j64J18n1N7j62J44j02K52l32K10K23k63l4j02K37
7844A31m2J4n6J54J0Q4m98K88m11L24O0l65K20K11k2l9K98j68j1k75l29K31j48
7867c39K28OJ8L52R8l54J8k41J26p7Q0K60l62M56O7n77J10R8q4J86m10R9K63J04
7891A25n8L1j10J12j29n7K50n70Q0L99n9n4r8K6K51n53K95j34L13J02j11k03J99
7914D7K18j53%k23j80K37k47M56l1N1R4j72J39m19R7J13K90j05j01o5L39j03j87
7937I5l08J91k69o5K87K19j74o4R3J40J98n20K43j59K34j47N0o1K49k3M1l11l32
7960c93J37K8P7%K30L16p2l43p3k51K39m2o8K73k50L81J45j92J05l09K39p7l17
7983b17M17r4k27N03l47Qp1J7k48m8L71K03l35j09L5J73L02m04m53P27k63j89
$$ y = [-292, -64, -90, 197, -196, -71, 100, -64, 54, 3, 60, -102, 42, -60, 192, -140, 70, 293, 30, -4, -106, 131, 89, 103, 47, 201, 211, 295, -203, 85, -326, -2, 58, -307, -87, 124, 102, 63, 361, 193, 182, -93, -422, -191, -339, -111, -105, -87, 265, 363, 9, 27, -214, -88, -165, -85, 175, -187, 269, 336, -241, -131, -33, -117, 69, -341, -242, 21, 125, 67, 98, -12, 100, -29, -86, 164, -406, -326, 73, 14, -40, -138, -112, 139, -414, -119, -253, 60, 162, 51, -152, 47, 265, 112, 112, -111, -291, -54, -301, 155, 124, 175, 269, 97, 236, -183, -86, 27, 317, 212, 111, 46, 385, 282, 95, -213, -22, -291, -356, -69, 150, -24, -88, 5, 145, 343, -177, 66, -93, 141, -6, 44, -17, 232, 209, 250, -61, -393, -256, -228, -151, -151, 79, 395, 323, -20, -93, -344, -105, -147, -215, 58, -192, 189, 334, 142, 247, -62, 177, 100, -217, 200, 106, -121, 382, 35, 43, -28, -11, -259, -307, 64, 267, -68, -177, -142, 31, 333, -71, -524, 203, -60, -249]
8005b49N32l16L46k41j27J39j18k5l2Q7K29j80J33p2j99K32J00n3n99J58L4K52
8027C1k51K05K5L21k03j53J19j83K71k31J75j88K59L2P9o04J84N00m21j57L22
8048A32J77J15m40M15k98k55J2k9k9O3o0K08r3L19k45o1O2J46l21J58j24L73k73
8071d8J22J81J8j67k6j44k01q9L22o2J79l9O0l12J58k30J23R7J28j55K15m6k04
8094a20J3J52P2l72M79j41j43L46j90J60l79L11n4j89k08j5J15L15m4l7RL01k27
8117A54q5k26Po5J71K44J48j18k0j73J10l41J37O3j74p9J05K32n5rR1l85K58R8
8141H8l05J75J88k52K98J15m59N5K02p4l76J47J93m8J88j11j66M23k78L5l03J11
8163a54k1K16R6j37K00K32n76o0L25n15J25M4J16K6L64l9k52Rk26q4J46K14j20
$$ y = [-249, 283, -33, 313, 72, -55, 84, -34, -59, -91, -4, 225, 45, 178, 106, -93, 139, 239, 186, -413, -255, -221, 31, -220, -15, 10, 331, 128, -25, 94, -89, 182, -49, 126, -62, 197, 229, 308, -296, -112, 388, -33, -190, 132, 309, 424, -16, 399, 101, -154, -142, -171, -200, -137, -197, 11, -82, 237, -8, -69, -7, 139, -182, -24, -148, 225, -48, 74, 255, 273, 106, 80, -64, -265, -354, -32, -94, 85, 46, 106, -206, -48, -278, -155, -58, 70, -85, 130, 84, -120, -107, 45, 117, -255, 224, 83, -60, 286, 96, 256, -123, 188, 134, -55, -263, -278, -163, 152, 108, 71, 80, 381, 154, 69, -157, -150, -215, -44, 200, 348, 230, 210, 37, 147, -194, -57, 6, -168, -247, -142, 90, 35, 26, 117, -268, -10, 88, -217, -42, 146, -106, 192, 307, -152, -97, 105, 31, -345, -198, -5, -53, 135, 24, -142, 281, 3, 38, -265, -154, -175, 41, 137, 0, 200, 432, -144, -204, 121, -394, -269, -225, -109, -83, 281, 242, -10, -1, -227, -311, -165, 49, -71]
8186g1J81Lj33K13J44
$$ y = [-71, 110, 113, -20, 193, 337]
8191C37
$$ Imaginary data points
##PAGE= N=2
##DATA TABLE= (X++(I..I)), XYDATA
0@%%%%%%Qj6J6j6J6k4L2l4M2n6O6p4Q9j06J23j47J71j96K28k60K98l39L84m38
30b33M92n52O22o98P79q68R66j072J192j323J463j619J793j986K200k440K710
47A426l015L366l769M241m809N500o361P471q968J1112j4458K0472l4717J33921
61A11412J25433j47164j03981q3015j4698k1436J8513N3517J01294P3641K6572
72A40088k6359m0059o0547p4138p8262k7821M3548J01173R8466O2757J1773k8996
84A21623p2498r7290q4454k2709M2538P3744O4154M6608L5354J7927k5010p2069
96B7918q8855o0055j3414K8294N7467P9879P9303M2149k0615p3912r0453p0427
108a02721l0788J2233N1543P3513O6010L5126Q55k3413m2056o0398o7037m5436
$$ y = [0, 0, 0, 0, 0, 0, 0, 8, -8, 8, -8, 8, -16, 16, -18, 24, -32, 34, -40, 49, -57, 66, -81, 90, -106, 122, -138, 160, -179, 205, -233, 259, -293, 329, -369, 410, -458, 508, -564, 628, -695, 768, -851, 942, -1044, 1156, -1284, 1426, -1589, 1777, -1992, 2249, -2560, 2940, -3421, 4050, -4918, 6194, -8264, 12208, -22509, 111412, 236845, 89681, -14300, -97315, -112013, -133449, -114936, -61419, 39875, 113516, 140088, 113729, 73670, 13123, -61015, -139277, -167098, -123550, -22377, 76089, 138846, 150619, 121623, 49125, -48165, -132619, -155328, -112790, -39046, 25108, 71716, 107070, 124997, 99987, 27918, -60937, -120992, -134406, -106112, -48645, 31234, 110537, 152686, 132071, 58159, -32294, -102721, -133509, -121276, -69733, 3780, 69790, 104916, 105771, 82358, 40302, -20096, -87133, -132569]
120a32569P320O2022Q5952O9889L4477m727m2591p3811q1297n1549J862M8638
132g6384O6264N8978M1698J8064j3457m6202o3534n6937l4523n445K8015O3102
144b0361Q3033O4451R343n1478p9860o8728l8077p634K0667M9467O6277N7316
156H4416K4216j3621l9495n0990n4975m6818j8156K7003O5241P3286N2214J4692
168A17013k4097n6092p2672o0214k0947K5636N2503N3888M2475L1483J0807k3625
180G6158n8096o7794m5871q002K3819M4022N7501N7418L4402j0671n3693o9912
192b0719n5155k4432P993L5323N3691N6673L7234M542k5621m3111m9233m7611
204g0426l0825M770M5626O6507N6195K4166p418l1397m9595n8097m5630p222L5990
$$ y = [-132569, -125249, -63227, 22725, 92614, 127091, 122364, 79773, 5962, -75335, -126884, -125022, -76384, -10120, 48858, 90556, 108620, 95163, 48961, -14573, -71510, -106033, -111478, -83463, -20361, 62672, 127123, 136466, 84988, 5128, -63600, -101677, -109311, -88644, -39177, 27100, 84416, 108632, 95011, 55516, 4526, -50449, -97267, -115423, -88420, -23179, 50107, 102321, 117013, 92916, 36824, -35848, -96062, -117009, -91373, -38870, 15018, 57493, 88976, 99783, 76158, 18062, -49732, -95603, -103605, -79786, -35764, 21737, 79155, 113557, 102886, 49193, -20719, -75874, -100306, -92313, -56990, -3299, 53374, 90608, 95150, 69529, 26418, -22815, -70426, -101251, -96481, -50855, 15652, 71847, 96013, 88595, 57198, 7603, -50494, -96124, -103346, -67356]
217f7356N7531N1978L2253J0909r670l3370n2224n1771k9220L271L1054M9173
229g442N5243M2395J0201l0579n7508n6512l4740p516J5937L6879N0361M8003
241F4722K4346j0771l6412m4749m1507l1296j3946J7232M9667O1274M3878R478
253I1916k2613m1621m9397m3107k1273J0748L7623M7252L9690K4250N616j8750
265F0334m2853n3868m0614r802K1393M0023M5034L9890K4479n117l6762n3921
277a1784m5895k0339N640K4740L7957M4002L5651J1492k0334m0719m4048l5253
289e8890j7636M818L1774M9658M6074K3347n483k7748l9583m3021l3666r606K1731
302e8231M3919M4827K9102R339r198k6311m0600m2066k6536K692K8748M1710M1102
$$ y = [-67356, -9825, 42153, 74406, 85315, 75645, 42275, -9949, -61720, -90940, -87669, -56615, -7442, 47801, 90196, 100397, 69818, 12310, -44202, -78942, -86458, -70521, -33642, 16719, 64722, 89068, 78297, 41885, -2864, -44371, -75667, -89613, -72381, -22714, 38560, 82438, 91916, 69303, 27682, -21715, -64822, -86095, -75347, -37724, 9528, 49218, 73468, 79084, 60334, 17481, -36387, -77001, -86803, -65410, -25387, 19647, 59537, 84016, 78899, 42137, -11784, -57679, -78018, -72378, -47638, -9681, 34321, 69972, 81464, 61130, 20411, -23637, -58890, -76526, -71708, -39934, 9724, 55798, 79145, 73662, 45914, 6331, -36690, -70356, -79962, -58231, -14312, 30515, 59617, 68956, 59758, 33447, -7153, -49219, -75755, -73063, -44315, -2605, 38497]
315C8497K9920Q599j9523m3174m6980l0942o174J5049K8459L7445L7274K2696
327G1146m066k9387l9111l5462k4044p923J3565L7154M8107L6548P867j9841l4974
340A9579l7061l1606j8230L760K7343M0839L6285J9894Q37j5942l1186l9900l4285
353e9673j1234J7462L5281L8109K9713J5843l573k6356m1471l8853j9819M816
365e9755K2094L0624L3208K8124J0964j4052l3310l8791k8198j2300N647K3256
377c2489L7369L7701K1083l097k4080l3262l3358k4982q238J4779L4009L8281
389B3716K6953P576q901k2340l1853l3476k1535J131K3452L4685L1848K1490O685
402E9431j3501l1732l8965k8805o775J4072K5500L0326K8893J8417j042k3141
$$ y = [38497, 68417, 77016, 57493, 14319, -32661, -63603, -69777, -54728, -26269, 11176, 48450, 71146, 67080, 37693, -1418, -36880, -60924, -68847, -55282, -18128, 29979, 66527, 74394, 54553, 19579, -17482, -49088, -67318, -63558, -36215, 4624, 40909, 60803, 61640, 45698, 14512, -25388, -59673, -70907, -53445, -18164, 19945, 49658, 65501, 61928, 35572, -5899, -44752, -64571, -59755, -37661, -7037, 26171, 54295, 65259, 51207, 17897, -20894, -49092, -61392, -55745, -32489, 4880, 42581, 63664, 60567, 36487, 3225, -30133, -55115, -63353, -48574, -14565, 23716, 50669, 58245, 49344, 27004, -4849, -38325, -59860, -58729, -35277, -592, 31256, 52746, 59431, 45930, 14198, -24767, -53572, -60347, -46275, -20775, 9551, 38444, 56861, 55819, 32678]
414C2678l4972l0911j7681k111J2216K6672L5259L0270J0137j4307l0039l2013
426a4802k5196j3808J973K1275L4277L2622J7189k149j6912k5649k9934k5790
438d6904j0219J1272K9300L2727K4586J0566m056j9225l1219l2045j9081K430
450e1868K0218K8842K7621K1192P728j0998k7927l3071k3967q069P408J9804K8009
463D922K7934J8269j056j9749k8348k7295j9360o590J0064K6786L3450K6018O912
476E1957j1360k2935k6567k4510j4869J579J8696K8145K6769J6371L522r632k3659
489A3507l0467k5487q701J0690K4001K7458K3719J3515j930j9839l0506k6951
501c0991j3955J554J3346K0441K5477K2929J0025r302k3930k7288k2386j1404
$$ y = [32678, -2294, -33205, -50886, -52997, -40781, -14109, 21150, 51420, 61557, 47250, 17211, -14802, -39998, -53806, -51833, -30558, 3719, 36341, 53530, 51381, 34469, 8820, -21114, -46904, -57123, -45851, -16551, 16176, 40762, 51328, 47272, 28047, -3172, -35217, -54298, -51868, -31650, -2808, 24813, 46005, 53733, 42735, 14808, -18263, -42230, -50299, -42891, -23087, 4922, 32856, 51125, 50069, 30320, 1972, -25323, -44683, -51273, -41209, -14423, 19027, 45045, 51957, 40597, 17662, -8905, -33415, -48284, -46705, -28009, 136, 26905, 43276, 46798, 37166, 13507, -16960, -42447, -51148, -40458, -16457, 11001, 34720, 48235, 46305, 26466, -4040, -30991, -44946, -43392, -30046, -9605, 15872, 38801, 48826, 39524, 15594, -11694, -34080, -45484]
513d5484K434J7039K8229K8436J6419k211j6544k4156k4732j9493o363J0583K4247
526a1596K7008J8900P190m134j3921k3830k6362j8728k78J7179K5461K5056J7400
539C9345N674r488k4257k8863k1375n416J0223J8340K2332K0396J3557J95j4539
552B6124k2871k3297j6249o400P570K1708K9170K3686P430j1280k2397k3873j9302
565b9981j0301J813J5778K4034K2556J2973J88r379j7307k2865k1786r898P278
578c6897K0891K5468K1177J1307k709j6823k6161k3910j2337L265J4061J8652
590d016J9711J6693P264o747j9725k3956j8522q919K558J3170K2285K4495J6746
603D1037J27j6181k3983k1945j4679l445R604K0306K3527J6185M528n177j2340
$$ y = [-45484, -43050, -26011, 2218, 30654, 47073, 44862, 28318, 4162, -20570, -40063, -46426, -35843, -11596, 15412, 34312, 41502, 37368, 23447, -383, -26745, -45473, -45751, -28572, -3111, 21945, 39345, 45019, 35531, 11274, -17589, -38964, -44380, -34157, -15817, 6515, 26911, 40468, 40663, 26124, 3253, -20044, -36293, -42693, -35123, -13415, 15755, 39441, 46871, 35591, 13194, -10679, -29981, -40282, -38469, -22691, 1343, 23899, 36872, 37060, 27681, 10374, -12491, -34277, -44175, -36897, -16006, 9462, 30639, 41946, 39237, 22414, -3747, -27657, -39994, -36729, -22668, -4016, 15695, 32388, 39652, 32905, 13180, -10776, -29298, -38217, -35659, -22489, -204, 24291, 41037, 41164, 24983, 1000, -20945, -35624, -39069, -29465, -9159, 14368, 30553, 35081, 29904, 17564]
616A7564j7787k1128j5878k088J3808K3139K2591J4704L897q637j9534k5583j9561
629c4493n216R838J8786J9367J5822Q711j68j1845j9197k0216j3533l366O489
642b9021J7283K3621K1353Q117r135k0418k2283j6262q469K336J4291K1446K0170
655B3029J0191j938j0142j4905j6889j6691r113M636J7174K2872J9231R179l169
668C3465j4374k2358k1460j1409K927J3932J7848J6760J2616N163o051j6485k0505
681i931j5801o608L571J1211J7872K0512J5142J001j4423k2098k0055j1580j246
694c2433Q100J6240J9927J5446M870o354j3612j6206j5566j1127j798J0802J9441
707b270J9878J2996K715p996j6774k0390j7755n958Q773J8007J8276J3013N818
$$ y = [17564, -223, -21351, -37229, -39317, -25509, -2370, 20221, 34925, 38822, 30185, 10651, -14932, -34493, -39709, -29871, -11085, 8282, 24104, 32815, 32647, 20802, 1605, -18611, -32144, -35510, -29021, -11738, 11883, 33236, 41353, 32218, 11800, -10483, -26745, -35214, -32878, -18587, 2859, 23029, 33220, 31282, 21140, 6235, -10654, -27345, -36458, -31822, -14648, 8224, 27455, 36634, 33465, 19091, -3267, -24727, -36136, -33209, -19277, -1429, 15331, 27947, 33110, 27059, 10574, -9931, -25732, -32340, -28769, -17558, 314, 20826, 35968, 36969, 22546, 448, -19607, -31187, -32433, -24333, -8093, 11834, 27280, 32150, 25796, 12184, -4022, -19588, -30715, -32513, -21711, -2270, 17608, 30604, 33319, 25323, 8549, -11841, -29596, -35554, -26781, -8774, 9502, 22515, 28333]
720B8333r65r063j6583j8287j2315j737Q089J4845J7968J6042Q143n736j7921
733A0813k0611j5652o215L993J2171J7813J6960J0208j063j0407j4398j4711j2123
746b3222p212L763J4022K0527J7746P118n014j3167j7532j7148j0401N94J1974
759a7952J7668J5830R962K296n419j2928j8087j5305n951M124J1786J5873J6275
772A8172J1844J194j1654j9279j8431r862k54Q458J3497J6621J3934N030n289
785B3981j3343j5291j3717q195o19Q934J6556J8167J1414P91q132j5104j6399
798a0957j4302n448O850J5874J6825J1445M779j788p752j4076j6542j1774j128
811b7994R025J3841J5992J2842O037n084j4930j8656j4393m382M742J1054J3890
$$ y = [28333, 27368, 18305, 1722, -16565, -28880, -30617, -22528, -7683, 10285, 26327, 34470, 28734, 10813, -9798, -25450, -31665, -27672, -15501, 2312, 19272, 29480, 28417, 18010, 3612, -11099, -23222, -30434, -26671, -12649, 7878, 25624, 32742, 27728, 14561, -2971, -20119, -30520, -29926, -17952, -284, 15546, 25508, 27804, 22385, 9457, -8630, -23935, -29886, -25762, -13976, 1897, 18172, 30016, 31210, 19556, 277, -18154, -28016, -28270, -19812, -6315, 10306, 24240, 29270, 23981, 10638, -4653, -18370, -26565, -27184, -18250, -1694, 16473, 27887, 28678, 20546, 5442, -10957, -25259, -30707, -23857, -7983, 8842, 20287, 25066, 23278, 15526, 1450, -15092, -26866, -27994, -18969, -5128, 10864, 23706, 29743, 24659, 9729, -8927, -23320, -27702, -22960, -11906, 1984]
824A984J4722R192m96r268j3003j4324j0312n208L125J2154J8741J5711N678n264
838B3432j2581j4256j4158q477j52J0360J5937J4152Q666J375n447j0623j4824
851f596j3786o768L980J1217J5074J3798R205N38j0071j6618j6443q750R56P636
865a6628J1861J3111J1636N485l974j1978j4658j1491o709k60O970J4817J6525
878A4707J1249N08q920j3637j4488j0792l969N055J2686J5313J0530M286k442
891B0086p259j1877j4110j0551j857Q385J3813J3885J0055M373l790j2382j6616
904g845j3038m561N485J0671J2105J1761P157O37p440j2658j3003q166l660K974
918a9581J0340J5213J4106O091m706j2002j3915j1556o967L96Q632J3933J2691
$$ y = [1984, 16706, 25898, 25402, 16134, 3131, -11193, -21505, -26713, -23588, -11434, 7307, 23018, 28696, 23432, 10851, -3405, -17563, -26040, -26192, -15832, 105, 14257, 22923, 24298, 18851, 8228, -6596, -20382, -27150, -23170, -11953, 3121, 16919, 26124, 26662, 16591, -27, -16470, -25220, -24264, -16628, -4767, 8344, 19980, 25465, 21491, 9513, -5145, -16636, -23345, -23605, -16635, -1818, 14707, 25956, 26464, 17544, 3907, -10581, -21373, -25342, -20287, -7601, 7712, 18242, 22528, 20086, 12827, 950, -13160, -23711, -25568, -17183, -3370, 10515, 20570, 24943, 21153, 8771, -7845, -20883, -25444, -19959, -9288, 2817, 14578, 21735, 22372, 14932, 2274, -10729, -18895, -22555, -19581, -9241, 5972, 20078, 26169, 21463, 9461, -4454, -16010, -22977, -22581, -13949, -16, 12675]
931A2675P549L13n211q903j1899j1707o338K124J0777J3811J2948P014k47q003
945A4903j4708j4438q636P08Q050J0901J0960R643M542k836j0704j3019j0917
958a5551n498Q36O458J2118J3659J0267R49p829j2981j2411r152l459M270J0821
972g503J4196J0006M079k752p654j0628j0856q674j634O342J1685J2867R197L279
986B1950l565j0196j4378j2282m843M442J0312J1740J0154N783M42o571j1194
999A794j1570p757k133L170Q829J2437J2035N762k899j0485j2953j0661n594L91
1013a9634P335J1842J2195P440O03o346q518j0559r409n171J604R492J2356J0907
1027A4137N508m89o796j1340j2781q496k07O988J0876J0216Q277L618k775r094
$$ y = [12675, 20224, 20537, 15326, 6423, -5476, -17183, -23521, -21397, -10620, 3191, 16139, 23153, 22906, 14903, 195, -14243, -22879, -22171, -14121, -3220, 7740, 17383, 21925, 19089, 8385, -4634, -15551, -21049, -20213, -13755, -1637, 12022, 22289, 23238, 15409, 2428, -9983, -19135, -22594, -18324, -7503, 6693, 16699, 20778, 18026, 10372, -256, -11112, -19786, -21420, -15078, -3393, 9474, 18671, 21950, 18385, 8189, -6189, -18471, -23314, -18872, -8560, 3180, 13334, 19117, 19559, 12988, 1794, -9776, -17533, -19666, -16496, -7667, 4770, 16805, 22567, 19668, 9183, -3770, -14431, -20025, -19634, -12299, -457, 11738, 19178, 19781, 13435, 4917, -5642, -15051, -20222, -18618, -9126, 3230, 14137, 19645, 19156, 12360, 1020, -11761, -20257, -20464, -13476, -2600, 7616, 15893, 19511, 16736, 7642]
1041G642j2086r887m391J734O610R382J1103Q562K032o333j1507j1479p884k722
1055a9224K729R339J1995J0439M103l079p975r592r211o538j635N528J0220J1303
1069H402P858K124l174q596j0867j0424n277K911Q836J0661R641N223N54n482
1083A2390j0753j0879p219j054M070Q126R682Q902N370k024q054j1167r667n207
1097a7484M98N287J0474J0836P515Q96n440q958r505p721m149K018Q028J0690
1111B985R470M590r50n597r017j0428p774j727N612R902R871P217L441k366p821
1126G408j1281r636m207K398O864Q731Q977O462J499n032r329j0117o858k539
1140a6660L227P090J0126R318M587j765p697j0012q559n664l95N167R598R684
$$ y = [7642, -4444, -14331, -18722, -16988, -10378, -996, 10107, 18669, 20701, 14368, 2861, -8618, -16502, -19224, -16495, -7156, 4839, 15278, 19381, 16302, 8327, -1265, -10476, -17014, -18649, -13121, -2901, 8402, 16260, 18384, 15210, 6614, -4253, -14677, -19954, -17043, -8207, 2454, 12095, 17318, 17872, 12390, 1637, -9242, -16461, -17515, -13445, -5319, 4363, 13265, 18635, 16611, 8557, -2610, -12277, -17484, -16986, -11699, -1225, 9611, 17126, 18022, 12582, 3624, -5881, -13602, -17751, -15733, -7705, 2985, 12455, 17045, 16095, 10498, 1481, -8947, -16721, -18448, -12836, -2934, 6937, 14154, 17595, 15229, 7408, -3873, -13509, -17716, -15318, -8454, 277, 9254, 15716, 17215, 12183, 2854, -7263, -14121, -16660, -13433, -6343, 3783, 13101, 17688, 15923, 8226, -1786, -10345, -16009, -16404, -11237, -1639, 8045]
1154H045O417J586l792o652q958q609m933R94P566J0174Q528N294J01m792q995
1169A974j0556p164o30M872P709Q673P471L554j537p195q944q871m591M77M564
1184a0194Q462R302P074K328m979q638r299o791k847J840P030R602Q657L838j561
1199A3824n646p410q111o281k221M359Q004R258P052K514j917o397r683q936m545
1214a6136K000O593R006P308M751P77l831p851q577o095k486K545N892Q398Q163
1229A0457N118q62o704r075q369m654k19M652P728Q893O021R48l171o383p289
1244b909o932m528O78N878Q793Q405M395L92m550p715q515p027j247L826P617
1259c439Q166O097K498j019n930p973p625m083Q2M643O653Q171O324K559l776
$$ y = [8045, 14462, 16048, 12256, 5604, -3354, -11963, -16896, -15902, -8336, 1838, 10366, 15660, 15761, 10969, 1974, -8582, -15746, -16376, -11504, -3795, 4878, 12349, 15903, 14366, 7171, -1773, -10644, -15235, -14758, -10194, -1732, 7570, 14644, 16972, 11993, 3355, -5944, -12735, -15582, -13742, -6712, 2890, 11547, 15385, 13824, 8178, 768, -7343, -13624, -15845, -11486, -3482, 5776, 12828, 15342, 13425, 7028, -2655, -11591, -16136, -14136, -7543, 1463, 8771, 13522, 14299, 10468, 2617, -5960, -12055, -14541, -11996, -6104, 2294, 10457, 15575, 14713, 8009, -1066, -9435, -14089, -14308, -9656, -1928, 6965, 12986, 13934, 10763, 4380, -2909, -9841, -14369, -13691, -7813, 980, 9385, 13780, 14172, 9622, 1907, -6608, -13635, -14882, -11056, -3439, 4727, 10824, 13322, 12303, 6373, -1600, -9225, -13308, -13226, -8583, -1930, 6241, 12565, 15124, 11348]
1274A1348q091q254o513k213J910N338Q544P826L446q31n486o902o644n096j827
1289a3445K523P195Q203O763K383k091n646q320p618l955J241N754P805O774M446
1304A2012L65l038o487p719o202k095K751N097P121P094M485k18n392q390p799
1319h415l886qL484O688P695N993J302l104n698o952n586l622J17M468P752P748
1335G976M863k18m129o860p171n792j982L163O933O962N828K088r85m090p012
1350d26p013m561K06L869O254O918N393K416k773o776q247n285k281J959N162
1365e185O398O571M122l63m340o534o069m634j509K004N797P788O208K315k116
1380A0453n365o943o458l768M32M730P118O453L465K35j927n267o717n973k045
$$ y = [11348, 3257, -4997, -11510, -13723, -11813, -6475, 2069, 9895, 13341, 12510, 7024, 122, -6522, -11618, -13445, -10922, -3727, 4476, 11239, 13622, 11531, 5885, -2435, -10053, -14008, -12767, -7013, 792, 7566, 12012, 12377, 9339, 2852, -4867, -11069, -13164, -10413, -5316, 1805, 8899, 13384, 13166, 7774, -616, -8415, -12301, -12309, -8825, -2137, 5558, 11551, 12853, 9749, 4051, -2901, -8487, -12109, -11992, -7524, 228, 7976, 12839, 12621, 8492, 1632, -5539, -11331, -13313, -10150, -3217, 3745, 9573, 11661, 10676, 6586, -426, -7439, -12000, -11794, -7925, -1671, 5247, 10640, 13056, 10283, 3507, -4740, -10025, -12306, -10347, -5185, 1213, 7784, 11906, 11543, 7203, 669, -5400, -10034, -11543, -9539, -3742, 4046, 10254, 12569, 10453, 5088, -1855, -8313, -12081, -11649, -6919, 199, 6652, 10117, 10352, 8425, 3158, -3559, -9532, -11577]
1395a1577J795M939O468O047M031L60n162p319p028l640KL690N713O006N021J530
1411A0876j713n318n993n087l436m2L842O479O804N161L6l735o250o623m810j876
1427a1685K777N909O331M917J676q43l261n630o101m312r39L321O003O130N189
1442I482J914k267n725p349n551j210J735M582N553N225L483K64l327n836n316
1457d343m487j329J704M364O554O276K846k071m806o260n676l204Q7M046O447
1472A48N610L279N36k820m206n047n064k506Q61M584N176N977M017p0l638o159
1488F78p263l418p1L794M545N610M472J103j419m154n311m792k804k51K629N336
1504a316O602M456Q81l212n639o089m005j727K018M801N895M443J716r41k917
$$ y = [-11577, -9782, -4843, 1625, 7672, 11703, 12063, 6901, -418, -7446, -11086, -11084, -7394, -1681, 4325, 9346, 10876, 9163, 3845, -2148, -7235, -10671, -10713, -6871, -392, 6412, 11573, 11609, 7874, 1624, -4999, -9809, -11685, -8908, -2999, 3332, 8249, 9925, 9082, 5821, 191, -5910, -10222, -11161, -7840, -1837, 4293, 9482, 11396, 9129, 3404, -3945, -9496, -10706, -8971, -4389, 1164, 6389, 9872, 10136, 6809, 973, -4343, -8830, -10159, -8455, -4091, 2463, 8739, 11585, 9514, 4708, -1552, -7228, -10432, -10345, -6299, 148, 5758, 9037, 9573, 6753, 2547, -2500, -7564, -10070, -9209, -4625, 551, 6528, 10545, 10475, 6837, 678, -6585, -10003, -10074, -6280, -1735, 3875, 8347, 9450, 8031, 3877, -1434, -6226, -9030, -9281, -6652, -1316, 5286, 9742, 10623, 7411, 1772, -4317, -8322, -10049, -8031, -3230, 2665, 7108, 8824, 7883, 4966]
1519D966m534m800l931j646K918M921N736M531J771j655m066o480n695k127J763
1534h328M316N031M607K927L79l083m859m674l665j278J031L954N315N062L303
1549A0038j002m226n795n118l157L13L153N161N406L484J99k213l847m466m229
1564f299k358L51L473N496M553L046N72k544m979o046m282n79L531M615M597L885
1580G032J412j235l409m764m562k213r3K399M062M909M308J256j998n038n411
1595c345m396j315J342M285N482M384K206j554l042l728m446l048q27J477M194
1610b331N345L888J693j212l720n034n074k450J080L886M330M328K616o9j571
1625E705m106m627l410j191J011L364M648M176K744k83l416m760m630k585k30
$$ y = [4966, 432, -4368, -8299, -9945, -7027, -2106, 3630, 8161, 9932, 8277, 4211, -2269, -7964, -10091, -8328, -4012, 1019, 5626, 8553, 8932, 5849, 990, -3684, -7349, -8627, -7596, -3642, 1673, 6735, 10038, 9036, 4810, -985, -6103, -9260, -8947, -5794, -633, 4773, 8257, 8456, 6243, 2396, -2070, -6299, -8657, -8306, -4833, 663, 5216, 8262, 8834, 6290, 1311, -4735, -9017, -9596, -6065, -1450, 3147, 7032, 8444, 7209, 3800, -964, -5526, -7739, -7832, -5433, -1371, 3538, 7846, 9102, 7104, 2066, -3345, -7741, -9056, -7714, -3429, 2053, 6437, 8643, 7089, 4047, 319, -4127, -7175, -8002, -6525, -2331, 3014, 6902, 8595, 7383, 3663, -1371, -6445, -8895, -7815, -3929, 401, 4729, 7345, 7276, 5705, 1599, -3028, -6438, -7629, -6618, -3254, 1394, 5570, 8314, 8031, 4615, -145, -4775, -7360, -7590]
1640g590K018M283M715L405J284k027m408l438l489j762k4K958M215M346K866
1655G352L69k390l999m594l948r94K286M048M443L313J417q31k678m332m443k063
1671g044K62K048L954L954L216J169j230l892m981l415j338P52L031M549L931
1686D966K389m32k869l944l634k470j072J274L436M708L474J386j356k733l950
1701h27l852k734Q74K676M014L705K321O48j530l309m647l463r56J466K573M356
1717A315L552J917Q3k547m255l945k774m08K304L101M113L580J276j520l226l942
1733a376l066k269L86K446M004L964K507k29j637l401l722l083j906J982L129
1748b271L877L303J653p41k205l772m396j949q1K453L376L520K763J127j206l344
$$ y = [-7590, -5572, -1289, 3426, 6831, 8115, 6088, 1680, -1758, -5247, -7009, -7033, -4075, 140, 4486, 7352, 7721, 5331, 1332, -3262, -7210, -8204, -5918, -1870, 2573, 5886, 7303, 6472, 3794, -538, -4981, -7044, -6782, -4734, -780, 3174, 6390, 7559, 6329, 2437, -2544, -5959, -7297, -6545, -3514, 1035, 4966, 7355, 6923, 4054, 110, -3524, -5994, -7066, -5792, -2356, 2352, 5826, 7212, 5856, 3123, -827, -4679, -7413, -6539, -3863, 151, 3856, 6177, 6825, 5295, 1986, -2661, -6124, -7080, -5614, -3041, 1315, 4867, 6784, 6867, 4320, 65, -3880, -6654, -7062, -4758, -1657, 2456, 6036, 7312, 5792, 2566, -1376, -4442, -6711, -6325, -3879, 125, 4089, 6596, 6367, 4730, 1329, -2393, -5476, -7382, -5400, -2271, 1606, 4909, 6562, 5821, 3616, -156, -4552, -6501, -6582, -4129, -753, 2767, 5530, 6657, 5451, 2107]
1764B107l959l575r23Q65K481L414L242K667P4k087l815l334k759p07Q85L258
1780b166M032L414J222r36k821l000m006j845J8K117L710L482K300N14j272k929
1796A834l435l571j237J158K767L274L250J863k09j836l729l720k103j38J336
1811d496L034L432K903J349o88l076l742k931j621J04J943L677L519K559L9j829
1827D176l297l101k655j077J105K819L335L141J102n7j825l422l561k533J80J604
1843d066L196L215K338J174q87k728l443k974j423M75K327K954K990K132K82j616
1859C946k697m003k151m57P51K637L037L211J222j86k322l347k896k147k75J727
1875c950L319L461K333J69p31k767l043l046j637R01K207L385L106J529K4j223
$$ y = [2107, -1852, -5427, -6350, -5485, -3004, 410, 3652, 6319, 6393, 4306, 491, -2843, -5602, -6309, -5424, -2166, 1866, 5280, 6502, 5566, 2745, -255, -4261, -6106, -6088, -3971, -261, 3221, 5521, 6035, 4763, 1834, -1601, -5172, -6409, -5251, -2484, 790, 4040, 5903, 5694, 3858, 129, -3591, -5694, -5832, -4496, -1462, 1970, 4873, 6222, 5534, 2458, -1284, -4215, -5836, -5732, -3789, -112, 3407, 5966, 6005, 4176, 879, -2222, -4877, -5954, -4849, -2030, 1305, 4446, 5548, 5491, 3666, 244, -3317, -5850, -5670, -4066, -870, 2345, 4683, 5857, 4970, 2242, -1201, -4175, -5598, -5123, -2796, 158, 3148, 5280, 5562, 3946, 1249, -2754, -4905, -5362, -4611, -1974, 1063, 4274, 5496, 5310, 2988, -359, -3255, -5402, -5677, -3950, -631, 2830, 5163, 5332, 4601, 1834, -1209, -4255, -5892, -4991, -2784, 601, 3707, 5236, 5260, 4037]
1891D037l141l139k563o47J161L036K761K777J054l63k538k986k997j709K70J649
1907c338L013K862K370L43j486k495l157k134j645P02K579L150K664J770m11j656
1923C131k806l042k202k80J704K444L205J926J126q24k083k861l328j351J49K625
1939b467K506K703K244L26j569l070k720k269k39M28K260K654K896J313l26j979
1955B691k723k682k062l63J341K863L118K565J51r03k202k958k475j574O04J952
1971b657L094K453J333O4r81k474k529k740p14J076K310K479K937J510n66k232
1987B363l345k338j362L28J491K268K744K141N65j179k400k452k178j333J05K059
2003b523K904L109J577j09j880k746k666j821n46J120K877K575J843N17m75j556
$$ y = [4037, 896, -2243, -4806, -5453, -4292, -1256, 1505, 4282, 5336, 4973, 2435, -551, -3548, -5257, -4987, -3338, -325, 2537, 4907, 5250, 3764, 1269, -1888, -4022, -5667, -4965, -2386, 764, 3428, 5198, 4787, 3131, 325, -2717, -4919, -5199, -3495, -1051, 2154, 4080, 5206, 4382, 2299, -562, -3890, -5241, -5092, -2467, 39, 2742, 4986, 5312, 3743, 673, -2047, -4316, -4555, -4127, -1867, 787, 3683, 4996, 4670, 2691, -32, -2714, -4776, -5139, -3798, -935, 2183, 4748, 4899, 3996, 1794, -1164, -3639, -5213, -4609, -2657, 437, 2890, 4223, 4287, 3306, 832, -1697, -4437, -5151, -4075, -1765, 714, 3651, 5161, 4595, 2363, -982, -3320, -4682, -4354, -2863, -595, 2149, 4290, 4855, 3676, 1276, -1176, -3354, -4687, -4582, -2523, 381, 3490, 5067, 4958, 3078, 332, -2334, -4155, -4701, -3581, -704, 1871, 3714, 4231, 3756, 2200]
2019B200k538k684j545K59J423K362K860J900P87j191k291l384k145p53O08K380
2035a752K713K355Q30k15j375k358k337j537n51Q53K240K653K403Q59j003j869
2051A909l040k144j193j93K291K729K452J440k16j059k019k231k176j070O77J942
2067a901K660K418J513o99j317k762l077j307O8J675K042K319J907J015j219j856
2083A479k656j905q68j39J742K018K932J731K46j382k473k702j800q36J155K251
2099a207K572J693J114n83j629j829k419j550n21J386K315K597J673J034j117
2114C529k130l068j739j083L26K596J907K526R53O04j741k707j970j805j67P09
2130c260J705K683K247J061m26j959k517k504j284N1J656K441K563J228L41j348
$$ y = [2200, -338, -3022, -4567, -4308, -2885, -523, 2337, 4237, 5024, 3833, 1542, -1842, -3987, -4740, -4132, -1752, 961, 3316, 4146, 3931, 2556, 198, -2139, -3676, -4227, -3374, -1134, 1519, 3922, 4781, 3778, 1909, -1131, -3275, -4468, -4661, -2370, 359, 2811, 4251, 4035, 2976, 957, -1274, -3450, -4520, -3843, -1901, 759, 3177, 4690, 3991, 2674, -88, -3165, -4472, -4404, -2729, -687, 1632, 3539, 4554, 3335, 1479, -1177, -3082, -3950, -4089, -2347, -329, 2603, 4334, 4580, 3198, 725, -1977, -3777, -4613, -3458, -1207, 1365, 3058, 4172, 3589, 1960, 131, -2288, -3838, -4359, -2973, -658, 1939, 3612, 4646, 3529, 1399, -1669, -3408, -4491, -4165, -1569, 338, 2864, 3817, 4421, 2680, -27, -1997, -3802, -3969, -3260, -1555, 1128, 3375, 4436, 4010, 2051, -466, -2970, -4254, -4203, -2547, -106, 2457, 3685, 4026, 2678]
2146B678j861k313j428r59K88K033K285J914J366L19j535k548k704j461k71J350
2162b847K404K020J712R13r36j820k290j859j231J76J439K141K256J707N05j444
2178B846k097k398j648q09N36K035K833K025O79o18j336k464j797j215p27J426
2194b729J773K706K067M27r69j962k368k061j121M95J884K284K136J541k15j591
2210B297j638k705j396k45Q25J437K433J835J156j60j772k290k420q77l57R19
2226b958K540K456J774k6p95j782k180j831r40K46J604K376K077J413m53r09k177
2243D35k313j582l94J123J702K061J889O65j06j799k062k327q78m5J279J875K321
2260A844J558K63k53k600k545j341r51P81J579K308J951J234m98r13k408k060
$$ y = [2678, 817, -1496, -2924, -3883, -3595, -1562, 723, 2637, 4003, 4322, 2787, 239, -2465, -3926, -4197, -2847, -443, 1577, 3289, 4202, 3266, 1446, -844, -2703, -3934, -3758, -2319, -178, 2078, 3785, 4290, 2846, 749, -1649, -3297, -4106, -3570, -1535, 1298, 3323, 4002, 3384, 2048, -416, -2213, -3428, -4155, -2729, -956, 1750, 3817, 4244, 3275, 1313, -1055, -3116, -4237, -3742, -1858, 426, 2562, 4103, 3888, 2297, 659, -2046, -3442, -3687, -2862, -1425, 1008, 2843, 3999, 3839, 2067, -223, -2643, -3520, -3877, -2958, -418, 2038, 3812, 3786, 2991, 1209, -971, -2802, -3742, -3496, -1892, 484, 2561, 3974, 3521, 2612, 435, -1878, -3460, -3854, -2731, -1029, 1032, 2921, 3586, 3480, 1681, -381, -2708, -3586, -3631, -2352, -477, 1844, 3402, 3665, 3412, 812, -1733, -3074, -4025, -3244, -1665, 643, 2594, 3828, 3330, 2417, 9, -2051]
2276b051j523j0R34J877K185J519J082p59j572k351k304q44K62J384K387J783
2292A999J455P6p75j989k123k019n28O99J567K242K039Q77R7j395k185k336j327
2309c626J56R45J871K224J926N74j124j862j781j693j483N36J279K228K023J580
2325C773j08j214k001k196j692k12O35J984K468J454Q88k63j797j907j975j554
2341c717L92Q83J972K087J646O58p68j812k489k196n84M63J566K668J740J222
2357C731j66j335k244j755j341m98P99J576K541J776N14n91j539k033k227j238
2373d030J70K146J560K281Q55O08q54j793k067j784o23N32J490J979K129R19J92
2390C710j367k252k243j473j18J211J932K155J481L21m06j575k376j683n96k87
$$ y = [-2051, -3574, -3584, -2650, -773, 1412, 2931, 4013, 3254, 1682, -669, -2973, -3817, -3555, -2171, 216, 1999, 3454, 3530, 2755, 766, -1357, -3376, -3904, -3205, -1638, 604, 2643, 3520, 3617, 2222, 37, -2299, -3626, -3470, -2525, -654, 1570, 3496, 4070, 2946, 1084, -697, -2390, -3873, -3337, -2058, 170, 2193, 3773, 3665, 2451, 450, -1746, -3438, -3650, -3015, -1031, 1437, 2891, 3779, 3516, 1719, -188, -2163, -3717, -3325, -2442, -470, 1617, 3263, 3921, 3153, 1341, -1148, -3344, -3928, -3465, -1899, 769, 2509, 3731, 3565, 2230, -14, -1769, -3110, -3608, -2809, -1233, 1308, 3084, 3598, 3007, 1468, -565, -2792, -4030, -3860, -1714, -154, 2127, 2982, 3590, 2736, 943, -1124, -2908, -3531, -2999, -1509, 470, 2599, 3518, 3710, 2343, 91, -2152, -3625, -3743, -2532, -600, 1555, 3036, 3357, 2951, 1376, -1000, -2683, -3279, -3566]
2406c566J162K267K717Q19M18j350j754k129j780l73M69J933K340J535J004r00
2422B812j024j850k297j296K11J103J630K204J804N53j134j657k518j436o27L67
2438c155J627J908J961J059J84j050k384k345p86m52M33J473K709J521J009o67
2454C045j454j993j803j005k86J246J905K283J300J20q73j694k150j434o69N85
2470b877J326K120J553J295l07p75k030k234j480j90J060J699K116K114N5k01
2486C244j815k292j621r60L07P20K333J895J414K95p96k120j709j637j091N63
2502c270J933K103J976Q40m35j346j925j667j351m79J337J957J635J485K87K9
2518C109j375k644j465j318M86J126K023K025J562o3j167j737k179j394m16J210
$$ y = [-3566, -2404, -137, 2580, 3399, 3817, 2467, 713, -1416, -3196, -3569, -3100, -1167, 1173, 2708, 3712, 2812, 1788, -62, -2359, -3655, -3444, -2341, -711, 1493, 3297, 3850, 2716, 1059, -1459, -2895, -3522, -3155, -1528, 380, 2341, 3400, 3584, 2534, 150, -2195, -2981, -3433, -3000, -1527, 1182, 2703, 3712, 3045, 1591, -402, -2205, -3210, -3496, -2250, -345, 1938, 3238, 3358, 2485, 791, -1359, -2793, -3462, -2877, -1551, 569, 2122, 3417, 3110, 2335, 305, -1929, -3409, -3599, -2539, -840, 1276, 3390, 3445, 3244, 1429, -863, -2484, -3444, -3137, -2417, -84, 1811, 3225, 3520, 2724, 604, -1105, -2742, -3833, -3270, -1337, 766, 2742, 3582, 3147, 1801, -124, -1791, -3142, -3621, -2284, -327, 1308, 2793, 3080, 3109, 1734, -910, -2375, -3693, -3207, -2081, -58, 1967, 3529, 3466, 2299, 562, -1617, -3011, -3427, -2217]
2534b217J007J944J904M99j42r27k228j839j321o2P52J872K327J589M18q97j730
2551I49k231j302j055P34J281J832K052Q94p2q96j790k053j548m06R93J684J931
2568I97J774O55m91j496j607k361q87J46J234J594K493J084Q1q77j515j952j537
2585b665o28J28J565K334J752Q18K01j531j961j968r25q05J167J856J920J552
2601B810L92o12r22j970k125n83k37J419J713K134J256O7q86j769k122k029j04
2618c568J073J535J690J562J154o07j212j819j795j141k69J040J532K346J305
2633B826M99m21j995j504j968q25K0J697K138J608J132k39o42j878j637j518p82
2650c489N50J791J950J327Q05K62j613j986j874j198L69J077J837J573J480J68
$$ y = [-2217, -1210, 734, 2638, 3137, 2995, 2068, -160, -1999, -3320, -3382, -2630, -758, 1569, 3158, 3576, 2679, 949, -1282, -2584, -3639, -2905, -1624, 208, 2260, 3154, 3082, 2186, 396, -1657, -3205, -3611, -2618, -934, 997, 2771, 3426, 2935, 1439, -168, -2529, -3416, -3270, -2036, -442, 2051, 3135, 3216, 2339, 824, -1128, -2665, -3293, -3165, -1600, 734, 2486, 3304, 3505, 1974, 13, -1955, -2880, -3685, -2518, -662, 1258, 2810, 3202, 2590, 1668, -302, -2427, -3010, -3247, -1828, -115, 2019, 3275, 3342, 2456, 687, -1435, -3464, -3568, -2495, -960, 730, 2292, 3446, 2839, 1627, -192, -1987, -3128, -3397, -2357, -825, 1521, 2826, 3325, 2904, 909, -595, -2563, -3388, -3368, -1671, 467, 2075, 3207, 2968, 2326, 448, -1189, -2707, -3489, -2939, -1148, 802, 2129, 2934, 3196, 1583, -403, -2277, -3475, -3106, -2029, -192, 1381, 2861, 3029]
2666C029q05j311j775j599o20N55Q31J940J893J458j0j430j891j619j695q0O59
2683b470J425K577J439K42n72j012j886j717j158K73Q11J934J948R28K76n04j685
2700H49j949j809q52J240J314K014J642R57m68q09k363j590j047m9N68J395J869
2717I12J777P07m10j955j474j666j088K27J092J887K054Q98k2j056j307j880j356
2734b660o27N66J649J382J608J318j91j128k131j830r39l68J249J694J841J410
2750B843L56p56j497j929j646m07K20J073J936J767R45L78j138j986j939j206
2766b986m01Q65J431K262J633N70q89j193j594j738p50k36Q28K095J794P61M51
2783B903k83j768j663j848o08N38J705J615J445J133j04j254j597j893j242L2
$$ y = [3029, 2224, 913, -862, -2461, -3081, -2526, -1695, 245, 2138, 3596, 3586, 2156, 265, -1354, -3049, -3129, -2470, -1045, 1532, 2971, 3213, 2641, 1629, -257, -1974, -3132, -2859, -2048, -114, 1834, 2762, 3038, 2534, 849, -1100, -2909, -3761, -2521, -1207, 807, 2449, 3406, 2938, 2129, -234, -1824, -2871, -2920, -2352, -957, 912, 2689, 3396, 2986, 1031, -443, -2109, -3197, -2970, -1878, 9, 2063, 2961, 2939, 1883, 576, -1304, -2660, -3287, -2721, -1072, 310, 1918, 3236, 3045, 1917, -214, -2044, -2983, -3351, -2102, -408, 1433, 2843, 3199, 2443, 946, -983, -2629, -3036, -2816, -1743, 193, 1960, 2905, 3283, 2145, 159, -1780, -2986, -3387, -2522, -1091, 1171, 2804, 3374, 2485, 1292, -302, -2040, -2790, -3026, -2198, -103, 1691, 2452, 2903, 2620, 852, -811, -2659, -3267, -2729, -1024, 591, 2036, 3169, 3065, 1811, 214, -1679, -2921, -2889]
2799b889N59J367J759J756R06o78j657j792j450j085J37J166J968J840R22r7r89
2816A743j317j580j320q72P53J251J968J631J152m48j220j689j851j533LJ265
2832b064J936J490J158N61n93j477j837j397q88M54J131J919J382J200J73r83
2848B165j718k116r52l16L64J619J792J466O72l55j242j425j717q40l02Q46J616
2865d43J682J663K55r56j081j859j737p47P61J052J749J337J147o3r54j219k013
2882a426j238o19J305J182J611J383P72l50j173j674j705r23R1J196J386J781
2898A599J451l01o71j507j531j448k91J3J600J713J608O02k1j093j709j699j182
2915b867l19R75J985J440J142L02j77j322j553j549q69K9R49J793J594J185K31
$$ y = [-2889, -2330, -963, 796, 2552, 3458, 2780, 1123, -669, -2119, -3204, -3067, -1901, 67, 1907, 2829, 2732, 1743, 426, -1154, -2474, -3346, -2593, -1342, 626, 2257, 3409, 2961, 1741, 52, -1799, -3332, -3329, -2064, -128, 1362, 2520, 3081, 2488, 1011, -826, -2223, -3111, -2657, -1526, 393, 1775, 2975, 3148, 2165, 447, -1669, -2621, -2937, -2573, -954, 838, 2304, 2976, 2621, 1379, -46, -1763, -2603, -2905, -2059, -443, 1239, 2902, 3157, 2201, 1120, -739, -2476, -3223, -2462, -1410, 339, 1676, 2823, 2760, 1806, 587, -1426, -2664, -3283, -1978, -796, 815, 2198, 2970, 2620, 1447, -227, -1932, -2855, -2764, -1568, -182, 1599, 3050, 2749, 2078, 571, -960, -2408, -2699, -2686, -1086, 627, 2235, 2837, 2816, 1723, 14, -1685, -2867, -3186, -2211, -226, 1214, 2356, 2658, 2481, 1159, -394, -1943, -2812, -2783, -1834, -41, 1553, 2738, 2969]
2932B969p21j675k135r09l72O67J301J784J022Q94l53j005j658j320j101k22J024
2949a810J410J707J138O11j061j007j757j762k59L30J093J980J340N94J74j091
2965A630j510j111j502j30O90R50J628J573M59j23r50k033j470j086L75J143J396
2982g1J325J448J1o16j219j654j570n41M76R66J869J555R42q1j184j669j322j138
3000b473l62P96J869J489Q74N75n87j323j433j287o69N0R52J579J479J126j08
3017B547m17j572j808j096o07O85J440J498J551M62l16j188j347j600q51K22P70
3034a627J234J422J448Q3r5j642j423j578r00M14J199J686J598P65J33j277j344
3051I6j314j010m68N08J421J596R89O40m36o11j564j588j028J8J102J772J626
$$ y = [2969, 2248, 573, -1562, -2471, -2843, -2176, -875, 909, 1931, 2825, 2472, 1467, -191, -1511, -2612, -2834, -1810, -400, 1307, 2445, 3056, 1995, 988, -769, -2531, -2790, -2460, -1367, 613, 1953, 2547, 2721, 1630, 120, -991, -2493, -2623, -1933, -983, 645, 2218, 2677, 2554, 1604, -429, -1899, -2985, -2610, -1467, -71, 1254, 2702, 2713, 2097, 878, -776, -2346, -2887, -2411, -1445, 424, 1979, 2921, 2840, 1656, -13, -1335, -2473, -2835, -2039, -170, 1319, 2193, 2768, 2181, 858, -575, -1862, -2531, -2481, -1529, 50, 1529, 2655, 2547, 2130, 558, -1250, -2346, -2953, -2268, -828, 670, 2221, 2683, 2367, 1179, -168, -1768, -2619, -2397, -1627, -393, 1029, 2477, 2560, 2465, 823, -600, -2178, -3078, -2664, -1465, 221, 1819, 2584, 2717, 1440, 96, -1218, -2228, -2696, -2188, -767, 829, 1818, 2458, 2022, 1411, -153, -1741, -2769, -2751, -1649, 123, 1749]
3068A749M18O11o84j410j517j547N6K58R69J707J296Q29k06q28j494j698o92n59
3086b742O15J382J882P50M93N0j786j084j281r14K40R37J306J579Q98l9n76j107
3104F03j639j279p3N5J591J466J263P27l86j038j922j139l86n6M61J263J789N17
3122A817J025p88j336j339j162o55J05J139J622J192Q96j20r17j292j528o55k14
3139b210L61R84J664J044M72k81o52j561j690o36L84P88J416R31J023M77k72j665
3157E77j560j160m68K95J031J569J323J030l33p37j887j065q33j8P06R74J389
3174H33J116O85m64j210j816j079m55N87O34J412J314O08K38o38j192j498j086
3191b011k92M53Q62J570P19Q93P9j129j545j043q87KR08J172J490P05K72l76j268
$$ y = [1749, 2167, 2778, 2094, 684, -833, -2380, -2324, -2066, -1097, 610, 1906, 2735, 2529, 1701, 207, -1491, -2183, -2742, -2127, -745, 1137, 1887, 2380, 2430, 644, -440, -1721, -2635, -2395, -1458, -152, 1427, 2325, 2286, 1710, 603, -1036, -2315, -2388, -2333, -742, 724, 1987, 2714, 2328, 1290, -632, -1771, -2157, -2213, -1752, -489, 1300, 1817, 2842, 2054, 718, -621, -1783, -2438, -2333, -1194, 428, 1620, 2516, 2396, 1479, 187, -1341, -1996, -2210, -1849, -865, 799, 1843, 2315, 2034, 1382, -179, -1869, -2505, -2121, -1333, 83, 1014, 2037, 2514, 2242, 577, -983, -2143, -2611, -2316, -1285, 284, 1607, 2637, 2304, 1567, -320, -1385, -2218, -2236, -1530, -556, 833, 1949, 2634, 2170, 960, -856, -1935, -2390, -1803, -1169, 243, 1557, 2165, 2403, 1765, 573, -925, -2011, -2303, -1850, -988, 582, 1301, 2194, 2273, 1144, -401, -1444, -2331, -2329, -1421, -249, 1241, 1946, 2218, 1842, 574]
3210E74j494j089l61M32Q06J365J335M73L43r79j326r63j266j37N62J045J653
3227I73J094J91l6j202j352j294n32r1J006J164J076R20M16m67j079j539j253
3244b005l58N07J037R56J711L52k4p12j527j419q33J2Q85J202J408Q90M5j65j047
3263I15j329j215o57P0J008J275J633L32K93n93j269j237j392JN53J046J163J074
3281A671O66j20j193j282j292o93o7Q01J209J683L42K84j07j236j314j057m60
3298b165J54J181Q06J335O75m3m20j199j350p45n00Q31R78J168J022L65K0j610
3316E03o56j028q97J56Q03J101J289R31M8o04j327j147p77n72L76J241J143J021
3334A604J75K15o97j547j261m57l01R05R70J301N99M79l71r37j313r93m24J06
$$ y = [574, -920, -2009, -2370, -1938, -1132, 233, 1568, 2041, 2384, 1405, 79, -884, -2150, -2287, -1725, -680, 973, 2067, 2258, 2222, 1020, -332, -1626, -2158, -2249, -1243, -79, 997, 1917, 2333, 1866, 787, -752, -2005, -2363, -1856, -819, 137, 1848, 2200, 2176, 1464, -63, -1482, -2315, -2303, -1418, -216, 1192, 2082, 2127, 1962, 915, -414, -1629, -2286, -2216, -1208, 67, 1700, 2032, 2325, 1732, 463, -774, -2166, -2165, -1612, -566, 597, 1671, 2337, 2217, 1024, -258, -1550, -2243, -2310, -1509, -300, 1383, 1725, 2009, 1902, 666, -648, -1705, -2165, -2011, -830, -24, 1311, 1986, 1943, 1523, 324, -1026, -1771, -2271, -1440, -462, 706, 1728, 2093, 2113, 503, -153, -1181, -2078, -1922, -1119, -18, 1271, 2202, 2250, 1646, 319, -828, -1605, -2177, -1801, -560, 583, 1604, 1779, 1994, 1297, -250, -1511, -1968, -2269, -1364, -394, 907, 1506, 1985, 1614, 677, -636, -1629, -2053, -1947]
3352a947J152Q02J111O37L20j117m94j668o17j53K56R95J820N85L17k54q22j129
3370b06r62r20P7Q94P93J345Q74K42m52r75j389j116o0L52O76J173R40N92m13
3389A465l09j278r24p72m7P65Q92J125P80L3j77r81r76j127k56k39M95J529J088
3408A086P39L7m79j092r70p12o53L49J141R28R35J014o21p24p32j360p29r1N81
3427a353J334P74Q87O53n18j264j081j252k22K80P03J216R60M22N61j022j074
3444Dj057n00l87O40P07J092J128K57j80p26j336q79q36J63P23J108J189N39J7
3463A666m09n58j248j090NJ76Q21Q22Q88O06K45p49j193j141o68o6M31J053J347
3482I38Q24M5m12o56j013r45m02j39P46J273O94Q98J70p06j318q19q91M0M10O02
$$ y = [-1947, -795, 7, 1118, 1755, 2075, 958, 464, -1204, -1821, -1974, -1718, -723, 1097, 1682, 1999, 1745, 923, -206, -1168, -2088, -2011, -1117, -324, 1021, 1895, 2137, 1685, 710, -679, -1795, -1855, -1503, -827, 346, 1286, 1878, 1465, 1156, -122, -1046, -1818, -1865, -1100, -208, 917, 1697, 1730, 1553, 572, -404, -1531, -1787, -2026, -1531, -2, 1086, 1825, 1862, 1383, 291, -679, -1391, -2044, -1695, -554, 374, 1309, 2323, 1702, 978, 246, -1114, -1843, -1934, -1353, -19, 755, 1642, 2295, 1777, 513, -568, -1820, -2042, -1762, -1059, 157, 1117, 1539, 2100, 1078, 4, -1053, -1553, -1940, -1300, -593, 499, 1627, 1884, 1704, 978, -358, -1237, -2073, -1910, -1187, -79, 1110, 1649, 1666, 1257, 699, -549, -1639, -1634, -1458, -637, 185, 1073, 1679, 1924, 1175, -18, -1159, -1827, -1893, -1462, -409, 938, 1762, 1807, 1395, 739, -274, -1219, -1621, -1760, -1014, 259, 953, 1851, 2021, 1315, -3, -822, -1713, -1673, -1263, -661]
3502f61J329R24j6m13k98j220p94p02J65M42P95R92Q03O82l88j012j126r85k66
3521a749K52P32R34J079J97K57o60r24r08n42j75K34O61J161R34M46n38o28j045
3540b82j060m73J07P31J013R42Q42p7m69r84p89q67l14J01Q79J191O64M87K6p39
3560I29r57j075n17K89L59P39J141N48J98n75n01r09j052k11L64M29P04J271M32
3579A606j43l12j037q48j010n1L73J211N95Q18O17k11r47r50o84m27m8N08Q63
3598g7R31K74J83Mq33r16j101J27j51J010Q39R24L3J25o33p37p47q96J44L30P57
3619d10J366K61K93K2q98r35q91n75K75M93J054J161M34r7n98q38r15o04k05L55
3639a252O91P96P84N22l61m38r04p41o68O4L51J061Q70N41J24l32p49q72o50l67
$$ y = [-661, 668, 1592, 1576, 1163, 865, -355, -1149, -1851, -1686, -1244, -449, 543, 1346, 2028, 1640, 628, -498, -1483, -1749, -1497, -765, 169, 1248, 1445, 1702, 1042, 118, -790, -1332, -1507, -1273, -612, 549, 1483, 1929, 1391, 763, -282, -1342, -1815, -1708, -977, 36, 978, 1820, 1743, 1274, 290, -499, -1366, -1680, -1579, -700, 491, 1155, 1642, 1668, 929, -28, -1103, -1620, -1331, -972, -233, 908, 1456, 1654, 1079, 578, -331, -1383, -1594, -1230, -801, -97, 1174, 1606, 1463, 1151, 114, -734, -1744, -1795, -1422, -211, 384, 1202, 1819, 1608, 661, -289, -973, -1400, -1448, -940, -77, 854, 1128, 1311, 1315, 482, -434, -1535, -1408, -1559, -549, 290, 1214, 1247, 1372, 739, 2, -745, -1641, -1497, -1167, -410, 956, 1217, 1510, 1532, 634, -301, -1192, -1767, -1492, -999, 55, 1216, 1650, 1553, 955, 117, -798, -1402, -1607, -1252, -561, 235, 1019, 1541, 1180, 742, -162, -903, -1571, -1507, -1156, -95, 775, 1316, 1440, 1108, 359, -513, -1163, -1530]
3659a530M21N16O38O20Q81L9q98k69j094p97j4R8J046J183L86K45j27r22q21q80
3679a279O3j68N44O21P86P34J72j87j047p52o27k02k26J018N26J079M11j62o19
3698F85o39q26o79O6M06N47Q15O42O00m85p10n56q25l1M7K8J158O48N60M3o38
3719H56p86p78m43k12J27O61J029P06K76K35j125n25q40n55j71N81Q03Q17N86
3738A242J10m37n43n73j041Q7j89P92N80P72K83M66p22q68q65l89j24M43P60O98
3758D82P36K3p1q01k25j124j07LL54N93Q91L71K62j49j132n47o22p51P27M55Q40
3779B08R60J05q1l77q45n97p40J78L23Q46M38R54l3Kp11r76l20k74k46N17P53
3800H4J021Q1N7l33p73q38m19m6J71L90P55J151j17Q1q86k48j192k26J06J76R99
$$ y = [-1530, -1109, -593, 45, 665, 1546, 1585, 687, 418, -676, -1473, -1487, -1389, -343, 840, 1226, 1471, 1344, 422, -399, -1279, -1216, -1384, -840, -219, 567, 1301, 1473, 1286, 239, -513, -1140, -1342, -1568, -550, -24, 1055, 1466, 1304, 685, 46, -780, -1459, -1393, -987, -440, 375, 1017, 1617, 1132, 422, -134, -959, -990, -943, -915, 243, 891, 1451, 1494, 856, 70, -708, -1151, -1363, -1236, -575, 454, 1160, 1436, 1671, 546, 21, -819, -1374, -1545, -964, -161, 656, 1242, 1352, 915, 372, -201, -1242, -1155, -1344, -552, 28, 800, 1083, 1549, 827, -41, -906, -1295, -1419, -976, -216, 482, 1218, 1241, 1170, 369, 144, -980, -1087, -1084, -730, -137, 754, 1125, 1387, 1238, 106, -441, -1063, -1814, -1087, -632, 208, 1168, 1273, 1192, 815, -30, -627, -1367, -1189, -866, -20, 418, 1372, 1339, 1341, 630, -346, -666, -940, -1186, -669, 84, 1105, 1186, 1243, 910, 137, -701, -1120, -1166, -995, -605, 150, 1301, 1184, 1265, 379, 131, -1061, -1287, -1181, -1005, -6]
3821fP58K74J22j2p36q08p44k20J44M41Q38O01M39O9n02o78q58k22j71N13P60
3842BM80O8Q03l30k84j055n53j41R4K66P21N65M47Q8l19r07m18p48m8J66L78J068
3864C43M69M67r9m47p33p28n64N2N44N89N69M65K92J50j233n99o12r8j16R55M98
3885A64N22O76j4m24o21q55m29n08N22P16M65P85J31j86n19j74o91q33J91M17
3905f65Q58N40M94J68p24o73n34l40l42N46j6Q48R98J36r0k53q85m93q68L30K05
3926g60Q15L20Q22m02R9n45o82n28m11K44M83N83P42K60q7l80k87m28r69P0J05
3947i36Q45N41m4O78J8p81m56n31m59J26J50P13P42L78j6j40l07o54p53j89K84
3968g91K73N89K74N87K8l82n69o34j80l34M10M68P55L94L95m12m67m68q05j25
$$ y = [-6, 752, 1026, 1148, 1136, 400, -408, -1152, -1372, -1228, -787, 51, 652, 1091, 1160, 658, -20, -878, -1100, -1271, -758, 2, 482, 550, 1353, 1023, 739, -316, -869, -1010, -916, -650, 71, 636, 1083, 1171, 852, -55, -473, -1221, -1269, -1103, -725, 343, 812, 1279, 1180, 733, 0, -728, -1292, -1240, -696, -107, 462, 927, 1219, 1369, 136, -463, -1075, -1173, -1289, -334, 164, 686, 1362, 1348, 924, 303, -552, -981, -1489, -967, -251, 214, 999, 1130, 944, 425, 251, -440, -1273, -1082, -665, 193, 733, 1227, 1395, 671, -2, -536, -876, -1218, -672, -688, 160, 1158, 1294, 1204, 951, 66, -427, -1295, -965, -760, 55, 375, 1197, 795, 894, 349, -333, -861, -1272, -1028, -545, 38, 780, 1040, 953, 573, 286, -142, -1111, -1041, -936, -91, 450, 406, 1084, 1102, 321, -135, -666, -1125, -999, -849, -136, 606, 984, 968, 828, 521, -133, -886, -1075, -791, -518, 71, 345, 932, 960, 578, 9, -625, -805, -1139, -729, -261, 494, 888, 1283, 871, 404, -64, -869, -994]
3988i94J97K34N18O82J50K20l82k68o48o32n28O88L55N29Q13J73l29m78k38m36
4008c74k60m72L04O22O01N67J08k23o87m53k61o67N23L71N61N15J77J6J20q22
4028B66j000l83K03J0P42N36O87j67J06p64l85m46n92K43J29Q88M96L76J0l82
4048E73k97o51j74m25r7N19M17Q99K16r4l49o69m10n07K2O11M41L27N69J10k61
4069G70k08j046k17J80m47L21N63L38N40Q9k65k52n49o47p2J7O82K33N56J63k1
4090G28j85n52k27p08J01J19P33M54K59L39m74k8o37o28o3k52M87O90L71L94j44
4111G77o28j66j00p58j40L96L75J98N97K20O6m43m27k82o84L8M78K98P46J45J08
4132H14j03p69p7m95q2PN14M91O12k0j79j87m19n62l54K27M4N04R4R03r2Mn17
$$ y = [-994, -797, -563, -45, 637, 787, 1007, 625, 357, -291, -923, -1451, -763, -408, 121, 934, 1107, 778, 300, 62, -374, -634, -1106, -802, -180, 421, 988, 1096, 873, 186, -267, -528, -1195, -672, -301, 260, 775, 952, 968, 1088, 266, -734, -1117, -914, -904, -162, 374, 1061, 894, 1000, 236, -149, -595, -1187, -944, -815, 73, 569, 945, 955, 573, 276, -375, -549, -974, -1071, -552, -135, 764, 980, 886, 537, -132, -542, -1049, -1027, -416, 25, 352, 921, 1031, 770, 562, -484, -701, -521, -968, -647, -84, 254, 794, 883, 618, 366, -183, -830, -902, -885, -203, 30, 586, 749, 728, 543, -9, -236, -944, -843, -724, 9, 463, 722, 1061, 587, 559, -78, -706, -769, -1021, -534, 156, 527, 921, 777, 149, -17, -117, -875, -1015, -619, -244, -46, 551, 771, 837, 394, -33, -315, -999, -961, -483, -185, 561, 706, 814, 711, -58, -135, -630, -712, -705, -191, 300, 912, 892, 713, 526, 107, -455, -809, -582, -538, -34, 60, 963, 871, 875, 358]
4155C58p05n94L25K13q7M46N40J67j4k01l99m38m55j37K44K07O82N33L4k90k53
4176A76n09J35n42M3K58L24M20N85J17l69p82j10j59j15k49K37N82K65O09q9k11
4197F16m77o89J13k94K90O4N32M15K51j54k53n88k44l43n5L6O09P90K0M31l26
4218G44p31l69l46j67O8K94N07J88N34q1m2m17m99l13n4L47Q2P35LK53k02m90
4240D4j11m91P1j24L36M57L36K41J41k48m84l23l08M4l08M72M38L14k8R7j39p15
4262b88Q3k94k62K57M25N19L86j32j40p31K25j63m59L9Q4P19K88j8k02N1k38l56
4284b07o80L24M26J21N3L49K34O3m06N8p12m61L75P7M19J12N34j55p1l00p01J9
4306e29L8q2N01K53L36k1J3j51k56m79l24o0N01L3L42NP24k17m88j04j21m53q8
$$ y = [358, -347, -941, -616, -403, -490, -44, 496, 663, 649, 448, 49, -389, -844, -981, -737, -530, 152, 685, 719, 429, 176, -333, -198, -740, -697, -439, -115, 305, 890, 1007, 638, -144, -254, -413, -528, -777, -540, 42, 307, 916, 827, 616, 139, -550, -437, -731, -441, -377, 155, 570, 821, 667, 414, -174, -418, -761, -816, -780, -171, 619, 639, 1070, 744, 13, -356, -702, -869, -801, -507, 0, 188, 722, 641, 599, 182, -317, -630, -684, -337, -255, 480, 483, 736, 534, 44, -67, -558, -487, -611, -275, 182, 518, 759, 900, 652, 168, -155, -463, -419, -727, -255, 183, 497, 469, 566, 427, -288, -205, -499, -761, -504, -79, 440, 826, 694, 554, -177, 48, -115, -574, -535, -451, 268, 556, 538, 336, 387, 149, -207, -887, -563, -137, -16, 37, 386, 620, 683, 277, 335, -377, -838, -463, -386, 33, 145, 679, 524, 453, 153, -548, -529, -491, -573, -72, 181, 517, 496, 509, 358, 102, -377, -701, -761, -260, -227, 115, 120, 844, 627, 139, 35, -86, -539, -627]
4329f27J41K40M34%M96k26n53Q6m51p0K12j37K69N15k6j15L49l70l74k16l00K29
4351d94M23L00L09l4j85k49l59j13n8k59N09L14K20m8J97j65k30J73l89m64J59
4372d43O3M97J76K44qm53j9k51o06K91P8J79O16L68m31O5J7n18j19n6m2J1N55
4395B14r8J48R7Rl22l30j17j97K45J94R6k1P40L9m34m56l41P4j11M02K81J95L8
4418C45J39j08l9n03l19j7J41L6N67K94L9m0k7l83o37k9L20p7K49p5K78J99K65
4441F18o72o0L5m17K8J56K23L32QJ97P1m32m44j72M00q7R3K29K3K42J11j40q4
4464B58l47l71p0J45L04K27K32J29j99l11L6m09J21l45N92K52j14K52p9o0k67
4485b4p2Q8k61r8J91j16O15MK6k94M15p77j54K99n9K08J14K70P8p4m23j29k30
$$ y = [-627, -486, -246, 188, 188, 684, 458, -95, -9, -460, -530, -318, -455, -186, 329, 303, 188, 537, 167, -207, -423, -723, -494, -71, 229, 538, 504, 319, 70, -289, -402, -460, -719, -210, 104, 324, 276, 473, 308, 78, 251, -138, -602, -443, -380, 117, 293, 537, 529, 76, 57, -194, -800, -509, -431, -252, 364, 732, 301, 366, 383, -135, -254, -310, -352, -341, 214, 116, 264, 361, 370, 48, -282, -399, -596, -351, -157, -61, -82, 658, 697, 263, -193, -534, -460, -571, -169, 112, 307, 345, 484, 376, 337, -166, -485, -502, -361, -325, 242, 536, 575, 535, 508, 125, -512, -541, -221, -298, -49, -124, 154, 353, 618, -54, -114, -79, -496, -468, -312, -89, 243, 251, 448, 519, 87, -357, -529, -129, -216, -123, 106, 129, 371, 482, 342, 258, -89, -460, -530, -385, -81, 146, 378, 507, 308, -3, 33, -376, -255, -600, -8, 244, 130, 382, 303, 243, -24, -96, -8, -269, -367, -176, -292, 323, 327, 353, 59, 474, -303, -457, -158, -217, -9, 105, 375, 453, 379, -44, -173, -403]
4508d03K99k15J33M04j99M08j80n9q9l85O9k13KK02M06K24M8N3K07r44n5n6K07
4531a36j83L06J63L60k53L38p14J39k55j39J15J47J29J7L37J37l95j27m7k93j07
4552d61L83J54j54K62l4k09J31K05n27k08p4L83K85p7J26K23m22M31q20K11k4
4573b16k01M47J42J52N4J30m66K37k00l95k4K70J8o9J65Q5J86k43%o2m16k00L04
4596c02L89K36j28J21k64j44R5k79J5O8j95K63K02R7R5J24k73k53k04M5K45n8
4618a05K0M60O6Jm72M2l89J96o6J05M33j9l5P4j04k66m15M87j86P8o3N69r7j26
$$ y = [-403, -104, -319, -186, 218, 19, 427, 247, 188, 99, -286, -217, -430, -428, -226, 180, 404, 452, 505, 712, -232, -287, -343, -136, -319, -13, 150, 510, 257, 595, -119, 20, -235, -374, -259, -112, 17, 34, 371, 508, 113, -14, -61, -354, -461, -78, 76, -78, 184, 150, -59, 72, 277, -250, -458, -532, -149, 136, 59, 185, 408, -14, 417, -403, -192, -216, -417, 30, 172, 324, 378, 508, 42, 279, 79, -316, -340, -70, -52, -121, 44, 129, 315, 72, 72, 10, -406, -606, -302, 87, 323, 195, 316, 52, -92, 3, -276, -261, -193, -388, -125, 77, 174, 269, 393, 120, -133, -337, -292, -47, -105, -85, 375, 441, 442, -30, 12, -377, -181, -247, -142, 291, 272, 237, 311, 207, -59, -474, 13, -173, -95, -158, 411, 314, 188]
$$ [...]
8191c20
##END NTUPLES=NMR FID
##END=
