##TITLE=1H_DE-62_2EXT
 D2O
 8 sc, 
 22.7.2024
##JCAMPDX= 6.0         $$ Bruker NMR JCAMP-DX V2.0
##DATA TYPE= NMR FID
##DATA CLASS= NTUPLES
##ORIGIN= UXNMR, Bruker Analytische Messtechnik GmbH
##OWNER= root
$$ XWIN-NMR		Version 3.5
$$ Mon Jul 22 13:56:42 2024 Russian Standard Time (UT+4h)  she@DPX200
##.OBSERVE FREQUENCY= 200.1308
##.OBSERVE NUCLEUS= ^1H
##.DELAY= (6, 6)
##.ACQUISITION MODE= SIMULTANEOUS
##.ACQUISITION SCHEME= undefined
##.AVERAGES= 8
##.DIGITISER RES= 18
##SPECTROMETER/DATA SYSTEM= spect
##.PULSE SEQUENCE= zg30
##.SOLVENT NAME= DMSO
##.SHIFT REFERENCE= (INTERNAL, DMSO, 0, 15.7039)
##AUDIT TRAIL= $$ (NUMBER, WHEN, WHO, WHERE, WHAT)
$$ ##TITLE= Audit trail, XWIN-NMR		Version 3.5
$$ ##JCAMPDX= 5.01
$$ ##ORIGIN= Bruker BioSpin GmbH
$$ ##OWNER= she
$$ F:/spectra/data/she/nmr/H-F/1/audita.txt
$$ ##AUDIT TRAIL=  $$ (NUMBER, WHEN, WHO, WHERE, WHAT)
(   1,<2024-07-22 13:54:52.21 +0400>,<she>,<DPX200>,
      <created by zg, POWCHK disabled, PULCHK disabled
       configuration hash MD5:
       00 E9 B6 7A A2 85 ED C7 34 08 36 98 17 FE 4E 26
       data hash MD5: 16K
       5E E6 5A 7A FC 88 A8 CD F3 40 80 0E 3B E8 31 C4>)
$$ ##END=
$$ 
$$ hash MD5
$$ A8 F8 EF 23 AA 26 B3 0F 30 E6 43 77 2F B2 44 EB
##$RELAX= 
##$RELAX= 
##$RELAX= 
##$RELAX= 
##$RELAX= 
##$RELAX= 
$$ Bruker specific parameters
$$ --------------------------
##$DU= <F:/spectra>
##$EXPNO= 1
##$NAME= <H-F>
##$PROCNO= 1
##$TYPE= <nmr>
##$USER= <she>
##$AMP= (0..31)
100 100 100 100 100 100 100 100 100 100 100 100 100 100 100 100 100 100 
100 100 100 100 100 100 100 100 100 100 100 100 100 100 
##$AQSEQ= 0
##$AQ_mod= 1
##$AUNM= <au_zg>
##$AUTOPOS= <>
##$BF1= 200.13
##$BF2= 200.13
##$BF3= 200.13
##$BF4= 200.13
##$BF5= 200.13
##$BF6= 200.13
##$BF7= 200.13
##$BF8= 200.13
##$BYTORDA= 1
##$CFDGTYP= 0
##$CFRGTYP= 5
##$CHEMSTR= <none>
##$CNST= (0..31)
1 1 145 1 1 1 1 1 1 1 1 1 1 1 1 1 1 1 1 1 1 1 1 1 1 1 1 1 1 1 1 1 
##$CPDPRG= <>
##$CPDPRG1= <>
##$CPDPRG2= <>
##$CPDPRG3= <>
##$CPDPRG4= <mlev>
##$CPDPRG5= <mlev>
##$CPDPRG6= <mlev>
##$CPDPRG7= <mlev>
##$CPDPRG8= <mlev>
##$CPDPRGB= <>
##$CPDPRGT= <>
##$D= (0..31)
0 1.2 0 0 0 0 0 0 0 0.06 0 0.03 0 0 0 0 0.0002 0 0 0 0 0 0 0 0 0 0 0 0 
0 0 0 
##$DATE= 1721642091
##$DBL= (0..7)
120 120 120 120 120 120 120 120 
##$DBP= (0..7)
150 150 150 150 150 150 150 150 
##$DBP07= 0
##$DBPNAM0= <>
##$DBPNAM1= <>
##$DBPNAM2= <>
##$DBPNAM3= <>
##$DBPNAM4= <>
##$DBPNAM5= <>
##$DBPNAM6= <>
##$DBPNAM7= <>
##$DBPOAL= (0..7)
0.5 0.5 0.5 0.5 0.5 0.5 0.5 0.5 
##$DBPOFFS= (0..7)
0 0 0 0 0 0 0 0 
##$DE= 6
##$DECBNUC= <off>
##$DECIM= 24
##$DECNUC= <off>
##$DECSTAT= 4
##$DIGMOD= 1
##$DIGTYP= 9
##$DL= (0..7)
0 120 120 120 120 120 120 120 
##$DP= (0..7)
150 150 150 150 150 150 150 150 
##$DP07= 0
##$DPNAME0= <>
##$DPNAME1= <>
##$DPNAME2= <>
##$DPNAME3= <>
##$DPNAME4= <>
##$DPNAME5= <>
##$DPNAME6= <>
##$DPNAME7= <>
##$DPOAL= (0..7)
0.5 0.5 0.5 0.5 0.5 0.5 0.5 0.5 
##$DPOFFS= (0..7)
0 0 0 0 0 0 0 0 
##$DQDMODE= 0
##$DR= 18
##$DS= 0
##$DSLIST= <SSSSSSSSSSSSSSS>
$$ [...]
##$SUBNAM2= <"">
##$SUBNAM3= <"">
##$SUBNAM4= <"">
##$SUBNAM5= <"">
##$SUBNAM6= <"">
##$SUBNAM7= <"">
##$SUBNAM8= <"">
##$SUBNAM9= <"">
##$SW= 24.0690372696642
##$SWIBOX= (0..15)
0 0 2 0 0 0 0 0 0 0 0 0 0 0 0 0 
##$SW_h= 4816.95568400771
##$TD= 16384
##$TD0= 1
##$TE= 0
##$TE2= 300
##$TE3= 300
##$TEG= 300
##$TL= (0..7)
0 120 120 120 120 120 120 120 
##$TP= (0..7)
150 150 150 150 150 150 150 150 
##$TP07= 0
##$TPNAME0= <>
##$TPNAME1= <>
##$TPNAME2= <>
##$TPNAME3= <>
##$TPNAME4= <>
##$TPNAME5= <>
##$TPNAME6= <>
##$TPNAME7= <>
##$TPOAL= (0..7)
0.5 0.5 0.5 0.5 0.5 0.5 0.5 0.5 
##$TPOFFS= (0..7)
0 0 0 0 0 0 0 0 
##$TUNHIN= 0
##$TUNHOUT= 0
##$TUNXOUT= 0
##$USERA1= <user>
##$USERA2= <user>
##$USERA3= <user>
##$USERA4= <user>
##$USERA5= <user>
##$V9= 5
##$VALIST= <valist>
##$VCLIST= <CCCCCCCCCCCCCCC>
##$VD= 0
##$VDLIST= <DDDDDDDDDDDDDDD>
##$VPLIST= <PPPPPPPPPPPPPPP>
##$VTLIST= <TTTTTTTTTTTTTTT>
##$WBST= 1024
##$WBSW= 4
##$XGAIN= (0..3)
0 0 0 0 
##$XL= 0
##$YL= 0
##$YMAX_a= 136438
##$YMIN_a= -136129
##$ZGOPTNS= <>
##$ZL1= 120
##$ZL2= 120
##$ZL3= 120
##$ZL4= 120
##$ABSF1= 10
##$ABSF2= 0
##$ABSG= 5
##$ABSL= 3
##$ALPHA= 0
##$AQORDER= 0
##$ASSFAC= 0
##$ASSFACI= 0
##$ASSFACX= 0
##$ASSWID= 0
##$AUNMP= <proc_1d>
##$AZFE= 0.1
##$AZFW= 0.1
##$BCFW= 1
##$BC_mod= 2
##$BYTORDP= 1
##$COROFFS= 0
##$CY= 11.3945322036743
##$DATMOD= 1
##$DC= 2
##$DFILT= <>
##$DTYPP= 0
##$F1P= 15.6554695791079
##$F2P= 12.8336369535428
##$FCOR= 0.5
##$FTSIZE= 0
##$FT_mod= 4
##$GAMMA= 1
##$GB= 0.15
##$INTBC= 1
##$INTSCL= 1
##$ISEN= 128
##$LB= 0.24
##$LEV0= 0
##$LPBIN= 0
##$MAXI= 10000
##$MC2= 0
##$MEAN= 0
##$ME_mod= 0
##$MI= 1.114404
##$NCOEF= 0
##$NC_proc= 0
##$NLEV= 6
##$NOISF1= 3.799351
##$NOISF2= 2.8
##$NSP= 1
##$NTH_PI= 0
##$NZP= 0
##$OFFSET= 15.70392
##$PC= 1
##$PHC0= -25645.8
##$PHC1= 17.78749
##$PH_mod= 1
##$PKNL= yes
##$PPARMOD= 0
##$PSCAL= 0
##$PSIGN= 0
##$REVERSE= no
##$SF= 200.130013532006
##$SI= 16384
##$SIGF1= 3
##$SIGF2= 2
##$SINO= 400
##$SIOLD= 16384
##$SREGLST= <1H.CDCl3>
##$SSB= 0
##$STSI= 0
##$STSR= 0
##$SW_p= 3612.71676300578
##$SYMM= 0
##$S_DEV= 0
##$TDeff= 0
##$TDoff= 0
##$TI= <>
##$TILT= no
##$TM1= 0
##$TM2= 0
##$TOPLEV= 0
##$USERP1= <user>
##$USERP2= <user>
##$USERP3= <user>
##$USERP4= <user>
##$USERP5= <user>
##$WDW= 1
##$XDIM= 8192
##$YMAX_p= 0
##$YMIN_p= 0
$$ End of Bruker specific parameters
$$ ---------------------------------
##NTUPLES= NMR FID
##VAR_NAME=  TIME,          FID/REAL,        FID/IMAG
##SYMBOL=    X,             R,               I
##VAR_TYPE=  INDEPENDENT,   DEPENDENT,       DEPENDENT
##VAR_FORM=  AFFN,          ASDF,            ASDF
##VAR_DIM=   8192,          8192,            8192
##UNITS=     SECONDS,       ARBITRARY UNITS, ARBITRARY UNITS
##FACTOR=    0.0002076,     1,               1
##FIRST=     0,             0,               0
##LAST=      1.7004516,     0,               0
##MIN=       0,             -136129,         0
##MAX=       1.7004516,     136438,          0
$$ Real data points
##PAGE= N=1
##DATA TABLE= (X++(R..R)), XYDATA
0@%%%%%%%%%%%Pj4J4j4J4j6K3k8L2l9M9n7O4p6Q7r8J13j29J45j64J87k09K32k62
35a39K94l26L62m01M45m97N52o09O72p44Q25r15J017j131J258j409J586j792K044
54A092k359K760l291M028n112O814j4706J47212q201j85409n5942N7453J15623
67E9962O2095r5699j51405L0110J50575O1970p8669j16597l7294J15602J30915
78A31565m9994j65472m0406J17523J15995j7204j35188r0315R4822J48927j2651
89I7602j33613o6870N1300J06307N3279q6317j28620J7323J37915O5816p7596
100C6526j19304k1755J17098J09035n8382j43919k9230J11893J02369l1386j24080
111e1135n5275Q3918J05349k614r5110p8561K9945J19824N5236j00049j17704
$$ plain form
0 0 0 0 0 0 0 0 0 0 0 0 0 7 -7 7 -7 7 -9 14 -14 18 -21 28 -29 35 -41 46 -52 61 -68 77 -87 100 -109 123 -139
35 -139 155 -171 191 -210 235 -262 290 -319 353 -391 434 -481 536 -595 663 -746 840 -952 1092
54 1092 -1267 1493 -1798 2230 -2882 3932 -10774 136438 128237 -57172 -113114 -55661 59962
67 59962 122057 26358 -125047 -94937 55638 117608 38939 -77658 -114952 650 131565
78 131565 81571 -83901 -124307 -6784 109211 92007 -43181 -133496 -38674 110253 97602
89 97602 -36011 -102881 -51581 54726 108005 21688 -106932 -89609 48306 114122 36526
100 36526 -82778 -104533 12565 121600 63218 -80701 -109931 1962 104331 72945 -51135
111 -51135 -106410 -22492 82857 80243 -14867 -93428 -63483 56341 111577 11528 -106176
122a06176L1318J25457N2412p3605j10777j1640J14262Q8773o2900j20754j6818
133i0448R2914Q4578k0532j05964n8260P0088J03838M789r3685q3179L4541J24367
145F3047M5152j08778j03771M4096J13549L7033p0424r5363m440J01795P4707
156I6603n6098j04349j6950P9700Q0687j4127j02684o0831P1624J06910j954j02459
168b3928p0196N0118J11027K3156j00754p9965M3113R3681L1778n7719q7622p514
180g4825R6797O9262n5416r6727j5085P5822P8568j6418j04247n1697P8893R6610
192H1537j7018r5576n1059N2087Q9498J3547q1824o8297L1834Q4320L5756n4808
204A9997q5987m631R4992O3345n8426r0632p602P4674O8889k2616r6620l8357
$$ plain form
122 -106176 -74858 50599 103011 29406 -81371 -93011 21251 110024 47124 -73630 -90448
133 -90448 2466 87044 66512 -39452 -97712 -27624 76214 81003 -12682 -95861 -61320 63047
145 63047 108199 -579 -104350 -60254 53295 90328 19904 -75459 -79899 21896 96603
156 96603 40505 -63844 -80794 -1094 79593 65466 -37218 -98049 -26425 80485 78531 -23928
168 -23928 -94124 -44006 67021 90177 -10577 -90542 -47429 46252 78030 20311 -67311 -74825
180 -74825 21972 91234 35818 -60909 -75994 -172 78396 61978 -42269 -93966 -15073 81537
192 81537 64519 -31057 -82116 -30029 59469 73016 -8808 -77105 -45271 39049 74805 19997
204 19997 -65990 -70621 24371 87716 29290 -61342 -68944 5730 74619 52003 -44617 -82974
216h2974P7495P8950k2104p9649m0924M0766P9210J8247p4850o7381K9120Q3774
228C9680L3442n8727q1142N651R0319M9347n6854p9896k392P0203N8546k6160
240D2017q4507k8210O8164O6025j7919o9126m0949L5669P8348J7640p6252o3632
252g2732L5820Q0578K1843n9773o9196J2915Q0829L8484n3318o7546k33O2461
264A0132N2098k5616p6729k4330O2038O1303j5379o7658l9273M0224P5287Q322
276F0419p6422n1452M0356P0302J2449n4310n7496J3099P2007L3294m8980o1937
288d8671R83N8637M7777k6393p2402j9686O1023N5890j8859o5153l2423M3229
300a6048O7939j390p0171l9374L8307N9456J0379m8729n2232J3027O6889K9532
$$ plain form
216 -82974 -5479 73471 51367 -28282 -69206 -28440 50770 69017 -5833 -73214 -44094 39680
228 39680 73122 14395 -66747 -61096 29223 78570 21716 -58180 -60572 9631 68177 42017
240 42017 -42490 -70700 -2536 63489 45570 -23556 -64505 -28836 49512 67152 -9100 -72732
252 -72732 -36912 43666 65509 5736 -63460 -50545 30284 68768 15450 -52096 -52329 10132
264 10132 62230 36614 -40115 -64445 -2407 58896 43517 -24141 -63414 -23190 52097 60419
276 60419 -16003 -67455 -27099 43203 55652 1342 -56154 -43055 28952 62246 13266 -48671
288 -48671 -47688 10949 58726 32333 -40069 -59755 1268 57158 38299 -26854 -59277 -16048
300 -16048 51891 50501 -19670 -59044 -20737 38719 49098 369 -51863 -38836 28053 57585
312E7585m7150n7700K902N7577M3553l0012o7989j2436N9556M7771k1946n9783
324b8072k5148M2333N9509n927o3066l2511L4965N3013J1015m6086n1106J5441
336c5640O6483K3230m8513n1721P239N5063L6580l1761o1779o293N6785M0060
348D9733k3738n3214k0475L9964N3094o915n8581k9479L4727N0669P332m6965
360c848m6003J9998O2319J6495m8604m4952J1801N1145K9640l2233n5190j884
372d1316N2737L4379k3597m9443j7322L9958M8670j0038n5449k5225L4627M8244
384C6225L246m8078l9539K5250N5855R832m5224l8549J2439M7456K6220l3027
396A2106n0613J536M9522L0377k3246m7386j4333M0932M5167j4428n3500j9207
$$ plain form
312 57585 10435 -47265 -44363 13214 56767 26755 -41234 -53670 5886 53657 31711 -28072
324 -28072 -53220 -10887 48622 42695 -20371 -52882 -17917 35096 46111 25 -51081 -35640
336 -35640 30843 54073 5560 -46161 -38922 16141 52721 20960 -40819 -47112 9673 49733
348 49733 25995 -27219 -47694 -7730 45364 38449 -20132 -49611 -14884 35785 43117 -3848
360 -3848 -49851 -29853 32466 48961 357 -44595 -32794 18351 47991 15758 -39432 -41316
372 -41316 11421 45800 22203 -27240 -44562 -4604 44066 34028 -21421 -46646 -12019 36225
384 36225 39471 -8607 -48146 -22896 32959 42791 -2433 -40982 -28543 18913 45133 12106
396 12106 -38507 -36971 12551 42928 19682 -27704 -42037 -1105 44062 29634 -23866 -43073
408d3073L5591M3278m69m6686l4366K7628N1336M678m2863l3404J2876M4775K2972
421D2273l2907m7595M359M8776K6197k5255m4222j0709M1214M1009j8034n1054
433b5948j3996L6290L8435l958m3500k9110K6791M7570K475m1128l1062J4222
445b2919M3473J9739l4258m4029P518M7655K2352k7037m2125n638M0565L5324
457D0620j9739m6887j0208L4891L4714n531m1832k5880K7385M4106P45l9560k9408
470c6584J5810M3028J6328l6361m0047J1991M4334J8074k7581l8110l025M0180
482H037L0338k1380m2260p904L3009L2590o705m0879k3243K9173M0937j971l9342
495i600k6207J8289M2031J1594l7897l4682J5628M0122J3996k6348l5015j286
$$ plain form
408 -43073 -7482 35796 35327 -11359 -45725 -18097 33239 37917 -4946 -38350 -25474 19301 42273
421 42273 9366 -38229 -33870 14906 41103 15848 -28374 -39083 2131 43140 25106 -25948
433 -25948 -39944 -3654 34781 30823 -12677 -41787 -14996 32574 35049 -6079 -37141 -22919
445 -22919 20554 40293 6035 -37994 -30476 17179 39531 12494 -29631 -35269 5296 40620
457 40620 20881 -26006 -36214 -1323 33391 27860 -13972 -39852 -12467 31639 32384 -7176 -36584
470 -36584 -20774 22254 38582 2221 -37826 -25835 18499 36573 8992 -29118 -32143 8037
482 8037 38375 16995 -25265 -33169 -160 32430 25725 -15154 -38397 -9224 31713 29742 -9600
495 -9600 -35807 -17518 24513 36107 -1790 -36472 -20844 19278 33274 6926 -28089 -29375
507b9375L7819K8342k1808m0692n670L2668L1292r157m1116j9816L1249L8706
519C2442n948l8542k2121K0247L9316O430l6121k9668J5477L7214J2197k4751
531F172l4176k28L8851K5867k4183l9135k722L3289K8199j1435l9712j5434L2436
544b211L4007r006l6053j8122K0177L5464N035l3965k7288J4373L6315J2415k6567
557D574l3892K792L9756K2281k6491l6166K73L2912K4728j2847l7755j2015L1280
570e70L0541r502l3163j6909J8800L4675M791l3992k7109J6963L5541R838k7956
583A948l1628O733L8897J6554k7031l0860J849K9972K2418j3001l5440j0110K9858
596A59K8353q996l2620j6324J9638L4651K731l5456k4354J9487L4516N340k7899
$$ plain form
507 -29375 8444 36786 14978 -25714 -31384 1284 32576 23419 -17697 -37513 -6264 32442
519 32442 26494 -12048 -34169 -13922 25394 31824 -4297 -33965 -18488 18726 30923 6172
531 6172 -28004 -28232 10619 36486 12303 -26832 -29554 3735 31934 20499 -19213 -34647 -2211
544 -2211 31796 22790 -13263 -31385 -11208 24256 29291 -4674 -31962 -17589 18726 31141 4574
557 4574 -29318 -26526 13230 35511 9020 -27146 -26873 6039 30767 17920 -19835 -31850 -570
570 -570 29971 20469 -12694 -29603 -10803 23872 28663 -5329 -32438 -15475 20066 29904 1948
583 1948 -29680 -22947 15950 32504 5473 -25387 -23538 6434 28852 15851 -19589 -29699 159
596 159 28512 19516 -13104 -29428 -9790 24861 27592 -7864 -32218 -12731 21785 27125 -774
609g74k7544Q772L5461J3467k5091k8355K254K7662K2239j3086l4963q857L0425
622A610K6666j0551l1763j4817K2169L2483j491l5000j9428K0574L0323L092k6091
635b224k3806Q599L1969J3286k3452k7733J838K8967K1237j5950l4736m847L1340
648D488K3418j3144l0345j0943K2592K9230m779l2054j5500J9515K6798K878k3568
661a414k4173Q691L2415J1866k4458k7728M424L0267J7955j8683l1767m38K9432
674F389J9823j4296k7430q630K1953K6180n119l0164j3964J8161K5836L337k4700
687b624k3815J0916L3346Q410k7270k3498P987K7855J3814j8216k8273O21K7547
700F800J6528j2404k5775q259K0925K5341n318k9093j3942J9235K5744J358k6125
$$ plain form
609 -774 -28318 -19546 15915 29382 4291 -24064 -21810 5852 28091 15005 -19958 -28815 1610
622 1610 28276 17725 -14038 -28855 -6686 25797 24306 -10694 -30122 -9548 20775 23867 -2224
635 -2224 -26030 -17431 14538 27824 4372 -23361 -21523 7444 28681 12731 -22005 -26852 4488
648 4488 27906 14762 -15583 -26526 -3934 25296 20517 -11537 -27037 -7522 19276 22154 -1414
661 -1414 -25587 -16896 15519 27385 2927 -24801 -20377 9890 27845 9162 -22605 -23043 6389
674 6389 26212 11916 -15514 -24144 -2191 23989 18870 -11294 -25258 -7097 18739 22076 -2624
687 -2624 -26439 -15523 17823 26233 -1037 -24535 -16548 11307 25121 6905 -21368 -20747 6800
700 6800 23328 10924 -14851 -23110 -2185 23156 17838 -11255 -25197 -5962 19782 21140 -4985
713d985k1091J4029L0517M379k5677j9483Q603K3983J2411j6279k6146M9K6407
726F717J6361j2651k5068p895K1022K5352o845l0544j0650K0805K3328j744k4802
739f614j7417J5038K6414K605k2614j7551O717K2975J3000j6236k6086O12K6224
752G067J5972j4088k5164m727K2244K1551r136k7650p635J9844K0594l130k2536
765f794j4943J2990K4598L476k1444j7798O585K3996J1883j8434k5288M061K6596
778I484J2344j5402k2819k132K1814J7874j0223k3955o181J7968J8632k630k1308
791f534j4715J3348K4094K348k1893j7031Q778K4379Q279k0096k1492P097K3909
804A0471Q567j4271j9403k118K0007J6818j0101k3191n001J7139J8387k685k2269
$$ plain form
713 -4985 -26076 -12047 18470 22849 -2828 -22311 -13708 10275 22686 6407 -19739 -19690 6717
726 6717 23078 10427 -14641 -22536 -1514 23838 16993 -13551 -24201 -3396 19932 18188 -6614
739 -6614 -24031 -8993 17421 20026 -2588 -20139 -13422 9553 22553 6317 -19769 -19157 7067
752 7067 23039 8951 -16213 -20940 1304 22855 13719 -13931 -21566 -1722 18872 15742 -6794
765 -6794 -21737 -8747 15851 19327 -2117 -19915 -13330 10666 22549 4115 -21173 -17112 9484
778 9484 21828 6426 -16393 -18525 3289 21163 10940 -13015 -19196 -1228 17404 14774 -6534
791 -6534 -21249 -7901 16193 18541 -3352 -20383 -11605 12774 21053 957 -20535 -13438 10471
804 10471 19038 4767 -14636 -16754 3253 20071 9970 -13221 -18222 -1083 17304 14619 -7650
817g650j3645J5362K3666j021k2631j3426J0893K1833M838j9026j7673O804K1237
830I561P889j3011j8736k026K0246J5968j0651k3061l916J8644J6570m563k2424
843i510j0693J7145K0433l623k0420j0652J0239J9534L880j7262j6227O435K0053
856I332Q079j3393j9482N0K0692J4606j3005k1516j500J8536J4948o756k0551
869i960p967J6056J8102m090j7997j0320R350J8836M523j7709j6882P690K0617
882A0249O825j5003j7874K308K0288J1671j4071j8448L32J7034J2251o288j8945
895i671o803J5220J6519l713j7906r847J0068J8736K906j8485j5029R599K0133
908A1727L612j5321j5250L656J9115R047j3053j6827P80J5773J1724o364j8629
$$ plain form
817 -7650 -21295 -5933 17733 16712 -5919 -19345 -8452 13381 18219 -807 -18480 -11676 9561
830 9561 17450 4439 -14297 -16323 3923 19891 9240 -13821 -17737 907 17477 12914 -9510
843 -9510 -20203 -3058 17375 13752 -6668 -17320 -7081 12453 16333 -929 -17156 -10721 9332
856 9332 17411 4018 -15464 -15414 5278 19884 6879 -14637 -16137 2399 17347 10591 -9960
869 -9960 -17927 -1871 16231 12141 -5856 -16176 -6826 12010 16533 -1176 -18058 -10368 10249
882 10249 17074 2071 -15803 -13495 6793 18464 4393 -14055 -13723 3311 15562 9274 -9671
895 -9671 -16474 -1254 15265 11552 -6354 -16201 -6133 12603 15509 -2976 -18005 -8406 11727
908 11727 15339 18 -15232 -11576 7539 16586 3533 -13294 -12514 3259 14983 8619 -10010
921a0010o027J6070J5816m993j8481q347J1666J8474k01j9157j1706J1009J7467
934A1580K005j4357j3406M127J7755P874j2646j6371J362J5998J1603q112j8578
947a1166m167J6872J4451p326j7263o373J2235J6188j484j7692r832J0926J5625
960A0994J802j3511j3366M342J8152O837j3392j5587K405J6587J0029r299j7942
973a1949j998J6722J2128p752j5794m786J1911J4280j787j6935q698R798J5757
986A0897J369j3760j3147N635J8455N473j4805j3619L777J5951Q304j0122j6063
999a1655p01J5827J0198p089j5048m741J1624J4761k717j6679q408J0940J4858
1012A1170Q65j4506j1880P037J7415L489j4215j2315M407J4751P205r964j4787
$$ plain form
921 -10010 -16037 33 15849 10856 -7625 -15972 -4306 14168 13967 -5190 -16896 -5887 11580
934 11580 13585 -772 -14178 -10051 7704 15578 2932 -13439 -12077 3921 15524 7412 -11166
947 -11166 -15333 1539 15990 8664 -8599 -14972 -2737 13451 11967 -5725 -15557 -4631 10994
960 10994 12796 -715 -14081 -9739 8413 15250 1858 -13729 -11324 5263 15292 5993 -11949
973 -11949 -13947 2775 14903 7151 -8643 -13429 -1518 12762 10975 -5960 -14658 -4860 10897
986 10897 12266 -1494 -14641 -9006 9449 14922 117 -13502 -9725 6226 14530 4408 -11655
999 -11655 -12356 3471 13669 6580 -8468 -13209 -1585 13176 10459 -6220 -14628 -3688 11170
1012 11170 12035 -2471 -14351 -7314 10101 13590 -625 -12940 -8533 6218 13423 3459 -11328
1025a1328n1J5006R973p336j5020m158J2362J4148m290j6670o628J1821J3819
1038A1648o74j4584j0486Q186J6018K030j3664j0499M100J4319O695j0137j4756
1051a1804J044J5198R027q377j4244l089J2867J2742n158j6425m269J1281J2556
1064A1349k012j3728q458P800J5399J123j3446j0063M618J4411N778j0445j4712
1077a2386K534J5359P378q938j3858j059J2882J0706n969j5027l522J1473J1465
1090A1038k149j3471q018Q330J4783K16j3429r252N573J4048M876j1852j2702
1103a2009L376J4582O476r433j2515n71J2493J0139o684j4204k651J0692J1106
1116A0797k263j3498p630R109J4095l47j3474q596O439J3409L263j1386j1585
$$ plain form
1025 -11328 -11379 3627 13600 6264 -8756 -12914 -552 13596 9306 -7364 -13992 -2171 11648
1038 11648 10974 -3610 -14096 -5910 10108 12138 -1526 -12025 -7925 6394 13089 2952 -11804
1051 -11804 -10760 4438 13465 5088 -9156 -12245 622 13364 8206 -8219 -12488 -1207 11349
1064 11349 9337 -4391 -12849 -5049 10350 11473 -1973 -12036 -7418 6993 12771 2326 -12386
1077 -12386 -9852 5507 12885 3947 -9911 -10970 1912 12618 6649 -8378 -11900 -427 11038
1090 11038 8889 -4582 -12600 -4270 10513 10729 -2700 -11952 -6379 7669 12545 693 -12009
1103 -12009 -8633 5949 12425 2992 -9523 -10094 2399 12538 5854 -8350 -11001 -309 10797
1116 10797 8534 -4964 -12594 -3485 10610 10263 -3211 -11807 -5368 8041 11304 -82 -11667
1129a1667M123J4024M638r027j1373n20J2704R375p197j3613k338J1431J0260
1142A0820l188j3288o333R727J2916j676j2942p538P024J2736K507j1365j0836
1155a1436N098J2595M406q813j1640O56J2448Q988p870j3258j512J1694R213m205
1169F364j2490n689J0476J1851k445j2463o382P036J1646K222j1384r400M604
1182f054J2839L521r169j0836J316J2481P510q038j2621rJ1049Q685m698j2622
1196f646m241J0476J0519k882j2008n300O445J1609J482j1149q962N214J2384
1209F941L168r457j0415J878J2468O286q418j1279N53J0888P502n008j1625l316
1223i834R867R908l357j1160n492P127J1155P48j1535q312O106J2092J935r119
$$ plain form
1129 -11667 -7544 6480 11118 2091 -9282 -9802 2902 12277 5080 -8533 -10871 560 10820
1142 10820 7632 -5656 -11989 -2262 10654 8978 -3964 -11502 -4478 8258 10765 -600 -11436
1155 -11436 -6338 6257 10663 1850 -9790 -9134 3314 12302 4432 -8826 -10338 1356 10569 6364
1169 6364 -6126 -11815 -1339 10512 8067 -4396 -10778 -3742 7904 10126 -1258 -10658 -6054
1182 -6054 6785 10306 1137 -9699 -8383 4098 11608 3570 -9051 -9060 1989 10674 5976 -6646
1196 -6646 -10887 -411 10108 7226 -4782 -10082 -3637 7972 9454 -1695 -10657 -5443 6941
1209 6941 10109 652 -9763 -7885 4583 10869 2451 -8828 -8275 2613 10115 5107 -6518 -9834
1223 -9834 33 9941 6584 -4576 -10068 -2941 8214 8962 -2573 -10885 -4779 7313 9248 129
1237A29r456K404J1983N272q578j0309R51R936P156m581j1559k842R915R191l449
1252F163j0839m986P274J1039l19j1447p133O799J0583J246q861q822K962J1499
1266E158M401q063j0137J238J0037O601n238j1176k211J0766Q328m518j0472m007
1280i293Q005J0037j270j1161n838O745R667R06q557q027L288J0811L842q327
1294H28r299J627J0354N800n807j0960r46J0119P161m583r725l091Q089Q564j675
1309F456j0076n161O439R334J64q408p490L498J0944L381q912q787K672R693M790
1324H537n920r936R3R808O150n192r037k279O955R014k196j0060m335O530R051
1339G183K21r190p039M544J0764J817r120p464L227R111L970n970r088M41R092
$$ plain form
1237 129 -9327 -6923 5060 10332 1754 -8555 -7604 2332 9488 4907 -6652 -9494 421 9612 6163
1252 6163 -4676 -9662 -2388 8651 8332 -3115 -10248 -3449 7134 8380 -481 -9303 -6341 5158
1266 5158 9559 1496 -8641 -7403 2634 9235 3997 -7179 -9390 1376 9704 5186 -5286 -9293
1280 -9293 -1288 8749 7479 -3682 -9520 -2775 6892 7798 -759 -8786 -5498 5313 9155 828
1294 828 -8471 -6844 3510 9310 3503 -7457 -8403 1716 8877 4294 -5431 -8522 -433 8131 6456
1309 6456 -3620 -8781 -2342 6992 7156 -1252 -8742 -5244 5700 9081 169 -8618 -5946 3747 8537
1324 8537 2617 -7319 -7226 2582 8732 3540 -5497 -7776 -821 8193 5997 -4063 -8398 -1868 7183
1339 7183 7404 -1786 -8825 -4281 6483 8300 -820 -8284 -5057 4054 8024 2054 -7034 -6593 2499
1354B499N680m768q851k165P567Q044k012j0320m390P513Q390p31r126n606M744
1369c532R878R58q328o224K511Q843L305n431r023M68R209N563m881r134j476
1384g294P853P306l191r783k829P552O983j178q425m573M893Q388R88q145n833
1399g288K826Q326L957o446q650J039R563M563n776q077q24Q179O184l511q979
1414d914k053O728O911j610p514n041M675Q600Q04q233n619L392Q485K596o879
1429C28p901K448R291L473o294p077N6P326N991m009q589j585O391O551j427p997
1445c024m629N449Q618n23q218m810M223Q089J578o995o943L043Q136K748n533
1460A209o566k62P313N594m107q018j865P147O534k562q060l599N965P947j706
$$ plain form
1354 2499 8179 3411 -5440 -7605 -38 8006 5994 -4326 -8716 -1203 7187 6456 -2670 -8276 -3532
1369 -3532 6346 7304 -1024 -7248 -4737 4106 7411 1980 -7043 -6575 2634 8197 3316 -5818 -7294
1384 -7294 559 7865 4674 -5109 -7938 -386 6597 5419 -3006 -7579 -2686 5702 6690 -1455 -7288
1399 -7288 -4462 3864 7821 1375 -7275 -6236 3327 7890 2114 -5963 -6787 1392 7576 4065 -4914
1414 -4914 -6967 -239 6672 5062 -2452 -7493 -2818 5782 6586 -1647 -7266 -3874 4611 7207 328
1429 328 -7573 -5125 4166 7639 1345 -5732 -5676 1650 7641 3632 -4957 -6542 -151 6400 4973 -3024
1445 -3024 -7653 -2204 6414 5891 -2327 -7137 -2914 5175 6753 -242 -7185 -4142 3994 6742 1209
1460 1209 -5357 -5619 1694 7288 3181 -4837 -6702 445 6979 4417 -3643 -7242 -1277 6670 4964
1475D964p509m100M501O910J442o678n906K472P731K392n138o693K28P588N259
1490G463m615q098q11P407N376k870p966k408N900O588j422p381l294L779O921
1505D569J370o564o055K898P822J942n369o513P11Q080M442n278q029P02O663
1520A391M779l162o944k362O034O231j391o962l782L804P188R97p513n455M282
1535b865P808R66n716o173J725P547L299n306o834Q11O476L998k866o770k060
1550e960N962N974j782p144l252M624O997L50p770m806M711O782Q10o000n208
1565e712K182O589L083n134o278P48O245L989k986p298j436O433N552k210p368
1580c601j996M791N957m95p232l707M435O209M25n068n378K008O716K822m739
$$ plain form
1475 4964 -2545 -6645 -2144 4766 6208 -470 -6376 -3904 3827 6219 1081 -5612 -5384 2204 7463
1490 7463 2848 -5250 -6061 1346 6722 3852 -4114 -6522 -622 5966 4544 -2837 -6131 -2352 4569
1505 4569 5939 -625 -6680 -3782 4040 5982 613 -5900 -5189 2891 7333 2055 -5974 -5272 1391
1520 1391 6170 3008 -3936 -6298 -264 5967 4576 -2386 -6168 -2364 4824 5821 -1692 -7147 -2865
1535 -2865 4943 5909 193 -5980 -4255 3292 6591 1285 -5549 -4738 1738 5736 2870 -3900 -5960
1550 -5960 2 5976 4194 -2950 -6202 -1578 5419 5769 -2001 -6807 -2096 4686 5496 -504 -5712
1565 -5712 -3530 3059 6142 1008 -5270 -4522 1723 5712 2726 -4572 -6008 425 5977 3767 -3601
1580 -3601 -5597 -806 5151 4656 -2576 -6283 -1848 4361 4786 -282 -5660 -3652 3064 5886 1147
1595A147o494Q28O962L479l793p054l11O593M784l438o633j369N068N138n85o881
1611b559l235L815O520J15n606m181J726P110K024n618n544J401O538L342l917
1626A931o880j15O402L975k846o061j500M656N529j234o339l023M158N782L10
1641D745n953m444K823O691J159n364n172K100O258K144l733n695k08O107L928
1656E386k900n871j454M601N604j492o578k799M466N763n23n902l677L195N953
1671C772J189n576m504J610O422K265m036n650K85N887L491l227n820j059N563
1686F12M362j731o280k335M884N006q17n434l433L067N779J016n368m331K265
1701b738N369K459m146n679P01N875L396l570n750l40N139M427k200o506j162
$$ plain form
1595 1147 -5347 -4519 2443 5922 2129 -4925 -5236 1357 6141 2703 -3930 -5299 -231 4907 4322 -2559
1611 -2559 -5794 -1979 4541 4656 -950 -5131 -3405 3705 5729 111 -5433 -4032 2506 5848 1931
1626 1931 -4949 -5064 1338 5313 2467 -3594 -5094 -438 5091 3857 -2482 -5505 -1347 4435 4745
1641 4745 -1208 -5652 -2829 3862 5021 -343 -5515 -3415 2843 4987 1254 -4441 -4649 1458 5386
1656 5386 2486 -3385 -4839 -238 5366 3874 -2704 -5503 -1037 4726 4203 -1699 -5376 -2181 3772
1671 3772 4961 -615 -5119 -3509 2913 5178 1142 -4508 -4223 1664 5155 1928 -3892 -4951 612
1686 612 4974 3243 -3037 -5372 -488 4518 3701 -1733 -5166 -2099 3680 4696 -672 -5003 -2738
1701 -2738 2631 5090 944 -4735 -4034 1841 5237 1667 -4083 -4423 716 5143 2943 -3563 -4725
1716d725M469M672j213m950l374L436N726M57n113m294K004N845J890m687m924
1731d781J305N817K676l909n235m3N165L833k412n652j464N083L905j139m960
1746a811l178L375N868j9n370l754K667N512J324m404n108J650N787K372m136
1761G75m458j13N164L605k854n407p79M099M342j255n595k323L813N429p63n497
1777a817k995L159N149N91m668m163J942N729J478l578m624L99M760L365l020
1792A707n501l16M899L487j473n296k423M291M680r18n192k182K668M995M84m566
1808f56l808K046N126J262l428m483N34M913L048k826n385k39M609L798j976n023
1824b488j792M097M414j225m856k466L047M294P41m466l713J862N104J725m143
$$ plain form
1716 -4725 -256 4416 3203 -1747 -5121 -1685 4041 4498 -615 -4909 -2905 2940 4830 143 -4781
1731 -4781 -3476 2341 5017 1108 -4127 -4170 995 4828 2416 -3236 -4700 383 4288 3149 -1811
1746 -1811 -4989 -1614 4254 4235 -1135 -4889 -2222 3290 4614 210 -4898 -3248 2539 4911 775
1761 775 -3683 -3796 1368 4973 2119 -3288 -4067 32 4374 3119 -2476 -4799 -986 4443 3680 -1817
1777 -1817 -4812 -1653 3496 4087 -581 -4744 -2802 2927 4405 827 -3797 -3398 1362 4727 1707
1792 1707 -3794 -4110 789 4276 2803 -2493 -4916 -625 4055 3137 -2055 -4237 -1569 3426 3910 -656
1808 -656 -4464 -2418 2708 3970 542 -3941 -3407 1506 4554 1728 -3657 -3896 713 4511 2535 -2488
1824 -2488 -4280 -183 4231 3006 -1850 -4316 -1269 3025 3766 -700 -4413 -2551 2553 4278 135
1839A35l988O54M908L006l412n099J62M484L252k294m534j095L482M416j170m643
1855a736k651L210M553qm242l617K751M669J062l968l691O92M905K591l424m759
1871c663K52M249L114j815m636j683M482L388j034m617k385L230M672j5m831k842
1887d134K545M508N90l688l299Q20M851J829l377l833K40M029K512j818m478j240
1903c943M227L943j838m413j727L036M175k91m617k348K593L885P37l630l413
1918c624J307M439J990l762l682L61M158K578k274m513o68M227L321k044m155
1933b341j305L335L648l80m547k186K481M142L71l702l186J513M334J642l587
1948B32l622J030L775K483k870l829o12M134L303k347l702j359L307L370p38m289
$$ plain form
1839 135 -3853 -3199 1709 4715 1303 -3796 -3634 850 4102 1808 -2726 -3821 -339 4077 2907 -1736
1855 -1736 -4387 -1177 3376 3368 -874 -4491 -1740 2929 3991 23 -3668 -2976 1929 4520 1096 -3663
1871 -3663 -3411 838 3952 2137 -2499 -4182 300 3688 2654 -1963 -4348 -1118 3554 3539 -1292 -4134
1887 -4134 -1589 2919 3509 -179 -3478 -2658 2193 4022 645 -3188 -2948 1081 3593 1775 -2703 -3943
1903 -3943 284 4227 2389 -2024 -3751 -715 3460 3169 -1448 -3796 -1203 2682 3419 -211 -3624
1918 -3624 -2317 2122 4112 350 -3332 -2971 1187 3765 1491 -3022 -3690 537 3858 1814 -2341
1933 -2341 -3646 -311 3337 2957 -1590 -3776 -1295 2847 3218 -484 -3670 -2157 2177 3819 232
1948 232 -3390 -2360 1415 3898 1028 -2801 -3413 721 4024 1677 -2025 -3384 -77 3293 2555 -1734
1964a734k201L178M003k11l736l156K110M014J212l514l525J459L846K053k825
1979I73l910J08L780K702k067m005r99L406L712j019m528j633K952L552K31m438
1995a183k627K067M055R11l659k945J431L733J559k650l625p0M310K224k188l634
2011b291r97L326L223o13m595j217K989L176l12l736k456K329L618N88l307l254
2027c529J642L517J549k645l805P76M015J815k072l848m97L292L082j650l819
2042b177r03K771L117p13l350j986K118L836M16l654k742J519L791J195k844l559
2058c165O35M250J523k396l511J82L435K594j788l950j013L245L111q20l490k445
2074c603K196M243K09l660k695J740L460J163k797l431J122L336J497k078l273
$$ plain form
1964 -1734 -3935 -757 3246 3035 -701 -3857 -1747 2267 3479 -35 -3560 -2101 1745 3798 973
1979 973 -2937 -2829 951 3653 1586 -2419 -3418 -12 3700 2681 -1847 -3480 -528 3024 3255 -1183
1995 -1183 -3810 -1743 2312 3223 -436 -3381 -1950 1783 3342 692 -2933 -3003 1307 3531 1343 -2291
2011 -2291 -3288 38 3261 2648 -1947 -3164 -175 3001 2689 -1047 -3503 -1174 2444 3032 -275 -3529
2027 -3529 -1887 1630 3179 534 -3271 -2495 1520 3335 1263 -2585 -3082 210 3292 1642 -2177
2042 -2177 -3080 -309 2808 2095 -1255 -3241 -1123 2713 3129 -525 -3267 -1748 2043 3238 394 -3165
2058 -3165 -2530 1720 3243 847 -2664 -2482 953 3547 1759 -2191 -3204 41 3152 2332 -1158 -3603
2074 -3603 -1407 2836 3045 -615 -3310 -1570 1890 3053 256 -3175 -2053 1283 2780 702 -2571
2089b571J71L320J904j211l701o66K724L132r06l640j734K466L371J09l695k024
2105b951J677L272J156l358k997J208L385J415k300k872k92L305K286j517l693
2120b276k96K930K745j351l483j399L029L214q05l320j841J666L072R93l176k890
2136c188J229L867J036k365l350K12L439K339j603l803n40L152K428j248l489
2151a884j074K193L504j56l679j543J777L184M56l321k644J229L540J137k567
2166A52k876N27L344J986k274l235j25L261K255j741k971j160K985K580o38l319
2182a249j661J979L305M03l103k728J484L454P27k644k573Q79K649J834k079l048
2198b371J50K848K196j379l563n34K790K523j061k784j869K424K942L32l386k042
$$ plain form
2089 -2571 -2400 920 2824 1613 -2088 -2754 -30 3102 2196 -1444 -3178 -712 2659 2768 -927 -2951
2105 -2951 -1274 1998 3154 -204 -3201 -1993 1392 2807 507 -2365 -2657 648 2934 1417 -2276
2120 -2276 -2572 358 3103 1752 -1731 -3130 -101 3113 2308 -1012 -2853 -1187 1885 2878 -298 -3188
2136 -3188 -1959 1908 2944 579 -2771 -2559 880 3219 1616 -2187 -2727 425 2853 1605 -1884
2151 -1884 -2958 -765 2739 2583 -1096 -2639 -862 2322 2778 -543 -3187 -1958 1582 2719 152
2166 152 -2724 -2197 1147 3133 859 -2376 -2501 760 3015 1274 -1697 -2857 128 2708 2070 -1249
2182 -1249 -2910 -931 2374 2777 -326 -3054 -1570 1884 2611 -33 -2606 -1727 922 2756 677 -2371
2198 -2371 -2221 627 2823 1444 -2119 -2653 137 2660 1599 -1185 -3054 -630 2312 2644 -742 -2784
2214b784J446L021P00k584k274N04L021J538j814l203K91K931K136j578l281n08
2230b438K525K666j283k916j056K070K946m95k909j799J565L111P32k924k177
2245b382Q30K889J694k372k879K29K791K261k059k646q50K717K315j082l023o04
2261b171J970K337n1k962j544J544K727N03k376k487R31L278R35k199k864L36
2277b093L186J632k121k537m40K968J801r14l060j157K107K998l49k971j576J810
2293g16K696J91k687k158J309L113J121k570k466O49K453J777j759k962q5K502
2309D08K160j249k823p94K130K267j94k884j648J926K646K19k651k131J299K857
2325A538Q91k304k452L99K943J402j982k408j64K537J927j235k638r00K411K469
$$ plain form
2214 -2784 -1338 1683 2383 -201 -2475 -1971 1050 2588 774 -2429 -2138 793 2929 1351 -1930 -2438
2230 -2438 87 2753 1470 -1446 -2502 -432 2514 2019 -890 -2689 -1124 1987 2719 -205 -2382
2245 -2382 -1552 1337 3031 659 -2220 -1991 800 3061 1002 -1644 -2494 223 2538 1456 -1567 -2171
2261 -2171 -201 2136 2085 -877 -2421 -877 1850 2353 -23 -2510 -1579 1699 2634 435 -2429 -2093
2277 -2093 1093 2725 604 -1933 -2373 595 2396 1482 -1578 -2735 -628 2370 2021 -950 -2526 -716
2293 -716 1980 2171 -516 -2674 -1365 1748 2869 299 -2167 -1518 935 2712 953 -2009 -2094 408
2309 408 2568 1319 -1504 -2298 -168 2099 1905 -979 -2627 -701 1945 2164 -487 -2618 -1319 1538
2325 1538 2429 125 -2327 -1928 1015 2417 435 -1973 -2137 400 2327 1092 -1546 -2446 -35 2434
2341B434p73l051q88J824K363p1k460j558J119K771O23k298k389Q81K709J185
2357B421j614k760j06K724J881j526k917m51K391J868m43k935q13J746K444R6
2373B006k585j615R76L011M33k355k157R72K430J047j663k350O0K577J368j215
2389I40k790k27K274J909o50k680r95K049K183o13k118j364J405K625J05k447
2405c94j697P22K601Q77j624k709Q63K232J248j699k146k05K506J497q12k814
2421a554p91K042K271o12k223j146J426K596l83j902j605J258J969M95j509k172
2437a840M09K131J249j120k487P3K204J594j083k372o65J683K138m60k207j452
2453b205J470K657k05k462j498J066K420O97j648k187M83K520R43j627k223J11
$$ plain form
2341 2434 1661 -1390 -2278 -454 1909 1838 -622 -2180 -1061 1710 2333 35 -2354 -1473 1236 2421
2357 2421 807 -1953 -2059 665 2546 1020 -1897 -2348 43 1911 1468 -1467 -2280 -534 1910 2006
2373 2006 -579 -2194 -1218 1793 2226 -129 -2286 -1314 1116 2163 500 -1850 -1790 787 2155 940
2389 940 -1850 -2077 197 2106 1456 -1224 -2219 -170 2013 1400 -718 -2082 -677 1948 2053 -394
2405 -394 -2091 -1369 1232 2109 485 -2224 -1361 871 2119 420 -1726 -1931 575 2072 1260 -1554
2421 -1554 -2345 -303 1968 1356 -867 -2013 -587 2009 1626 -276 -1881 -623 1346 1841 332 -1840
2437 -1840 -1431 700 1949 829 -1658 -1585 619 2213 1130 -1242 -1907 -224 1914 1454 -753 -2205
2453 -2205 -735 1922 1717 -745 -2243 -1177 1243 1940 292 -1895 -1412 1108 2051 424 -1799 -1688
2469a688J928J664q31k939J4J994J876p74k327q18J571K143k02j939j392O75K317
2486A272N74j803j923N24K405Q34j452j773m80K324J650j312k417k0J651K019
2502B073o50k234j236J421K281m24j943j263J189J969P94k021j849J026K306M02
2518A841j657j783L18K080J404j815j802j67J775J991j343j934r38J770K180n20
2534A400k129j025J083K182K14k134j664P88K468N92j774j555J97K101J307j668
2550C83j839l29K114J666j438j767n67J817J833m54k398q79J350K068J41k162
2566d61j390Q68K163P19j802j871K25K222J104j447j937J27K160J175r91j921
2582a057p03K059J347m34k204o29J198J983O8k009j264Q85J944L56j341j923O89
$$ plain form
2469 -1688 240 1904 1073 -1866 -1852 142 2018 1244 -1083 -1901 -330 1813 1611 -328 -1720 -1045 1272
2486 1272 1846 43 -1880 -1356 1049 1883 431 -1342 -1822 502 2152 840 -1577 -1597 54 2073
2502 2073 1423 -811 -2047 -626 1655 1231 -712 -1975 -786 1183 1977 -44 -1893 -867 1439 1841
2518 1841 184 -1599 -1281 799 2203 388 -1414 -1581 194 2185 842 -1092 -2030 -260 1920 1400
2534 1400 -729 -1754 -671 1511 1725 -409 -2073 -1285 1183 1775 1 -1554 -1357 744 2051 383
2550 383 -1456 -1785 329 1995 557 -1210 -1777 40 1873 1419 -979 -1858 -508 1560 1701 -461
2566 -461 -1851 -983 1180 1899 97 -1774 -1549 673 1777 330 -1607 -1480 680 1855 864 -1057
2582 -1057 -1760 299 1646 1212 -992 -1621 -423 1560 1628 -381 -1645 -760 1184 1540 199 -1724 -1035
2599a035J851J316j812j995L34J821J593j321j963l97J669J849q44j942o46J306
2615b16J724k23j877j201J168J804M26j805j423N72K111P24j436j959M94J618
2631E01J253r65k106k15J544K005r11k114k49P04K089k34j953j021J221J789J62
2648A500j864j253P07J906Q70j679j722K37J974P30r60j822J9J481J526p24j841
2665i15p06J596J482j56k121j001J518J691j39j730j042N89J890P25j733j313
2681a365J63K020J023j442j477n23J802J570p66k145l04J381J627m25j862q50
2697a573J151K031o13j461j007O18K019J19j229j707N86J980P42j248j737n8K092
2714G05Q67o26k022j17J232J612p49j623n99Q96J763J8j712j237J112J636O66
$$ plain form
2599 -1035 816 2132 320 -1675 -1341 480 2073 752 -1211 -1608 61 1910 1066 -876 -1522 -216
2615 -216 1508 1285 -592 -1793 -625 1179 1605 -200 -1623 -1051 1060 1784 348 -1611 -1117 501
2631 501 1754 789 -1317 -1532 12 2017 1106 -1008 -1257 -553 1536 1302 -651 -1672 -451 1338 1500
2648 1500 -364 -1617 -910 996 1866 187 -1535 -1298 676 1406 446 -1376 -1357 124 1650 926 -915
2665 -915 -1621 -25 1457 1301 -820 -1821 -303 1388 1249 -481 -1523 -934 956 1681 -52 -1365
2681 -1365 -1202 818 1841 399 -1078 -1601 201 1771 1005 -1140 -1444 -63 1564 1139 -723 -1573
2697 -1573 -422 1609 996 -465 -1472 -854 1165 1284 55 -1652 -1066 914 1656 408 -1329 -1387 705
2714 705 1572 946 -1076 -1193 39 1651 902 -721 -1320 -424 1339 1357 -355 -1592 -480 1156 1822
2731A822j809j525Q25J527P96j338j816M05J512J049r31j582j29J016J431m16
2747H37j594r82J347K195p26j676r90R26K158k96j155j320M34J576N11j056j775
2764a586K34K151N43o59j923j26J636J156o02j688p34J563J249j51j599p47R72
2781c11J341M6j404j116O25J571N18j173j445J29J724P51j167j223k15J964P55
2798A370l56j935l07J270J562k79k104n88J082J695k05j457j319J131J365K42
2814A167j086j652M79J943N16j276j250kJ430Q91q17j206p34J898J024q36r53
2831d64p42J056J493j41j399j284J101J489K37j328j246K60J683M56j091j114
2847a034k05J281J270o26j688k95R27J887p28j560n00Q52J249K55j471o55P56
$$ plain form
2731 1822 13 -1512 -687 840 1636 298 -1518 -1113 399 1448 517 -1065 -1194 -178 1253 837
2747 837 -757 -1739 -392 1803 1077 -599 -1589 -663 1495 1199 44 -1276 -842 734 1245 189 -1586
2764 -1586 -1352 799 1342 683 -1240 -1366 270 1426 824 -864 -1598 -35 1214 1063 -536 -1283 -311
2781 -311 1030 1076 -328 -1444 -819 752 1270 97 -1348 -1219 505 1256 89 -1134 -1349 615 1370
2798 1370 1014 -921 -1228 42 1604 1325 -779 -1367 -285 1410 1205 -252 -1571 -440 925 1167
2814 1167 81 -1571 -1092 851 1367 91 -1159 -1161 269 1160 343 -863 -1597 301 1325 489 -464
2831 -464 -1206 -150 1343 1202 -197 -1481 -380 1109 1346 18 -1228 -968 715 1171 80 -1034
2847 -1034 -1239 42 1312 686 -1002 -1297 -370 1517 789 -771 -1271 -419 830 1085 -386 -1041 -285
2864b85J043M93j518j319Q06J068R82j085j160j99J515J173j059j416j47J150
2880D2J106j84j712m13Q15J384O1j504p71N97J571K48j370q99N53J279N74j196
2898A81j534L78J551N52q84j157J05J084Q59n33j215o17J110J350m22j192q39
2915a223J044J117J65j362q17N10J329K06r34j101K16J301R00j380j156K47J329
2932C91O56l46j465m48J197J248o08j129m40O18J411j40j356q53P21J328K79j386
2950c22q63M35J250Q00j028j230L2J438P12r57j212l76J609P26k42j739k67J170
2968f4J217k20j468l54P20P49J59r30p58M48R58O09o83j270L69J037P36o60j473
2987h78K9J138P03m74j252l37P83J147j35j118n08P94P96L27j260p14L89J285
$$ plain form
2864 -285 758 1251 -267 -1586 -780 288 1270 185 -975 -1174 341 1514 455 -961 -1108 42
2880 42 1148 964 -748 -1161 -346 1038 1099 -405 -1176 -579 992 1240 -130 -1029 -476 803 1377 181
2898 181 -1353 -975 576 1128 244 -913 -808 276 1135 602 -613 -1230 -120 1230 808 -384 -1223
2915 -1223 -179 938 1103 -259 -1076 -566 763 969 35 -1066 -850 451 1351 -29 -1185 -938 391
2932 391 1047 701 -764 -1212 -15 1233 625 -504 -944 -326 1085 945 -411 -1264 -543 785 1064 -322
2950 -322 -1185 -750 500 1300 272 -958 -926 512 1224 267 -945 -1321 288 1014 772 -967 -1234 -64
2968 -64 1153 933 -535 -889 -169 580 739 -191 -949 -501 457 1066 383 -887 -518 519 1255 595 -878
2987 -878 -849 289 992 518 -734 -1071 -288 859 724 -394 -902 -108 688 1015 -245 -959 -570 715
3005G15J98o30j042M7J027N10m25j397L0J464N50m87j403j39J144R76m85j137
3023d84n68Q95O80K32j093o36O70J051k3j039p50N61J143L46p48j003kQ84J060
3042A176r58r10j44P59J093m0j385p65J041J054J5j304p21P14J239P7j006p36
3060h01L24Q44N76o18j149L76O38O82r44o41m3O23J239l51j308n37J060P14R5
3079G79r02j163R58J170l2r05p86J71J239M59r66r25J48J048Q44o32r76k84J002
3098B47O64m05j285l19R42J075n89q06m46O42R36R4q66r73M38J384M33j149r07
3117h90L4R93Q15r52p85K2O44J027p82p69j86Q13Q16jj211k33K72J170J2j190
3137c81l92M43P93L54p74o67L04O77K92m52r68J32R56O74n84j341JJ007Q49j65
$$ plain form
3005 715 913 283 -759 -712 315 825 400 -997 -967 497 1047 560 -843 -982 162 1138 653 -484
3023 -484 -1052 -157 523 755 -338 -974 -304 747 724 -315 -1065 -504 639 985 237 -766 -768 116 1176
3042 1176 218 -692 -836 -77 1016 976 -409 -1174 -133 921 936 -368 -1089 -375 864 941 -65 -801
3060 -801 -477 367 943 325 -824 -448 190 872 -72 -713 -756 -133 1106 755 -553 -1090 -30 684 779
3079 779 -123 -1286 -328 842 810 -95 -881 -710 529 988 22 -903 -755 293 1137 505 -471 -755 247
3098 247 911 506 -779 -1098 -156 919 330 -476 -922 -280 656 750 -116 -1089 -651 733 1166 17 -890
3117 -890 -856 137 952 0 -785 -763 -119 908 126 -643 -829 -16 800 799 -412 -645 -373 797 809 -381
3137 -381 -773 -330 463 817 43 -624 -320 357 649 197 -771 -639 317 991 407 -934 -933 74 923 758
3157G58j048n47O20J255k90q07r97N51Q98L11r00o66M31R11L69r61o41J34N93
3176b6J081m86j274j71Q79Q27m94o48k08L01J168j86j069m97O47P80j15n38r01
3195i30O09P82P37j011j166M27Q71L71k83j478M99P96P24o23j034j62P61J159
3213A049n05j045j81N73Q80O8q85j056Q91O03M51q76o27j94J078P28q05p86J34
3232e05O65M54k12j189r0R19Q32l25q19p65R13O58J32p84n77M29O33M26q28q16
3252h49J1J398K74o78r76J54R86N40o47p44k49R05O45k23j220o9O46O95M19j202
3272a84p25M53J189j09q30p95N23P42O06q29p48L2Q31N62l45r10m07R79R49n26
3292D58j090l30P73R45mj364l51O32J036O4j226n97N19J128K85n95j032J24J092
$$ plain form
3157 758 -290 -837 -217 1038 748 -59 -1056 -505 393 704 -196 -862 -431 480 849 -112 -753 -619 -26
3176 -26 1055 569 -705 -876 3 830 336 -312 -520 -219 949 763 -306 -803 -156 624 509 -29 -930
3195 -930 -321 461 1198 187 -979 -552 319 690 407 -1071 -572 224 948 325 -709 -871 -110 1049
3213 1049 544 -501 -682 -109 771 839 -46 -1102 -211 392 843 -33 -660 -854 224 952 147 -639 -505
3232 -505 160 614 402 -787 -877 42 874 549 -270 -1035 -122 536 668 -116 -693 -264 369 795 -33 -849
3252 -849 -838 560 834 156 -820 -666 320 860 213 -531 -780 125 770 547 -673 -742 -96 599 1018 -184
3272 -184 -909 -456 733 624 -206 -1001 -478 264 870 41 -707 -675 156 718 373 -537 -944 35 984 458
3292 458 -632 -962 -189 756 752 -612 -963 -331 705 769 -457 -1054 -535 593 878 283 -749 -625 467
3311D67L82p15j044M36N54R44n82p60n72P38J045k73r95k40L65P97J66j070k66
3330f23K03O95M36o23q21q5J219O62p86p55k29R02R04n83q75j41M58O46%j168
3350e64k05O88Q58k6q62p53M97Q28L11o16j002L59O60N77n97p16r2Q37N27m46
3370B63q60j16Q68Q54m63j057l50R22P24K3j073o56O57P08J44p28o40J10J062
3389C92Q1l82q41M44N01P78r14q53K63L55P33K95j195o31Q50Q05m04n77m25O16
3409a09O41J07j059k64J47O75M85n00q72L54O19L57j36j207J1Q83M37m77n53l75
3429h36Q87O17l42o37p8j83J203J64r07o91K26J006K92n17j077N87N73K21m51
3448E7p51J93N47N07l89n75j10M41O98r3p76k41L38O86J52j132m60N03J142mq93
$$ plain form
3311 467 849 134 -910 -474 80 1024 442 -318 -890 -152 893 620 -375 -615 -250 547 713 -357 -623
3330 -623 -420 275 711 88 -733 -818 401 1063 277 -478 -707 195 1099 516 -359 -500 -42 604 604 -564
3350 -564 -769 -81 777 751 -111 -864 -367 461 772 156 -846 -487 173 750 153 -563 -655 182 709 263
3370 263 -597 -713 155 1009 546 -511 -861 61 785 808 -265 -921 -264 444 588 -140 -780 -670 392
3389 392 473 91 -750 -306 195 973 59 -794 -531 -176 557 852 -343 -974 -124 681 277 -300 -725 -109
3409 -109 532 639 -420 -684 -537 138 623 123 -749 -395 224 581 445 -762 -751 132 569 92 -461 -836
3429 -836 51 668 326 -311 -389 -572 631 795 -112 -803 -577 429 721 204 -873 -286 287 508 57
3448 57 -694 -501 46 553 164 -411 -521 -80 618 525 -251 -492 -154 532 684 -448 -908 -405 737 733 -160
3469a60o65O15P15K43p38p49Q7Q44K92j16r25N2M83P68m34m73k88K08Q45k15o93
3490c04l33K45R14ll79j051M43P89K25n64m98J08O66O18n45m58n73R61M57Rj090
3511c63l37M32Q67l92m49k40J17R43O9n42n33K38N97j6k46o23L9M15Q07p29o22
3532e68J81N79N7J33p43l60R62M54m01o87k76J37R21J90p43k24n4Q37M44q21o97
3553f79L14R15R8n34l31k53O50L44l24m68j36M73M40j71o64o27P46O37L98o94
3573A34q33K23R24J70m94p64L4J172j07j33p87j72R03N58o88l60l78O84K71%o38
3594b81l29O42M26L84j105m65M64P76K06n83p57L08M44K19o1p36J8O30M83l36
3614C47j001P0N38P21l06n49m61M83M59J25o31J5l3O35J89o49m69K62O20K4j53
$$ plain form
3469 -160 -825 -210 505 748 10 -739 -652 192 484 368 -557 -505 -22 746 312 -161 -449 -241 604 389 -304
3490 -304 -637 -392 522 519 140 -911 -468 321 546 -18 -516 -408 258 876 331 -127 -700 261 718 727 -363
3511 -363 -700 -268 599 207 -242 -482 -365 578 647 105 -428 -190 407 391 145 -478 -439 -24 783 54 -568
3532 -568 -387 192 249 382 -361 -721 241 695 294 -393 -669 -532 389 579 -164 -388 -442 395 839 18 -679
3553 -679 -365 550 648 114 -217 -470 180 524 200 -268 -404 69 509 338 -326 -953 -207 430 828 134
3573 134 -699 -476 448 618 124 -640 -606 566 459 326 -461 -633 270 828 140 -220 -598 86 357 357 -281
3594 -281 -610 32 458 842 -263 -728 -264 512 718 135 -622 -314 130 349 288 -448 -430 200 683 347
3614 347 -654 -584 -46 675 369 -180 -641 -158 301 426 -205 -190 -223 412 601 -48 -517 -255 365 389 236
3635B36q11j9R23L32k82q70j29R14J23q0o97k26O44N68n4q54O7P3L99L54n57o58
3657f04M03O74J54q31k77J42P72J53l77q13Q6N80L17j0p15j29O39M57j09p96l58
3678f42M92O79k05m76n06M96O58J67n74n93k44J056L16l86o81J73L57N68l55p76
3698d76J45K56Q09k71n74k00K46P00j4q79l78L41P28J51k77j044M65P28L11m98
3718B69p25j5M91O20m84p34L28K0N77m8q26j75M44R85l98p40j49O93M19j80n81
3739b09n91O03M50L63n06k44j47K21L21P4q38j71Q52K64j63o87j2N15M49j63o23
3760b42l66J13Q25P1m73j87q6O37L30l38j116O08M45R6j15o11j3Q19L2J2j013
3781e72l77Q38J58M60r31j34M57M78Mo54k18M01O32n9o28j35J23L75L61m57n46
$$ plain form
3635 236 -575 -594 329 661 379 -491 -620 294 417 337 -360 -586 58 626 572 -282 -215 -142 257 611 54 -604
3657 -604 -201 473 627 -204 -481 -339 433 586 209 -604 -518 62 379 369 -346 -475 164 621 512 -284 -642
3678 -642 -150 529 324 -152 -658 -162 496 663 89 -504 -748 308 624 238 -443 -270 87 655 300 -476
3698 -476 -331 -75 734 463 -111 -311 -65 635 621 -258 -636 -295 433 584 307 -737 -272 456 767 269
3718 269 -456 -471 20 640 156 -578 -250 -230 347 299 -527 -702 -258 727 329 -411 -560 133 552 372 -209
3739 -209 -800 -197 253 616 110 -134 -281 -60 261 335 -503 -674 178 442 279 -408 -420 95 544 381 -242
3760 -242 -608 -495 330 401 -72 -259 -345 292 622 284 -832 -224 221 317 202 -409 -422 397 429 441 -572
3781 -572 -949 -111 47 507 -424 -558 -101 377 381 -273 -491 -90 542 483 -145 -280 -157 218 579 122 -424
3802d24J89K93N87m65m20l50O79N34k3j160J39L05M00L24o62n98M32O06L80q46
3822h0j99k06O05K27l63l22J03L90K67k08o00j89O78K26K0o46j46K97N42j04n37
3843b45k18J86P17L71q48l75M0P99L59m16q14RO77K00m9o40m5M65L38j75o44j20
3865d28K21M55j08k69m58L16Q22n4m33m25LL97P74n30r49K66R52q1k20o99l1O12
3887A33K72L16j124l46Q30j3K24l78k01N2J24Q18o47m91J79P47k26K2m34k13M48
3908I2L97j89o69K8M76K79j12p48j36K17P52N7o40l10R3P71k81l95o7J98N14K01
3930E28p09m43L83L55L50o29k85q9N35M16r5n57j04K72N99o34m62m8K66R48j90
3951D07m90l13mN25L18n36k67K08R9M12N1q27J68N29M07m60n77j29K74O70n0o18
$$ plain form
3802 -424 -235 58 645 180 -240 -590 89 623 600 -560 -421 -116 284 608 -54 -652 -220 386 766 -80
3822 -80 -279 -485 120 347 -16 -338 -235 155 422 214 -386 -575 103 329 349 -297 -443 -146 396 292 -245
3843 -245 -463 -277 440 811 -37 -412 -372 427 786 370 -444 -435 242 442 393 -247 -292 173 511 336 -308 -428
3865 -428 -207 248 140 -129 -587 -271 551 497 64 -361 -358 39 813 283 -666 -400 552 471 251 -448 -479 133
3887 133 405 721 -403 -749 81 68 292 -86 -287 -235 -111 707 60 -431 -252 495 269 291 -143 -356 92
3908 92 489 300 -369 -341 135 414 302 -446 -582 -365 387 444 -196 -506 -413 358 77 -318 -385 -187 327 528
3930 528 -181 -624 -241 114 464 -165 -450 -539 -4 412 317 -240 -344 -72 527 -107 -569 -617 -351 597 407
3951 407 -83 -396 -400 125 443 -93 -360 -152 -53 359 410 -417 -249 280 687 227 -350 -479 -205 465 415 -203
3973b03n58P42L61L7o48k79K44Q06nk91m18nN93M8l33n29K24M22L62m14o54J80
3995c18L34K75M08q67l2K3N99j62n40J0L45M47j27l76m61K66N99J43l16l90m58
4016e98O20N55o25l27K1O47k12L37p77k02O10L46K26r77l1K17N47K35q06j61K63
4037i2L32J47j58q69K56L56O77l80o82o1N29L17r2m36k28J73N34J62o19k25K07
4058a52P58r3o67l44k0Q43r3n10k05r2O58M69n03k32k03K35M48J14o40m3K6P14
4080D68O4o70m46M26O87j00o08k02N54k3L04n62l06l1N93O96o45p61R9O02J81
4101C20Q9j074Q3N87M87j02o51m03O12O74m96k00j77N6L12K04l3o23p2M43J61
4122A97p3l14k23K52M36o3p66K22M38K26j2m77k62K86N05J59q02k51O14R5Q4m49
$$ plain form
3973 -203 -761 -19 342 379 -269 -548 -304 502 497 206 -212 -217 376 424 91 -438 -214 208 570 156 -498 -318
3995 -318 16 291 699 -168 -200 -177 422 260 -280 -270 75 522 395 19 -442 -176 423 566 250 -140 -598
4016 -598 22 577 -48 -375 -354 293 81 418 -359 -561 49 395 621 -356 -387 -170 377 612 -194 -355 -92
4037 -92 240 387 229 -640 -384 -28 649 269 -413 -474 55 372 280 -156 -384 -211 323 485 -134 -359 -152
4058 -152 606 513 -154 -498 -518 325 232 -278 -483 -575 83 552 49 -183 -386 -151 297 411 -229 -272 -246 468
4080 468 532 -138 -584 -158 529 429 -179 -381 173 150 454 -108 -414 -445 148 844 199 -562 -463 139 320
4101 320 409 -665 -582 5 492 390 -261 -664 -52 622 126 -74 -251 -195 117 321 288 -335 -407 36 197
4122 197 124 -190 -413 -161 275 212 -554 -332 106 332 320 -157 -419 -133 372 531 -271 -522 92 187 271 -178
4144a78k99L51J13N74m38m60J6J59M15Ro70J42O04J45o67k01n4L02M74J97m20
4165A14n30K15M11M1l50m35J3Q16K00k43n32nM56J94m12l95QK99M15n9o06r8N20
4188C7K67k05M4l56P5N21l36j3l24j36O66J03m65k81K78J43N25l67l35k08N08
4209A41J72k69k39j05J54M69K05o94k36L31O2K42l53j24P2L38J17k99n87M66K29
4230I2K69j94p49J89O53K73n10j94m9J99L56j85k76k67O24n0r6l08L2jL6O54m85
4253A3k41J13j9M73j55k65k04L54K74r4m01j67K33K15l6k27k09K56K29J25l12
4274d5l72M16J62k9l52o5j06M51Q0n9m87q6N91N4O5n36K51L11J73k44k42OK35
4297A72o2N9k22n5k70P62J29k83q85N65L00J93l21l09M2R2L53k10o50N67L16K28
$$ plain form
4144 -178 -477 -126 -13 561 123 -337 -321 -162 253 262 -408 -266 338 483 -184 -385 -439 -137 337 534 114
4165 114 -416 -201 210 251 -99 -534 -521 295 495 252 -280 -285 171 365 -47 -442 -434 -135 280 221 -385 -483 37
4188 37 304 99 143 -213 -138 383 47 34 -290 -426 240 343 -122 -403 -125 18 543 176 -159 -367 141
4209 141 313 44 -195 -300 -146 323 528 -166 -402 -71 -9 233 -120 -244 -172 166 283 -16 -603 -137 92
4230 92 361 167 -582 -393 260 533 23 -171 -220 -21 335 150 -126 -393 231 181 85 -223 -191 -192 -156 498 13
4253 13 -228 -115 -134 339 184 -81 -285 69 343 249 -152 -319 -86 129 93 -134 -343 -87 142 267 -45
4274 -45 -417 -1 161 132 -220 -285 -391 60 140 81 -406 -492 99 153 218 -318 -67 244 417 173 -69 -63 172
4297 172 110 169 -53 -108 -378 384 513 230 -655 -90 210 403 82 -227 -185 -93 260 50 -600 -33 283 511
4319E11k98k14j21K95n7J98m51k03M32jM05o98oj97Q06q8l67J8n5K49L28k79l24
4342a17k2L43J66j80n76Q7N82k39Q6m87K14j05L92K50n10j75OM19L32o85m4N3
4364b10M14J61k48j19j49K55l4j04r3J35j87P07o44J65j74M07j03%k66k47J21
4385b13M75Q9o70j23J47P23m6l91n01O24J15L16k22m96l60O58J26j06l99k7J72
4406a09M35o1l83q9K62N85m11j29j61K04m8K79l67l59K49j59N02m44q2L31j90
4427a45M07o1n54J4N79r8j72K0q2j19L71J48l24k93K17K33M55p02k71K19L72L39
4449E53n87k05j24M60L55j56k61n49P26L7j96p4j24m4M16L50q39J95J08J86J07
4470C34o34j83K63J09N89p07j08J02J94L87k86l0k41J96K78J89q11L10KK79l7
$$ plain form
4319 511 213 -1 -122 173 116 314 -137 -340 92 91 496 -202 -208 -405 401 313 -54 -36 -91 158 486 207 -117
4342 -117 -139 204 370 190 -386 -299 283 44 130 -357 -143 -248 144 394 -116 -291 -285 134 466 -219 -263 -210
4364 -210 204 365 117 -2 -151 104 70 -34 -127 8 -179 528 -116 49 -125 282 179 179 -87 -334 -213
4385 -213 262 351 -319 -442 -295 428 382 -9 -510 114 229 545 323 -173 -533 125 251 145 -254 -281 -109
4406 -109 326 265 -118 -207 55 640 229 100 -61 143 95 374 7 -352 -103 -262 240 -204 -286 45 -145
4427 -145 262 201 -353 -339 240 142 -30 -10 -92 -211 160 308 -16 -309 -92 141 596 -106 -377 -158 214 553
4449 553 -34 -239 -363 97 452 296 35 -514 212 249 53 -21 -145 -189 227 577 -262 -67 41 227 334
4470 334 -300 -483 -220 -111 478 -229 -337 -235 -41 346 60 30 -211 -15 263 452 -359 -49 -47 232 195
4491A95l63j05J43J03L30l50l24K95K74N94o10o17L89L62J43m11k34m0K8L65p0
4512I7m31L08j9Q6P9j35j12k98O93j35j77m38M27N3K62j84l11j78N00J69K31p12
4534b25P6N02n0r1m64J6L38J77k40R0m13L98J29j81k06K67j05K24q3j31k38k94
4556e04O77K65l25m16J01L75J56l29j74k23M69O0J96j62m65J52J77n7p9k6O6N1
4578a5M66o26k91L37L87j85j33O8k78K35K90r1m96L02J61J45j53l02O1K48m2l2
4600E6p5j57M60m9j08o43M09r1K34k59K93r9j66J89J65j2n04RL61J73j52l40p7
4623c83N81j76j00Q4n97J55M68JL36n30J00L29j73n9p10L54M25J28k79l61K18
4644a89K57M4L2L2k30K19J22j07m18L7O7J92L8l9m97M11J49L0k08k34M39L11l66
$$ plain form
4491 195 -168 -273 -130 -27 303 -47 -371 -76 198 792 182 -435 -46 316 459 48 -186 -226 -198 167 97
4512 97 -334 -26 -45 41 120 -15 -127 -425 268 133 -44 -482 -55 -2 260 76 -235 -413 87 256 487 -225
4534 -225 -149 353 303 212 -252 -236 102 279 39 129 -284 114 243 62 -144 123 18 242 159 28 -210 -504
4556 -504 173 438 113 -303 -202 173 329 0 -174 -397 72 132 328 166 -299 -147 30 -27 -106 -132 -66 -15
4578 -15 451 -175 -466 -129 258 73 -60 8 -270 -35 255 164 -332 -30 131 276 123 -179 -118 130 88 56
4600 56 -19 -176 284 235 127 -516 -107 -198 36 -223 70 -29 -195 -6 159 147 -357 -348 13 186 34 -306 -383
4623 -383 198 22 -78 6 -591 -436 32 33 369 -161 -61 268 95 36 -674 -320 105 233 -46 -407 -189
4644 -189 68 112 144 176 -54 165 287 180 -238 -201 -134 58 96 57 -440 -29 120 150 -58 -292 147 458 92
4667I2J7k40N1J91J21Kp3l51L45j30lj76n5j9M28m1k69J66j23L07j26J00m52Q3
4691a55O3K02j55o8K06j60P4M37m29J16o20O35p0j32j47K26M6J91l76J2J28K42
4713B66J33n27K8O3q0K75m5k70nK69k34L8J5j71K58M35j42n45R6O2J97l18R3q6
4737a95O9K09k6j07k44L97m5n4Q7l29M7K67j08P9k77NK36J69pj76j62NM9L63m93
4762b41K49m36O49o8k03K5jK21J39k10k69O0J37K39Rn20j21M66J15J53n45m6Q
4785a90L4L33j07k21L64j98J46m53J45K20N6Rj59K21k08N6J29j86qK51R2k78J53
4808B01k05p8K61l04K86l73M1K12L23jl67p9n6K19m8J8l23Q4J6L81k79J57k19
4831a33L09k1p0k5j06nR4N3q9l43J75K58o6n3m2K33j55q2J3j55L74O4j41j33J87
$$ plain form
4667 92 109 -131 -80 111 232 234 161 -190 155 25 22 -154 -209 -228 200 159 -110 56 -67 240 114 214 -238 -155
4691 -155 -92 110 -45 -113 93 -67 7 444 15 131 -489 146 76 -56 -203 23 69 260 -116 -104 24 266
4713 266 399 -128 -100 -37 -117 158 113 -157 -162 107 -127 -89 -74 -245 13 448 306 -239 -143 -81 116 -202 -109 -195
4737 -195 -126 83 57 -50 -294 103 58 4 91 -238 -191 76 -32 47 -230 -225 11 180 173 -3 -165 -160 -111 252 -241
4762 -241 8 -428 221 153 -50 -25 -26 195 334 124 -145 -85 52 291 300 -220 -341 125 240 393 -152 -198 -190
4785 -190 -156 177 70 -151 213 15 161 -292 -147 73 129 138 -21 200 -8 48 177 -9 -17 234 326 48 201
4808 201 -4 -82 179 -125 161 -212 -171 41 364 363 -4 -83 -139 80 32 50 -273 -189 -173 208 -71 86 -133
4831 -133 176 155 85 60 -46 -51 43 96 7 -336 -161 97 31 -22 -64 169 14 -68 -55 -210 164 228 87 -46 141
4856A41j9k43L59k16m70L47J71nq1j29J31J84N1j72j06m6J28o3L68m05J9J39J57
4879B40J09l21l53K02O0K49J3n80K65N9M7l39K20j30M73J2j70j02J20LJ91j04
4901A64l47j07J18L59J36j79n18L01J54K37k02m96J84N01r3j6m41K92L45j89j52
4922E1q7j21O3K03J19l62M9L68M2n52L2PK15q6L90m70L4k9L5J08J81j60j60O4
4946f6Q4m3j05J17K92j12mk24L57j97K22j53m51K77k42M14j47N4n31L13M3L78
4968B76j83k95K80n3K47m10m6J04Q0Q5M6q3k56J16J47L52l67k25L36j56j3r1j10
4991b19J98J54o2k12J78k14nK85k61R6j69M36Kk21J22l0N8J84k40k15J27K9J37
5014A58K08k45j85j71L53J2o9l64J91M09l47K7Q7j98L39p0j31n5q3J82K4J49l46
$$ plain form
4856 141 122 -121 238 22 -448 -101 70 65 -16 -145 -14 170 221 49 -57 -103 25 -38 330 -75 -56 83 240
4879 240 349 28 -325 -123 -63 186 199 -381 -116 -57 -10 -349 -129 -259 214 226 56 -46 74 77 268 164
4901 164 -183 -290 -172 187 323 144 -374 -73 81 318 116 -380 -196 305 212 196 -245 47 392 203 51
4922 51 -36 -157 -94 109 228 -134 -85 283 325 -227 -195 -188 27 -59 331 -139 -105 -134 -99 9 190 30 -130 -66
4946 -66 18 -25 -130 -13 279 167 163 -61 296 99 321 168 -283 -6 -248 166 19 73 -458 -145 -102 276
4968 276 93 -202 78 25 272 -138 -184 -80 0 85 131 48 -208 -92 55 407 40 -185 151 -5 -18 -109 -219
4991 -219 -21 133 71 -141 37 -177 -182 103 -158 -62 -231 205 207 -14 108 78 136 320 80 -135 -8 21 158
5014 158 366 121 -64 -235 118 130 61 -303 -112 297 -50 -23 64 -134 205 135 4 -51 -134 48 72 221 -125
5037a25KK3J62J96k53l96L18K26oj41k35J27J11jK95o01K12L16o8k68J45p5J46
5060A10k05P2l6l3J15L04k21l9j82m6L35J41l68m24N26j20K45k39j34j76N87K54
5082D66k57l28j87J50L69j5k22k27P43n60J94K7k65K36l4R9j86j69K4N73l08k22
5104i9j51M61k04K13r1j98m6k1J81j01o2P9K59j66j17j76J58J13K8p1K3j46j88
5127c22N38M8k69n2oK86q9r2l69J34K41k10O7j21J60K85l1K49n20J26k12q7L70
5150A24l02J44M9M01m72nk20K18M9Q5lr9J5M10k97k3j81j55J96K30L2j73m32L92
5174a7K11q0k24Q2J3L43j51k98j13L40n1M08n81J33j32L82j18j4l21J50R4n7n4
5197e5k80M04m65Q06m66J04L9j19M34m16k9N3j93M2P4J90k29L15j7j22mO6j87
$$ plain form
5037 -125 -123 -100 62 258 5 -391 -73 153 147 6 -229 -102 9 8 303 -298 -86 230 162 -106 39 -36 110
5060 110 -95 -23 -59 -92 23 327 106 67 -115 -161 174 315 -53 -477 49 -71 174 -65 -199 -375 212 466
5082 466 209 -119 -306 -156 213 198 -24 -251 492 -68 126 153 -112 124 90 189 3 -166 -142 431 123 -99
5104 -99 -250 211 7 220 129 -69 -115 -136 45 -56 -118 -39 220 54 -63 -239 -81 32 60 -11 12 -134 -322
5127 -322 216 264 -5 -57 -63 223 134 42 -327 -193 48 -162 -95 -216 -56 229 198 447 -73 53 -159 -246 124
5150 124 -178 -34 15 416 -56 -61 -281 -63 -14 71 68 -31 -16 394 97 74 -107 -262 -66 164 196 23 -409 -17
5174 -17 194 114 -110 -28 -15 328 177 -121 -234 106 55 463 -118 15 -117 265 147 133 -188 -38 56 -1 -55
5197 -55 -335 69 -396 410 -56 48 87 -32 402 -14 -43 10 -183 -141 -67 123 -106 209 192 70 66 132 -55
5220e5L5J92j58K31m03J40j60Q55m87l84L38k10M63m54L05l19K75j24k58J43K9
5241fK28k70J25k61o2N96m06q9N9k97L07J51O7Kj13KLj5K6l43K77J34J2J38n55
5266b90J80L99r0J02l31q3J44k1J84j22j23k6K46K12l23j64Q0L76l51m06L32J18
5288D3N5l2k14k78O06K01l96L8K17l15J93m4l06k4L2K33J16m54L7j08L28K20k02
5311e4O9j99j3K56K59k95k79K53J52k0k72J25M43k91o7j54N8O9K12l28k5K7M07
5334C33k25p6L3m4p5J30K9j96j06N1R9N01n20R0k6l44M46l5k16R2Q9P3k57N3K24
5359A23k9k86M97o08j48L27Q5K40l25n8M5L08O6J41l77j22l7J80M0p6k81o2P39
5382C82j77k86M9j8j98L84n2jl99K19%L80m88J14J09L53R4p65L46O3j95J64j30
$$ plain form
5220 -55 -20 172 14 245 -158 -18 -178 677 190 -194 144 -66 397 -57 248 -71 204 80 -178 -35 -6
5241 -6 222 -48 77 -184 -246 350 -56 -145 -86 -383 -76 75 142 144 31 33 36 21 47 -296 -19 115 127 265 -290
5266 -290 -110 289 199 301 -30 -113 31 10 194 72 -51 -77 169 381 58 -106 -26 350 -1 -407 -75 43
5288 43 98 66 -148 -426 180 381 -15 23 240 -75 118 74 -232 -256 -224 9 125 -329 -292 -400 -72 148 -54
5311 -54 15 -184 -197 59 318 23 -256 -3 149 129 -143 -18 425 134 67 -87 -29 40 252 -76 -101 -74 333
5334 333 108 32 65 21 -54 76 105 -91 -197 -146 -47 454 -66 24 -2 -346 100 65 -151 -59 30 103 -154 -101 123
5359 123 94 -192 305 -303 -451 -124 -39 201 -124 -182 -137 171 237 378 1 -121 -158 22 62 -14 -295 -357 382
5382 382 205 -81 -32 -50 -248 136 84 83 -316 -97 -97 283 -205 -91 18 371 465 -300 46 109 -86 78 -52
5405e2k66M15M1k58J13jj24J19O3j35K30l32L80j61J61k63J06J95L3l92j76P0
5427b34L4K77Q8r3n24M77L25l17q7J54m18J35J43J35K36q21P65j76k35k58L03
5448i1K56j52K78j66q2j14n0L49m31j6O04k78j03K7r3KJ05q5j67J08K47k20m7
5471a19K09l94J54J07J40J14l64Rk31N51P6k91J09Nn1J1N7O5k88J31q9Kk72K76
5495h3J53L3r3k98N3O5O47p24N27l12j55k8R3m6J11K82k65N8l5l34N76k59R2l5
5519B3L16m77n7M04j68k34L18r8o7J98l6m61L10J41K51l10k51J79J32L55m72k57
5541b61p9M73m00K82O9q0J51j67J21m5l49L07K79k29K3k0j01L37J9l19k59k4O47
5564C75m85J85N8M8k03M25p22L16J30P9j02j69j22j4M05l95K10j36j42M77m8k14
$$ plain form
5405 -52 -318 97 138 -120 -7 -8 -132 -13 50 -85 145 -187 193 32 193 -70 36 231 264 -128 -304 -234
5427 -234 -200 77 165 72 -452 25 350 33 -54 100 -318 -183 -40 95 331 -490 275 99 -136 -394 -91
5448 -91 165 13 291 125 43 -71 -121 228 -203 -219 385 107 4 31 -62 -60 45 -40 -207 -99 148 -72 -119
5471 -119 90 -304 -150 -43 97 211 -153 -144 -375 176 252 -39 70 75 24 35 92 157 -131 0 -89 -87 -359 -83
5495 -83 70 103 10 -288 -235 -170 477 -247 280 -32 -187 -215 -122 -168 -57 225 -40 18 -17 -351 225 -34 58 23
5519 23 339 -138 -195 209 41 -193 125 27 -40 158 122 -339 -29 112 363 53 -198 -19 113 468 -4 -261
5541 -261 -340 133 -267 15 84 4 155 -12 109 64 -285 22 301 72 95 75 -26 311 330 11 -248 -272 375
5564 375 -110 75 133 181 -22 403 -319 -3 127 206 104 -65 -187 -201 204 -191 19 -117 -259 218 170 -44
5586d4j35J32J11j29M63l51j87MK41j57L68k89n17N25L70l29j65P8J9M5J58l11
5608a00K39j67K8r7l4q3L56Rj35p5k24K54J68k0l41J94PLj4K07k32K1r1O6k1O4
5634a8J85k76J02J9j73J15j2J7J50Q9n14M10j4l7j15n6M62j66j55j12P8K92k49
5657B2K33j59k09k72L04J80o4k22PN2K87n2l17j8K06K40k47J46j16L6o0O4m30
5680c89K54O1M56m40K11k01J30R8j03n1L6J12j6J03m47k7L12k35M09k76k30M4
5702a89M48r5K01l52j23J20l1j03R4l10M56O5l51L17k12m0J32j26k6J38o4O8J13
5725A30j9r0j10M8k09M45l20K3Q8J31j79J66L1j70k35J71K66k07k21N93l85K18
5747A65m37P9J49K83p3j23R6j63K8j27K92l47L95j9j04q6p6j40N74k16k2l22J16
$$ plain form
5586 -44 -179 -47 64 -65 398 47 -140 -136 105 -52 316 27 -490 35 405 76 -89 -11 8 53 211 -100
5608 -100 139 -28 0 -97 -131 -214 142 151 16 -59 -283 -29 139 119 -222 -28 -21 -18 -32 175 -57 -36 -127 -61 -82 -18
5634 -18 167 -109 -7 12 -161 -46 -58 -41 109 198 -316 94 80 43 -72 -128 334 168 13 -99 -21 271 22
5657 22 255 96 -113 -385 -81 99 35 -187 -180 -128 159 107 -210 -228 -22 218 -29 117 1 37 -23 41 -389
5680 -389 -135 -74 382 -58 153 -48 82 180 77 26 62 174 158 261 -186 -213 99 -136 273 -3 -233 -189
5702 -189 259 164 365 13 -110 10 -21 -124 -30 -340 116 181 -170 147 -65 -105 27 -99 -125 13 -51 17 130
5725 130 111 21 -89 -41 -250 195 -125 -102 -14 117 -62 104 135 -35 -270 -99 167 -40 -261 332 -53 165
5747 165 -272 -193 -44 239 166 43 139 -24 4 -123 169 -178 217 198 94 8 -68 -208 366 150 128 -194 -78
5770g8J51J08ql6j30j64J01J99P5j49j26R4p9L53l7l49J11K91m83K62j36q8K44
5793A26l20K35N6l34N91k19l38J02KJ7J35j27j82K70l7N4j53J3K51J09r5j37j74
5816a55J02J30j13l4k86M12N1k23L3L1p1J3N05k73m37N12j57p3P7J23l30P4K71
5839A82j36r4o4J31L43l65j25J64J01p6m1j3k66N10o1q6M9kp2J32j73K04m64K57
5863C5j42M20k52k11J92L1J11m26J96j4J39k4o3M8K3k22M27l47N6O1n3k22J68
5886f9J23j74L8L47o66K23J69K02l04J93R3k97J65K8j38K37o3k18K99j06N1m5
5908H8k60J02M08k37k29L39k11J7J80j11N0m10M83o4p7l7j69j01M12p5k00j11
5930b13L29O2k11J16K9J59n38J26J29j50J75J96M3m44K73O7j92K91r2j35O1M6
$$ plain form
5770 -78 73 181 173 137 7 -157 -56 143 218 69 -57 37 -42 311 274 -75 36 327 -156 106 -30 -118 126
5793 126 -194 41 97 -237 354 135 -203 -101 -99 -82 53 -74 -256 14 -23 31 -122 -109 142 251 156 19 -155
5816 -155 -53 77 -36 -70 -356 56 107 -116 -83 -52 -123 -110 395 122 -315 197 40 -33 44 167 -163 -89 182
5839 182 46 -48 -112 19 362 -3 -128 36 137 61 20 7 -259 251 190 104 153 151 79 211 38 242 -222 35
5863 35 -107 313 61 -150 42 73 184 -242 -46 -60 79 55 -8 40 63 -159 268 -79 -23 38 -15 -237 -69
5886 -69 54 -120 -82 265 -401 -178 -9 193 -111 82 175 -122 43 71 -67 170 107 -111 188 82 133 88
5908 88 -172 -70 338 101 -128 211 0 17 197 86 136 -274 209 145 68 31 -138 -239 173 98 -102 -213
5930 -213 116 178 -33 83 112 271 -267 -141 -12 -162 13 209 252 -192 81 148 -44 247 155 20 81 127
5952A27J2p0j97J92J42n19K45J05K0P7l4l75M13p6k24J44K51j41j22k16K13K57
5974B24j94r9K4k60L92L4j76L53n22L50J98m24j13K89j61Q9J24j48j11%J12K12
5996A93p6k90K35k08L29n02L78qj51m9O9K36l13L07j74o9K96l64K97K91k08k57
6018c8j7j27J20l7M39m36j19J89P8K6J49J4k80k77L64j7L47n33p8L18j25J11P8
6041A49l51L20j20p4J49R2K7k59J60j79J69PJ93j15k03k17M60j91k2j40K60k01
6063h6n2K58j15j25R6j26M43k51j54P0L2j9R3l54L08M7l9l37L38%j26N7J89n6
6087I1R9k53OJ14Q6m01K51p1K35j75OQ1k87M63l98J29J14R5m11L08n7k43J17J62
6111F1j2J59l74K90l42M81k9n8m17Q4N80l50o5j17mK67k54j6R2L77m42K17jJ7
$$ plain form
5952 127 139 69 -128 64 206 -313 -68 37 57 134 100 -275 138 62 -162 -18 233 92 -30 -246 -33 224
5974 224 30 -69 -45 -305 87 121 -55 298 -224 126 324 -100 -213 76 -85 4 128 -20 -131 -131 -19 193
5996 193 117 -173 62 -146 183 -319 59 51 -100 -149 -80 156 -157 150 -24 -93 203 -161 136 427 219 -38
6018 -38 -55 -182 -62 -99 340 -96 -215 -26 52 78 227 241 -39 -316 48 31 378 -155 -233 85 -40 71 149
6041 149 -202 118 -2 -76 73 165 192 -67 93 -86 83 90 283 168 -35 -252 208 17 -5 -145 115 -86
6063 -86 -138 120 5 -120 -24 -150 293 42 -112 -42 -10 -29 64 -290 18 65 26 -311 27 27 -99 -42 147 91
6087 91 190 -63 -57 57 143 -258 -7 -78 157 -18 -12 69 -218 245 -153 -24 90 185 -226 82 25 -218 -101 61
6111 61 49 208 -166 124 -218 263 234 176 -241 -157 423 73 8 -109 -113 154 -100 -116 -24 353 -89 128 127 144
6135A44j58l4oj02jJ80%P4j37m4J34j68j34M14l49K39j69J45n5k48N1K76p2j37
6159a57Q0K05j27r6K58k33R9J41N1M7l45J26m8nL5k5r5J56K43l83J55k04RQ0L0
6184cK18n10K42O2J32l06L33j00l7N3Q9k23P4k8K21k9j86l1L4k59L48n2Q5n9l06
6209b38L44j86J88k14J56N9q7j19k59M61q1k34K8J84R8J63j78rp5K72n02O46l84
6232C3J6J57k14J97j82j04J49j6L15n43J58J7l27L20K16j77k23J9K25J16m40K95
6254Gj93L34N8l04K63k46K8J39N3j53Q3j42K06k49K55J6k67M10l21K9j21M08l36
6277d3K22p1j71J83K9k15J2Kj6o1Q2M5j0j00J33l7n4j0l94L53L27k40q2n9K64
6302H9j49Mq2K10K8j64j06K28L28o48J68M9k05J27J82Mm54L29K73l42o1N61m15
$$ plain form
6135 144 -14 -48 -54 -156 -157 23 23 97 -40 -84 50 -118 -252 162 -187 52 -117 28 -27 -275 -224 52 -20 -157
6159 -157 -77 128 1 -95 163 -70 29 170 221 268 -77 49 1 -4 31 6 -89 67 310 -73 82 -122 -113 -33 -3
6184 -3 215 -295 -53 9 141 -165 168 68 31 84 173 -50 24 -4 217 188 2 -29 5 -254 94 42 127 68 -238
6209 -238 106 -80 108 -106 50 109 22 -97 -356 105 24 -210 -182 2 100 263 85 76 1 273 -229 417 33
6232 33 49 206 -8 189 7 -97 52 36 351 -192 -34 -17 -344 -24 192 15 -208 -189 36 152 -288 7
6254 7 -186 148 206 -98 165 -81 -53 86 139 -14 69 -73 133 -116 139 155 -112 298 -23 6 -115 293 -43
6277 -43 179 108 -63 120 149 -66 -54 -52 -68 -129 -47 -2 -12 -112 21 -16 -70 -80 -474 -121 206 -34 -116 -175 89
6302 89 -60 -56 -138 72 100 -64 -170 58 386 -262 -94 -45 -250 -123 59 63 -391 -62 211 -131 -192 369 -46
6325d6Nq6M65j72j84K2J89p3l34J34j63N1J88M4J31j04l46K46K98j80k01K79j38
6348B5l3j87L9J59J94m40N6K68n4j15J34J52l42j03J96L8l17K80l2j12n9K33j5
6371c5l08O12o18J76K53J45n73K85j69J68n8L29m75K38J94j86j52N11n2l88N8
6392d5K21L3j41l44L65n8j8J41j32K20j74J98m49L59O3l22N1j15J92l00J23p3
6414b05K52p1J74n0j11K67j92J3k67PJ79p4J34r6m8K63j47j21J19j2m1J77K8l35
6438a57N07l71j11J03J44M4O7n05M17l37K95ok16J21R4j95J29J5lj79M71k54J76
6461B49l30N6K73j06k2l67K85P2P2r4K2k04J69j89J05j08O0o6K91j84O6r3Q1j3
6485B5N0j60j14K82j03N8P6j75N7P5k11J9J33O2j2k99L70j12K79m83L94l60J69
$$ plain form
6325 -46 -41 -127 338 166 -18 4 193 120 -214 -80 -243 -192 -4 40 171 67 -279 -33 265 85 -116 163 25
6348 25 -8 -195 -156 3 197 -243 -187 81 27 -88 46 198 -144 -247 -51 -13 -330 -50 -82 -194 -253 -20 -35
6371 -35 -343 269 -349 -173 80 225 -348 -63 -232 -64 -122 207 -268 -30 164 -22 -174 337 285 -103 -45
6392 -45 176 209 68 -276 89 31 13 154 22 242 68 266 -183 176 239 -83 -32 -147 45 -255 -132 -205
6414 -205 47 -24 150 100 -11 256 64 77 -190 -183 -4 -78 56 -40 -88 175 28 -93 26 14 -27 150 178 -157
6438 -157 350 -21 -132 -29 115 159 226 -279 138 -199 96 90 -126 -5 89 -106 23 38 35 -144 327 73 249
6461 249 -81 -25 248 142 120 -247 38 110 182 88 110 -94 75 -114 -9 -117 -57 -123 168 -16 50 -43 38 25
6485 25 75 -85 -199 83 -20 38 114 -61 -4 71 -140 -121 12 74 62 -237 133 21 300 -183 211 -149 20
6508B0j97M7Q9j14J51L7rK1k8L3J49j55o5p1L6P9j77J1O7L4K21m19M55j95P9Q1
6534A80j54k34J79K37k54j65K18J25k17K35j5j78j07N4J91K2j60jK83k77M7L0
6556C9l0M12l51n5R5L30k73k34k2r8J70QJ16j35P3J7m34M20Q3R3o4k00M58l95
6580B3N4j47K89l16P2j92K7R6J29K4L24n94J21M14l22j99L44k18L5P3n9q9k73
6603c84N04j5MJ0n88N62l33N9M4J29n7K53J09l13j1j53j24L53j42J17r1qJ64j51
6627f2m3M18m33O5K14p8k27K53Q1j51p8J40n0p7K58j9k3m03M48j94K17n31L78
6650A03r1K67j75k11P4J54n6j28J09J48j84j4K2M0n0J99j17n8K7l21K21L8j66
6673a69J97j20K4J21jj06J51j15NJ54O2Q9l49rJ80J21o58L31P9K16q2j15j76J93
$$ plain form
6508 20 -177 -130 -41 -155 -4 33 24 45 17 50 199 44 -21 -92 -56 23 -154 -143 -76 -42 179 -240 215 20 99 180
6534 180 26 -208 -29 208 -46 -211 7 132 -85 150 135 -43 -150 -96 95 117 -43 -44 239 -38 9 39
6556 39 9 421 70 15 110 440 167 -67 -89 -187 -17 -9 107 -28 45 62 -372 48 131 224 160 -40 418 23
6580 23 77 -70 219 -97 -25 -217 -190 -94 35 59 383 -211 -90 324 2 -197 147 -71 -36 37 -22 -111 -384
6603 -384 120 105 109 119 -469 93 -240 -181 -137 -8 -65 188 297 -16 -27 -180 -304 49 -93 24 -67 -75 89 -62
6627 -62 -105 313 -120 -55 159 81 -146 107 188 37 -41 99 49 -28 230 211 188 -215 233 39 256 -275 103
6650 103 12 279 104 -107 -33 121 65 -63 46 194 10 -4 18 58 8 207 90 32 59 -262 -41 -3 -169
6673 -169 28 -92 -68 53 52 -54 97 -18 -13 141 203 292 -57 -66 114 235 -423 -92 -13 203 121 6 -170 23
6697B3p3J15K9k23J64j8K08k91J24k8L9o8L06n87L41K75l80J59l48n0K05K60L5
6720B17l21Lk19M00R1l16M2n6L38J15l16m3R7P6p9k43P8K28m13L12J97k66J08
6743C0k77M51l99N34n55K93n7P5j95N9j66K12Q3q1M5j60J49J77m35R1J24k8j02
6766a32r7n1L34J61j68J89n44P2K83k1K30k02j94K15J1j67J30lK56k73J85k87
6788g3K00J19l20J47l0K65n00j86K59M56o6p1l39J84j79J65k8j77j73O18n97l2
6810c58%J98P7l0l7J43J9l1J29j73K40J1J23j25j2p7m0k85R3K94k94j4M79k82
6834D8J82j83J77j86k28O03n72M68m94K44k45N7K72l83K41q3r4N87m60j1K41k64
6856h3J39L2j64L2r4J92Q9j32K08j83k43L84j18K47m49l32O49j11O7o7k58K75
$$ plain form
6697 23 -50 65 94 -129 35 17 225 -66 58 30 69 1 307 -280 61 336 -44 115 -233 -283 -78 182 217
6720 217 -104 -101 -320 80 171 -145 -103 -159 179 294 -22 -65 32 108 29 -214 -136 92 -321 -9 188 -78 30
6743 30 -247 204 -195 339 -216 77 20 95 -100 -41 -207 5 88 7 52 -108 41 218 -217 -126 -2 -30 -132
6766 -132 -229 -280 54 215 47 236 -308 -236 47 26 256 54 -140 75 86 -81 49 46 302 29 214 -73
6788 -73 127 246 -74 73 43 308 -192 -378 -119 337 271 200 -139 45 -134 31 3 -174 -347 271 -326 -358
6810 -358 -358 -160 -83 -113 -150 -7 12 -19 110 -63 177 188 311 186 174 97 57 -228 -135 159 -135 -149 330 48
6834 48 230 47 224 38 -190 413 -159 309 -185 59 -186 -129 143 -240 1 -82 -176 411 -49 -60 181 -83
6856 -83 56 88 -76 -44 -138 54 143 11 219 36 -207 177 59 306 -143 -475 174 63 130 63 -195 80
6878H0m3j3O7l38R0M75l39J66r6j36k4J13N46n48l27K59J49j35m3K2J64k46M6
6901a11j56J10J6N8K08j07n2K24l26K02K44k70j05O2j78K0J63k5RL9j81J66k66
6924b56P1L11P6kk05K23k22J01m8j27rl7J62m9k01L48j80J50j67n7J23K0lN1r8
6949b5L28m09L32j4k18k16N38l67K1O2K6m7p7J58rk51R3J99k86J87J36k02MJ76
6973A39J22j77j88M27l55R6K16k78l9l04M15K5k68L9L08j44n0M7l92M3M10k85
6995a93k06L03R5p2L35l42J92j39J97j79o1J03j01J42j28J96k82o4K38Q1j93m0
7017a18J13j17K99P1l75J17N3Pj28J06j72j08K13K6O4k3j5l2K27k64O0r5L44k14
7041C9j88J80k55J85L32k10m6N8j55L59k0m16J06j7n2k02K64j00J59L36j78k96
$$ plain form
6878 80 37 24 91 -247 -157 318 -21 145 49 -87 -111 2 548 0 -327 -68 81 -54 -97 -75 89 -157 -111
6901 -111 -267 -157 -141 -83 125 18 -34 190 -136 66 310 40 -65 -3 -181 -161 2 -23 -14 25 -156 10 -256
6924 -256 -185 126 202 200 -5 218 -4 97 49 -78 -87 -124 38 -11 -212 136 -44 106 -61 -118 5 25 22 73 -25
6949 -25 303 -106 226 212 -6 -222 316 -51 -30 32 58 11 -66 92 83 -168 -75 124 -162 25 161 -41 -37 139
6973 139 261 84 -104 323 -32 64 280 2 -37 -341 74 99 -169 -130 178 34 -16 31 -361 -318 92 -193
6995 -193 -399 -96 -1 -73 262 -80 112 -27 170 -9 -70 33 -68 74 -54 142 -140 -204 34 115 -78 -118
7017 -118 -5 -122 177 248 -127 -10 43 50 -78 28 -144 -252 -39 -13 51 28 13 -19 208 -56 4 -91 253 39
7041 39 -149 31 -224 -39 293 83 37 95 -60 299 279 -137 -31 -48 -100 -302 -38 -138 21 357 179 -117
7063a17J93k48J35J56J83l60q4J17Q4K14l14q0M33j46l69j22L25k16P95o75P8
7084a8J38j51j2J19k30J79QJ68k82O6m0r5J12n4J71j41J36J82l23M78k60k84J16
7107a7L24o3k10p8Q3J76L2n33N8Q1J79k5q8l4J57k7k17N51m6j18j51L09m97K7
7131a27K44m10M10J03k43l7r7L01k23j74J73L54j05K5k42k51l7M92n2k04J26k55
7153b29N96l74L12p07L87m0L25l15K31l89K74k9l2J8q2j38Q2L51m31M0R8r5L63
7176B16k7k41k36J95J69k40K82m41L92m01J74j1J89k34J11j43K56m9K12l31n1
7197b09L56j65l4L62l20J15K4l94N48r7k3J74k87n0O1q0j03k0j21M18o0j31J99
7220A63L2n5Q0J0m48L23k16K94K73l13oj47P2N3k96J54k25K99o8p1K17k78L84
$$ plain form
7063 -117 76 -172 -37 119 302 -58 -142 -25 59 273 -41 -121 312 166 -203 -325 0 -216 579 -96 -18
7084 -18 120 -31 -43 76 -154 25 33 201 -81 -15 -55 -150 -38 -92 79 -62 74 256 -67 411 151 -133 -17
7107 -17 307 244 34 -44 39 215 247 -286 -228 -147 32 7 -81 -115 42 15 -202 349 303 185 34 343 -154 -127
7131 -127 117 -293 117 220 -23 -60 -157 144 -79 -253 -80 274 169 194 -48 -299 -336 156 104 -100 26 -229
7153 -229 367 -7 305 -402 -15 -55 270 -45 186 -203 71 42 10 28 -54 -192 -110 241 -190 -150 -52 -147 216
7176 216 189 -52 -288 -93 76 -164 118 -323 69 -332 -158 -169 20 -214 -103 -246 10 -39 173 -158 -209
7197 -209 147 -18 -52 310 -10 105 129 -265 283 186 163 337 50 0 61 -19 -122 -142 -263 155 95 -36 163
7220 163 195 140 220 230 -218 105 -111 183 456 143 137 -10 62 115 -181 -27 -252 47 -21 -92 125 -153 231
7243B31j49j09J5R6j10J37j60q3N0K74k17o2J18MJ2L0P6j62J58k82M0J53q2k61
7267b83L01j79L34j62K46m45M82m78M35m25J88J3Q9n11L52J68q1j19j57M99k69
7288bJ61k64J08o9lR0J11j6k14M60m01K31n7l8j94j6L55K1l61l25M20m8l2J49
7312F6j71j11L59j79K02m80K93p5J29P3J31k37J01r2J31k82j20P0J65L46k23j13
7334a7p7pK89l28L60j74J64j49k55N5K67j63J36j69RJ15K42k18j34Oj37J09j42
7357b18J12K51q5M7j31M7q1K58k12n7J06k95K19Q0n3k29L45M0k88L9J50kk59K38
7381B2j76K15n2k1K67j26Q7p1k09pJ74l73lL36j51L27L3k72L7Q8q7K98k41ql09
7406b22J58K35p0l5l55K76m30N45q9K36n7K5m25j65O37j23j45O3J33j52n8l1p2
$$ plain form
7243 231 82 -27 -12 84 -26 111 -49 -132 -82 192 -25 -87 31 35 47 77 153 -9 149 -133 -93 60 -22 -283
7267 -283 18 -161 173 11 257 -188 294 -184 251 -174 14 27 116 -395 -43 125 44 -75 -232 267 -2
7288 -2 159 -105 3 -66 -69 21 132 116 -98 362 -39 192 135 97 -97 -113 242 263 -98 -423 -3 -51 -83 66
7312 66 -105 -216 143 -36 166 -314 -21 -96 33 106 237 0 101 9 140 -142 -262 -192 -27 319 96 -17
7334 -17 -94 -101 188 -140 220 46 210 61 -194 -139 128 -35 101 -68 -59 56 298 80 -54 -48 -185 -76 -218
7357 -218 -106 145 60 107 -24 23 -58 200 -12 -69 37 -258 -39 41 -12 -241 104 144 -144 -105 45 43 -216 22
7381 22 -154 61 9 -12 255 129 216 145 -64 -71 103 -270 -273 63 -88 239 272 0 37 125 38 336 95 87 -222
7406 -222 -64 171 101 66 -289 -13 -443 102 13 249 192 217 -208 -373 264 141 -4 59 192 40 -18 -49 -121
7429a21J3K42j47m06N07K97l54J30l07J4L58m8p2k0K07j48j03mr4P1J79l27j03
7452b36j9k1K87j61J50K6J9J08J09j49k08J63l16o0L56N8k81J31rJ09n4j50J96
7475D8J05l43L5l6K15j10K74k38J7K43k85k59L23r8L17m32L68J5k78K82k65J29
7497B7K71m10K8M97m74K47j46R2l29N46k06j68p5K2K05l10K38K20qk28j59J24
7519Dj23k4r3M27l86J07j26J13K35J08j76j40J08q6K70k87J39j06j95K39K24k81
7541d9J73J3m1K00m66J63J08q8K34k88J0L51l34J45k05k24M21J17J28k64K9k4
7563A09j70K90J0J1m98K87j1L6r3L9o1J11n02L92K49m3j89jK08k33o9L4j40N45
7587C11l63k96P71r9k88j66K6M9R5r3O7N3o0O7k15j66M54k89j76M50j46j79J59
$$ plain form
7429 -121 -108 134 -13 -419 88 385 31 161 -146 -132 226 178 106 86 293 145 42 38 -56 15 194 -133 -236
7452 -236 -255 -276 11 -150 0 26 45 153 262 113 -95 68 -248 -308 48 106 -175 -44 -53 56 2 -148 48
7475 48 153 -190 -155 -191 24 -86 188 -50 -33 210 -75 -334 -11 -109 208 -224 144 159 -119 163 -102 27
7497 27 298 -112 -84 413 -61 186 40 132 -197 349 143 -25 -100 -78 127 -183 55 275 267 39 -120 4
7519 4 -119 -143 -236 191 -195 -88 -214 -101 134 242 66 -74 34 -52 218 -69 70 -36 -231 8 232 -49
7541 -49 124 137 96 296 -170 -7 101 13 247 -41 -31 320 -14 131 -74 -298 123 240 368 104 133 109
7563 109 -61 229 239 250 -248 39 28 64 -29 10 -51 60 -442 -50 199 156 -33 -34 174 -59 -128 -94 -234 311
7587 311 -52 -348 423 324 36 -130 -104 -55 40 -53 14 67 7 74 -141 -307 147 -142 -318 132 -14 -193 -34
7610c4m1oK47m55O60l78L03p87L89j62J42K32n6k01O1L62m23R0K84L3l85L26k51
7633e0K72q1r3L4J6l46j2M0L08K5j27K29l36J46m07M68j32m47L93J42J54m4j99
7656d7J84k2m2j98J93R6j76N50o85j8J88O5j29R6k16M5l9O2K06n7j96r7K36Q1
7680H0J58j19O2k5J51l91k64L95K82j53m27M01j54L61p6m16l1J11R4J6l2n4j43
7703a74K87l6K95k84p2J14j05J00k91J48K97k47K73k80L30n22J24K5p6L40l43
7724i7L8m5L8j83K48O6J19k22j07j12J97K64Pm80L15k94K94J69k08q5J69K71m54
7747i2k39L66q1K85k20o7k6J57r9K45l43K10j56k33N03l32L46o2j99J28l45L87
7769A33k07k50L94K9j37J14m3L5J62j43n5j69N41k90j97K37o6m6N4k27K06j6j44
$$ plain form
7610 -34 -75 -81 166 -289 371 -7 296 -491 -102 -264 -122 110 54 -147 -86 276 -147 -57 227 260 -125 201 -50
7633 -50 222 141 48 82 98 -248 -260 -220 88 113 -14 215 -121 25 -382 86 -46 -493 -100 42 196 152 -47
7656 -47 137 115 73 -125 68 164 -12 538 -147 -165 23 88 -41 55 -161 -116 -155 -93 113 56 -140 -237 -1 80
7680 80 238 119 181 156 307 -84 -348 47 329 176 -251 150 -4 357 281 -135 -166 -55 39 55 23 -31 -174
7703 -174 113 77 372 88 16 130 25 125 -166 -18 279 32 305 25 355 -167 -43 -18 -94 246 -97
7724 -97 -59 -104 -66 -249 -1 65 184 -38 -145 -257 -60 204 211 -269 46 -248 46 215 7 -78 91 362 -92
7747 -92 -331 35 -46 239 19 -48 -74 83 -16 229 -114 96 -60 -293 210 -122 224 162 -37 91 -254 133
7769 133 -74 -324 70 99 -38 76 33 68 230 87 32 -137 404 114 -83 154 88 42 96 -131 75 59 -85
7792h5J87J71l39l6kK35j65r2K36J75n4m24K09k4kJ46k18L52m65K68N7j70k9Q7
7816A8l36K43M0R6KL0j73p4K75l48k8L29m2L21k88k69K96Q6m44N6K95k90J82l39
7840c62M08p1pJ09j32P0P7m9p4J25m2L31p41L10J20j4J41L4k85QL89k06l39N17
7864C17l87J41k24R6J14l07N99m24j38J23J01j16j49K46NQ4O5j83K4k3J90qj43
7887CK8J71j97J53K00k46n16K53P4K70j36k56Q4J58j82l1r1P7J03J30k39j79N18
7910A49m03K85j6m5L7j96M09j27j39j00M50k92k17K34q3L2k8Kj49L94k33j10q
7933a54R1M5o0J84p1q5k7J46k43J11l8q9J8K10j5O8j37J39k06j28J56K46k85k22
7957c46M63K64K38o89J06K04l48l0K00l69L76k11j03J62k10J46L26j01M01n76
$$ plain form
7792 -85 102 273 -66 -102 -104 131 -34 -126 110 285 231 -193 16 -8 -10 136 -82 270 -195 73 130 -40 -69 18
7816 18 -318 -75 -35 61 63 93 -80 -154 121 -227 -255 74 32 353 65 -204 92 178 -266 -210 85 -205 -23 -362
7840 -362 46 -25 -32 77 -55 15 92 43 -31 94 52 383 -358 -48 72 58 199 233 -52 -44 345 139 -200 317
7864 317 -70 71 -153 -57 57 -250 349 -75 -213 -90 11 -105 -254 -8 -3 81 146 -37 -13 -36 154 146 3
7887 3 31 202 5 158 358 112 -404 -151 -77 193 57 -199 -115 43 -139 -170 -261 -184 -81 49 -190 -369 149
7910 149 -254 31 15 -30 7 -189 220 93 -46 -146 304 12 -205 29 -54 -22 -50 -48 -197 197 -36 -146 -154
7933 -154 -63 -18 -78 106 35 -50 -77 69 -174 -63 -101 -190 -172 38 23 91 -46 93 -113 -241 -85 161 -124 -346
7957 -346 117 381 619 -70 36 240 -108 -138 62 -307 69 -142 -245 -83 -293 -147 179 78 479 -97
7977i7l94N95j3j63L9k49M85j49J07k20n3k6K85k49Q3K5j74J39O5J20m10J97J08
8000E1l4n3p4K98k21L9j78j38M82p7J8r5q3q7mj3K72r4qk50R8K33p5L02j27j13
8026F9l8J96k29j80M2J53O6Q7R5J04j33m61K50r9J35j28M4j16K99N3n04L14Qj05
8050g8m9J78O1r9J34K9k69Q3J51m6o0J56l34r6N09l98j11M13j13j18o7J33O3O2
8074A34j31l5K5p0P2m5q6J51J88k73J55J34j09L2K4j29J93j99j56j04K45K6j64
8097a22O3Q4J63l24J69k46L86l8j64K70k84LJ1j55L30k9m0n8p6l12K13K61K5l8
8121I2k52J36l2J37j18O0k60J93k34L0K09r9j05L72O9n5j1m0l16J10K68K0n58
8144c84M39k47L02qj57j40J34n4O6J05j51N0J87j17j4L5m4J04l51L60j31L27l78
$$ plain form
7977 -97 -491 104 91 -72 -33 -282 203 54 161 -59 -112 -138 147 -102 -19 6 -168 -29 36 156 -254 -57 51
8000 51 17 -36 -110 188 -33 6 -172 -310 172 95 113 18 -65 -152 -156 -169 103 9 1 -249 -151 82 7 309 182 69
8026 69 31 227 -2 -182 -140 13 79 166 261 365 232 -229 21 -78 57 -71 -27 -143 156 209 -295 19 27 -78
8050 -78 -127 51 112 13 147 176 -93 -10 141 95 35 191 -143 -239 270 -128 -239 174 61 -57 -124 9 72 134
8074 134 3 -32 -7 -77 -5 -50 -136 15 203 -70 85 219 110 142 166 37 230 31 -125 -229 16 42 -122
8097 -122 -59 25 188 -136 33 -213 173 135 -29 241 -43 -40 -29 -184 146 117 77 19 -57 -369 -156 105 130 92
8121 92 -160 -24 -56 81 -37 23 -237 -44 -278 -248 -39 -138 -243 129 198 143 132 92 -224 -114 154 174 -384
8144 -384 55 -192 110 102 -55 -195 -61 -115 -49 56 -95 -45 142 25 11 46 2 106 -245 115 -16 311 -67
8167f7L23m36K61L4k5j32pQ2n8J06j75L3lK79K30m67j36M8p6R5M98n44pn
$$ plain form
8167 -67 256 -180 81 115 90 -42 -49 33 -25 81 -94 -61 -64 215 445 -22 -158 -110 -186 -91 407 -137 -144 -149
8191a49
$$ Imaginary data points
##PAGE= N=2
##DATA TABLE= (X++(I..I)), XYDATA
0@%%%%%%%pJ4j4J8k5K8l5M2m9O3p7R0j04J20j40J63j88K16k47K82l22L65m12M67
31B48n24N86o56P33q18R11j011J121j244J377j525J689j871K072k296K553k841
48a496L167l549L998m529N178n991P037q446J0456j3573J9116l1900J13203L0461
62A23132k39347l093J11761J04324m309j07231j21366P3777J57073K1104j26332
73a0507r2352J9044J27025Q7452q6935j59629O983J49772Q4137p2722j32171m0516
85a20419J22628J27271n5843j51802k9150R8142R3862J246j03417r8009N5805
96e9686J42942K5519j15379r8294K9366J26342O9536r3686j34596J5842J35704
107D3610P0297p5109j20809j4434J10909Q7179m6269j08335m0281O7485J06362
$$ plain form
0 0 0 0 0 0 0 0 0 -7 7 -7 11 -14 14 -21 21 -28 35 -42 48 -56 64 -76 87 -101 115 -132 150 -172 193 -219 248
31 248 -276 310 -346 387 -431 480 -531 590 -654 723 -802 887 -984 1088 -1208 1345 -1496
48 -1496 1671 -1878 2120 -2409 2769 -3222 3815 -4631 5825 -7748 11368 -20532 92671 123132
62 123132 -116215 -119308 -7547 96777 92468 -14763 -136129 -62352 94721 115825 -10507
73 -10507 -102859 -83815 43210 130662 43727 -115902 -108919 40853 124990 52268 -79903 -120419
85 -120419 2209 129480 73637 -78165 -107315 -9173 84689 85935 -17482 -115491 -59686
96 -59686 83256 108775 -6604 -104898 -75532 50810 120346 26660 -107936 -92094 43610
107 43610 113907 38798 -82011 -96445 14464 101643 55374 -52961 -93242 -25757 80605
118H0605J2695j17607r1949P0062J29750J1838j06455q7739L3377J19850N3801
129A08228r4094j11758K4107J13624N5391o0811j02825k0388R4619Q7123l5433
140E7783j05668m6512O9004J10050N510j23896p9113Q0879J15754l579r8186p0534
152h8508L4946J05495M3063q4818r5979K0666R8775N2241n0608r8164k4551R3635
164F193Q9213l9537j11519l5999Q1006R6120j3804j12822n5473P6210R3468n762
176F7294q0840o4124K6738R8994M0862q1369q8908K1708R2362M9684m9361r7309
188f4269j8805R7639P8953n0789j02608j8544P8383P5194j9413r1658m4784O1053
200a9648Q2178J799p4668o4631K6929R6378L5738q1573q1750K6916Q8082M0821
$$ plain form
118 80605 93300 -24307 -116256 -46194 83556 95394 -11061 -98800 -65423 54427 108228
129 108228 14134 -97624 -73517 40107 95498 34687 -68138 -88526 6093 93216 57783
140 57783 -47885 -94397 -25393 84657 90167 -33729 -112842 -31963 83791 80212 -17974 -88508
152 -88508 -53562 51933 94996 10178 -85801 -65135 33640 85881 35273 -62891 -87442 6193
164 6193 95406 55869 -55650 -91649 -10643 85477 71673 -41149 -96622 -20412 73056 67294
176 67294 -13546 -77670 -50932 48062 88924 7555 -81353 -59645 32717 82401 33040 -64269
188 -64269 -83074 14565 93518 42729 -59879 -78423 -40 75154 55741 -35917 -80701 -19648
200 -19648 62530 64329 -10339 -74970 -48041 48337 84075 2502 -79248 -52332 35750 76571
212G6571n1693q8170r078R2908O3014n2610q4936j0773O4108O4923j1856q2869
224c0461m5807N5915Q1116J773p6134o0960L4135R1495K3223p8285o8882K8919
236d3953P9743L3240n1555p6684r52Q1430N0829m6134p2728j2399N6463O3593
248F0893r602q2620m3314O0038P6769p778p4728m8509L8347Q0462J3898p1491
260g635n6616K7630O9641K8227m7034o8940O88P4372M5879m2060o8565j2367N6990
273B10O1389j6976q0888l2089O2324O5061j4898o6273l7998L6107O9387J1090
285E6446o4472n1047K6509O4553K5235m5967o4236L830P1670M0244m2997o4669
297d4901p053N7514N3945k4005p3705k0432N7865N3285j4918n7915l3926L3455
$$ plain form
212 76571 24878 -63292 -72370 20538 83552 30942 -53994 -64767 -659 64264 52408 -30461
224 -30461 -76268 -20353 60763 62536 -13598 -74558 -40423 51072 74295 -3990 -72872 -43953
236 -43953 35790 69030 17475 -59209 -60161 21269 72098 25964 -46764 -59163 -2700 60893
248 60893 51291 -31329 -74643 -14605 62164 54386 -20342 -68851 -30504 49958 63856 -7635
260 -7635 -64251 -36621 33020 61247 14213 -54727 -54039 20333 66212 24152 -44413 -56780 210
273 210 61599 44623 -36265 -68354 -6030 59031 44133 -22140 -60138 -24031 45356 56446
285 56446 -8026 -59073 -32564 31989 57224 11257 -52979 -49149 22521 62765 19768 -44901
297 -44901 -51954 5560 59505 35500 -38205 -58637 -772 52513 37595 -20320 -54246 -20791
309b0791O3624Q718o0642m6948K6783O1874K1407m6915n9281R223O7896L2477
321E7425m3793n7280j816N4488M5291k5214o5718j4754N2709M5873j2900n3429
333a9118l3014L3176O2753M074o1232m0052K9803N6602J6179m6531n2525J3506
345c6379O3293K4702m3080m9919K013M9688L9406k4938n9951j2010N0070M2588
357D5483j4564n1944k8551L5806N7686j703n9458l2656L2361N0775R929m4629
369a465m5531J6068N7914J9520m0393m5276L252M7950L5188k6592n5788p934M8178
382E091L9207j6761n1376k2947L8948N0864p588n4258k5832L0552M6279P556m3306
395c571m1135J8585N3271J5442l8987m1476M938M7342L1800k9948n2646k249M7700
$$ plain form
309 -20791 42833 51551 -9091 -56039 -29256 32618 54025 7110 -52171 -42948 24948 57425
321 57425 13632 -43648 -45464 9024 54315 29101 -36617 -51371 1338 47211 34311 -19118
333 -19118 -52132 -18956 43797 47871 -13361 -53413 -23610 32992 49171 2640 -49885 -36379
345 -36379 26914 51616 8536 -41383 -39370 10318 49724 24786 -35165 -47175 2895 45483
357 45483 30919 -21025 -49576 -13770 43916 42213 -17245 -49901 -17540 33235 43164 -1465
369 -1465 -46996 -30928 26986 46506 6113 -39163 -35911 12039 47227 20635 -35153 -43087 5091
382 5091 44298 27537 -23839 -46786 -7838 43026 35438 -18820 -44652 -14100 32179 39735 -3571
395 -3571 -44706 -26121 27150 42592 3605 -37871 -32933 14409 46209 16261 -36385 -38634 9066
408I066L2998j9414m7353j8268L9006M5932j1617n0573k0874L0241M1640N703
420C6487m1824l8255K0522N1715J1066l8927l7746P561M5695K7312l1200m9227
432c6821K099M6417K8471k1917m3646j3373L7598M0709j2915m7098j8161K9693
444h944L9980L069m1927l4167K2748M8661P949l9846l4468J1352M4078K2096l2337
457H244m3928N019M3679K4301k1724m0947j0424L7074L6536j4265m4134j6134
469c6703K9608L8590J6m2165l0301K6036M5130L096l8452l0370J3445M2061J7715
482C7706l2746l9021O916M0535K1679k1422l9332q599L7922L3759j6767m3006
494b2376j2504L0811L6409l755m2508k4994K8368M0643q86l5719k5979J2845L9385
$$ plain form
408 9066 42064 22650 -24703 -42971 -3965 41967 30350 -20223 -41097 -10856 30784 36487
420 36487 -5337 -43592 -23070 28645 39711 784 -36962 -29401 16294 43606 12406 -36821
432 -36821 -34722 11695 40166 18249 -25397 -38770 -1172 39537 26622 -20476 -38637 -8944
444 -8944 31036 34105 -7822 -41989 -19241 29420 37369 -2477 -36945 -25593 18485 40581 8244
457 8244 -35684 -30665 13014 37315 15591 -25356 -35780 1294 37830 23565 -20569 -36703
469 -36703 -7095 31495 31511 -10654 -40955 -14919 30211 33307 -5145 -35515 -22070 19991 37706
482 37706 4960 -34061 -27145 13390 35069 13647 -25685 -34284 3638 37397 20630 -22376
494 -22376 -34880 -4069 32340 28585 -13923 -38917 -10549 30094 29208 -6511 -32490 -19645 19740
507A9740J5892l2191l6569Q355L9131J9997k2221l9132n498L8672L0836j9625
519A7387m1292q619L1913L2710p600m0472j9682K8244L5959k292l3169k4362J3023
532a8252L8528J4454l3833l4431J1038L8848J6605k3912l6576k442L9045K6570
544C5642k1985l7610n258L0300K8855q214l7060j7598K5990L4100j386l3125k4731
557c2080J5417L9400J0271l5048l1244J4160L6686J2983k4490l3370J212L6378
569A0275K2702k1875l4096l640K7744K7398p348l6588j7503K7679L3319l642l3901
582i476k2026J7942L7538N796l5043k5549J4831L2700J1442k3193l1210K062L4730
595A0544K0626k0848l2415m091K7886K7112q865l7362j4542K9469L1016p390l2994
$$ plain form
507 19740 35632 3441 -33128 -24773 14358 34355 12134 -26998 -32496 6176 37012 17387
519 17387 -23905 -32524 -611 32099 24499 -15973 -35655 -7411 28548 26256 -6913 -31275 -18252
532 -18252 20276 34730 897 -33534 -22496 16352 32957 9045 -27531 -29973 9072 35642
544 35642 13657 -23953 -29211 1089 29944 21730 -15330 -32928 -6938 27162 25776 -7349 -32080
557 -32080 -16663 22737 33008 -2040 -33284 -19124 17562 30545 6055 -27315 -26103 10275
569 10275 32977 11102 -22994 -26634 1110 28508 21160 -15428 -32931 -5252 28067 24425 -9476
582 -9476 -31502 -13560 23978 29774 -5269 -30818 -15987 16713 28155 4962 -26248 -24186 10544
595 10544 31170 10322 -22093 -26184 1702 28814 19949 -17413 -31955 -2486 28530 21140 -11854
608a1854j7908J9296L3762L159l2112k2534J3972L0355J0777k2009l0838K665
620b3269L4723J9103k2331l0801k428K8956K4950j2084l6075r777K9678K6574
632B7219r213l0409j4611J8719K9933K535k9506k1883J3397L0776J0128k4358
644B727k9657N738L4836J5665k3154k9045N22K8355K1618j4322l2888n947K7751
657B199K2335q760k6956j3927J7073L0213J743l0917k0554J5176L0826P130k6384
670h03k5947R383L2483J1172k3007k5462K863K6387J8886j4701l0104m517K5436
683B069K1588p843k7329j4536J9088L0495j471l2147j6875J8334K7607L118k4296
696b198k2422R818K9660Q694k1513k2399K259K4635J8075j3903k9230m277K5391
$$ plain form
608 -11854 -29762 -10466 23296 26455 -5657 -28191 -14219 16136 26913 4904 -25934 -23269
620 -23269 11454 30557 8226 -22575 -25003 3953 28903 16819 -19256 -29033 645 27219
632 27219 18006 -12403 -27014 -8295 21638 24173 -5333 -27216 -13819 16957 27085 2727
644 2727 -26930 -21192 13644 29309 6155 -22890 -22368 5987 27605 13283 -19605 -25552 2199
657 2199 24534 15774 -11182 -25109 -8036 22177 23920 -6997 -27551 -12375 18451 25581 -803
670 -803 -26750 -17367 15116 26288 3281 -22181 -19318 7069 25955 11254 -18850 -23367 2069
683 2069 23657 15814 -11515 -26051 -6963 23532 22061 -10086 -26961 -8627 18980 22098 -2198
696 -2198 -24620 -14802 14858 23552 2039 -20360 -18101 6534 24609 10706 -18524 -22801 2590
709B590K1712r302k8397j1915K1325K8020n279l0190j2855J8680K2871K500k1898
722b138k0868Q821K8289Q627k0736k2056K534K4415J7954j5245k8974k239K6897
735E281J8260j2034k5731q235K0911K3554o308k6215j0802J5612K1242L530k1028
748a963k0388R002K7878Q101k1937k1836M860K5342J4364j6402k6657O94K5332
761F390J5150j2469k2561o607J8868K1551n645k4570j1225J5163K2453K865k2748
774c385j9673J1637K7453M682k2286j8723P133K3200J1508j7006k2981K303K2417
787F279J3202j1036k1438o196J8949K0048n988k4597j0489J7146K1704r8k3715
800f229j5932J4134K4304R72k0338j5206O915K1134J0041j6299k1024K236K1755
$$ plain form
709 2590 24302 15000 -13397 -25312 -3987 24033 18754 -11436 -24291 -5611 17260 19760 -2138
722 -2138 -23006 -14185 14104 22731 1995 -20061 -17527 6888 24842 9597 -19377 -21616 5281
735 5281 23541 11507 -14224 -22459 -1548 22006 15698 -10517 -21319 -5707 15535 19065 -1963
748 -1963 -22351 -13349 14529 22630 693 -21143 -16283 9059 23423 7021 -19636 -18942 6390
761 6390 21540 9071 -13490 -20097 -1229 20322 14677 -9893 -21118 -5955 16498 19363 -3385
774 -3385 -23058 -11421 16032 20714 -1572 -20295 -13162 10038 21546 4540 -18441 -16138 6279
787 6279 19481 8445 -12993 -19189 -240 19808 13820 -10777 -21266 -4120 17584 17486 -6229
800 -6229 -22161 -8027 16277 17249 -3089 -18295 -11380 9754 19795 3496 -17528 -15292 6463
813F463J2691j1324k1303n388J9739J9764q425k4439p044J7916J9197l444k1983
826g580j1798J3673K0830K85j8029j4420O274K0724R370j6499k0783L983K1652
839G682J1188j2653k0826k789K0803J6597j0938k2011l705J6760J5925l402j9774
852g143j1073J2510K0167M67j7771j4658O963K1470P960j7909j9498O047K1478
865I010Q665j3325j8738q05J9749J3643j0811j9403l241J5133J5079k726j8978
878f748j1652J3599J9741o68j8718j2803Q759K0924N094j8929j6040P484J9334
891I377O387j2414j6878j60J8231J2622j0310j8501l061J4738J5523l978j9980
904h404r471J4704J8645k873j8850j0032R919J8659K510j6807j4294P751J7338
$$ plain form
813 6463 19154 7830 -13473 -18861 878 20642 12217 -12222 -19266 -1350 17847 14403 -7580
826 -7580 -19378 -5705 15125 15410 -2619 -17039 -10765 9959 19329 2830 -17953 -13970 7682
839 7682 18870 6217 -14609 -17398 3405 20002 9064 -12947 -16652 108 16033 12631 -7143
852 -7143 -18216 -5706 14461 14928 -2843 -17501 -10538 10932 18892 983 -18515 -12468 9010
865 9010 17675 4350 -14388 -15193 4556 18199 7388 -12015 -15256 -123 14956 12230 -6748
878 -6748 -18400 -4801 14940 14272 -4446 -17249 -8490 12434 17528 -1401 -17441 -9957 9377
891 9377 15764 3350 -13528 -13688 4543 17165 6855 -11646 -14707 31 15554 11576 -8404
904 -8404 -17875 -3171 15474 12601 -6249 -16281 -6362 12297 14807 -2000 -16294 -8543 8795
917H795O133j1939j6470M5J8535J2039j1331j8365j433J5843J4280o099k0063
930a0030o436J5933J5790n104j6462q438R487J7013J867j5825j3213P197J7094
943H873N730j2722j6416K413J8737R928j2669j6779K80J5621J2202p361j7919
956a0082m200J4829J3583m700j5890p608R311J6500J753j6784j2501Q513J7252
969I976M005j3455j5125M169J8378P354j2893j5288J669J4913J0382p593j6400
982i908l875J4492J2758m199j5754q104J0851J6337j32j7189j0376R743J5687
995A0331K565j3872j2680M768J6894N989j2473j3402J350J4177J0239p802j6730
1008a0646k452J4456J2465n526j5938o342J1523J5409k176j6258q527R592J4868
$$ plain form
917 8795 14928 2989 -13481 -13436 5099 17138 5807 -12558 -13991 1852 16132 10033 -10030
930 -10030 -16466 -533 15257 10153 -6309 -14747 -5260 11753 13620 -2205 -15418 -8221 8873
943 8873 14603 1881 -14535 -12122 6615 16543 3874 -12905 -12625 2996 15198 7837 -10082
956 -10082 -14282 547 14130 9430 -6460 -14068 -4757 11743 13496 -3288 -15789 -7276 9976
969 9976 13981 526 -14599 -10430 7948 15302 2409 -12879 -11210 3703 14085 6492 -9908
982 -9908 -13783 709 13467 9268 -6486 -14590 -3739 12598 12466 -4723 -15099 -5356 10331
995 10331 12896 -976 -13656 -8888 8006 13995 1522 -11880 -10530 3647 13886 6084 -10646
1008 -10646 -13098 1358 13823 8297 -7641 -13983 -2460 12949 10773 -5485 -14012 -4420 10448
1021A0448J523j3438j2022N467J6457M962j2212j3200J759J4768R590q976j6363
1034a1237j528J5442J0955p000j4792n067J2089J4112l537j5621p233R978J3502
1047A0063R74j2718j1626O274J5675M743j3110j2461K894J4800P999r893j4953
1060a1339M39J4564R505p470j3722l972J1452J3037l806j4947o609J0008J3196
1073A0336K45j3413j0705P232J5778K834j3061j1257M066J4459O484j0377j3720
1086a1099J487J3558Q176p256j3143l032J1685J1906m110j4776n412R945J2402
1099A0331j82j3656r504Q349J4376J586j2834j0147M846J3028N864j0255j2843
1112a1041J509J3962P012p110j2936k582J2226J1411n391j4276m521J0660J1939
$$ plain form
1021 10448 11971 -1467 -13489 -8022 8435 13397 1185 -12015 -10256 4512 14102 5126 -11237
1034 -11237 -12765 2677 13632 6632 -8160 -13227 -1138 12974 9437 -6184 -13417 -3439 10063
1047 10063 11037 -1681 -13307 -7033 8642 13385 275 -12186 -9292 5508 13507 3614 -11339
1060 -11339 -10900 3664 13169 5699 -8023 -11995 -543 12494 8688 -6259 -12868 -2860 10336
1073 10336 10581 -2832 -13537 -6305 9473 12307 -754 -12011 -7945 6514 12998 2621 -11099
1086 -11099 -9612 3946 12122 4866 -8277 -11309 376 12282 8172 -6604 -12016 -2071 10331
1099 10331 10149 -3507 -13011 -4662 9714 11300 -1534 -11681 -6835 6193 12057 1802 -11041
1112 -11041 -9532 4430 11442 4332 -8604 -11186 1040 12451 7060 -7216 -11737 -1077 10862
1125A0862j478j3804p946Q221J3641L95j2166q995M898J2948N170j0374j2358
1138a0986K640J3033O762p743j2796j550J2758J0028o109j4071k803J0185J1116
1151A0464j965j3288o987Q898J2352l0j1751q450M722J3167M305j0937j1443L313
1165g630J2919N693p863j2325o11J2402R193o916j3001j823R986R882k473j2219
1179d786o565Q866J1927n99j1803p811N581J2690L236j1058j0679M187J2491M845
1193A0522q584j0963J61J1873Q314p053j2197j352R945R020l014j1893n729R125
1207a825J1502j406j1715p197O278J2204K206j1241r509N060J1474L945q266j0353
1221h843P82J1504P117o813j1330j242R613Q810l511j1582n170R567J0679k206
$$ plain form
1125 10862 9384 -4420 -12366 -4145 9496 9891 -2275 -11270 -6372 6576 11746 1372 -10986
1138 -10986 -8346 4687 11449 3706 -9090 -10640 2118 12146 6037 -8034 -10837 -652 10464
1151 10464 8499 -4789 -11776 -2878 9474 9444 -2307 -10757 -6035 7132 11437 500 -10943 -7630
1165 -7630 5289 10982 3119 -9206 -9817 2585 11778 4862 -8139 -9962 24 9906 7433 -4786
1179 -4786 -11351 -2485 9442 8843 -2960 -10771 -5190 7500 10736 -322 -11001 -6814 5677 10522
1193 10522 1938 -9025 -8864 3009 11323 4270 -7927 -9279 666 9686 6672 -5221 -10950 -1825
1207 -1825 9677 8271 -3444 -10641 -4363 7841 10047 -1194 -10703 -5643 5831 9776 1510 -8843
1221 -8843 -8061 3443 10560 3747 -7583 -8825 788 9598 6087 -5495 -10665 -1098 9581 7375
1235G375j1279o136O707J1145J629j0899q516N204J0941L074p834r918O08J1885
1249C986O204p286j0647n83R686Q270m099j1964l338R916Q809k589j0643n260
1263i538O666J0411Q48j0062p932M791J0853K657p981r341J699J1475N505q128
1277A923j0026M92R887P021m488j1099k665R298Q513l243j0134m453O651R561
1291G238N55r898p475N365J0315K462q455q921K641J1285M375q126r376J305R445
1306B735N730m734r937k018R176P624l536r438m103O325R676L6j0901o019O335
1321c049R383J489q356q113L311J0578L405q018q087J381Q591O030n054r985j301
1336g795Q836P542l583r619l774P366Q908j292j0396n086O611Q879J9p640p230
$$ plain form
1235 7375 -3904 -10040 -3333 7812 9441 -1458 -9974 -4770 6171 9245 1411 -8507 -7899 3986
1249 3986 10190 2904 -7743 -8326 1360 9630 5531 -6433 -9771 145 8954 6365 -4278 -9538
1263 -9538 -2872 7539 8387 -1675 -9607 -4816 6037 8694 713 -8628 -6929 4546 10051 1923
1277 1923 -8103 -7611 2276 9297 4809 -6290 -8955 343 8856 5613 -4521 -8974 -2323 7238
1291 7238 7793 -2105 -9580 -4215 6100 8562 107 -8814 -6173 5112 9487 1361 -8015 -6710 2735
1306 2735 8465 3731 -6206 -8224 952 8576 5040 -4398 -8501 -2176 7500 7536 -3365 -9384 -3049
1321 -3049 6334 7823 -533 -8646 -5335 5243 8648 630 -7457 -6076 2515 8545 3491 -6494 -7795
1336 -7795 1041 8583 5000 -4619 -8393 -1027 7881 6589 -3807 -8893 -2282 6597 6616 -1024 -8254
1351h254L530R743L061p408q039J451Q658N526n134j0096n71R275O468l997r481
1366e268k613P495P912j664r945l675N890Q151J21p891o638L596R908K566p890
1381E5p498K227Q869M510n812r214r7R461N510m924p909k218O962P201j885r068
1397c830l493N653P792L66p794o628M400R166J755p838o933K435Q828L714o236
1412A357q262Q18Q769M800m741p816j571O787O958k271q777l618O383P705n01
1427F020q539n622N198Q859N41p884n484K793Q001K978n895p385P54Q247M546
1442G128m327p697j491P470O377l274q570k941O787P221j503q049m391M999Q057
1457E796O7p533m918K744P629L130o379p193J126Q215M254m881p224j027P357
$$ plain form
1351 -8254 -4724 5019 8080 672 -7367 -5916 2742 8268 3134 -6962 -7533 1742 8210 4213 -5268
1366 -5268 -7881 -386 7526 5862 -4083 -7758 -1868 6283 6404 -1487 -8125 -4529 5379 7945 55
1381 55 -7443 -5216 3653 8163 2351 -6863 -6960 2501 8011 3087 -4822 -7040 -78 7123 5238 -3830
1397 -3830 -7323 -1670 6122 6488 -1306 -7934 -3534 5632 7387 -451 -7384 -4949 3879 7593 1357
1412 1357 -6905 -6087 2682 7482 2741 -5075 -6646 141 7099 4828 -3949 -7567 -1184 6521 6020
1427 6020 -2519 -8141 -2943 5916 6457 -1427 -6911 -4118 3883 6861 966 -6419 -5665 2582 7128
1442 7128 2801 -4896 -6387 1083 7460 4186 -4384 -7325 -538 6683 5180 -2869 -7260 -2261 5796
1457 5796 5863 -1670 -6588 -3844 3785 6915 536 -6657 -5531 2684 6938 2057 -5167 -6194 1163
1472A163O230l896q531j219O481O178j978p110m228M991P592k25o752n099L065
1487c338P657K359o608o767J997Q212L540n895p000R4P424N396m212p735p88O264
1503F00M983r15p685l919N204P572k52p636m624L550P826J591o664o298K854P804
1519C991K292n268o568O43O897M783m791o622q67N689N971k176p353l241N341
1534a279P618j485p555l801M189O972J094o796n553L616P045J423m558o401P37
1549d734O909M217m200p157l71O120N209k501p212k922O444O292k089p169k691
1564e855M071O460N66o287m984K960O869J763n392n464P33P100L598m639o511
1579e012k89O704M438k784o869j866O022N429k187o148k950L926O128N94o423
$$ plain form
1472 1163 7393 3497 -5034 -6253 228 6406 4428 -2682 -6910 -1919 5673 5448 -1304 -6403 -3338
1487 -3338 4319 6678 70 -6697 -4700 3512 7052 1157 -5843 -5749 1675 7071 2859 -4876 -5664 600
1503 600 5583 4668 -3017 -6936 -1732 5840 5588 -2048 -6672 -3122 4704 6295 -369 -6667 -3813 3991
1519 3991 6283 1015 -5553 -4910 1987 6770 1979 -4643 -5510 179 6150 3974 -3379 -6620 -1279
1534 -1279 6339 4854 -2701 -6502 -2313 4659 5753 -1043 -6596 -2980 4065 5488 930 -5471 -4734
1549 -4734 2175 6392 2192 -4965 -5336 784 5993 3492 -3720 -6642 -198 6094 4005 -3164 -5855
1564 -5855 -1784 4676 5242 -1045 -6029 -3069 3800 5563 171 -5293 -4560 2540 6138 1499 -5012
1579 -5012 -5301 1403 5841 3057 -3812 -5678 344 5773 3586 -2562 -5512 -1586 4542 5136 -1287
1594a287m952L494O799J440n398n659J671O933L114n190o003Q38O068L924l360
1609B432o314j534N630N407k229n875l138L989O411p2o413m272L766O272J283
1624E343n915m838K095O484K491n197n110O33N704L365k617o409j223N756M863
1639E425k168o254k330M274O025n19o626l770M154O060N65n738m427K346O135
1654C152K329n215n149R75N443M134l683o194p58O021M514k805o140j709M921
1669a64N282p64o733k768L543N978r5n270m507K544O559J465m933n168J277N997
1685B243L292l887o107j51O079L991k920n988j251M599M977j441n832k742M248
1700h90M986J72n341m164K755N974J158m803m749J682N794K460l702n700K70N733
$$ plain form
1594 -1287 -6239 -2745 4054 5494 96 -5563 -3892 3041 6155 965 -5038 -4200 1868 5792 2432
1609 2432 -3882 -5416 214 5621 3392 -2483 -5621 -1632 4779 4707 -1706 -5978 -2212 4060 5343
1624 5343 -572 -5410 -3315 3169 5660 463 -4647 -4014 1690 5055 2438 -3971 -5194 562 5425
1639 5425 3257 -2997 -5327 -1053 4972 4453 -2173 -5943 -1789 4271 4836 -902 -5329 -2983 3152
1654 3152 5481 266 -4883 -3908 1535 5669 1986 -4208 -4966 1055 5569 2764 -3376 -5085 -164
1669 -164 5118 4354 -2379 -5147 -1604 4374 4279 -991 -5498 -2954 3605 5070 137 -5031 -3754 2243
1685 2243 5535 1648 -4459 -4610 1469 5460 2540 -3448 -4699 -100 4877 3436 -2396 -5138 -890
1700 -890 4096 4268 -1073 -5237 -2482 3492 4650 -153 -4902 -3220 2574 5034 1332 -4368 -4098 1635
1716A635L159k629n613j027M591M693j533n834k476M272M904R1n694l633K876
1731b218O028J068n713m042K012N521K048m055n111N83N600L112k990m998r49
1746d104M896M187k171n957j852M366M850p34n179l140L064N604L69n102l619
1761d522K094M926K101l816n172O31N536K713k877n177q20N132M067k302n694
1776c180j536M710M296j042n537k473L348N396J2n232l126K250M987J545m107
1791C11m721J172N583K423l880m861L81M862L246k381n364q26M426L730j234m909
1807b042k564L435M721O6m929l182K641M752J113m025m604J457N538K146l332
1822A191m857K10M775L300k850n109n59L990L733j008m616k527L466M738k85m962
$$ plain form
1716 1635 4794 2165 -3448 -4475 116 4809 3276 -2558 -5034 -762 4142 4233 -1461 -5094 -2218
1731 -2218 3810 4878 -835 -4877 -2865 2656 4704 649 -4462 -3879 1721 4833 1843 -3155 -4104
1746 -4104 792 4979 2808 -3149 -5001 -635 4215 3481 -1698 -4838 -1774 3830 4199 -903 -4522
1761 -4522 -2428 2498 4599 783 -4389 -3758 1778 4491 1614 -3563 -4383 749 4816 2514 -3180
1776 -3180 -4716 -6 4290 3248 -2289 -4762 -1414 3982 3994 -1238 -4364 -2114 2873 4418 311
1791 311 -4410 -3238 2345 4768 888 -3973 -3592 1270 4516 2135 -3229 -4055 371 4101 2867 -2042
1807 -2042 -4606 -1171 3550 3616 -1313 -4495 -1854 2898 4011 -14 -4618 -3161 2377 4523 1191
1822 1191 -3666 -3456 1319 4619 1769 -3340 -3899 91 3824 2816 -1800 -4327 -861 3877 3592 -1370
1838a370k948K709M600J027m341m307K258M975J820l836m159j96N059L150k816
$$ plain form
1838 -1370 -4318 -1609 2991 4018 -323 -4630 -2372 2603 4423 587 -3572 -3768 1291 4441 1625
$$ [...]
8191A63
##END NTUPLES=NMR FID
##END=
