##TITLE=1H_DE-61_NaOH
 D2O
 8 sc, 
 11.7.2024
##JCAMPDX= 6.0         $$ Bruker NMR JCAMP-DX V2.0
##DATA TYPE= NMR FID
##DATA CLASS= NTUPLES
##ORIGIN= UXNMR, Bruker Analytische Messtechnik GmbH
##OWNER= root
$$ XWIN-NMR		Version 3.5
$$ Thu Jul 11 13:53:21 2024 Russian Standard Time (UT+4h)  she@DPX200
##.OBSERVE FREQUENCY= 200.1314
##.OBSERVE NUCLEUS= ^1H
##.DELAY= (6, 6)
##.ACQUISITION MODE= SIMULTANEOUS
##.ACQUISITION SCHEME= undefined
##.AVERAGES= 8
##.DIGITISER RES= 18
##SPECTROMETER/DATA SYSTEM= spect
##.PULSE SEQUENCE= zg30
##.SOLVENT NAME= CDCl3
##.SHIFT REFERENCE= (INTERNAL, CDCl3, 0, 15.7039)
##AUDIT TRAIL= $$ (NUMBER, WHEN, WHO, WHERE, WHAT)
$$ ##TITLE= Audit trail, XWIN-NMR		Version 3.5
$$ ##JCAMPDX= 5.01
$$ ##ORIGIN= Bruker BioSpin GmbH
$$ ##OWNER= she
$$ F:/spectra/data/she/nmr/H-F/1/audita.txt
$$ ##AUDIT TRAIL=  $$ (NUMBER, WHEN, WHO, WHERE, WHAT)
(   1,<2024-07-11 13:52:16.12 +0400>,<she>,<DPX200>,
      <created by zg, POWCHK disabled, PULCHK disabled
       configuration hash MD5:
       00 E9 B6 7A A2 85 ED C7 34 08 36 98 17 FE 4E 26
       data hash MD5: 16K
       79 B2 9D 77 5C 57 7A D1 ED 21 D0 3B 50 88 A5 90>)
$$ ##END=
$$ 
$$ hash MD5
$$ AA 81 67 57 18 69 44 AD 49 3F 22 27 E9 18 E2 5B
##$RELAX= 
##$RELAX= 
##$RELAX= 
##$RELAX= 
##$RELAX= 
##$RELAX= 
$$ Bruker specific parameters
$$ --------------------------
##$DU= <F:/spectra>
##$EXPNO= 1
##$NAME= <H-F>
##$PROCNO= 1
##$TYPE= <nmr>
##$USER= <she>
##$AMP= (0..31)
100 100 100 100 100 100 100 100 100 100 100 100 100 100 100 100 100 100 
100 100 100 100 100 100 100 100 100 100 100 100 100 100 
##$AQSEQ= 0
##$AQ_mod= 1
##$AUNM= <au_zg>
##$AUTOPOS= <>
##$BF1= 200.13
##$BF2= 200.13
##$BF3= 200.13
##$BF4= 200.13
##$BF5= 200.13
##$BF6= 200.13
##$BF7= 200.13
##$BF8= 200.13
##$BYTORDA= 1
##$CFDGTYP= 0
##$CFRGTYP= 5
##$CHEMSTR= <none>
##$CNST= (0..31)
1 1 145 1 1 1 1 1 1 1 1 1 1 1 1 1 1 1 1 1 1 1 1 1 1 1 1 1 1 1 1 1 
##$CPDPRG= <>
##$CPDPRG1= <>
##$CPDPRG2= <>
##$CPDPRG3= <>
##$CPDPRG4= <mlev>
##$CPDPRG5= <mlev>
##$CPDPRG6= <mlev>
##$CPDPRG7= <mlev>
##$CPDPRG8= <mlev>
##$CPDPRGB= <>
##$CPDPRGT= <>
##$D= (0..31)
0 1.2 0 0 0 0 0 0 0 0.06 0 0.03 0 0 0 0 0.0002 0 0 0 0 0 0 0 0 0 0 0 0 
0 0 0 
##$DATE= 1720691535
##$DBL= (0..7)
120 120 120 120 120 120 120 120 
##$DBP= (0..7)
150 150 150 150 150 150 150 150 
##$DBP07= 0
##$DBPNAM0= <>
##$DBPNAM1= <>
##$DBPNAM2= <>
##$DBPNAM3= <>
##$DBPNAM4= <>
##$DBPNAM5= <>
##$DBPNAM6= <>
##$DBPNAM7= <>
##$DBPOAL= (0..7)
0.5 0.5 0.5 0.5 0.5 0.5 0.5 0.5 
##$DBPOFFS= (0..7)
0 0 0 0 0 0 0 0 
##$DE= 6
##$DECBNUC= <off>
##$DECIM= 24
##$DECNUC= <off>
##$DECSTAT= 4
##$DIGMOD= 1
##$DIGTYP= 9
##$DL= (0..7)
0 120 120 120 120 120 120 120 
##$DP= (0..7)
150 150 150 150 150 150 150 150 
##$DP07= 0
##$DPNAME0= <>
##$DPNAME1= <>
##$DPNAME2= <>
##$DPNAME3= <>
##$DPNAME4= <>
##$DPNAME5= <>
##$DPNAME6= <>
##$DPNAME7= <>
##$DPOAL= (0..7)
0.5 0.5 0.5 0.5 0.5 0.5 0.5 0.5 
##$DPOFFS= (0..7)
0 0 0 0 0 0 0 0 
##$DQDMODE= 0
##$DR= 18
##$DS= 0
##$DSLIST= <SSSSSSSSSSSSSSS>
$$ [...]
##$SUBNAM2= <"">
##$SUBNAM3= <"">
##$SUBNAM4= <"">
##$SUBNAM5= <"">
##$SUBNAM6= <"">
##$SUBNAM7= <"">
##$SUBNAM8= <"">
##$SUBNAM9= <"">
##$SW= 24.0689651099613
##$SWIBOX= (0..15)
0 0 2 0 0 0 0 0 0 0 0 0 0 0 0 0 
##$SW_h= 4816.95568400771
##$TD= 16384
##$TD0= 1
##$TE= 0
##$TE2= 300
##$TE3= 300
##$TEG= 300
##$TL= (0..7)
0 120 120 120 120 120 120 120 
##$TP= (0..7)
150 150 150 150 150 150 150 150 
##$TP07= 0
##$TPNAME0= <>
##$TPNAME1= <>
##$TPNAME2= <>
##$TPNAME3= <>
##$TPNAME4= <>
##$TPNAME5= <>
##$TPNAME6= <>
##$TPNAME7= <>
##$TPOAL= (0..7)
0.5 0.5 0.5 0.5 0.5 0.5 0.5 0.5 
##$TPOFFS= (0..7)
0 0 0 0 0 0 0 0 
##$TUNHIN= 0
##$TUNHOUT= 0
##$TUNXOUT= 0
##$USERA1= <user>
##$USERA2= <user>
##$USERA3= <user>
##$USERA4= <user>
##$USERA5= <user>
##$V9= 5
##$VALIST= <valist>
##$VCLIST= <CCCCCCCCCCCCCCC>
##$VD= 0
##$VDLIST= <DDDDDDDDDDDDDDD>
##$VPLIST= <PPPPPPPPPPPPPPP>
##$VTLIST= <TTTTTTTTTTTTTTT>
##$WBST= 1024
##$WBSW= 4
##$XGAIN= (0..3)
0 0 0 0 
##$XL= 0
##$YL= 0
##$YMAX_a= 128091
##$YMIN_a= -103536
##$ZGOPTNS= <>
##$ZL1= 120
##$ZL2= 120
##$ZL3= 120
##$ZL4= 120
##$ABSF1= 10
##$ABSF2= 0
##$ABSG= 5
##$ABSL= 3
##$ALPHA= 0
##$AQORDER= 0
##$ASSFAC= 0
##$ASSFACI= 0
##$ASSFACX= 0
##$ASSWID= 0
##$AUNMP= <proc_1d>
##$AZFE= 0.1
##$AZFW= 0.1
##$BCFW= 1
##$BC_mod= 2
##$BYTORDP= 1
##$COROFFS= 0
##$CY= 11.3945322036743
##$DATMOD= 1
##$DC= 2
##$DFILT= <>
##$DTYPP= 0
##$F1P= 15.6554695791079
##$F2P= 12.8336369535428
##$FCOR= 0.5
##$FTSIZE= 0
##$FT_mod= 4
##$GAMMA= 1
##$GB= 0.15
##$INTBC= 1
##$INTSCL= 1
##$ISEN= 128
##$LB= 0.24
##$LEV0= 0
##$LPBIN= 0
##$MAXI= 10000
##$MC2= 0
##$MEAN= 0
##$ME_mod= 0
##$MI= 1.114404
##$NCOEF= 0
##$NC_proc= 0
##$NLEV= 6
##$NOISF1= 3.799351
##$NOISF2= 2.8
##$NSP= 1
##$NTH_PI= 0
##$NZP= 0
##$OFFSET= 15.70392
##$PC= 1
##$PHC0= -25675.21
##$PHC1= 11.58748
##$PH_mod= 1
##$PKNL= yes
##$PPARMOD= 0
##$PSCAL= 0
##$PSIGN= 0
##$REVERSE= no
##$SF= 200.130013532006
##$SI= 16384
##$SIGF1= 3
##$SIGF2= 2
##$SINO= 400
##$SIOLD= 16384
##$SREGLST= <1H.CDCl3>
##$SSB= 0
##$STSI= 0
##$STSR= 0
##$SW_p= 3612.71676300578
##$SYMM= 0
##$S_DEV= 0
##$TDeff= 0
##$TDoff= 0
##$TI= <>
##$TILT= no
##$TM1= 0
##$TM2= 0
##$TOPLEV= 0
##$USERP1= <user>
##$USERP2= <user>
##$USERP3= <user>
##$USERP4= <user>
##$USERP5= <user>
##$WDW= 1
##$XDIM= 8192
##$YMAX_p= 0
##$YMIN_p= 0
$$ End of Bruker specific parameters
$$ ---------------------------------
##NTUPLES= NMR FID
##VAR_NAME=  TIME,          FID/REAL,        FID/IMAG
##SYMBOL=    X,             R,               I
##VAR_TYPE=  INDEPENDENT,   DEPENDENT,       DEPENDENT
##VAR_FORM=  AFFN,          ASDF,            ASDF
##VAR_DIM=   8192,          8192,            8192
##UNITS=     SECONDS,       ARBITRARY UNITS, ARBITRARY UNITS
##FACTOR=    0.0002076,     1,               1
##FIRST=     0,             0,               0
##LAST=      1.7004516,     0,               0
##MIN=       0,             -103536,         0
##MAX=       1.7004516,     128091,          0
$$ Real data points
##PAGE= N=1
##DATA TABLE= (X++(R..R)), XYDATA
0 0 0 0 0 0 0 0 0 0 0 0 0 0 5 -7 7 -7 7 -7 8 -14 14 -14 21 -21 26 -28 33 -34 40 -46 52 -57 66 -73 81 -89
36 -89 100 -109 122 -136 149 -164 182 -203 226 -250 279 -312 348 -393 444 -509 590 -696 838 -1038
56 -1038 1344 -1870 2943 -5996 33778 128091 55974 -41730 -59050 -10630 56537 72397 -19408
69 -19408 -103536 -66096 28283 64903 33592 -32383 -61520 6822 92651 63525 -37679 -75876
81 -75876 -32604 24174 45142 388 -63642 -48245 35073 74458 37760 -21521 -48869 -13504
93 -13504 47621 41492 -36001 -74984 -29010 33697 52064 17450 -34968 -36032 26475 64781 24570
106 24570 -41035 -60724 -21268 35173 40990 -16352 -56689 -20131 45631 62439 19041 -37055
118 -37055 -48091 1447 47968 23551 -39937 -60748 -17344 41682 55890 7654 -43493 -28923
130 -28923 29043 52043 14134 -40656 -55959 -13544 39168 37205 -14209 -44388 -14559 37606
142 37606 52123 11544 -39094 -41417 4889 37027 15541 -29450 -43671 -8305 38889 42973
154 42973 -89 -34974 -19384 22692 36666 4361 -38718 -40672 1378 35799 23335 -16038
166 -16038 -31608 -4042 34840 37197 -2737 -38358 -28329 11780 31463 7730 -30333 -32887
178 -32887 5157 39147 29594 -10046 -32059 -12405 23909 29803 -4398 -37462 -29633 10223 35042
191 35042 17845 -18813 -28771 1109 33968 27177 -10627 -35995 -21066 15267 29671 4119
203 4119 -28260 -25043 9807 35229 22284 -13468 -30749 -8893 23004 23285 -7871 -31632 -20404
216 -20404 13175 31388 12011 -19433 -22969 5094 27605 18011 -13663 -30768 -13223 18148
228 18148 23560 -1973 -24034 -15713 12851 29328 13344 -17850 -25597 -859 21827 15215 -11298
241 -11298 -26573 -11787 18019 26905 3472 -20515 -16004 8665 23847 10812 -16926 -26902 -4803
254 -4803 20497 18195 -5978 -21289 -10139 15207 25537 5573 -20421 -20100 3451 19980 11106
267 11106 -12585 -23474 -5353 20183 21709 -1389 -19558 -12744 9680 21068 5936 -18500
279 -18500 -21678 346 19444 14420 -6856 -18990 -6861 15964 20491 208 -19278 -15281 5162
292 5162 17741 7981 -13453 -18738 -83 19042 15575 -4335 -17871 -8864 11121 17582 767
305 767 -18296 -15089 4608 18053 9875 -9598 -16899 -1975 16601 14683 -4571 -18297 -10662
318 -10662 8581 16719 3555 -14734 -14365 3966 17757 11447 -7383 -16782 -5041 12904 13998
331 13998 -3132 -17072 -11727 7380 17429 6482 -11356 -14292 1182 15720 11200 -6948 -17252
344 -17252 -7477 10276 14719 153 -14147 -11011 5695 16622 8199 -9961 -15111 -2062 12319
357 12319 10904 -4463 -15190 -7623 9216 15356 2750 -10951 -10520 3424 13787 8228 -9867
370 -9867 -14238 -2545 10722 11550 -2520 -12686 -7702 8245 14617 3467 -11425 -11802 1509 12434
384 12434 7789 -7186 -14114 -3366 11145 12496 -700 -12174 -8647 6004 13618 4149 -11004
397 -11004 -12377 127 12036 9322 -4480 -12698 -4530 9939 12225 410 -11395 -9741 3218
410 3218 12135 5542 -8472 -11871 -522 11101 9723 -2201 -11452 -6003 7256 11309 979 -10390
424 -10390 -9623 1874 11229 7135 -6248 -10974 -1909 9573 9434 -1669 -10649 -7372 5069 10373
438 10373 2517 -9072 -8921 1543 10575 7126 -4280 -10951 -2955 7576 9778 -2083 -9329 -8389
452 -8389 5280 9547 5307 -8534 -7944 -538 10725 6757 -3910 -10444 -5599 7994 8271 1826
466 1826 -9850 -6850 3263 9844 6049 -7609 -8480 -1651 7622 8434 -3733 -8909 -5228 5016
480 5016 10668 1240 -7183 -6612 653 9900 5617 -6159 -8209 -2771 6218 8465 -1557 -8819 -4298
495 -4298 3793 8407 3705 -7155 -8287 1552 7600 4624 -3108 -8270 -3544 6873 8519 -1063 -7366
510 -7366 -4827 3031 7528 3607 -5873 -8723 -420 8168 5755 -3860 -7619 -1999 5342 6744 1341
525 1341 -6428 -7123 1447 8626 4330 -5796 -8156 -221 7788 6292 -2484 -7617 -3315 4739 6593
540 6593 685 -5687 -5719 679 6448 4556 -2769 -6719 -1953 4940 6487 272 -7075 -5593 2652 6999
556 6999 2524 -4831 -6271 -342 6506 5735 -2273 -6668 -2729 3994 5727 227 -5594 -4985 2239 6157
572 6157 2243 -3751 -5243 214 5404 4144 -3097 -6650 -2042 4977 6031 -47 -5955 -5449 1798
587 1798 7476 4003 -3537 -6280 -1423 4370 4503 -1297 -5739 -2525 4394 6001 592 -5537 -5564 561
603 561 6451 4459 -2949 -5616 -1562 4172 4375 -1138 -5892 -3817 3649 6849 2317 -3863 -4804 -398
619 -398 4593 3545 -3091 -6231 -1912 4097 5432 886 -4119 -3377 2466 5555 1854 -4647 -5615 -891
635 -891 4278 3749 -1662 -5100 -1972 4227 5484 1189 -4004 -3872 1212 5326 2428 -3564 -5303 -1262
651 -1262 3662 3693 -1383 -5396 -2887 2659 4567 857 -3702 -3702 1364 5625 3691 -1956 -4069 -496
667 -496 4390 4605 -87 -4574 -2889 2201 4589 1155 -3564 -4465 -289 4286 2947 -2277 -5068 -2184
683 -2184 2568 3520 -591 -5087 -4148 1098 3873 1499 -3613 -4482 -821 3414 2807 -1908 -4939 -2675
699 -2675 2240 3591 107 -4075 -4016 690 3833 1848 -2964 -4340 -1431 2922 2798 -1279 -4756 -2727
715 -2727 1710 3621 517 -3281 -3951 476 3779 2182 -2409 -3936 -1391 2921 3676 -99 -3450 -1964
731 -1964 2421 4433 1474 -2358 -2973 514 3964 2952 -1615 -3530 -1365 2482 3399 225 -3721 -3377
747 -3377 1030 3124 1074 -2849 -3463 -877 3115 2621 -1166 -3498 -1341 2523 3703 953 -2332 -2581
763 -2581 908 3624 1862 -2186 -3152 -792 2142 2796 -767 -3730 -2098 1544 3278 810 -2338 -2332
779 -2332 519 3584 2232 -1399 -2762 -1046 2147 2373 -572 -3417 -2508 1326 2910 808 -1870 -2311
795 -2311 431 3219 2778 -1056 -3012 -978 1697 2317 -367 -2947 -2261 981 2880 1710 -1786 -2096
811 -2096 -363 2790 2131 -932 -3054 -1978 1545 2519 387 -2172 -1911 1082 2936 1461 -1427 -2758
827 -2758 -828 1886 1794 -607 -2744 -1637 1299 2691 913 -1658 -2248 170 2509 1172 -1677 -2755
843 -2755 -864 1934 2397 284 -2009 -1567 1175 1880 642 -1846 -2347 169 2343 2105 -490 -2302
859 -2302 -824 1518 2063 -187 -2300 -1822 757 2478 1228 -1138 -2100 -336 1826 1512 -1074 -2376
875 -2376 -801 1826 2345 738 -1763 -2067 176 1859 988 -1339 -1602 -230 1944 1874 -502 -2082 -1437
892 -1437 926 1935 567 -1549 -1649 344 2064 1197 -1300 -1811 -589 1693 2113 246 -1906 -1588
908 -1588 646 1744 374 -1484 -1584 353 2196 1231 -883 -2302 -978 1195 1844 123 -1512 -1027
924 -1027 589 1584 640 -1635 -1847 -324 1728 1585 -593 -1942 -917 606 1678 260 -1201 -1157 581
941 581 1776 901 -1141 -1869 -131 1867 1591 -164 -1736 -1335 1062 1825 722 -1206 -1237 431 1439
958 1439 651 -1144 -1682 -486 1221 1647 -111 -1764 -979 676 1825 574 -1090 -1506 31 1402
974 1402 882 -977 -1472 -244 1460 1422 227 -1651 -1224 500 1593 652 -793 -1540 -184 1364 1082
991 1082 -402 -1395 -426 1327 1375 265 -1454 -1339 694 1537 964 -1000 -1605 -350 1198 1502 -246
1008 -246 -1228 -845 561 1286 86 -1130 -986 471 1439 672 -824 -1460 -164 1338 1413 -81 -1588
1025 -1588 -1138 815 1323 463 -700 -1360 299 1096 845 -296 -955 -191 1207 1194 -304 -1374 -835 565
1043 565 1279 536 -948 -1301 -180 1404 1088 -396 -1208 -527 612 1283 365 -811 -1058 431 905 395
1061 395 -631 -921 -238 992 728 -489 -1254 -443 945 1289 169 -970 -845 209 1446 752 -243
1078 -243 -1044 -344 792 1038 -113 -1045 -570 646 984 144 -670 -745 291 1085 634 -643 -1009 5
1096 5 1181 921 -415 -1271 -720 647 1280 206 -1014 -1159 -88 853 570 -26 -898 -465 636 980
1114 980 179 -571 -618 440 623 273 -723 -1065 -36 749 572 -529 -796 -421 689 1207 49 -764 -994
1133 -994 198 1385 665 -556 -1113 -311 652 1195 -138 -1063 -712 392 792 405 -755 -860 131 874
1151 874 616 -428 -734 -310 793 505 -30 -664 -381 314 953 286 -717 -794 408 972 295 -458 -1146
1170 -1146 -579 630 1076 129 -967 -665 341 930 419 -422 -792 -75 693 611 -211 -766 -685 343 791
1189 791 82 -768 -679 222 561 491 -457 -565 -366 562 689 -129 -495 -401 697 715 -77 -764 -737 288 700
1210 700 319 -483 -703 -110 719 721 228 -850 -474 366 1073 253 -368 -886 -118 666 577 -295 -703 -197 476
1231 476 701 -62 -485 -610 257 667 221 -319 -735 -105 474 561 -191 -556 -397 361 557 175 -524 -528 161
1252 161 624 371 -477 -450 -137 606 462 -354 -683 -220 413 618 -56 -805 -751 128 654 264 -453 -754 50
1273 50 673 648 -219 -811 -367 337 765 185 -337 -697 149 627 299 -361 -552 -340 336 546 16 -460 -439
1294 -439 299 696 208 -217 -466 93 283 266 -129 -522 -173 394 289 208 -437 -265 58 298 200 -411 -597
1315 -597 -55 628 430 -84 -250 -278 161 368 -160 -444 -310 378 575 120 -196 -432 -103 866 309 24
1335 24 -549 -311 168 535 212 -291 -297 -25 468 211 -369 -583 -84 549 446 -124 -591 -217 333 391 288
1356 288 -413 -383 43 597 375 4 -177 -124 328 489 101 -302 -455 2 594 219 -233 -502 175 437 370
1377 370 -188 -294 -419 235 496 0 -522 -181 269 203 311 -271 -347 -143 247 57 -226 -440 -180 174 265
1398 265 17 -364 -467 172 331 340 -53 -666 -241 511 379 -16 -426 -420 283 488 95 -466 -39 227 389
1419 389 143 -247 -146 -20 572 336 -138 -541 -219 382 378 181 -395 -480 46 376 273 -295 -292 -215 274 320
1441 320 141 -541 -57 282 521 90 -319 -616 93 294 465 -276 -390 -170 377 562 -73 -438 -280 29
1461 29 293 332 -121 -634 -1 167 329 -40 -309 -153 219 159 23 -312 -301 189 307 208 -262 -448 -289 186
1483 186 189 40 -335 -465 23 404 -78 -223 -293 307 495 79 -232 -257 36 347 359 108 -438 -137 -234 203
1505 203 94 -160 -429 122 280 222 98 -322 22 271 369 142 -150 -151 273 295 54 -237 -71 47 466 239
1527 239 -112 -279 -252 315 314 -60 -213 -52 306 118 160 -183 -153 113 363 155 -136 -383 -23 45 275 -40
1549 -40 -316 -319 231 333 -23 -289 -545 -42 227 -167 227 -419 -49 203 103 -45 -283 -249 149 375 104
1570 104 33 -277 -217 236 171 -14 -308 -220 208 351 -9 -16 -183 -53 313 -83 -56 -131 -242 58 165 -73 -103
1593 -103 -262 14 115 3 -268 -98 -36 142 204 -101 -237 128 212 309 154 -389 -275 117 36 3 -66 -470
1615 -470 -21 333 56 83 -352 68 216 -6 95 -300 -330 153 202 379 -30 -224 -6 109 43 -293 -70
1636 -70 96 147 -67 38 65 -211 14 313 11 -267 -243 -163 108 212 514 -106 -373 307 147 62 -266 -186
1658 -186 135 411 164 114 -157 -134 -95 99 6 -105 -164 -34 398 103 -325 -33 -48 -89 -131 -21 -82 -78 297 55
1682 55 176 -385 -51 -94 6 65 74 47 100 93 -104 -182 -14 -246 155 255 74 -152 -219 135 208 115 -157 -17
1706 -17 116 136 134 -212 -153 -199 56 310 -41 136 -42 -96 316 237 -137 -129 313 397 198 216 -1 15 399 368 -81
1731 -81 -108 -76 -104 47 0 -161 -133 3 -116 10 4 -225 -196 256 138 126 -40 64 -135 425 260 -11 -264
1754 -264 -204 102 128 204 -389 -75 -218 129 -90 104 -376 -49 125 10 -40 -152 -208 246 -93 -20 -86 -207
1776 -207 28 321 -133 110 -173 102 247 32 108 -281 -200 232 17 -39 78 -88 23 141 -66 145 -149
1797 -149 -122 -14 160 52 -43 -185 194 219 -46 -69 15 169 251 114 -176 -115 -229 121 164 -126 -74 -361 47
1820 47 -20 -98 431 -2 -241 190 -113 44 -118 -123 457 -83 -29 59 -246 257 6 -186 -81 -84 -88 36 217 -90
1844 -90 -3 50 163 70 -52 -120 -74 131 51 270 47 -35 -53 169 131 -50 -235 15 -9 122 7 -272 10 -188
1868 -188 47 38 116 31 207 75 100 -94 1 -28 -55 115 195 -175 -243 -146 -20 -129 193 66 -165 82 -44 30
1892 30 -162 -207 86 248 -116 -18 -232 -15 -76 214 -166 -214 -58 61 127 63 -12 10 -368 364 -228 -337 3
1915 3 112 333 -119 -67 94 41 185 194 163 57 -28 -172 228 152 -269 -159 -90 -165 27 -16 -54 -12 85 348 -167
1940 -167 -27 -16 -5 62 46 -28 -124 -124 160 77 -109 -70 71 -80 140 195 151 12 284 76 149 -254 -181 -130 130
1965 130 392 23 -54 -20 -24 67 113 150 -146 3 157 177 124 -39 -7 222 -4 115 62 -88 76 21 -100 -278
1989 -278 -307 264 175 457 -18 -14 -44 33 289 59 38 -70 122 -38 138 13 -236 -278 -39 92 -34 -66 -42
2012 -42 78 451 61 -106 -85 -131 91 1 -41 -44 39 163 190 -8 50 -345 103 -126 -19 62 -206 205 -6 70
2036 70 -40 -109 -39 104 14 -71 -67 -249 40 13 232 -85 -118 -56 -12 194 -43 -9 262 -216 22 90 -88 -96 -133
2061 -133 83 -5 -217 -59 -49 90 107 226 5 12 7 71 161 -225 -42 220 -72 54 111 -193 -97 -345 197 46
2085 46 1 -148 -159 104 -23 -478 64 11 151 200 35 -89 205 233 -133 277 -403 -24 -18 44 -44 -2 -269 -133
2109 -133 200 60 -39 -127 68 -84 39 100 99 -94 237 -112 146 -67 -326 -165 32 -155 77 -116 -28 75
2131 75 28 184 30 -138 6 20 209 -22 147 193 152 113 103 -150 205 377 -20 -78 -229 -111 -227 -58 211
2154 211 -54 -238 7 94 163 -46 -214 -295 160 241 7 -186 -80 121 -251 122 -45 -156 -164 -80 -4 339 61
2177 61 -298 -57 -172 237 -28 -225 -225 120 55 -182 -139 188 267 38 99 173 55 -3 47 -75 150 16 30 497
2201 497 93 192 17 113 146 118 72 -117 -57 161 -6 75 -179 -229 -195 160 156 -46 -211 -240 68 -132 132 107
2225 107 -10 -5 263 271 -135 81 123 -38 -11 107 -150 -78 132 290 222 -102 -133 -35 -183 142 -112 146 -77
2248 -77 86 -57 15 -238 70 -93 60 66 -58 165 205 313 182 -127 -139 -157 -44 63 -122 -138 -212 205 -26
2271 -26 -24 -86 62 -102 -296 72 -10 -158 59 -286 -171 46 -155 74 -61 239 -99 -21 -17 63 -282 -84 -171
2294 -171 -140 -87 9 36 -129 -4 149 132 109 -19 -327 151 -70 -204 273 -171 -59 -72 -141 -59 -6 -89 -18 -100
2318 -100 -181 -22 165 -169 -191 -3 2 -98 91 59 22 -129 -116 -80 -64 78 -32 268 -77 -58 -49 56 20 13 87
2343 87 -162 93 -280 -114 -14 -37 -82 24 43 155 -94 2 39 -120 123 219 -80 -131 367 -212 -180 -67 65
2366 65 -44 254 -222 42 -76 77 77 199 -6 88 -181 -190 27 -72 28 -79 52 -206 -137 -32 -275 55 0
2389 0 64 66 -15 -18 -7 -2 -191 -227 -19 -96 135 -186 -289 -35 -10 134 232 -32 4 -143 77 69 47 24 -42 68 -68
2416 -68 -14 -44 -120 30 245 135 67 42 1 -269 -95 29 -132 55 -114 -189 -105 -120 -81 110 233 -39 -69 -167
2440 -167 -7 0 -43 -11 332 35 256 76 191 193 -114 -174 15 -204 48 164 -5 152 56 141 -123 227 -69
2463 -69 93 296 -265 -204 349 126 0 -16 -59 161 314 77 103 54 171 -118 38 128 -385 -274 -141 -128 19
2486 19 85 -178 111 -138 154 195 -109 97 -17 53 -163 -496 -16 -65 -237 -198 231 23 75 212 391 54
2508 54 -179 -220 -144 60 -156 -172 228 146 15 -138 -35 266 -20 -50 -185 -65 -194 -221 30 -126 165 4
2530 4 -99 -280 -183 -62 4 62 -111 219 34 -51 396 -85 59 -53 -75 0 -48 -7 294 158 -96 -28 54 129
2554 129 185 41 72 -125 -108 227 114 11 -104 -101 -118 16 -308 -44 183 13 126 97 -110 50 -158 -305
2576 -305 7 -215 34 77 289 131 191 -40 -18 87 -57 141 -37 99 10 223 75 18 -145 125 59 -24
2598 -24 143 -25 114 -106 217 46 212 -106 182 117 -141 -188 116 -53 12 -23 -135 117 -123 35 313 -272
2620 -272 -172 -151 -108 -119 11 51 -151 139 -85 56 84 20 77 98 204 107 -211 48 -19 -292 149 -186 148
2643 148 49 139 132 114 147 12 129 150 -37 81 219 -55 61 -27 -33 -119 -22 2 151 29 158 283 18 -148
2667 -148 -98 155 -72 -198 10 -12 -18 -37 6 108 -132 -57 -268 -241 -48 43 10 -100 -25 -250 17 -124 -189 29
2691 29 -382 -157 138 40 23 -102 -244 -10 -56 50 20 47 133 46 157 37 -58 58 204 161 -53 -19 68 -65
2715 -65 119 54 -81 62 9 222 148 -85 -1 2 201 46 -29 -110 4 210 -38 50 -43 129 -203 46 131 -253
2739 -253 101 49 -28 301 -101 291 86 296 -86 125 -43 -50 149 29 47 -97 -47 -65 -48 -23 120 43 119 -3
2763 -3 -204 -251 -199 23 445 93 25 -37 -148 103 187 -44 74 81 163 62 129 -7 40 -29 -54 -56 45 33 -140 -18
2789 -18 -266 12 -194 94 171 -62 154 -297 -131 -82 36 -1 -93 -87 -116 -54 -32 -86 62 -111 -245 -143 60 58
2813 58 -79 100 -18 -98 15 -65 43 -145 60 -100 158 -204 -49 0 153 -113 -58 -225 -18 -425 -50 41
2835 41 -200 53 -72 4 -64 -59 53 105 67 -161 -160 -94 -32 116 -51 -176 -63 38 -269 -68 -156 -303 -246 148
2859 148 171 168 109 -136 104 169 -1 21 -57 23 17 44 -186 24 -373 28 348 -45 60 35 -73 -13 -5 -62 -76 13
2885 13 -125 3 116 -198 189 58 28 -276 -23 -123 346 -64 -43 -219 28 96 0 86 -212 81 -148 -53
2907 -53 205 112 -73 -8 -107 18 312 98 -268 -97 5 -88 118 -113 -48 -220 -200 -84 131 51 85 27 29 -365
2931 -365 -79 -122 -19 -25 276 -135 -289 -67 -17 103 263 -94 -53 114 82 -56 210 -179 -163 65 78 221 68
2954 68 71 -96 -2 -81 -76 29 230 -253 43 40 262 228 -158 -128 -25 -11 -97 -69 -339 -35 -120 -16 -88 -145 68 -188
2980 -188 -63 137 -172 304 16 62 273 -173 -15 70 34 -5 -79 4 119 221 37 -91 60 6 100 133 247
3003 247 106 -14 314 57 59 -136 -11 115 -83 -284 -83 27 74 -160 -248 -171 184 333 -102 219 45 108
3025 108 -44 188 -242 -287 21 -228 -4 -156 -58 -82 -16 -294 -137 163 -193 -51 178 -26 161 84 236 189
3047 189 -19 29 195 -103 -197 139 106 -9 -282 -247 -151 248 113 17 -137 -99 -40 89 -119 -191 -145 322 -3
3070 -3 84 83 99 92 -267 148 -250 -219 -176 122 -260 -209 45 113 99 185 161 -165 -278 -98 -124 246 -45 -58 14 -81
3096 -81 162 195 -36 -43 75 45 42 -50 -24 1 125 146 -41 -260 -64 38 -38 72 -73 0 298 252 -139 122 -95
3121 -95 208 276 269 -126 -13 67 43 225 62 -149 140 -41 169 -79 -142 -361 86 194 -120 -51 -94 -249 -2
3144 -2 -180 -25 70 -93 -181 -144 117 -12 -174 49 -86 -310 -1 170 264 37 -373 -65 -88 329 89 43 63
3167 63 89 -130 -148 -91 -268 -353 -137 -79 -83 -89 73 43 -121 -115 275 -211 -2 30 -2 -160 15 -22 -210 81 10 -46
3193 -46 -145 50 -22 -86 -20 -114 -23 -58 -219 108 -137 236 27 4 -80 -50 -37 -16 -161 101 34 26 -86 -357 -99
3218 -99 -6 111 277 -72 -274 -181 79 -283 -140 154 -102 3 127 150 165 -84 -146 2 -2 29 -392 -62 11
3241 11 -21 22 -34 -334 113 47 -26 -119 -107 -33 -117 -111 -19 4 242 14 -40 -10 62 -20 72 109 73 -10 -61 -152 226 254
3269 254 -21 9 116 252 201 161 -122 264 61 -132 -114 95 104 15 -4 157 -164 -26 -56 94 179 -74 149
3292 149 -3 54 37 -64 -182 82 136 172 -193 -54 397 137 63 -209 -4 -156 35 64 -2 145 -158 -142 -55
3315 -55 173 104 -202 -32 -61 72 -440 79 62 -188 -113 -14 114 -1 0 15 56 -55 -235 -48 -44 53 199 110 -200
3340 -200 -193 50 -69 -6 278 -74 162 -82 222 58 -286 90 -257 95 134 -39 158 146 -94 89 167 -143
3362 -143 -139 -148 2 -92 155 -159 -25 -79 58 33 119 77 -79 -195 -4 20 -98 164 -334 178 6 24 -164 85
3386 85 64 194 78 156 12 -247 168 -25 240 242 141 256 63 303 -156 -64 30 5 77 189 68 -295 -346
3409 -346 -15 210 164 110 -57 118 125 -130 -65 -168 77 -12 -21 3 164 -53 -216 -55 52 39 -120 -150 212 -44
3433 -44 108 153 -247 -57 1 225 117 -209 58 -175 -116 503 335 93 3 -44 -85 -152 260 108 143 -117 123
3456 123 272 -76 -58 -64 95 -337 264 -153 -37 -1 88 62 169 79 -39 -172 -177 -187 -93 -27 374 145 -199 -209
3480 -209 59 36 134 141 15 -144 160 104 -19 152 69 84 -18 -116 -167 -97 58 203 5 48 -115 -81 -9 -3 -125
3505 -125 -27 72 22 143 -153 -43 265 128 184 22 81 306 18 169 -273 221 87 -151 -83 52 -61 -131
3527 -131 -315 -22 136 177 195 146 145 44 126 0 -5 37 216 225 -23 -78 20 -68 -52 142 32 174 406 9 -143
3552 -143 106 -84 53 97 210 -67 3 51 21 77 -36 57 68 -213 -100 179 12 -128 68 -105 145 226 52
3575 52 -98 -74 92 1 -190 -186 259 -16 -178 -113 -4 -243 -97 363 169 32 -27 -94 219 25 0 18 -147
3598 -147 -65 40 226 -359 137 -66 57 -118 323 -164 -167 -32 -32 -82 74 51 -49 -180 3 52 -41 97 -103
3621 -103 -87 83 -6 -10 -4 3 98 -94 61 92 -26 45 91 133 16 224 117 31 -148 26 95 -95 -35 -86 -165 136
3647 136 34 -156 -105 227 195 -211 -38 -231 -319 -11 -2 -61 123 -132 228 -168 -108 141 46 -195 -245 160 64
3670 64 65 -89 152 160 60 -97 -180 155 190 172 -15 142 139 41 35 -52 -72 -146 180 100 43 104 89 -283 19 106 -242
3697 -242 120 -188 -71 33 -181 -53 14 -20 -259 -111 -12 56 6 -76 -268 -160 -263 -169 215 57 -44 56
3719 56 39 -136 142 -364 22 -121 67 152 -36 -15 19 128 -155 -132 117 80 213 -225 -83 99 125 -140 155
3742 155 186 -189 168 -8 174 -132 -127 165 -66 28 -39 -105 -141 7 31 -191 -236 92 3 -53 -35 -4 -54 -226 45
3767 45 48 19 -2 223 -100 24 -134 -55 -44 -230 -9 138 20 -50 37 29 -139 -149 30 -82 227 36 -74 -143
3791 -143 176 37 -66 68 -83 -347 75 -75 -107 264 -130 313 128 -48 80 42 -118 262 221 -67 -203
3812 -203 -66 92 110 -226 93 -140 -183 67 -70 -160 -20 -193 42 -27 -81 69 -245 27 -77 217 167 101
3834 101 -75 -11 143 275 12 -241 -102 309 -34 -132 -46 187 128 75 72 -88 -15 -109 -99 128 -126 -119 130 -82
3858 -82 106 43 -212 -16 236 144 23 -81 -51 -27 102 -274 -227 242 -102 111 69 -186 -84 -213 94 93 80
3881 80 -37 -75 60 -65 10 -6 40 164 54 -202 -99 49 29 -34 -46 72 209 -104 -113 76 330 -10 51 -176
3905 -176 112 11 -105 -20 -8 -153 40 10 101 -61 -30 -239 -89 175 135 11 -195 -165 -104 -204 101 183 -20
3928 -20 189 -121 111 -68 159 316 -86 -240 -24 -80 75 77 20 66 2 -12 196 -79 89 186 -142 -209 255
3951 255 -168 -96 -130 162 -30 -33 242 -13 169 20 -153 -167 73 -69 104 70 -74 -167 103 78 -193 -35 18
3974 18 -157 69 6 249 46 131 81 -204 -89 -10 -10 -48 -41 312 -295 -4 22 -170 87 -5 -73 43 137 99 -160
3999 -160 52 -2 12 74 -105 -173 -12 -23 -45 39 -124 71 44 -1 81 68 11 -161 188 -48 -72 -227 -18 215
4023 215 52 -12 -72 -93 124 -6 39 -209 -114 46 -138 -27 108 108 -40 -137 -116 -122 115 -179 -202 -84 -116 -62 -21
4048 -21 -203 -139 82 -101 95 -54 0 8 -66 -39 30 -108 -28 208 -77 -75 -41 134 198 71 -92 -88 119 -123 -4
4073 -4 -259 -228 160 24 166 -50 282 67 -127 -66 68 344 -14 -104 -96 29 -2 -5 -181 89 -273 -307 -25 -67
4097 -67 26 -153 183 -238 -225 102 -108 -98 131 88 25 -63 28 44 -212 225 -81 -12 168 -71 52 75 14 -254
4121 -254 -81 19 46 -123 92 -173 -333 102 151 -4 132 139 98 110 -199 -118 116 351 50 -57 -153 45 12
4144 12 106 -95 -122 9 -9 -407 240 -101 -130 151 149 -195 224 84 99 -157 -155 -311 -173 -186 -206 83 -13 55 -111
4169 -111 62 -67 -154 -356 -165 -129 -272 -63 -29 145 5 100 -33 120 154 -9 60 79 139 54 -158 24 -12
4192 -12 -34 -43 30 2 114 -151 -17 158 -125 95 -66 91 103 72 -75 163 -233 147 -213 -114 261 -14 -72
4215 -72 -260 -86 157 156 -181 32 -149 230 91 -119 -121 166 129 -94 219 31 148 -18 166 -55 -113 74
4237 74 -57 58 -39 -249 -95 -27 -71 9 86 -150 166 91 -201 12 165 105 105 105 193 86 -98 287 367 -6 39
4262 39 -141 378 62 79 156 -24 -38 -41 114 235 -76 -141 111 61 -26 80 105 175 -96 50 30 103 10 -78 -69 -82
4288 -82 -14 -159 144 136 199 200 -27 241 116 166 -176 -53 -9 74 -211 -202 -48 54 38 -109 27 -148 162 183 -149
4313 -149 146 -185 4 36 -25 -85 265 -18 -246 196 -108 39 47 -33 -111 30 422 384 98 -158 33 -41 -23
4336 -23 -149 -123 88 23 -150 -116 22 -235 73 -10 61 101 242 144 13 125 105 232 68 -52 -94 -26 306 28
4360 28 -40 -186 -37 -313 224 156 -154 259 101 23 122 189 158 466 127 5 -3 61 64 -145 -580 20 137 56
4384 56 103 -120 6 71 124 -149 81 33 58 36 -5 47 274 257 -170 -255 -267 6 213 -28 -44 -137 -51 247 -25
4409 -25 -215 -172 30 88 93 -35 176 -58 196 150 6 -28 12 -29 203 -111 -156 2 34 14 -40 4 121 -46 -110
4434 -110 71 22 156 -15 -117 -217 17 -59 -157 282 -277 -145 -38 117 85 -21 96 -120 -215 11 -156 -27
4456 -27 18 95 207 -239 80 -48 -210 297 167 129 -57 189 218 -75 -13 -130 86 -47 -83 -49 -209 328 10
4479 10 150 -40 170 -23 109 163 -116 54 289 209 28 -194 -83 183 -147 -177 -57 61 -146 248 -40
4500 -40 317 -84 -64 1 -47 -292 -115 205 44 -49 -76 -92 -128 -74 -64 63 26 -82 -21 -152 -175 -2 -57 -81 -92
4525 -92 -227 27 -32 -283 -30 3 242 -204 107 -9 126 -134 147 -149 -150 -183 209 44 -193 229 137 0
4547 0 54 -24 -224 -36 -53 78 95 192 -109 -220 -28 107 338 42 -355 -9 -30 165 -214 176 52 88 -212
4570 -212 -127 69 -156 -131 12 111 -202 -10 38 120 -213 -384 -238 32 98 -32 1 137 158 -76 71 132 -89
4593 -89 -153 28 -13 3 138 56 -91 -27 -64 146 -304 -401 1 105 -67 66 65 -195 -170 165 20 -70 40 77
4617 77 -26 -34 -114 189 64 219 240 -105 -41 81 -2 128 -19 -84 -176 75 99 127 27 324 163 106 -5 47
4641 47 6 -46 -107 -186 -75 257 189 -70 94 -38 -107 198 -278 -86 205 172 127 -64 70 25 48 215 37 81
4665 81 180 -210 -117 -60 124 66 -53 -51 -40 86 -181 -190 24 211 -103 152 163 -32 -25 111 -25 100 92 -47 -195
4690 -195 203 107 -105 -154 289 13 -135 42 51 -126 189 -13 45 253 -56 150 -151 138 56 187 -44 -9
4712 -9 -67 64 -46 133 -19 65 -153 220 29 -48 -45 79 -106 120 211 -254 119 3 -141 111 -28 192 201
4735 201 51 130 -213 40 49 -66 -111 -266 -234 62 -318 251 -107 83 -58 5 135 -98 77 -200 126 241
4757 241 -113 -35 303 79 -44 -156 -222 143 -106 -184 -88 -85 -94 12 116 -273 -163 94 -178 226 50 12 -249
4780 -249 -102 -131 159 -191 -165 244 -189 173 164 -40 -51 -73 271 -84 59 -208 -8 117 -9 -19 47 -81 -112
4803 -112 -4 -82 -145 15 104 11 -17 -119 57 -169 -191 -79 -43 -123 63 49 -46 -46 147 -209 -14 -144 127 -1
4827 -1 -43 -104 -103 73 277 3 67 67 -114 74 -210 -42 238 187 -245 64 -85 -86 68 -17 246 29 -397 -31
4851 -31 249 -142 62 -109 98 143 -192 -350 -91 -121 -165 -234 106 -129 -151 -39 -25 -98 192 271 7 -164 15
4874 15 99 17 168 -49 129 63 -168 -55 167 110 -43 -132 96 144 144 78 -250 203 67 -44 154 118 163 -106
4898 -106 66 157 13 -75 155 125 -116 -158 180 165 -136 14 65 -218 162 -134 232 -113 157 -6 -90 -3 -143
4921 -143 4 -215 -418 209 -100 -8 -44 -53 -213 127 -153 69 126 -16 124 255 -12 -93 193 154 13 339
4943 339 134 -28 -152 323 -87 32 73 -95 -234 -37 148 10 -158 -179 65 -115 -64 127 83 115 -79 -52
4965 -52 -109 239 -70 29 -95 92 -16 -205 -49 37 -174 -37 -119 308 216 53 86 -47 -53 132 150 -195 122
4988 122 49 16 89 -30 100 -216 -98 60 -168 174 -96 10 -100 -126 74 219 43 -118 116 -28 58 -121
5010 -121 0 -204 106 -57 -262 -235 -70 -120 62 -17 247 -195 134 327 23 127 -56 43 -149 -117 -209 122
5032 122 -185 -29 14 91 195 80 10 -37 -70 209 236 279 -24 25 -53 -31 44 188 -33 -194 -166 -248 156 -85
5056 -85 -161 -62 -13 150 349 -63 121 -267 86 44 -375 0 88 79 116 -3 71 93 145 118 -34 -47 -108 -18 99
5081 99 59 315 80 211 72 -48 126 -66 85 -72 290 112 132 5 105 -73 112 99 -145 -124 133 34
5103 34 175 189 137 221 61 211 137 74 140 -29 -56 114 103 154 -36 136 133 -205 -45 -158 -90 178 -18 229
5127 229 -178 129 55 -69 25 -186 -216 100 56 -176 -226 39 -86 -190 125 -4 -188 124 30 -158 52 -210
5149 -210 -33 128 -47 -17 26 43 25 21 273 -40 228 -101 227 -13 39 59 27 -52 -142 -53 -8 168 134 -17 38
5174 38 -58 30 198 -247 -11 -270 57 -61 -43 -193 -78 106 -24 -54 -50 -382 -53 -30 -97 130 -155 4 -61
5197 -61 135 -35 85 -53 244 -298 -72 181 27 275 137 -14 -11 143 -18 47 -55 109 186 -156 -23 -109
5219 -109 -137 154 -79 263 -138 66 19 -110 -126 -288 -16 6 -198 -38 -122 -112 43 -42 95 -68 162 -69
5241 -69 -153 -346 -304 65 -126 -175 -8 60 -104 -30 -24 89 -160 -176 206 32 -79 0 -160 -37 -150 46 -73
5264 -73 -33 -152 74 -57 -26 103 -116 39 -72 -148 8 154 -157 1 278 36 187 61 -78 49 145 45
5286 45 -117 253 17 -312 8 10 -10 185 -86 -422 -45 17 18 262 -70 42 171 190 136 134 -150 -34 185 -6
5310 -6 -24 21 77 -45 50 -120 -81 -13 -65 -79 279 96 -46 276 -41 156 -65 -112 222 -172 84 210 112 105 -70
5335 -70 -151 -286 -127 265 178 59 -280 -97 -164 -51 68 15 2 37 -218 -122 -62 51 47 -164 -28 278 67 165
5359 165 195 134 63 -98 -55 -119 -164 -39 -24 -151 170 3 121 -140 9 -57 -227 -29 126 21 -167 -58 -37
5382 -37 47 -369 -132 -1 -12 15 13 36 -28 218 21 -129 55 -275 -127 189 239 -23 -2 -199 10 -101 208
5405 208 250 94 -221 112 -72 5 286 -100 -104 -63 39 24 -89 -60 -66 -168 -30 213 114 219 75 -171 54
5428 54 349 81 -85 -39 233 87 112 60 -180 62 -127 -143 -186 -98 65 -67 -42 237 -72 -239 78 -186 -53
5451 -53 -8 165 125 11 -93 -93 4 -58 -156 -109 -148 125 273 -141 -1 48 -8 82 191 190 261 61 252 -340 57
5476 57 -136 29 -271 -53 220 74 -41 355 123 -14 17 -136 19 -18 220 -162 104 -2 -113 -17 19 -39
5498 -39 24 -218 54 -30 -181 37 -53 -33 94 -223 -13 -166 22 -22 376 104 -126 144 -9 19 -324 120
5520 120 129 -67 -145 27 -145 82 -12 -10 74 -29 -104 -245 188 7 -222 -56 123 116 -14 131 94 -154 202 4
5544 4 -122 370 293 115 -149 203 18 24 -199 -233 26 118 82 327 -159 18 74 293 111 -195 81 -257 76
5567 76 121 -128 96 47 -40 60 60 -141 -170 -209 -1 30 -220 -149 -152 -13 -464 121 -3 -51 -195 -97 -3 162 -240
5592 -240 -267 -194 110 49 155 49 -110 -10 -129 -294 -36 -111 37 -82 -110 160 -144 36 -65 43 151 180
5614 180 -7 115 161 -145 -152 241 -145 162 -46 118 133 132 338 41 43 144 -5 -376 -80 -22 87 4 -21 0
5638 0 57 73 22 -205 31 -81 -16 -177 25 -153 -164 -57 -32 335 -240 100 53 201 -239 -17 82 -304 -137
5661 -137 -71 10 311 -186 -1 134 -221 93 102 -134 -221 25 156 136 114 89 -9 182 -81 8 -76 15 80 53 102
5686 102 -125 -43 26 -110 -267 40 138 174 -112 -209 59 197 238 -141 -14 -45 60 -221 140 7 -21 90 133
5709 133 -108 -228 -308 -86 -57 266 -206 156 34 -217 -183 -21 50 -244 187 -144 -10 -19 -123 -72 111 -301
5731 -301 -39 -148 194 -16 16 1 35 59 177 38 -206 62 -82 -21 26 49 -198 -82 -104 147 -133 167 -46
5754 -46 -377 155 -28 105 102 -252 -156 -60 12 -569 119 35 47 110 86 -1 44 300 137 83 171 146 -186 8 270
5779 270 180 -59 -10 -21 114 81 265 -54 167 -44 29 52 -87 -15 -19 71 -103 151 101 16 -83 -281 -8 38 46
5804 46 -93 -253 -93 54 -310 2 14 -290 122 190 -107 89 303 -107 -248 -218 -74 -60 -182 217 -289 -3
5826 -3 -109 40 -71 135 -138 -43 -29 120 34 142 -228 104 141 -138 49 -37 88 13 4 -213 120 42 -72 179
5850 179 -65 -18 94 208 52 -71 -47 293 120 45 -75 -20 112 102 106 159 -23 -33 91 -110 -204 107 -62
5873 -62 186 -64 62 -96 82 217 316 17 -30 -27 -263 17 -52 -80 -36 -68 -69 -127 20 54 165 16 97 48 -64
5898 -64 20 -18 13 35 160 -180 -5 129 110 28 -10 217 146 -75 38 -4 -19 -109 101 142 -8 55 45 213 -43
5923 -43 199 84 -120 5 36 -128 197 344 -84 -38 -30 -101 185 -69 146 231 -179 102 23 136 35 155 -40
5946 -40 92 -24 46 -120 -14 137 -183 -197 -154 212 -324 151 -50 137 -214 -16 160 -80 89 23 -66 -52
5968 -52 -140 36 39 162 49 56 66 -73 3 -111 226 68 -205 34 41 -153 -99 88 18 -42 38 -68 41 23 73
5993 73 -142 242 71 -74 80 -14 -176 164 -249 270 171 155 -143 -8 -128 -17 -72 -72 197 177 -328 37 -40
6016 -40 77 -66 128 -18 -189 173 -106 -2 -301 -161 -68 -50 -26 25 -23 -208 -45 -54 32 257 136 -98 -128
6039 -128 -130 -3 84 -21 430 -100 -58 -101 -204 -24 -122 15 -111 -55 -49 -38 46 150 -102 -337 13 -59 -76 -106 -2
6064 -2 216 -86 214 69 -176 74 -41 -84 -32 132 0 -93 119 95 141 -144 122 1 -12 -112 24 6 -67
6087 -67 -172 7 -29 117 8 188 65 -83 -55 19 -38 -133 215 -145 190 119 -109 16 -39 -307 -116 -191 -131
6110 -131 -322 198 -107 -37 -94 -259 -59 -6 142 -30 346 82 -77 -173 -30 -61 48 74 -32 100 6 145
6132 145 -78 49 -58 -155 343 -97 41 69 -38 -15 129 107 -59 103 -13 -99 -172 -108 -71 -99 1 38 -196
6155 -196 -101 40 -118 155 -117 164 -95 13 -24 -353 -122 -141 30 -24 -112 -1 -186 81 222 -15 50 -107
6177 -107 -134 -63 217 107 -39 -73 -104 -110 216 134 -118 60 -21 -211 86 -62 -83 -3 231 1 -195 46 25 -64
6201 -64 395 -21 -248 -167 -81 -174 -22 76 246 -156 -92 -120 220 -153 -217 -74 53 -60 -164 2 -61 -66 -53 -123
6225 -123 -140 7 133 211 -67 -89 199 209 -110 -189 -16 140 4 58 -6 -95 335 -8 39 299 -172 -212 -93
6248 -93 111 87 -2 116 190 6 91 -262 -86 -112 -261 90 10 184 120 -146 89 127 -137 21 91 10 -132 -153
6272 -153 114 109 -175 161 -35 79 28 -142 -357 -147 -33 -145 54 -230 -19 -234 -164 -172 215 -102 -64 -154 27
6295 27 -43 61 12 359 -22 77 -210 65 -45 88 -166 -20 138 154 -206 110 129 177 40 -188 79 113 -69
6318 -69 -32 -87 -169 53 -117 136 102 -82 -10 89 -63 7 70 78 0 36 -116 13 -113 -87 -73 -69 30 157 -53 -109
6344 -109 -449 -73 -34 2 -80 -173 -97 -39 113 297 -129 41 11 -3 -210 126 -16 -125 333 190 -123 115 -50
6367 -50 146 200 -59 -64 -8 37 54 47 170 122 -14 -19 -23 -132 -155 -37 -7 41 52 -71 -360 -162 210 292 -136 125
6393 125 -299 76 7 -59 -78 -92 285 87 148 -85 -244 -124 11 -1 70 -25 -260 -143 17 134 71 121 -160
6416 -160 93 56 189 -49 82 -118 61 -257 118 87 169 -18 96 -36 9 215 -59 -32 -14 -21 -74 -73 -107 7
6440 7 -168 6 -86 -167 -125 -229 -293 -316 -10 -88 -16 281 126 -89 -120 -286 24 33 -105 59 -3 173 266 -38 -141
6465 -141 35 23 17 210 -68 80 283 67 216 303 160 66 373 -149 -117 -58 228 140 44 29 -4 66 37 -168
6489 -168 38 -33 -265 -138 105 91 173 36 -139 -119 84 224 -50 34 146 -18 63 80 -122 -325 -105 -124 135
6512 135 42 -92 -80 -260 -134 -67 170 -173 1 -158 -13 -124 -105 34 -148 39 -50 58 -119 -3 0 -45 -119
6535 -119 74 -71 285 73 19 -213 205 -27 109 -105 -110 -80 -152 196 123 116 -208 -125 259 -226 -91 -6 -39 98
6559 98 8 281 -233 35 -330 -224 52 82 254 -77 -126 -101 -199 -29 47 -77 -168 -138 -208 -108 89 -196 158
6582 158 110 -29 -78 201 97 16 20 111 225 186 225 38 -69 74 -24 8 41 -69 97 225 -3 62 113 -125
6606 -125 2 154 -36 44 -75 -14 202 -252 256 -37 74 74 -65 57 -67 -115 -34 -42 143 111 28 183 -108
6629 -108 4 -299 -363 -45 205 -53 175 34 -150 109 -29 -11 68 61 -60 -39 -233 -65 -60 67 201 28 -96
6652 -96 -3 41 117 -14 100 162 51 -81 -106 -61 -21 300 -80 284 22 426 60 -57 172 -19 148 -86 -130
6675 -130 187 35 2 -89 17 -67 140 -117 90 -18 -214 137 -53 -123 -210 260 -149 148 -159 -198 -27 66
6697 66 102 0 84 69 242 -62 -41 -224 -49 -50 -64 -299 16 -197 -115 -167 -224 167 -195 -149 93 63 -227 -121
6721 -121 211 -291 48 -26 -88 -42 -133 -67 -38 128 -115 99 -2 -333 114 -230 20 -107 -332 -16 -22 -149 -192
6744 -192 128 -102 -158 -17 25 44 105 -159 64 -9 -147 -126 -164 36 -239 -121 -15 -166 -166 -109 -150 -226 -32 -99
6768 -99 31 63 -229 -162 95 -72 -24 -83 158 -17 79 37 -101 -230 -205 234 89 102 89 -29 14 -119 -1 -208
6792 -208 -128 -202 -61 328 -173 88 11 -23 88 56 -164 35 -149 -1 83 91 -161 -52 -56 -301 -44 89 45 -114
6816 -114 199 -75 -8 260 -218 92 143 169 8 38 7 210 91 208 13 52 -77 7 -279 68 14 113 237
6839 237 71 46 -55 218 -316 -28 -3 -364 -135 136 129 -113 -163 -14 -127 -35 -226 1 -72 -331 132 259
6861 259 91 73 8 -105 -83 -65 -136 -75 -144 45 -75 32 228 84 254 39 219 51 -144 -14 -24 -108 92
6884 92 212 28 -145 -61 40 -110 -290 80 13 186 99 -263 326 202 200 -174 28 49 111 115 -249 184 -15
6907 -15 -88 -20 -125 -159 -20 -139 -209 -175 -106 -161 -180 40 262 148 113 -183 -45 93 132 -7 -119 -251 47 -78
6931 -78 -70 -14 38 -22 -123 -148 34 194 175 22 108 113 12 9 23 -146 213 -53 116 161 85 -78 -91 -47 101 -40
6957 -40 201 78 100 50 90 -96 -58 255 -65 -339 45 -105 -61 -74 -207 -115 -98 -254 41 136 112 4 27 -152
6981 -152 -5 150 -37 57 126 293 -163 50 213 42 -282 2 -57 116 -69 92 53 -244 -186 -109 -137 -15
7003 -15 -39 -42 56 -141 258 141 -28 -175 34 148 -43 -205 174 -211 118 19 69 -170 67 24 29 -119 179
7026 179 97 -83 27 29 -7 -152 -145 84 -55 -140 246 177 -29 -142 184 -80 -101 80 -170 5 17 79 -17 18
7050 18 31 -240 50 30 -41 112 -257 170 25 125 150 11 -55 -152 85 192 337 -151 -65 31 -189 -23 -129
7073 -129 98 -115 -168 -130 123 -82 -158 126 71 63 -200 -10 -90 109 -38 -76 -121 -169 38 -144 -87 49 76 -289
7097 -289 169 -21 33 131 -49 -139 -17 62 -3 143 -35 127 -128 -100 6 101 -149 180 -318 -131 -16 -150
7119 -150 -176 95 -184 -66 140 -13 -128 -126 59 109 -16 -144 -9 -37 -217 77 310 -122 -36 -79 137 -7
7141 -7 65 9 130 101 -18 87 -64 334 -331 -61 185 177 -46 -89 133 -99 189 123 -13 -85 187 72 -244
7164 -244 99 -88 184 -41 -198 -20 39 -9 50 -147 88 -70 166 116 -77 39 -138 -131 10 112 -143 -5
7186 -5 33 47 -319 107 132 186 -156 -100 -225 -142 -117 -4 -31 -47 127 -90 8 -129 -22 36 -314 -156 92 -53
7210 -53 -113 96 -115 87 -67 149 -45 -107 -34 60 -264 56 -149 -286 -9 218 -95 -35 -30 -255 -47 -86 57
7233 57 -421 68 29 213 -187 -42 175 -5 72 380 -22 156 54 -179 -41 53 -203 132 -120 -82 129 89
7255 89 16 -77 -33 -86 99 24 94 241 -226 -85 -18 61 95 0 -208 129 67 -20 211 37 150 23 5 191 282
7280 282 257 99 86 30 -77 282 115 73 0 132 -91 -218 -137 -112 -166 -64 124 137 186 -217 35 98 86 -74
7304 -74 167 -126 12 155 -59 32 68 73 -379 139 217 -9 21 266 -94 -117 228 0 -198 82 -232 287 -48
7327 -48 139 -42 -157 290 123 -250 -160 13 244 -50 -80 67 -25 225 -65 -95 -21 78 -174 -234 33 -14 -151
7350 -151 -136 288 -75 6 -67 43 -95 -103 -299 175 160 88 -417 61 -43 -242 -172 -50 -188 26 -56 36 -70
7373 -70 -346 -161 175 241 -229 99 60 158 -63 -14 90 108 -44 118 229 277 125 -114 -99 -163 64 198 -122
7396 -122 -41 -170 71 173 -244 -26 165 -105 -15 74 170 -24 134 -89 0 31 -209 10 359 107 -113 -204
7418 -204 -68 451 -177 -270 114 -73 -169 57 -106 -195 -207 120 88 -190 66 -49 111 -29 -4 -136 -179 64
7440 64 78 211 38 -43 122 -50 -111 110 -107 81 -194 -18 -75 22 -222 -15 11 -231 -66 -35 -83 226 254
7463 254 -99 37 225 112 -70 34 -40 18 186 -20 72 8 193 215 -180 111 45 -94 -131 8 -389 128
7485 128 -41 -11 -284 79 37 -71 17 -48 102 -2 -14 95 12 -107 100 -11 93 -105 162 221 201 -149 200
7508 200 252 7 56 -80 79 63 -3 -119 -141 120 -383 256 63 -245 -108 -235 173 -113 -442 125 -143 179
7530 179 103 122 -46 -116 -6 -190 -98 45 -69 -130 48 -131 -22 158 -125 -126 111 6 -62 129 58 -24 26 0
7554 0 142 51 -17 -71 73 -173 -28 -86 120 236 -80 -183 -59 239 -253 -237 -43 -62 66 -66 50 58 35 101
7578 101 -5 105 -32 -178 -110 -76 -115 -38 -42 -76 94 -18 -237 152 -40 -276 117 -45 -118 187 219 -51 87
7601 87 -200 -4 181 -130 16 3 -68 -109 -169 101 -20 -372 289 249 15 216 1 -44 -146 279 220 174 99
7624 99 50 -160 -23 -105 -68 -24 -88 -27 58 120 33 -57 266 11 -163 219 -20 0 -16 -282 -183 -224 -52 -56 48 -184
7650 -184 -43 202 -55 25 -6 155 -157 192 -132 140 -206 47 -197 55 119 2 -226 -7 395 -28 -46
7671 -46 102 150 -45 -130 -5 -170 35 -103 95 -56 -35 -7 -166 -110 182 365 -131 -294 -137 189 89 36
7693 36 63 163 -28 -44 -20 -132 -176 281 -73 -18 -65 -27 23 55 -155 19 -239 7 -15 -44 23 30 -66 -76 62 41
7719 41 113 -23 10 0 120 56 -100 -118 161 62 -129 66 66 -185 75 -75 -253 -325 -9 -126 -188 1 113 109
7743 109 -51 271 -62 -232 87 203 -102 260 -115 -25 77 63 -59 -216 -33 -39 19 106 197 61 10 145 -74
7766 -74 80 -33 26 96 -109 -168 60 57 72 -96 -35 0 -112 -64 -61 155 -146 111 21 226 -188 -109 139 127 65
7791 65 184 71 -27 -217 -134 49 -301 -180 25 64 70 -116 186 -24 150 -159 -168 72 -94 92 56 -16 -24 207
7815 207 -127 -111 -14 -56 -11 -100 217 -19 -265 142 -143 -58 -25 -86 -82 360 77 79 -87 1 44 93 125 4 -140
7840 -140 103 9 191 -160 1 16 -171 199 10 29 -65 -169 104 -209 276 21 6 -35 -420 106 40 -14 -271
7863 -271 153 300 -145 135 -62 -97 149 -29 269 -97 -157 2 -207 133 -164 -18 -148 -110 4 -99 25
7884 25 -64 60 46 173 0 63 -216 -117 -111 -268 199 171 12 -65 -246 48 356 8 -117 53 -89 68 61 -179
7908 -179 145 -97 -177 -120 -9 -67 192 143 -99 -7 296 101 38 -131 67 216 -40 -225 -178 52 181 1
7930 1 117 -223 92 -304 172 111 -252 -291 -20 141 134 -8 -104 112 -100 243 26 -104 -80 -90 -101 211 75
7953 75 -73 60 -37 15 108 136 -34 23 -22 -238 -98 27 -208 -96 85 -26 -218 284 -146 -51 46 -288 -150
7976 -150 141 -48 189 13 0 -42 268 160 -43 5 69 28 54 166 -19 100 -260 128 -109 37 4 48 46
7999 46 -11 -8 -127 37 -31 -4 -131 74 -127 -170 190 36 -241 140 -204 -109 131 89 -38 83 94 140 0 111
8023 111 167 138 -246 -308 -69 -56 -43 -3 95 31 50 164 -64 339 -51 -149 126 81 114 43 -113 -103 90 -120 -52
8048 -52 131 135 20 209 52 326 -141 30 -99 -48 62 331 146 63 144 178 148 136 -71 51 84 107 163 -95
8072 -95 -63 -26 116 4 -49 71 113 -109 -143 -10 -5 118 -157 258 306 -32 100 69 -83 -11 91 -41 190 -210
8096 -210 38 1 199 144 178 105 322 -19 -119 65 -103 -58 160 -5 130 40 80 201 136 5 210 -32 280
8119 280 -157 -318 -68 192 143 -135 23 185 121 114 146 -17 0 -201 -2 39 -40 126 -116 2 88 30 130
8142 130 -207 -4 24 11 100 -107 147 0 -108 -76 285 126 -227 -44 -149 283 -147 -22 -164 -43 181
8163 181 144 -63 207 68 -87 144 -289 -91 -39 20 170 -153 197 -16 196 -57 -38 192 -102 -293 -10
8184 -10 256 -88 85 -234 406 148 -147
8191a47
$$ Imaginary data points
##PAGE= N=2
##DATA TABLE= (X++(I..I)), XYDATA
0 0 0 0 0 0 0 0 0 -1 7 -7 7 -7 7 -14 14 -21 21 -28 35 -37 46 -50 63 -70 81 -92 105 -119 133 -154 172 -193
32 -193 217 -243 271 -302 335 -373 413 -459 507 -562 623 -688 763 -847 940 -1046 1171 -1313
50 -1313 1481 -1682 1928 -2238 2642 -3192 3992 -5263 7605 -13364 56971 39437 -95282 -59021
64 -59021 6550 58313 34585 -46787 -102688 -25806 72992 79440 10484 -44156 -46518 24826 81781
77 81781 27300 -77634 -82957 -5893 49803 41469 -9442 -53937 -18839 60244 72428 4121
89 4121 -52911 -51277 -1901 44926 23663 -48839 -63429 5658 63638 50307 -2308 -42491 -26447
102 -26447 32732 51026 -6627 -63508 -51471 7066 51091 35297 -23566 -47461 3380 59751
114 59751 46997 -14909 -57206 -41313 15863 47666 8827 -48513 -44233 15862 60260 44686
126 44686 -14552 -51980 -20311 36823 40186 -12536 -54458 -41275 13951 52992 30673 -24727
138 -24727 -39929 2826 46219 36101 -15960 -52905 -32812 20033 39814 5031 -34679 -29423
150 -29423 14439 48320 30964 -19130 -42369 -12151 28392 27117 -12974 -42901 -25099 22329
162 22329 43585 15023 -25124 -27278 7888 35941 20931 -22766 -43915 -16681 25236 31403
174 31403 -1905 -31796 -19216 21982 41604 14854 -26617 -34735 -3468 27867 20608 -17237
186 -17237 -37460 -13180 27388 37155 6672 -27259 -24021 11278 33366 12386 -26210 -36563
198 -36563 -7895 27024 27805 -4723 -29636 -14171 22504 34132 7179 -27144 -30286 656 27470
211 27470 15963 -17703 -29763 -6106 25684 30017 945 -26419 -18620 12732 26403 5537
223 5537 -23672 -27780 -774 26580 20753 -9447 -24200 -6164 21095 24728 -228 -26336 -22257
236 -22257 7647 24320 7960 -18133 -22014 944 25508 22298 -6982 -25078 -11235 15244
248 15244 20482 -123 -23084 -21187 6285 25901 13692 -13057 -20483 -1771 20195 19174 -6066
261 -6066 -25844 -15100 11929 21356 4342 -17291 -17855 4898 24348 15787 -11224 -22329 -6894
274 -6894 14847 17276 -2665 -22048 -15435 10365 22968 8599 -13345 -17377 71 18941 14849
287 14849 -9259 -22471 -9309 12832 17802 1609 -16372 -13848 7811 20930 8877 -12986
299 -12986 -18200 -3054 15116 13837 -6131 -19029 -8835 12824 18717 3633 -14483 -14275 4468
312 4468 17864 8362 -11878 -18720 -4001 14220 14986 -2232 -16528 -8890 10712 18065 3935
325 3935 -14294 -15619 887 15655 10073 -8667 -16826 -4056 13698 16221 16 -15305 -11198
338 -11198 6734 15887 4901 -12922 -15833 -553 14840 12332 -4980 -15064 -5840 10980 15322
351 15322 1002 -14631 -12816 3454 14401 6643 -8966 -14229 -1701 13766 12768 -2973 -14333
364 -14333 -7422 8062 13069 2077 -13243 -14289 1776 15120 8011 -6884 -12925 -2450 11686
377 11686 12123 -3112 -14226 -8911 6465 12777 3793 -10619 -11740 2092 14002 9175 -6272
390 -6272 -13178 -5119 9273 11644 -1107 -13624 -9213 5866 13412 5245 -8664 -11765 81 12049
404 12049 9003 -5634 -12944 -5584 7795 11695 1193 -10897 -9026 4657 12646 5835 -7043
417 -7043 -11736 -1985 9927 9403 -3431 -11635 -5861 6874 11551 3421 -9040 -9200 2191 11040
431 11040 5796 -6219 -11311 -2969 8212 9800 -1483 -9775 -6320 6121 10648 3598 -8689 -9516
445 -9516 -261 10577 5732 -4797 -11084 -2791 7631 10348 95 -9821 -6956 3721 10927 2735
459 2735 -6301 -11640 889 8391 8749 -3634 -9907 -3142 5572 10933 -3 -8719 -7899 1553 10402
474 10402 3464 -5032 -9153 -2463 9669 7193 -2069 -7987 -6388 5843 8702 811 -6643 -8566
488 -8566 1027 9823 4695 -4068 -7597 -3125 7216 8888 -2425 -8472 -4699 2793 8295 3484 -6904
503 -6904 -8328 1922 8074 4665 -2571 -8027 -4011 5954 8532 -1329 -8524 -4844 3498 7160 3650
518 3650 -4132 -7841 -1039 7886 6684 -3888 -8784 -3486 5617 7139 269 -6656 -5095 1996 7056
533 7056 4789 -3608 -8028 -2267 6567 6801 -1658 -8345 -4543 4918 8625 1941 -7130 -6413 2193 7768
549 7768 3882 -4400 -7487 -1535 6367 6140 -1683 -6984 -3535 3955 7200 1583 -6090 -6546 1277 6753
565 6753 4076 -3795 -7291 -2067 5937 7286 -297 -6917 -5145 2231 6906 3194 -4389 -7142 -1158
580 -1158 5801 5005 -1228 -5139 -2652 3610 5368 147 -5823 -4465 2306 6379 2843 -4496 -7051
595 -7051 -1246 5742 5714 -874 -5568 -3253 2704 5359 416 -5552 -5272 1435 6548 4391 -2439 -5824
611 -5824 -2055 4072 4732 -1075 -5402 -3172 2983 6153 2615 -3938 -5284 -133 4835 3106 -2753
626 -2753 -5689 -2320 4135 5830 509 -4447 -3099 2014 5117 2217 -3838 -5760 -896 4504 3437
641 3437 -1919 -4993 -2292 3588 5664 1545 -3838 -3762 1946 5061 2733 -2907 -5317 -1546 3608 3124
657 3124 -2071 -5223 -3257 2409 4780 1116 -3912 -4068 952 4786 2985 -2020 -4361 -1149 4191
672 4191 4750 -24 -3894 -2451 2600 5505 2427 -3096 -4057 272 4487 3317 -1511 -4126 -1698 3392
688 3392 4390 43 -4047 -3219 1180 4309 1778 -2789 -4640 -563 3852 3029 -1167 -4284 -2125 2413
704 2413 4347 633 -3677 -3499 920 4105 2258 -2200 -4089 -459 4032 3656 -239 -3484 -2060 2315
720 2315 4304 1416 -2890 -2717 995 4231 3048 -1146 -3242 -904 3374 3543 -291 -3424 -2535 1355
736 1355 3692 1210 -2918 -3924 -363 2861 1947 -1632 -4025 -2093 2230 3024 18 -3201 -2448 1119
752 1119 3413 2239 -1837 -2829 270 3341 2767 -861 -3135 -1923 1933 3135 52 -3405 -2773 543
768 543 2888 1629 -1617 -3262 -610 2968 3102 -88 -2718 -1948 1938 3378 904 -2565 -2930 27
784 27 2440 1541 -1669 -3382 -1162 2662 2926 -92 -2673 -1481 1393 2902 886 -2350 -3082 -229
800 -229 2350 1296 -805 -2578 -1026 2386 3330 292 -2273 -2030 537 2523 1050 -2183 -3182 -578
816 -578 2235 2426 -443 -2485 -1002 1794 3068 563 -2660 -2650 319 2164 1355 -1451 -2334 -268 2487
833 2487 2487 -191 -2204 -1785 979 2308 324 -2079 -2216 445 2646 1872 -887 -2402 -811 1518 1966
850 1966 -543 -2119 -1442 1208 2895 1286 -1372 -2339 -321 1888 1406 -869 -2181 -602 1644 2157
866 2157 65 -2037 -1959 449 2303 859 -1543 -1651 101 2140 1925 -561 -2305 -1445 1242 2117 366
883 366 -1788 -1612 751 2267 1121 -1250 -2366 -508 1534 1961 -167 -1826 -1373 1127 2030 403
899 403 -1816 -1719 151 2044 1471 -1106 -2113 -765 1458 1365 -176 -1598 -767 979 1989 781 -1725
916 -1725 -1913 137 2047 1504 -489 -1627 -1029 1277 1678 -67 -1751 -1091 927 1745 865 -1490 -1816
933 -1816 1 1611 1751 -46 -1483 -943 817 1515 3 -1679 -1276 589 1884 1013 -1175 -1933 -531
950 -531 1351 1568 -253 -1446 -787 954 1538 330 -1279 -1077 283 1639 1384 -845 -2017 -788 1293
967 1293 1554 8 -1146 -968 325 1392 701 -1087 -1120 289 1494 1096 -742 -1754 -724 1267 1761
984 1761 26 -1413 -1229 471 1457 659 -1035 -1228 -15 1276 838 -549 -1439 -440 992 1508 287
1001 287 -1637 -1067 232 1656 889 -566 -1292 -425 951 1039 -87 -1537 -821 594 1465 33 -1107
1018 -1107 -1109 290 1374 1049 -871 -1621 -444 791 1490 12 -1131 -872 724 1294 651 -975 -1238
1035 -1238 235 1208 772 -646 -1070 -225 1215 967 -397 -1233 -870 430 1547 514 -1101 -1404 -45
1052 -45 1008 1118 -302 -1169 -140 571 1106 -151 -1141 -704 543 896 319 -960 -1306 -21 1031 677
1070 677 -387 -1338 -361 886 1188 -44 -929 -1132 -17 1390 789 -567 -994 128 610 797 -95 -673
1088 -673 -659 367 855 -80 -722 -635 56 1034 1011 -563 -1276 -367 772 1081 -300 -912 -972 64 1283
1107 1283 391 -843 -960 99 852 787 -311 -1168 -477 645 758 36 -668 -631 430 908 443 -792
1125 -792 -937 82 971 806 -453 -1268 -423 659 970 -20 -970 -688 -168 932 646 -404 -720 151
1143 151 637 787 -135 -1050 -620 431 780 205 -746 -866 53 605 502 -782 -912 156 902 714 -97
1162 -97 -824 -540 663 882 115 -841 -925 -27 1001 602 -264 -901 -409 445 1015 -78 -918 -802 16 780
1182 780 585 -385 -992 -279 741 882 -255 -705 -515 424 781 -222 -615 -714 167 608 274 -425 -732
1201 -732 -33 652 620 -177 -880 -406 137 663 -136 -607 -552 15 870 208 -572 -878 -105 754 618 -223 -603
1222 -603 -457 40 969 240 -606 -783 1 619 655 -364 -724 -488 319 611 138 -642 -373 255 706 486
1242 486 -274 -579 157 679 486 -165 -829 -316 731 585 -159 -677 -517 423 611 327 -395 -439 56 343
1262 343 456 -221 -572 -324 504 629 257 -535 -278 149 604 395 -467 -540 47 644 821 -33 -452 -392 458
1283 458 913 66 -574 -522 94 560 675 -262 -616 -253 606 276 256 -635 -442 304 610 272 -242 -478 -166
1304 -166 413 480 100 -468 -270 63 419 -138 -379 -235 309 216 -107 -132 -509 188 537 355 -158 -559 -56
1325 -56 347 418 -293 -658 -315 318 658 160 -288 -526 29 398 236 -230 -658 -212 165 513 -16 -477 -581
1346 -581 45 496 305 4 -741 45 588 409 -66 -429 -231 518 472 344 -382 -487 -129 505 507 -298 -540
1367 -540 -248 379 443 135 -263 -526 -53 551 79 -587 -531 -75 221 345 -205 -596 -155 468 287 190 -255
1388 -255 -299 159 568 307 -169 -409 -80 293 93 -229 -512 -159 216 539 82 -324 -470 -138 496 127
1408 127 -194 -407 -259 347 238 -114 -246 -269 323 403 -151 -366 -101 130 318 83 20 -384 -23 487 336
1429 336 69 -366 -249 0 643 195 -569 -241 152 483 105 -243 -388 -363 344 313 197 -572 -295 172 384
1450 384 301 -81 -378 112 133 420 -205 -388 -25 118 177 24 -255 -60 255 232 295 -421 -374 40 233 311
1472 311 -248 -421 -103 137 158 -150 -567 -332 11 359 279 -252 -430 -74 388 365 -26 -336 -311 151 395
1493 395 181 -152 -334 -103 376 414 -259 -181 -79 121 435 -123 -170 165 176 82 -222 -328 -152 110 256 243
1515 243 -136 -181 -307 176 130 -29 -195 -162 102 62 -46 -201 -412 305 311 84 -148 104 -46 49 156 64 -276
1538 -276 -86 96 332 89 -457 -414 28 179 -50 -198 -18 -222 170 330 -11 -224 -150 -8 -91 85 -120
1559 -120 -327 271 259 302 -106 -303 23 316 110 -26 -366 -255 -302 178 330 -150 -123 -57 321 397 -295 -426
1581 -426 48 268 116 316 -49 -29 -8 324 221 -47 13 -67 138 60 16 -376 -74 99 -63 79 -132 -249
1603 -249 48 152 274 31 -299 -218 61 322 -188 -112 -128 83 206 133 -123 -456 -64 111 346 -2 -266
1624 -266 -153 57 167 91 -370 -293 23 486 433 -376 -333 69 53 56 50 -41 -197 -38 381 28 -141 -216 5 250
1648 250 -80 -192 -335 -8 133 355 -15 -191 -53 127 -124 94 -126 -362 -291 160 95 -31 -144 -63 343
1669 343 118 -164 -367 -130 -50 -10 133 -324 -81 35 210 176 36 62 -147 2 216 53 -126 63 -85
1690 -85 334 -94 -123 -425 -85 228 132 -194 -206 123 287 378 92 -196 -129 -96 128 95 -53 -336 149 69 152
1713 152 23 -203 -180 -145 6 -37 -223 -140 226 217 2 193 -320 62 183 17 -46 -187 -172 339 94 -6 -195
1736 -195 -429 107 301 -128 -197 -74 -384 105 138 -38 -114 -54 164 162 -155 -386 -328 38 18 4 -166 -226 138
1759 138 85 54 -92 -111 -312 49 268 -97 32 -310 -34 1 95 -90 -18 -23 -8 181 -470 -356 -188 77 292
1782 292 34 258 -257 133 128 258 171 -238 12 49 182 -152 -104 -173 -86 -288 204 -63 -280 -133 -38 99 136
1805 136 -245 -60 26 229 76 -136 -26 -5 94 -55 182 46 -29 61 178 113 -158 74 -82 -3 106 -11
1827 -11 -371 -265 -61 -47 83 -34 42 -114 185 -105 66 -332 7 137 76 -75 -250 60 28 -200 -172 -288
1849 -288 73 179 -103 133 -66 -186 -94 414 111 -120 -295 -180 -155 -90 -246 134 104 71 227 -97 -233 -254
1871 -254 166 258 -57 4 -68 -3 202 73 -3 -270 151 125 88 133 0 -326 44 -28 86 -39 -148 -117 -99 -67
1895 -67 -148 -121 51 1 -71 -12 -43 24 -89 16 -94 -131 -51 -14 38 54 73 -46 -11 22 52 246 -55 -33 -68 110
1921 110 -21 -85 -97 80 123 270 105 102 21 -133 6 54 -171 -288 85 9 217 28 104 -90 -19 143 -106
1944 -106 -336 -40 55 271 211 -97 59 -15 -51 88 -108 -139 -123 220 271 74 -97 -253 -46 235 122 259
1966 259 -115 6 -24 -36 -100 -93 -133 -224 83 -194 -50 -157 18 20 -39 -104 -13 -136 254 194 2 -58 -162 37 257
1991 257 -345 70 33 79 -46 85 -20 54 102 -87 333 82 -40 -76 -166 300 7 3 90 -107 166 10 249
2014 249 -123 -179 -72 -70 -69 11 84 -70 -59 36 -122 50 -255 -21 278 104 -58 -333 358 228 146 144 -239 -234 -124
2039 -124 45 -244 62 -141 29 -160 114 -185 -95 -83 33 36 -213 -50 185 77 -108 78 -182 -108 -95 -114
2061 -114 -129 -181 -181 387 40 -246 -227 -18 -38 -107 103 -105 -189 51 178 131 -57 73 -95 -44 -124 -168 146 -15
2085 -15 0 -78 121 150 -42 -247 -71 154 146 -146 -128 15 97 38 117 -313 43 16 93 76 104 117 61 70 247 -118
2111 -118 -203 -68 101 42 71 20 -105 -116 36 124 -146 -65 -171 -97 249 3 -52 54 47 326 109 -182 -196 -46
2135 -46 67 44 -160 -62 15 -175 -111 134 213 30 252 43 125 -259 -234 -107 209 -157 -73 -8 -156 105 96 64
2159 64 -87 0 96 87 -97 -102 167 1 173 106 -50 -21 -122 54 -49 22 -102 111 117 -24 241 -152 -176 226
2183 226 -90 240 -9 -192 -74 -295 -31 -30 53 137 -76 152 -143 -46 -98 -85 185 182 39 -183 -264 56 77 5
2207 5 -166 -273 192 22 0 91 -182 -369 210 2 -130 -52 18 12 -77 22 -125 68 -132 4 -12 47 -90 2
2231 2 12 366 73 -200 95 157 47 24 46 -74 86 -3 -53 -83 -21 62 -213 55 -81 -39 -364 -234 -6 96
2255 96 -96 47 30 -94 92 109 -93 -73 13 -212 -246 -110 152 80 -59 -8 -218 -139 -122 81 -143 -57 -178 -168
2279 -168 89 22 -141 -23 -44 233 107 0 -272 49 212 -136 -29 -92 -30 15 -14 5 -57 -195 13 146 43
2302 43 -14 -192 -90 -5 -28 -131 36 70 255 -32 5 -104 55 -27 118 -189 161 75 -187 -66 183 -81 186
2325 186 -12 -107 21 66 27 -83 44 127 152 88 -206 -115 187 -50 148 41 116 -226 115 200 36 291 -33
2348 -33 -95 95 580 -83 2 -74 -38 -19 77 -153 -175 182 89 241 106 -235 129 135 14 19 -45 36 108 208 7
2373 7 136 -199 -114 45 170 -55 -13 -126 -147 -172 207 -385 -150 265 107 -179 -79 13 -32 -8 8 148 -104
2396 -104 194 -33 79 204 25 220 -66 -2 95 -249 -9 -157 198 -39 -13 26 40 -24 -56 196 -171 178
2418 178 208 66 120 106 40 47 -176 92 -63 -213 -206 103 -12 205 -142 -28 155 279 -125 113 -67 157 -87
2441 -87 -294 -204 -60 -140 36 49 -159 214 -120 -79 165 -81 280 -57 -239 170 -166 -18 -2 -52 256 76
2463 76 54 -148 -137 -75 66 116 -163 -236 -126 -150 -81 89 -383 78 -90 138 119 -229 13 150 -30 22 181
2486 181 159 -53 169 66 -29 121 22 177 139 -93 -165 -137 -14 133 -20 -92 -249 -178 90 -28 -105 -57 -57 0
2510 0 68 27 -42 16 -190 -1 298 -13 203 -189 247 112 141 -63 -93 144 -247 143 38 -58 -160 137 73
2533 73 317 104 336 241 -93 236 -182 10 73 -75 -176 -20 -220 104 -78 19 -58 147 25 -100 -30 6
2555 6 23 100 -7 -343 9 -221 -135 -69 146 -93 -97 19 -91 55 46 -159 -54 142 -153 117 113 132 -246 -34
2579 -34 -24 111 234 -34 -20 -36 -137 232 -44 116 201 -84 -68 112 -109 -183 459 38 226 -138 -116 -35 -86
2602 -86 173 -174 242 -27 146 175 171 157 91 167 185 -149 -25 -1 -63 -8 -38 150 -258 -36 -185 -191 -33 -209 -13
2627 -13 -85 123 124 17 20 87 46 35 122 11 -143 -6 -224 -215 -103 -18 59 -109 -123 -143 197 -131 114 -176 -152 -98
2653 -98 127 57 189 -347 -69 -179 46 78 106 -157 -302 192 -2 43 45 -25 -25 -34 -142 -234 -64 141 -106 83
2677 83 70 -115 90 60 42 -48 24 -91 -225 -57 -26 245 97 -13 201 -127 71 -110 -34 -49 45 -137 -1
2700 -1 -51 -14 16 20 66 -20 -284 -126 225 -91 194 37 58 -76 -170 -199 195 -52 87 70 38 -195 42 -127 -199
2725 -199 123 63 151 -70 -262 -42 343 37 -142 180 261 -37 -111 48 -212 212 -117 -44 66 -44 181 58
2747 58 262 -308 81 80 -77 39 -20 36 -16 367 142 72 219 26 -46 -19 208 -77 -221 -44 220 139 125 -78
2771 -78 -169 -89 133 298 -203 -47 161 18 34 -41 -88 130 -291 -108 -92 2 -186 22 -253 -68 -56 59 -115
2794 -115 110 69 -84 228 101 28 -213 -62 -231 254 77 23 35 69 -71 55 -123 108 -245 32 33 -27 228
2817 228 -73 43 170 147 192 34 372 237 195 100 94 -493 111 201 -82 -155 -42 97 -144 -38 105 -141 -232
2840 -232 145 179 -3 51 55 -18 -207 -174 138 -24 -257 -69 -81 -313 124 255 235 162 74 71 -95 54 174 230
2864 230 -228 -43 114 -97 4 -55 -127 -272 -12 -58 328 136 258 -237 6 -63 -68 73 52 -174 146 -115
2886 -115 -82 43 -187 49 120 50 135 107 -169 138 109 -9 -76 -111 -49 126 -67 53 -100 -96 -20 51 -220 -7
2910 -7 42 18 -78 262 -18 -183 123 -33 187 164 23 -267 11 -50 69 103 34 -67 17 -34 -198 90 -49 56
2934 56 -6 214 74 168 65 164 -133 -15 -198 89 270 -50 76 -49 -99 161 94 -210 -96 -8 65 -125 37
2957 37 72 84 75 -49 50 49 -124 116 74 -15 -232 -12 32 -64 44 -108 42 205 57 -92 171 -151 3 246
2981 246 -87 114 -207 175 -4 276 2 129 -160 -137 40 -50 -29 49 -136 35 214 95 14 -361 -154 15
3003 15 50 -268 -205 -128 168 129 -59 25 -135 110 84 -91 -31 64 130 -4 -85 -159 -62 -239 -25 -138 -254 -64
3027 -64 99 -117 -281 -14 -15 117 125 64 -66 -132 -126 -53 84 -138 -19 17 -89 197 -92 402 327 -167 65 -121
3051 -121 -184 39 -116 50 181 157 13 13 99 -27 -51 -114 -43 -152 11 -42 -47 139 54 208 126 2 66 -76 -248
3076 -248 23 16 -89 -40 28 204 128 143 -242 -302 -38 3 -1 18 47 231 -26 19 -124 -101 263 -243 52 -177 21
3101 21 95 -227 46 59 -105 118 81 77 -109 -12 236 40 -236 -27 -32 6 -268 -330 -103 66 -107 -107 -49 -226 180
3126 180 150 -157 -32 -114 152 124 -31 30 -6 -142 -87 87 -139 -106 -118 102 74 54 -97 -20 208 182 68 -196
3150 -196 -84 -352 20 117 108 -120 -87 210 48 53 -133 -158 -4 51 116 257 -17 241 -12 54 -236 220 13
3173 13 -177 -101 -144 142 117 26 -98 -70 -20 78 -27 -161 34 -24 -396 -53 -247 144 186 143 -126 30 -103 -104
3197 -104 24 -17 -67 -197 -34 -88 6 162 120 -129 162 29 19 -14 34 224 160 182 -181 118 18 44 92 -77
3221 -77 165 116 49 -125 -30 54 -34 -188 -70 -53 -45 45 -312 -28 -73 -80 66 190 -405 21 92 -240 133 -351 -233
3246 -233 -77 -11 -56 -93 -160 -84 41 -141 -50 -100 133 -102 137 -22 31 -172 241 -251 -30 -130 -130 96 191 -95
3270 -95 74 113 227 262 -95 -183 -49 18 127 -14 -87 47 157 -147 -241 -248 -156 104 123 176 145 221 -59 93 -138
3295 -138 27 -88 159 334 160 39 -187 260 -80 -436 -184 113 199 65 104 -43 -41 -40 16 -145 -207 -103 39
3318 39 -82 106 74 -90 185 36 298 19 63 -36 -213 83 63 -139 24 -237 14 46 16 -85 -239 -197 -22
3341 -22 -216 143 72 -107 -83 -71 -105 50 -222 -95 -10 -46 -215 -197 141 121 -61 0 48 50 233 -111 319 5
3365 5 -239 273 267 -90 194 325 -60 14 19 55 116 -287 -19 -92 3 8 -11 -1 120 186 -185 -7 -121 -84 2 -80
3391 -80 156 -142 -28 168 59 171 -252 -168 60 71 -31 3 274 -82 -18 -29 83 170 -4 28 -163 140 -33
3414 -33 178 -5 -245 21 -129 -131 -137 140 79 -149 85 6 -215 -283 -3 -87 -224 -50 -39 -131 -97 137 123 60 171
3439 171 22 -138 -5 264 166 43 -86 -120 265 -258 257 176 67 10 -126 -80 -143 40 -111 -166 16 -27 100
3462 100 66 -107 -69 237 -31 -19 -92 -212 -160 48 -151 -181 76 -245 212 116 54 -1 151 -17 105 148 -39
3485 -39 -93 80 22 62 -4 119 46 102 -41 -18 -297 -84 214 107 199 31 67 31 -128 -97 2 273 -5 -173
3509 -173 44 238 261 -71 230 -266 -39 -76 20 -393 -95 134 -43 56 -14 -21 -1 -98 66 -11 217 160 206 264
3533 264 137 -207 140 -228 131 38 84 91 -169 -51 37 227 -117 -85 -88 43 200 -85 89 -151 101 21 -42
3556 -42 -133 -230 70 -249 119 -45 303 31 79 -30 64 -92 -52 -7 -19 5 18 -126 -78 260 152 -66 -157 54
3580 54 112 -151 180 44 -16 -15 -24 133 -42 -22 -20 -93 23 40 -16 -90 46 100 44 76 -257 213 -44 77 -22 -160
3606 -160 -162 101 136 31 -10 -37 99 46 -112 -111 -17 134 130 73 -55 -11 105 -97 160 -59 156 -83 -18 142 -24
3631 -24 -85 1 -91 -27 74 -87 -95 -105 37 -1 121 148 -189 -170 -20 -235 -243 71 -57 -99 -276 60 -189 186 -47
3656 -47 282 129 -20 -137 -96 185 35 -46 -82 138 -11 100 225 -128 99 284 -185 1 -9 25 70 -199
3678 -199 -65 -62 -251 118 148 122 -47 34 -56 -50 -110 0 -69 105 -4 -180 -110 88 147 10 155 17 -107 -78
3702 -78 55 -165 -115 -30 -53 -64 21 90 111 -153 -273 122 122 -99 152 210 -63 23 -85 64 49 -107 289 33
3726 33 4 138 22 -140 -95 35 -220 4 -256 52 68 -124 255 -82 157 -327 98 -12 -4 142 157 91 143
3749 143 169 79 -92 -96 -34 40 186 -162 -172 -100 -101 143 -20 219 -90 -144 -385 277 207 137 -58 146 -112 53
3773 53 78 -52 104 124 -111 55 66 63 201 47 142 -130 -311 -87 112 -255 44 -39 128 2 -23 -54 -80 78
3797 78 24 -148 -54 5 -43 -97 -44 176 109 -26 -79 132 84 120 189 -15 112 144 -98 84 -38 130 65 99 -231
3822 -231 24 -189 -109 -38 225 125 124 -239 195 -65 63 37 -176 52 37 -78 49 26 255 174 -115 73 -365
3845 -365 -145 -175 32 -171 16 38 -106 -125 -81 -57 -39 135 140 84 -72 52 -113 -42 122 -8 168 -147 -20
3868 -20 -208 7 -179 9 -45 147 -125 -141 -135 83 259 165 228 -132 191 -27 -34 114 -78 -55 92 -85 -156 -242
3892 -242 92 -31 5 -219 -221 259 -13 18 -71 149 127 193 216 74 183 190 -53 68 100 34 34 64 86 -164 10
3917 10 61 -189 28 -28 134 157 -65 -107 336 15 122 177 109 77 -22 -276 -114 3 187 196 -132 -275 -294 8
3941 8 36 -33 -13 -98 62 75 8 206 4 166 -4 117 39 69 -81 46 2 -163 -32 -107 56 17 217 -218
3965 -218 58 193 41 281 146 366 4 -161 29 33 -67 59 -228 -93 91 102 -178 101 -19 -135 -98
3986 -98 -94 -42 22 -112 49 -152 -284 18 -90 -348 -118 61 -137 -40 10 36 106 20 78 -44 -112 318 164 21
4010 21 -4 -54 -32 -108 -84 74 -4 -111 29 117 -201 -64 -333 -53 -31 38 92 -117 20 -158 138 85 15 10 -138
4035 -138 -39 -213 146 -95 114 -47 -194 -85 -91 151 326 186 143 -37 -74 -59 -110 -103 123 85 268 -39 25 -364
4059 -364 3 439 -83 -245 -14 76 64 95 231 86 -20 -111 -208 142 27 245 52 -114 30 292 178 129
4081 129 -12 49 -53 -15 118 -14 132 70 -33 71 164 43 -287 177 65 68 15 -121 -33 38 -166 -119 102
4104 102 116 47 104 101 -199 135 -49 -60 -5 191 -156 90 127 86 54 -84 14 64 101 -201 -84 -184 165 192 -118
4129 -118 -84 79 -191 123 2 -187 9 9 131 9 113 -163 -48 104 -51 -137 -46 39 -163 141 85 -124
4151 -124 -147 131 65 11 -32 -24 -36 -44 71 343 -37 -236 -11 139 -6 41 66 308 235 150 23 63 -133 -214 46
4176 46 176 -80 78 -308 -92 249 54 60 -260 125 256 -24 -196 99 -134 -23 -163 161 -8 -252 -138
4197 -138 138 1 -19 -119 176 263 -31 -12 -186 -113 -72 105 -68 -93 1 -23 -226 -39 -59 77 -104 -179 40
4220 40 98 4 -83 -195 246 36 43 -73 150 184 -151 23 -79 -40 -10 -84 34 0 140 -6 -110 352 15 -167
4244 -167 144 -101 156 70 -123 -52 -136 -81 -48 -10 68 111 185 -117 33 43 154 8 115 70 -180 68 89 -258
4268 -258 29 -98 -86 -12 60 96 -58 382 50 227 -328 127 185 4 -23 -55 184 -42 169 -59 36 -45 202
4291 202 54 30 120 -202 -40 12 -79 116 -201 -90 -12 80 -156 -193 95 111 -246 14 -243 -161 -98 -26 3 -94
4315 -94 67 -50 -202 -53 -170 22 -47 -109 -44 -43 73 -70 -34 87 2 53 -327 109 250 -150 -20 8 -25 119
4339 119 18 37 171 -272 164 -159 -23 130 -142 -32 -54 -99 -19 -6 12 -194 65 116 -36 17 -120 46 -48
4362 -48 -181 82 146 -53 126 129 340 134 -195 130 -45 -4 45 35 86 104 17 143 -46 -31 -91 -32 132 -147
4386 -147 -97 365 5 18 -112 112 219 -292 -84 5 -17 39 82 20 -24 -4 160 12 6 200 66 60 145 8 -58
4411 -58 31 44 104 -136 -244 -27 50 -72 -81 -295 -270 66 116 -104 -253 10 -1 182 -20 -142 -112 -321 145 84
4435 84 -45 -375 -281 -63 -163 244 288 306 47 261 16 -150 -35 196 -197 71 34 -253 -40 -215 -368 -43
4457 -43 68 166 114 -196 -67 -73 -48 -101 9 -2 160 26 65 -59 -85 61 186 228 -101 231 -24 46 417 -37
4481 -37 -15 -1 204 153 94 -57 92 10 -125 -28 -139 241 45 -110 -186 -82 -105 -63 33 -131 -112 -69 180 56
4505 56 90 -30 -84 29 -10 112 -10 -140 7 -463 -79 -100 181 -224 413 -44 -49 -95 57 -62 -25 -32 -134 157
4529 157 -21 122 -38 -112 8 -192 -77 104 -298 291 2 -121 77 -328 -80 -34 -103 -200 10 -128 -77 -13
4551 -13 -76 -78 90 -110 29 -10 -47 64 178 60 -69 134 147 -49 -176 192 -147 -58 66 -206 -28 86 101
4574 101 198 53 -13 366 -35 125 222 63 0 21 -94 134 277 -217 -95 18 20 -188 335 53 230 123
4596 123 -152 115 206 -180 -73 -241 -134 41 -73 -213 50 -197 19 -25 187 13 -83 -146 -180 -128 81 123
4618 123 -193 44 -15 97 -16 -142 -38 186 -160 -205 -36 -79 -70 35 -216 76 62 112 -198 -114 -136 52 183
4641 183 113 232 -106 96 -33 -186 -88 69 147 135 71 -84 -112 -103 229 138 -51 147 181 -252 85 -212 -82
4664 -82 -251 56 70 -140 253 -118 -37 156 9 -27 -77 208 -62 -62 37 -58 49 -61 -59 -115 191 -71 -112 124
4688 124 4 -4 58 -9 -205 196 64 -125 108 -87 154 32 -203 -136 -85 -113 -60 34 34 -58 207 120 -123 168
4712 168 160 -201 -95 78 -242 6 86 -116 11 -150 -265 -215 354 -28 -199 49 -23 276 -202 -21 -225 -262
4734 -262 -158 -193 -412 -27 51 367 -54 110 -153 -139 -113 -191 -242 -58 60 -49 -9 100 179 -50 -79 75 -86
4757 -86 137 -92 64 -121 51 -108 -16 -190 -4 -101 239 -102 -1 -73 -158 190 105 -3 -150 -1 30 79 -11
4780 -11 35 299 276 -84 176 -172 -206 -34 -86 -120 65 145 41 -245 214 53 123 -117 117 136 193 -59 58
4803 58 -117 160 -86 -170 -48 153 170 -39 -297 -82 126 -195 50 158 -98 -89 -197 76 180 -122 132 -152
4825 -152 102 -182 -159 -48 263 -48 -282 -197 298 -79 -141 11 264 -31 171 69 5 194 -23 164 -219
4846 -219 38 132 67 4 -87 -147 -27 113 -108 -148 -27 -38 -194 61 270 -196 -254 14 42 377 -133 -130 -7 -197
4870 -197 6 302 138 299 119 34 42 -77 -219 248 26 -242 -19 -266 -298 7 -22 -111 -270 -139 39 -80
4892 -80 65 -116 -73 -288 128 -201 -69 127 -124 -11 274 87 -248 313 -19 -40 121 81 101 -83 66 -11
4914 -11 105 60 61 129 74 -54 141 -22 196 -128 27 -148 -183 237 19 126 0 -68 -205 96 -128 234 -3
4937 -3 69 -55 -126 109 -334 -33 225 -15 -26 98 -342 -235 169 35 -151 -122 -146 -6 181 -53 78 38 -64
4960 -64 -19 -52 -68 -67 75 -18 41 141 43 105 183 67 308 1 105 43 61 -115 254 122 22 -37 28 -199 93
4985 93 17 -168 238 -121 -50 -412 5 128 -96 -66 -91 -108 -149 173 82 230 40 120 355 -395 32 -68 65
5008 65 262 -39 -214 -91 -237 247 156 -29 -60 -14 -156 283 48 -329 -67 196 -22 81 199 191 -101 -213
5030 -213 24 -66 -94 -164 -181 -138 28 -106 163 69 34 -31 -83 -15 390 189 -61 -115 7 116 50 87 -200 131
5054 131 159 180 -33 -42 -103 -100 81 -216 163 -76 34 -145 181 -33 129 -52 -66 -182 -151 42 -20 -47 -41 164
5078 164 -64 145 -223 -48 5 -19 -92 143 -131 33 -259 -128 122 -18 276 208 -217 -50 -16 150 104 39
5100 39 17 -231 298 253 114 160 -74 128 51 308 61 183 134 92 -3 -134 95 -68 48 -144 -41 187 181
5123 181 -236 -45 -241 124 76 -178 -123 -19 33 117 36 259 35 -143 -80 16 -53 129 88 4 -28 171 -33 -154
5147 -154 143 -75 -138 287 11 -66 11 -23 -105 -17 59 211 -23 117 -24 10 253 25 53 0 -108 -95 7 -163
5171 -163 -43 -113 -175 -207 140 206 187 -6 140 -141 22 124 212 -19 -172 -227 72 -5 -11 -29 -1 132 183 181 81
5196 81 309 -60 34 72 41 165 -144 99 0 -14 144 174 -26 -143 -40 -174 211 -13 46 241 -20 253 -47
5219 -47 111 -8 -231 222 124 -129 11 213 71 39 -105 -123 -359 -67 90 -121 128 71 21 -270 -74 -5
5241 -5 82 -54 141 147 45 374 -195 -166 324 102 -338 -236 -40 -43 38 -20 176 234 57 44 -106 157 115 37 44
5266 44 270 -143 -21 -60 27 -34 42 46 53 -96 197 3 -40 182 -98 -150 -119 121 32 250 -122 179 -62 145
5290 145 150 -383 -214 93 -104 27 -156 8 8 -1 -7 11 -202 -237 -46 96 138 98 -13 174 3 77 -12 24 7
5315 7 -94 -12 -133 147 -130 -119 -45 9 82 279 -1 44 10 -320 4 9 -46 88 -129 -207 -42 47 192 117 -57
5340 -57 -98 212 95 130 -96 -41 121 -149 -119 124 57 -51 -84 -59 -277 36 -32 -4 -12 -182 -171 -39 88 1 241
5365 241 -3 -15 -113 141 -58 75 259 177 -332 -74 80 46 2 266 63 207 98 -118 35 -25 235 -100
5387 -100 -47 194 31 86 61 23 245 -5 -47 -119 -101 -102 43 -84 -126 -59 17 -124 -69 137 -394 123 0 -75 -92
5412 -92 -97 -2 15 257 52 -178 -57 180 240 46 -72 -41 -113 -2 16 55 -321 16 92 122 34 -19 -261 25 111
5437 111 128 9 112 -153 10 -18 53 90 152 -42 -77 -257 24 351 -51 126 -80 -196 -215 224 303 -159 128
5460 128 332 -110 57 -45 374 -30 -2 -17 -226 -36 28 200 100 27 209 158 -252 -139 24 -56 53 -49
5482 -49 160 -256 -46 -176 -56 2 77 -111 82 -26 -250 62 -213 -62 65 217 -138 21 158 -8 46
5503 46 -60 166 -183 5 -2 -122 244 194 102 -150 -63 -71 155 31 -142 -154 52 -24 -330 45 -140 -57 60 -225
5527 -225 2 -98 52 -6 -176 -109 344 -92 231 -17 -157 169 107 -143 50 69 83 -5 -189 -32 170 75
5549 75 44 -214 -52 233 -13 85 25 5 -11 230 -352 94 -116 51 10 -396 -49 -87 -36 41 -136 -312 183
5572 183 -40 48 58 -41 -133 -123 274 33 -106 -171 257 -25 37 252 -123 78 -175 100 -282 -155 -4 -88 -72
5595 -72 -26 174 -110 -236 143 67 216 295 -95 172 -107 131 -47 275 -140 194 140 -107 57 -46 41 73
5617 73 -235 197 111 -33 81 -72 -53 -152 -130 -226 -99 163 101 39 48 -99 -73 75 53 76 6 -115 -59 2 77 -17
5643 -17 -180 2 -26 79 55 -42 -120 142 -215 221 -101 -140 -127 -40 -40 8 287 111 -131 -84 192 69 147 -171
5667 -171 50 -1 51 -136 227 44 58 117 -16 68 96 8 122 -47 117 -101 -181 -98 101 -44 -184 -56 164
5690 164 -200 21 3 -179 -103 -41 38 185 4 -14 -1 -11 19 290 -63 -151 98 -332 138 -75 150 96 367
5713 367 34 -53 47 142 -34 146 -15 -36 71 -226 -130 4 59 97 110 -10 -149 95 -191 22 -96 -171 197
5736 197 -18 188 96 -19 -192 50 -296 -219 70 5 65 193 -367 119 -166 -336 -266 47 -148 337 -125 85
5758 85 112 0 -129 -3 259 -144 -28 352 -31 -124 203 -243 -271 -128 255 -61 -6 54 4 33 56 2 30 -51
5782 -51 91 -77 -36 134 58 135 89 17 -186 264 -114 309 183 95 226 -49 241 81 -96 90 299 -238
5804 -238 91 70 94 -114 75 145 -152 -172 -26 28 193 247 -45 96 244 -145 -10 6 0 117 19 -227 -78
5827 -78 108 -91 50 57 53 121 -3 -23 -30 -33 -210 -13 21 -125 167 -164 3 127 12 -68 120 -43 102 71 -101
5852 -101 -374 -341 311 -104 105 -196 125 -20 161 41 59 98 22 145 273 59 25 0 -139 0 -83 15 -76
5875 -76 37 -61 97 -44 27 -231 -140 4 36 38 -138 91 124 -278 -206 -115 31 19 -116 -231 -128 -255 120 -177
5899 -177 25 121 -144 -18 27 114 83 -241 129 -58 -114 -65 104 195 -167 -16 -176 -14 7 54 -50 170 -141
5922 -141 117 -124 -156 -131 208 -222 -281 250 -165 238 87 255 -48 -44 -32 -14 -136 -45 145 -200 89 -25 243
5945 243 91 -34 -104 -71 0 80 -67 -224 254 56 19 43 -46 116 -215 142 -11 228 240 59 -108 -172 -103
5968 -103 -323 -264 48 -36 -198 115 118 230 -246 -82 96 -208 -126 -105 -70 75 59 32 1 71 -118 -121 39 20 -176
5993 -176 99 69 -59 -168 25 59 -59 -79 299 -229 -114 -49 -32 202 -216 -125 -130 -149 -140 -84 -59 177 -54 269
6017 269 12 -164 -170 236 2 302 159 8 75 44 -121 -120 -19 61 147 109 100 -43 -276 -218 64 -16 72 14 133
6042 133 -262 128 -411 -29 0 92 -13 -6 23 154 -364 -103 267 114 147 -77 129 -30 160 -15 -32 -31 -11
6065 -11 160 262 -35 57 33 133 28 -89 -130 -249 -50 119 88 346 90 65 -102 -74 -32 249 -9 185 -90
6088 -90 -33 115 -9 -318 -173 258 -255 83 40 221 -123 43 -207 -291 -12 -158 -194 333 -69 -50 -137 -8
6110 -8 -79 106 51 -147 -13 16 -56 -190 104 -19 67 -68 90 -28 -14 -82 71 -27 -79 21 -149 19 22 -16 -273
6135 -273 -386 79 -128 55 37 -192 -29 81 9 87 25 -99 -81 -59 45 182 20 111 218 -78 -18 61 -112
6158 -112 8 -23 47 69 95 -109 74 356 -34 -185 -36 38 -106 98 223 163 -122 110 -34 200 -19 3
6180 3 -77 -125 35 40 116 33 111 89 90 85 -150 4 24 -135 153 -170 -21 -358 -154 83 149 203 -66 -173 250 62
6206 62 -61 -42 65 136 -110 172 -217 44 165 -114 -117 -159 -65 75 -237 2 -215 -212 107 -10 88 213 -46
6229 -46 106 186 -30 87 -212 -19 -141 -36 -44 207 144 112 46 45 147 35 -162 -72 115 111 -48 16 179 -162
6253 -162 -12 -73 -94 -37 -38 116 -97 -120 220 -231 80 -157 -48 9 132 144 -314 207 246 163 -105 87 103 -22
6277 -22 227 -62 -8 42 -36 123 125 245 40 -188 -214 178 21 9 -131 74 -74 276 -45 -31 -164 377 243
6300 243 -123 -100 55 175 330 -35 -59 -48 310 -127 -60 11 -26 361 67 -177 -209 -84 -160 69 -34 148 91
6323 91 41 268 46 -253 31 54 -25 148 159 255 -219 78 188 -81 -89 -26 279 163 -148 -96 -90 -235 125 -43
6347 -43 64 -82 -98 -108 -59 81 142 52 -95 122 -40 -117 -94 -50 26 231 106 -8 19 -145 -39 -92 212 -53
6371 -53 -85 207 -122 -129 219 -3 -10 218 -25 4 105 185 -15 169 27 -109 23 -95 -309 243 -104 -21 25
6394 25 166 -104 -81 155 -19 82 121 178 219 -12 -54 -138 -1 -57 -168 145 109 50 225 -105 51 66 53 -41
6418 -41 68 -94 -15 128 -215 -38 -3 271 53 156 179 120 404 -152 -87 166 -184 -58 -83 199 140 144 -7
6441 -7 -83 77 12 7 -134 117 -137 -27 -97 135 219 178 -24 -58 1 21 28 227 -194 -54 -1 -88 1 -180 122 44
6467 44 -380 55 151 101 -228 -100 44 95 -70 163 37 201 14 -70 80 -121 -160 187 122 197 135 -88 106
6490 106 -49 -166 -4 -41 215 78 -160 140 -200 100 -100 80 117 85 201 -129 6 -114 -150 -32 184
6511 184 77 -111 295 123 187 -33 -15 350 -33 -56 262 -133 -123 121 56 73 78 56 -20 -190 -270 -68 -274 -82
6535 -82 -39 52 48 -118 91 -143 75 -157 23 82 309 122 47 266 -5 101 -67 -192 123 -129 -97 -39 22
6558 22 57 -57 -21 72 -117 165 167 50 -305 -151 14 -88 111 -31 -27 10 59 28 3 223 49 109 -78 -178
6582 -178 32 228 -21 51 -134 120 -31 14 -106 -52 160 -155 73 110 10 264 78 172 13 -98 26 83
6604 83 -2 94 -68 139 34 15 21 -55 202 82 203 -157 121 2 -26 -174 -140 -246 -344 25 95 -53 -92 -217
6628 -217 -36 127 -57 10 -35 117 133 -106 82 53 -167 252 -12 11 119 -338 71 88 -183 138 188 -150
6650 -150 69 141 -85 102 221 -175 -187 -25 -136 -49 0 122 -159 235 186 -107 -88 -54 -47 -107 -40 49 80 89 -164
6675 -164 75 -131 86 -23 52 62 -74 20 136 -221 32 -49 45 -182 269 211 106 -216 -264 -200 -34 -146 -84
6698 -84 298 -202 108 250 55 -128 48 54 220 64 230 295 80 124 -44 -10 -128 178 -18 -52 -50 -22 184
6721 184 -225 -73 -313 107 -258 -84 -251 -21 79 -120 -93 73 146 128 -141 79 -82 30 16 -230 -323 75
6743 75 -230 227 -124 159 17 65 -85 67 -98 -270 111 -165 182 141 -354 37 174 285 -183 -231 4
6764 4 79 54 -129 229 14 -90 -70 -62 249 -117 -19 37 -119 16 -231 35 90 95 68 -76 112 173 -165 12 -35
6789 -35 -138 -181 256 -127 52 -108 -65 15 50 -270 -74 -71 -101 121 -51 32 39 -32 41 161 305 45 -9 164 55
6814 55 60 -8 69 157 -54 -116 91 249 -179 106 -86 -56 186 -90 36 -185 -98 -36 42 -80 127 70 42 111 121
6839 121 -71 -63 258 -64 29 -24 0 -97 -114 -290 132 -20 20 155 95 -248 -54 4 89 -4 9 -20 17 -26 -133
6864 -133 -11 -30 -222 81 -86 -105 74 83 -93 42 16 -29 -106 27 -52 -113 109 25 155 -226 74 21 12 18 -14
6889 -14 123 53 -195 -75 238 -32 -215 -176 217 -51 257 71 144 -164 9 130 168 -138 208 -13 107 -40
6911 -40 36 67 -38 -126 -37 153 49 29 42 9 -23 -246 -19 -15 98 97 -231 -182 -66 -113 -73 336 -101 42 202
6936 202 -57 -76 69 23 195 -134 33 49 62 70 -90 -145 -216 -27 -146 -31 6 250 -79 7 37 -234 81 -126
6960 -126 -111 104 27 -83 292 -186 29 -107 -197 -238 307 33 -89 62 221 -17 29 190 199 100 -38 -213 -29
6983 -29 32 -45 204 71 284 -178 48 -111 43 -149 175 -81 50 -36 80 51 18 127 64 193 -47 -336
7005 -336 174 245 105 -50 20 -46 4 161 -209 -80 70 -107 -188 -2 -227 53 -109 136 9 -57 -31 -42 104
7028 104 -58 -33 30 69 307 39 266 194 111 -70 -215 -160 -115 68 -14 -188 79 159 -53 212 59 -222 -105
7051 -105 31 -36 19 -128 14 -75 -143 27 99 -139 14 150 -175 6 -162 220 179 -196 167 71 -11 194 -430
7074 -430 10 151 55 -111 -133 -131 83 155 62 144 58 34 11 3 -197 -53 103 34 14 36 -34 -43 -54 -74 -33 144 35
7101 35 54 -255 255 -183 -275 138 -89 12 138 20 104 -68 0 -96 -225 -73 16 -34 -156 -171 -165 36 -87 56
7125 56 74 -74 74 16 -157 30 -96 -8 122 -148 71 -28 232 122 225 50 36 129 284 -295 48 66 -128
7148 -128 -118 -67 -143 -48 117 264 -340 -247 107 244 34 80 -12 74 77 176 -111 21 -85 -28 13 -201 36 -217
7172 -217 290 17 74 154 6 -16 -29 91 65 109 -23 -29 36 -119 -144 94 108 -276 -11 -55 32 -144 -43 263
7196 263 -145 -64 -62 104 -189 67 55 50 -109 103 -100 112 -82 74 123 -28 5 99 132 -62 64 -25 -68 187
7220 187 -37 5 249 -238 -216 -247 94 -197 -69 197 -69 -59 8 -129 129 12 28 1 -81 -203 76 190 186
7243 186 -210 -52 102 12 -105 -2 117 -162 72 182 192 -72 75 39 -18 81 -87 -104 -46 242 -27 33 11
7266 11 -93 33 36 -128 -232 -274 10 27 129 -73 -31 107 -56 241 -132 -80 -5 -159 -75 -82 -79 70 13 -85 -55
7291 -55 153 -110 -107 -113 -185 434 -70 100 11 -33 -102 -197 -3 -296 -122 64 82 -31 -11 145 -39 -279 42 -133
7315 -133 248 -55 91 -169 23 -38 -64 -219 203 93 200 52 57 109 -15 31 -11 15 -93 184 -5 -249 -287
7338 -287 151 100 224 134 60 -16 -120 4 161 -24 191 -53 -124 -65 -164 398 -53 19 164 -40 13 -134 -72
7361 -72 -329 45 -99 24 47 350 -122 -105 61 216 127 75 34 280 237 47 -73 -219 -8 -153 217 -104
7383 -104 -8 -250 -19 190 -67 -101 253 -161 -53 -81 65 204 -222 68 29 -198 -256 173 -223 150 29 31
7405 31 73 -133 18 -114 62 147 -104 232 106 -41 194 75 -6 -197 17 25 83 134 -41 82 -58 129 204
7428 204 -44 -12 -122 115 -327 -74 -25 -26 -50 -49 -193 -247 34 20 -101 29 142 -59 131 114 -37 -205 167
7451 167 -123 -108 -175 -155 245 -70 78 110 276 181 -115 362 83 -39 -107 77 -81 14 -24 -103 -53 -29 68 -158
7475 -158 73 -118 -184 -105 -314 156 0 15 -8 143 114 -206 295 2 -9 -87 -6 -97 -201 191 38 2 -45 -86
7499 -86 116 -84 38 -109 158 199 144 -32 -162 -183 -72 47 -151 -149 220 27 52 270 94 -267 20 71 -160
7522 -160 -29 258 145 51 177 -60 -24 153 -282 21 -52 -149 191 185 -97 -76 358 -31 143 31 -128 -164 18
7545 18 -236 -137 -86 -44 3 106 218 96 48 -41 68 -106 -134 -67 -65 -111 -18 81 307 -213 -78 -108 39 -2 -60 -109
7571 -109 -137 -131 -213 -210 -89 38 65 -45 60 -71 6 175 10 -298 -36 -216 -124 -77 24 102 -34 201 -132 161
7595 161 -136 210 65 39 49 246 30 136 288 139 -184 297 206 -96 6 3 131 -270 -121 39 225 -351
7617 -351 78 -22 -231 162 18 14 -77 86 -63 144 54 -44 -84 -24 347 -62 -115 38 130 80 -134 -108 -122 -112
7641 -112 -4 -120 13 189 -46 60 -122 -189 50 72 -144 -245 -80 -18 -11 -193 11 239 -139 101 -1 9
7663 9 -42 -48 99 -70 -81 3 143 105 36 -190 56 58 -36 163 264 -1 185 98 -58 -128 -155 6 -8 72 -17 -199
7689 -199 87 371 319 107 -139 -100 -41 23 110 62 91 -24 -69 -24 -63 -64 -123 79 -83 194 2 -52 44 -30 -60 -84
7715 -84 -166 -40 44 195 286 -135 -26 -42 11 12 79 147 -27 -15 -149 224 89 97 -90 -106 -66 189 -173 -44 64
7740 64 33 34 -99 -82 -15 301 220 19 -105 197 42 76 -59 36 178 75 -47 95 -121 -36 -151 -307 -115
7763 -115 -12 11 180 -270 126 -149 285 71 39 -136 -83 6 194 -41 8 -39 -45 308 -115 -183 31 270 -19
7786 -19 -18 61 342 162 81 -25 136 -5 -180 -189 71 65 -73 -32 113 14 17 -8 -103 80 -120 8 -221 -169 -101 136
7812 136 -244 -180 -81 -102 -5 13 190 152 -53 -82 44 -31 10 199 -77 -91 -312 -159 12 86 -197 -79 94 98
7836 98 20 -81 153 -30 -69 218 -251 18 -387 -41 -50 131 39 174 93 397 66 -121 64 -196 -131 -88 157
7859 157 -67 -163 -111 -124 189 -74 115 -119 -216 5 -112 114 146 -40 -99 71 -8 225 47 99 70 -102 -140
7882 -140 -134 365 -100 -27 -97 -148 269 -200 -39 -146 108 -247 -152 -113 0 34 145 110 82 53 -240 -233 196 151 -144
7907 -144 67 218 187 -66 40 20 -50 44 290 289 -78 126 21 -79 39 98 103 -175 -20 33 -39 -15 59 74 427
7932 427 -155 -75 21 36 15 48 -187 169 -16 -25 86 236 -166 38 -102 -64 196 -143 80 48 -127 -113 -261
7955 -261 123 -43 56 -239 44 -160 155 74 5 76 99 -136 59 87 219 -10 -251 20 -144 113 -158 -248
7977 -248 -67 29 -246 28 -20 -26 95 3 132 185 6 3 -253 -140 -114 22 -94 204 -48 -378 -48 96 -195
8000 -195 -124 316 80 -204 39 36 128 -87 -105 -22 50 304 -58 29 -217 -15 28 -29 -52 30 -96 -134 -179 65 -131
8025 -131 17 -32 -37 246 -168 -142 -91 -42 -8 -97 -26 -158 129 4 152 117 77 -150 -144 -89 19 -233 26 30 134
8050 134 -142 119 96 169 135 -91 -173 -24 -59 -20 -98 -4 181 89 -119 -127 60 -102 -78 -26 -71 249 22 -97 -105
8075 -105 71 102 35 -121 -19 4 -49 -29 -16 28 -4 149 46 -48 -61 165 -29 183 192 -100 127 10 94 23 -7
8100 -7 31 28 -71 -65 126 143 -20 60 106 -195 125 74 -68 43 100 87 -8 -46 -110 -133 98 87 404 -155 -84 -189 -41
8127 -41 0 13 -15 216 27 133 69 131 18 176 -86 106 -131 -219 -156 -98 -221 -23 -89 26 87 -15 -10 41 230
8152 230 -27 16 7 -21 -180 -24 -57 -118 13 -162 -126 141 11 -157 209 216 6 299 -146 -11 -3 -314 19 -104
8176 -104 20 -68 120 44 5 -183 263 19 -33 169 169 5 445 300 88
8191H8
##END NTUPLES=NMR FID
##END=
