##TITLE=1H_DE-61K_d6
 DMSO-d6
 8 sc, 
 10.7.2024
##JCAMPDX= 6.0         $$ Bruker NMR JCAMP-DX V2.0
##DATA TYPE= NMR FID
##DATA CLASS= NTUPLES
##ORIGIN= UXNMR, Bruker Analytische Messtechnik GmbH
##OWNER= root
$$ XWIN-NMR		Version 3.5
$$ Wed Jul 10 14:00:45 2024 Russian Standard Time (UT+4h)  she@DPX200
##.OBSERVE FREQUENCY= 200.1314
##.OBSERVE NUCLEUS= ^1H
##.DELAY= (6, 6)
##.ACQUISITION MODE= SIMULTANEOUS
##.ACQUISITION SCHEME= undefined
##.AVERAGES= 8
##.DIGITISER RES= 18
##SPECTROMETER/DATA SYSTEM= spect
##.PULSE SEQUENCE= zg30
##.SOLVENT NAME= CDCl3
##.SHIFT REFERENCE= (INTERNAL, CDCl3, 0, 15.7039)
##AUDIT TRAIL= $$ (NUMBER, WHEN, WHO, WHERE, WHAT)
$$ ##TITLE= Audit trail, XWIN-NMR		Version 3.5
$$ ##JCAMPDX= 5.01
$$ ##ORIGIN= Bruker BioSpin GmbH
$$ ##OWNER= she
$$ F:/spectra/data/she/nmr/H-F/1/audita.txt
$$ ##AUDIT TRAIL=  $$ (NUMBER, WHEN, WHO, WHERE, WHAT)
(   1,<2024-07-10 13:59:12.14 +0400>,<she>,<DPX200>,
      <created by zg, POWCHK disabled, PULCHK disabled
       configuration hash MD5:
       00 E9 B6 7A A2 85 ED C7 34 08 36 98 17 FE 4E 26
       data hash MD5: 16K
       1B AD CC 94 BF 4A 98 7D F1 DC D1 1A 50 96 9E 57>)
$$ ##END=
$$ 
$$ hash MD5
$$ 03 25 01 F1 3C F9 71 7B A5 86 64 37 7C D7 BC CA
##$RELAX= 
##$RELAX= 
##$RELAX= 
##$RELAX= 
##$RELAX= 
##$RELAX= 
$$ Bruker specific parameters
$$ --------------------------
##$DU= <F:/spectra>
##$EXPNO= 1
##$NAME= <H-F>
##$PROCNO= 1
##$TYPE= <nmr>
##$USER= <she>
##$AMP= (0..31)
100 100 100 100 100 100 100 100 100 100 100 100 100 100 100 100 100 100 
100 100 100 100 100 100 100 100 100 100 100 100 100 100 
##$AQSEQ= 0
##$AQ_mod= 1
##$AUNM= <au_zg>
##$AUTOPOS= <>
##$BF1= 200.13
##$BF2= 200.13
##$BF3= 200.13
##$BF4= 200.13
##$BF5= 200.13
##$BF6= 200.13
##$BF7= 200.13
##$BF8= 200.13
##$BYTORDA= 1
##$CFDGTYP= 0
##$CFRGTYP= 5
##$CHEMSTR= <none>
##$CNST= (0..31)
1 1 145 1 1 1 1 1 1 1 1 1 1 1 1 1 1 1 1 1 1 1 1 1 1 1 1 1 1 1 1 1 
##$CPDPRG= <>
##$CPDPRG1= <>
##$CPDPRG2= <>
##$CPDPRG3= <>
##$CPDPRG4= <mlev>
##$CPDPRG5= <mlev>
##$CPDPRG6= <mlev>
##$CPDPRG7= <mlev>
##$CPDPRG8= <mlev>
##$CPDPRGB= <>
##$CPDPRGT= <>
##$D= (0..31)
0 1.2 0 0 0 0 0 0 0 0.06 0 0.03 0 0 0 0 0.0002 0 0 0 0 0 0 0 0 0 0 0 0 
0 0 0 
##$DATE= 1720605551
##$DBL= (0..7)
120 120 120 120 120 120 120 120 
##$DBP= (0..7)
150 150 150 150 150 150 150 150 
##$DBP07= 0
##$DBPNAM0= <>
##$DBPNAM1= <>
##$DBPNAM2= <>
##$DBPNAM3= <>
##$DBPNAM4= <>
##$DBPNAM5= <>
##$DBPNAM6= <>
##$DBPNAM7= <>
##$DBPOAL= (0..7)
0.5 0.5 0.5 0.5 0.5 0.5 0.5 0.5 
##$DBPOFFS= (0..7)
0 0 0 0 0 0 0 0 
##$DE= 6
##$DECBNUC= <off>
##$DECIM= 24
##$DECNUC= <off>
##$DECSTAT= 4
##$DIGMOD= 1
##$DIGTYP= 9
##$DL= (0..7)
0 120 120 120 120 120 120 120 
##$DP= (0..7)
150 150 150 150 150 150 150 150 
##$DP07= 0
##$DPNAME0= <>
##$DPNAME1= <>
##$DPNAME2= <>
##$DPNAME3= <>
##$DPNAME4= <>
##$DPNAME5= <>
##$DPNAME6= <>
##$DPNAME7= <>
##$DPOAL= (0..7)
0.5 0.5 0.5 0.5 0.5 0.5 0.5 0.5 
##$DPOFFS= (0..7)
0 0 0 0 0 0 0 0 
##$DQDMODE= 0
##$DR= 18
##$DS= 0
##$DSLIST= <SSSSSSSSSSSSSSS>
$$ [...]
##$SUBNAM2= <"">
##$SUBNAM3= <"">
##$SUBNAM4= <"">
##$SUBNAM5= <"">
##$SUBNAM6= <"">
##$SUBNAM7= <"">
##$SUBNAM8= <"">
##$SUBNAM9= <"">
##$SW= 24.0689651099613
##$SWIBOX= (0..15)
0 0 2 0 0 0 0 0 0 0 0 0 0 0 0 0 
##$SW_h= 4816.95568400771
##$TD= 16384
##$TD0= 1
##$TE= 0
##$TE2= 300
##$TE3= 300
##$TEG= 300
##$TL= (0..7)
0 120 120 120 120 120 120 120 
##$TP= (0..7)
150 150 150 150 150 150 150 150 
##$TP07= 0
##$TPNAME0= <>
##$TPNAME1= <>
##$TPNAME2= <>
##$TPNAME3= <>
##$TPNAME4= <>
##$TPNAME5= <>
##$TPNAME6= <>
##$TPNAME7= <>
##$TPOAL= (0..7)
0.5 0.5 0.5 0.5 0.5 0.5 0.5 0.5 
##$TPOFFS= (0..7)
0 0 0 0 0 0 0 0 
##$TUNHIN= 0
##$TUNHOUT= 0
##$TUNXOUT= 0
##$USERA1= <user>
##$USERA2= <user>
##$USERA3= <user>
##$USERA4= <user>
##$USERA5= <user>
##$V9= 5
##$VALIST= <valist>
##$VCLIST= <CCCCCCCCCCCCCCC>
##$VD= 0
##$VDLIST= <DDDDDDDDDDDDDDD>
##$VPLIST= <PPPPPPPPPPPPPPP>
##$VTLIST= <TTTTTTTTTTTTTTT>
##$WBST= 1024
##$WBSW= 4
##$XGAIN= (0..3)
0 0 0 0 
##$XL= 0
##$YL= 0
##$YMAX_a= 151400
##$YMIN_a= -123397
##$ZGOPTNS= <>
##$ZL1= 120
##$ZL2= 120
##$ZL3= 120
##$ZL4= 120
##$ABSF1= 10
##$ABSF2= 0
##$ABSG= 5
##$ABSL= 3
##$ALPHA= 0
##$AQORDER= 0
##$ASSFAC= 0
##$ASSFACI= 0
##$ASSFACX= 0
##$ASSWID= 0
##$AUNMP= <proc_1d>
##$AZFE= 0.1
##$AZFW= 0.1
##$BCFW= 1
##$BC_mod= 2
##$BYTORDP= 1
##$COROFFS= 0
##$CY= 11.3945322036743
##$DATMOD= 1
##$DC= 2
##$DFILT= <>
##$DTYPP= 0
##$F1P= 15.6554695791079
##$F2P= 12.8336369535428
##$FCOR= 0.5
##$FTSIZE= 0
##$FT_mod= 4
##$GAMMA= 1
##$GB= 0.15
##$INTBC= 1
##$INTSCL= 1
##$ISEN= 128
##$LB= 0.24
##$LEV0= 0
##$LPBIN= 0
##$MAXI= 10000
##$MC2= 0
##$MEAN= 0
##$ME_mod= 0
##$MI= 1.114404
##$NCOEF= 0
##$NC_proc= 0
##$NLEV= 6
##$NOISF1= 3.799351
##$NOISF2= 2.8
##$NSP= 1
##$NTH_PI= 0
##$NZP= 0
##$OFFSET= 15.70392
##$PC= 1
##$PHC0= -25663.5
##$PHC1= 2.58748
##$PH_mod= 1
##$PKNL= yes
##$PPARMOD= 0
##$PSCAL= 0
##$PSIGN= 0
##$REVERSE= no
##$SF= 200.130013532006
##$SI= 16384
##$SIGF1= 3
##$SIGF2= 2
##$SINO= 400
##$SIOLD= 16384
##$SREGLST= <1H.CDCl3>
##$SSB= 0
##$STSI= 0
##$STSR= 0
##$SW_p= 3612.71676300578
##$SYMM= 0
##$S_DEV= 0
##$TDeff= 0
##$TDoff= 0
##$TI= <>
##$TILT= no
##$TM1= 0
##$TM2= 0
##$TOPLEV= 0
##$USERP1= <user>
##$USERP2= <user>
##$USERP3= <user>
##$USERP4= <user>
##$USERP5= <user>
##$WDW= 1
##$XDIM= 8192
##$YMAX_p= 0
##$YMIN_p= 0
$$ End of Bruker specific parameters
$$ ---------------------------------
##NTUPLES= NMR FID
##VAR_NAME=  TIME,          FID/REAL,        FID/IMAG
##SYMBOL=    X,             R,               I
##VAR_TYPE=  INDEPENDENT,   DEPENDENT,       DEPENDENT
##VAR_FORM=  AFFN,          ASDF,            ASDF
##VAR_DIM=   8192,          8192,            8192
##UNITS=     SECONDS,       ARBITRARY UNITS, ARBITRARY UNITS
##FACTOR=    0.0002076,     1,               1
##FIRST=     0,             0,               0
##LAST=      1.7004516,     0,               0
##MIN=       0,             -123397,         0
##MAX=       1.7004516,     151400,          0
$$ Real data points
##PAGE= N=1
##DATA TABLE= (X++(R..R)), XYDATA
$$ [...]
1873a201J942Q89j737j70Q30M6j264J104R89j743j056J181L14j079L62J496q77
$$ -1201 741 1630 -107 -277 553 599 -665 439 1428 -315 -1371 -190 124 -955 -593 903 26
1890B6j371J202R32m64r6Q51p62j151N21R72n19q67P38J1j052O8J449L62j251
$$ 26 -1345 -143 789 325 229 1080 318 -833 -312 660 141 -726 12 23 -1029 -961 488 850 -401
1909d01K58Q07o75p11J586N16j424m32M74l55n30J220N65j634n10R50N86p52Q63
$$ -401 -143 664 -11 -722 864 1380 -44 -476 -2 -357 -887 333 898 -736 -1246 -296 290 -462 401
1928D01R37p76j257O24J067j023k55Q11l29j568M91J470p09m01O15j8q99L09J761
$$ 401 1338 562 -695 -71 996 -27 -282 529 200 -1368 -877 593 -116 -517 98 80 -819 -510 1251
1947A251l59j024J35N26r20k08J152L37j375j83N99k95j47J094M73j351m53J157
$$ 1251 892 -132 3 529 -391 -599 553 890 -485 -668 -69 -364 -511 583 1056 -295 -748 409
1965D09K40q40P83M06j250p42N90P26n84M8P71n57j096N26J551p96k21P46l66
$$ 409 649 -191 592 998 -252 -994 -404 322 -262 -214 557 0 -1096 -570 981 185 -36 710 344
1984C44j077M51J387l74j161J79K76q47M8J491k16j193J24Q81l44l87J068K39
$$ 344 -733 -282 1105 731 -430 -251 25 -822 -774 717 501 -692 -568 313 -31 -418 650 889
2002H89j262l06J042J0p38P16L87r47j094J274M20n71K31P44o16r32P22J253r09
$$ 889 -373 -679 363 373 -365 351 738 -209 -1303 -29 391 -180 51 795 179 -753 -31 1222 313
2021C13p80P69j2j021K42J079k52q23J93N76q11J5J051Q1j100J13O58l94k68J271
$$ 313 -467 302 290 -731 -489 590 338 -485 -292 284 -527 -512 539 620 -480 -367 291 -103 -371 900
2041I00j45j157m33P54K85r33P73K03l34r82J437M80p17j65O26o17j024J089P63
$$ 900 755 -402 -835 -81 204 -729 44 247 -87 -1069 368 848 131 -34 592 -25 -1049 40 803
2060H03q85n16O05j93o18N65J000j94j141N56M49q89N7J205j04j205Q2O34m38
$$ 803 -82 -598 7 -186 -804 -239 761 567 -574 -18 431 -458 -401 804 700 -505 -423 211 -227
2079b27l91P21L35j161N5P49N50o40M12J93p78o83R69O25r48O5N35p58q21J142
$$ -227 -618 103 438 -723 -668 81 631 -9 403 596 -182 -865 104 729 -219 -154 381 -377 -1198 -56
2099e6P96p34k43L97j25n87N75P61n60o10J43M43n78K66R84m27j037J20O04k16
$$ -56 740 6 -237 160 35 -552 23 784 224 -386 -243 200 -378 -112 872 445 -592 -472 132 -84
2119h4k41Q27n6j052J16P53k88m1K61K60j164n20J114M11m58J7N24k88o33O34
$$ -84 -325 502 446 -606 -490 263 -25 -66 195 455 -709 -1229 -115 296 -162 -145 379 91 -542 92
2139I2Q22o38l96M48J0r11L54R88n34j096N64K85n28K46J136m53j205N48P35k75
$$ 92 914 276 -120 328 338 -573 -219 769 235 -861 -297 -12 -540 -294 842 389 -816 -268 467 192
2159A92l72O86O3j126K3P72j76k04o9L50l83o65J231K10o03J8M84m71m43Q46K86
$$ 192 -180 506 569 -557 -534 238 62 -142 -211 139 -244 -909 322 532 -71 -53 431 -40 -483 363 649
2180F49o65k21L85k60n54M71Q98n73m96M04J53o53N53O71l59j097J37J102p94
$$ 649 -16 -237 148 -112 -666 -195 703 130 -366 38 191 -462 91 762 403 -694 -557 545 -249
2199b49k09R44J39j378M6R80J80o73N25K76q83j54Q31K19j046N39J31n98l89R23
$$ -249 -458 486 625 -753 -707 273 453 -220 305 581 -302 -456 375 594 -452 87 218 -380 -769 154
2219A54N66j144J8N16n1n28N18P10j067k6L00K46m39M35K22m46r51M80P59j65
$$ 154 720 -424 -406 110 59 -469 49 759 -308 -334 -34 212 -227 208 430 -16 -967 -487 272 107
2239A07j89P67l79q21M83P59n46k44N43k01q13J1J029J54r33J88M56p83j44N86
$$ 107 -82 685 306 -515 -32 727 181 -63 480 279 -534 -523 506 660 -273 -85 371 -412 -556 30
2259C0P44p68n11O53j57l15L98O54r20o47N38L39m94N64N47o73l96J96O48l67
$$ 30 774 6 -505 148 -9 -324 74 728 -192 -839 -301 38 -456 108 655 -18 -414 -218 430 63
2279F3L89m6k00n34J67N81m13l31N44Q3p31k35J140k14l96J76J75m85NO05J66
$$ 63 452 406 206 -328 -161 420 7 -324 220 303 -428 -663 477 263 -133 43 218 -267 -262 343 509
2300E09n58k99L46r1l08N77K53p30o9K40L34n36O32O78j002p25R79J80n56j27
$$ 509 -49 -348 -2 -93 -401 176 429 -301 -370 -130 204 -332 300 978 -24 -749 230 410 -146 -273
2320b73O50n27o65N70P46q6p06L95M30r62Q6R25rq36K01M33o65l1O38L52q91n8
$$ -273 377 -150 -815 -245 501 415 -291 104 534 -428 -342 583 574 -262 -61 372 -293 -324 314 666 -225 -283
2342b83K07mk90N22M00o89j59L34K41j06qK25l75n12M28J24r5r5J74m76N4K56
$$ -283 -76 -80 -370 152 552 -137 -296 38 279 173 165 390 15 -497 -69 55 -40 -135 39 -437 -383 -127
2364a27N91k27k82L05K8r60N60P23m46p62N76K24p27O2Q60Mn27Q8M02m38l20O58
$$ -127 464 237 -45 260 288 -672 -112 611 165 -597 -21 203 -524 -462 398 402 -125 -37 365 -73 -393 265
2386B65K72q86L5L98J04m41M20J58p26o36R99J43L9m66O42n7q40N88N46k72m91
$$ 265 537 -349 -314 84 188 -253 167 325 -401 -1037 -38 105 144 -322 320 263 -577 11 557 285 -206
2407b06L42k44j91P4O97k57p10K70J81J6j05M26n0l65k64O96k88l38M35K51m34
$$ -206 136 -108 -299 -225 472 215 -495 -225 -44 -28 -133 293 243 -122 -386 310 22 -316 119 370 -64
2428f4m48Q85m28j82L61K60l53j91J09M76n91L31L76o29m10O70M19o44m05P62
$$ -64 -512 373 -55 -237 124 384 31 -160 -51 425 -166 165 541 -88 -498 172 591 -53 -458 304
2448C04m58k75K69Q89l02n25J38J88l75o6O16Q1q73k7N72k17j41M88K06o01m70
$$ 304 -154 -429 -160 729 427 -98 40 228 -147 -213 403 484 -389 -416 156 -61 -202 286 492 -109 -579
2469e79P66L91p61O63j17l94n69O93M34l54P8k99J60o13M48L64k55l36J73J40
$$ -579 187 578 -183 480 363 -31 -600 93 527 173 251 -48 112 -501 -53 311 56 -280 -107 33
2489C3l70O28L27k74m43K84J93m00l29M69j99l51J00K74K36k81M83q5o87J21R97
$$ 33 -337 291 618 344 -99 185 378 -22 -351 118 -81 -432 -332 -58 178 -103 380 295 -392 -271 726
2510G26m30o50L38Q09q59m65N20K89l84j33M51j39m87L64O76l24o06L52J41n28
$$ 726 296 -354 -16 793 -66 -531 -11 278 -106 -239 212 73 -414 -50 626 302 -304 48 189 -339
2530c39J95P19n69l59j59N98j40m35P52N3p81J61K56K23l20L42J75n04k79M08
$$ -339 -144 575 6 -353 -512 86 -54 -489 263 316 -465 -304 -48 175 -145 197 372 -132 -411 -3
2550cJ31k91J66j23O2l91N46J16k63l9J70L9j53K27M01o89k62O58m64k59L46K62
$$ -3 128 -163 3 -120 -58 -449 97 213 -50 -89 81 120 -33 194 595 -94 -356 302 -162 -421 -75 187
2572A87k84j79M61J05k32l82Q95k04o79J45M99j78l13L84L73j165L64N40j15m25
$$ 187 -97 -276 185 290 58 -324 571 367 -312 -167 332 154 -159 225 598 -567 -203 337 222 -203
2592b03R8P0j32j16L00N37p31R6M61m61l51L86L90m71j22M80l62q2K17L84l99
$$ -203 -105 -35 -167 -283 17 554 -177 -81 380 -81 -432 -46 344 -127 -249 231 -131 -213 4 388 -11
2613a1l32N56k40r1K33J48m84j45K96J36p8p9M40k49q59K32R58k51l75O40n09
$$ -11 -343 213 -27 -118 115 263 -221 -366 -70 66 -12 -91 349 100 -759 -527 431 180 -195 445 -64
2634f4l02O6P17j95l07k82M64j28n60N64L06o41J30M82J09p01K39O52k46o13M84
$$ -64 -366 -300 417 222 -85 -367 97 -31 -591 -27 279 -362 -232 250 359 -342 -103 549 303 -310 174
2655A74J71l62J2K43k49k03o9N75K0k28J26k4m94K30K52J0l00MK12n11L09N42
$$ 174 345 -17 -5 238 -11 -214 -283 292 312 84 210 186 -308 -78 174 184 -116 -112 100 -411 -102 440
2677D40l69l50K82O0j83m2N59l69j17j66K60k9OJ87J09m41k98N60J93m47J35L94
$$ 440 71 -279 3 63 -120 -162 397 28 -89 -255 5 -24 -18 169 278 -163 -461 99 292 -155 -20 374
2699C74k72m86M02N28n45j40J64K77l79P5J89j9n10L18L92m19l25O12j88l35j9
$$ 374 102 -384 18 546 1 -139 25 302 -77 -2 187 168 -342 -24 368 -51 -376 236 48 -287 -306
2720c06O19n89K4N00jk64l42N69k30O9N4K14l22l60L55K78l19K71p8j00j37j0
$$ -306 313 -276 -252 248 247 -17 -359 210 -20 49 103 317 -5 -365 -10 268 -51 220 142 42 -95 -105
2742a05L08k07M5l5j64j73N98j7jm37L75m1k80J86K75j20n68K57K64l59L62K5
$$ -105 203 -4 41 6 -158 -331 267 250 249 -188 187 146 -134 52 327 207 -361 -104 160 -199 163 188
2764A88j61k53j2M76o14mN59K68o71Q0J50k42J22M5M85l25l61KN48j97m30N32
$$ 188 27 -226 -238 238 -376 -380 179 447 -224 -144 6 -236 -114 -69 416 91 -270 -268 280 83 -347 185
2786A85L4m19p6P20k46m45L94o9m46K33K34J42o6l30Q3R8K43k84L55k24k62K38
$$ 185 219 -200 -276 444 198 -247 147 78 -368 -135 99 241 175 -155 -72 26 269 -15 340 116 -146 92
2808I2M5k69M01p4l70l2L10J14k48J57K52n49j96L97L4j41J24K09j59l45J01J88
$$ 92 137 -132 269 195 -175 -207 103 217 -31 126 378 -171 -367 30 64 -77 47 256 97 -248 -147 41
2830D1J72l42L85k54j83p6M60M2l50o6M04n30J32L48J32l25j99L62j15K5O4Mm09
$$ 41 213 -129 256 2 -181 -257 203 245 -105 -171 233 -297 -165 183 315 -10 -209 153 38 63 127 131 -278
2853b78j25O06K4o7j89L56j34m03L28J64j65Pl7r9j79J0M41l33k40K90K25n59
$$ -278 -403 203 227 160 -29 327 193 -210 118 282 117 124 87 -12 -191 -181 260 -73 -313 -23 202 -357
2875c57J57M20k80p7J16J8Qk71N99m44J42k14N2R6j39J93k6R6m18L07J12l76M76
$$ -357 -200 220 -60 -137 -21 -3 5 -266 333 -111 31 -183 -131 -35 -174 19 -7 89 -329 -22 90 -286 190
2898A90j9j82K2K13K14n17q5J07M9k10K89K03j74j86p9K35k72K71K39n9l57k66
$$ 190 171 -11 11 224 438 -79 -164 -57 -8 -218 71 274 100 -86 -165 70 -202 69 308 249 -108 -374
2920c74L99l53N63j69J07l59Q7m6k7J91N6K63n53J86J92j61m80M20m0r2o0J20
$$ -374 25 -328 235 66 173 -186 -99 -145 -172 19 75 338 -215 -29 163 2 -478 -58 -98 -190 -250 -130
2942a30M21j75j43o3Q5K6R1j32K4J10J52k43l03L56M9j17q4j45L58m61M82j22
$$ -130 291 116 -27 -90 -5 21 112 -20 4 114 266 23 -280 76 125 8 -76 -221 137 -324 158 36
2964C6N1m34J35L92j26j11Q4P9j51n7J01J53m23K0M45k01l14M69L9J00k82pP6
$$ 36 87 -347 -212 180 54 -57 27 106 -45 -102 -1 152 -271 -251 194 -7 -321 148 187 287 5 -2 74
2987G4nM4J57k89m1J69j9n11N66Ml54r1Q3N25k76j26J3K42n75K71M39k76j53J24
$$ 74 69 113 270 -19 -60 109 90 -421 145 149 -205 -296 -213 312 36 -90 -77 165 -410 -139 300 24 -129 -5
3011eL0k48j47P28l96J30M5K01n85L9K88J19j86j56N42o20NM87N4k48j11J3L75
$$ -5 25 -223 -370 358 -38 92 137 338 -247 -208 80 199 13 -143 399 -221 -216 271 325 77 -34 -21 354
3034C54k21m03M33r0k67M68Q0m99R8K85o1j02m03L21K43m33K55l43J55J45R6R9
$$ 354 133 -270 163 73 -194 274 354 -145 -47 238 177 75 -328 -7 236 -197 58 -285 -130 15 111 210
3056B10k83mK7J68j41J85j8l52j18J12L03l12K75L04k84J55k10l25J61J40O3Q
$$ 210 -73 -77 -50 118 -23 162 144 -208 -326 -214 89 -223 52 356 72 227 17 -308 -147 -7 56 64
3078F4j85M7J12k65K30J53M4m72L59K37o65K9L57m1J18m46O29k05k18K07l57J61
$$ 64 -121 -74 38 -227 3 156 200 -272 87 324 -341 -312 45 4 122 -324 305 100 -118 89 -268 -107
3100a07K4J05j07J08l3n7K64m33K00K60l14k4P5j22J22K17o1k87j8J7K97k86O3
$$ -107 -83 22 -85 23 -10 -67 197 -236 -36 224 -90 -114 -39 -161 -39 178 117 -170 -188 -171 126 -160 -97
3123i7L82l28j06qM21k89O5R4m4m68J90K96pj88m9M69l59K14k91L15k33J01J82
$$ -97 285 -43 -149 -157 264 -25 40 134 90 -378 -188 108 101 -87 -136 333 -26 188 -103 212 -21 80 262
3146B62m56J24o2K46L9m62L56K2k02K80K22k58j39K49p4k0j19J77k33J3K68J20
$$ 262 -194 -70 -132 114 153 -309 47 69 -133 147 369 111 -28 221 147 127 8 185 -48 -35 233 353
3168C53k39m37M06M8k13M5Q9Lo2k4P7q0k2M58j4k11l36J28J2J42j57L48l96Q7
$$ 353 114 -323 83 131 -82 -37 52 55 -7 -31 46 -34 -56 402 388 177 -159 -31 -19 123 -34 314 -82 5
3192ERr0J58j74L31l71M4o7p5J97N2n5J09k88M20K05o07J16K92j14k30J59J02
$$ 5 14 -76 82 -92 239 -132 -88 -155 -230 -33 19 -36 73 -215 205 410 -197 -81 211 97 -133 26 128
3215A28K5n03N35m00O9k6K45j02r5L44k12j86J76J18j52J58p6J22n3j68K52j33
$$ 128 153 -350 185 -215 -146 -172 73 -29 -124 220 8 -178 -2 116 -36 122 46 168 115 -53 199 66
3237F6j66L43l27R9j85J9K46L2p3r7O4J24j49L61l05j9r4K84J01l22J5R0m04K06
$$ 66 -100 243 -84 15 -170 -151 95 127 54 -43 21 145 -4 357 52 33 -61 223 324 2 17 107 -297 -91
3261i1L92m55J60L5j51j3J72J35l5n8l71K92O8j22k53K74j32l6J00Q4l5K46K53
$$ -91 301 -154 6 41 -110 -123 49 184 149 91 -280 12 80 -42 -295 -21 -153 -189 -89 -5 -40 206 459
3284D59q21K87J47o6j88K13K28k03r3L0J49k45J64jK8j51r2J46J69k95K0K69p6
$$ 459 -362 -75 72 6 -182 31 259 56 -37 -7 142 -103 61 60 88 -63 -155 -9 160 -135 -115 154 78
3307G8j90J41j01m1l43O89N7l29j46M68k38k81N53l31k5j73L33j70j04J83j66
$$ 78 -112 29 -72 -113 -456 233 290 -39 -185 283 45 -236 317 -14 -39 -212 121 -49 -153 30 -136
3328a36R6K4j3j56J03L42j30k48mK41j28r5J79J87k29k36KL61k89J47Q2r3O7k11
$$ -136 -40 -16 -29 -185 -82 260 130 -118 -122 119 -9 -104 75 262 33 -203 -201 160 -129 18 100 7 74 -137
3352a37L30k95l1K37jl4l76L08J74l86K33J94l29j1L60m0j14l43J54m7R1K23j31
$$ -137 193 -102 -133 104 103 69 -307 1 175 -211 22 216 -113 -124 236 196 82 -261 -107 -154 -63 160 29
3375B9P4k6r4P2j61K45p9R6l20K8N30n46K4L55l45R1l6P0m1L0k44M43j47k16M30
$$ 29 103 77 -17 55 -106 139 60 156 -164 -136 394 -152 -128 227 -118 -27 -63 7 -34 -4 -248 195 48 -168 262
3400B62q8j98K66O2k65k78K74l45M9K89K63k23K5k55L11j87N6oJ21m35K61M19
$$ 262 174 -24 242 304 39 -239 35 -310 -261 28 291 68 93 -162 149 -38 18 12 133 -302 -41 378
3422C78l59O7k7k57R3J33Q6j95M7m17O94j07j29J59k90J77m48N17J66l90K07%
$$ 378 19 86 59 -198 -105 28 114 -81 -34 -451 243 136 7 166 -124 53 -395 122 288 -102 105 105
3444A05j49R8J02l05J64Q2j88j6j15Q3L98k08K1K2m08J23L92j31r3R7j1j54J95
$$ 105 -44 54 156 -149 15 97 -91 -107 -222 -139 259 51 72 94 -314 -191 201 70 -23 74 63 -91 104
3467A04j87K08M1n59M20P6k50J33J76k6l27N6m9K90j68L54k45n7j73J18M17l69
$$ 104 -83 125 166 -393 27 103 -147 -14 162 136 -191 -135 -184 106 -62 292 47 -10 -183 -65 352 -17
3489a7MO7j64L13k50K45j26k61K92j96O1L11j21l15JM87L9n04J21J48l30lL51
$$ -17 -13 54 -110 203 -47 198 72 -189 103 -93 -32 279 158 -157 -156 331 370 -134 -13 135 -195 -198 153
3512A53j21j02J83K4J67l57o4K37j17o9L1O4J07l12L03k30r5L01k87K08R7l00
$$ 153 32 -70 113 137 304 -53 -117 120 3 -66 -35 29 136 -176 127 -103 -198 103 -184 24 121 -179
3534a79M66p6j57J58k74K10pk06k4K31l94K52k77J39K46NJ7k96M8o6K95J9r0j56
$$ -179 287 211 54 212 -62 148 141 -65 -89 142 -252 0 -277 -138 108 113 130 -166 -118 -184 111 130 40 -116
3558a16L25j32j34J5j61L44k42j22L00K01k47k53L28k50RJ79R1j60KKj83K88K42
$$ -116 209 77 -57 -42 -203 141 -101 -223 77 278 31 -222 106 -144 -135 44 135 -25 -23 -21 -204 84 326
3581C26O5k95o3j25p1L20m34M49J6m95K11Q4m3M8K63k16j6O4j30J06O6j2o0P3
$$ 326 391 96 33 -92 -163 157 -277 172 188 -307 -96 -12 -55 -7 256 40 24 88 -42 64 130 118 58 131
3605A31q1K06j39k8n4M8q4j01K74J70l88k38O5K71ol32L67j62n0K64l92M73k19
$$ 131 50 256 117 89 35 83 -1 -102 172 342 -46 -284 -219 52 46 -286 81 -81 -131 133 -259 214 -5
3628eM05p03L19k82L01M09l68m8k12j90L72j31J10j47Q5K60k77j30M15j25J40
$$ -5 400 -303 16 -266 35 444 76 28 -184 -374 -2 -133 -23 -170 -85 175 -102 -232 183 58 198
3649A98k74l1N42m84J83J23k37N7l2k58K74r1J70k15O9r1O3M1m9Q2J1j11K20k66
$$ 198 -76 -107 435 -49 134 257 20 77 45 -213 61 -30 140 -75 -6 -97 -34 7 -42 40 51 -60 160 -106
3673a06K45k84K47r1j20K15k36Q4O7k37L83k22k92L70N5OJ20k25n9j0J24O3J20
$$ -106 139 -145 102 11 -109 106 -130 -46 21 -216 167 -55 -347 23 78 84 204 -21 -80 -90 34 97 217
3696B17k5j94k0j88lK74k31J09J91m6j24M7j4j13J72N2J19j42j19J04j57l7p4
$$ 217 192 -2 -22 -210 -213 61 -170 -61 130 84 -40 7 -7 -120 52 104 223 81 -38 66 -91 -128 -202
3719b02K17j20J70Nj10J14J18k45J57j6j7N5r4l30M54j73j54p2M40k87o3K65j94
$$ -202 15 -105 65 70 -40 74 192 -53 104 88 71 126 32 -298 156 -17 -171 -243 197 -90 -153 112 -82
3742h2L6O2l3J59m41M26N8o26M74j4K05k06J84p5q1j44M14J6l32oJ08j0k04M03
$$ -82 -46 16 -17 142 -299 127 185 -441 33 19 224 18 202 127 46 -98 316 332 0 -6 102 92 -112 291
3766B91l31O0j68L02n9j37J06K7j45j27k16M38K10l72K46k69Q2k10L41m6j94N3
$$ 291 -40 20 -148 154 95 -42 64 91 -54 -181 -397 41 251 -121 125 -144 -62 -272 69 23 -171 -118
3788a18J34J29k61j62J91r3j56L82K8j24pO0j24N3rM2J16j43J68J16k44O2k85
$$ -118 16 145 -116 -278 -87 -180 -336 46 74 -50 -57 3 -121 -68 -77 -35 81 -62 106 222 -22 40 -245
3811b45J66m2N8K40l56L27j09q1J37j57J48n1l54L45m7n2q5j75J69M16k53p9n8
$$ -245 -79 -121 -63 177 -179 148 39 -42 95 -62 86 35 -319 26 -21 -73 -158 -333 -164 252 -1 -80 -138
3834a38N6O9L1J5j96K68p9r6R2Q7k91L8M93l94n0p6P2M6M6l26N17J7j73l5J09
$$ -138 -82 -13 18 33 -163 105 26 -70 22 109 -182 -144 349 -45 -95 -171 -99 -53 -7 -333 184 201 28 -7 102
3859A02K16l89J3O9l51L82J37k44M5P6J22j60j0Q2L8l42L34J6o9J76k12l1J78
$$ 102 318 -71 -58 11 -340 42 179 -65 -20 56 178 18 8 90 128 -214 120 136 67 243 31 0 178
3882A78j28j83O8K67p2m36L84n7l05L70o9J24m04L40k81K21n2J06k05K84k26j21
$$ 178 50 -133 -65 202 130 -306 78 21 -284 86 17 141 -263 77 -204 17 -35 71 -134 150 -76 -197
3904a97J03K88J2k22M5j51M2K64k13M0O7J53l74J47j66J49r7N3J06n5k58J81L05
$$ -197 -94 194 206 -16 29 -122 -80 184 -29 11 78 231 -143 4 -162 -13 -110 -57 49 -6 -264 -83 222
3927B22L2j62O3j86k48M39j6N2k16Q8k4P1j97K41r2j53Q9K78k02l71L58j28K2
$$ 222 254 92 155 -31 -279 160 144 196 -20 68 44 115 -82 159 67 -86 3 281 79 -292 66 -62 -40
3950d0J63J6l2l06K81L62l73m10M05r5J3j26n2M00j36n5K5M4j63J86k0j96J28
$$ -40 123 139 107 -199 82 444 71 -339 66 -29 -16 -142 -194 206 70 15 40 84 -79 107 87 -109 19
3973A9P5m1p9P2J68j45j34j77M72l18L1j69K28k7K50J4l15J75j76J8L3Q2K23p17
$$ 19 94 53 -26 46 214 69 -65 -242 230 -88 -57 -226 2 -25 225 239 -76 99 -77 -59 -26 56 279 -438
3997d38M85m0J52n2n4m2N5o5J3o0J26o2p3j02K60N3o8J6j64J55j05K50l52K79
$$ -438 47 7 159 107 53 11 66 1 14 -46 80 18 -55 -157 103 156 88 104 -60 95 -10 240 -112 167
4021A67j68J01l32J20L12n42L69q6J16p8K19j29l9K00j20n8L5l66J76J36l91M98
$$ 167 -1 100 -232 -112 200 -342 27 -59 57 -21 198 69 30 230 110 52 87 -279 -103 33 -358 140
4043A40k63mj79O1N24l2j53l23L69k3L7l28J81K27k99J82J16l79M11n21J91l14
$$ 140 -123 -127 -306 -245 279 247 94 -229 140 117 154 -174 7 234 -65 117 233 -146 265 -256 -65 -379
4065c79K46K01q7K2k4j25P0J18J44k22K32k50Q7j28Q0q3l0n5N66o26J80K83j58
$$ -379 -133 68 -19 3 -21 -146 -76 42 186 -36 196 -54 33 -95 -15 -98 -128 -183 383 -243 -63 220 62
4088F2k00O5L10l21K01r4J10Q0m34L94k17K72k03j32J04K25R4l64j70L03K3j58
$$ 62 -138 -73 237 -84 117 23 133 213 -221 173 -44 228 25 -107 -3 222 316 -48 -218 85 108 -50
4110e0J94j82R5n3lL4j45o5rM72l09L1Q4j29J68J84l15N2j15k1L7j94L85l07L90
$$ -50 144 -38 57 4 1 35 -110 -175 -184 288 -21 10 94 -35 133 317 2 54 -61 -82 -45 -239 146 -161 229
4135B29o3k23o9K40l10K92Mm9j32K75p2j83J20j87J08q8k8Q4K07O1Jn07M20RL6
$$ 229 166 -57 -126 114 -196 96 100 51 -81 194 122 -61 59 -128 -20 -108 -136 -52 155 216 217 -290 130 139 175
4160A75j82j09J33J2l4J19N6j80k8NN2l18L63m6P5L9k77M16l42O3k2p2NJ90o0
$$ 175 -7 -116 17 29 -5 114 170 -10 -38 -33 19 -299 64 18 93 132 -145 271 -71 -8 -30 -102 -97 93 33
4185C3P7k02K29j41j55J81M9J86k40J9k3j86M6K93m1k17J53j30rJ81j70o2Q3p6
$$ 33 110 -92 137 -4 -159 22 71 257 17 36 13 -173 -127 166 125 -92 61 -69 -78 103 -67 -129 -46 -122
4209a22L19q3j88j5R4J84m73L83J32k28J0m9j5j41MO0K36k7j2M9m0r5n0l34J86
$$ -122 197 114 -74 -89 5 189 -284 99 231 3 13 -36 -51 -192 -188 -128 108 81 69 118 78 -17 -67 -401 -215
4234b15J23J51O9j78j51L91l78K01R3k00o3N4Oo6K52K6k22L7m0K62j41qKn7nJ99
$$ -215 -92 59 128 -50 -201 190 -188 13 106 -94 -157 -103 -97 -163 89 115 -107 -70 -110 152 11 3 5 -52 -57 142
4260A42o5p8k9L03k84K39k38K30k69J75J28k13p1M2j78R0k3J99p0q1kJ9K54j74
$$ 142 77 -1 -30 273 -11 228 -10 220 -49 126 254 41 -30 12 -166 -76 -99 100 30 -51 -53 -34 220 46
4284D6oj45M9q5m0K71l8k04L45q3O1l13j9L58r3L4j77J82l20K36k14J5n9K09J26
$$ 46 40 -105 -56 -141 -181 90 52 -152 193 110 171 -142 -161 197 104 138 -39 143 -177 59 -155 -140 -199 10 136
4309A36j70O9j23J68k60j06K45N1K4M5k9j3o9L5N3J68q9n9K9j34J89j12m5k9L3
$$ 136 -34 35 -88 80 -180 -286 -41 10 34 79 50 37 -32 3 56 224 135 76 105 -29 160 48 3 -26 7
4334GK2K45l70J47l5q7K62k43k04J82O9K08k60p2j09J68J22K35l36r4lK36J01
$$ 7 29 274 -96 51 16 -71 191 -52 -256 -74 -5 203 -57 -129 -238 -70 52 287 -49 -143 -146 90 191
4357A91l32N3J74j49j73N44j76n62K93K56k7k5k2k85J09J14J01J3k17M3J14n0
$$ 191 -141 -88 86 -63 -236 308 132 -430 -137 119 92 67 45 -240 -131 -17 84 97 -120 -77 37 -13
4379a3n5Q8Oj22m2L75n5j43j7O8j22j5L2J79j02j46O1K76l28J07q1n2K84l50N71
$$ -13 -68 20 26 -96 -138 237 182 39 22 90 -32 -47 -15 164 62 -84 -23 253 -75 32 -49 -101 183 -167 404
4404D04o43K87J28p2q4R7m7j87j45J99Q3J9j01M8j62P9K48k10mJ77J84l00j34
$$ 404 -239 48 176 104 20 117 70 -117 -262 -63 20 39 -62 -14 -176 -97 151 -59 -63 114 298 -2 -136
4427a36J41j15j38P0O6k25J64K04K53k80j11J19j58L45l69N6L14l12J16J73m18
$$ -136 5 -110 -248 -178 -112 -337 -173 31 284 4 -107 12 -146 199 -170 -114 200 -112 4 177 -241
4448b41J01L84j13k49n0J88j30L75m45L78P2l44K07j23Lk2m1O8j33Q8L20j82j76
$$ -241 -140 244 131 -118 -168 20 -110 265 -180 198 270 -74 133 10 13 -9 -50 18 -115 -27 293 111 -65
4471f5K17j4j48K62j33k21J19j34J83K66k01j17k09K93j64J08M2k67J85J7j93
$$ -65 152 138 -10 252 119 -102 17 -117 66 332 131 14 -195 98 -66 42 84 -183 2 19 -174
4492a74l8K26J59k78J27J17jm54N6K47J21k37Q8J64L2j73L2j11K2R7k12R4j89
$$ -174 -212 14 173 -105 22 139 138 -316 -260 -13 108 -129 -41 123 155 -18 14 -97 -75 22 -190 -96 -285
4515b85L71p2L5j9k06R3K6M20l58j65J92j09J67l7j65j19L42J44l17oJ00j08k3
$$ -285 86 14 49 30 -176 -83 -57 363 5 -160 32 -77 90 53 -112 -231 111 255 -62 -68 32 -76 -99
4538i9L45l26L24j66j17J9P0o3k7k63M43Pj56j7j0j5K1N3k43N03l92q3K55n6j09
$$ -99 246 -80 244 78 -39 -20 50 -13 -40 -303 140 147 -9 -26 -36 -51 -30 23 -220 283 -109 -192 63 7 -102
4563a02K06m0J45j70J5J8j70M6L7J14Q7l51J14K29l51K96k32J77j75L6j6J72p6
$$ -102 104 64 209 39 54 72 -98 -52 -15 99 186 -165 -51 178 -173 123 -109 68 -107 -71 -87 85 9
4586Ik33J08J79%j75K37j57j53L45k20L06k39n6M5J19j03l5L79l05k06K08J45
$$ 9 -224 -116 63 63 -112 125 -32 -185 160 -60 246 7 -49 -4 115 12 -23 356 51 -155 53 198
4608A98l29K25P0q6Lp6m0l5k9K11l45J71K38k8j41j53J94Q1j31P0r8j0l0O4J93
$$ 198 -131 94 164 78 81 5 -35 -70 -99 112 -233 -62 176 148 7 -146 48 129 -2 68 -30 -40 -70 -6 187
4633A87o3j34J62k38J06j07o4J2j32K37L3r9j20K27J81k65o4K76j89J63k8j71
$$ 187 124 -10 152 -86 20 -87 -151 -139 -271 -34 -1 -100 -220 7 188 -77 -141 135 -54 109 81 -90
4655i0J56J27k59j28M34m0k05M60o03P5L79k89K2j14N3K88k91j4K59o5k58K15
$$ -90 66 193 -66 -194 240 200 -5 455 -148 -73 306 17 39 -75 -22 266 -25 -39 220 155 -103 112
4677A12J18j42k02R4j72K80k95J92J8j04J32k05KK97j95L1O9M3j55J9Q7l4j86
$$ 112 230 88 -114 -20 -192 88 -207 -15 3 -101 31 -174 -172 125 -70 -39 30 73 -82 -63 24 -10 -196
4700a96L66k32K10Pj67%k43K79l6R7j10K23k12J19j90K27m33M61k96K70j81P2
$$ -196 170 -62 148 155 -12 -12 -255 24 -12 85 -25 198 -14 105 -85 142 -291 170 -126 144 -37 35
4722C5j80J07j4J25Q8k03K3l03L60l00K65J19j55L6J81m5k48R5J6N3k01q3N53
$$ 35 -145 -38 -52 73 161 -42 -19 -322 38 -262 3 122 -33 3 184 139 -109 -14 2 55 -146 -229 324
4745C24l96K26J2k54R1l8J33K5o3q3Mj97M41l71PK43l64L01R9k82M69m90J05J5
$$ 324 -72 154 166 -88 3 -35 98 123 60 -23 -19 -216 225 -146 -139 104 -260 41 140 -142 327 -163 -58 -43
4769d3r8K11j2K26k94j18J75j19J9l0R0q3K65j02M3l01K27k60K63k8o0K53k28
$$ -43 -141 70 58 284 -10 -128 47 -72 -53 -83 7 -76 189 87 130 -171 56 -204 59 31 -29 224 -4
4792dn0K02j07p2j34K85j57J29j59P9J25p8j56J26J88L8l98L04k60M71l14L25
$$ -4 -54 148 41 -31 -165 120 -37 92 -67 12 137 59 -97 29 217 255 -143 161 -99 372 58 383
4814C83j64k98K26k07l78K19J84J63j32j53L49p7k01R1j41J79j07l47K83J82k39
$$ 383 219 -79 147 -60 -438 -219 -35 128 -4 -157 192 115 -86 5 -136 43 -64 -411 -128 54 -185
4835a85M09k70J53q9J21k55P6N4J34M0l08K80j99R5K07Nk80J81k2qL5j95L46l31
$$ -185 224 -46 107 18 139 -116 -40 14 148 188 -120 160 -39 56 263 268 -12 169 147 139 174 -21 325 -6
4859fJ15K13l35n5M03j69r8k36J14J98P3m19J09j84N24k71J8R4l15J79L06k62
$$ -6 109 322 -13 -68 335 166 68 -168 -54 144 217 -202 -93 -277 247 -24 -6 88 -227 -48 258 -4
4881dK44m4j56k80L91j00j44J78p1q4K30k31M20m64K31n4k23J22o4K87m24L09
$$ -4 240 196 40 -240 151 51 -93 85 14 -70 160 -71 349 -115 116 62 -161 -39 -103 184 -240 69
4903F9r9P6o6k34K97q8K42O8j67J6p9J72k16l99K00L91l49K9J36m8l6q3J61J88
$$ 69 -30 46 -20 -254 43 -45 197 265 98 114 35 207 -9 -408 -208 183 -166 -137 -1 -49 -85 -168 -7 181
4927A81l25L90j99k19L55k4J17k55K3j70j08K18L6p3K04k30K63j25j11L07j88
$$ 181 -144 246 47 -172 183 159 276 21 44 -126 -234 -16 20 -53 151 -79 184 59 -52 255 67
4948F7j57L66m95J86J54j74J35Rk8n6j73J41L09k69Jm7o5N3M9j37k10N87k19j15
$$ 67 -90 276 -219 -33 121 -53 82 91 63 7 -166 -25 284 15 16 -31 -96 -43 6 -131 -341 246 27 -88
4972h8o8K57o3P0p7Mj90l8K07j11K54l8k43K47n7J91k20K2n9J70J9l45J83J55
$$ -88 -156 101 38 108 31 35 -155 -193 14 -97 157 119 -124 123 66 257 37 59 0 170 189 -156 27 182
4996A82k83L5K99k49J3k23N09l82k24M29J29k07J34j05j30k6R3j05L51k61Q6l07
$$ 182 -101 -66 233 -16 -3 -226 283 -99 -323 106 235 28 162 57 -73 -99 -6 -111 240 -21 65 -242
5018b42K72p2lJ80j95j40J75L7k29K29Lj89L85k83l8j56K00K08k10pK26m51J64
$$ -242 30 -42 -45 135 -60 -200 -25 12 -217 12 15 -174 211 -72 -110 -266 -66 142 -68 -75 151 -300 -136
5041a36L12j44j35l4j58K59L0j29M08l78J66j46N9n0K06L5j82M5j45J74J1j74
$$ -136 176 32 -103 -137 -295 -36 -6 -135 273 -105 61 -85 -26 -76 130 165 -17 28 -117 57 68 -106
5063a06J76j60L0p7k7L21q2o5k7Q4j18M7N6j64J4L1p1K64q0Q0O1k81M40l42P9
$$ -106 70 -90 -60 -137 -164 157 75 10 -17 67 -51 -4 52 -112 -98 -67 -138 126 46 126 187 -94 346 4 83
5088H3k09l6l9K17NK6j54n2p9L56m8k12L63j29k60J95m3o6n7O2L76l16j04L17
$$ 83 -126 -162 -201 16 21 47 -107 -159 -238 118 70 -142 221 92 -168 27 -16 -82 -139 -77 299 -17 -121 196
5112A96l55K20J25k0k69K58m7J38k98N5L5j65N0j10L12l9J52j61k2j5j27J26m8
$$ 196 -159 61 186 166 -103 155 108 246 -52 3 38 -127 -77 -187 125 86 238 77 55 40 -87 39 -9
5135iPQ4J30j84m1K76j53j3l18Q6k2m5J72J25m7l3M6j79nJ21J57q4j54p5O9J50
$$ -9 -2 82 212 28 -13 263 110 97 -221 -135 -157 -202 -30 95 48 15 61 -118 -123 -2 155 71 -83 -158 -89 61
5161F1j59J51K7q8L3o2P3k92M14j06m6J35k59K38j61M8N1j50J77P2l84K88O3j75
$$ 61 -98 53 80 -8 25 -37 36 -256 158 52 6 141 -118 120 -41 7 58 -92 85 157 -227 61 124 -51
5185e1J89l41K20p3N7k7P8Mo3j96J32L9J52J99j74k76J08j63M1R3j37o5K30j11
$$ -51 138 -203 17 -56 1 -26 52 56 -7 -203 -71 -32 120 319 145 -131 -23 -186 -145 -52 -189 -254 -24 -135
5209a35J13O7k11K95l89M0K61j50K55J14l60n9n0MJ73nk23K12L18k55O6l2j14
$$ -135 -22 45 -166 129 -260 -220 41 -109 146 260 -100 -159 -209 -205 -32 -37 -260 -48 270 15 81 49 -65
5232f5L04m06L05j1J66k28K2J1k86k01K59M68m29KK76l48m3M1L50K1j25L4k3k69
$$ -65 239 -167 138 127 293 65 87 98 -188 -389 -130 338 -91 -89 187 -161 -204 -163 187 208 83 117 94 -175
5256a75J24J97j19j86Q1M3J30k78J25J8l5J84j92K15j92L89k87l6M2k02J06O5
$$ -175 -51 146 27 -159 -78 -35 95 -183 -58 -40 -75 109 -83 132 -60 329 42 6 48 -154 -48 17
5278A7J56j15Lj80L41N4k73L4L44k71M6r9J36p6j6o3P6k57M15k87R3j19P0Lk55
$$ 17 173 58 61 -119 222 276 3 37 381 110 156 57 193 117 101 38 114 -143 272 -15 78 -41 29 32 -223
5303b23L68p2m0j15N9J73l73J2J82m3P7J40j56n6R5J53l10m8N5J19mJ4J83k65
$$ -223 145 73 33 -82 -23 150 -223 -211 -29 -72 5 145 -11 -67 28 181 -129 -177 -122 -3 -7 7 190 -75
5327g5J2p5J75j86Q1j71L63q7K5n2k36k3L36o5j8k0L6Q0j36kP3k51K09j08P7J93
$$ -75 -63 -138 37 -149 -68 -239 124 37 62 10 -226 -249 87 22 4 -16 20 100 -36 -38 35 -216 -7 -115 -38 155
5353A55k29J72j44j52L12M6j15r9K00J31r0l14J88l67J05L25o0J54l74J86j29
$$ 155 -74 98 -46 -198 114 160 45 -54 146 277 187 -127 61 -306 -201 124 64 218 -156 30 -99
5374i9K10j32J27j18k09L03j82L25k56K14k42J71k5K13n83M82l17J75j66K00J
$$ -99 111 -21 106 -12 -221 82 -100 225 -31 183 -59 112 87 300 -283 199 -118 57 -109 91 92
5395I2j17R3k66L34k86N8o7O2L58l80j32N35p1k64K51k14k4j03N9O0o2KJ66j33
$$ 92 -25 68 -198 136 -150 -92 -159 -97 261 -119 -251 284 213 -51 200 -14 -38 -141 -82 -22 -84 -82 84 -49
5419d9N4K19m00P6J15L65n67J47P4j48K25K0p3j47j1J97j25o9J54J36j81lQ4J27
$$ -49 5 224 -176 -100 15 380 -187 -40 34 -114 111 131 58 -89 -100 97 -28 -97 57 193 12 9 93 220
5443B20k62o2L7K66l88K42j43K01j51J71k71J26J10R8k62N5J01j62J63j88K05
$$ 220 -42 -104 -67 199 -189 53 -90 111 -40 131 -140 -14 96 194 -68 -13 88 -74 89 -99 106
5464A06j30L85k36j07j15N4j44K71j4RJ62Kl94K55j76K07m44L36K1m8k27q9O10
$$ 106 -24 361 125 18 -97 -43 -187 84 70 79 241 243 -151 104 -72 135 -309 27 48 0 -227 -316 294
5487B94m42K84n1K11m15qK60L7r8K2O0m3J5P4j40n7k04K96l62P5J02m5k8P3R8
$$ 294 -148 136 85 296 -119 -127 133 170 72 94 154 111 126 200 60 3 -201 95 -267 -192 -90 -135 -163 -90 8
5512HNj13N8L85m1k77j68K00j1j49P3L8O4j46K10q4o0L21j65l43J56J62J15l55
$$ 8 13 -100 -42 343 302 25 -143 57 46 -103 -30 8 72 -74 136 52 -8 313 148 -195 -39 123 238 -117
5536a17k37J61L74j12j46j37R0L9L62k91j69J66p2r1J0K58j67m0K56l6N8j71O2
$$ -117 -354 -193 181 69 -77 -214 -124 -85 277 -14 -183 -17 -89 -180 -170 88 -79 -119 137 101 159 -12 50
5559E0l6K07n46L42j25j27N66j83mj40O9r2M6j68J75m8J4M8o8K3Q7J1k54K81j66
$$ 50 14 221 -325 17 -108 -235 331 148 144 4 73 -19 27 -141 34 -14 0 48 -20 3 90 101 -153 128 -38
5584c8J03j0j44j6k1J11p9J56j19l0L54k47n1Q4L6J46q9l4L2k73O4J00J39l42
$$ -38 65 55 -89 -105 -126 -15 -94 62 -57 -87 267 20 -31 53 89 235 146 112 144 -129 -65 35 174 -168
5608a68J50j21J77KK6k31J00M9J74n0J1m1Q0j64k6J41j3j43L22k28K76k42j32
$$ -168 -18 -139 38 40 66 -165 -65 -16 158 108 119 78 158 -6 -32 109 96 -47 275 47 323 81 -51
5631e1J16k33J68j42o3K11j44O1R8k34L40J10l07j68N33k76L8j33K10j74J99j71
$$ -51 65 -168 0 -142 -205 6 -138 -77 21 -213 127 237 -70 -238 295 19 57 -76 134 -40 159 -12
5653a2l09K97k32M49l20M4Q0L97j74k19k96K44J89q8q9O2J0j84L8J92j33k8J96
$$ -12 -321 -24 -256 193 -127 -83 -3 394 220 1 -295 -51 138 50 -39 23 33 -151 -113 79 -54 -82 114
5676A14k65K35m4j66K25k1K41l16j42O9J40J15k46R5N6J09J54l46p6j99L52j36
$$ 114 -151 84 40 -126 99 78 319 3 -139 -70 70 185 -61 34 90 199 353 7 -69 -268 84 -52
5698e2L11l15m6O5n4J53l35J83P0J07o5j47L07j27q6r5L48k17Q6Jk9J68K7l31
$$ -52 259 -56 -102 -37 -91 62 -273 -90 -20 87 22 -125 182 55 -31 -126 222 5 91 92 63 231 258 -73
5722g3O5J45l09L50m73L82R1l34l8O0L18m8k90L9L27n4k62n5K03k7jj18N9Q4q7
$$ -73 -8 137 -172 178 -295 87 178 -156 -194 -134 184 136 -154 -115 212 158 -104 -159 44 17 16 -102 -43 41 -46
5747d6R1L5j23R1q1R9r4o7K13l34K09k36J67J94l9J10l88K29j66K48p0j00M3k38
$$ -46 45 80 -43 48 -33 66 -28 -95 118 -216 -7 -243 -76 118 79 189 -199 30 -136 112 42 -58 -15 -253
5771b53J3K75l7J65k36Q2J88l61J86QK9K2r9J48k31K94l45J76M4J07p3l30K85
$$ -253 -240 35 -2 163 -73 9 197 -164 22 30 59 81 -18 130 -101 193 -152 24 68 175 102 -228 57
5794E7L5j63K50k57KL45m49K21J46L5m70K04j12L2J04J62m14M47k89l8L90l05
$$ 57 92 -71 179 -78 -76 269 -180 41 187 222 -248 -44 -156 -124 -20 142 -272 175 -114 -152 238 -67
5816f7j3O5j55R2J08j71j36K31j85M01j93l3L5j17o5J53J19J03k51J48J19l03
$$ -67 -80 -15 -170 -78 30 -141 -277 -46 -231 170 -23 -56 -21 -138 -203 -50 69 172 -79 69 188 -115
5838a15J17k13mL22k0r5K1r5MJ16J84l98L22j19j35L38k37k16J77j74Q1J40L0
$$ -115 2 -211 -215 107 87 -8 13 -82 -78 38 222 -176 146 27 -108 230 -7 -223 -46 -220 -139 1 31
5861C1j03K17k88l1J86J97m09J19J49k22R1j95K01lK55k09q9J33q3p3K68l17q
$$ 31 -72 145 -143 -174 12 209 -200 -81 68 -154 -63 -258 -57 -60 195 -14 -103 30 -53 -126 142 -175 -183
5884a83J60J10J00j96R5q7Q3j58K40q2k06N2J7j36j04L14J25j10j38L67l59l3
$$ -183 -23 87 187 -9 86 -1 82 -76 164 82 -124 -72 -55 -191 -295 19 144 34 -104 263 -96 -129
5906a29m1J81Q8j75K5JJ48k75K55j18n0J51Rj34LK55k79K4K15l13J93J50m1nO0
$$ -129 -170 11 99 -76 -51 -50 98 -177 78 -40 -90 61 70 -64 -61 194 -85 -61 154 -159 34 184 143 138 198
5931A98m10K09J12k23L18k85M6K31k06J71j55J88P3l86J12k7k12L79j32m4K12
$$ 198 -212 -3 109 -114 204 -81 -35 196 -10 161 6 194 267 -119 -7 -34 -246 133 1 -43 169
5952A69k91J38R6jj75r3K29o9k23L08p1k92J20L14k26m5J88J36l22k03P7L49k37
$$ 169 -122 16 112 111 -64 -157 72 3 -220 88 17 -275 -155 159 -67 -112 76 212 -110 -313 -236 113 -124
5975a24J36pL1l5m4L56m45K09L0O7m13J93l7J01K20k44M2l3K5j75K16j82J81l8
$$ -124 12 5 36 1 -43 313 -132 77 107 174 -239 -46 -83 18 238 -6 36 3 28 -147 69 -113 68 30
5999C0q8M99n92j39O3L7R7j57K17j27K75k17j1J72Mj83O6po7M60l35P0j61M32
$$ 30 -58 441 -151 -290 -227 -190 -93 -250 -33 -160 115 -102 -113 59 63 -120 -54 -61 -128 332 -3 67 -94 338
6023C38m82J14N2j72M97l22j99J80J98J43n66K02q6r0J22j21Q8o6R7K5j38K72
$$ 338 -144 -30 22 -150 347 25 -174 6 204 347 -219 -17 -103 -193 -71 -192 -104 -170 -73 -48 -186 86
6045H6L1k52J09L5Q2k32K95p1lQL6Kk38J08j09K2k0j38M70p0l01J8J37r2J46P7
$$ 86 117 -135 -26 9 91 -141 154 83 80 88 124 126 -112 -4 -113 -91 -111 -249 221 151 -150 -132 5 -87 59 136
6071A36j76j06O0j3J6j04J41J87p5J72q8M4m08Q6K47n6L00l97L45m24K1J21l54
$$ 136 -40 -146 -86 -99 -83 -187 -46 141 66 238 150 194 -214 -128 119 63 363 -34 311 -113 -92 29 -325
6094c25J32K05N3O3j08J31k38k5J65p6o2K28q2rk14L94j89P5j90L2M7j39K41m3
$$ -325 -193 12 65 128 20 151 -87 -112 53 -23 -85 143 61 52 -162 232 43 118 -72 -40 7 -132 109 66
6118F6m5M3l01O7J75k27L4K20K13l02p9j73L45o0m3O3j19L40k10j6J84k16K71
$$ 66 21 64 -237 -170 5 -222 -188 32 245 -57 -136 -309 36 -24 -67 -4 -123 217 7 -9 175 -41 230
6141B30j20Q1m7m30J28K35j2p9L35l77K82q2k47j69M46l38M54l61KJ39Q1J05j75
$$ 230 110 191 144 -286 -158 77 65 -14 321 -56 226 144 -103 -272 174 -164 290 -71 -69 70 151 256 81
6164H1L13o14K94l0j98K71j36m6J67J69j71j17PK7n8J4J83o8p0J43k38J64k48
$$ 81 394 -220 74 44 -154 117 -19 -65 102 271 100 -17 -10 17 -41 -27 156 88 18 161 -77 87 -161
6187a61K52q7k18j19O51m89J10j01J68J80k59j84K12P0l8J44j24O6j41N3j36O7
$$ -161 91 4 -214 -333 318 -171 -61 -162 6 186 -73 -257 -45 25 -13 131 7 73 -68 -15 -151 -84
6209h4P9Or1K02k3j09l8q6L26k88j1J26j64K74k98J46J73l4r1J04j42K68k15O7
$$ -84 -5 1 -90 112 89 -20 -58 -144 182 -106 -117 9 -155 119 -179 -33 140 106 15 119 -23 245 30 97
6233I7j98K71j12q3k08J80q3J21P6j45P3j24K39n4J75M6m95K82k1k6k7m7j46N6
$$ 97 -101 170 58 -25 -233 -53 -136 -15 61 -84 -11 -135 104 50 225 271 -224 58 37 11 -16 -63 -209 -153
6257a53k2J84J32J0k97L52k14p7J52j4m9n9O7m3j21K54K81l36o9l6J97j01j81
$$ -153 -175 9 141 151 -146 206 -8 -85 67 53 4 -55 12 -31 -152 102 383 47 -22 -58 139 38 -143
6280a43m3M6O9n1K36j07j02k23L86j65PJ19O0m6J04L2O2j02L1j90P4Q3r3L0j13
$$ -143 -186 -140 -71 -122 114 7 -95 -318 68 -97 -90 29 89 43 147 179 241 139 170 -20 54 137 44 74 -39
6305c9o6L35j02k48J35N4J35l57N9K61M5k78lK13j83q6j1pJ01N3m4K7J22M9J39
$$ -39 -105 230 128 -120 15 69 204 -153 -94 167 212 -66 -69 144 -39 -125 -136 -143 -42 11 -33 -6 116 165 304
6330C04l99K51p1k25K51l80K58J22J55k59jR4k49P1K06j16J25k59J03N8K06m73
$$ 304 -95 156 85 -140 111 -269 -11 111 266 7 6 100 -149 -78 128 12 137 -122 -19 39 245 -228
6352b28K33K43l77J11j95R8J94L0p1O9l0J24m05L11j15l4L5l2j27J83J59k00k32
$$ -228 5 248 -129 -18 -213 -115 79 109 38 107 77 201 -204 107 -8 -42 -7 -39 -166 17 176 -24 -256
6375b56M03j54Q9L4p1j58J17o1J87k3j65J65l91K23Q5l7j51o1J73J62p6N4q9J43
$$ -256 147 -7 82 116 45 -113 4 -57 130 107 -58 107 -284 -61 24 -13 -164 -225 -52 110 34 88 -1 142
6399A42j6J18k05P3Q0n29K83J25N5l10M51k16q0l4R5J62k13o9o4M7K11q9N7nP
$$ 142 126 244 39 112 192 -337 -54 71 126 -184 267 51 -29 -63 32 194 -19 -88 -152 -105 106 17 74 69 76
6424G6j90m1K23j33l3K28r1O7m32L95j84L00k41j88L7K31J43m9M9k71J11O3j50
$$ 76 -114 -155 68 -65 -98 130 39 106 -326 69 -115 185 -56 -244 -207 24 167 118 167 -104 7 70 -80
6447h0k20K48J39j31J14j33K4R2K4k83K32L7q3K8p3n6P4K2K55N3n66J80n3L6K7
$$ -80 -300 -52 87 -44 70 -63 -39 53 77 -206 26 63 -20 8 -65 -121 -47 -25 230 283 -283 -103 -156 -120 -93
6472i3j1k55P19m74J08k94J3J63R5N9o1l0J63o8j38K43k75j24L84j58L07l71K18
$$ -93 -104 -359 360 -114 -6 -300 -287 -124 -29 30 -31 -61 102 34 -104 139 -136 -260 124 -34 273 -98 120
6495A20l7r5k4Q7K18k23k78K36l8LL2m9N2l99Q8N00l40N02j67j70r1J95Q3j81
$$ 120 83 -12 -36 51 269 46 -232 4 -34 -31 1 -48 4 -395 -307 193 -147 355 188 18 -73 122 205 24
6519B4k9O4m23K48M3J70j91j75K72J4J00j46p4n3K17j27M7j04j18RL43r2j79K16
$$ 24 -5 59 -364 -116 -73 97 -94 -269 3 17 117 -29 -103 -156 61 -66 -19 -123 -241 -232 111 19 -160 56
6543E6KM3q0j46L62k50J61j54j10R9J91L1J62n72J50j96L71J76m07L58j18j87
$$ 56 58 101 21 -125 237 -13 148 -6 -116 -17 174 205 367 -205 -55 -251 120 296 -111 247 129 -58
6565e8L68k86P9N2l84J98P7m1J83J35j24l13J81k68J60j86L09L1j49k02m8L79
$$ -58 310 24 103 155 -229 -31 46 5 188 323 199 -114 67 -201 -41 -227 82 113 -36 -238 -286 93
6587I3k6k06K07J0l1K0J08j25m2p6M36l30j42n1K64l6j11k65r4J98K07J29M1j28
$$ 93 67 -139 68 78 47 67 175 50 8 -68 368 38 -104 -155 109 73 -38 -303 -397 -199 8 137 178 50
6611E0j7J36j26k37M6K84j28j9P6k93J39J14j42L22n00L88o6n5P7nL31k67Q9k31
$$ 50 33 169 43 -194 -148 136 8 -11 65 -228 -89 25 -117 205 -295 93 27 -28 49 44 375 108 197 -34
6635c4L71l11J4P4k81J79l5Q2J13q7Q6r0j23Q2O7Mj54L7j77M08l1q1j34k55L23
$$ -34 337 26 40 114 -167 12 -23 59 172 85 171 81 -42 40 107 111 -43 -6 -183 225 194 113 -21 -276 47
6660D7k12J40L36k26q0k59K38n6Q0J8o1q1m2K82k05P9m55N39j03k41M18k30j93
$$ 47 -165 -25 311 85 5 -254 -16 -72 8 26 -35 -116 -158 124 -81 -2 -457 82 -21 -262 156 -74 -267
6683b67L53L2Mp1J15M3l19k49M01N1K23l33K4j02m4j10L1K24P0j44K58k12J62
$$ -267 86 118 122 51 166 209 -110 -359 42 93 316 -17 7 -95 -139 -249 -218 6 76 -68 190 -22 140
6706A40N6J38l59K06l30J25j18K15j00r0R0j89L21K52l13o8P8k57J81p2P4JJ30
$$ 140 196 334 -25 181 -149 -24 -142 73 -27 -117 -27 -216 105 357 44 -24 54 -203 -22 -94 -20 -19 111
6729A11l6r7K31k26NM3j80J27J8j50O8K46k91L48L2l15KnO%j5K71K6k94j78L21
$$ 111 75 -22 209 -17 -12 31 -149 -22 -4 -154 -86 160 -131 217 249 -66 -64 -69 -63 -63 -78 193 219 -75 -253 68
6755F8k90M27j02p6lL7K03j83J76j93p2QJ06o6j07k62L21J24q4m2o3j74J56J40
$$ 68 -222 205 103 27 24 61 264 81 257 64 -8 0 106 40 -67 -329 -8 116 32 -10 -73 -247 -91 49
6779D9n2J81l15K15j14J02K17l46l3K27j28r7O6K55j95k4j7l27L43N3J38m30L58
$$ 49 -3 178 -137 78 -36 66 283 -63 -96 131 3 -94 -28 227 32 8 -9 -336 7 60 198 -232 126
6802A26k09j36O05o09K32k43K90J1J08k86K19M9J41p62L19O3Q4O5k30J9J86Q2
$$ 126 -83 -219 386 -223 9 -234 56 67 175 -111 108 157 298 -464 -145 -82 2 67 -163 -144 42 124
6824A24r3j17J13L6q7N6r7r5J09N1K13m01K60O8k13J18l8J14j65N9j14k1O9k62
$$ 124 31 -86 27 63 -24 32 -65 -160 -51 0 213 -188 72 140 -73 45 7 121 -44 15 -99 -120 -51 -313
6848c13M10k1J67k12L3J2q0L8j89K44L5J9j34L9l58M47j14J76r0l86M11j5J02
$$ -313 97 76 243 31 64 76 -4 34 -155 89 124 143 9 48 -310 137 23 199 109 -277 134 119 221
6871B21k97l4N04j82j0k69K45k20l11L30l2qN1k3j44J01J83k34M7J6K8K2J15n3
$$ 221 -76 -110 394 212 202 -67 178 -42 -353 -23 -55 -63 -12 -35 -179 -78 105 -129 -82 -66 -38 -16 99 46
6895D6J74K6k00k47L02j2q4pnq4J52j08J81j08k78L80k30j17J7K8P6o5M4j63L78
$$ 46 220 246 46 -201 101 89 5 -2 -7 -91 61 -47 134 26 -252 128 -102 -219 -202 -174 -98 -163 -119 -282 96
6920I6p8Q5j14R8p6q8J46k96K26J27K01k6j95q4q9k9J17K70J9n17K25Q4m03J29
$$ 96 18 103 -11 87 11 -77 69 -227 -1 126 327 301 106 22 -67 -96 21 291 310 -207 18 102 -301 -172
6944a72J62k22J84J3j42Q2J22J67l61J98k6k32M0QL49k86J32J9m0j5O6J22j29
$$ -172 -10 -232 -48 -35 -177 -95 27 194 -167 31 5 -227 -187 -179 170 -116 16 35 -5 -20 46 168 39
6967C9R6j97q9K1J13J17j16NJ64k17j67K70o2J58P5m55L30j24O2k42j1K30J32
$$ 39 135 -62 -151 -130 -17 100 -16 -11 153 -64 -231 39 -23 135 210 -245 85 -39 23 -219 -230 0 132
6990A32k58J25j6k02K65j73R5O8j08J08O3j78M1K44j46j8nK78k94J64l72J84K13
$$ 132 -126 -1 -17 -219 46 -127 -32 36 -72 36 99 -79 -38 206 60 42 37 315 21 185 -187 -3 210
7013B10n70K81j36%J10J53l47K09j75K99O0l41O26m29pJ04Jj18K11p4j62J17J83
$$ 210 -360 -79 -215 -215 -105 48 -299 -90 -265 34 94 -247 379 -50 -57 47 48 -70 141 67 -95 22 205
7036B05M9j04O8l55K70q9j41N7j04j23L09R6j10Rq4j55J62L10l36L2j4k10L87
$$ 205 254 150 218 -137 133 44 -97 -40 -144 -267 42 138 28 37 -47 -202 -40 270 -66 -34 -48 -258 129
7059A29r8L8r7K34n2j58q7j9J67k05k04L16q8J32j08R1j91N5J82q9l5P0J07k00
$$ 129 31 69 -28 206 154 -4 -91 -110 57 -148 -352 -36 -124 8 -100 -9 -200 -145 37 -52 -87 -17 90 -110
7083a10oN4P3L2p4J00M1n1o6P9j19j06K94m7l56K91j41P1K0l2n3J23J58O3m31
$$ -110 -116 -62 11 43 -31 69 110 59 -7 72 -47 -153 141 94 -262 29 -112 -41 -21 -53 -106 17 175 238 -193
7108a93K19L9p7K33k88J9j08L00k84L95j1k85J21k23j4L12r7R8k76K73J8k58J37
$$ -193 26 65 -12 221 -67 -48 -156 144 -140 255 244 -41 80 -143 -157 155 58 156 -120 153 171 -87 50
7131E0m1L45l23J79k8k27N9k23L67j75p2J80k3j40J23j59J62j71j00K79L9j19
$$ 50 9 354 31 210 182 -45 14 -209 158 -17 -89 91 68 -72 51 -108 54 -117 -217 62 101 -18
7153a8J7o9J52l0j32N7k82J94L77m03R6J9k16L80n5R2J64l41J85k54L60j41m8
$$ -18 -1 -70 82 52 -80 -23 -305 -111 266 -137 -41 -22 -238 142 87 179 343 2 187 -67 293 152 104
7176A04k35m7rK7M09k12k1j80j24L32j80K78k47Q3j03m3L28J9j53l6M7R6k54N4
$$ 104 -131 -178 -187 -160 249 37 16 -164 -288 44 -136 142 -105 -22 -125 -168 160 179 26 -10 37 133 -121 -67
7200f7N4J3J62k39m0J94M0J20r1j81J3j25R3J97q0J77m21M6K81k67L73k96m9K79
$$ -67 -13 0 162 -77 -117 77 117 237 146 -35 -22 -147 -54 143 63 240 -181 -135 146 -121 252 -44 -93 186
7224A86k06J38k46J98k02J35J7k45K25M2k58K37J88o6m21K67M5K09m93N26m0j23
$$ 186 -20 118 -128 70 -132 3 20 -225 0 42 -216 21 209 143 -278 -11 34 243 -250 276 236 113
7246A13k7j01NQ7j04kr0K87j30l60K98l38K37L0J19j50N7p0Q5L8j70j24L85j22
$$ 113 86 -15 -10 77 -27 -29 -119 168 38 -322 -24 -362 -125 -95 24 -126 -69 -139 -54 -16 -186 -310 75 -47
7270d7q5K91q9N4j67J26J12K06l69J35n20M10k28L97n73L07o9J81k85J08K73L0
$$ -47 -132 159 70 124 -43 83 195 401 32 167 -353 57 -171 226 -347 -40 -109 72 -213 -105 168 198
7292A98l69J07J83J71k06Jj52o3M04m39J75J28kj44R1Pm50L49N3P8j37J3j25P7
$$ 198 -171 -64 119 290 84 85 -67 -130 274 -165 10 138 136 -8 83 90 -360 -11 42 120 -17 -4 -129 -52
7316e2K30n67K52O1M3j58Q7K63q2k83K06J32J81k94r0L35l86n4M52k43K6j35Q4
$$ -52 178 -389 -137 -76 -33 -191 -104 159 77 -206 0 132 313 19 -71 264 -122 -176 276 33 59 -76 8
7339HJ10j71k02J37O6j38Q8L9K31N8m18Q5m6R3P9j26O3n5K98k67M9K3n9J12j01
$$ 8 118 -53 -255 -118 -52 -190 -102 -63 168 226 -192 -107 -153 -60 19 -107 -44 -99 199 -68 -19 4 -55 57 -44
7364d4j9L3O6j34L67k26J1lKj86o5L4K13L7j18J78j83J3K0J6J66J37l39L43k58
$$ -44 -63 -30 36 -98 269 43 54 51 53 -133 -198 -164 49 86 -32 146 -37 -24 -4 12 178 315 -24 319 61
7389F1j25p2j6P3jOJ19K0j57L19l20J22o4j29J27j51K52l73L73K03j01j48q8J74
$$ 61 -64 -136 -152 -79 -80 -74 45 65 -92 227 -93 29 -35 -164 -37 -188 64 -309 64 267 166 18 -70 104
7413A04J14k13r2k45L27K9l93L75K78k63j30J49j21J86o3j81L9K24J21j57j33
$$ 104 218 5 -87 -332 -5 24 -369 6 284 21 -109 40 -81 105 42 -139 -100 124 245 88 -45
7434d5m3J37P2j92R4q7k1K17j98q2N2m9L36l01K73k89M51k8m44j07J97K38m02
$$ -45 -88 49 121 -71 23 -64 -85 132 -66 -148 -96 -145 191 -110 163 -126 325 297 -147 -254 -57 181 -221
7457b21k6L28k31K32J21K1l19j8J12l5m6J9N39l44l60K27o9J15k3q0K16j32j9
$$ -221 -247 81 -150 82 203 224 -95 -113 -1 -36 -82 -63 476 132 -228 -1 -70 45 22 -58 158 26 7
7480GJ22OK09l42K56l4l65K10k9J28j39n8j55M56m82L56r8k84P2J08J94j21m4
$$ 7 129 135 344 2 258 224 -141 69 40 168 29 -29 -184 272 -210 146 48 -236 -164 -56 138 17 -27
7503b7M2m1M2k7O8q3J56L4N1k87J30J04j14J06k54J77j73J79l25K11O1l4%J6J32
$$ -27 15 -26 16 -11 57 -26 130 164 215 -72 58 162 48 154 -100 77 -96 83 -242 -31 30 -4 -4 12 144
7528A44j64j12J45J18j71K26k70l5k21M11n4p4R3OQ6p7j52K03Oj32k95L25k3k51
$$ 144 -20 -132 13 131 -40 186 -84 -119 -340 71 17 -57 36 42 128 51 -101 102 108 -24 -319 6 -17 -268
7552b68K94RLk07M3J62l6j18J39r9N7M2qL6q1J51q7J25n0J45k42k08J41L51l53
$$ -268 26 35 38 -169 -126 36 0 -118 21 -78 -21 21 13 49 -32 119 32 157 107 252 10 -198 -57 294 -59
7577e9P7o0J54k18l0J11J15j92lM0n4M26l92q3K83k35L0J07L7R5j81R3j89L38
$$ -59 18 -42 112 -106 -136 -25 90 -102 -105 -65 -119 307 -85 -168 115 -120 -90 17 54 149 -32 61 -128 210
7601B10j87n4j65J93j70J63J45K31m94J85L0j30K1L83m41J4K04k05Oj20K35k74
$$ 210 23 -31 -196 -3 -173 -10 135 366 -128 57 87 -43 -22 361 -80 -66 138 -67 -61 -181 54 -220
7623b20J05M4Q9j34K31o4k10K50n8o9k00K69r1m4J19P4L9k15J1K42J29l20L68
$$ -220 -115 -71 18 -116 115 51 -159 91 33 -36 -236 33 -58 -102 17 91 130 -85 -74 168 297 -23 345
7646C45l97oK09j96Q4m9J05k61P9n0J87Nk6N3K9k46J55K2j60M4J34j8l2k7j58
$$ 345 -52 -58 151 -45 39 -10 95 -166 -87 -137 50 55 29 82 111 -135 20 42 -118 -74 60 42 10 -17 -175
7671a75K66p7j38JJ25L3Jj0K9r1j9R4j68J11J19k35J33j1ml7J78k05L5L7M6M8
$$ -175 91 14 -124 -123 2 35 36 26 55 -36 -55 39 -129 -18 101 -134 -1 -12 -16 -53 125 -80 -45 -8 38 86
7697H6j07o8J23P4J49k85j37J85N0J13o2J76j59K3r8q8j0J11J56k44q7N4J95k00
$$ 86 -21 -89 34 108 257 -28 -165 20 70 183 121 297 138 161 63 -25 -35 76 232 -12 -99 -45 150 -50
7721e0J73j2j16l5j3K5K00l34K50K57k27k05p9K19o1o8n1L48l30l1J28J59K5k35
$$ -50 123 111 -5 -40 -53 -28 172 -162 88 345 118 -87 -166 53 -8 -76 -127 221 -109 -140 -12 147 172 -63
7745f3K77P3k28k13L60J31J6l94j21QJ72Q1R9k46O5J42j08Oj77K35j85J99j82
$$ -63 214 287 59 -154 206 337 353 -41 -162 -154 18 99 198 -48 17 159 51 57 -120 115 -70 129 -53
7768e3K63l00q8J73L8Q1K2O2j59O0J2l31L21L57m52q9j07K16k37K00k92L74NJ01
$$ -53 210 -90 -178 -5 33 114 136 198 39 99 111 -220 101 458 6 -83 -190 26 -211 -11 -303 71 76 177
7792A77j01j67J27p1K4q9K25k12L3j68R2q7N3J64J9j59J6M4OK63J0j79q2J93l13
$$ 177 76 -91 36 -35 -11 -100 125 -87 -54 -222 -130 -217 -164 0 19 -140 -124 -80 -74 189 199 20 -62 131 -182
7817a82K04j94M05r2L4l35J86k56K14k9K3j50J9J76n2K35q1k41L4J33k29NK5R2
$$ -182 22 -172 233 141 175 -160 26 -230 -16 -45 -22 -172 -153 23 -29 206 125 -116 -82 51 -178 -173 -148 -56
7841e6J68r3j75K47N6m21O9K39R1k02p5K96l62J96k33L2L00J12o17M09k3L8J2
$$ -56 112 19 -156 91 147 -274 -205 34 125 -77 -152 144 -218 -22 -255 -223 77 189 -428 -19 -42 -4 8
7864Hk02L45o5l4J0j1m3j0N4j03J32j62J74R9n3P6j69j83M43m56J76J93k45J93
$$ 8 -194 151 86 52 62 51 8 -2 52 -51 81 -81 93 192 139 215 46 -137 306 -150 26 219 -26 167
7888A67oJ07l62K8k7ol6P7l29J05P7L08J00J68l41j95L82l81J92R4n1r2K80j49
$$ 167 161 268 -94 -66 -93 -99 -135 -58 -387 -282 -205 103 203 371 30 -165 217 -164 28 122 71 -21 259 110
7912A10n6p8J17nk59J46%L79n24K68k95L1o5P4M9K7K48j66j40K61m56L12m7J65
$$ 110 54 -24 93 88 -171 -25 -25 354 -170 98 -197 -166 -231 -157 -108 -81 167 1 -139 122 -334 -22 -69 96
7936I6r8q7Q4j14J18j91J29j73M61j37J35J0l35Q0P0k81L03p3k28K73J3j73J78
$$ 96 -2 -89 -5 -119 -1 -192 -63 -236 225 88 223 233 -102 -22 48 -233 70 -3 -231 42 55 -118 60
7959F0l43K61K0J50K14m78J85O3l42l0j15M16L8J6l9l3J25l0j29k8K49j55j54
$$ 60 -283 -22 -2 148 362 -116 69 132 -210 -240 -355 61 99 115 76 43 168 138 9 -19 230 75 -79
7982g9K93l6j8k58Q0j8lP9j38K47L7k14r7M21l63J09r0Q9J21j76Q4k92K98k6J50
$$ -79 214 178 160 -98 -18 -36 -39 40 -98 149 186 -28 -125 296 -67 42 -48 41 162 -14 70 -222 76 50 200
8007B00l13M0q3K12k17K02j35nJ04L3J24k22j4J92o5J31l14J03O4j07j73K42K10
$$ 200 -113 -73 -156 56 -161 41 -94 -99 5 38 162 -60 -74 118 53 184 -130 -27 37 -70 -243 -1 209
8030B09L7j63k09j50L92k69K08j1j1Q5j91J1rj01Q1J15K8rk70J30N6k50N37m06
$$ 209 246 83 -126 -276 116 -153 55 44 33 118 -73 -62 -71 -172 -91 24 52 43 -227 -97 -41 -291 246 -160
8054a60K0N1K07k23J06q8J28K20l21K29L7j30k10K34Q2l33N0q4O3L1qK94l34M33
$$ -160 -140 -89 118 -105 1 -87 41 261 -60 169 206 76 -134 100 182 -151 -101 -185 -122 -91 -99 195 -139 294
8078B94l01o2K44k28K6J87j14K50m74J69j40J62n2k90N58l31J55j03rq8J51j43
$$ 294 -7 -69 175 -53 -27 160 46 296 -178 -9 -149 13 -39 -329 229 -102 53 -50 -59 -147 4 -139
8100a39J55J58m6j25l5J17j49RJ59Q5k82K41l59K33j10J39M2j74R3j40P6p2k5
$$ -139 16 174 128 3 -32 85 -64 -55 104 189 -93 148 -211 22 -88 51 93 -81 12 -128 -52 -124 -149
8123a49M27K1l74m5L0K78r0j57L57k47m0P6r5J47rk29L06k52l1L77m62J69J3j48
$$ -149 278 299 -75 -120 -90 188 98 -59 298 51 11 87 -8 139 130 -99 207 -45 -76 301 -161 8 21 -127
8147a27O8L3K00r4j74N1R5j37j53L71k29M5KK43j12j90K7j9L87m33J44k79L61
$$ -127 -59 -26 174 80 -94 -43 52 -85 -238 133 -96 -51 -49 194 82 -108 -81 -100 287 -146 -2 -281 80
8170H0QJ71n92L22Q9j46L23j76j54K24l21O9r9K97m18K43p5L60k52Q6M3
$$ 80 88 259 -333 -11 78 -68 255 79 -75 149 -172 -103 -202 95 -323 -80 -155 205 -47 39 82
8191H2
$$ Imaginary data points
##PAGE= N=2
##DATA TABLE= (X++(I..I)), XYDATA
0@%%%%%%%qJ6j6J6k4L2m0M8n6P1q5J01j18J35j57J83k11K43k79L19l63M13m68
$$ 0 0 0 0 0 0 0 0 -8 8 -8 8 -16 16 -24 24 -32 39 -46 55 -63 72 -85 98 -113 130 -149 170 -193 220 -248
30b48N27n93O66p47Q34r30J038j152J277j417J570j738J925k131K360k617K904
$$ -248 279 -314 352 -395 439 -491 547 -605 672 -745 825 -913 1012 -1119 1241 -1376 1528
47A528l230L603m035M541n141N867o774P938r493J1695j5076K1005l4411J19335
$$ 1528 -1702 1901 -2134 2407 -2734 3133 -3641 4297 -5196 6499 -8577 12428 -21983 97352
61I7352O341j55295Q6109l153q3922k4097O1701l9146o9287K2705Q7613J1098
$$ 97352 103693 -51602 34507 31354 -52568 -76665 -14964 -54110 -123397 -100692 -13079 -1981
73a981J5376O4323M307p8732J1167P9036j1740p9712J483J2479o7273m4803N3655
$$ -1981 13395 77718 82025 3293 14460 93496 81756 2044 3527 16006 -51267 -96070 -42415
86d2415L6798k5326j9716J0071N306K6166N5794K1601k2725N046J0889l9354k2587
$$ -42415 -5617 -30943 -50659 -40588 -35282 -9116 46678 68279 45554 50600 61489 22135 -452
99d52L8256J453p3657n0693J4116Q006p408M1736M7521k3572j3552O0656K9349
$$ -452 37804 39257 -34400 -85093 -70977 -62971 -70379 -28643 18878 -4694 -18246 42410 71759
112G1759k8823J9156L9293o4807r7642K2398N8755m8422n2146M8477J9441o1947
$$ 71759 42936 62092 101385 36578 -61064 -38666 20089 -28333 -80479 -32002 -12561 -74508
124g4508R468R8389K6003m9381R376L8937l6094k8801O0367J9886q0057l6528
$$ -74508 -65040 33349 59352 9971 19347 58284 22190 -6611 53756 73642 -6415 -42943
136d2943L8125j3005n2697K9439N6529l6122m9517M2586N1449l957J1260L5100
$$ -42943 -4818 -17823 -70520 -41081 15448 -20674 -70191 -27605 23844 19887 31147 66247
148F6247j1437l8989Q81J3201k1800j8067K423k9869m2318J7250M3881O914J653
$$ 66247 54810 15821 16702 29903 8103 -9964 -7541 -37410 -79728 -62478 -18597 -11683 -10030
161a0030K5610P891j6849J6872L7373q940l0973J225j4945m8181J746M6636j0834
$$ -10030 15580 23471 6622 23494 60867 51927 20954 22179 7234 -40947 -39201 7435 -3399
174c399m8526J1248L5524k0423j0610O1411L3987m8920k1780M4152R032l4321
$$ -3399 -51925 -40677 -5153 -25576 -36186 25225 59212 10292 -11488 32664 41696 7375
186G375J3000K8122m9109n8543K8385L0945l8135r409M9701k158m7305K6515P3024
$$ 7375 20375 48497 -612 -59155 -30770 175 -37960 -47369 2332 174 -47131 -20616 52408
199E2408N04l6333J7165J4578m5544k2378L4629J737m5613j4319J6058r087m792
$$ 52408 52912 16579 33744 48322 2778 -19600 15029 16766 -28847 -43166 -27108 -36195 -40987
212d0987M0602K7333k2728r123K4403M056r816J7203J0197l1832k7003P041R65
$$ -40987 -385 26948 4220 -4903 19500 23556 13740 30943 41140 9308 -17695 -10654 -9689
225i689r142J2838N776k9782j2145L0096J5369p922J8468K5254k2850k7026K7927
$$ -9689 -18831 -5993 -217 -29999 -42144 -12048 3321 -4601 13867 39121 16271 -10755 17172
238A7172K7950k6382k0338J2315j8862m3435J2881M3340j0575k9398K3518K4076
$$ 17172 45122 18740 -1598 10717 -8145 -51580 -38699 4641 -5934 -35332 -11814 12262
250A2262k3356M624N5847P111n1632j0219K8250j6457l1420K2835K0923m1595
$$ 12262 -11094 -6470 49377 56488 4856 -5363 22887 6430 -24990 -2155 18768 -22827
262b2827l0510L3888K3096j6976R438L0556j4940l0949K1672L4133j4538j6679
$$ -22827 -53337 -19449 3647 -13329 -3891 26665 11725 -19224 2448 36581 22043 5364
274E364J4360q889l4874L562K8631o128k2482K389L262j1903J1885L2494M056
$$ 5364 19724 10835 -24039 -20477 8154 2026 -20456 -18067 -14805 -26708 -14823 17671 21727
287B1727j4113N486M134j2366M092K0279j0933l4054o110Q585j2112j420L0101
$$ 21727 7614 13100 17234 4868 8960 29239 18306 -15748 -21858 -13273 -25385 -26805 3296
300C296N778k8509R56L1852L000j0694K1203R692l7751k0801K9043R792k8091
$$ 3296 9074 -19435 -18479 13373 16373 5679 26882 36574 -1177 -21978 7065 16857 -11234
313a1234j528K0073j9932k9303K5515L5979j4569j8611K1547O406k5070R138L8823
$$ -11234 -12762 7311 -12621 -41924 -16409 19570 5001 -13610 7937 14343 -10727 -1589 37234
326C7234o464l6549O66J3900j9600j1704K6150N196l3835p763K6662O703n421
$$ 37234 30770 -5779 -5113 8787 -10813 -22517 3633 8829 -25006 -32769 -6107 596 -4825
339d825J9375J5056k0595j5204J7301Q778j3334j750J701k1884j5746J6882J4772
$$ -4825 14550 29606 9011 -6193 11108 19886 6552 4802 6503 -15381 -31127 -14245 527
352E27q276J504J1344r675r682K2322J8898j3272q544Q292j0890j8308J5694J9714
$$ 527 -7749 -6245 5099 -4576 -14258 8064 26962 13690 5146 13438 2548 -15760 -66 19648
366A9648j9567k1603J1641M193j7629R881L1182n810k8036J0299K4807r842p626
$$ 19648 81 -21522 -9881 -5688 -23317 -13436 17746 11936 -16100 -5801 19006 9164 1538
379A538K3770J970l8238j0557K5150j517k1556J0432J4549k2730j4223L1642K2964
$$ 1538 25308 27278 -10960 -21517 3633 2116 -19440 -9008 5541 -17189 -31412 230 23194
392B3194j6047m037J7150q593k2168J2632K1329j5288k2638N586K928j5001O633
$$ 23194 7147 3110 20260 11667 -10501 2131 23460 8172 -14466 -8880 -5952 -20953 -14320
405a4320K3999l120j9847N195J3411m475K833J7847k983k2063j241J1448n641
$$ -14320 9679 6559 -13288 -8093 5318 843 3676 21523 18540 -3523 -4764 6684 1043
418A043m872J0514n303k2481j338J9038J403m886J3922N751j8617j531K5279N192
$$ 1043 -3829 6685 1382 -21099 -22437 -3399 -1996 -6882 7040 12791 -5826 -7357 17922 23114
432B3114j8161K90O993k1193j5928K1023J3953k0928p633J7966k748j4025J9700
$$ 23114 4953 5243 12236 -8957 -24885 -3862 10091 -10837 -18470 -504 -3252 -17277 2423
445B423K6077j4794k1372J2642Q651j6961l03K0759p973k9660J486K0008n108
$$ 2423 28500 13706 -7666 4976 13627 -3334 -3637 17122 9149 -20511 -19025 983 -4125
458d125q662J6979N902k2275l465K5279P224j2007M419O413j7006j1551J6350
$$ -4125 -12787 4192 10094 -12181 -15646 9633 16857 4850 9269 15682 -1324 -12875 3475
471C475Q509j5815p389N945p392p510J6650J5740q389o358R009p9p243J1114J1898
$$ 3475 11984 -3831 -11220 -5275 -12667 -20177 -3527 12213 3824 -2534 6475 6396 -847 10267 22165
486B2165j5630j7219N144K295j0367N842J5873j0021j6905J0614J5691o376J35
$$ 22165 6535 -10684 -5540 -3245 -13612 -7770 8103 -1918 -18823 -8209 7482 1106 1241
499A241J7305m728k2556K488J9592m894j3346Q274J705k2171n184K4076P131j6958
$$ 1241 18546 13818 -8738 -6250 13342 8448 -4898 3376 5081 -17090 -22274 1802 8933 -8025
513h025J103J3106q927q306K1127J5465j7690j1915R871k399j4009P625J4078
$$ -8025 -6922 6184 -2743 -11049 10078 25543 7853 -4062 5809 3410 -10599 -2974 11104
526A1104j4116j8268Q583J1296m909M187J6254l633j6570M871J4110l887n942
$$ 11104 -3012 -21280 -12697 -1401 -6310 -2123 14131 10498 -6072 -1201 12909 9022 3080
539C080N811m468j8382n77J5133L8q120N341K405j1375J652J9050M466j1318J062
$$ 3080 8891 4423 -13959 -14536 597 635 -7485 -2144 261 -11114 -9462 9588 14054 2736 3798
554C798N677j0832m917J5372M291j8040o631Q114m589q251J4434J2829j3500j0101
$$ 3798 9475 -1357 -6274 9098 13389 -4651 -11282 -3168 -7757 -16008 -1574 11255 -2245 -12346
568a2346J4536P536q838N990J3880j2721k0157P040J1900j0308n841J1474l100
$$ -12346 2190 9726 888 6878 20758 8037 -12120 -5080 6820 -3488 -9329 2145 -955
581i55j8375N368K1715Q48r693P057N041j3713k611J7687K581j7052l868O271
$$ -955 -19330 -13962 7753 8601 -1092 5965 11006 -2707 -5318 12369 14950 -2102 -5970 301
595C01p697p009J4124Q276j3414n943J0360K013m864J0687J0273j1533j1192P790
$$ 301 -7396 -14405 -281 7995 -5419 -11362 -1002 1011 -3853 6834 17107 5574 -5618 2172
609B172M462p625J354O698j0502j4097P558J0824m413m61J0716k781j1692P084
$$ 2172 6634 -991 363 7061 -3441 -17538 -9980 844 -3569 -4030 6686 3905 -7787 -703
623g03J5637l716r537M646j464j5636j46J6014j351j4101K169P552p068j580J7826
$$ -703 14934 11218 1681 6327 4863 -10773 -10919 5095 3744 -10357 -8188 -636 -7704 -9284 8542
638H542O636j5060l842J0583k365p861R442P480j6349j1856R857N494q178L036
$$ 8542 15178 118 -3724 6859 4494 -3367 6075 13555 -2794 -14650 -4793 701 -7477 -4441
652d441J0851q179j1789J0808J3357m918l154Q104m092j3663L840J2233m937j0436
$$ -4441 6410 -1769 -13558 -2750 10607 5689 2535 10639 6547 -7116 -3276 8957 4020 -6416
666f416K616M10r671K218J5460K171j0128K239P234n023j551J1971K166j5494
$$ -6416 -3800 -3390 -13061 -10843 4617 6788 -3340 -1101 6133 1110 -441 11530 13696 -1798
680a798m723O675l264n605Q889N189j2749n815J1754N185m859N302Q121r435j0297
$$ -1798 -6521 154 -3110 -8715 174 5363 -7386 -13201 -1447 3738 -1121 4181 12302 2867 -7430
695g430R702Q693q247m039N968o228j2888N578J3729m608p939O982K773q973M237
$$ -7430 2272 10965 2718 -1321 4647 -1581 -14469 -8891 4838 230 -7709 -727 2046 -6927 -2690
710b690J6293j028j3026R46N437q119l760J0570P70j4440l289R561j88l544R913
$$ -2690 13603 12575 -451 495 5932 -2187 -5947 4623 5393 -9047 -12336 -2775 -2963 -6507 3406
725C406O588j0745n169J0577M190o605J949M612j0015j0144P783P025o634k571
$$ 3406 9994 -751 -5920 4657 8847 2242 4191 8803 -1212 -11356 -3573 3452 -3182 -5753
739e753O451l394q167P930J2179l310o377N245O55q756K506J0917l895j2417O22
$$ -5753 698 -2696 -10863 -2933 9246 5936 -441 4804 5459 -3297 -791 10126 6231 -6186 -5564
754e564L904o263o13J1661J723j1482J99J0467k33l498Q694L225j3128n970Q905
$$ -5564 -1660 -7923 -8536 3125 4848 -6634 -6435 4032 3799 301 8995 12220 -908 -6878 2027
769B027J705p794J636M969r141p070J0738Q753n619j099P174l033q562P232J0284
$$ 2027 3732 -4062 -2426 2543 -6598 -13668 -2930 5823 204 -895 6279 3246 -5316 1916 12200
784A2200o368q801L940r09q977K970J0723l075j0381L357N911l965J258J1668
$$ 12200 5832 -2969 971 62 -8915 -5945 4778 1703 -8678 -5321 590 -3375 -2117 9551
798I551K81j1472l21P535k339m749N453R40j2490m290R424K769n078M183N395
$$ 9551 9832 -1640 -1961 5574 3235 -1514 3939 4879 -7611 -11901 -2477 292 -4786 -603 4792
813D792o923m608J0793P086o672k468L936n869q091O315Q132p311o910M515R14
$$ 4792 -2131 -6739 4054 11140 4468 2000 5936 67 -8024 -1709 6423 -888 -7798 -3283 -2369
828b369n721N266J1380l236q854L643N749m822l38Q623l082j2412q92P705k433
$$ -2369 -8090 -2824 8556 5320 -3534 109 5858 1036 698 9321 6239 -6173 -7065 640 -1793
843a793m059O536J946j0227r92J1465K924m354L062L545q009n008Q810L341q038
$$ -1793 -5852 684 2630 -7597 -8589 2876 5800 1446 4508 8053 44 -4964 3846 7187 -851
858h51k948L300m524n786Q115Q207n782m416O283J033m651M967Q274n765r405
$$ -851 -3799 -499 -5023 -10809 -2694 5513 -269 -4685 1598 2631 -2020 2947 11221 5456 -3949
873c949K776L263n470m0P375l368j0015K219P875q10j304O566R38q546o74R424
$$ -3949 -1173 2090 -3380 -3420 3955 587 -9428 -7209 666 -144 -1448 5118 6056 -2490 -3164 6260
889F260O15o186J173J677q481m196Q671L534p077j050N456k412l720Q335P332
$$ 6260 6875 689 1862 3539 -4942 -9138 -467 3067 -4010 -5060 396 -2016 -5736 2599 9931
904I931o335m558M464p33o141L265O584o114r105L700M319l721J134Q429k252
$$ 9931 3596 -962 3502 2769 -3372 -107 6477 363 -8742 -5042 -723 -4444 -3310 5119 2867
919B867p818K920Q024k074k907N015n68r976p71P703o44n887J905K510o710j098
$$ 2867 -4951 -2031 5993 3919 1012 6027 5459 -4517 -5288 2415 1771 -4116 -2211 299 -6411 -7509
935g509R452L943n764J76M367l420l483O351M271p810n187L427r48m446M054O509
$$ -7509 1943 5886 122 298 4665 1245 -2238 4113 8384 574 -4613 -1186 -2134 -6580 -2526 3983
951C983n130n901N082M928k967J668O466l219q209K120N584l365l515L704j129
$$ 3983 -1147 -7048 -1966 2962 -5 1663 8129 4910 -3299 -1179 4405 1040 -2475 1229 100
966A00q245R35Q447P81m807L458L036n790j048Q841K187o794j129K303m186l695
$$ 100 -8145 -7210 1237 2018 -2789 669 3705 -2085 -3133 5708 7895 1101 -28 2275 -1911 -5606
982e606O035L561o853l900M534J242k908N222O302n067n790M521L445l997R8M838
$$ -5606 429 3990 -2863 -6763 -2229 -987 -3895 1327 7629 2562 -3228 1293 4738 741 839 5677
998E677m611q607K665N741k477k117M796Qo521K210Q961l28m639K286P89n917
$$ 5677 1066 -7541 -4876 865 -1612 -3729 1067 1075 -5446 -3236 5725 5397 758 3044 3833 -2084
1014b084j326O787L91o896r55L304l030k338O935M124n858k415N353N70l016L972
$$ -2084 -3410 3377 3768 -3128 -4083 -779 -3809 -6147 788 4912 -946 -3361 1992 2562 -454 3518
1030C518M212o274n896L479K403m399N65M593l629o049L699O781j568j305M555
$$ 3518 7730 1456 -4440 -961 1442 -2957 -2392 2201 -1428 -7477 -3778 3003 1435 130 4685
1045D685p78o393J253O935j632n521P85Q34n749l50P559P83n885N57M247k130
$$ 4685 3907 -2486 -1233 5702 4070 -1451 -666 168 -5581 -5931 1628 2411 -3474 -2917 1330 -800
1061h00j009O496K456o542k614M016p70l896L285K908o013m784M934K949k790
$$ -800 -1809 4687 7143 601 -2013 2003 1233 -2663 622 3530 -2483 -7267 -2333 616 -2174
1076b174J513M932l441m899M539N470l445j789K907k367o622J973O253k699m370
$$ -2174 -661 4271 830 -4069 470 5940 2495 706 3613 1246 -5376 -3403 2850 151 -4219
1091d219K442J295l901J295P500O14n553M94L411l096j713N121R74p424k364M326
$$ -4219 -1777 -482 -4383 -3088 4412 5026 -527 -33 3378 282 -1431 3690 4664 -2760 -5124 -798
1107g98o29k576L908L560n381k975N530L290l067J139L381m007n568L963L684
$$ -798 -1427 -4003 -95 3465 -1916 -4891 639 3929 862 2001 5382 1375 -4193 -230 3454
1122C454l519k502K605j429m707K812O609j341l570K650J217l474J224N821j016
$$ 3454 -65 -2567 38 -1391 -6098 -3286 3323 1982 -1588 1062 2279 -1195 29 5850 4834
1137D834o597L1K600l284j556N005Q97n853p75N296r0j733M146K378n116k905
$$ 4834 -1763 -1732 868 -2416 -3972 1033 1930 -3923 -4698 598 508 -1225 2921 5299 183 -2722
1153b722M718J452l852J67K688m314m533M311M105l068j258L765j144l791L303
$$ -2722 1996 3448 -404 -237 2451 -1863 -6396 -2085 2020 -1048 -2306 1459 315 -3476 -173
1168a73N929k424l829J984Lm091N22N216j708n760R46K957j991J09N082J070n242
$$ -173 5756 3332 -497 1487 1490 -2601 -2079 3137 1429 -4331 -3385 -428 -2419 -2310 2772 3842 -1400
1185a400l18M543o25k176L023Q67n644l044M524R59l106J067K553l001l118M992
$$ -1400 -1718 2825 2200 24 3047 3914 -1730 -4774 -250 709 -2397 -1330 1223 -1778 -4896 96
1201I6L917k719q68K863j849l797K558L977k748m356K090K88l572J166N486j087
$$ 96 4013 1294 426 3289 1440 -2357 201 4178 1430 -2926 -836 -548 -4120 -2954 2532 1445
1217A445m123J464L280j859OM417l28o118l57L520j039k368K306R79m897j350
$$ 1445 -2678 -1214 2066 207 213 4630 4302 -1816 -2173 1347 308 -2060 246 1225 -3672 -5022
1233e022M918J834k575J552K632l016k794M278K558l344j857J945j999l578K963
$$ -5022 -104 1730 -845 707 3339 323 -2471 1807 4365 1021 -836 1109 -890 -4468 -1505
1248a505M124k893k748K616O98k218J879M549j517m219J074K313k557m91L562
$$ -1505 2619 -274 -3022 -406 292 -1926 -47 4502 2985 -1234 -160 2153 -404 -895 2667
1263B667j098n176K82K956l77j257K953J309m072p84M865J354l008J004J143l594
$$ 2667 1569 -3607 -3325 -369 -746 -2003 950 2259 -1813 -2597 2268 3622 614 1618 2761 -833
1279h33k848M255J814l860j073K437j425k193L626L872k500k642K589N96k631
$$ -833 -3681 574 2388 -1472 -2545 -108 -1533 -3726 -100 3772 1272 -1370 1219 1815 -816
1294h16J516L603k856m820J586J967k058Q0L471r78l973R83M275l10j472K685
$$ -816 700 4303 1447 -3373 -1787 180 -1878 -1798 1673 695 -3278 -2295 1980 1670 198 2883
1310B883j14l906q54L921j56k919M94J059l064j512M284J872k809j50K610j245
$$ 2883 2769 -1137 -1991 1930 1774 -1145 -651 408 -2656 -4168 116 1988 -821 -971 1639 394
1326C94j754K921K916l365k618J586k6k384J607K705k325l322K077K305j330O52
$$ 394 -1360 1561 4477 1112 -1506 80 54 -2330 -723 1982 -343 -3665 -1588 717 -613 39
1342C9L180r61l943P01L774j414j644J893k81m422k68M034J64k382Q36J889k722
$$ 39 3219 2258 -1685 -984 2790 1376 -268 1625 1344 -3078 -3346 688 852 -1530 -694 1195 -1527
1359a527o64M286J546l287m64J883j466k249K593J766l069k430J991M75j928K014
$$ -1527 -2191 2095 3641 354 -110 1773 307 -1942 651 2417 -652 -3082 -1091 -616 -2544 -530
1375e30K944j678l036K392J882j335l8K416j683l763O74K854j615j126J759l7
$$ -530 2414 736 -2300 92 1974 639 601 3017 1334 -2429 -1755 1099 -516 -1642 117 80
1391H0l069J060L514M35k280J210R32k523n98L365P39l683p50J650j691j662L218
$$ 80 -2989 -1929 1585 2020 -260 950 1882 -641 -1239 2126 2865 -818 -1568 82 -1609 -3271 -53
1408e3K032l106j410K863N38j499K162K231k617l105J902J681k190k61K384j850
$$ -53 1979 -1127 -2537 326 864 -635 1527 3758 1141 -1964 -62 1619 -571 -832 1552 -298
1424b98l579K003K770o29j021K154l7k770L99L954n03k525M98N14k677o35L261
$$ -298 -3877 -1874 896 267 -754 1400 1363 -1407 -1008 2946 2443 -82 416 930 -1747 -2382 879
1441H79L80l013k44J885o76m58K774J592k948r06J663K35j578J251J533k854k559
$$ 879 1259 -1754 -1998 -113 -789 -1247 1527 3119 171 -735 928 1163 -415 836 2369 -485 -3044
1458c044J751J453j537P17K109j443k288K003K742j147j121J749n14l433N59L137
$$ -3044 -1293 160 -1377 -660 1449 6 -2282 -279 2463 1316 195 1944 1430 -2003 -1444 1693
1474A693q78k778Q74R48k248m5M017L78k790L72K047r85j357K906P93l647j367
$$ 1693 815 -1963 -1089 -141 -2389 -2434 1583 1961 -829 -457 1590 605 -752 2154 2947 -700 -2067
1491b067K019j34j763J663J657k538j826K615J639j332P46J482j275k376J544
$$ -2067 -48 -182 -1945 -282 1375 -1163 -2989 -374 1265 -67 679 2161 886 -1490 54
1506E4K407j927j436J463j078k611J163L302r12j841J127J199j979O92K984l8
$$ 54 2461 534 -902 561 -517 -3128 -1965 1337 425 -1416 -289 910 -1069 -377 2607 2569
1522B569k789p4J281j630p63K171K80l254m24K276J98p29J474J855k424j373K565
$$ 2569 -220 -294 987 -643 -1406 765 1045 -2209 -2633 -357 -159 -888 586 2441 17 -1356 1209
1539A209R77j691l32J338j684k493J895K010j961q29J638k41k037J966K557q09
$$ 1209 2186 495 163 1501 -183 -2676 -781 1229 -732 -1561 77 -164 -2201 -235 2322 1513
1555A513j632Q17O32k106L01K487r60k827oJ411j039n42K673N79k377k13K534
$$ 1513 -119 698 1330 -776 -475 2012 1052 -1775 -1781 -370 -1409 -1951 722 1301 -1076 -1289 1245
1572A245l1j309J349J090k411j871K281N57j871K13J288j713j587K320K014j261
$$ 1245 1214 -95 1254 2344 -67 -1938 343 900 -971 -758 530 -1183 -2770 -450 1564 303
1588C03m79J657p10j563J288J920j443j899Q21K05k084K08K919q69k259R06J522
$$ 303 -176 1481 771 -792 496 2416 973 -926 -105 100 -1984 -1776 1143 274 -1985 -1079 443
1605D43q53j47K492M37k958n8J938l42j518J064M62k607q89J938J105j420P91
$$ 443 -410 -557 1935 2372 -586 -644 1294 952 -566 498 960 -1647 -2536 -598 507 -913 -122
1622a22J217j389j183K315J585j685q79J025m49k073J095J866j340j987J107M72
$$ -122 1095 -294 -1477 838 2423 738 -141 884 435 -1638 -543 1323 -17 -2004 -897 -425
1638d25j174J035K433o56j879O59J466j437K7K011r26k518l99J851j72j202J296
$$ -425 -1599 -564 1869 1213 -666 -7 1459 22 49 2060 1134 -1384 -1783 68 -104 -1306 -10
1655a0P60k133j50K170R71j172M38P96j725r03J500J218j959r35Q87r12j197J716
$$ -10 750 -1383 -1533 637 1608 436 874 1670 -55 -958 542 1760 -199 -1134 -247 -1159 -2356 -640
1673f40J851j069j268J653J51q66Q62J550q75k348J67J337j040n94J719n87j969
$$ -640 1211 142 -1126 527 678 -188 674 2224 1349 -999 -832 505 -535 -1129 590 3 -1966
1690a966K39K020k19l10J257N21k356j5K292K25j625K54K40j706r41J975R98j876
$$ -1966 -1727 293 74 -236 1021 1542 -814 -829 1463 1688 63 317 557 -1149 -2090 -115 883 -993
1708i93j51J318k86o76J506J418r67j420P76j07j124N57J633j307k105J062Q44
$$ -993 -1144 174 -112 -788 718 2136 1169 -251 525 418 -706 -149 1484 177 -1928 -866 -22
1725b2p09N6K127o18j757O74J828n60j049J431k80k277k65J955k36j375M23P73
$$ -22 -731 -675 1452 834 -923 -249 1579 1019 -30 1401 1121 -1156 -1421 534 298 -1077 -654 119
1743A19j341j75K117P24j423k45J364o02j105J424J046j854j394P35M30j407R67
$$ 119 -1222 -1397 720 1444 21 -224 1140 538 -567 857 1903 49 -1345 -610 -180 -1587 -620
1760f20J731j537j407J429J303p08J14J151m15j706M02J133r13o33P26k05j684
$$ -620 1111 -426 -1833 -404 899 191 305 1456 1041 -665 -263 870 -43 -676 50 -155 -1839
1777a839K82J980k0p19N44O22j044l83K099L13j801k63N54p05q93J330O99j386
$$ -1839 -1557 423 403 -316 228 850 -194 -577 1522 1835 34 -229 325 -380 -1273 57 756 -630
1795f30p92J300L88r03J088J414j722j041J313O37q41l01J234j446j437O81J773
$$ -630 -1422 -122 266 -637 451 1865 143 -898 415 1052 211 -90 1144 -302 -1739 -1058 715
1812G15j206l78J050P5j349K63J825J17r73K65L99j231m36J593L76j989o0P94
$$ 715 -491 -869 181 256 -1093 -830 995 1112 139 404 803 -428 -864 729 1105 -884 -944 -150
1830a50o76m76J671R08j725l18J221L52j127Q67O89j148j525J169M79r27K32J067
$$ -150 -826 -1302 369 1277 -448 -766 455 807 -320 547 1236 88 -1437 -268 211 -716 -484 583
1848E83o47j605Q25J776l09p45J298l22j550M20J395k04j420J74O54j364m68K090
$$ 583 -64 -1669 -844 932 623 -122 1176 854 -696 -276 1119 915 -505 -331 323 -1041 -1509 581
1866E81N2j178K0P58k46j64J295J97j021j137J279j01r98O87P20j458j090J578
$$ 581 633 -545 -525 233 -13 -177 1118 1315 294 -843 436 335 -663 24 744 -714 -1804 -226
1884b26O51q11K93J010o17j256Q04J457q36m53L90j34j504K13J682n72p37N38
$$ -226 425 -386 -93 917 300 -956 -152 1305 469 16 406 272 -1232 -1019 663 91 -646 -108
1902a08M74j135K61J352L85j410k02J063n44n31J296j4j558n90J038L84q76Q82
$$ -108 366 -769 -508 844 1229 -181 -383 680 136 -395 901 887 -671 -1261 -223 161 -715 167
1920A67N62r69p12J043O30n70L07N23p16j292P77J215q29p04P92n50o29N57J185
$$ 167 729 -240 -952 91 721 151 458 981 265 -1027 -250 965 136 -568 224 -326 -955 -398 787
1939G87o18q25J055J74q46R2J355k40j414j38Q82o34k66J149J47j390o1J060j32
$$ 787 169 -656 399 573 -273 -181 1174 934 -480 -618 264 -370 -636 513 660 -730 -791 269 137
1958A37k4M53L89j193l35P83Q04j273J43N83q16r69R34J018r04j74J033o89p94
$$ 137 113 566 955 -238 -573 210 1014 -259 -116 467 -349 -1318 -384 634 -270 -444 589 -100 -894
1977h94J042J251q53r40L61J21m93o3J429p85j050L47Q10m67n01J248R4j019Q7
$$ -894 148 1399 546 -394 -33 88 -405 -468 961 176 -874 -527 283 -184 -685 563 657 -362 -275
1996b75J019l41o81N29L16j180o03J304M45o97j41N61n64n89Q18Q32n73n86R26
$$ -275 744 403 -278 251 567 -613 -1216 88 533 -164 -305 256 -308 -897 -79 753 180 -406 520
2015E20k86q51N95J020r61r06O81K22m36J22R74m09q90K23R15o95J16Q32m21r73
$$ 520 234 -617 -22 998 37 -869 -188 34 -402 -280 694 285 -605 -382 533 -162 -46 786 365 -608
2035f08P1J035n03m33O21L44j182j04J008L41o14J27P40r52q90J291N80o27n13
$$ -608 -537 498 -5 -438 183 527 -655 -759 249 590 -24 103 843 -109 -999 292 872 245 -268
2054b68K85j81q76P89J155q76q92P47L31q09O10R44n31j074O39N40p64J2Q15j70
$$ -268 17 -164 -1040 -251 904 28 -864 -117 214 -595 15 959 428 -646 -7 533 -231 -219 596 426
2074D26j368K23Q67l3l55N16K34r17l79R32O49o14r0K20l36p40P78Q44j057o3
$$ 426 -942 -719 148 115 -240 276 510 -407 -786 146 795 181 91 311 -25 -765 13 857 -200 -263
2094b63K38k16n31P56Q46q67m56O35J07o76L91Q81p47r98O46J2j57K45O37m46
$$ -263 -25 -241 -772 -16 830 -37 -493 142 249 -427 -36 845 98 -900 -254 -242 -399 -154 483 37
2114C7q54N16P54Qo16P58k45q18j1Q62K09p98N5M24o41n88J568K37j021k94Q42
$$ 37 -817 -301 453 461 -155 603 358 -460 -471 391 600 -198 -143 281 -360 -948 620 857 -164 -458 384
2135C84k68n56O73N15n71o17N28m51r5L86P82p80p78N84M58j79lO21k66p18k5
$$ 384 116 -440 233 748 177 -440 88 -363 -458 -72 710 -70 -848 -264 194 15 12 633 367 -351 -376
2156c76O62l2l40p9N25r08k05J068J36p36L70L55q30LR23K70j264J95O23m59n06
$$ -376 286 254 -86 -165 360 -548 -753 315 451 -285 85 440 -390 -387 536 806 -458 -263 360 -99 -605
2177f05R53M68q81p27P50R4l80N77Q02j082r16J060K81m60R5N98n28r86P33M17
$$ -605 348 816 -65 -792 -42 52 -328 249 1051 -31 -947 113 394 -66 29 627 99 -887 -154 263
2197B63L6q07Q77O5j048K47J234O2j244K84M81n08p33J368J2o84R9j05n0l18P62
$$ 263 299 -508 369 434 -614 -367 867 929 -315 -31 450 -58 -791 577 589 -95 4 -101 -151 -469 293
2218B93M21p80l82N78J34j69K54J96n49m99J22O98m69j14N49q07j55L46J111o70
$$ 293 714 -66 -448 130 264 95 349 545 -4 -503 -381 317 -152 -266 283 -524 -679 -333 778 108
2238A08l18M94j52p03N32N37o9q20L16L83p86p0P40N78j164j03O46M8l76Q95K6
$$ 108 -210 284 132 -571 -39 498 429 -391 -75 308 -478 -548 192 770 -394 -497 149 197 -179 716 742
2259G42q32l54P16p0o83M97O09q00n67O73M68n77R0L95l91m91M13Q12j77m97K21
$$ 742 -90 -444 272 202 -481 16 625 -175 -742 -69 399 -178 -88 307 -84 -575 -162 650 473 -24 197
2280A97j48l12L1O34j8p07K37K69m44J26P66J8o61k35M94j03m81M60K35p29j99
$$ 197 49 -263 -232 402 384 -323 -86 183 -261 -135 631 649 -12 -247 247 144 -337 123 358 -371 -570
2301e70M19P8q5L00L25p44m35Q61N83r80J54O29n75p04N62P16p44P0L00j09r96
$$ -570 -151 -73 -158 142 467 -277 -712 149 732 -248 -94 535 -40 -744 -182 534 -210 -140 160 51 -945
2322i45P30N99j0p04K35N63n67k42Q65Q9j105J28M12k02r1M39L11p07l53Q60j47
$$ -945 -215 384 374 -330 -95 468 -99 -341 524 613 -492 -364 48 -154 -245 194 505 -202 -555 305 158
2343A58j47J09K48l61l84K78M46m78j46N98o40m20P08M55l95k64K86N8o24O68
$$ 158 11 120 368 7 -377 -99 347 -131 -277 321 -319 -739 -31 424 29 -235 51 109 -515 153
2363A53L48m26j85J32j58m80N56N85k65o83J12O07q24Q7J212k24j012L18N03k33
$$ 153 501 75 -110 22 -136 -616 -60 525 260 -423 -311 296 -528 -441 771 547 -465 -147 356 123
2383A23l46K51M58r59o6P92L7o38M74K23m42m06O50L87l20m58N23k09q01O27Q77
$$ 123 -223 28 486 -473 -539 253 290 -348 126 349 -93 -499 151 538 218 -240 283 74 -727 -100 777
2404G77o31l73j42O48k92l86R56j91p65J54P94n20K16J18J71o71j2N11n52j01
$$ 777 146 -227 -369 279 -13 -399 557 366 -399 -245 549 29 245 363 534 -137 -149 362 -190 -291
2424b91L71J37n13o9M92J29l64L4K38k66j14O66K07p44j62N99m45m45M73N37n45
$$ -291 80 217 -296 -365 127 256 -108 -74 164 -102 -216 450 657 -87 -249 350 -95 -540 -67 470 -75
2445g5k30N41K21o17K49L63r5p56N22L13n44m79Q65k7m22k39N31o3l44L15M79
$$ -75 -305 236 457 -160 89 452 357 -399 123 436 -108 -587 278 251 -171 -410 121 58 -286 29 508
2466E08o63j90O17M10q10P4M90m30m07N99q7l06k86L80j47lR4N46l12n88O34J88
$$ 508 -155 -345 272 682 -128 -54 436 6 -401 198 111 -195 -481 -101 -248 -251 -157 389 77 -511 123 311
2488C11n87M27K0j37m68M73J61n48L08K41q5n17L23K86m6j73L33K11r99K08O18
$$ 311 -276 151 171 34 -434 39 200 -348 -40 201 116 -401 -78 208 162 -11 322 533 -466 -258 360
2509C60op65L08L34p51j10Q05J33m30j50N33k02m54P83j58M1o03M24P6k82j38
$$ 360 354 -411 -103 231 -520 -630 175 308 -122 -272 261 59 -395 388 230 271 -332 92 168 -114 -252
2530b52N75k37o51K59N91m00k38L99K31k53j87K99n7k11L19k63j14j94M18J3k46
$$ -252 323 86 -565 -306 285 -115 -353 46 277 24 -163 136 79 -132 187 -76 -190 -384 34 47 -199
2551a99J70o8j57J65J79L12l10j13K17q6l81L92K86q07k06N81K6k57Q5M25k07
$$ -199 -29 -97 -254 -89 90 402 92 -21 196 110 -271 121 407 -400 -606 -25 1 -256 -171 254 47
2572D7q31R32K70o23J72M94k94p85K55Q22n45m84P06J48o14K4O30k4l69k01M71
$$ 47 -784 148 418 -205 -33 461 167 -618 -363 459 -86 -570 136 284 -330 -306 324 300 -69 -270 201
2593B01l90k24O34J32m09k93K05k49J62M70pj37m36L64J00r9nK92k51q1O4K11
$$ 201 -189 -413 221 353 -56 -349 -144 -393 -231 239 232 95 -341 23 123 24 19 311 60 -21 43 254
2615B54k14j52K98j34l16J10J43j40K84M3r1l53L40K93k84m4j01L88n75q7O04
$$ 254 40 -112 186 52 -264 -154 -11 -151 133 176 85 -268 72 365 81 37 -64 324 -251 -338 266
2636B66j44m21j30O30k13l46L92M88q13J86J99L16n52kQ86q13n44L90Q95p35l8
$$ 266 122 -299 -429 201 -12 -358 34 522 -291 -105 94 410 -142 -144 742 -71 -615 -225 670 -65 -103
2657a03M02j81l63j7P14m27q8N32l93j84k21O91l71k94J2K49j53p5N35k14q2n8
$$ -103 299 118 -245 -262 452 25 -63 469 76 -108 -329 362 -9 -303 -291 -42 -195 -270 265 51 -31 -89
2679h9P8P8p6M46j0o74j17K88p6M9J87p3l16m3N88Ll87K41q4ml14L50L31m16q5
$$ -89 -11 67 -9 437 427 -247 -364 -76 -152 -103 84 11 -305 -348 240 243 -144 97 13 9 -305 45 376 -40 -125
2704a25K06J23p85K50N12J29m03j86M68k80k77O46P8l31lm7l25R9J76N73p13K7
$$ -125 81 204 -581 -331 181 310 -93 -279 189 -91 -368 278 356 25 22 -25 -350 -251 -75 498 -215 -188
2726a88k1K40J50j41M18o42k39L52M18m10l8L81l76k54K95o4M05l6n9m32j56L79
$$ -188 -209 31 181 40 458 -184 -423 -71 347 -63 -101 280 -96 -350 -55 -119 286 250 191 -241 -397 -18
2748a8L78l96l17K96N09n29J98L9Qm67J28K52j61k73P20lp08K63J79k8o5N2OJ0
$$ -18 360 -36 -353 -57 452 -77 121 160 168 -299 -171 81 -80 -353 367 364 -344 -81 98 70 5 57 63 73
2772G3l86K69L45n32jN40j88n11N76M34n33k40L52K0n04K38N56m20k63R0L81k42
$$ 73 -313 -44 301 -231 -232 308 120 -391 185 619 86 -154 198 218 -286 -48 508 88 -175 -85 296 54
2794E4j54M71l89j97j09L37p0R0O9J31k43k09K80j1k90J88L02l25k18M41m7r2
$$ 54 -100 371 -18 -215 -324 13 -57 33 102 233 -10 -219 61 50 -240 -52 250 -75 -293 148 101 9
2816Ik18K80k25k05J85L86l65J54J53k76J57o2M34m41l62M38rm62L04J58R9m13
$$ 9 -209 71 -154 -359 -174 212 -153 1 154 -122 35 -27 407 -34 -396 42 33 -429 -125 33 132 -281
2838b81L27l1j73j8Q9L43l90q0N63q4l77L06K9l31j67K39K36rl83K73q4k99N29
$$ -281 46 15 -158 -176 -87 256 -134 -214 349 265 -112 194 223 -108 -275 -36 200 191 -192 81 -3 -302 227
2861B27n2k30j72L80j85K36k14J49j66m0K6K10l31R7M10j20m25O9M44k79qJ08
$$ 227 175 -55 -227 153 -32 204 -10 139 -27 -67 -41 169 -162 -65 345 225 -200 -131 313 34 26 134
2883A34nn89R0O18k61l38O03k1m05NL23K30j67k6j96Mk36N90j29l60OK53j10r4
$$ 134 129 -460 -370 248 -13 -351 252 231 -174 -169 154 384 217 191 -5 -1 -237 353 224 -136 -130 123 13 -81
2907h1Q9O0r4j06o6L16j64M1L57l75pj42L26j90j87L10K92p88J78O08j28p8k58
$$ -81 8 68 -26 -132 -198 118 -46 -5 352 -23 -30 -172 154 -36 -223 87 379 -409 -231 377 249 171 -87
2930h7K08p4r2K98l05K26j82q6J33l62L65K66l27K00K05j07l15j93L65k86m1K32
$$ -87 121 47 -45 253 -52 174 -8 -94 39 -323 42 308 -19 181 386 279 -36 -229 136 -150 -191 41
2952D1J8m03J34L74k76j40N5L64j51Or1K6k61k9L85l1j54j55M97l17j39N75j54
$$ 41 59 -344 -210 164 -112 -252 -197 167 16 22 -69 -43 -304 -333 52 21 -133 -288 209 -108 -247 328 174
2975A74l13L3M20m31LQ2J14R0k84K51j75l5o0J80M0l74K73J86j77m1J89p3J37
$$ 174 -139 -106 314 -117 -114 -32 82 172 -112 139 -36 -71 -131 49 89 -285 -12 174 -3 -44 145 72 209
2998B09k71Q2j92L28k01J04l83L09J14k01q2O9K93k05j84L33j46R3j67K52k89
$$ 209 -62 20 -172 156 -45 59 -324 -15 99 -102 -184 -115 178 -27 -211 122 -24 69 -98 154 -135
3019a35k75M31K0l22J13L94j32k71L89k02K58n16J69J57m2J35J30k79Om9J9O3
$$ -135 -410 21 41 -281 -168 226 94 -177 212 10 268 -248 -79 78 36 171 301 22 28 -21 -2 61
3041F1q8J23k47n2K09K82j30l00K9K85j07j66L04r5KK23m06j01k0J4K27r7J8j70
$$ 61 -27 96 -151 -203 6 288 158 -142 -113 172 65 -101 203 108 110 333 -73 -174 -194 -180 47 -50 -32 -202
3065b02L43k75N1K93j90l65M23j0k20K55M0k12j31O6L65n45J38Q3K41l47L1M35
$$ -202 141 -134 -83 210 20 -345 78 68 -152 103 143 -69 -200 -134 231 -314 -176 -93 148 -199 -168 267
3087B67j68q4O2M5k30P8J17m0l41L83J37k12Q5n1j53J09J56r3o3j77J48L48m21
$$ 267 99 15 77 122 -108 -30 87 47 -294 89 226 14 99 48 -105 4 160 67 4 -173 -25 323 -98
3110i8J4O9J73m28N2L52k60J5J70K32m29O0J38R0k74j09L23P6m26K91N2j46j23
$$ -98 -84 -15 158 -270 -218 134 -126 -111 59 291 -138 -78 60 150 -124 -233 90 166 -260 31 83 -63 -186
3133a86N93k86k78K54k66J80o8M86j95k39l6J57q7O9q9J20j83j40J15J58n0j60
$$ -186 407 121 -157 97 -169 11 -57 429 234 -5 -41 116 29 98 9 129 -54 -194 -79 79 29 -131
3155a31M98k70l87L83J1j13m0P3j62RJ71j55J94j96J0J99j0k41N83l46r3k50K94
$$ -131 367 97 -290 93 104 -9 -49 24 -138 -129 42 -113 81 -115 -105 94 84 -157 426 80 -13 -263 31
3178C1oo5L40m64J28r1J21lO8O7J7P1l01q0L26k71K75m5m84J86N8J28l06R5L77
$$ 31 25 -40 300 -164 -36 -127 -6 -9 59 126 143 214 -87 -167 159 -112 163 118 -366 -180 -122 6 -300 -205 172
3203A72k8l92K76K36j21k73J52R0j46N1K14m33J83m6j82M5j11L77j91m8K90Q4
$$ 172 144 -248 28 264 143 -130 22 112 -34 17 231 -202 -19 -65 -247 -202 -313 64 -127 -175 115 199
3225A99l49k0K55k13j62K54J6o4j52J31n9N4l9J51M1K3p4J24m3l4l04L81k16j16
$$ 199 -150 -170 85 -128 -290 -36 -20 -84 -236 -105 -164 -110 -149 2 43 66 -8 116 73 39 -265 116 -100 -216
3249b16K23k62J26K17J56m19L5J71o0j85K06K29j48P1Q6k75k04L54q7M7j08OL70
$$ -216 7 -255 -129 88 244 -175 -140 31 -29 -214 -8 221 73 144 230 -45 -249 105 18 65 -43 -37 333
3272C33l63Q4j92K41q9k44K26K4kl73N51k06J26j14j23K17l78K81ML0j22K17p4
$$ 333 -30 54 -138 103 14 -230 -4 20 18 -355 196 -10 116 2 -121 96 -282 -1 3 33 -89 128 54
3295E4l39K02O5m8QN19l13k71J28K1k8n9m7m1J32J99k08J37n15P15k14oo4Q1K
$$ 54 -285 -83 -18 -66 -58 461 148 -123 5 26 -2 -61 -108 -149 -17 182 -26 111 -404 311 97 91 27 108 110
3320A10o2q9J95m8o8l5r8k1R1l29O58j32m64M64l89J78J80j3k83j94N65j21k66
$$ 110 48 -41 154 106 38 3 -95 -116 -25 -354 304 172 -292 172 -217 -39 141 128 -155 -349 216 95 -171
3343a71K84j16L5j0j31L89l04k92J77J26k53L51p6n2RM6J80l04k49N64l43j82
$$ -171 113 -3 32 22 -109 280 -24 -316 -139 -13 -266 85 9 -43 -34 12 192 -112 -361 203 -140 -322
3365c22K98M3j75J2R2j32jm2M07o93L25P8M8n5K01m6k33k20K17L52R6l54J51k3
$$ -322 -24 19 -156 -144 -52 -184 -185 -227 180 -513 -188 -110 -62 -117 84 38 -195 -415 -198 154 250 -104 47 24
3389B4k65L89P5k23j10J80k41j45J10K29j23O3p8R4Jj30K47J50m95K92O6m7n17
$$ 24 -241 148 223 0 -110 70 -171 -316 -206 23 -100 -37 -115 -21 -20 -150 97 247 -248 44 110 63 -454
3412d54M19J26q7Q2j80l5L9K31j61j02j95J63J94R2ok4r1k15K87j50K38j06Rp9
$$ -454 -35 91 4 86 -94 -129 -90 141 -20 -122 -317 -154 40 132 126 102 11 -204 83 -67 171 65 74 -5
3436ek3o3K04O9m54L77Pp6R8k39K11j7o6j59O9k1J42K42k39j75J92J00n38M03
$$ -5 -28 -91 113 182 -272 105 112 36 134 -105 106 89 23 -136 -67 -88 54 296 57 -118 74 174 -364 39
3460C9R3j55k83J39J83M9j4R4j87k59J13J92J03l11J62M5l1L1K08jj38J67q3J57
$$ 39 132 -23 -306 -167 16 65 51 145 -42 -301 -188 4 107 -204 -42 3 -28 3 211 210 72 239 156 313
3484C13k33J24l57L2o4R4J32k5L7Q5l27P0M43j63j74N8j39J70j15Q9j78K87o0
$$ 313 80 204 -153 -121 -185 -91 41 16 53 138 -189 -119 324 161 -13 45 -94 76 -39 50 -128 159 99
3507I9o0L05o30K22J49P3k01J17j6j4J5l2m0q1J31q4L3k76N01k49N2k27K96k14
$$ 99 39 344 -286 -64 85 158 -43 74 58 44 59 27 -13 -94 37 -47 -14 -290 211 -38 14 -213 83 -131
3531a31j47K13j8J9j75K52J65l53L80J36l29j39L61j93J01r5k33K64l04M28K0
$$ -131 -278 -65 -83 -64 -239 13 178 -175 205 341 12 -127 234 41 142 47 -186 78 -226 202 222
3552B22j84j68R5J81j54j24K68J34k35n8r7J0L5k0L6l60M15J67j89N2j41J18l14
$$ 222 38 -130 -35 146 -8 -132 136 270 35 -23 -120 -110 -75 -95 -59 -419 -4 163 -26 26 -115 3 -311
3575c11L66l57L82m26J38L07k39K11O4k66M67l14K14j21j36K49j34q9J03k68K26
$$ -311 55 -302 80 -346 -208 99 -140 71 135 -131 336 22 236 115 -21 228 94 5 108 -160 66
3596F6O9k14K99j24k95J43k4Q6J78o4j29m9m9L62k92L67l44M1n0j49n4L81j50
$$ 66 135 -79 220 96 -199 -56 -80 6 184 120 -9 -58 -107 255 -37 330 -14 27 -23 -172 -226 155 5
3619Ej73L39k26j52Q5J55k9J18m20K91k12P8K14n8j67N49o19J7K16j11K31n3j47
$$ 5 -168 171 -55 -207 -122 33 4 122 -298 -7 -219 -141 73 15 -152 397 -222 -205 11 -100 131 78 -69
3642f9J60J6k79L39l54L58k23J36j15r9J09M7k35K56p9r7j25J61L10l70lJ68K48
$$ -69 91 107 -172 167 -187 171 -52 84 -31 -130 -21 26 -209 47 -32 -129 -254 -93 217 -153 -156 12 260
3665B60l61Jp2K28K7j49K37o3j40j68K65KO5J60p1m66P8K36J7m03K31N7j04j5
$$ 260 -101 -100 -172 56 83 -66 171 108 -32 -200 65 67 132 292 221 -245 -167 69 86 -317 -86 -29 -133 -148
3689a48K87n25M78j8m5K4k0q9j58J59j5J24p2M50m43j70O9J3K41j50l18KK30N6
$$ -148 139 -386 92 74 29 53 33 -56 -214 -55 -70 54 -18 432 -11 -181 -112 -99 142 -8 -326 -324 -94 -38
3713c8k9l1J65k76K22K20j82j06K36J51j19l24J64R0k39J77n6J29jj49j18J03
$$ -38 -67 -98 67 -209 13 233 51 -55 181 332 213 -111 53 143 -96 81 25 154 153 4 -114 -11
3735a1rK00j91O8K81k87j06j0k11M15j16QJ52O1n37N62J4j42m51L29Q7M8l44L22
$$ -11 -20 180 -11 57 338 51 -55 -65 -276 139 23 31 183 244 -293 269 283 141 -310 19 106 154 -190 132
3759A32k9k51R1J68j24M5j86K24j35r5J68j98K16j10J89o2Q0j99M3J32k27J53
$$ 132 103 -148 -57 111 -13 32 -154 70 -65 -160 8 -190 26 -84 105 43 123 -76 -33 99 -128 25
3781B5p2l8J65r9J00k98L61R1k61r9J7P0k30K27J12m6q6L74l45j01J79Q1l63J30
$$ 25 -47 -85 80 -19 81 -217 144 235 -26 -125 -108 -38 -268 -41 71 25 -61 313 -32 -133 46 127 -236 -106
3805a06r8K74j01Rl9K5m4m5J28p5k7J13n3Q4J88j51q5k95M62J31l89J53Rn1J05
$$ -106 -204 70 -31 -22 -61 -36 -80 -125 3 -72 -99 14 -39 45 233 82 -3 -298 164 295 -94 59 68 17 122
3830A22l38P8J67P1l94L18o6r9L03P8n87N38k09k53K98J20k19J55k61J67J81k60
$$ 122 -216 -138 29 100 -294 24 -42 -141 162 240 -347 191 -18 -271 27 147 -72 83 -178 -11 170 -90
3852i0K25k25o0K36J95k52k89K78j66K92r8j32J18j26j3P3j0N4p3J67j8M9L2m
$$ -90 135 -90 -150 86 281 29 -260 18 -148 144 46 -86 32 -94 -107 -34 -44 10 -63 104 86 135 167 163
3876A63j35J09j03j57K52m92K12Q6J79j23J91oj32p8L84l14j85K31k20K70M43
$$ 163 28 137 34 -123 129 -363 -151 -65 114 -9 182 176 44 -34 350 36 -149 82 -138 132 575
3897E75m28j27J24o2k23J4L30m08J24K38j5J37m13K60p5J28k27L4K5K26l88K24
$$ 575 147 20 144 82 -141 -127 203 -205 -81 157 142 279 -134 126 51 179 -48 -14 11 237 -151 73
3919G3j06j63M4J5O0j25Q6k9P8J34j50j25J48n7J78j24P7j45J90l9J81o7j57k28
$$ 73 -33 -196 -152 -137 -77 -202 -116 -145 -67 67 -83 -208 -60 -117 61 -63 14 -131 59 20 201 134 -23 -251
3943b51K83p7l09M42N8N6j41k63J88K05l87J51K0j2K04m3K2n2P8j17K43l04J11
$$ -251 32 -45 -354 88 146 202 61 -202 -14 191 -196 -45 -25 -37 167 124 146 94 172 55 298 -6 105
3966A05l0j03J36K37k85j55J00K62k13j03j5Ol78P66j2k71l37L9Q6p3J88o5k4
$$ 105 75 -28 108 345 60 -95 5 267 54 -49 -64 -58 -436 330 318 47 -290 -251 -165 -238 -50 -115 -139
3989a39J5K83j74k7r9J95l1j20Om2Q3J37Qj36P2j39K71J5j42J1l6K51j94Q8j88
$$ -139 -124 159 -15 -42 -141 54 23 -97 -91 -133 -50 87 95 -41 31 -108 163 178 36 47 11 262 68 156 -32
4014c2L4j39jO3k14L72j75P9K8j33m3K41J9P3j90P7N2q2J37L8j11o8j15J30J0
$$ -32 2 -137 -138 -75 -289 83 -92 -13 15 -118 -161 80 99 172 -18 59 111 29 166 204 93 25 -90 40 50
4039E0k66M36k76l4M4J41k17O5K30j41r4L7q3K33N3l47K76p6k26J96J46j23J18
$$ 50 -216 220 -56 -90 -46 95 -122 -57 173 32 -62 -25 -108 125 178 -169 107 31 -195 1 147 24 142
4062A42j76l3J96PRj80j91M0J91j04R2j29K31j10K6r0j37L3J38J52l6Jl62J59
$$ 142 -34 -67 129 136 145 -35 -226 -186 5 -99 -7 -136 95 -15 11 -79 -216 -183 -45 107 71 72 -290 -131
4086a31K64k47k2K29j78J23j73J61j84L10k1j93r5K41j38q8l7K57O1Pk81j97K48
$$ -131 133 -114 -136 93 -85 38 -135 26 -158 152 131 -62 -157 84 -54 -142 -179 78 139 146 -135 -332 -84
4109h4J09q4m6Q6N7L6n4j44R5l5j49N30l32l2l6Q0J96l35J59j53l6K04j08J91
$$ -84 25 -59 -105 -19 38 74 20 -124 -29 -64 -213 317 -15 -47 -83 -3 193 -142 17 -136 -172 32 -76 115
4133A15k84K03L8j93R9j74O6J39k17J4J71o8K09n2J10J1k08k02o7k1L37R9j01
$$ 115 -169 34 72 -121 -22 -196 -130 9 -208 -194 -23 -91 118 66 176 187 -21 -223 -290 -311 26 125 24
4156B4R3R3k30jl6m6L50j80o0j8j73L26j82O2R6j79m0m0n6Q8K25k3j65j50J65
$$ 24 117 210 -20 -21 -57 -103 247 67 7 -11 -184 142 -40 22 118 -61 -101 -141 -197 -109 116 93 -72 -222 -57
4181e7L0J30j27q0jK50j33k3KP0qj89K73j45k3k50M47k58j28j71L59j27o9N25
$$ -57 -27 103 -24 -104 -105 145 12 -11 -9 61 53 -136 137 -8 -31 -281 166 -92 -220 -391 -32 -159 -228 297
4205B97m68Q1j64K50q5J30m33L50J35n6K38l52L24k96j9L4N3oJ5J22k52Q2N2k05
$$ 297 -171 -90 -254 -4 -89 41 -392 -42 93 37 275 -77 247 -49 -68 -34 19 13 28 150 -102 -20 32 -173
4229a73J9K68k59K46j03R5j14k3K51j34j52K15Q0l2j9j99J84l7J95l63J10K99
$$ -173 -154 114 -145 101 -2 93 -21 -44 207 73 -79 136 216 184 165 -34 150 113 308 -55 55 354
4251C54m47k0m9J9J21J69J36k26M2l36M0J01j00K41n9k6O3p4PJ76j2J13j66K32
$$ 354 -93 -113 -162 -143 -22 147 283 57 99 -237 -197 -96 -196 45 -14 -40 23 -51 -44 132 120 233 67 299
4275B99l52J4q4L25j94Kpj32M14k18q0j06O5j79N46l09qN6Q8k0k35K5Q6Q9L73
$$ 299 -53 -39 -123 202 8 10 3 -129 285 67 -13 -119 -54 -233 313 4 -4 52 140 120 -115 -90 -4 85 458
4300D58m89J13N1j2l73K43Q5L9j55j65L85l08J40L0j92K71k85O1N8K80k2j90P0
$$ 458 -31 82 133 121 -252 -9 76 115 -40 -205 180 -128 12 42 -150 121 -164 -103 -45 235 213 23 93
4323I3l69K33j70J22j34K07r3J04L1M3K46m43K34R4l95m1N17k15Rj52L34m49K42
$$ 93 -276 -43 -213 -91 -225 -18 -111 -7 24 67 313 -130 104 198 -197 -238 279 64 73 -79 255 -194 48
4346D8N8Mk75J38n9k53M56O1m6m5k20N9J94k33k7L72j16r0L2J09q9l00K04K8j34
$$ 48 106 110 -165 -27 -86 -339 117 178 132 87 -133 -74 120 -113 -140 232 116 26 58 167 78 -222 -18 10 -124
4371a24J5j9L12m33K6R1l0QJ94P4l6p2J40l79P2J30Mk10L12j50J85j09J31k8q5
$$ -124 -109 -128 184 -249 -223 -132 -162 -154 40 114 78 6 146 -233 -161 -31 -27 -237 75 -75 110 1 132 104 19
4396A9j17J15K72j16r0j68J10j10j51J17K81m0J5J9o2l45K38J11p2L4o0nO6l3
$$ 19 -98 17 289 173 83 -85 25 -85 -236 -119 162 122 137 156 94 -251 -13 98 26 60 0 -5 61 28
4420B8k2J08j32j87J83o3K1l8k0L59k59k8j8K98j49j55K0Q3m7j80P1K86J21k91
$$ 28 6 114 -18 -205 -22 -85 -64 -102 -122 237 -22 -50 -68 230 81 -74 -54 29 -18 -198 -127 159 280 -11
4444a1L22k98J6J40m8j40J53k92k5K88n48O36j38m7j17K01o3L1k10K9J82k04K71
$$ -11 311 13 29 169 121 -19 134 -158 -183 105 -443 193 55 8 -109 92 29 60 -150 -121 61 -143 128
4467A28K2l87k2K25o5K03N6j08l19O7O8N1J72L4l34Q8jK39k37K39k04J62j00q7
$$ 128 150 -237 -259 -34 -99 104 160 52 -267 -200 -132 -81 91 125 -209 -121 -122 117 -120 119 -85 77 -23 -110
4491a10J08J87l85Q4J01o5j57L88j48J88p6q9J3M1r6J81k94J04k18M3j0J50j40
$$ -110 -2 185 -200 -116 -15 -80 -237 151 3 191 115 26 39 80 -16 165 -129 -25 -243 -200 -210 -60 -200
4514b00M22l53K3kK81k55Q1K0R7N9J4m7j92RJ84R3j40p5q8j39J26J37m4J50j46
$$ -200 222 -131 -108 -110 171 -84 -3 17 114 173 187 140 -52 -43 141 234 94 19 -69 -208 -82 55 11 161 15
4539A5J92k17j16p3J70MK31l64R4J79J08k04o7J42j10P6l52nK98k14L32k78K99
$$ 15 207 -10 -126 -199 -29 -25 206 -158 -64 115 223 19 -48 94 -16 60 -292 -297 1 -213 119 -159 140
4562A40j96J45q5J33k69P1j7K74j21j8j31J20J02m6r3j71K82j68J78k5j46M07
$$ 140 -56 89 4 137 -132 -61 -78 196 75 57 -74 46 148 102 9 -162 120 -48 130 105 -41 366
4584C66k24k79J29j00M6k5j12J30j6Q9Q7J24l76K13J74k47P7j12P5J33k1K4k15
$$ 366 142 -137 -8 -108 -62 -87 -199 -69 -85 4 91 215 -161 52 226 -21 56 -56 19 152 131 155 -60
4607f0J58R7j1k58J93J63m66j60L86q9j95J11J05J41nK2j27Q8k96L96k34k50J12
$$ -60 98 195 184 -74 119 282 -184 -344 42 -47 -242 -131 -26 115 110 132 5 93 -203 193 -41 -291 -179
4630a79K18j83K81j99k23M86k92J68J07l09J47Qp6J84j64j02J90j82M1k5KL39
$$ -179 39 -144 137 -62 -285 201 -91 77 184 -125 22 30 -46 138 -26 -128 62 -120 -79 -104 -102 237
4652B37k94K60m09L49p2k86J98K3j00L39m40K99k12L84l63P4J45l81K49l27L02
$$ 237 -57 203 -206 143 71 -215 -17 6 -94 245 -195 104 -108 276 -87 -13 132 -249 0 -327 -25
4673b5o7J40K52q9k73n0N7o1o4K54l22J04L86k09j46Q9P2k00q0J68K08j98K29
$$ -25 -92 48 300 211 -62 -112 -55 -116 -180 74 -248 -144 242 33 -113 -24 48 -152 -232 -64 144 -54 175
4696A75j80l1j9j00p0M99j94l20J20J53Q0Q4k70l4J19j38J19oR7J27J08k57l0
$$ 175 -5 -36 -55 -155 -225 274 80 -240 -120 33 113 197 -73 -107 12 -126 -7 -13 84 211 319 62 32
4719C2J43q4j83J16j01nJ0q8J16L54k36M1j21j2J35M8k51J57j96j30K72j57J36
$$ 32 175 91 -92 24 -77 -82 -72 -160 -44 310 74 115 -6 -18 117 165 -86 71 -125 -255 17 -140 -4
4742dL6m2J29j93M6K8o6L5O5k8J40j69l4Q7J30k57Q1j25K40k51N5RO6L2j74J44
$$ -4 32 -10 119 -74 -28 0 -66 -31 34 6 146 -23 -57 30 160 -97 -16 -141 99 -152 -97 -88 -22 10 -164 -20
4768b0J56j66j91M01k52M8k75K98L88n36L07k06J29q0j94J62k98J21J02k4K61
$$ -20 136 -30 -221 180 -72 -24 -299 -1 387 -149 158 -48 81 1 -193 -31 -329 -208 -106 -130 131
4789A31m1p1J77m14J26K82K9p6L9o9k06N0N7j77L6J99k38Q0J23J57j64J12k11
$$ 131 90 19 196 -218 -92 190 219 143 182 113 -93 -43 14 -163 -127 72 -166 -86 37 194 30 142 -69
4812f9O6J2N4J82j59l14J38L43j95L13k44J23n91K49L92o73N44k73l8Q0k01K94
$$ -69 -3 9 63 245 86 -228 -90 253 58 371 127 250 -341 -92 300 -373 171 -102 -140 -60 -261 33
4834C3L0k9n1M6j21O2J01N2k04j48L46l31J35K3J51Pk52J02K20j96k16M14j1j15
$$ 33 63 34 -17 29 -92 -30 71 123 -81 -229 117 -214 -79 -56 95 102 -150 -48 172 -24 -240 174 163 48
4858D8J71%k59j70L33K3m33J52K33k7k99J88q0J90o7q2NJ78P6M1j31l12J20N7
$$ 48 219 219 -40 -210 123 146 -287 -135 98 71 -228 -40 -120 70 3 -79 -74 104 180 221 90 -222 -102 -45
4882d5m3j11K31J1o0J26j0j72K66j98K75l8j40%r1J9m3P2k1N4k5j38J85k07r9
$$ -45 -88 -199 32 43 -17 109 99 -73 193 -5 270 232 92 92 1 20 -23 49 28 82 57 -81 104 -103 -202
4907b02K71l22n1M32j66J31P1l66J28J32P7j99k24J71L57n00K85Q%k37M63j24
$$ -202 69 -253 -304 128 -38 93 164 -202 -74 58 135 -64 -288 -117 240 -260 25 33 33 -204 259 135
4929A35M4j37j45K72J30k84J01k90R0N5K08k66KJ22J84k09j35J14k89K45J79j08
$$ 135 179 42 -103 169 299 15 116 -174 -84 -29 179 -87 -85 37 221 12 -123 -9 -298 -53 126 18
4951A8J40l72J81k0k35J64K23M0j94k68L45l1J97k09J35k7J7n2J70j76K5J9j79
$$ 18 158 -214 -33 -53 -288 -124 99 139 -55 -323 22 -9 188 -21 114 87 104 52 222 46 71 90 -89
4974h9j41j74M75K12n69M61l21J66n7j8J09O4r8Nm3J2m2o3J41j18j15M14j89K89
$$ -89 -230 -404 71 283 -286 175 -146 20 -37 -55 54 118 20 25 -18 -6 -48 -111 30 -88 -203 211 22 311
4998C11k91l16J65K19L3k1k90m4J58J96k7k20K65j01j16J48J35p9Q8l42K58m02
$$ 311 20 -296 -131 88 121 100 -190 -234 -76 120 93 -127 138 37 -79 69 204 125 213 -129 129 -273
5020b73J04J35k0p0M5J73M0j95N9K2q6L2j20L31J50l75L08j09k22J62o7J57j63
$$ -273 -169 -34 -54 -124 -79 94 134 -61 -2 20 -66 -34 -154 177 327 -48 260 151 -71 91 24 181 18
5043A8k5n7J80j07J3K7Q4j70n2j07M18j55K67k27m93J99N76l38m4l5k8K79l52
$$ 18 -7 -64 116 9 22 49 133 -37 -89 -196 222 67 334 107 -386 -187 389 51 7 -28 -56 223 -129
5066a29J60j1k85K77l5k87M84l10J51R6k18L7m7K74l55K20K84j88j17j53J29j29
$$ -129 31 20 -265 12 -23 -310 174 -136 15 111 -107 -70 -117 157 -198 22 306 118 1 -152 -23 -152
5088a52J19J27J2P1m64Q6J73k6R8j77j90M53Pk72J82j73K76k64M8j36K77k64K08
$$ -152 -33 94 106 177 -287 -201 -28 -54 44 -133 -323 130 137 -135 47 -126 150 -114 -66 -202 75 -189 19
5111A9k01J25M8j44J92M0J59l09J39J74k94j53J49J8R5k28K9J54J27j71J85k33
$$ 19 -182 -57 -9 -153 39 79 238 -71 68 242 -52 -205 -56 -38 57 -171 -142 12 139 -32 153 -80
5133h0J99j70j10K52j20R5j64K09k0l25J72K62k53Q0J75l97M6O8K12l03K66J30
$$ -80 119 -51 -161 91 -29 66 -98 111 91 -234 -62 200 -53 27 202 -195 -149 -81 131 -172 94 224
5155B24j79K0q8j19K54j72K97l66J18j69J13nJ7%K9n9L50k07j18r0j1L73m52K70
$$ 224 45 65 -23 -142 112 -60 237 -129 -11 -180 -67 -72 -55 -55 -26 -85 265 58 -60 -150 -161 212 -240 30
5179C0j30l8P9k9Q5k37J96l8J30j31J56j21J0p2J29k6q6oO6o6Q4N0j49J49O9q2
$$ 30 -100 -138 -59 -88 -3 -240 -44 -82 48 -83 73 -48 -38 -110 19 -7 -93 -99 -33 -99 -15 35 -114 35 104 22
5205B2J39j79q4J23j24j05j11N75j59j07P6j57J15J5Q3p4n3Q8K4k20M1L7Jj58
$$ 22 161 -18 -102 21 -103 -208 -319 256 97 -10 66 -91 24 39 122 48 -5 83 107 -113 -72 -35 -34 -192
5229a92K79k5k20K14j7n8l02M06n7q3pk58L91j90k4nL9P6j20K08Rj49m8K36lk07
$$ -192 87 62 -158 56 39 -19 -321 85 28 -55 -62 -320 71 -119 -143 -148 -109 -33 -153 55 64 -85 -133 103 100 -107
5255a07J12n2r1J27P2r1k75M27k05K04j1k04k0J20j84J99r0J1o6j7K88l5J09k71
$$ -107 5 -47 -138 -11 61 -30 -305 122 -83 121 110 -94 -114 6 -178 21 -69 -58 -124 -141 147 112 221 -50
5279e0Q2J43r3j43N6j14j38K06K4L1j13j04N4K48J29l48o1J82k78J67L94k10j61
$$ -50 32 175 82 -61 -5 -119 -257 -51 -27 4 -109 -213 -159 89 218 -130 -191 -9 -287 -120 274 64 -97
5302i7L02k65J14k31L14j78j67O8J15J63j84j86K92q4K1R6j69J75j27J27rk21
$$ -97 205 -60 54 -177 137 -41 -208 -140 -25 138 -46 -232 60 -24 -3 93 -76 99 -28 99 90 -131
5324a31J27p6j71K83K6J3k6m1R4j53K67r9p0j59J03j56L3J2K41k40M4K3N3O9k44
$$ -131 -4 -80 -251 32 58 71 45 4 98 -55 212 113 43 -116 -13 -169 -136 -124 117 -123 -79 -56 -3 66 -178
5349a78L09k40J33q1l6L0k74M45Q3k31O0K55j98j8j8K74k11l2M8K06l62m36K37
$$ -178 131 -109 24 -57 -93 -63 -337 108 191 -40 20 275 77 59 41 315 104 72 120 326 -36 -472 -235
5372b35J57J51o4j87n3L86j20J4O0k22L02M3j72r9J54k00P4q5J01N6j40K15k57
$$ -235 -78 73 9 -178 -231 155 35 49 109 -113 189 232 60 -39 115 -85 -11 -96 5 61 -79 136 -121
5395a21M1rM32m30K89o2Jj08k51K87j40J06k34M46l03l7J33R9j57p3J16J90l17
$$ -121 -80 -89 343 -87 202 140 141 33 -218 69 -71 35 -199 247 -56 -93 40 139 -18 -91 25 215 -102
5418a02J40r4mq0OP2qO4J37k55P1J41J9Pj24j02K33jK58l88KJ38O6j51Nj85o8
$$ -102 38 -56 -60 -140 -134 -62 -70 -6 131 -124 -53 88 107 114 -10 -112 121 120 378 -10 -8 130 196 45 50 -135 -203
5445b03r8J77K79r1Q4j29l0r7k7O9J22k48PK05J78j71n0O9r5J06l6j27R5pJ31
$$ -203 -301 -124 155 64 148 19 -11 -108 -135 -66 56 -192 -185 20 198 27 -23 46 -49 57 21 -106 -11 -18 113
5470A13j81o5J0J10L68k16j33J37k79P9J61K0l07M24j34J82l24K70J29m90L69
$$ 113 -68 -133 -123 -13 355 139 6 143 -136 -57 104 124 -183 241 107 289 -35 235 364 -126 243
5491B43l50o6J50N0j5L10m10J86j59P9m03mK48L28Nr3l80K68kO7j12J3L00l98
$$ 243 -107 -173 -23 27 12 322 -88 98 -61 18 -385 -389 -141 187 192 99 -281 -13 -15 52 -60 -47 253 -145
5515a45K66r5k91O7K21q4O6r7j24k4O1Q3k58O33j68M8j78k31J86l9j29J75k40
$$ -145 121 26 -265 -198 23 -61 5 -92 -216 -240 -179 -96 -354 279 111 159 -19 -250 -64 -103 -232 -57 -297
5538b97O45k24r6J29j94o9K95j21K9j83l5J31j53lL3Q0J73l31L19j33k23K84m8
$$ -297 348 124 28 157 -37 -106 189 68 97 -86 -121 10 -143 -146 -113 -33 140 -191 128 -5 -228 56 8
5561Hk87J13L13j91k5q4m3J60K11k93K74O4k53K7k22K4J83O0p7j60K24j98N29
$$ 8 -279 -166 147 -44 -69 -153 -196 -36 175 -118 156 220 -33 -6 -228 -204 -21 39 -38 -198 26 -172 357
$$ [...]
8191B34
##END NTUPLES=NMR FID
##END=
