##TITLE=1H_DE-60k_d6_T
 DMSO-d6
 8 sc, 
 3.7.2024
##JCAMPDX= 6.0         $$ Bruker NMR JCAMP-DX V2.0
##DATA TYPE= NMR FID
##DATA CLASS= NTUPLES
##ORIGIN= UXNMR, Bruker Analytische Messtechnik GmbH
##OWNER= root
$$ XWIN-NMR		Version 3.5
$$ Wed Jul  3 14:38:05 2024 Russian Standard Time (UT+4h)  she@DPX200
##.OBSERVE FREQUENCY= 200.1314
##.OBSERVE NUCLEUS= ^1H
##.DELAY= (6, 6)
##.ACQUISITION MODE= SIMULTANEOUS
##.ACQUISITION SCHEME= undefined
##.AVERAGES= 8
##.DIGITISER RES= 18
##SPECTROMETER/DATA SYSTEM= spect
##.PULSE SEQUENCE= zg30
##.SOLVENT NAME= DMSO
##.SHIFT REFERENCE= (INTERNAL, DMSO, 0, 15.7039)
##AUDIT TRAIL= $$ (NUMBER, WHEN, WHO, WHERE, WHAT)
$$ ##TITLE= Audit trail, XWIN-NMR		Version 3.5
$$ ##JCAMPDX= 5.01
$$ ##ORIGIN= Bruker BioSpin GmbH
$$ ##OWNER= she
$$ F:/spectra/data/she/nmr/H-F/1/audita.txt
$$ ##AUDIT TRAIL=  $$ (NUMBER, WHEN, WHO, WHERE, WHAT)
(   1,<2024-07-03 14:37:11.90 +0400>,<she>,<DPX200>,
      <created by zg, POWCHK disabled, PULCHK disabled
       configuration hash MD5:
       00 E9 B6 7A A2 85 ED C7 34 08 36 98 17 FE 4E 26
       data hash MD5: 16K
       3B 69 91 6C 81 35 09 75 0A 8A 6D E7 85 7D F3 6E>)
$$ ##END=
$$ 
$$ hash MD5
$$ 42 9E 8E 92 BF 77 D8 B4 72 C1 DA F0 12 FA BC 60
##$RELAX= 
##$RELAX= 
##$RELAX= 
##$RELAX= 
##$RELAX= 
##$RELAX= 
$$ Bruker specific parameters
$$ --------------------------
##$DU= <F:/spectra>
##$EXPNO= 1
##$NAME= <H-F>
##$PROCNO= 1
##$TYPE= <nmr>
##$USER= <she>
##$AMP= (0..31)
100 100 100 100 100 100 100 100 100 100 100 100 100 100 100 100 100 100 
100 100 100 100 100 100 100 100 100 100 100 100 100 100 
##$AQSEQ= 0
##$AQ_mod= 1
##$AUNM= <au_zg>
##$AUTOPOS= <>
##$BF1= 200.13
##$BF2= 200.13
##$BF3= 200.13
##$BF4= 200.13
##$BF5= 200.13
##$BF6= 200.13
##$BF7= 200.13
##$BF8= 200.13
##$BYTORDA= 1
##$CFDGTYP= 0
##$CFRGTYP= 5
##$CHEMSTR= <none>
##$CNST= (0..31)
1 1 145 1 1 1 1 1 1 1 1 1 1 1 1 1 1 1 1 1 1 1 1 1 1 1 1 1 1 1 1 1 
##$CPDPRG= <>
##$CPDPRG1= <>
##$CPDPRG2= <>
##$CPDPRG3= <>
##$CPDPRG4= <mlev>
##$CPDPRG5= <mlev>
##$CPDPRG6= <mlev>
##$CPDPRG7= <mlev>
##$CPDPRG8= <mlev>
##$CPDPRGB= <>
##$CPDPRGT= <>
##$D= (0..31)
0 1.2 0 0 0 0 0 0 0 0.06 0 0.03 0 0 0 0 0.0002 0 0 0 0 0 0 0 0 0 0 0 0 
0 0 0 
##$DATE= 1720003031
##$DBL= (0..7)
120 120 120 120 120 120 120 120 
##$DBP= (0..7)
150 150 150 150 150 150 150 150 
##$DBP07= 0
##$DBPNAM0= <>
##$DBPNAM1= <>
##$DBPNAM2= <>
##$DBPNAM3= <>
##$DBPNAM4= <>
##$DBPNAM5= <>
##$DBPNAM6= <>
##$DBPNAM7= <>
##$DBPOAL= (0..7)
0.5 0.5 0.5 0.5 0.5 0.5 0.5 0.5 
##$DBPOFFS= (0..7)
0 0 0 0 0 0 0 0 
##$DE= 6
##$DECBNUC= <off>
##$DECIM= 24
##$DECNUC= <off>
##$DECSTAT= 4
##$DIGMOD= 1
##$DIGTYP= 9
##$DL= (0..7)
0 120 120 120 120 120 120 120 
##$DP= (0..7)
150 150 150 150 150 150 150 150 
##$DP07= 0
##$DPNAME0= <>
##$DPNAME1= <>
##$DPNAME2= <>
##$DPNAME3= <>
##$DPNAME4= <>
##$DPNAME5= <>
##$DPNAME6= <>
##$DPNAME7= <>
##$DPOAL= (0..7)
0.5 0.5 0.5 0.5 0.5 0.5 0.5 0.5 
##$DPOFFS= (0..7)
0 0 0 0 0 0 0 0 
##$DQDMODE= 0
##$DR= 18
##$DS= 0
##$DSLIST= <SSSSSSSSSSSSSSS>
$$ [...]
##$SUBNAM2= <"">
##$SUBNAM3= <"">
##$SUBNAM4= <"">
##$SUBNAM5= <"">
##$SUBNAM6= <"">
##$SUBNAM7= <"">
##$SUBNAM8= <"">
##$SUBNAM9= <"">
##$SW= 24.0689651099613
##$SWIBOX= (0..15)
0 0 2 0 0 0 0 0 0 0 0 0 0 0 0 0 
##$SW_h= 4816.95568400771
##$TD= 16384
##$TD0= 1
##$TE= 0
##$TE2= 300
##$TE3= 300
##$TEG= 300
##$TL= (0..7)
0 120 120 120 120 120 120 120 
##$TP= (0..7)
150 150 150 150 150 150 150 150 
##$TP07= 0
##$TPNAME0= <>
##$TPNAME1= <>
##$TPNAME2= <>
##$TPNAME3= <>
##$TPNAME4= <>
##$TPNAME5= <>
##$TPNAME6= <>
##$TPNAME7= <>
##$TPOAL= (0..7)
0.5 0.5 0.5 0.5 0.5 0.5 0.5 0.5 
##$TPOFFS= (0..7)
0 0 0 0 0 0 0 0 
##$TUNHIN= 0
##$TUNHOUT= 0
##$TUNXOUT= 0
##$USERA1= <user>
##$USERA2= <user>
##$USERA3= <user>
##$USERA4= <user>
##$USERA5= <user>
##$V9= 5
##$VALIST= <valist>
##$VCLIST= <CCCCCCCCCCCCCCC>
##$VD= 0
##$VDLIST= <DDDDDDDDDDDDDDD>
##$VPLIST= <PPPPPPPPPPPPPPP>
##$VTLIST= <TTTTTTTTTTTTTTT>
##$WBST= 1024
##$WBSW= 4
##$XGAIN= (0..3)
0 0 0 0 
##$XL= 0
##$YL= 0
##$YMAX_a= 148584
##$YMIN_a= -154915
##$ZGOPTNS= <>
##$ZL1= 120
##$ZL2= 120
##$ZL3= 120
##$ZL4= 120
##$ABSF1= 10
##$ABSF2= 0
##$ABSG= 5
##$ABSL= 3
##$ALPHA= 0
##$AQORDER= 0
##$ASSFAC= 0
##$ASSFACI= 0
##$ASSFACX= 0
##$ASSWID= 0
##$AUNMP= <proc_1d>
##$AZFE= 0.1
##$AZFW= 0.1
##$BCFW= 1
##$BC_mod= 2
##$BYTORDP= 1
##$COROFFS= 0
##$CY= 11.3945322036743
##$DATMOD= 1
##$DC= 2
##$DFILT= <>
##$DTYPP= 0
##$F1P= 15.6554695791079
##$F2P= 12.8336369535428
##$FCOR= 0.5
##$FTSIZE= 0
##$FT_mod= 4
##$GAMMA= 1
##$GB= 0.15
##$INTBC= 1
##$INTSCL= 1
##$ISEN= 128
##$LB= 0.24
##$LEV0= 0
##$LPBIN= 0
##$MAXI= 10000
##$MC2= 0
##$MEAN= 0
##$ME_mod= 0
##$MI= 1.114404
##$NCOEF= 0
##$NC_proc= 0
##$NLEV= 6
##$NOISF1= 3.799351
##$NOISF2= 2.8
##$NSP= 1
##$NTH_PI= 0
##$NZP= 0
##$OFFSET= 15.70392
##$PC= 1
##$PHC0= -25501.48
##$PHC1= 4.787481
##$PH_mod= 1
##$PKNL= yes
##$PPARMOD= 0
##$PSCAL= 0
##$PSIGN= 0
##$REVERSE= no
##$SF= 200.130013532006
##$SI= 16384
##$SIGF1= 3
##$SIGF2= 2
##$SINO= 400
##$SIOLD= 16384
##$SREGLST= <1H.CDCl3>
##$SSB= 0
##$STSI= 0
##$STSR= 0
##$SW_p= 3612.71676300578
##$SYMM= 0
##$S_DEV= 0
##$TDeff= 0
##$TDoff= 0
##$TI= <>
##$TILT= no
##$TM1= 0
##$TM2= 0
##$TOPLEV= 0
##$USERP1= <user>
##$USERP2= <user>
##$USERP3= <user>
##$USERP4= <user>
##$USERP5= <user>
##$WDW= 1
##$XDIM= 8192
##$YMAX_p= 0
##$YMIN_p= 0
$$ End of Bruker specific parameters
$$ ---------------------------------
##NTUPLES= NMR FID
##VAR_NAME=  TIME,          FID/REAL,        FID/IMAG
##SYMBOL=    X,             R,               I
##VAR_TYPE=  INDEPENDENT,   DEPENDENT,       DEPENDENT
##VAR_FORM=  AFFN,          ASDF,            ASDF
##VAR_DIM=   8192,          8192,            8192
##UNITS=     SECONDS,       ARBITRARY UNITS, ARBITRARY UNITS
##FACTOR=    0.0002076,     1,               1
##FIRST=     0,             0,               0
##LAST=      1.7004516,     0,               0
##MIN=       0,             -154915,         0
##MAX=       1.7004516,     148584,          0
$$ Real data points
##PAGE= N=1
##DATA TABLE= (X++(R..R)), XYDATA
$$ plain form
0 0 0 0 0 0 0 0 0 0 0 0 -7 7 -7 7 -7 14 -14 14 -21 22 -28 33 -34 41 -48 55 -62 73 -82 94 -107 116 -132 148
34 148 -165 182 -205 229 -252 279 -310 343 -381 420 -465 517 -573 638 -713 798 -900 1022 -1171
53 -1171 1358 -1600 1930 -2407 3157 -4523 7791 -32102 19952 148584 104470 -50908 -154915
66 -154915 -103588 1085 86773 114116 60489 -66306 -138148 -72007 59408 114436 70589
77 70589 -14546 -89526 -113822 -41534 76605 118452 39064 -61623 -91608 -54312 11112 80558
89 80558 99678 21554 -84150 -97098 -16612 55792 71798 51129 -6809 -78894 -82367 6570
101 6570 83939 69471 8081 -38370 -60493 -45361 21222 82990 60881 -21246 -68108 -47796
113 -47796 -3378 35028 59120 38621 -30357 -76009 -39790 30620 56677 36009 4356 -33696
$$ packed form
0@%%%%%%%%%%pJ4j4J4j4K1k8K8l5M3n0O1o7P5q9J03j17J35j55J76k01K23k48K80
34A48l13L47l87M34m81N31n89O53p24Q01q85R82j090J211j351J511j698J922k193
53a171K529k958L530m337N564p680J2314l9893N2054J28632m4114j55378j04007
66a54915N1327J04673Q5688K7343n3627j26795p1842O6141J31415N5028m3847
77G0589q5135p4980k4296P2288J18139M1847p9388j00687k9985L7296O5424O9446
89H0558J9120p8124j05704j2948Q0486P2404J6006k0669n7938p2085l473Q8937
101F570P7369j4468o1390m6451k2123J5132O6583O1768k2109q2127m6862K0312
113d7796M4418L8406K4092k0499o8978m5652L6219P0410K6057k0668l1653l8052
$$ plain form
125 -33696 -61176 -31992 38405 63540 17366 -31571 -40194 -32215 -9528 38467 61513 15573
137 15573 -44285 -45557 -8235 16729 29106 31340 605 -47267 -50162 176 39204 32092 8167
150 8167 -9327 -26747 -27842 8253 46388 33737 -12416 -34382 -23605 -9272 6960 30285
162 30285 27204 -15095 -42091 -17322 18262 24632 20258 15058 -10696 -37527 -19585 23203 31055
175 31055 5942 -9709 -14937 -22970 -13609 19485 34761 7658 -21732 -19157 -3823 3014 13213
188 13213 23629 7890 -23696 -26705 1941 17973 9995 3829 103 -16327 -24064 616 26634
201 26634 16311 -7573 -10563 -5868 -9437 304 22285 19197 -11192 -23385 -7226 3946 3816
214 3816 10730 14460 -5147 -22913 -9362 13375 14122 3271 1023 -3335 -15348 -12991 9985 19393
$$ packed form
125c3696k7480K9184P0397K5135m6174m8937q623P979K2687M7995K3046m5940
137A5573n9858j272L7322K4964J2377K234l0735m7872k895N0338L9028p112k3925
150H167j7494j7420j095L6095L8135j2651m6153k1966J0777J4333J6232K3325
162C0285l081m2299k6996K4769L5584O370m374n200k5754k6831J7942M2788P852
175C1055k5113j5651n228q033R361L3094J5276k7103k9390K575J5334O837J0199
188A3213J0416j5739l1586l009K8646J6032p978o166l726j6430p737K4680K6018
201B6634j0323k3884k990M695l569R741K1981l088l0389j2193J6159J1172j30
214C816O914L730j9607j7766J3551K2737P47j0851k248m358j2013K357K2976R408
$$ plain form
228 19393 2537 -10344 -4707 -1222 -4278 5550 17881 6397 -15499 -14341 2363 5069 -145
241 -145 4993 5922 -10649 -15844 3298 17124 6887 -2231 685 -3123 -11395 -2342 14422 9742
255 9742 -8047 -11232 -1997 -1483 -1688 8535 13366 -1910 -14423 -4396 7854 4590 668 5521
269 5521 1343 -12335 -9932 7338 10885 -1583 -4793 936 -3077 -7724 2899 13169 3157 -9956
283 -9956 -4240 4238 580 -474 7925 5584 -9315 -10783 2587 7176 -371 -1601 2614 -3074 -9921
298 -9921 -675 11649 7479 -4081 -3301 1417 -3420 -4202 6390 9200 -4027 -10251 -1461 3545 -976
313 -976 397 6990 1868 -9050 -5054 6853 4922 -3473 -941 3175 -3726 -6421 3955 9252 -149
328 -149 -6456 -347 2272 -2743 -1063 6164 2665 -7882 -6685 3667 4591 -996 1308 4757 -2173
$$ packed form
228A9393j6856j2881N637L485l056R828J2331j1484k1896J158J6704K706n214
241a45N138R29j6571n195J9142J3826j0237r118K916l808q272R053J6764m680
255I742j7789l185R235N14k05J0223M831j5276j2513J0027J2250l264l922M853
269E521m178j3678K403J7270L547j2468l210N729m013m647J0623J0270j0012j3113
283i956N716Q478l658j054Q399k341j4899j468J3370M589p547j230M215n688o847
298i921R246J2324m170j1560P80M718m837p82J0592K810j3227o224Q790N006m521
313i76J373O593n122j0918L996J1907j931q395K532M116o901k695J0376N297r401
328a49o307O109K619n015J680P227l499j0547J197J0352R24n587K304L449o930
$$ plain form
343 -2173 -7778 652 7810 1471 -4755 -622 769 -5276 -4035 5632 6271 -3355 -4767 2588 2223 -3072
359 -3072 826 5838 -381 -7036 -1438 4741 511 -3161 1316 2829 -3501 -4159 3882 5048 -2428
374 -2428 -4466 1468 1443 -3164 -122 5748 1837 -5372 -2084 4269 1340 -2390 1824 3227 -3453 -5960
390 -5960 1133 4426 -1235 -2377 2828 1738 -4418 -1799 5484 2916 -3425 -1411 2892 -616 -3913
405 -3913 874 3951 -1254 -4531 926 3404 -1343 -2580 2560 2465 -3501 -2052 3909 2854 -2750 -1254
421 -1254 2672 -12 -3408 572 4181 -546 -4422 -661 2011 -1537 -2153 3580 3244 -2327 -2656 2774
437 2774 2296 -2083 -261 3066 -189 -4651 -1506 2327 228 -2653 639 2569 -1317 -2456 1924
452 1924 3320 -1410 -2218 1655 1302 -2382 -1839 2426 410 -3356 -1058 3406 924 -2307 506 2604
$$ packed form
343b173n605Q430P158o339o226M133J391o045J241R667O39r626j412P355l65n295
359c072L898N012o219o655N598O179m230l672M477J513o330o58Q041J166p476
374b428k038N934k5m607L042N870l911p209L288O353k929l730M214J403o680k507
390e960P093L293n661j142N205j090o156K619P283k568o341K014M303l508l297
405c913M787L077n205l277N457K478m747j237N140r5n966J449N961j055n604J496
421a254L926k684l396L980L609m727l876L761K672l548o16N733l36n571l29N430
437B774m78m379J822L327l255m462L145L833k099k881L292J930l886j139M380
452A924J396m730q08L873l53l684N43M265k016l766K298M464k482l231K813K098
$$ plain form
468 2604 -1524 -3273 1626 3248 -1041 -2383 856 1050 -2148 -550 3102 1873 -2384 -1327 1744
483 1744 -105 -2175 594 2657 -941 -3384 83 2337 -871 -1530 1521 2027 -1905 -1946 1896 1741
499 1741 -2046 -1538 1743 570 -2319 -156 2219 -864 -2914 175 2258 -130 -1115 1399 1728 -1618
515 -1618 -1109 1963 2305 -983 -1033 1079 -522 -2602 -872 2085 -72 -1923 -293 1776 -182 -951
531 -951 1468 2335 -561 -1283 1199 879 -1842 -1933 972 -51 -1730 -141 2360 730 -1545 67 2042
548 2042 409 -936 904 1309 -1358 -2386 269 1073 -899 -736 1502 684 -1715 -403 1823 1238
564 1238 -949 -69 1177 -59 -1852 -47 1439 -312 -1287 545 1127 -993 -1278 866 640 -1091
580 -1091 -519 1336 327 -1549 -696 782 241 -1093 320 1122 6 -1243 195 1027 -84 -498 825
$$ packed form
468B604m128j749M899J622m289j342L239J94l198J598L652j229m257J057L071
483A744j849k070K769K063l598k443L467K254l208o59L051N06l932m1L842j55
499A741l787N08L281j173k889K163K375l083k050L089K083k388r85K514L29l346
515a618N09L072L42l288n0K112j601k080J730K957k157j851J630K069j958p69
531i51K419Q67k896p22K482l20k721r1K905j023j679J589K501j630k275J612J975
548B042j633j345J840M05k667j028K655Q04j972J63K238q18k399J312K226n85
564A238k187Q80J246j236j793J805J486j751r75J832N82k120k85K144k26j731
580a091N72J855j009j876Q53J478n41j334J413Q02j116j249J438Q32j111m14J323
$$ plain form
597 825 1062 -1076 -1036 384 418 -957 -416 966 179 -1248 -103 1094 370 -709 1009 1233 -423 -682
615 -682 87 178 -1202 -931 651 445 -1200 -650 704 736 -49 661 1661 364 -758 115 600 -785
633 -785 -1231 -192 477 -1049 -949 433 819 -457 163 1397 907 -329 -139 480 -533 -952 200 841
651 841 -157 -635 -24 309 -117 -18 742 956 -131 -271 92 222 -695 -353 490 214 -755 -323 280 -243
671 -243 -681 320 991 -408 -310 485 142 -842 -755 670 468 -308 -88 261 -196 -1019 -56 750 202 -205
691 -205 260 454 -363 -606 427 550 -379 -317 -211 -111 -732 104 669 611 195 250 638 -80 -226 142 151 -191
713 -191 -573 225 -177 -602 -811 63 299 521 404 512 76 -334 1 239 -229 -331 -318 -281 -469 -884 -127
734 -127 454 388 -144 336 499 -38 -290 260 342 -369 -253 -3 -144 -611 -424 -74 -232 94 125 398 -325
$$ packed form
597H25K37k138M0J420L4j375N41J382p87j427J145J197p24j079J718K24j656k59
615f82P69R1j380K71J582k06j645N50J354L2p85P10J000j297j122Q73M85j385
633g85m46J039O69j526J00J382L86j276O20J234m90j236J90O19j013m19J152O41
651H41r98m78O11L33m26R9P60K14j087j40L63J30r17L42Q43k76r69M32O03n23
671b43m38J001O71j399R8P95l43r84Q7J425k02p76K20L49m57q23R63Q06n48m07
691b05M65J94q17k43J033J23r29O2J06J00o21Q36N65n8m16N5L88p18j46L68Rl42
713a91l82P98m02m25k09Q74K36K22j17J08m36m10L35K38m68j02J3L7j88m15P57
734a27N81o6n32M80J63n37k52N50Q2p11J16K50j41m67J87L50j58L26L1K73p23
$$ plain form
755 -325 -61 -79 124 297 43 170 332 -327 -398 82 188 39 112 283 -203 -227 41 282 89 -161 470 458
777 458 -211 -92 -149 236 -358 -165 278 40 -207 -370 301 -18 -201 204 164 -25 -432 -59 -255 -370 -130
798 -130 -36 244 -93 -344 -98 100 -13 -75 124 -306 -420 -462 -243 -78 -472 313 275 301 -388 138 126 -113
820 -113 181 299 -9 -540 -169 -516 -471 28 54 10 66 -3 -252 -303 92 84 292 336 -44 -300 -246 -151 -144 -184 64
845 64 7 -321 -52 -94 156 -509 428 67 446 37 67 91 -46 -35 104 137 193 -157 147 -160 -292 -64 148
868 148 368 145 -76 -317 -69 26 36 -10 205 67 -96 -134 -356 -128 224 29 21 4 -16 -132 -76 51 274
891 274 128 32 -55 -306 29 126 -56 398 166 180 -269 -83 -126 -332 23 243 24 72 133 -334 -241 143 341
914 341 403 -100 70 -228 111 -196 -95 160 -54 331 102 115 -206 37 -60 -63 92 -19 -124 -332 -86 -53
$$ packed form
755c25K64j8K03J73k54J27J62o59p1M80J06j49P3J71m86k4K68K41j93k50O31j2
777D58o69J19n7L85n94J93M43k38k47j63O71l19j83M05m0j89m07L73j96j15K40
798a30R4K80l37k51K46J98j13o2J99m30j14m2K19J65l94P85l8K6o89N26j2k39
820a13K94J18l08n31L71l47M5M99K6m4N6o9k49n1L95qK08M4l80k56N4R5Pm0K48
845F4n7l28K69m2K50o65R37l61L79m09L0K4j37J1J39L3N6l50L04l07j32K28K12
868A48K20k23k21k41K48R5J0m6K15j38j63l8k22K28L52j95qj7k0j16N6J27K23
891B74j46r6q7k51L35R7j82M54k32J4m49J86m3k06L55K20k19M8O1m67R3L84J98
914C41O2n03J70k98L39l07J01K55k14L85k29J3l21K43r7lJ55j11j05k08K46L3
$$ plain form
936 -53 -96 -175 97 224 39 -213 -251 -195 87 53 101 106 192 -203 -22 159 440 60 110 41 87 149 -72 -110 -116 -379
962 -379 -40 53 364 9 136 -138 31 159 439 179 -160 187 15 -113 81 -77 151 38 -188 -114 -220
983 -220 -2 343 -20 -247 -113 -49 133 9 -67 114 144 -308 223 -7 -84 -13 126 -9 -65 42 7 -198 -323
1006 -323 159 171 188 218 -52 -7 122 -169 -10 144 85 152 -142 -271 -204 35 75 76 -37 142 55 -96 -4 -257
1030 -257 278 91 180 323 -147 78 -199 -71 -150 26 305 -93 -22 -283 185 43 -175 40 40 18 -103 69
1052 69 213 53 -54 278 -165 -31 16 0 63 -17 75 271 45 64 136 -113 22 322 24 108 259 -259 -283
1075 -283 -198 -185 -22 49 -36 -163 75 -67 34 278 307 48 54 92 -75 -211 113 331 92 -11 6 59 52 306
1099 306 -8 6 282 -116 48 28 -250 -138 -148 19 222 239 -206 -229 -28 -60 204 274 176 188 16 -93 -183
$$ packed form
936e3m3p9K72J27j85k52l8N6K82l4M8NQ6l95J81J81K81l80N0o9M6O2k21l8ok63
962c79L39R3L11l55J27k74J69J28K80k60l39L47j72j28J94j58K28j13k26P4j06
983b20K18L45l63k27J34O4J82j24p6J81L0m52N31k30p7P1J39j35n6J07l5k05j25
1006c23M82J2J7L0k70M5J29k91J59J54n9O7k94j29O7K39M0Jj13J79q7j51R2k53
1030b57N35j87Q9J43m70K25k77J28p9J76K79l98P1k61M68j42k18K15%k2j21J72
1052F9J44j60j07L32m43J34M7j6O3q0R2J96k26J9P2k49J35L00k98Q4J51n18k4
1075b83Q5J3J63P1q5j27K38j42J01K44K9k59OL8j67j36L24K18k39j03J7N3pK54
1099C06l14J4K76l98J64k0k78J12j0J67K03J7m45k3K01l2K64P0r8J2j72j09r0
$$ plain form
1122 -183 -72 322 191 -67 -276 71 20 138 133 126 -179 67 -95 -14 -263 -8 -145 -188 54 118 -190 -112 94
1145 94 293 138 199 400 -194 -13 74 78 -222 103 -277 397 136 141 126 206 195 -169 -187 5 -177 57 -101 339
1169 339 -68 -67 254 -315 108 -106 -62 20 24 24 116 -218 251 0 133 20 -144 -199 177 244 -144 -273 -211 274
1193 274 50 18 -14 159 -269 -56 41 -15 311 -222 40 -138 -18 -419 -216 -41 179 275 137 -164 129 -168
1215 -168 -79 2 -169 170 180 -312 -194 44 -89 -24 -32 -111 -177 -140 -69 -47 -409 -69 -9 149 -86 -181 88 -365
1239 -365 -272 -37 -394 15 -97 -101 63 46 -75 84 -269 81 56 130 -353 68 244 -104 176 -46 -249 76
1261 76 -10 21 -57 302 8 -215 -14 -29 10 201 -36 253 195 70 -33 -187 133 -14 357 123 -111 10
1283 10 150 -118 45 213 214 -63 -62 107 -36 -162 -115 -342 88 183 -96 217 15 -71 71 -166 18 272 276
$$ packed form
1122a83J11L94j31k58k09L47n1J18npl05K46j62Q1k49K55j37m3K42O4l08P8K06
1145I4J99j55O1K01n94J81Q7Ml00L25l80O74k61Nj5Q0j1l64j8J92j82K34j58M40
1169C39m07JL21n69M23k14M4Q2M%R2l34M69k51J33j13j64n5L76O7l88j29O2M85
1193B74k24l2l2J73m28K13R7n6L26n33K62j78J20m01K03J75K20R6j38l01K93k97
1215a68Q9Q1j71L39J0m92J18K38j33O5qp9o6L7P1K2l62L40O0J58k35r5K69m53
1239c65R3K35l57M09j12mJ64j7j21J59l53L50k5P4m83M21J76l48K80k22k03L25
1261G6q6L1p8L59k94k23K01j5L9J91k37K89n8j25j03j54L20j47L71k34k34J21
1283A0J40k68J63J68Jk77JJ69j43j26M7k27M30R5k79L13k02q6J42k37J84K54M
$$ plain form
1306 276 122 193 -18 -314 73 89 315 50 369 -322 56 -70 123 -105 -15 267 74 285 146 5 221
1327 221 -23 200 -144 -343 -363 -180 77 29 -99 98 -149 -66 -143 0 80 -5 117 -132 -167 -207 -6 -264 73
1350 73 91 59 -210 -15 -25 61 201 215 -193 -214 152 34 399 30 -129 140 -162 0 9 -30 186 -16 -45 170
1374 170 -84 -322 -133 -118 -3 338 43 -135 54 -94 -140 201 199 122 -255 38 -35 -55 -26 14 168 -106 156
1397 156 -86 166 -143 202 41 -32 -15 196 -56 -19 160 51 194 -126 48 17 333 355 32 -74 -221 65
1419 65 -82 -158 -225 -27 259 5 58 76 131 229 -98 -188 -101 39 -195 -26 -68 -89 109 -34 41 69 -123 -215 93
1444 93 83 -118 48 -52 78 -101 94 194 -88 168 61 -74 -58 100 346 -77 -72 359 153 156 -248 118
1466 118 -46 215 270 -251 179 -13 -31 -106 83 -236 -119 -128 168 413 156 -61 -114 129 -52 -158 -208 214
$$ packed form
1306B76j54P1k11k96L87J6K26k65L19o91L78j26J93k28R0K82j93K11j39j41K16
1327B21k44K23l44j99k0J83K57m8j28J97k47Q3p7J43Q0q5J22k49l5m0K01k58L37
1350G3J8l2k69J95j0Q6J40J4m08k1L66j18L65l69j59K69l02J62Rl9K16k02k9K15
1374A70k54k38J89J5J15L41k95j78J89j48m6L41kp7l77K93p3k0K9M0J54k74K62
1397A56k42K52l09L45j61p3J7K11k52L7J79j09J43l20J74l1L16K2l23j06j47K86
1419F5j47p6o7J98K86k54N3J8N5R8l27r0Q7J40k34J69m2k1J98j43P5K8j92r2L08
1444I3j0k01J66j00J30j79J95J00k82K56j07j35J6J58K46m23NM31k06Lm04L66
1466A18j64K61N5n21M30j92j8p5J89l19J17rK96K45k57k17n3K43j81j06n0M22
$$ plain form
1488 214 -14 -96 1 2 103 136 115 -267 -54 -187 -122 181 -386 -45 -7 125 40 28 122 240 -198 307 -13 257
1512 257 -45 -160 -48 -188 175 119 98 -411 -29 41 -209 4 17 163 45 -101 169 273 -95 200 -85
1533 -85 -273 -108 -40 -123 308 41 272 -442 140 -176 -185 -116 -73 -58 39 4 196 106 172 86 -32 -54 45 83 164 -75
1559 -75 -125 100 -84 187 28 -23 349 -74 134 -213 168 172 -245 50 -259 245 -176 98 -143 -30 116 223
1581 223 164 86 -50 -63 89 -125 -9 387 92 49 197 34 129 79 21 -200 -124 -95 81 -47 -89 -23 55 21
1605 21 -186 160 19 48 182 102 -103 160 -88 49 91 -174 362 -52 67 -119 -311 167 108 85 108 -216
1627 -216 -87 -38 174 218 76 -398 63 30 118 74 -161 -151 -44 129 -9 -55 -169 89 16 -271 48 -257 270
1650 270 -34 -94 257 -137 69 289 13 163 -77 130 190 -268 -228 28 169 -117 131 148 -59 -18 172 183
$$ packed form
1488B14k28q2R7JJ01L3k1l82K13j33O5L03n67L41L8J32q5j2R4J18m38N05l20K70
1512B57l02j15J12j40L63n6k1n09L82P0k50K13J3J46j18j46K70J04l68K95k85
1533h5j88J65O8q3M31k67K31p14N82l16rO9M3J5R7l5J92r0O6q6j18k2R9L8Q1k39
1559g5n0K25j84K71j59n1L72m23K08l47L81Mm17K95l09N04m21K74k41J13J46J07
1581B23n9p8j36j3J52k14J16L96k95m3J48j63R5n0n8k21P6K9J76j28m2O6P8l4
1605B1k07L46j41K9J34q0k05K63k48J37M2k65N36m14J19j86j92M78n9k3K3l24
1627b16J29M9K12M4j42m74M61l3Q8m4k35J0J07J73j38m6j14K58p3k87L19l05N27
1650B70l04o0L51l94K06K20k76J50k40K07O0m58M0K56J41k86K48J7k07M1J90J1
$$ plain form
1672 183 0 8 289 44 61 -156 -55 -18 14 156 222 -297 48 177 -143 -266 -218 29 351 -43 33 -191 119
1695 119 66 22 80 113 -116 -20 105 -53 134 -183 50 44 19 -192 80 27 139 -19 -86 123 27 290 -117 -245
1719 -245 57 -128 177 -174 7 186 -138 -54 172 -271 -11 -202 -24 217 -127 -167 25 -81 61 -106 -2
1740 -2 57 -154 128 -288 72 128 58 -171 -207 51 187 -99 91 167 -212 -75 102 -172 -84 60 116 259 154
1763 154 136 144 -46 -164 -265 -43 150 106 194 57 -78 60 22 232 150 20 174 47 127 47 148 181 -249
1786 -249 -76 51 -15 -92 91 -174 42 126 135 -207 158 21 118 155 348 330 -32 30 282 -88 250 -171 412
1809 412 291 287 293 116 19 8 -47 -46 84 17 -86 22 -135 114 -3 -172 -104 -124 71 83 212 88 227 29
1833 29 -67 151 -31 124 94 115 194 -240 455 83 188 43 -52 -181 -168 83 21 -278 24 282 231 -68 115
$$ packed form
1672A83j83QK81k45J7k17J01L7L2J42O6n19L45J29l20j23M8K47L22l94P6k24L10
1695A19n3m4N8L3k29R6J25j58J87l17K33ok5k11K72n3J12j58o7K09r6K63m07j28
1719b45L02j85L05l51J81J79l24Q4K26m43K60j91J78K41l44m0J92j06J42j67J04
1740bN9k11K82m16L60N6p0k29l6K58J36k86J90P6l79J37J77k74Q8J44N6J43j05
1763A54j8Qj90j18j01K22J93m4Q8j37j35J38l8K10q2j30J54j27Q0q0J01L3m30
1786b49J73J27o6p7J83k65K16Q4Rl42L65j37R7L7J93j8l62O2K52l70L38m21N83
1809D12j21mOj77r7j1n5JJ30o7j03J08j57K49j17j69O8k0J95J2J29j24J39j98
1833B9r6K18j82J55l0K1P9m34O95l72J05j45r5j29J3K51o2k99L02K58n1k99J83
$$ plain form
1856 115 245 -38 -23 140 205 88 47 135 275 -34 10 74 65 41 -186 -108 -123 57 95 23 15 -26 -97 4 38 170
1882 170 69 -16 92 -137 34 -43 192 89 13 -142 -64 -133 76 204 331 -111 76 56 -213 107 -235 227
1904 227 -100 33 -162 -20 183 170 124 -128 156 -403 -26 164 31 8 -196 -259 42 91 235 -19 -142 156
1926 156 -168 203 -101 -45 178 110 97 -12 -108 72 -203 23 61 70 104 -46 -48 -146 -248 -158 -80 -40 -122 17 -87
1951 -87 108 -36 -14 -123 129 110 -65 -74 6 -116 50 -63 297 189 -174 339 221 -2 62 -132 34 102 -102
1974 -102 -186 26 -13 4 -259 171 293 106 -32 144 -87 6 191 -194 197 8 83 189 47 -197 -25 -106
1996 -106 255 174 -189 -370 40 -64 10 -4 -145 -79 130 159 195 91 -94 -54 -306 14 36 -174 90 8 121
2019 121 53 -270 117 -44 199 40 78 -275 365 60 258 -5 -113 67 -99 -204 21 82 42 211 139 -132
$$ packed form
1856A15J30k83J5J63O5j17m1Q8J40l09M4O4rk4k27P8j5J80L8p2qm1p1J01L4J32
1882A70j01q5J08k29J71p7K35j03p6j55P8o9K09J28J27m42J87k0k69L20l42M62
1904B27l27J33j95J42K03j3m6k52K84n59L77J90j33k3k04o3L01M9J44k54j23K98
1926A56l24L71l04N6K23o8j3j09r6J80k75K26L8RL4j50kr8j02R0P8M0q2J39j04
1951h7J95j44K2j09K52j9j75rQ0j22J66j13L60j08l63N13j18k23O4j94J66O8k04
1974a02q4K12l9J7k63M30J22j87j38J76k31R3J85l85L91j89P5J06j42k44J72q1
1996a06L61q1l63j81M10j04P4j4j41O6K09K9L6j04j85M0k52L20K2k10K64q2J13
2019A21o8l23L87j61K43j59L8l53O40l05J98k63j08J80j66j05K25O1m0J69p2k71
$$ plain form
2041 -132 33 -37 153 176 -43 -105 34 262 -96 50 -178 215 -91 -167 17 -129 20 200 70 43 -186 -174
2063 -174 10 -125 -61 22 291 -67 -88 149 -259 285 -82 -110 167 -169 -310 419 183 141 282 8 -150 -349
2085 -349 -276 -77 -168 138 27 -177 -73 477 174 48 -156 -65 -104 -52 -40 -196 -164 153 13 312 -158 -74 296
2108 296 -6 60 246 262 -121 -136 -189 81 -125 63 180 420 46 -39 -47 70 -122 -141 2 80 -39 -200 -33
2131 -33 -25 65 -218 15 150 -179 258 -155 54 -324 290 -26 38 38 -205 -103 -67 -119 130 193 -68 169 -177
2154 -177 -105 108 -287 -165 -383 156 -361 -267 272 -127 -85 404 78 -349 -90 -169 85 24 93 60 231 -132
2176 -132 236 -31 -132 -60 174 238 398 -40 -180 116 316 177 -118 208 68 -64 13 -54 78 -286 -49
2197 -49 158 26 376 115 -310 252 176 55 -114 15 -106 159 163 -42 125 54 -336 158 -46 41 -242 -56
$$ packed form
2041a32J65p0J90K3k19o2J39K28l58J46k28L93l06p6J84j46J49J80j30k7k29J2
2063a74J84j35O4Q3K69l58k1K37m08N44l67k8K77l36j41P29k36m2J41k74j58j99
2085c49P3J99r1L06j11k04J04N50l03j26k04R1l9N2J2j56L2L17j40K99m70Q4L70
2108B96l02O6J86J6l83j5n3K70k06J88J17K40l74q5qJ17j92j9J43P8j19j61J67
2131c3QR0k83K33J35l29M37m13K09l78O14l16O4%k43J02L6n2K49O3k61K37l46
2154a77P2K13l95J22k18N39n17R4N39l99M2M89l26m27K59p9K54o1O9l3J71l63
2176a32L68k67j01P2K34O4J60m38j40K96K00j39k95L26j40j32P7o7J32l64K37
2197d9K07j32L50k61m25N62p6j21j69J29j21K65Mk05J67p1l90M94k04Q7k83J86
$$ plain form
2219 -56 -187 267 116 -387 -135 116 -255 233 74 83 -138 -233 38 4 -73 -25 -269 -128 96 -52 250 -110
2241 -110 55 8 -58 -218 -80 -109 628 -357 526 80 -308 115 121 -191 148 -271 91 106 -138 -376 -112 114
2263 114 304 124 -321 72 242 166 161 -168 75 91 -19 3 -312 110 -27 157 -91 -10 7 117 -244 -196 -202
2286 -202 -65 -211 83 -38 -68 150 37 -153 43 279 -203 -130 -95 229 -27 42 -139 31 -75 43 -55 -34
2308 -34 -266 -310 32 -49 -108 192 -291 -245 -34 -139 -89 -40 -338 237 108 -66 -14 -189 276 320 -32 -40 178 -54
2332 -54 -133 22 60 -138 -97 -10 58 -234 -451 -20 -85 -266 162 293 186 55 238 121 -87 178 20 234
2354 234 -155 -243 171 -53 103 501 -95 -38 -101 159 38 60 -31 189 164 -168 -4 -132 68 -7 312 -173
2376 -173 -100 93 66 -203 -82 -88 45 4 70 84 142 117 -148 7 14 -139 -30 150 195 -61 -239 424 344 36
$$ packed form
2219e6j31M54j51n03K52K51l71M88j59Rk21r5K71l4p7M8k44J41K24j48L02l60
2241a10J65m7o6j60J38k9P37r85Q83m46l88M23Ol12L39m19L62J5k44k38K64K26
2263A14J90j80m45L93J70p6nl29K43J6j10K2l15M22j37J84k48Q1J7J10l61M8o
2286b02J37j46K94j21l0K18j13j90J96K36m82P3L5L24k56O9j81J70j06J18r8K1
2308c4k32m4L42q1n9L00m83M6K11j05N0M9k98N75j29j74N2j75M65M4l52qK18k32
2332e4p9J55L8j98M1Q7O8k92k17M31o5j81M28J31j07j31J83j17k08K65j58K14
2354B34l89q8M14k24J56L98n96N7o3K60j21K2r1K20k5l32J64j28K00p5L19m85
2376a73P3J93k7k69J21oJ33m1O6J4N8k5k65J55Pj53J09J80M5k56j78O63q0l08
$$ plain form
2400 36 293 116 202 -22 154 217 -148 -189 179 206 95 -38 88 101 -38 -156 154 501 130 213 78 -16 -19
2423 -19 -2 -20 116 -40 85 1 -29 -47 255 7 193 133 98 113 -53 -72 -61 -71 -74 250 -278 -70 217 203 -53
2448 -53 122 7 64 -73 -32 -122 18 -76 108 126 -255 99 232 -92 269 -18 22 -128 -70 177 -16 -155 353
2471 353 13 -39 149 -176 184 -15 -87 40 -175 -66 132 185 -80 9 -128 -172 -158 43 -57 46 -153 -38
2493 -38 0 -74 -221 -94 126 438 -213 -118 179 -81 0 176 -40 -245 -283 30 16 -39 -167 160 87 -241 -178
2516 -178 -1 -29 176 -137 70 122 -202 -110 83 77 -120 -4 25 9 155 124 -151 -1 -167 -194 -189 -90 105 -48
2540 -48 122 -58 -219 -63 273 82 11 174 -178 -184 0 -106 -182 154 20 435 44 -240 118 102 -216 0
2562 0 -135 142 13 -107 98 70 48 205 350 67 -1 51 57 6 -140 135 135 -254 62 197 -84 -41 17 -331
$$ packed form
2400C6K57j77Q6k24J76O3l65m1L68K7j11j33J26J3j39j18L10L47l71Q3j35r4l
2423a9J7j8J36j56J25q4l0j8L02k48J86o0l5J5j66j9J1j0lL24n28K08K87j4k56
2448e3J75j15N7j37M1r0J40r4J84J8l81L54J33l24L61k87M0j50N8K47j93j39N08
2471C53l40n2J88l25L60j99p2J27k15J09J98N3k65Q9j37m4J4K01j00J03j99J15
2493c8L8p4j47J27K20L12o51R5K97k60Q1J76k16k05l8L13j4n5j28L27p3l28O3
2516a78J77k8K05l13K07N2l24R2J93oj97J16K9j6J46l1k75J50j66k7NR9J95j53
2540d8J70j80j61J56L36j91p1J63l52oJ84j06p6L36j34M15l91k84L58j6l18K16
2562@j35K77j29j20K05k8k2J57J45k83o8N2On1j46K75%l89L16J35k81M3N8l48
$$ plain form
2586 -331 174 -146 25 145 -128 -73 -79 199 178 -212 113 -27 143 -86 -198 -273 133 -277 44 50 -148 193
2608 193 45 -57 -281 187 -146 64 -123 73 -12 46 242 95 -203 53 -158 8 -128 72 368 -52 84
2629 84 -196 -69 107 -5 12 128 95 367 -61 -162 369 -97 271 236 314 -104 173 -57 -37 30 54 237 53
2652 53 -23 56 116 127 191 -126 -176 -6 35 4 188 57 -124 286 285 -93 198 230 -142 54 49 389 133 -21 226
2677 226 -39 -236 -518 137 -23 -160 -110 116 -235 18 452 -28 70 -170 61 164 -88 -190 -128 40 -12
2698 -12 -74 179 -20 -140 5 -69 20 -59 -126 153 299 148 -80 43 178 -217 21 13 43 229 -98 -214 48
2721 48 -108 187 10 -282 164 -31 -157 11 129 86 -116 -116 -211 63 -13 -280 -3 1 -335 251 -46 -223 -444
2744 -444 30 -133 21 13 -225 130 -67 78 276 273 -403 -88 -95 254 -50 245 117 189 -120 -68 32 110 230
$$ packed form
2586c31N05l20J71J20k73N5oK78k1l90L25j40J70k29j12p5M06m10L21Oj98L41
2608A93j48j02k24M68l33K10j87J96q5N8J96j47k98K56k11J66j36K00K96m20J36
2629H4k80J27J76j12J7J16l3K72m28j01N31m66L68l5P8m18K77k30K0O7K4J83j84
2652E3p6P9O0J1O4l17n0J70M1l1J84j31j81M10jl78K91L2l72J96nL40k56j54K47
2677B26k65j97k82O55j60j37N0K26l51K53M34m80R8k40K31J03k52j02O2J68n2
2698a2o2K53j99j20J45p4Q9p9o7K79J46j51k28J23J35l95K38qL0J86l27j16K62
2721D8j56K95j77k92M46j95j26J68J18m3k02%r5K74p6k67K77Ml36N86k97j77k21
2744d44M74j63J54qk38L55j97J45J98lo76L15pL49l04K95j28P2l09N2J00P8J20
$$ plain form
2767 230 -58 94 -76 -10 -148 380 122 -221 182 89 -389 39 9 -55 123 -265 -59 -99 -98 223 -5 343
2789 343 -37 -128 139 -252 136 -78 260 -194 -55 -114 -108 14 287 -30 -174 -167 -267 104 147 250 83 72 87
2812 87 -1 -81 -28 -91 -109 -65 103 -102 71 284 148 -221 97 4 110 69 -147 83 -148 -78 24 106 -152 -84
2836 -84 110 -138 86 -92 -104 -12 -107 177 -15 164 140 305 -379 18 -113 -150 41 -30 67 -234 -222 -73 -128
2859 -128 -120 203 28 -116 -191 -163 -241 -236 73 -14 76 -233 141 356 159 98 -149 -277 -11 -157 294 -240 -151 171
2883 171 350 13 -231 26 49 -201 212 40 133 -223 84 -44 -201 -160 -144 95 64 -117 -193 180 45 485
2905 485 50 -78 105 -79 -87 -57 -146 -195 114 119 -152 195 -27 314 -177 -31 178 -71 82 -43 -172 117
2927 117 -168 -22 426 84 -7 -128 52 -114 -51 99 120 122 302 -62 -116 -144 94 73 100 171 111 -103 98 181
$$ packed form
2767B30k88J52j70O6j38N28k58l43M03r3m78M28l0o4J78l88K06m0JL21k28L48
2789C43l80r1K67l91L88k14L38m54J39n9OJ22K73l17j44Pj00L71M3J03j67j1J5
2812H7q8q0N3o3j8M4J68k05J73K13j36l69L18r3J06m1k16K30k31P0J02Q2k58O8
2836h4J94k48K24j78j2R2r5K84j92J79k4J65o84L97j31l7J91p1R7l01J2J49n5
2859a28QL23j75j44p5K8p8NL09q7R0l09L74K15j97o1k47j28K66j46M51n34Q9L22
2883A71J79l37k44K57K3k50M13j72R3l56L07j28j57M1J6K39l1j81p6L73j35M40
2905D85m35j28J83j84qL0q9m9L09Nk71L47k22L41m91J46K09k49J53j25j29K89
2927A17k85J46M48l42r1j21J80j66O3J50K1KJ80l64n4k8K38k1K7P1o0k14K01Q3
$$ plain form
2951 181 147 -27 -171 60 124 175 -278 40 13 141 -292 -284 -48 98 325 -385 -107 16 -6 30 69 39 -160
2974 -160 -117 -214 277 -65 388 -5 -36 40 71 79 -286 -44 -81 -241 247 83 237 -109 -215 163 -260 347 134
2997 134 -347 95 -176 -182 -142 80 182 35 -233 -66 -9 -209 252 400 -4 77 -30 82 53 -145 -11 147
3019 147 -127 -43 140 -89 128 200 -163 339 10 59 269 105 -122 -221 -236 53 -26 132 -181 76 -32 -139
3041 -139 -213 148 136 46 23 -8 299 -25 -22 -95 72 14 -142 42 -431 -117 57 -201 -188 -193 -40 -89 66 80 169
3066 169 34 31 -62 244 -98 72 -297 31 -254 -209 17 177 -73 -7 46 -53 271 -177 111 48 46 -336 -120
3089 -120 173 73 85 310 16 57 -30 37 -102 -245 10 95 223 217 276 -40 92 148 107 -191 79 -20 242 371
3113 371 16 233 -374 0 71 -109 -1 238 12 88 -229 -149 82 -350 -246 62 -217 144 -344 -284 -153
$$ packed form
2951A81l4j74j44K31O4N1m53L18k7J28m33QK36J46K27p10K78J23k2L6L9l0j99
2974a60M3r7M91l42M53l93l1P6L1Ql65K42l7j60M88j64J54l46j06L78m23O07k13
2997A34m81M42k71oM0K22J02j47k68J67N7k00M61J48m04Q1j07J12k9j98J34J58
3019A47k74Q4J83k29K17P2l63N02l29M9K10j64k27r9j5K89p9J58l13K57j08j07
3041a39p4L61j2r0k3l1L07l24Lp3J67n8j56J84m73L14J74k58J3nJ53m9J55J4Q9
3066A69j35lr3L06l42J70l69L28k85M5K26J60k50O6N3r9L24m48K88o3kl82K16
3089a20K93j00J2K25k94M1q7O7j39j43K55Q5J28oN9l16J32N6m1k98K70r9K62J29
3113C71l55K17o07L74P1j80J08K39k26P6l17Q0K31m32J04L08k79L61m88O0J31
$$ plain form
3134 -153 253 -219 102 -35 -92 26 -83 103 107 -39 -364 -70 250 92 -71 -18 -13 -37 32 -20 -251 79 146
3157 146 -161 111 150 -234 -57 -24 108 70 170 -138 77 61 85 210 297 193 75 -60 -142 -42 -111 -187 -316
3180 -316 114 -134 -43 -127 136 -176 216 192 -22 42 -45 184 -126 41 -290 -9 265 -29 272 163 155 -183
3202 -183 -176 233 14 198 19 -138 74 -250 -59 -88 -7 -93 149 336 -214 -180 -156 -69 -2 -31 208 121 79 -104
3226 -104 -238 79 -404 160 100 202 -29 222 107 167 -387 -52 47 42 -214 49 -190 -253 125 148 186 88 87 -33
3250 -33 -35 -53 -62 295 65 178 -26 -155 112 -167 -13 -49 41 22 -188 -17 -324 121 20 111 119 30 -79 -345
3274 -345 89 281 171 126 26 74 -17 215 -19 18 -15 21 128 226 85 -116 48 -122 -105 -11 -4 110 95 122
3298 122 -130 -28 107 -22 150 -30 -51 259 49 -46 -21 -24 -310 -103 180 205 104 -151 -68 77 -171 -97 278
$$ packed form
3134a53M06m72L21j37n7J18j09J86Mj46l25K94L20j58j63N3Nk4O9n2k31L30O7
3157A46l07K72L9l84J77L3J32l8J00l08K15j6K4J25Q7j04j18j35q2J00o9p6j29
3180c16M30k48R1q4K63l12L92k4k14O4q7K29l10J67l31K81K74k94L01j09ql38
3202a83PM09k19J84j79j57K12l24J91k9Q1q6K42J87n50L4K4Q7O7k9K39q7m2j83
3226a04j34L17m83N64o0J02k31K51j15O0n54L35R9nk56K63k39o3L78K3L8r8jj20
3250c3kj8rL57k30J13k04j29K67k79J54l6R0j9k10J71l07M45j01R1Qq9j09k66
3274c45M34J92j10m5j00M8r1K32k34L7l3L6J07R8j41k01J64j70J7R4PJ14j5K7
3298A22k52J02J35j29J72j80k1L10k10r5K5lk86K07K83K5j01k55Q3J45k48P4L75
$$ plain form
3321 278 -128 -113 10 49 -45 72 -59 17 143 149 -107 -227 -8 270 22 -79 -291 143 -184 110 -23 54
3343 54 -6 -58 216 97 -138 33 -41 -76 -6 -93 -126 -81 -31 -29 86 19 43 -86 -174 126 -73 179 -127 178 40
3368 40 238 -86 -49 -135 -184 -33 171 83 -36 -166 49 282 -1 192 222 32 208 94 -178 -289 221 -134
3390 -134 193 12 -374 -255 -245 72 -108 -39 83 115 47 -6 -364 21 231 57 70 160 -44 234 138 218 -143
3413 -143 -251 -208 -118 470 -320 -81 35 98 -1 -206 62 144 127 -4 -6 -234 163 -58 300 -173 194 -68 13
3436 13 -24 -72 162 -207 127 -21 207 133 264 -53 -65 61 77 4 209 -149 -23 93 41 40 -386 26 171
3459 171 34 61 -81 -129 51 286 41 232 169 340 19 297 -227 93 -55 57 -101 -40 36 168 -231 -167
3481 -167 -86 146 -95 23 52 -217 168 65 -47 -116 -37 -240 77 -68 194 -176 82 -103 32 127 -249 -122
$$ packed form
3321B78m06J5J23L9r4J17j31P6J26Ok56j20K19K78k48j01k12M34l27K94j33P7
3343E4o0n2K74j19k35J71p4l5P0q7l3M5N0KJ15o7K4j29q8L00j99K52l06L05j38
3368D0J98l24L7q6m9J51K04q8j19j30K15K33k83J93L0j90J76j14k72j11N10l55
3390a34L27j81l86J19J0L17j80O9J22L2o8n3l58L85K10j74J3R0k04K78r6Q0l61
3413a43j08M3R0N88p90K39J16O3r9k05K68Q2j7j31kk28L97k21L58m73L67k62Q1
3436A3l7m8K34l69L34j48K28p4J31l17j2J26J6p3K05l58J26J16n2jm26M12J45
3459A71j37K7j42m8J80K35k45J91o3J71l21K78n24L20j48J12j58O1P6J32l99O4
3481a67Q1K32k41J18K9k69L85j03j12o9P9k03L17j45K62l70K58j85J35R5l76J27
$$ plain form
3503 -122 128 -143 192 164 -124 63 -81 -222 198 -11 -21 267 -135 146 -173 229 190 16 104 -88 -50 140
3525 140 -82 -155 140 -116 82 73 -29 -26 9 103 -140 -174 -38 -10 132 -21 -72 -242 175 -44 115 -14 133
3548 133 129 -124 41 -53 -56 155 58 -157 -79 350 -137 -60 76 -148 -123 0 -63 68 -119 161 260 -144 111 -132
3572 -132 -31 -63 172 -94 -29 42 -63 183 -265 -174 -146 -85 16 -59 -174 -102 -307 -21 336 -144 25 -44 99
3595 99 -14 11 -136 -50 -185 24 -82 -27 172 -30 -287 -67 86 107 227 36 -87 -165 -82 157 -147 85
3617 85 10 227 113 -116 126 -11 -26 -30 11 -56 84 61 -31 23 105 -136 -239 -42 137 182 199 230 451 1 -202
3642 -202 -138 138 144 211 5 -186 -140 -91 -169 -70 91 51 -44 221 -207 156 -92 -251 6 -288 85 -27 -88 52
3666 52 41 -141 162 -21 155 94 239 45 86 -145 38 16 -104 40 -175 170 -447 -81 -210 -107 -43 -252
$$ packed form
3503a22K50k71L35k8k88J87j44j41M20k09j0K88m02K81l19M02l9j74Q8j92L8J90
3525A40k22p3K95k56J98rj02LL5R4k43l4J36K8J42j53n1j70M17k19J59j29J47
3548A33mk53J65r4lK11r7k15P8M29m87P7J36k24K5J23o3J31j87K80R9m04K55k43
3572a32J01l2K35k66O5P1j05K46m48R1K8O1J01p5j15P2k05K86L57m80J69o9J43
3595I9j13K5j47Q6j35K09j06N5J99k02k57K20J53K1J20j91j23p8Q3K39l04K32
3617H5p5K17j14k29K42j37j5mM1o7J40k3r2N4Q2k41j03J97J79M5J7L1K21m50k03
3642b02O4K76OO7k06j91M6M9p8R9J61m0r5K65m28L63k48j59K57k94L73j12o1J40
3666E2j1j82L03j83J76o1J45j94M1k31J83k2j20J44k15L45o17L66j29J03O4k09
$$ plain form
3688 -252 -8 284 -6 151 132 -228 -23 -209 -36 135 -225 159 -109 -203 -260 139 -129 248 -180 -155 -125 -126
3710 -126 236 -57 -300 -57 390 -134 78 -95 -14 65 -268 -91 -387 153 -39 -9 -9 -20 68 186 -210 -260 -241
3733 -241 -255 222 133 -55 15 24 178 -60 84 -34 -212 96 -70 -229 -222 366 -192 -425 187 49 -164 68
3755 68 -82 -359 192 -17 -99 -154 46 284 -236 -303 97 -310 53 155 -155 -268 -44 -49 77 39 56 0 -51
3778 -51 42 -243 354 168 62 0 254 -6 -39 117 -86 -225 130 -48 107 358 -120 -46 -63 -210 19 29
3800 29 347 -30 -159 63 102 -132 29 274 37 -188 10 55 -52 -46 260 -158 -117 -123 141 275 -131 46 98
3823 98 223 206 71 -298 -105 -81 189 -111 74 83 112 184 121 96 109 -30 -272 30 255 275 297 -7 -244 162
3847 162 -151 278 -258 58 193 -63 69 -117 9 155 -106 -147 14 -134 88 77 -71 0 -167 -22 -189
$$ packed form
3688b52K44K92k90J57j9l60K05j86J73J71l60L84k68r4n7L99k68L77m28K5L0j
3710a26L62k93k43K43M47n24K12j73Q1P9l33J77k96N40j92L0%j1Q8J18l96n0J9
3733b41j4M77q9j88P0RJ54k38J44j18j78L08j66j59PN88n58k33O12j38k13K32
3755F8j50k77N51k09q2n5K00K38n20o7M00m07L63J02l10j13K24nJ26l8J7n6n1
3778e1R3k85N97j86j06o2K54k60l3J56k03j39L55j78J55K51m78P4j7j47K29J0
3800B9L18l77j29K22L9k34J61K45k37k25J98M5j07OL06m18M1oK64J34m06J77N2
3823I8J25j7j35l69J93K4K70l00J85RK9P2o3k5J3j39k42L02K25K0K2l04k37M06
3847A62l13M29n36L16J35k56J32j86J26J46k61m1J61j48K22j1j48P1j67J45j67
$$ plain form
3868 -189 37 -123 119 -34 -101 15 -195 146 -215 -257 -186 124 57 -167 -57 -2 -44 -249 108 -107 42 -9
3890 -9 128 91 -20 103 265 83 36 195 -180 267 29 -107 79 -252 218 34 -46 236 216 192 40 -32 31
3913 31 -125 -145 164 -219 -152 75 162 -101 -177 -225 107 126 -453 -185 -56 108 48 -208 -225 -26 -137 -159 -48
3936 -48 270 78 -129 -272 -71 213 16 -47 -28 369 68 -224 -23 -148 53 47 182 64 80 30 -207 -21
3958 -21 43 -71 -295 -22 192 93 -248 -329 -454 -86 -21 -36 304 26 -90 -128 -358 -42 -108 176 83 89 264 80
3982 80 -110 -214 421 111 -221 -80 -5 -176 127 -59 16 166 -184 -22 -52 -150 155 -198 -74 156 32 54
4004 54 101 81 -55 174 92 -97 46 -22 -14 193 113 -198 81 92 -159 -80 59 53 24 -99 -13 -82 274 -126 38
4029 38 242 -249 172 -32 -110 132 -104 -54 109 -84 138 -53 45 -69 -241 108 -38 241 -58 -131 -176 222
$$ packed form
3868a89K26j60K42j53o7J16k10L41l61m2P1L10o7k24J10N5m2k05L57k15J49n1
3890iJ37l7j11J23J62j82m7J59l75M47k38j36J86l31M70j84q0K82k0k4j52p2O3
3913C1j56k0L09l83O7K27Q7k63p6m8L32J9n79K68J29J64o0k56j7J99j11k2J11
3936d8L18j92k07j43K01K84j97o3J9L97l01k92K01j25K01oJ35j18J6n0k37J86
3958b1O4j14k24K73K14r9l41q1j25L68O5j5L40k78j16l8k30L16o6K84r3OJ75j84
3982H0j90j04O35l10l32J41P5j71L03j86P5J50l50J62l0r8L05l53J24K30j24K2
4004E4M7k0j36K29q2j89J43o8QK07q0l11K79J1k51P9J39ok9j23Q6o9L56m00J64
4029C8K04m91M21k04p8K42k36N0J63j93K22j91R8j14j72L49j46K79k99p3m5L98
$$ plain form
4051 222 -82 -247 -152 22 -45 54 166 275 -106 -100 93 -91 64 126 93 103 99 -180 -28 -59 -97 -1 286 -94
4075 -94 -117 -82 151 209 -4 192 16 167 -91 33 77 106 142 155 -47 93 164 -316 -243 -193 -179 -182 -115 -40 183
4100 183 -80 35 -52 84 27 313 -47 -150 56 293 175 -274 -3 133 -28 -178 -21 92 137 -36 12
4121 12 149 -394 66 37 36 -4 259 66 50 98 60 -187 101 143 -165 35 -3 -46 271 162 174 254 -134 -193 243
4146 243 165 15 -86 36 -56 -116 57 -53 26 -231 26 -122 -239 -49 -86 -63 -178 -11 198 -142 48 43 144
4169 144 -66 78 -85 -122 -255 106 26 -270 -123 143 -166 94 66 96 49 -27 135 -286 -58 265 -49 167
4191 167 -130 207 -32 -154 25 -8 92 -121 377 62 292 145 106 -96 82 156 62 -103 -112 5 -17 -146
4213 -146 111 -54 215 310 179 294 -60 151 264 50 -238 -218 148 -305 -321 217 175 -200 -89 -52 -61 246
$$ packed form
4051B22l04j65R5J74o7R9J12J09l81OJ93j84J55O2l3J0mk79J52l1l8R6K87l80
4075i4k3L5K33N8k13J96j76J51k58J24M4K9L6J3k02J40P1m80P3N0J4lO7P5K23
4100A83k63J15q7J36n7K86l60j03K06K37j18m49K71J36j61j50J57J13M5j73M8
4121A2J37n43M60k9jm0K63j93j6M8l8k47K88M2l08K00l8m3L17j09J2Q0l88n9M36
4146B43p8j50j01J22r2o0J73j10P9k57K57j48j17J90l7K3j15J67K09l40J90nJ01
4169A44k10J44j63l7j33L61q0k96J47K66l09K60k8L0m7p6J62m21K28L23l14K16
4191A67k97L37k39j22J79l3J00k13M98l15K30j47l9k02J78P4r4j65rJ17k2j29
4213a46K57j65K69R5j31J15l54K11J13k14k88K0L66m53j6N38m2l75J11L7rL07
$$ plain form
4235 246 -157 138 266 251 261 -192 35 -295 78 60 -226 -22 260 -3 444 -73 -23 339 -184 93 90 47
4257 47 -194 384 7 152 161 -65 -40 228 182 276 -72 314 113 37 -81 27 -101 39 -115 -94 84 184 12
4280 12 197 -139 -95 173 -272 -37 -75 -303 301 -356 241 49 136 -100 120 -33 -299 134 328 39 75 -9
4302 -9 317 -2 349 84 -114 -144 55 -250 233 -246 40 267 -27 131 -129 154 -64 91 447 117 59
4323 59 150 38 -89 -225 71 90 -108 -1 279 -148 121 -3 -202 -87 -209 13 166 82 67 -125 157 116
4345 116 140 178 66 -84 27 -60 -156 -52 -60 193 29 -139 126 344 -43 182 -97 117 -78 -7 -171 -6
4367 -6 17 -104 -306 -119 27 28 -119 -131 -331 -76 -194 -247 -230 138 39 -42 -105 300 -219 81 -21 -217 -86 -55
4391 -55 87 -18 0 358 56 -131 -18 98 70 52 -67 -184 161 135 89 120 -88 60 -149 -121 -125 -88 109 -95
$$ packed form
4235B46m03K95J28j5J0m53K27l30L73j8k86K04K82k63M47n17N0L62n23K77lm3
4257D7k41N78l77J45Rk26K5K68m6R4l48L86k01p6j18J08j28J40j54K1J78J00j72
4280A2J85l36M4K68m45K35l8k28O04o57N97j92Q7k36K20j53k66M33J94k89L6q4
4302iL26l19L51k65j98l0J99l05M83m79K86K27k94J58k60K83k18J55L56l30n8
4323E9R1j12j27j36K96J9j98J07K80m27K69j24j99J15j22K22J53q4j5j92K82m1
4345A16K4L8j12j50J11q7r6J04qK53j64j68K65K18l87K25k79K14j95P1j64J65
4367fK3j21k02J87J46Jj47j2k00K55j18n3J7L68r9q1o3M05n19L00j02j96J31L1
4391e5J42j05J8L58l02j87J13J16k8j8j19j17L45k6m6L1k08J48k09K8mL7J97k04
$$ plain form
4415 -95 -328 -163 -200 -116 152 -171 11 283 -123 -95 81 -155 -19 -279 -58 -168 -29 172 117 371 -75 201
4437 201 -90 4 -127 -176 -47 30 18 -8 -123 -25 99 81 10 99 69 -2 -103 -99 263 219 55 -151 -91 332 97
4462 97 353 236 -65 70 -65 163 -34 -29 281 -174 190 -220 -110 -199 -75 113 292 228 244 -8 165 55
4484 55 361 -106 3 181 -115 163 80 50 190 106 -95 -155 282 -3 107 -226 34 -198 -193 -115 -282 0 261
4507 261 85 -189 -252 59 -150 -12 -3 -16 -1 53 174 -39 56 -56 93 265 140 151 -143 23 -205 3 219
4530 219 -38 125 -141 147 0 -49 -11 -157 88 -3 21 94 177 89 78 -52 231 31 151 -111 -86 233 -30
4553 -30 169 139 35 -99 176 -65 79 22 -35 54 -57 182 77 145 278 378 181 282 26 158 -1 175
4575 175 87 -221 21 -125 138 65 3 134 117 126 209 38 106 -133 123 -137 55 121 30 172 -162 -335 26
$$ packed form
4415i5k33J65l7Q4K68l23J82K72m06K8J76k36J36k60K21j10J39K01n5K54m46K76
4437B01k91R4j31m9J29P7j2k6j15R8J24j8p1Q9l0p1j01ML62m4j64k06O0M23k35
4462I7K56j17l01J35j35K28j97NL10m55L64m10J10q9J24J88J79o4J6k52J73j10
4484E5L06m67J09J78k96K78q3l0J40q4k01o0M37k85J10l33K60k32NP8j67K82K61
4507B61j76k74o3L11k09J38Rj3J5N4J21k13R5j12J49J72j25J1k94J66k28K08K16
4530B19k57J63k66K88j47m9L8j46K45r1K4P3Q3q8j1j30K83k00J20k62K5L19k63
4553c0J99l0j04j34K75k41J44n7n7Q9j11K39j05O8J33J00j97J01k56J32j59J76
4575A75q8l08K42j46K63p3o2J31j7RQ3j71O8k39K56k60J92O6r1J42l34j73L61
$$ plain form
4598 26 -100 -72 213 221 47 -234 3 255 50 -60 -20 67 -151 29 77 -81 40 188 153 45 -41 -163 21
4621 21 -29 -158 -104 -70 12 75 14 -90 7 204 81 194 107 12 52 109 173 194 -35 -8 165 -150 -68 -145 -164 -9
4647 -9 -52 -112 -216 -25 -151 193 -149 -221 228 126 -142 140 -27 100 28 -95 31 -250 -156 -10 215 -33
4669 -33 242 244 243 -95 34 84 -116 -179 122 146 -79 -183 -87 80 106 91 -88 78 207 33 -192 -147 -15 63
4693 63 -94 145 233 -28 -178 24 -407 -141 212 -178 13 -48 135 -230 -238 103 205 72 -145 -212 270 188
4715 188 -276 -144 67 -59 184 55 -130 360 -250 191 -86 178 -142 127 164 73 100 -223 -90 -54 -290
4736 -290 123 -217 -11 176 -15 -82 172 67 163 16 -468 152 122 76 -57 -142 -73 307 -114 -112 134 119 362
4759 362 -496 -160 193 55 467 -140 288 276 204 0 203 86 112 -178 148 -151 -342 -191 -137 -71 -76 -26 298
$$ packed form
4598B6j26K8K85Qj74k81K37K52k05j10M0Q7k18J80M8j58J21J48l5j08q6j22J84
4621B1n0j29N4L4Q2O3o1j04R7J97j23J13q7r5M0N7O4K1k29K7J73l15Q2p7j9J55
4647im3o0j04J91j26L44l42p2M49j02k68K82j67J27p2j23J26k81R4J46K25k48
4669c3K75Kjl38J29N0k00o3L01K4k25j04R6J67K6j5j79J66J29j74k25M5J32P8
4693F3j57K39Q8k61j50K02m31K66L53l90J91o1J83l65qL41J02j33k17o7M82q2
4715A88m64J32K11j26K43j29j85M90o10M41k77K64l20K69L7r1K7l23J33L6k36
4736b90M13l40K06J87j91o7K54j05R6j47m84O20l0m6j33q5O9L80m21KK46j5K43
4759C62q58L36L53j38M12o07M28j2p2k04K03j17K6k90L26k99j91J51N4O6nN0L24
$$ plain form
4782 298 183 134 -99 -189 379 138 -187 52 -244 8 -120 -1 86 149 -109 -7 124 -167 194 7 31 155
4804 155 -215 -10 328 -56 -111 -102 -107 -297 75 -103 -53 -131 -308 -123 28 -37 -80 -36 -289 197 -460 -200 334
4827 334 -48 -29 -228 134 85 6 -12 -111 330 233 245 -128 217 -77 45 193 214 -203 -44 78 182 65 -38
4850 -38 76 -54 93 62 15 -92 125 -52 82 14 11 265 -108 -33 8 122 100 -184 -20 -116 -7 70 89 -129
4874 -129 202 74 210 -28 255 -100 -103 -40 16 -41 241 -224 92 83 235 96 -154 -128 141 121 -224 -12 -3 -2
4898 -2 -29 -59 266 115 -134 59 -78 -273 -59 -119 -144 161 156 20 92 -24 312 -63 -146 124 -22 109 -82
4921 -82 -106 75 30 30 -43 -43 -133 -141 53 -47 97 -165 -130 130 243 -19 23 104 -28 -72 91 -307 258 -31 36
4946 36 -256 313 -124 -83 105 -58 -107 -33 44 -132 -89 -188 -122 80 377 -148 -95 131 -257 -169 132 69 -119 -88
$$ packed form
4782B98j15m9k33r0N68k41l25K39k96K52j28J19Q7O3k58J02J31k91L61j87K4J24
4804A55l70K05L38l84n5Rnj90L72j78N0p8j77J85J51o5m3M4k53M86o57K60N34
4827C34l82J9j99L62m9p9j8r9M41r7J2l73L45k94J22J48K1m17J59J22J04j17j03
4850c8J14j30J47l1m7j07K17j77J34o8lK54l73P5M1J14k2k84J64r6J09P7J9k18
4874a29L31j28J36k38K83l55lO3N6n7K82m65L16rJ52j39k50K6K69k0l45K12RJ
4898bk7l0L25j51k49J93j37j95K14o0k5L05nj36P2j16L36l75q3K70j46J31j91
4921h2k4J81m5%p3%r0qJ94j00J44k62L5K60J13k62M2Q1j32m4J63l98N65k89O7
4946C6k92N69m37M1J88j63m9P4P7j76M3r9O6K02K97n25N3K26l88Q8L01o3j88L1
$$ plain form
4970 -88 -51 30 -33 -152 -237 26 199 20 -69 128 225 97 -199 -118 103 194 -112 -1 280 -388 -317 -192 -188 128
4994 128 -158 195 -117 91 191 -224 -280 62 -95 38 83 -20 -48 -152 -320 376 138 -282 -36 70 104
5015 104 -335 159 -125 -129 -104 17 -42 222 2 140 10 -14 -56 -14 -127 82 82 24 103 -330 6 27 -100 -40
5039 -40 25 -136 -13 -34 -233 -210 -186 -31 -177 102 -379 199 -188 -35 67 -177 325 20 179 258 -142 -301
5061 -301 -38 95 132 -15 52 166 -188 165 -58 643 81 73 -151 -175 -170 -64 -112 389 -2 193 -31 73 107
5084 107 8 113 97 -17 83 116 -9 -140 -354 63 77 -44 185 -235 -260 22 77 152 103 151 95 45 -115 213
5108 213 63 57 186 -135 196 166 71 -119 -437 42 -227 58 -203 -6 -230 -86 128 -108 -104 -65 -182 -163 -44
5131 -44 50 28 -105 -23 156 277 33 117 167 -86 -19 7 97 -152 -231 -109 14 -38 -195 73 -185 -3 -122 -39
$$ packed form
4970h8L7Q1o3j19q5K63J73j79q9J97R7j28k96Q1K21R1l06J11K81o68P1J25ML16
4994A28k86L53l12K08J00m15n6L42j57J33M5j03k8j04j68O96k38m20K46J06L4
5015A04m39M94k84mK5J21n9K64k20J38j30k4m2M2j13K09%n8P9m33L36K1j27O0
5039d0O5j61J23k1j99K3K4J55j46K79m81N78l87J53J02k44N02l05J59P9m00j59
5061c01K63J33L7j47O7J14l54L53k23P01n62qk24k4NJ06m8N01l91J95k24J04L4
5084A07r9J05j6j14J00L3j25j31k14M17J4j21K29m20k5K82N5P5m9M8n6n0j60L28
5108B13j50oJ29l21L31l0r5j90l18M79k69K85k61J97k24J44K14k36ML9j17J9J19
5131d4R4k2j33Q2J79J21k44Q4N0k53O7K6R0k49p9J22J23n2j57K68k58J82j19Q3
$$ plain form
5155 -39 167 172 106 32 141 -93 -28 -128 -32 27 26 12 33 210 -90 -73 97 238 168 -33 -271 43 82 190 -191
5180 -191 -242 -8 28 -278 -84 250 -3 -27 181 -48 25 63 85 42 225 147 -119 249 -32 -180 35 60 117
5203 117 -5 254 57 85 49 1 -149 41 -59 289 209 -254 287 -7 -63 -228 -117 48 -64 -68 57 -166
5225 -166 30 -53 -173 74 -228 -2 256 -129 -148 -396 -228 -260 55 -73 141 -6 246 -240 305 5 -117
5246 -117 -44 -223 333 10 -145 107 268 -184 -6 -294 127 25 166 -71 69 312 -145 62 -138 76
5266 76 -96 137 59 78 -179 11 96 -2 -17 -78 181 37 193 329 -118 -199 -19 57 56 -109 -173 222 -69 -81
5290 -81 127 59 189 116 -64 48 -395 123 104 117 -389 -86 -27 285 117 234 197 36 -243 -6 -214 -154 99
5313 99 86 -140 39 -67 -213 -108 111 7 32 197 -73 18 201 -23 -254 50 113 -38 257 -21 38 -88
$$ packed form
5155c9K06No6p4J09k34O5j00R6N9jj4K1J77l00J7J70J41p0k01k38L14L9J08l81
5180a91n1K34L6l06J94L34k53k4K08k29P3L8K2m3J83p8k66L68k81j48K15K5N7
5203A17j22K59j97K8l6m8j50J90j00L48q0m63N41k94n6j65J11J65j12mJ25k23
5225a66J96q3j20K47l02K26K58l85j9k48J68l2L15j28K14j47K52m86N45l00j22
5246a17P3j79N56l23j55K52J61m52J78k88M21j02J41k37J40K43m57K07k00K14
5266G6j72K33p8J9k57J90Q5r8j5o1K59j44J56J36m47q1J80P6jj65o4L95k91j2
5290h1K08o8J30p3j80J12m43N18j9J3n06L03N9L12j68J17l7j61k79K37k08O0K53
5313I9j3k26J79j06j46J05K19j04K5J65k70R1J83k24k31L04O3j51K95k78N9j26
$$ plain form
5335 -88 217 64 283 153 -174 33 -157 260 -239 56 -179 -81 -131 -131 -301 -83 -221 -88 -192 -299 -139 -7
5357 -7 -43 -12 -20 -190 78 -121 153 115 -58 56 -300 13 128 -280 -47 63 122 151 177 54 346 -41 -58 35
5381 35 64 -50 100 -260 -430 3 13 112 22 -128 -78 64 -4 -192 31 -79 220 250 113 272 279 17 -107
5404 -107 -188 29 -60 -92 118 4 -12 -10 89 -143 82 -59 -144 41 161 -140 -177 -17 -26 -212 -142 -58 -71 214 -44
5429 -44 -9 39 147 128 -74 -134 -247 225 -49 70 -52 9 -63 131 -5 7 45 -110 -133 -28 30 157 -337 20
5453 20 -122 17 -396 -213 -182 -145 1 -65 53 30 -337 174 161 141 -91 -54 14 -184 -118 133 108 -34 40 -74
5477 -74 388 162 -33 43 -400 -193 -22 127 23 146 2 -10 5 -208 1 212 -36 -57 276 -345 338 5
5499 5 -107 -242 -186 -90 -72 29 -8 16 47 -373 -14 66 175 168 -107 -224 201 -199 -162 -100 141 22 -65 75 -146
$$ packed form
5335h8L05j53K19j30l27K07j90M17m99K95k35R8n0%j70K18j38J33j04j07J60J32
5357gl6L1qj70K68j99K74l8j73J14l56L13J15m08K33J10N9K9K6j23K92l87j7R3
5381C5K9j14J50l60j70M33J0R9r0j50N0J42o8j88K23j10K99L0j37J59Pk62j24
5404a07q1K17q9l2K10j14j6KR9k32K25j41q5J85J20l01l7J60rj86P0Q4j3K85k58
5429d4L5M8J08j9k02o0j13M72k74J19j22O1p2J94j36J2L8j55k3J05N8J27m94L57
5453B0j42J39m13J83L1L7J46o6J18k3l67N11j3k0k32L7O8j98O6K51k5j42P4j14
5477g4M62k26j95P6m43K07J71J49j04J23j44j2J5k13K09K11k48k1L33o21O83l33
5499Ej12j35N6R6J8J01l7K4L1m20L59Q0J09pk75j17M25m00L7O2K41j19q7J40k21
$$ plain form
5524 -146 -280 70 -15 160 -86 56 77 264 337 70 -104 72 33 198 318 -455 52 -16 324 164 -101 -36
5546 -36 120 149 12 20 -110 108 -198 -150 260 -227 43 84 -340 102 142 51 -18 53 -78 121 44 -193 136 158
5570 158 209 164 -34 -388 77 137 -70 -95 189 411 -82 123 -90 -74 -68 -252 -90 25 -340 -111 297 -46
5592 -46 99 -117 227 280 290 90 -112 318 -5 -92 -77 -92 79 -280 2 43 -205 202 -205 51 -48 233 -413
5615 -413 133 -8 225 -17 -57 0 -45 145 -119 -203 307 161 -73 83 -126 -490 -42 129 12 12 -286 428
5637 428 5 202 134 -198 143 -184 94 -132 -224 240 37 192 -35 11 25 -192 -27 6 -9 97 -83 -32
5659 -32 36 48 -77 139 170 124 -217 -7 -19 -336 56 -20 7 89 -54 126 -57 467 -76 181 -107 118 -14
5682 -14 0 89 -150 -282 103 -52 -132 83 -59 73 -100 -25 121 -135 34 -267 -260 59 -70 278 266 -99 264
$$ packed form
5524a46j34L50q5J75k46J42K1J87P3k67j74J76l9J65J20p73N07o8L40j60k65O5
5546c6J56K9j37Qj30K18l06M8M10m87K70M1m24M42M0r1o9P1j31J99p7k37L29K2
5570A58N1m5j98l54M65O0k07k5K84K22m93K05k13J6Oj84J62J15l65K29M08l43
5592d6J45k16L44N3J0k00k02M30l23q7J5j5J71l59K82M1k48M07m07K56r9K81o46
5615d13N46j41K33k42m0N7m5J90k64q4N10j46k34J56k09l64M48J71j17%k98P14
5637D28m23J97o8l32L41l27K78k26r2M64k03J55k27M6J4k17J65L3j5J06j80N1
5659c2O8J2j25K16L1m6l41K10j2l17L92p6K7Q2j43J80j83N24n43K57k88K25j32
5682a4J4Q9k39j32L85j55q0K15j42J32j73P5J46k56J69l01PL19j29L48j2l65L63
$$ plain form
5705 264 -24 -403 107 204 177 -110 -144 99 -38 25 96 -157 32 91 45 -293 154 -221 64 -116 146 11
5727 11 156 144 -76 -130 154 37 -101 543 36 -228 -334 -148 206 212 130 166 -10 340 -48 -12 58 54 -157 -133
5751 -133 -235 -69 195 -76 61 98 -237 -193 -398 20 138 259 -65 -226 -172 -153 25 -9 28 120 -225 177
5773 177 -93 22 200 -41 233 -146 -66 -188 258 -144 -156 347 -15 166 -20 -237 -137 260 -101 199 -3
5794 -3 188 -120 66 105 -25 -158 -427 46 -55 -60 -59 -23 -9 47 -1 192 282 0 27 -29 -34 45 155 221 249 397
5820 397 -195 -354 162 58 -444 -85 -83 -62 -236 118 232 -155 -151 -103 -18 -169 -243 -32 -228 207 -45 45 -39
5843 -39 -126 74 -181 104 -12 253 -132 207 61 -20 192 -21 15 61 65 93 -117 -25 -52 66 -17 55 -123 -169
5867 -169 43 99 34 -38 -169 -106 -315 5 -85 -340 -95 115 -11 146 -30 -69 78 -15 -73 35 -73 95 126
$$ packed form
5705B64k88l79N10R7k7k87l4K43j37O3P1k53J89N9m6l38M47l75K85j80K62j35
5727A1J45j2k20n4K84j17j38O44n07k64j06J86L54Oq2L6j76L50l88L6P0mk11K4
5751a33j02J66K64k71J37L7l35M4k05M18J18J21l24j61N4J9J78l4L7R2l45M02
5773A77k70J15J78k41K74l79Q0j22M46m02j2N03l62J81j86k17J00L97l61L00k02
5794cJ91l08J86L9j30j33k69M73j01nJL6J4N6m8J93R0k82K7n6nP9J10O6K8J48
5820C97n92j59N16j04n02L59KK1j74L54J14l87MM8Q5j51p4K11j96M35k52R0q4
5843c9q7K00k55K85j16K65l85L39j46q1K12k13L6M6MK8k10R2k7J18q3P2j78m6
5867a69K12N6o5p2j31O3k09L20r0k55K45K10j26J57j76l9J47r3n8J08j08J68L1
$$ plain form
5890 126 320 74 -30 125 195 -45 -127 220 -95 93 125 185 -23 -14 93 61 151 73 139 -192 -57 -214 -137 -8
5914 -8 -36 -100 -202 -11 -37 -20 95 -75 307 289 39 122 18 267 -28 -55 -94 63 -43 90 67 -23 -134 95
5938 95 -101 -164 25 198 -70 67 40 13 165 -255 141 -404 -307 -152 -188 -16 -43 151 150 137 91 -106 308 -268
5962 -268 -404 148 150 -26 170 -200 142 62 -136 -189 -94 -273 -32 -207 108 221 -280 -156 124 117 225 -101
5984 -101 -150 249 128 -5 -7 -45 34 -276 -377 68 229 -308 -214 -100 35 266 -140 342 -218 149 54 62 147
6007 147 369 5 -97 286 47 -245 37 -131 -245 -99 -257 -134 -150 -51 146 223 -6 70 -10 -46 26 95 126
6030 126 242 -73 53 75 8 -99 153 -4 217 -220 -15 43 -155 70 -41 81 -178 -92 -67 -233 302 256
6052 256 -56 -275 -136 194 132 193 61 -427 281 87 -124 51 297 -316 -52 -127 -313 61 -96 0 -110
$$ packed form
5890A26J94k46j04J55P0k40q2L47l15J88L2O0k08RJ07l2R0p8O6l31J35j57P7J29
5914hk8o4j02J91k6J7J15j70L82j8k50Q3j04K49k95k7l9J57j06J33k3r0j11K29
5938I5j96o3J89J73k68J37k7k7J52m20L96n45R7J55l6J72k7J94jj3m6j97M14n76
5962b68j36N52Kj76J96l70L42q0j98n3R5j79K41j75L15J13n01J24K80pJ08l26
5984a01m9L99j21j33kl8P9l10j01M45J61n37R4J14J35K31m06M82n60L67r5QQ5
6007A47K22l64j02L83k39k92K82j68j14J46j58J23j6R9J97P7k29P6q0l6P2O9L1
6030A26J16l15J26K2o7j07K52j57K21m37K05N8j98K25j11J22k59Q6K5j66N35m6
6052B56l12k19J39L30o2O1j32m88P08j94k11J75K46o13K64p5j86L74j57R6j10
$$ plain form
6073 -110 181 -111 14 -151 317 -185 -197 -79 108 232 -133 153 222 67 -88 -271 39 -222 -179 159 110
6094 110 -64 -76 -8 82 89 -194 -117 195 396 -135 133 -44 -55 -31 215 -332 -138 190 -191 16 -290 202 215
6117 215 92 5 418 87 -28 73 68 -128 -44 14 -291 -154 -115 10 66 277 68 82 266 104 -228 -5 -294
6140 -294 111 -80 5 -166 -233 -1 233 228 47 29 190 -125 45 -31 -73 -394 155 100 -27 12 -138 96 -108
6163 -108 -137 181 -11 -5 59 4 155 -260 136 17 -91 220 41 57 209 145 141 -108 -8 -66 14 266 50 -6
6187 -6 -47 27 -118 31 106 175 -46 54 -287 37 348 191 -53 197 75 -326 -61 -14 -278 -17 67 -51 -41
6210 -41 49 94 50 -24 -156 -7 165 229 -9 -44 -129 -264 80 101 172 -66 49 -131 -306 -170 -60 191 -120
6233 -120 -91 45 -84 -84 28 -40 -60 -292 126 -25 -137 50 -252 -174 -98 -179 141 264 250 -38 158 -271 -43
$$ packed form
6073a10K91k92J25j65M68n02j2J18J87J24l65K86O9j55j55j83L10k61M3L38m9
6094A10j74j2O8R0Pk83P7L12K01n31K68j77j1K4K46n47J94L28l81K07l06M92J3
6117B15j23q7M13l31j15J01nj96Q4N8l05J37L9J25N6K11k09J4J84j62l32K23k89
6140b94M05j91Q5j71o7K32K34nj81j8J61l15J70p6m2l21N49n5j27L9j50K34k04
6163a08k9L18j92OO4n5J51m15L96j19j08L11j79J6J52o4mk49J00n8Q0K52k16n6
6187fm1P4j45J49P5O9k21J00l41L24L11j57k44K50j22m01K65M7k64K61Q4j18J0
6210d1R0M5m4p4j32J49J72O4k38l5q5j35L44K1P1k38J15j80j75J36J10K51l11
6233a20K9J36j29%J12o8k0k32M18j51j12J87l02P8P6q1L20J23j4k88J96m29K28
$$ plain form
6256 -43 -229 -14 -33 -217 -320 102 113 -33 263 -23 -8 -17 -69 99 128 -36 36 -229 3 43 -238 148 -71
6279 -71 -123 66 141 89 -21 167 -162 180 4 298 -88 102 -82 153 -263 22 -140 -280 -16 85 -138
6300 -138 -85 -181 95 65 -61 -248 108 209 -227 -142 40 -78 35 -353 68 251 223 -162 242 -104 125 242
6322 242 -141 -262 203 -55 -82 129 200 232 -172 252 -12 364 -145 -51 5 6 -224 276 100 291 28 -163
6344 -163 54 -26 10 313 -128 40 -47 -129 124 -135 -91 12 -135 -231 46 107 20 -322 134 -44 108 203 141
6367 141 60 3 16 136 -156 -89 -72 -65 -336 319 -93 -46 -43 -60 266 213 -79 -34 -351 174 -236 -113 -71 -176 -329
6392 -329 -146 -122 -106 -78 89 31 87 92 71 -185 55 -115 -48 -235 -332 169 -28 -34 -472 -15 262 -57 -285 -226
6416 -226 -62 243 -192 73 -31 373 -5 -80 202 145 33 125 -22 26 53 -60 -83 -78 170 -143 173 34 173
$$ packed form
6256d3j86K15j9j84j03M22J1j46K96k86J5rn2J68K9j64P2k65K32M0k81L86k19
6279g1n2J89P5n2j10J88l29L42j76K94l86J90j84K35m16K85j62j40K64J01k23
6300a38N3r6K76l0j26j87L56J01m36Q5J82j18J13l88M21J83k8l85M04l46K29J17
6322B42l83j21M65k58k7K11P1L2m04M24k64L76n09R4N6Jk30N00j76J91k63j91
6344a63K17q0L6L03m41J68q7q2K53k59M4J03j47r6K77O1q7l42M56j78J52R5o2
6367A41q1n7J3J20k92O7J7Pk71O55m12M7Lj7L26n3k92M5l17N25m10J23M2j05j53
6392c29J83K4J6K8J67n8N6Nk1k56K40j70O7j87r7N01j97om38M57K77l19k28N9
6416b26J64L05m35K65j04M04l78p5K82n7j12R2j47M8K7j13k3NK48l13L16j39J39
$$ plain form
6439 173 182 109 33 -35 102 79 -258 -52 -216 87 -244 27 31 -40 144 263 4 35 138 72 -205 21 -262 18
6463 18 -145 15 22 -153 137 322 202 -9 -100 -42 -79 -254 98 -92 295 195 175 -99 -65 -79 -144 -164 124 94
6487 94 60 -78 24 -416 5 -111 93 92 107 361 -64 -330 -220 -118 -22 -17 0 335 -83 -116 36 -177 -82 -37
6511 -37 69 -121 208 68 -58 -12 -118 20 198 90 97 293 91 -68 -52 -241 37 -140 39 195 178 -80
6533 -80 81 97 -134 25 97 -279 -92 318 80 209 246 28 223 -253 -168 12 -17 63 -90 -42 -89 -205 -4
6556 -4 22 -97 -48 -19 205 139 -34 125 -64 -178 186 23 -20 -161 43 -14 233 -103 -108 41 158 -99 -349
6579 -349 53 125 299 53 92 181 -23 143 -48 30 60 -299 116 59 -266 -187 -170 6 138 278 21 -172 320
6602 320 93 161 72 -20 71 289 149 -209 -29 245 75 -40 28 -111 -169 24 19 -101 -81 -82 -172 96 -239 30
$$ packed form
6439A73Rp3p6o8J37k3l37K06j64L03l31K71Mp1J84J19k59L1J03o6k77K26k83K80
6463A8j63J60Pj75K90J85j20k11r1N8l7j75L52j90L87j00k0k74L4j4o5k0K88l0
6487I4l4j38J02m40M21j16K04jJ5K54m25k66J10J02R6NJ7L35m18l3J52k13R5M5
6511c7J06j90L29j40j26M6j06J38J78j08PJ96k02j59J6j89K78j77J79J56j7k58
6533h0J61J6k31J59P2l76J87M10k38J29L7k18J95m76Q5J80k9Q0j53M8m7j16K01
6556dK6j19M9K9K24o6j73J59j89j14L64j63m3j41K04n7K47l36nJ49J17k57k50
6579c49M02P2J74k46L9Q9k04J66j91P8L0l59M15n7l25P9J7J76J32J40k57j93M92
6602C20k27O8q9r2R1K18j40l58J80K74j70j15O8j39n8J93nj20K0jr0K68l35K69
$$ plain form
6626 30 200 -158 -153 -14 -167 27 28 29 -181 -150 -96 -37 164 179 -43 -33 192 45 -158 233 -105 153 184 -58
6650 -58 199 38 10 14 81 -63 -52 53 -193 -587 -154 33 -40 -161 -406 176 252 -15 32 224 -198 -58 -198
6673 -198 -141 457 -70 -65 -12 -24 24 26 -24 122 70 -66 -76 171 16 -50 276 170 124 -48 105 5 -72 137 302
6698 302 131 -116 5 -177 -343 285 23 10 -6 -3 105 76 -310 -39 20 235 36 -69 -29 -323 -285 50 -250
6721 -250 44 43 -162 -28 120 131 69 320 -114 161 -27 125 90 -77 300 112 -106 41 241 121 -169 54
6743 54 -198 -86 220 47 235 146 -122 -61 -162 148 18 -262 -32 166 151 -143 112 -50 9 -119 119 149
6765 149 -96 250 133 -116 -38 -75 103 148 162 -179 179 -79 -86 -2 -128 87 122 288 -240 122 13 -129 119
6788 119 82 140 168 -45 -97 190 -190 -90 179 7 42 -189 128 15 -86 82 -24 129 59 -8 -267 -172 -189
$$ packed form
6626C0J70l58NJ39j53J94JJk10L1N4N9K01J5k22J0K25j47k03L91l38K58L1k42
6650e8K57j61k8MO7j44J1J05k46l94M33J87p3j21k45N82P6k67M7J92m22J40j40
6673a98N7N98n27NN3j2M8Kn0J46n2j36j0K47j55o6L26j06m6j72J53j00p7K09J65
6698C02j71k47J21j82j66O28k62j3j6LJ08k9l86K71N9K15j99j05M0k94L8L35l00
6721b50K94jk05J34J48J1o2K51m34K75j88J52l5j67L77j88k18J47K00j20k90K23
6743E4k52J12L06j73J88q9k68O1j01L10j30k80K30J98j5k94K55j62N9j28K38L0
6765A49k45L46j17k49P8l7J78M5J4l41L58k58pQ4j26K15L5J66n28L62j09j42K48
6788A19l7N8K8k13n2K87l80J00K69j72L5k31L17j13j01J68j06J53p0o7k59R5j7
$$ plain form
6811 -189 -40 -6 114 -276 305 29 133 522 -194 -248 203 319 -66 -224 -170 -313 210 168 27 283 156
6832 156 -212 148 115 29 251 -62 -189 70 245 4 -156 60 -133 419 -132 -222 -51 -274 2 61 -155
6853 -155 -240 -149 280 -97 117 300 -272 -64 -92 -104 132 -44 -185 233 188 70 -168 78 57 239 120 -150
6875 -150 154 484 177 61 66 194 -114 -121 -151 117 -161 -186 4 -146 297 2 275 41 34 87 48 196 105 -205
6899 -205 -59 38 249 150 -29 237 93 -4 132 52 100 137 273 -7 -28 250 -77 34 -52 213 19 107 122
6922 122 140 -18 -114 94 123 14 -49 -128 179 -208 -132 59 7 -167 -34 70 59 337 94 -42 -65 -99 53
6945 53 -30 59 97 -131 78 -24 50 -99 113 -405 -125 -107 3 -28 -131 -12 93 1 67 124 75 -44 200 39
6969 39 -23 -194 116 -45 -106 352 -87 110 290 -61 -138 156 -217 128 -82 -4 212 -178 13 132 -33 -66
$$ packed form
6811a89J49L4J20l90N81k76J04L89p16n4M51J16l85j58N4j43N23m2j41K56j27
6832A56l68L60l3q6K22l13j27K59J75k41j60K16j93N52n51r0J71k23K76N9k16
6853a55q5R1M29l77K14J83n72K08k8j2K36j76j41M18m5j18k38K46k1J82j19k70
6875a50L04L30l07j16NJ28l08pl0K68k78k5J90j50M43k95K73k34pN3l9J48r1l10
6899b05J46R7K11r9j79K66j44r7J36q0M8L7J36k80k1K78l27J11q6K65j94Q8J5
6922A22J8j58r6K08K9j09o3p9L07l87P6J91n2j74J33J04j1K78k43j36k3l4J52
6945E3q3Q9L8k28K09j02P4j49K12n18K80J8J10l1j03J19J05r2O6N7m9j19K44j61
6969C9o2j71L10j61o1M58m39J97J80l51p7K94l73L45k10P8K16l90J91J19j65l3
$$ plain form
6991 -66 33 220 49 -198 118 13 166 83 -298 60 -97 -50 41 41 -305 166 -196 -74 191 -33 -158 69
7013 69 -150 130 -7 -137 -84 34 -111 41 -208 126 79 18 266 -85 -86 -83 158 -29 237 -66 -181 202 -203
7036 -203 -48 129 -441 -422 76 -117 203 -333 44 -94 79 3 178 160 118 19 -266 165 -12 -132 -169 48
7058 48 -178 47 66 118 -14 42 -199 -34 -41 62 27 96 -364 -140 -77 -199 -65 154 217 16 -267 -313 -116 103
7082 103 254 159 -103 74 -13 56 -92 -155 -5 145 -212 -274 -158 -31 8 229 208 -16 -111 -68 63 -85 -91 232
7106 232 -107 -224 -150 36 153 -285 -79 120 111 -73 348 63 -39 -174 -97 129 -181 178 -84 42 -17 141
7128 141 82 -39 -50 -178 56 -220 3 -365 169 80 90 0 -135 -110 -30 15 34 -7 -370 27 289 184 12
7151 12 253 -66 -97 -149 46 -130 -54 94 -4 -293 22 291 193 -143 51 -100 -104 -278 59 69 -257 115 -162
$$ packed form
6991f6R9J87j71k47L16j05J53q3l81L58j57M7R1%l46M71l62J22K65k24j25K27
7013F9k19K80j37j30N3J18j45J52k49L34m7o1K48l51jLK41j87K66l03j15L83m05
7036b03J55J77n70J9M98j93L20n36L77j38J73p6J75j8m2r9k85M31j77j20l7K17
7058D8k26K25J9N2j32N6k41J65pJ03l5O9m60K24O3j22J34K19O3k01k83m6J97K19
7082A03J51r5k62J77q7O9j48o3J50J50l57o2J16J27L9K21k1k24r5M3J31j48oL23
7106B32l39j17P4J86J17m38K06J99rj84M21k85j02j35P7K26l10L59k62J26n9J58
7128A41n9j21j1j28K34k76K23l68N34q9J0r0j35K5Q0M5J9m1l63L97K62j05j72
7151A2K41l19l1n2J95j76P6J48r8k89L15K69r8l36J94j51mj74L37J0l26L72k77
$$ plain form
7174 -162 103 -196 -35 100 212 -88 -72 -92 -45 158 -11 244 128 -68 83 -170 -124 -42 -89 -86 209 -223 91
7197 91 -234 -102 146 129 14 121 -467 149 -28 -7 -119 -131 52 -9 -162 -158 61 -73 -105 100 136 -88 49
7220 49 298 -189 -160 51 -141 96 -60 23 -31 71 -285 90 124 -61 -287 28 -206 -416 -25 298 235 125
7242 125 -62 -325 -319 -308 -11 302 -15 -58 -219 144 -318 -63 -105 94 -39 152 88 -25 112 153 243 -110 94
7265 94 -256 -19 -169 257 -158 161 -125 133 139 -103 243 -165 25 -109 48 -295 -190 -60 -31 -23 242 90
7287 90 -124 -129 -34 68 178 -100 -241 -153 -75 32 -339 76 -79 -39 26 -55 -63 52 -20 210 -19 181 -112 89
7311 89 358 -149 -13 47 79 -89 -163 -215 199 -154 -251 -153 60 212 100 10 -7 217 67 -188 -238 69 137 22
7335 22 -312 -33 187 -230 233 99 -102 84 -7 -273 198 183 275 189 220 -239 124 120 239 5 -68 137 207
$$ packed form
7174a62K65k99J61J35J12l00J6k0M7K03j69K55j16j96J51k53M6Q2m7LK95m32L14
7197I1l25J32K48j7j15J07n88O16j77K1j12j2J83o1j53MK19j34l2K05L6k24J37
7220D9K49m87K9K11j92K37j56Q3n4J02l56L75L4j85k26L15k34k10L91L23o3j10
7242A25j87k63OJ1K97L13l17m3j61L63m62K55m2J99j33J91o4j13J37M1R0l53K04
7265I4l50K37j50M26m15L19k86K58Ok42L46m08J90j34J57l43J05J30K9QK65j52
7287I0k14nR5J02J10k78j41Q8P8J07l71M15j55M0O5q1qJ15p2K30k29K00k93K01
7311H9K69n07J36O0L2j68p4n2M14l53r7R8K13J52j12r0j7K24j50k55n0L07O8j15
7335B2l34K79K20m17M63j34k01J86r1k66M71j5R2q6L1m59L63mJ19k34p3K05P0
$$ plain form
7358 207 -115 178 48 -199 76 -86 -106 -209 -62 -50 -232 104 262 -167 -168 -71 26 17 37 -32 96 121 193 94
7382 94 -68 39 0 -261 5 112 -297 -145 -60 -276 -111 166 -386 -64 352 -112 -1 100 -132 -174 -24
7403 -24 74 -20 3 -129 238 67 50 -222 133 -349 -336 203 -354 67 73 -62 -80 -4 114 -14 -383 -89 -231
7426 -231 7 -47 -17 -128 25 206 -73 9 18 63 223 37 -120 115 -200 7 -148 107 107 121 2 71 253
7449 253 202 153 393 339 81 246 -14 259 80 180 -212 -256 209 -126 34 -108 -85 20 297 -70 235 135
7471 135 133 -18 -141 25 -44 -220 -172 68 -19 -51 9 49 -48 -278 320 192 150 141 328 -117 186 146 382 -128
7495 -128 161 209 -260 102 -13 84 -66 183 88 -340 149 -209 -120 207 -14 26 132 151 157 -87 53 147 -195
7518 -195 -77 -50 131 -106 355 -33 15 -27 134 332 -206 -113 -203 5 39 112 -51 127 21 -13 181 11 40
$$ packed form
7358B07l22K93j30k47K75j62k0j03J47J2j82L36J58m29jR7R7rK0o9J28K5P2r9
7382I4j62J07l9k61K66J07m09J52Q5k16J65K77n52L22M16m64J11J01k32m2J50
7403b4R8r4K3j32L67j71j7k72L55m82J3N39n57M21Oj35j8P6J18j28l69K94j42
7426b31K38n4L0j11J53J81k79Q2RM5J60j86j57K35l15K07j55K55%J4j19O9J82
7449B53n1m9K40n4k58J65k60K73j79J00l92m4M65l35J60j42K3J05K77l67L05j00
7471A35kj51j23J66o9j76M8K40q7l2O0M0r7k30N98j28m2rJ87m45L03m0K36n10
7495a28K89M8m69L62j15R7j50K49r5m28M89l58Q9L27k21M0J06J9Ok44J40R4l42
7518a95J18K7J81k37M61l88M8m2J61J98n38R3r0K08L4P3j63J78j06l4J94j70K9
$$ plain form
7541 40 -148 35 -9 66 -123 94 447 99 116 -59 189 -89 269 -225 -13 3 -114 -227 44 -115 -56 82
7563 82 -6 -120 -352 112 -174 98 81 -185 95 261 -265 -14 -41 -36 224 -77 157 132 -37 -16 60 -381 23
7586 23 41 -8 -67 -195 25 45 3 143 -29 142 -102 -230 263 176 -279 -118 -207 -110 128 -96 85 -57 38
7609 38 -214 48 118 166 108 0 -177 -6 251 198 256 368 214 50 -69 152 107 -121 119 -90 -46 86 -99
7632 -99 -131 -89 -24 8 10 -81 -430 -107 -80 81 153 -115 148 -328 -179 -19 218 247 -98 -24 311 232 -161 -83 -100
7657 -100 -118 96 -61 6 -307 -23 173 -64 -59 184 -106 -301 -2 189 141 -159 -99 5 -200 108 194 -287
7679 -287 62 -62 -99 -87 204 320 -25 -49 -153 -119 -13 30 211 74 57 70 81 -118 -60 -84 -172 -109 -253 -77
7703 -77 -288 42 -244 156 -165 2 -163 116 394 117 5 57 82 52 -54 44 -243 266 86 -37 -48 -173
$$ packed form
7541D0j88J83m4P5j89K17L53l48J7j75K48k78L58m94K12J6j17j13K71j59N9J38
7563H2q8j14k32M64k86K72j7k66K80J66n26K51k7NK60l01K34k5j69K1P6m41M04
7586B3J8m9n9j28K20K0m2J40j72J71k44j28M93q7m55J61q9R7K38k24J81j42R5
7609C8k52K62P0M8n8j08j77J71K57n3N8J12j54j64j19K21m5k28K40k09M4J32j85
7632i9l2M2O5L2Kr1l49L23K7J61P2k68K63m76J49J60K37K9l45P4L35p9l93P8j7
7657a00j8K14j57O7l13K84J96k37NK43k90j95K99J91m8l00O0J04k05L08Q6m81
7679b87L49j24l7J2K91J16l45k4j04L4J06M3J81j37j7J3J1j99N8k4q8O3j44J76
7703g7k11L30k86M00l21J67j65K79K78k77j12N2K5l0j06R8k87N09j80j23j1j25
$$ plain form
7725 -173 -56 -204 163 -153 123 51 174 16 92 -147 136 -145 44 8 -15 -344 9 -49 -84 -217 24 -28
7747 -28 248 -154 33 -54 77 163 -127 -21 164 -116 44 -298 -11 66 3 116 -60 24 -133 -101 -150 -60 -158
7770 -158 25 125 -8 -211 -125 124 180 -97 162 72 151 -47 -53 -39 -102 -127 -163 23 4 -371 -50 33 123 73 -125
7795 -125 -132 -19 229 -110 57 -85 -37 -77 322 -59 32 -166 -119 -134 40 40 -105 -46 274 117 203 99 -206 131
7819 131 264 -29 -86 223 -170 -83 -160 -100 239 211 203 -201 160 139 -244 95 93 209 351 -18 -56 36 -120 191
7843 191 36 -138 -64 88 -38 282 -166 -232 -221 -231 188 46 -134 -17 -234 -114 -374 199 237 -196 -174 278
7865 278 108 -156 -197 44 232 3 -82 -62 68 -69 120 287 71 -309 15 172 41 81 99 23 99 96 99 110
7889 110 -90 -54 144 -231 202 -90 -87 -77 210 -158 7 -105 47 -13 63 79 -100 -188 -155 28 -317 -25 -152
$$ packed form
7725a73J17j48L67l16K76p2J23j58P6k39K83k81J89l6k3l29L53n8l5j33K41n2
7747b8K76m02J87q7J31Q6k90J06J85k80J60l42K87P7o3J13j76Q4j57L2m9R0r8
7770a58J83J00j33k03Q6K49N6k77K59r0P9j98oJ4o3k5l6J86j9l75L21Q3R0n0j98
7795a25pJ13K48l39J67j42M8m0L99l81R1j98M7j5J74%j45N9L20j57Q6j04l05L37
7819A31J33k93n7L09l93Q7p7O0L39k8qm04L61k1l83L39kJ16J42l69l8R2j56L11
7843A91j55j74P4J52j26L20m48o6J1j0M19j42j80J17k17J20k60N73L8m33K2M52
7865B78j70k64m1K41J88k29q5K0J30j37J89J67k16l80L24J57j31M0J8p6P6lLJ1
7889A10k00L6J98l75M33k92LJ0K87l68J65j12J52o0P6J6j79q8L3J83l45K92j27
$$ plain form
7912 -152 -122 -56 140 267 69 -220 143 298 -190 -302 104 -85 -132 -84 136 -1 -150 -77 70 -54 -359 -56
7934 -56 -122 -200 241 -47 -74 -4 43 183 -46 -97 -76 -54 -153 141 -323 136 -173 -53 194 100 195 8 8 11 28 -410
7960 -410 -117 124 -21 92 118 71 -293 -265 -311 -173 310 4 -81 -234 62 38 -227 -62 10 -99 -95 -350 121
7983 121 -28 -2 -297 45 -113 187 208 -184 -25 138 -343 28 180 235 138 -44 83 -45 -6 149 187 -47
8005 -47 12 -38 -153 111 -136 -19 5 -184 -16 -267 -83 64 -231 -278 -90 115 54 120 3 -99 219 -152
8027 -152 -150 123 80 313 -157 140 217 201 180 -176 -33 -94 83 117 60 -155 23 57 101 55 -43 -31 82 36 -158
8052 -158 -136 192 -206 211 254 -40 411 80 -76 134 -330 -133 -169 -160 283 -180 187 -315 115 52 -55 63
8074 63 -40 154 -39 -212 172 67 -115 142 -229 170 11 -81 -176 -129 -178 46 -85 192 -19 -137 20 -70
$$ packed form
7912a52L0O6J96J27j98k89L63J55m88j12M06j89m7M8K20j37j49P3J47j24l05L03
7934e6o6p8M41k88k7P0M7J40k29n1K1K2r9K94m64M59l09J20K47r4R5j87%LJ7m38
7960d10K93K41j45J13K6m7l64K8m6J38M83l06q5j53K96k4k65J65P2j09Mk55M71
7983A21j49K6k95L42j58L00K1l92J59J63m81L71J52N5r7j82J27j28L9J55L8k34
8005d7N9n0j15K64k47J17K4j89J68k51J84J47k95m7J88K05o1O6j17j02L18l71
8027a52KK73m3K33m70K97P7j6k1l56J43o1J77L4n7k15J78L4M4m6r8J2J13m6j94
8052a58K2L28l98M17M3k94M51l31j56K10m64J97l6RM43m63L67n02M30o3j07J18
8074F3j03J94j93j73L84j05j82K57l71L99j59r2r5M7m9K24j31K77k11j18J57r0
$$ plain form
8096 -70 25 83 130 328 -447 73 -193 94 222 -8 -67 38 91 192 -96 28 -190 -75 17 53 10 -2 9 191
8120 191 -279 -203 116 -12 51 10 107 100 259 -199 -3 141 -145 -555 -120 128 122 219 70 -165 29 108 156 -13
8144 -13 -151 -117 -31 -133 29 -115 5 -15 -52 68 -185 -105 123 91 -104 -102 -380 42 -68 -71 29 183 57 -96
8168 -96 -67 -47 51 -238 -70 -40 -141 -133 -90 -261 -4 15 -177 -137 133 -81 134 69 -265 -180 66 -265 18
$$ packed form
8096g0R5N8M7J98p75N20k66K87J28k30n9J05N3J01k88J24k18J15R2L6m3j2J1J82
8120A91m70P6L19j28O3m1R7pJ59m58J96J44k86m10M35K48oR7j49k35J94P9M8j69
8144a3j38L4Q6j02J62j44J20k0l7J20k53Q0K28l2j95Kk78M22j10lJ00J54j26j53
8168i6K9K0R8k89J68L0j01QM3j71K57J9j92M0K70k14K15o5l34Q5K46l31K83
8191A8
$$ Imaginary data points
##PAGE= N=2
##DATA TABLE= (X++(I..I)), XYDATA
$$ plain form
0 0 0 0 0 0 0 0 0 7 -7 7 -7 7 -14 14 -21 28 -28 35 -42 49 -56 68 -77 89 -103 117 -134 152 -171 193 -218
31 -218 244 -276 307 -342 383 -425 472 -523 580 -643 713 -788 872 -967 1072 -1192 1328 -1483
49 -1483 1666 -1881 2137 -2453 2854 -3376 4095 -5147 6841 -10037 18224 -86341 -145918 13862
63 13862 84535 121848 65653 -50542 -148833 -85711 57091 135615 85172 -7159 -90127 -114149
75 -114149 -52210 72305 127800 56319 -59266 -98999 -60486 13897 85216 106816 31560 -79096
87 -79096 -105987 -23619 62574 81077 48708 -9757 -77771 -88322 -3741 88799 82638 6655
99 6655 -48855 -64252 -46872 15467 83716 71500 -17182 -77155 -57995 -5242 36503 60014
111 60014 41411 -26835 -80669 -51485 25007 61321 40483 3557 -32682 -58654 -36299 32522
$$ packed form
0@%%%%%%%Pj4J4j4J4k1K8l5M9n6O3p7R1j05J24j45J66j92K20k51K86l23L64m11
31b18M62n20N83o49P25q08Q97r95J103j223J356j501J660j839K039k264K520k811
49a483L149l547M018m590N307o230P471r242J1988j6878K8261j04565n9577J59780
63A3862P0673L7313n6195j16195r8291O3122J42802P8524n0443r2331q2968k4022
75a14149O1939J24515N5495p1481j15585l9733L8513P4383P1319K1600p5256j10656
87g9096k6891Q2368Q6193J8503l2369n8465o8014j0551Q4581R2540o161p5983
99F655n5510j5397J7380O2339O8249j2216q8682n9973J9160N2753M1745K3511
111F0014j8603o8246n3834K9184P6492L6314k0838l6926l6239k5972K2355O8821
$$ plain form
123 32522 67858 26964 -32173 -46574 -31282 -7285 32498 59984 23260 -42384 -52825 -7899
135 -7899 25415 31428 30353 5159 -43595 -55050 -4775 42710 37270 7241 -12806 -27207 -28764
148 -28764 4873 47624 42833 -5694 -36500 -28045 -10116 6748 28250 29544 -8978 -44132 -26536
161 -26536 14800 28526 20809 13957 -5467 -33065 -25163 17809 35567 9272 -13979 -16701 -19862
174 -19862 -15805 14258 36067 12175 -23125 -23719 -3864 5851 13401 22824 10352 -22764 -31612
187 -31612 -2694 20434 15352 4193 -1396 -15193 -25905 -4991 26573 23349 -3944 -14329 -8419
200 -8419 -8259 -2194 19895 24332 -4312 -25966 -12387 5188 4979 8069 13894 -1289 -23003 -14333
214 -14333 12632 18037 4185 -785 -2779 -13103 -13133 8487 21382 5191 -13528 -10239 -1909 -1264
$$ packed form
123C2522L5336m0894n9137j4401J5292K3997L9783K7486l6724o5644j0441M4926
135g899L3314O013j075k5194m8754j1455N0275M7485n440l0029k0047j4401j557
148b8764L3637M2751m791m8527l0806Q455J7929J6864K1502J294l8522l5154J7596
161b6536M1336J3726p717o852j9424k7598P902M2972J7758k6295k3251k722l161
174a9862M057L0063K1809k3892l5300n94J9855R715P550R423j2472l3116q848
187c1612K8918K3128n082j1159n589j3797j0712K0914L1564l224k7293j0385N910
200h419J60O065K2089M437k8644k1654J3579J7575k09L090N825j5183k1714Q670
214a4333K6965N405j3852m970j994j0324l0K1620J2895j6191j8719L289Q330O45
$$ plain form
228 -1264 5282 17683 9907 -14880 -19246 60 9320 3743 3690 5214 -9068 -19243 -2222 17924
242 17924 11861 -2023 -2064 -1273 -9906 -5391 12997 13659 -6562 -13947 -3759 315 -2031 5599 12420
257 12420 48 -14172 -6030 9646 7926 19 1902 1411 -9968 -10771 6267 13573 176 -8220
271 -8220 -2124 -941 -5920 1622 13535 5859 -10836 -9177 3637 3252 -332 6238 7487 -7008
285 -7008 -13493 -254 9134 1552 -2918 2056 -628 -8939 -4020 9737 8677 -3582 -4451 2254 -70
300 -70 -3882 3175 8551 -1819 -10730 -2693 5523 901 -1731 4741 3491 -7309 -5917 6530 8158
315 8158 -1714 -3338 2141 -1918 -7081 1486 10079 2616 -7375 -2703 3099 -1908 -2502 5465 5677 -5505
331 -5505 -7959 1670 4443 -1422 -579 5248 1104 -6648 -2020 7166 2967 -4367 -1563 2374 -2700
$$ packed form
228a264O546J2401p776k4787m366J9306R260n577n3J524j4282j0175J7021K0146
242A7924o063j3884m1P91q633M515J8388O62k0221p385J0188M074k346P630O821
257A2420j2372j4220Q142J5676j720p907J883m91j1379q03J7038P306j3397q396
271h220O096J183m979P542J1913p676j6695J659J2814l85l584O570J249j4495
285g008o485J3239R388p582m470M974k684q311M919J3757j060j2259q69O705k324
300g0l812P057N376j0370q911Q037Q216m622k632O472j250j0800J392J2447J628
315H158r872j624N479m059n163Q567Q593p463r991M672N802n007n94P967K12j1182
331e505k454R629K773n865Q43N827m144p752M628R186m199p334K804L937n074
$$ plain form
346 -2700 -5525 2948 6244 -2382 -6026 1753 4414 -1399 -781 5413 1953 -7022 -4014 4898 3064
361 3064 -2942 255 3179 -2969 -6016 1944 6861 242 -4223 196 1226 -3511 -2071 5562 4312
376 4312 -3813 -3750 2623 1727 -2701 990 4574 -1057 -6400 -581 4419 -144 -3825 1384 2887 -2927
392 -2927 -2590 4696 4630 -2539 -3153 2381 1189 -3372 3 4593 -457 -5995 -1545 3762 445 -1875
408 -1875 2112 3049 -3156 -3959 2650 4446 -879 -1831 1825 473 -3869 -1184 4637 1467 -4150 -1856
424 -1856 2297 -557 -3019 1596 3883 -1104 -3164 2083 3874 -980 -1932 2191 930 -3782 -1708
439 -1708 3000 1031 -3861 -1826 1906 147 -1597 2065 4244 -683 -3674 295 2304 -1048 -1737
454 -1737 1903 1348 -3364 -2743 2306 2411 -1445 -322 2432 322 -3154 134 3146 -261 -3228 172
$$ packed form
346b700k825Q473L296q626l644P779K661n813O18O194l460q975L008Q912j834
361C064o006L197K924o148l047P960M917o619m465M419J030m737J440P633j250
376D312q125O3O373q96m428L691L584n631n343N819N000m563l681N209J503n814
392b927L37P286o6p169o14N534j192m561L375M590n050n538M450N307l317k320
408a875L987R37o205q03O609J796n325r52L656j352m342K685N821l170n617K294
424a856M153k854k462M615K287m987k060N247J791m854r52M123j261m712K074
439a708M708j969m892K035L732j759j744L662K179m927k991L969K009l352o89
454a737L640n55m712O21N049J05l856J123K754k110l476L288L012l407k967L400
$$ plain form
470 172 2140 -1535 -2219 1925 2209 -1989 -1531 2763 1858 -2451 -1197 1753 -47 -2984 -159 3194
486 3194 389 -2141 -68 2313 -891 -1584 2413 2496 -1673 -2291 891 1037 -2052 -836 2234 833
502 833 -2502 -975 1893 4 -1853 788 2737 -642 -1920 1170 1818 -1157 -1457 1398 1036 -2371
518 -2371 -1680 1053 395 -1965 -931 2050 1274 -1423 591 2552 94 -1650 748 1799 -1072 -2036
534 -2036 333 667 -2209 -1528 1487 1590 -827 -86 1774 412 -1653 183 2388 -38 -1970 -374
550 -374 547 -1316 -1251 1090 1734 -403 -791 1154 1042 -1169 -764 1729 585 -1590 -615 1341 -123
567 -123 -2114 -93 1081 -188 -1059 975 1628 -1031 -1769 761 956 -953 -669 1213 274 -1912 -469
584 -469 1492 639 -709 296 1121 -513 -1430 710 1414 -137 -778 532 780 -1262 -935 784 933
$$ packed form
470A72J968l675o84M144K84m198M58M294r05m309J254K950j800k937K825L353
486C194k805k530K073K381l204o93L997Q3m169o18L182J46l089J216L070j401
502H33l335J527K868j889j857K641J949l379j278L090O48k975l00K855l62l407
518b371O91K733o58k360J034K981p76k697K014J961k458j744K398J051k871r64
534b036K369L34k876O81L015J03k417P41J860j362k065J836K205k426j932J596
550c74R21j863O5K341O44k137l88J945j12k211M05K493j144k175R75J956j464
567a23j991K021J174j269q71K034O53k659p38K530J95j909K84J882r39k186J443
584d69J961q53j348J005Q25j634r17K140P04j551o41J310K48k042L27J719J49
$$ plain form
601 933 -866 -570 1126 723 -858 -137 1301 204 -880 265 912 -693 -1506 -247 73 -797 -651
618 -651 845 866 -804 -362 1345 883 -23 414 904 -475 -1672 -625 97 -237 -857 20 748 -317
636 -317 -898 871 1142 -85 68 840 338 -1247 -985 296 -457 -1106 -19 1158 -131 -479 105 834
654 834 -273 125 1098 634 -835 -818 327 106 -519 -109 688 391 -566 -534 424 63 -39 380 632 -127
674 -127 -719 225 586 -420 -432 693 331 -522 -697 -18 -170 -456 103 779 451 -325 181 254 -349 -425 172
695 172 502 -376 -779 -77 31 -47 157 722 792 -177 -341 153 -368 -532 101 111 -460 -751 -55 350 -560
716 -560 -57 811 567 276 135 281 -442 -677 -379 294 223 -542 -501 191 -317 6 315 723 218 165 -111
737 -111 150 -230 -549 98 165 -271 -396 270 -386 -468 3 467 406 148 227 341 -104 -198 301 166 94 -107
$$ packed form
601I33j799K96J696m03j581P21J438j097j084J145O47j605q13J259L20q70J46
618f51J496K1j670M42J707m62r06M37M90j379j197J047P22l34o20Q77P28j065
636c17n81J769K71j227J53P72n02j585K62J281p53o49J087J177j289l48N84P29
654H34j107L98R73m64j469J7J145k21o25M10P97k97r57L2R58l61j02M19K52p59
674a27n92R44L61j006j2J125l62q53j75O79j52k86N59O76l28p76N06P3o03p6N97
695A72L30q78m03P02J08p8K04N65P0r69j64M94n21j64O33J0n71k91O96M05r10
716e60N03Q68k44k91j41J46p23k35K98O73p1p65M1O92n08L23L09M08n05n3k76
737a11K61l80l19O47O7m36j25O66o56q2M71M64o1k58P9J14m45r4M99j35p2k01
$$ plain form
759 -107 -139 -278 -246 -502 101 470 167 8 146 173 -480 159 400 106 -182 -269 115 -129 -221 -168 231 -272
781 -272 -335 319 83 -67 -77 215 -15 26 158 -89 -238 -471 -150 62 -65 287 509 11 25 -95 28 364
803 364 167 -332 -168 -445 -323 -143 231 167 -64 477 424 156 -117 249 169 -5 46 354 43 -321 -252 -271
825 -271 9 64 157 524 159 -138 -311 184 62 45 -167 152 -97 -487 -231 143 -39 260 136 313 -150
846 -150 -364 67 -170 -170 169 255 140 112 -8 -366 -273 -95 -76 -289 -211 -93 6 -160 -86 225 375 246 -86
869 -86 -102 23 -279 240 102 443 -208 -331 -136 125 -97 -240 133 59 -48 -91 234 -88 -25 -57 86 -332
891 -332 72 -100 -79 -25 -153 191 271 39 -123 -76 -389 -64 -213 262 -1 59 184 -143 91 -5 138 90 176
914 176 63 12 -86 -299 26 118 -30 231 -111 32 194 -292 356 223 185 -407 290 23 -237 45 -70 154
$$ packed form
759a07l2j39L2k56O03L69l03j59J38K7o53O39K41k94k88q7L84k44r2N3L99n03
781b72o3O54k36j50j0K92k30M1J32k47j49k33L21K12j27L52K22m98J4j20J23L36
803C64j97m99J64k77J22J80L74o4k31N41n3k68k73L66q0j74N1L08l11l64O9j9
825b71K80N5R3L67l65k97j73M95j22j7k12L19k49l90K56L74j82K99j24J77m63
846a50k14M31k37%L39Q6j15k8j20l58R3J78J9k13P8J18R9j66P4L11J50j29l32
869h6j6J25l02N19j38L41o51j23J95K61k22j43L73p4j07m3L25l22O3l2J43m18
891c32M04j72K1N4j28L44Q0k32j62M7l13L25j49M75k63O0J25l27K34r6J43m8Q6
914A76j13n1r8k13L25R2j48K61l42J43J62m86O48j33l8n92O97k67k60K82j15K24
$$ plain form
936 154 276 269 -350 -293 143 25 70 290 308 -120 113 239 -288 -16 306 558 -63 -331 62 -430 59 -17
958 -17 207 -76 -186 262 -50 -161 75 -164 85 -165 318 208 17 -296 -257 -28 299 164 -37 373 -203
979 -203 -152 -157 205 126 -212 352 -193 -179 55 -55 183 -71 87 210 -96 -166 -147 -329 41 128 236 200 24
1002 24 -11 -176 -20 274 129 89 -47 -129 -64 -108 -184 91 -165 282 228 -183 191 -94 80 57 247 -64 141
1025 141 -345 -153 54 -494 116 227 56 -83 98 18 -110 -11 129 -53 297 -154 -254 45 -26 76 185
1046 185 19 -125 -59 -214 162 184 -134 75 34 -241 -46 209 -51 -224 12 -6 112 -146 -169 -80 -268 -99
1068 -99 109 -160 -26 32 -343 -135 -222 16 169 7 226 -89 217 -179 184 156 -144 -9 18 -470 -192 64
1090 64 -219 71 -79 -74 40 52 -18 32 41 204 -43 -72 30 68 -307 -180 -140 9 -31 169 30 -103 -97 103 11
$$ packed form
936A54J22po19N7M36j18M5K20J8m28K33J26n27K72L22K52o21k68L93m92M89p6
958a7K24k83j10M48l12j11K36k39K49k50M83j10j91l13L9K29L27j35k01M10n76
979b03N1nL62p9l38N64n45J4K34j10K38k54J58J23l06p0J9j82L70Q7J08l6j76
1002B4l5j65J56K94j45m0j36q2O5m4p6K75k56M47n4m11L74k85J74k3J90l11K05
1025A41m86J92K07n48O10J11j71j39J81q0j28R9J40j82L50m51j00K99p1J02J09
1046A85j66j44O6j55L76K2l18K09m1k75J95K55k60j73K36j8J18k58k3Q9j88J69
1068i9K08k69J34N8l75K08q7K38J53j62K19l15L06l96L63k8l00J35K7m88K78K56
1090F4k83K90j50NJ14J2p0N0RJ63k47k9J02L8l75J27M0J49m0K00j39j33OK00r2
$$ plain form
1115 11 306 166 254 -61 -36 -33 139 -176 -326 -28 -185 -131 121 11 173 213 -183 -45 -15 106 -530 31 -267
1138 -267 195 114 -18 -164 -395 -27 202 166 95 137 -84 86 -60 -401 -218 123 23 19 115 51 -45 57 55 73
1162 73 424 215 108 39 167 -300 -229 200 104 135 233 -186 18 185 -114 -154 370 33 12 -370 -18 178 -230
1185 -230 -278 -126 -68 15 192 -96 140 -119 25 144 -69 -356 203 6 -75 32 -121 76 -21 302 54 261
1207 261 -45 -133 520 -73 -97 -268 119 -133 -207 176 178 -230 111 -78 206 129 24 168 240 -380 90 -221
1229 -221 -150 -145 103 -92 -198 -156 -220 -153 57 256 192 -42 60 -291 -272 196 -126 -410 -76 142 -247 78 361
1252 361 -78 -29 -139 51 -24 -17 160 -64 -135 -66 187 459 164 -19 108 -166 -1 75 116 -3 -125 -185 -114
1275 -114 180 -356 -300 195 225 38 -252 -59 -258 -31 30 77 123 244 107 -66 -25 -67 -1 -112 69 -87 -262
$$ packed form
1115A1K95j40Q8l15K5LJ72l15j50K98j57N4K52j10J62M0l96J38L0J21o36N61k98
1138b67M62q1j32j46k31L68K29l6p1M2k21J70j46l41J83L41j00mR6o4r6J02kJ8
1162G3L51k09j07o9J28m67P1M29r6L1R8m19K04J67k99m0N24l37k1l82L52J96m08
1185b30m8J52N8Q3J77k88K36k59J44J19k13k87N59j97q1J07j53J97r7L23k48K07
1207B61l06q8O53n93k4j71L87k52p4L83Km08L41j89K84p7j05J44P2o20M70l11
1229b21P1NK48j95j06M2o4O7K10J99o4k34J02l51J9M68l22k84L34K18l89L25K83
1252C61m39M9j10J90p5PJ77k24p1O9K53K72k95j83J27k74J65P6M1j19j22o0P1
1275a14K94n36N6M95L0j87k90J93j99K27O1M7M6J21j37j73M1m2O6j11J81j56j75
$$ plain form
1298 -262 58 -113 -301 281 429 -59 86 -277 91 213 -64 116 -194 72 -452 49 208 -39 -135 46
1318 46 270 62 65 -24 83 -300 55 -14 43 127 -32 -11 -184 -303 9 185 -245 363 3 -145 37 187 125
1341 125 -56 -17 -15 175 -257 -48 -23 -192 -110 124 -11 86 40 319 -284 -27 56 305 70 -281 -196 -119 -80 369
1365 369 200 -199 70 107 -306 -39 138 -202 380 -8 -21 106 -70 95 -7 125 240 129 -228 -32 -187
1386 -187 -68 242 -155 -16 -52 198 -108 110 55 60 45 53 201 -95 -71 -55 -35 -205 -123 -223 -162 -87 182 -9
1410 -9 20 -31 176 22 -334 276 148 79 -60 -101 -28 -244 -247 -12 91 74 -125 40 -119 -85 50 224 259 -211
1434 -211 17 162 306 129 -112 109 402 -37 119 -84 114 288 115 84 214 144 102 -56 -216 17 146
1455 146 -178 248 174 83 -22 -49 68 -43 -41 120 -96 -18 104 -72 -79 -231 57 53 59 -67 183 167 -125 45
$$ packed form
1298b62L20j71j88N82J48m88J45l63L68J22k77J80l10K66n24N01J59k47r6J81
1318D6K24k08Lq9J07l83L55o9N7Q4j59K1j73j19L12J76m30O08l60j48J82J50o2
1341A25j81L9KJ90m32K09K5j69Q2K34j35R7m6K79o03K57Q3K49k35l51Q5P7L9M49
1365C69j69l99K69L7m13K67J77l40N82l88j3J27j76J65j02J32J15j11l57J96j55
1386a87J19L10l97J39l6K50l06K18n5Nj5QJ48k96K4J6K0j70Q2j00O1P5K69j91
1410iK9n1K07j54l56O10j28o9j39m1P3k16lK35J03j7j99J65j59L4J35J74L5m70
1434b11K28J45J44j77k41K21K93m39J56k03J98J74j73l1J30p0m2j58j60K33J29
1455A46l24M26p4r1j05k7J17j11KJ61k16P8J22j76pj52K88mOj26K50j6k92J70
$$ plain form
1479 45 -196 188 127 -260 56 -15 151 -120 98 49 -209 -78 -11 -221 -119 414 183 160 10 -57 186 89 -92
1502 -92 75 -80 -142 -250 -21 -84 -211 179 118 87 167 192 -106 -393 -10 -3 -230 37 105 -121 -177 20 274 16
1526 16 -64 -144 -254 -132 -155 185 -117 293 279 -271 -179 -159 -116 -221 -251 168 -7 -97 44 -155 -97 158 -61 109
1550 109 257 269 145 38 -34 -18 -337 265 -83 -265 5 -39 -156 -118 125 90 -139 274 65 162 99 -171 -157
1573 -157 40 368 -78 -85 55 -49 141 -167 24 -74 -67 -34 -53 333 243 143 105 86 -68 111 21 -85 -32 -163
1597 -163 47 80 -207 116 -54 134 -138 111 128 -115 97 46 0 178 -61 256 -60 -122 -155 -100 -13 -266 -246
1620 -246 -93 62 -558 44 -320 -46 -63 4 39 181 -254 -274 109 -359 -87 -334 -5 -209 -166 75 86 -127
1642 -127 -51 -124 116 125 41 -58 195 231 15 220 29 -59 -92 210 297 -2 45 -190 113 30 59 -21 42 76 264
$$ packed form
1479D5k41L84o1l87L16p1J66k71K18m9k58J31O7k10J02N33k31k3j50o7K43r7j81
1502i2J67j55o2j08K29o3j27L90o1l1Q0K5k98k87L83Pk27K67O8k26n6J97K54k58
1526A6q0q0j10J22k3L40l02M10j4n50R2K0M3j05l0M19j75r0J41j99N8K55k19J70
1550A09J48J2j24j07p2J6l19O02l48j82K70m4j17L8K43l5k29M13k09R7o3k70J4
1573a57J97L28m46pJ40j04J90l08J91r8PL3j9L86r0j00l8j9j54J79r0j06N3j31
1597a63K10L3k87L23j70J88k72K49J7k43K12n1m6J78k39L17l16o2l3N5Q7k53K0
1620b46J53J55o20O02l64K74j7O7L5J42m35k0L83m68K72k47L29k04M3K41J1k13
1642a27P6p3K40Rq4r9K53L6k16K05j91q8l3L02Q7k99M7k35L03q3K9q0O3L4J88
$$ plain form
1667 264 215 -71 174 -116 66 164 93 -98 121 166 69 129 -259 194 -70 17 -61 161 -143 6 223 -30 96
1690 96 -120 -155 -51 -45 -151 -285 -194 -109 448 53 28 230 227 87 213 -86 315 -40 -162 6 204 133 104 88
1714 88 -189 -401 -112 -165 -39 -272 505 63 35 36 -84 146 -34 172 -117 31 202 -96 111 -55 -185 53
1736 53 42 -172 -201 -166 -118 230 95 21 58 3 381 119 -1 -91 -223 188 31 58 -297 -123 26 163 190 -61
1760 -61 65 314 -188 -263 -29 225 92 -148 -127 -242 -205 -388 103 -60 -157 90 49 -38 44 130 -64 23 8 83
1784 83 176 -92 -136 -20 97 227 97 63 -151 -184 -180 -6 96 37 130 23 5 -11 -400 38 104 2 -46 -1 -197
1809 -197 -340 -127 -150 78 47 105 -5 -293 -70 153 44 -36 51 -88 23 -357 25 -134 -15 20 -143 318
1831 318 252 -152 3 116 75 73 145 104 -251 225 75 560 -32 160 -207 -218 -44 -214 86 -264 59 -43
$$ packed form
1667B64m9k86K45k90J82R8p1j91K19M5r7O0l88M53k64Q7p8K22l04J49K17k53J26
1690I6k16l5J04Oj06j34R1Q5N57l95k5K02lj40J26k99M01l55j22J68J98p1k9j6
1714H8k77k12K89n3J26k33P77m42k8Jj20K30j80K06k89J48J71k98K07j66j30K38
1736E3j1k14k9L5M8L48j35p4L7n5L78k62j20r0j32M11j57K7l55J74J49J37K7k51
1760f1J26K49n02p5K34K54j33k40K1j15L7j83M91j63r7K47m1q7Q2Q6j94Q7j5P5
1784H3R3k68m4J16J17J30j30l4k14l3MJ74J02n9R3j07j8j6l89M38O6j02m8M5j96
1809a97j43K13k3K28l1N8j10k88K23K23j09q0Q7j39J11l80L82j59J19L5j63M61
1831C18o6m04J55J13m1kP2m1l55M76j50M85n92J92l67j1J74j70L00l50L23j02
$$ plain form
1853 -43 186 402 124 -87 124 -173 -156 194 148 122 155 -147 13 240 -81 -28 -74 50 65 -79 -165 40 -177
1876 -177 -155 -44 -205 281 -96 47 -163 167 -56 255 -51 79 -370 383 -156 -16 182 -213 22 -204
1896 -204 -81 -21 23 87 -13 -137 -97 -261 -51 26 184 -207 50 -29 -143 116 -15 178 251 -195 -78 -121 -150
1919 -150 -58 128 135 -125 287 -103 -96 79 327 105 26 152 57 137 17 267 -83 -24 108 -64 152 -68 -35
1942 -35 -64 -171 183 -83 -132 82 -128 -8 -130 -30 109 -68 -183 215 -143 11 -52 114 -39 -77 -133 55
1964 55 -82 -286 213 110 -103 -37 -34 134 1 97 -86 329 201 106 -70 66 105 -87 30 75 231 19 246
1987 246 -90 -275 33 100 101 -80 50 228 -100 -30 147 220 56 -177 -198 -365 -138 65 -43 -59 138 79 -188
2010 -188 367 168 -115 154 -43 100 -92 78 137 -513 69 -29 -37 -97 137 -212 -114 18 -94 -194 -118 143
$$ packed form
1853d3K29K16k78k11K11k97J7L50m6k6L3l02J60K27l21N3m6J24J5j44q6K05k17
1876a77K2J11j61M86l77J43k10L30k23L11l06J30m49P53n39J40J98l95K35k26
1896b04J23O0M4O4j00j24M0j64K10P7J58l91K57p9j14K59j31J93P3m46J17m3k9
1919a50R2J86Pk60M12l90PJ75K48k22p9J26r5Q0j20K50l50N9J32j72K16k20L3
1942c5k9j07L54k66m9K14k10J20j22J00J39j77j15L98l58J54o3J66j53l8n6J88
1964E5j37k04M99j03k13O6LJ68j33R6j83M15j28r5j76J36L9j92J17M5J56k12K27
1987B46l36j85L08O7Jj81J30J78l28P0J77P3j64k33k1j67K27K03j08j6J97n9k67
2010a88N55j99k83K69j97J43j92J70N9o50N82r8qo0K34l49R8J32j12j00P6K61
$$ plain form
2032 143 60 22 -44 115 137 173 50 -92 -285 -131 92 -141 -84 125 -3 132 194 -235 -79 265 102 234
2054 234 -3 148 113 161 -53 110 -57 65 117 118 -218 -173 -119 226 51 -31 -71 91 20 7 14 339 -35 18 -96
2079 -96 266 -5 49 45 -241 -18 -34 -322 -71 -38 -30 -312 -78 133 -136 39 -121 136 -259 29 154 -137 113
2102 113 -53 -124 -1 40 -217 -15 -184 -97 35 132 90 -58 -33 -96 275 -17 38 -45 -167 -23 16 -115 47
2125 47 65 70 118 57 278 313 -374 212 -60 -8 200 -11 -93 24 110 135 -26 -196 118 -226 -129 -61 35 -51 103
2150 103 -166 114 -1 119 117 -63 -9 -17 34 -155 39 -48 -26 130 247 422 -55 272 268 60 137 -8 2 65
2174 65 321 -30 -63 -104 331 -108 173 222 289 86 84 -127 -41 251 284 149 30 -161 -118 202 145 -9 -270 -289
2198 -289 -97 86 -61 -212 -124 197 -150 -84 -73 31 -197 -267 227 117 -185 140 463 -148 -150 158 116 174 265
$$ packed form
2032A43q3l8o6J59K2L6j23j42j93J54K23k33N7K09j28J35O2m29J56L44j63J32
2054B34k37J51l5M8k14J63j67J22N2Jl36M5N4L45j75q2m0J62p1j3PL25l74N3j14
2079i6L62k71N4mk86K23j6k88K51L3Qk82K34K11k69J75j60K57l95K88J25k91K50
2102A13j66p1J23M1k57K02j69Q7J32R7m2j48K5o3L71k92N5q3j22J44L9j31J62
2125D7J8NM8o1K21L5o87N86k72N2K08k11q2J17Q6K5j61j70L14l44R7O8R6q6J54
2150A03k69K80j15J20kj80N4qN1j89J94q7K2J56J17J75m77L27mk08P7j45J0O3
2174F5K56l51l3m1M35m39K81M9O7k03kk11Q6K92L3j35j19j91M3L20n7j54k61j9
2198b89J92J83j47j51Q8L21l47O6J1J04k28p0M94j10l02L25L23o11kL08m2N8R1
$$ plain form
2221 265 200 386 -124 -110 -3 146 -106 52 29 -266 42 -147 160 -3 -94 90 70 198 -277 29 52 -222
2243 -222 -244 127 124 73 -50 -575 -128 11 47 420 123 194 -361 19 -7 106 63 -231 -58 -273 46 186 162
2266 162 -17 50 -99 -120 2 106 103 294 99 248 128 -27 180 241 -180 -86 76 154 -82 -52 130 -118 29
2289 29 -69 214 75 -184 -205 4 56 -14 158 243 -45 101 -53 166 -95 -407 66 46 138 43 102 163 -15 144
2313 144 -141 73 -96 -12 -122 144 -85 5 314 87 250 33 233 -101 188 -83 -85 -317 -31 147 -115
2334 -115 -19 76 -28 -165 -22 -175 93 -140 -206 296 51 -108 100 9 -201 139 277 55 -81 7 -106 -61
2356 -61 -45 -6 -164 -114 -266 -31 -338 75 -142 108 180 199 111 210 -78 160 -42 55 -92 -133 142 122 191 -201
2380 -201 -94 5 -38 -147 -17 -129 156 268 152 61 -267 346 175 208 204 72 133 -84 15 7 28 -1 -14 126
$$ packed form
2221B65o5J86n10J4J07J49k52J58k3k95L08j89L07j63r1J84k0J28m75L06K3k74
2243b22k2L71ln1j23n25M47J39L6L73k97P1n55L80k6J13m3k94J73k15L19J40k4
2266A62j79O7j49k1J22J04lJ91j95J49j20j55K07O1m21R4J62P8k36L0J82k48J47
2289B9r8K83j39k59k1K09N2p0J72Q5k88J46j54K19k61l12M73k0R2r5N9O1j78J59
2313A44k85K14j69Q4j10K66k29R0L09k27J63k17K00l34K89k71kk32K86J78k62
2334a15R6R5j04j37J43j53K68k33o6N02k45j59K08r1k10L40J38k22j36Q8j13M5
2356f1J6L9j58N0j52K35l07M13k17K50P2J9q8R9k88K38k02R7j47m1K75k0O9l92
2380b01J07R9m3j09J30j12K85J12j16r1l28O13j71L3mj32O1k17R9qK1k9j3J40
$$ plain form
2404 126 -6 -347 -9 -480 -111 121 -188 -242 111 -25 50 135 -328 97 -96 185 -156 117 -55 271 -100
2425 -100 194 -243 -28 237 1 93 -69 -7 -5 4 41 253 -257 -170 -149 -149 -131 -4 101 164 308 -208 -149 -27 -212
2450 -212 168 115 -348 150 -84 165 153 102 -2 93 167 -104 49 -134 -85 -129 37 -50 184 -189 -29 -156 131
2473 131 172 79 -30 -30 192 -157 -25 -271 -172 135 -69 -4 269 3 -130 124 108 80 -223 207 -120 82 84
2496 84 -106 74 -27 59 131 51 25 145 -33 50 -170 138 -57 120 -366 138 72 298 73 -59 247 -255
2518 -255 -202 -286 -56 2 20 100 24 143 126 281 221 -235 87 107 -6 -167 112 38 -97 3 -34 61 -138 116
2542 116 -38 -164 45 -128 180 8 -220 -118 248 -33 237 131 24 -83 14 290 281 -106 258 225 12
2563 12 -10 74 -68 -149 -166 -90 179 -322 -144 89 -358 -7 -18 146 -97 -69 18 25 -206 -7 146 -100 -62 -35
$$ packed form
2404A26j32l41L38m71L69K32l09n4L53j36P5Q5m63M25j93K81l41K73j72L26l71
2425a00K94m37K15K65k36R2j62O2KRL7K12n10Q7K1%J8J27J05O3J44n16N9J22j85
2450b12L80n3m63M98k34K49j2n1j04R5P4k71J53j83M9m4J66q7K34l73J60j27K87
2473A31M1r3j09%K22l49J32k46R9L07k04O5K73k66j33K54j6k8l03M30l27K02K
2496H4j90J80j01Q6P2q0k6J20j78Q3k20L08j95J77m86N04o6K26k25j32L06n02
2518b55N3q4K30N8J8Q0p6J19j7J55o0m56L22K0j13j61K79p4j35J00l7R5j99K54
2542A16j54j26K09j73L08j72k28J02L66k81K70j06j07j07R7K76rl87L64l3k13
2563A2k2Q4j42q1j7P6K69n01J78K33m47L51j1J64k43K8Q7Pk31J99J53k46L8K7
$$ plain form
2587 -35 -170 -48 -111 -124 -83 2 40 -160 32 -184 49 -87 -63 202 -209 136 316 -12 -195 -147 27 29 -251
2610 -251 207 275 -301 57 -7 227 244 428 126 282 -163 -338 -19 302 215 -187 23 146 54 -11 -123 22
2632 22 -151 258 212 -3 -39 154 269 155 -179 131 177 127 -6 -3 231 -11 -95 60 -15 -157 -134 -107 -75 -192
2656 -192 28 71 -295 4 23 133 -113 59 -158 -116 -325 40 224 -89 -181 21 201 58 115 -71 -110 233
2678 233 43 142 27 -353 81 48 -237 -83 -112 30 112 18 -16 103 27 -220 -6 195 6 -254 9 -68 -51
2701 -51 81 5 204 -276 -120 113 214 -80 128 -218 -131 42 22 8 247 1 27 139 -94 51 117 -23
2723 -23 182 -188 228 -22 214 67 403 169 206 -104 -96 -195 -175 -43 -89 -109 151 -6 -273 -71 -472 -122 202
2746 202 230 154 172 -29 21 -192 41 117 -436 -106 50 -15 -14 68 56 -518 82 166 -63 -168 -54 29 106 238
$$ packed form
2587c5j35J22o3j3M1Q5L8k00J92k16K33j36K4K65m11L45J80l28j83M8J74Kk80
2610b51M58O8n76L58o4K34J7J84l02J56m45j75L19L21q7m02K10J23r2o5j12J45
2632B2j73M09m6k15l6J93J15j14l34L10M6n0j33LK34k42q4J55p5j42K3K7L2j17
2656a92K20M3l66K99J9J10k46J72k17M2k09L65J84l13r2K02J80j43N7j86l9L43
2678B33j90R9j15l80M34l3k85J54k9J42Q2r4l4J19p6k47K14K01j89k60K63p7J7
2701e1J32p6J99m80J56K33J01k94K08l46Q7J73k0j4K39k46K6J12k33J45O6j40
2723b3K05l70M16k50K36j47L36k34L7l10Qr9K0J32m6k0K60j57k67K02m01L50L24
2746B02K8p6J8k01N0k13K33P6n53L30J56o5JQ2j2n74O00Q4k29j05J14Q3P7J32
$$ plain form
2770 238 -13 -205 -412 -209 -56 516 -83 -190 2 165 53 -218 82 -108 -282 -54 403 -128 -109 -31 206
2791 206 236 -258 -103 141 103 68 185 -7 94 -169 220 -55 -46 223 -106 22 -97 -156 72 -113 66 174
2813 174 30 179 91 253 -23 61 271 215 27 -71 -93 -365 -268 334 -45 110 280 -121 -74 121 65 171 74
2836 74 -174 -124 157 79 -164 -206 242 -86 148 -93 370 195 -43 140 141 -37 -261 166 -13 303 87 84 -35
2859 -35 -65 0 -264 173 134 147 -96 -44 87 81 -136 14 -74 243 -37 16 -132 -375 -329 26 337 -167 201 365
2883 365 29 45 -151 -31 31 -187 -1 -235 -136 -136 -243 123 -219 -153 63 -186 -225 -28 -78 -90 0 -111 259
2906 259 12 -67 -12 93 123 44 -181 -87 -5 102 -59 179 -106 -213 -81 -215 -136 -27 131 65 -91 -43 -4
2929 -4 144 60 262 147 216 31 -356 3 -58 71 195 -138 -205 166 -82 166 -11 117 149 186 -56 -343 177
$$ packed form
2770B38k51j92k07K03J53N72n99j07J92J63j12k71L00j90j74K28M57n31J9P8K37
2791B06L0m94J55K44l8l5J17j92J01k63L89k75RK69l29J28j19n9K28j85J79J08
2813A74j44J49q8J62k76Q4K10n6j88r8k2k72R7O02l79J55J70m01M7J95n6J06r7
2836G4k48N0K81p8k43m2M48l28K34k41M63j75k38J83Jj78k24M27j79L16k16lj19
2859c5l0O5k64M37l9J3k43N2J31ok17J50q8L17k80N3j48k43M6L55L11n04L68J64
2883C65l36J6j96J20O2k18J86k34R9%j07L66l42O6K16k49l9J97n0j2R0j11L70
2906B59k47p9N5J05L0p9k25R4Q2J07j61K38k85j07J32j34P9J09J58o6j56M8L9
2929dJ48q4K02j15O9j85l87L59o1J29J24l33o7L71k48K48j77J28L2L7k42k87N20
$$ plain form
2952 177 -82 -176 -313 38 162 -125 -117 98 231 81 -57 -146 -162 -126 65 122 -130 -23 36 41 271 224 58 31
2976 31 153 103 378 -69 -178 -3 -140 83 95 79 -86 97 44 -87 97 -43 197 112 -153 -239 -360 -44
2998 -44 36 -218 150 -152 157 38 74 18 383 178 -68 258 40 -31 93 -188 -115 62 -165 -120 57 186
3020 186 -167 -41 76 -113 -94 218 -136 39 7 71 271 -212 243 181 -69 92 -2 118 45 1 -182 163
3042 163 124 232 0 190 320 181 -64 -233 201 123 -81 60 214 1 250 -43 101 159 87 -59 -227
3063 -227 -75 -166 179 243 10 2 -124 -110 -209 -83 78 -86 -125 206 113 128 -49 -15 9 38 201 89 2 14 197
3088 197 -126 -124 134 207 123 -162 -21 62 -10 -198 -60 -44 55 -296 52 -36 -13 -116 -42 -184 -88 -216 77 166
3112 166 66 271 226 -26 63 -111 -43 -10 -133 -78 117 66 -220 33 -194 340 -323 -130 -1 -37 169 183 48
$$ packed form
2952A77k59r4j37L51J24k87QK15J33j50j38q9j6L6J91N7k52J07N9NK30m7j66k7
2976C1J22n0K75m47j09J75j37K23J2j6j65J83n3j31J84j40K40q5k65q6j21L16
2998d4Q0k54L68l02L09j19L6n6L65k05k46L26k18p1J24k81P3J77k27M5J77J29
3020A86l53J26J17j89J9L12l54J75l2O4K00m83M55o2k50J61r4J20p3m4j83L45
3042A63l9J08k32J90J30j39k45j69M34p8k04J41J54k13K49k93J44N8p2j46j68
3063b27J52r1L45O4k33qj26J4r9J26J61j64l9L31r3J5j77L4K4K9J63j12q7J2J83
3088A97l23KK58P3q4k85J41Q3p2j88J38J6R9l51L48q8K3j03P4j42R6j28K93Q9
3112A66j00K05m5k52Q9j74O8L3j23N5J95n1k86K53k27N34o63J93J29l6K06J4j35
$$ plain form
3135 48 -78 -10 -58 173 317 -214 105 225 67 83 -79 -110 -37 164 58 -37 -40 270 -124 -228 204 -29 -46
3158 -46 -15 77 -129 5 316 24 117 -203 -189 1 366 -318 -138 -239 -56 -261 78 -215 45 110 -24 -219
3180 -219 118 144 114 -113 -21 126 99 291 -85 -5 -276 142 187 280 -252 -182 -82 136 2 -108 415 -94 -198
3203 -198 -29 -278 82 -194 135 -240 -89 56 -200 233 -104 215 -154 -114 98 -288 19 -78 107 74 -87
3224 -87 -86 54 156 -26 221 19 -206 -15 210 -169 -1 155 180 -259 73 215 192 -17 -211 7 -118 148
3246 148 -45 142 199 207 52 -328 -133 229 -56 -168 -353 1 -21 -187 -1 -117 -116 64 104 -16 -50 -330 116
3269 116 25 110 4 129 95 -51 -10 302 -10 79 -192 214 130 -64 96 -220 -67 36 -39 73 21 -281 177
3292 177 -51 61 107 -32 46 10 231 87 -42 -44 125 47 58 23 8 -62 -95 -304 8 196 -236 22 43 -33
$$ packed form
3135D8j26O8m8K31J44n31L19J20j58J6j62l1P3K01j06r5lL10l94j04M32k33j7
3158d6L1R2k06J34L11k92R3l20J4J90L65o84J80j01J83k05L39k93K60O5j34j95
3180b19L37K6l0k27R2J47k7J92l76Q0k71M18M5R3n32P0J00K18j34j10N23n09j04
3203a98J69k49L60k76L29l75J51J45k56M33l37L19l69M0K12l86L07r7J85l3j61
3224h7JJ40J02j82K47k02k25J91K25l79J68J56K5m39L32J42k3k09j94K18j25K66
3246A48j93J87N7Qj55l80J95L62k85j12j85L54k2j66J86j16JJ80M0j20l4k80M46
3269A16r1Q5j06J25l4j46M1L12l12Q9k71M06q4j94J60l16J53J03p5J12n2l02M58
3292A77k28J12M6j39P8l6K21j44j29kJ69p8J1l5j5p0l3k09L12J88m32K58K1p6
$$ plain form
3316 -33 -104 -36 -6 29 166 159 159 110 218 80 -25 -89 0 -166 110 -92 -224 57 -112 3 -6 -26 39 90 -114 -7
3342 -7 -92 99 84 -362 -225 1 -95 241 41 242 118 69 49 -13 -153 205 -30 217 146 -48 9 107 -70 -142
3366 -142 -182 18 -133 232 -24 170 314 -108 142 -267 -61 28 -316 -26 -161 -346 -169 183 87 -192 5
3387 5 -73 -95 379 106 109 245 -298 -220 203 82 -181 103 -10 262 -236 42 -272 51 -1 -6 -97 95 -253 -68
3411 -68 37 17 233 44 271 30 -45 88 37 205 -230 206 -22 -34 -3 -142 291 -229 91 33 41 -18 43 38
3435 38 214 -30 -53 17 150 -73 -43 114 13 -52 40 -193 57 300 18 -115 -61 61 -246 -42 -224 316
3457 316 -18 -97 -55 15 160 74 -56 -149 100 169 -6 -198 90 -88 23 165 -9 233 -362 31 163 46
3479 46 -24 -84 194 154 -174 -275 4 -98 99 206 132 30 98 110 175 -55 268 128 214 -114 165 -115 -38
$$ packed form
3316c3p1O8L0L5J37p%m9J08j38j05o4Q9j66K76k02j32K81j69J15rk0O5N1k04J07
3342gq5J91j5m46J37K26r6L36k00K01j24m9k0o2j40L58k35K47p1j94N7R8j77p2
3366a42m0K00j51L65k56J94J44m22K50m09K06Q9l44K90j35j85J77L52r6k79J97
3387Ep8k2M74k73LJ36n43P8M23j21k63K84j13K72m98K78l14L23n2nr1J92l48J85
3411f8J05k0K16j89K27k41p5J33n1J68m35M36k28j2L1j39M33n20L20n8Qn9O1n
3435C8J76k44k3P0J33k23L0J57j01o5R2k33K50K43k82j33N4J22l07K04j82N40
3457C16l34p9M2P0J45q6j30r3K49O9j75j92K88j78J11J42j74K42n95L93J32j17
3479D6p0o0K78m0l28j01K79j02J97J07p4j02O8J2O5k30L23j40Q6l28K79k80P7
$$ plain form
3502 -38 135 -102 -117 -187 -25 -49 -114 -49 129 126 -39 55 154 15 -19 232 -71 -44 19 -13 182 -70 14 -254 209
3527 209 108 46 114 -36 -20 106 119 155 -26 3 42 55 19 252 -215 -31 -85 125 -50 -23 -123 -324 -38 222
3551 222 -147 497 -65 90 -170 161 84 81 -226 3 -222 -23 -146 -3 -14 -459 302 -141 83 -28 125
3572 125 -132 168 -128 157 61 -185 -119 -20 -125 -162 214 107 66 15 -271 -42 226 59 -85 80 171 304
3594 304 98 -48 204 -140 90 26 -52 -67 -66 95 22 -212 -57 -40 -154 55 1 61 -13 -36 62 269 57 36
3618 36 15 -42 75 -87 -163 195 345 -189 82 306 -130 -259 257 -111 333 24 72 -22 -7 -39 19 40 -238
3641 -238 -134 268 182 47 -191 -85 -26 210 110 -128 -94 -100 -213 96 92 297 -48 -2 -100 -45 -341 115 28 -112
3665 -112 127 -7 224 -92 5 -35 -141 -83 175 -50 52 -66 44 -264 -82 -292 -81 -37 73 43 -129 -10
$$ packed form
3502c8J73k37j5p0J62k4o5O5J78lj65R4R9j39l4K51l03K7O3l2J95k52Q4k68M63
3527B09j01o2O8j50J6J26J3L6j81K9L9J3l6K33m67J84n4K10j75K7j00k01K86K60
3551B22l69O44n62J55k60L31p7ll07K29k25J99j23J43j1m45P61m43K24j11J53
3572A25k57L00k96K85r6k46O6R9j05l7L76j07m1n1k86K29K68j67j44J65R1J33
3594C04k06j46K52l44K30o4p8j5JJ61p3k34J55J7j14K09n4O0p4k3R8K07k12k1
3618C6k1n7J17j62p6L58J50n34K71K24m36j29N16l68M44l09M8r4J5l2N8K1k78
3641b38J04M02q6j35k38J06N9K36j00k38L4oj13L09mK05l45M6r8N5k96M56q7j40
3665a12K39j34K31l16R7m0j06N8K58k25J02j18J10l08J82k10K11M4J10l0j72J19
$$ plain form
3687 -10 20 261 -72 33 123 233 -46 -15 30 100 -172 -20 219 -54 -326 -191 -83 116 184 110 111 213 -13
3710 -13 17 -247 211 19 136 6 -116 30 -3 -359 81 11 66 -127 25 117 -190 52 15 -289 -236 -19 131
3733 131 -257 -159 121 10 -3 -171 -145 -109 -6 -148 436 -55 100 78 35 -283 201 30 56 21 -183 150 -227
3756 -227 335 294 128 -111 -204 175 80 -192 -238 -31 -137 -32 -14 -182 6 -39 -79 186 -1 28 -7 -307 -124
3779 -124 203 -28 243 -19 52 147 -128 -11 140 168 62 -84 -188 159 -72 91 -85 -260 47 -4 332
3800 332 26 18 -29 168 218 -43 -214 70 -19 -50 -71 7 136 -55 -92 -54 255 30 -138 12 105 -101 338 -254
3824 -254 -28 -142 45 155 217 -45 -64 74 -125 45 40 64 -74 -178 423 77 12 -66 -86 -66 44 -60 47
3847 47 103 207 118 -26 54 97 61 -241 -91 -190 206 47 80 233 269 -126 -381 -252 106 61 105 -281 -29 231
$$ packed form
3687a0L0K41l33J05R0J10k79L1M5P0k72J52K39k73k72J35J08J99O8p4JJ02k26
3710a3L0k64M58j92J17j30j22J46l3l56M40p0N5j93J52R2l07K42l7l04N3K17J50
3733A31l88R8K80j11j3j68K6L6J03j42N84m91J55k2m3l18M84j71K6l5k04L33l77
3756b27N62m1j66k39r3L79r5k72m6K07j06J05J8j68J88m5m0K65j87K9l5l00J83
3779a24L27k31K71k62P1R5k75J17J51K8j06j46j04L47k31J63j76j75L07n1L36
3800C32l06qm7J97N0k61j71K84q9l1k1P8J29j91l7L8L09k25j68J50R3k06M39n92
3824b54K26j14J87J10O2k62j9J38j99J70nK4j38j04O01l46o5p8k0K0J10j04J07
3847D7N6J04q9j44Q0M3l6l02J50r9L96j59L3J53L6l95k55J29L58m5M4l86K52K60
$$ plain form
3871 231 -98 -66 -161 321 -270 -157 -112 266 -62 -56 -148 210 -27 218 -181 128 -179 -204 -182 79 -156 -224 79
3894 79 -61 -173 -282 24 -142 -76 30 427 108 54 -80 -79 -116 -38 -117 -80 -205 157 -23 95 135 189 -5 -75
3918 -75 185 85 -49 60 89 -206 28 -241 -52 -353 -11 0 -51 60 -30 57 -433 -113 62 119 -14 45 -153
3941 -153 -38 -245 -156 -133 14 247 -221 48 -31 -201 9 -211 181 281 132 63 137 -152 37 186 269 -277
3963 -277 -20 -25 135 -268 153 212 -302 118 0 9 -215 65 253 136 6 253 -22 -38 93 88 -36 137 -149
3986 -149 -209 -324 101 -68 355 151 120 193 281 170 -153 73 -181 -159 14 158 87 -290 210 -62 -223 -61
4008 -61 29 56 68 -158 81 -52 137 21 -48 -76 142 159 145 176 42 53 -139 -7 371 284 -3 37 14 -188
$$ packed form
3871B31l29L2r5M82n91J13M5L78l28Or2L58k37K45l99L09l07k5K2K61k35o8L03
3894G9j40j12j09L06j66O6J06L97l19n4j34Jl7P8p9L7j25L62j80J18M0N4j94p0
3918g5K60j00j34J09K9k95K34k69J89l01L42J1n1J11r0Q7m90L20J75N7j33N9j98
3941a53J15k07Q9K3J47K33m68K69p9j70K10k20L92J00j49o9P4k89J89J49Q3n46
3963b77K57nJ60m03M21N9n14M20j18Rk24K80J88j17j30K47k75j6J31nj24J73k86
3986a49o0j15M25j69M23k04l1P3Q8j11l23K26k54K2J73J44p1l77N00k72j61J62
4008f1R0K7J2k26K39j33J89j16o9k8K18J7j4L1j34J1j92J32L78q7k87M0k3k02
$$ [...]
8191B2
##END NTUPLES=NMR FID
##END=
