##TITLE=1H_DE-60k_D2O
 D2O
 8 sc, 
 2.7.2024
##JCAMPDX= 6.0         $$ Bruker NMR JCAMP-DX V2.0
##DATA TYPE= NMR FID
##DATA CLASS= NTUPLES
##ORIGIN= UXNMR, Bruker Analytische Messtechnik GmbH
##OWNER= root
$$ XWIN-NMR		Version 3.5
$$ Tue Jul  2 14:11:33 2024 Russian Standard Time (UT+4h)  she@DPX200
##.OBSERVE FREQUENCY= 200.131
##.OBSERVE NUCLEUS= ^1H
##.DELAY= (6, 6)
##.ACQUISITION MODE= SIMULTANEOUS
##.ACQUISITION SCHEME= undefined
##.AVERAGES= 8
##.DIGITISER RES= 18
##SPECTROMETER/DATA SYSTEM= spect
##.PULSE SEQUENCE= zg30
##.SOLVENT NAME= DMSO
##.SHIFT REFERENCE= (INTERNAL, DMSO, 0, 15.7039)
##AUDIT TRAIL= $$ (NUMBER, WHEN, WHO, WHERE, WHAT)
$$ ##TITLE= Audit trail, XWIN-NMR		Version 3.5
$$ ##JCAMPDX= 5.01
$$ ##ORIGIN= Bruker BioSpin GmbH
$$ ##OWNER= she
$$ F:/spectra/data/she/nmr/H-F/1/audita.txt
$$ ##AUDIT TRAIL=  $$ (NUMBER, WHEN, WHO, WHERE, WHAT)
(   1,<2024-07-02 14:10:05.87 +0400>,<she>,<DPX200>,
      <created by zg, POWCHK disabled, PULCHK disabled
       configuration hash MD5:
       00 E9 B6 7A A2 85 ED C7 34 08 36 98 17 FE 4E 26
       data hash MD5: 16K
       DD DF 05 53 E9 11 90 0F 1A 21 C0 12 98 21 13 0D>)
$$ ##END=
$$ 
$$ hash MD5
$$ AF A4 D2 73 A9 91 CA 0B FA 92 61 20 C4 1C D0 36
##$RELAX= 
##$RELAX= 
##$RELAX= 
##$RELAX= 
##$RELAX= 
##$RELAX= 
$$ Bruker specific parameters
$$ --------------------------
##$DU= <F:/spectra>
##$EXPNO= 1
##$NAME= <H-F>
##$PROCNO= 1
##$TYPE= <nmr>
##$USER= <she>
##$AMP= (0..31)
100 100 100 100 100 100 100 100 100 100 100 100 100 100 100 100 100 100 
100 100 100 100 100 100 100 100 100 100 100 100 100 100 
##$AQSEQ= 0
##$AQ_mod= 1
##$AUNM= <au_zg>
##$AUTOPOS= <>
##$BF1= 200.13
##$BF2= 200.13
##$BF3= 200.13
##$BF4= 200.13
##$BF5= 200.13
##$BF6= 200.13
##$BF7= 200.13
##$BF8= 200.13
##$BYTORDA= 1
##$CFDGTYP= 0
##$CFRGTYP= 5
##$CHEMSTR= <none>
##$CNST= (0..31)
1 1 145 1 1 1 1 1 1 1 1 1 1 1 1 1 1 1 1 1 1 1 1 1 1 1 1 1 1 1 1 1 
##$CPDPRG= <>
##$CPDPRG1= <>
##$CPDPRG2= <>
##$CPDPRG3= <>
##$CPDPRG4= <mlev>
##$CPDPRG5= <mlev>
##$CPDPRG6= <mlev>
##$CPDPRG7= <mlev>
##$CPDPRG8= <mlev>
##$CPDPRGB= <>
##$CPDPRGT= <>
##$D= (0..31)
0 1.2 0 0 0 0 0 0 0 0.06 0 0.03 0 0 0 0 0.0002 0 0 0 0 0 0 0 0 0 0 0 0 
0 0 0 
##$DATE= 1719915005
##$DBL= (0..7)
120 120 120 120 120 120 120 120 
##$DBP= (0..7)
150 150 150 150 150 150 150 150 
##$DBP07= 0
##$DBPNAM0= <>
##$DBPNAM1= <>
##$DBPNAM2= <>
##$DBPNAM3= <>
##$DBPNAM4= <>
##$DBPNAM5= <>
##$DBPNAM6= <>
##$DBPNAM7= <>
##$DBPOAL= (0..7)
0.5 0.5 0.5 0.5 0.5 0.5 0.5 0.5 
##$DBPOFFS= (0..7)
0 0 0 0 0 0 0 0 
##$DE= 6
##$DECBNUC= <off>
##$DECIM= 32
##$DECNUC= <off>
##$DECSTAT= 4
##$DIGMOD= 1
##$DIGTYP= 9
##$DL= (0..7)
0 120 120 120 120 120 120 120 
##$DP= (0..7)
150 150 150 150 150 150 150 150 
##$DP07= 0
##$DPNAME0= <>
##$DPNAME1= <>
##$DPNAME2= <>
##$DPNAME3= <>
##$DPNAME4= <>
##$DPNAME5= <>
##$DPNAME6= <>
##$DPNAME7= <>
##$DPOAL= (0..7)
0.5 0.5 0.5 0.5 0.5 0.5 0.5 0.5 
##$DPOFFS= (0..7)
0 0 0 0 0 0 0 0 
##$DQDMODE= 0
##$DR= 18
##$DS= 0
##$DSLIST= <SSSSSSSSSSSSSSS>
##$DSPFIRM= 0
$$ [...]
##$SUBNAM2= <"">
##$SUBNAM3= <"">
##$SUBNAM4= <"">
##$SUBNAM5= <"">
##$SUBNAM6= <"">
##$SUBNAM7= <"">
##$SUBNAM8= <"">
##$SUBNAM9= <"">
##$SW= 18.0517599122864
##$SWIBOX= (0..15)
0 0 2 0 0 0 0 0 0 0 0 0 0 0 0 0 
##$SW_h= 3612.71676300578
##$TD= 16384
##$TD0= 1
##$TE= 0
##$TE2= 300
##$TE3= 300
##$TEG= 300
##$TL= (0..7)
0 120 120 120 120 120 120 120 
##$TP= (0..7)
150 150 150 150 150 150 150 150 
##$TP07= 0
##$TPNAME0= <>
##$TPNAME1= <>
##$TPNAME2= <>
##$TPNAME3= <>
##$TPNAME4= <>
##$TPNAME5= <>
##$TPNAME6= <>
##$TPNAME7= <>
##$TPOAL= (0..7)
0.5 0.5 0.5 0.5 0.5 0.5 0.5 0.5 
##$TPOFFS= (0..7)
0 0 0 0 0 0 0 0 
##$TUNHIN= 0
##$TUNHOUT= 0
##$TUNXOUT= 0
##$USERA1= <user>
##$USERA2= <user>
##$USERA3= <user>
##$USERA4= <user>
##$USERA5= <user>
##$V9= 5
##$VALIST= <valist>
##$VCLIST= <CCCCCCCCCCCCCCC>
##$VD= 0
##$VDLIST= <DDDDDDDDDDDDDDD>
##$VPLIST= <PPPPPPPPPPPPPPP>
##$VTLIST= <TTTTTTTTTTTTTTT>
##$WBST= 1024
##$WBSW= 4
##$XGAIN= (0..3)
0 0 0 0 
##$XL= 0
##$YL= 0
##$YMAX_a= 47883
##$YMIN_a= -72055
##$ZGOPTNS= <>
##$ZL1= 120
##$ZL2= 120
##$ZL3= 120
##$ZL4= 120
##$ABSF1= 10
##$ABSF2= 0
##$ABSG= 5
##$ABSL= 3
##$ALPHA= 0
##$AQORDER= 0
##$ASSFAC= 0
##$ASSFACI= 0
##$ASSFACX= 0
##$ASSWID= 0
##$AUNMP= <proc_1d>
##$AZFE= 0.1
##$AZFW= 0.1
##$BCFW= 1
##$BC_mod= 2
##$BYTORDP= 1
##$COROFFS= 0
##$CY= 11.3945322036743
##$DATMOD= 1
##$DC= 2
##$DFILT= <>
##$DTYPP= 0
##$F1P= 15.6554695791079
##$F2P= 12.8336369535428
##$FCOR= 0.5
##$FTSIZE= 0
##$FT_mod= 4
##$GAMMA= 1
##$GB= 0.15
##$INTBC= 1
##$INTSCL= 1
##$ISEN= 128
##$LB= 0.24
##$LEV0= 0
##$LPBIN= 0
##$MAXI= 10000
##$MC2= 0
##$MEAN= 0
##$ME_mod= 0
##$MI= 1.114404
##$NCOEF= 0
##$NC_proc= 0
##$NLEV= 6
##$NOISF1= 3.799351
##$NOISF2= 2.8
##$NSP= 1
##$NTH_PI= 0
##$NZP= 0
##$OFFSET= 15.70392
##$PC= 1
##$PHC0= -25316.96
##$PHC1= 6.98748
##$PH_mod= 1
##$PKNL= yes
##$PPARMOD= 0
##$PSCAL= 0
##$PSIGN= 0
##$REVERSE= no
##$SF= 200.130013532006
##$SI= 16384
##$SIGF1= 3
##$SIGF2= 2
##$SINO= 400
##$SIOLD= 16384
##$SREGLST= <1H.CDCl3>
##$SSB= 0
##$STSI= 0
##$STSR= 0
##$SW_p= 3612.71676300578
##$SYMM= 0
##$S_DEV= 0
##$TDeff= 0
##$TDoff= 0
##$TI= <>
##$TILT= no
##$TM1= 0
##$TM2= 0
##$TOPLEV= 0
##$USERP1= <user>
##$USERP2= <user>
##$USERP3= <user>
##$USERP4= <user>
##$USERP5= <user>
##$WDW= 1
##$XDIM= 8192
##$YMAX_p= 0
##$YMIN_p= 0
$$ End of Bruker specific parameters
$$ ---------------------------------
##NTUPLES= NMR FID
##VAR_NAME=  TIME,          FID/REAL,        FID/IMAG
##SYMBOL=    X,             R,               I
##VAR_TYPE=  INDEPENDENT,   DEPENDENT,       DEPENDENT
##VAR_FORM=  AFFN,          ASDF,            ASDF
##VAR_DIM=   8192,          8192,            8192
##UNITS=     SECONDS,       ARBITRARY UNITS, ARBITRARY UNITS
##FACTOR=    0.0002768,     1,               1
##FIRST=     0,             0,               0
##LAST=      2.2672688,     0,               0
##MIN=       0,             -72055,          0
##MAX=       2.2672688,     47883,           0
$$ Real data points
##PAGE= N=1
##DATA TABLE= (X++(R..R)), XYDATA
0@%%%%%%%%%%%%%%%%%%%%%pJ5j6J6j6J6j6K2l0L2l2L9m7N0n7O3p1Q1q9J00j11
$$ 0 0 0 0 0 0 0 0 0 0 0 0 0 0 0 0 0 0 0 0 0 0 -7 8 -8 8 -8 8 -8 14 -16 16 -16 23 -24 26 -31 32 -39 42 -47 53 -58
42e8J22j35J49j64J81k00K21k44K70k96L24l58L97m39M87n44O09o85P78q93J038
$$ -58 64 -71 78 -86 95 -105 116 -128 142 -154 170 -188 209 -230 257 -287 322 -363 415 -478 560
63E60j228J487j868K479l620O477k7969m8373L7541M5425K8920J908l9066n2758
$$ 560 -668 819 -1049 1430 -2190 4287 -23682 -72055 -34514 10911 39831 41739 2673 -50085
77e0085k009L6841M1390K0758k3510n8725k3046L0883M1345K2920m303m1321m0860
$$ -50085 -52094 -15253 26137 46895 23385 -35340 -58386 -27503 13842 36762 32459 -8862 -49722
90d9722P347M0082L4086Q236l0974m5808r624L2374L7337J7708j6873m3664k4601
$$ -49722 -42375 -2293 31793 40029 9055 -36753 -46377 -14003 23334 41042 24169 -19495 -44096
103d4096J9299L7363K5992j953l7259l7825M439L6083L1919P610k6123m0705j2297
$$ -44096 -24797 12566 38558 36605 -654 -38479 -34040 2043 33962 41572 15449 -25256 -37553
116c7553K5252L5009K0214j1167m2014k9748J4182L7826K6502q98l2047l7232
$$ -37553 -12301 22708 42922 31755 -10259 -40007 -25825 12001 38503 37605 5558 -31674
128c1674l717K9681L4081J2836k1350m1969j8632K1711L4713J9734p922l4151
$$ -31674 -35391 -5710 28371 41207 19857 -22112 -40744 -19033 15680 35414 27492 -6659
140f659l0447M975L2292K8690L601k7084l5747p304K5394L0092J3286j4677l4253
$$ -6659 -37106 -32131 161 28851 32452 5368 -30379 -37683 -12289 17803 31089 16412 -17841
153a7841k0688J4251L1975K1152m750k9717k8412K736K8843K6547M066k1485l1242
$$ -17841 -38529 -24278 7697 28849 24099 -5618 -34030 -31294 -2451 24096 28162 6677 -24565
166b4565r943K1438K9921J4416j3114l1616k0399J2521L0243K0988l914k5976
$$ -24565 -34508 -13070 16851 31267 18153 -13463 -33862 -21341 8902 29890 25976 0
178@k7300j354K6503K8161O651k0620l0882j1614J8377K9310J5439j0248k9089
$$ 0 -27300 -28654 -2151 26010 32661 12041 -18841 -30455 -12078 17232 32671 22423 -6666
191f666k2559P082K8874K2553q01k3980k7619n085K2476K7329Q789j6252k8783
$$ -6666 -29225 -22143 6731 29284 28483 4503 -23116 -28201 -5725 21604 30393 14141 -14642
204a4642j5046J3053K7960J6782p301k5982k2310L109K4821K2381J357k0693k5222
$$ -14642 -29688 -16635 11325 28107 20806 -5176 -27486 -24377 444 22825 24182 3489 -21733
217b1733o782J8536K5572R805j3686k6318j4469J0996K5407J6446n489k3779k0587
$$ -21733 -28515 -9979 15593 25398 11712 -14606 -29075 -18079 7328 23774 18285 -5494 -26081
230b6081J685K2761K2714K072j9147k3981p430J6884K5507J0701j2058k4648j5672
$$ -26081 -24396 -1635 21079 23151 4004 -19977 -27407 -10523 14984 25685 13627 -11021 -26693
243b6693Q854K4712J8497l942k2584k1302l74K0738K3037M981j6588k4465r803
$$ -26693 -17839 6873 25370 21428 -1156 -22458 -22832 -2094 20943 25924 9336 -15129 -24932
256b4932J4341K4439J3124r299k3982j7021N538K2722J9116j396k0083k1435l583
$$ -24932 -10591 13848 26972 17673 -6309 -23330 -17792 4930 24046 22650 2567 -18868 -22451
269b2451J7933K2402O960j4291k3506j1261J1255K3038J3344p513k1460j6862
$$ -22451 -4518 17884 24844 10553 -12953 -24214 -12959 10079 23423 15910 -5550 -22412
281b2412K980K0775J8622L8j8223k0730m546J5981K1652Q010j2591k2565j2055
$$ -22412 -19432 1343 19965 20003 1780 -18950 -23496 -7515 14137 22147 9556 -13009 -25064
294b5064J0111K2468J4072n966k0566j7547J241K0293K0262J412j7504k0939n713
$$ -25064 -14953 7515 21587 15621 -4945 -22492 -21251 -958 19304 20716 3212 -17727 -23440
307b3440J4650K1919R782j0740k2233j3740P988K2603J5664m205j9466j7969j133
$$ -23440 -8790 13129 22911 12171 -10062 -23802 -15814 6789 22453 18248 -1218 -19187 -20320
320b0320J8295K0486M604j5656k0982q193J2709K1088J0960q485k0577j4672N169
$$ -20320 -2025 18461 23065 7409 -13573 -21766 -9057 12031 22991 14506 -6071 -20743 -15574
333a5574K0091J6850k185j7845j8104k163J5305J9613N677j3340k0326r360J0676
$$ -15574 4517 21367 19182 1337 -16767 -18930 -3625 15988 21665 8325 -12001 -21361 -10685
346a0685K0242J1131o712j9460j4769L380J8912J6504o11j6834j8294l250J4559
$$ -10685 9557 20688 13976 -5484 -20253 -16873 2039 18543 17932 1098 -17196 -20446 -5887
359e887J9288O506j2027j9412j0678Q991K0278J2842o142j8904j4598J573J7216
$$ -5887 13401 19907 7880 -11532 -22210 -13219 7059 19901 13759 -5145 -19743 -18170 -954
372i54J7843J666j5227j8731n730J3051K0007Q217r890j8731j1344N682J9142
$$ -954 16889 18555 3328 -15403 -21133 -8082 11925 20142 10252 -8479 -19823 -14141 5001
385E001J4540l407j7371j5708m37J5350J7732L617j2964j8137p062J0371J8952
$$ 5001 19541 16134 -1237 -16945 -17382 -2032 15700 19317 6353 -11784 -18846 -8475 10477
398A0477R820q117j7520j2344L881J7593J4620j628j6106j5636j792J3524J7198
$$ 10477 20297 12180 -5340 -17684 -13803 3790 18410 16782 676 -14960 -16752 -3228 13970
411A3970M841j1964j7360q292R253J8113J0691p236j7130j2697K785J6592J5398
$$ 13970 18811 6847 -10513 -18805 -9552 8561 19252 12016 -5114 -17811 -15026 1566 16964
424A6964n34j5543j6083l294J2953J7794N785j0900j7198r496P767J7621J2096
$$ 16964 16430 887 -15196 -18490 -5537 12257 18042 7142 -10056 -19552 -11785 5836 17932
437A7932n398j6449j3486J182J5186J5966J717j3723j6264m493J0551J7616P704
$$ 17932 12534 -3915 -17401 -16219 -1033 14933 16650 2927 -13337 -17830 -7279 10337 18041
450A8041q899j6738j0237N777J6161J2921k992j5206j3613m56J3333J5549L591
$$ 18041 9142 -7596 -17833 -12056 4105 17026 14034 -1172 -14785 -15241 -1908 13641 17232
463A7232j2062j6029n447Q889J6661Q718p442j6173j0225M347J5170J2725j533
$$ 17232 5170 -10859 -16306 -7417 9244 17962 10520 -5653 -15878 -11531 3639 16364 14831
476A4831j4578j4281j007J2550J5288M086j1074j5811o943Q380J6021R595n922
$$ 14831 253 -14028 -15035 -2485 12803 16889 5815 -9996 -16939 -8559 7462 17057 11135
489A1135j5975j1455L396J4320J2728L73j3022j4942k641J1390J4988N867r473
$$ 11135 -4840 -16295 -12899 1421 14149 14522 1500 -13442 -16083 -4693 10295 16162 6689
502F689j5594q071O758J5159J0180l310j4807j2529J351J3641J3611J486j1733
$$ 6689 -8905 -16976 -10218 4941 15121 11811 -2996 -15525 -14174 -533 13078 14564 2831
515B831j4443m096R668J4870O910p562j4394r499N217J4178J1109k175j3609j2826
$$ 2831 -11612 -15708 -6040 8830 15740 8178 -6216 -15715 -10498 3680 14789 12614 -995 -13821
529a3821N97J1850J3583K428r674j4752n221R043J4186P395o078j4446r697M088
$$ -13821 -13224 -1374 12209 14637 4963 -9789 -15010 -5967 8219 15614 9536 -4910 -14607 -10519
543a0519J3638J1166j426j2318j3208r54J1610J3280L656r017j4494o771P906
$$ -10519 3119 14285 12859 541 -12667 -13621 -2011 11269 14925 5908 -8586 -15357 -7451
556g451J4197P971m680j3599j0764K097J3366J1664J93j1559j3114k887J0057
$$ -7451 6746 14717 10037 -3562 -14326 -12229 1137 12801 12994 1435 -11679 -14566 -4509
569d509J3813M577p475j3626p889N934J3922Q881l395j2733j0802Q05J2094J1859
$$ -4509 9304 13881 6406 -7220 -15109 -9175 4747 13628 10233 -2500 -13302 -12497 -403 11456
583A1456J115r884j2717m120R315J2672N824o653j2629q259M424J3573R065k809
$$ 11456 12571 2687 -10030 -14150 -4835 7837 13661 7008 -5621 -13880 -9456 4117 13182 10373
597A0373j1489j0721l08J1634J1580J901r614j1841n187Q255J3638N548n941j2241
$$ 10373 -1116 -11837 -12145 -511 11069 12970 3356 -8485 -13672 -5417 8221 13769 7828 -4413
611d413q524L305J2783R799j848j0641j1258j763J0495J2409K710q461j1971n939
$$ -4413 -12937 -9632 3151 12950 11102 461 -10797 -12560 -2065 10344 13054 4593 -7378 -13317
625a3317O342J3173P423n028j1931r397J936J1941J0026j11j0048j0982k850R247
$$ -13317 -6975 6198 13621 8593 -3338 -12735 -10799 1142 11168 11057 1009 -9973 -12823 -3576
639c576J2058M067p668j1448o472M855J2665P704l799j0710r392N60J0882J0882
$$ -3576 8482 12549 4881 -6567 -13039 -8184 4481 12185 8386 -2324 -11716 -11156 -274 10608
653A0608N92r345j0780l676Q049J2310M678o769j0898p011M050J2192Q163k960
$$ 10608 11200 1855 -8925 -12601 -4552 7758 12436 5667 -5231 -12242 -8192 4000 12163 9203
667I203j0269r644k00R987J1375J138q897j0495m027O591J2213N813n814j0877
$$ 9203 -1066 -10710 -10910 -923 10452 11590 2693 -7802 -11829 -5238 6975 12788 6974 -3903
681c903p538K790J1322R159j776j0167r684j300R233J1213K611p845j0943m978
$$ -3903 -11441 -8651 2671 11830 10054 -113 -9797 -11097 -1864 9349 11960 4115 -6828 -11806
695a1806N528J1594O785m788j0438p995J376J0865R716p15r809r599k125Q295
$$ -11806 -6278 5316 12101 7313 -3125 -11120 -9744 1121 10837 10122 313 -9286 -11411 -3116
709c116J1095L532p316j0638n152M330J1608P269m157j0336p808R40R675R839
$$ -3116 7979 11511 4195 -6443 -11595 -7265 4343 11612 7455 -2881 -10689 -9749 -74 9765
723I765N50r183r519k838P536J0812M386o480j0242o135L873J1096P150k105j0236
$$ 9765 10315 1132 -8387 -11225 -3689 7123 11509 5029 -5213 -11348 -7475 3621 10771 8666 -1570
738a570q564L87R066J0093J114q171r746l243O038J0940N141n082j0377o775L261
$$ -1570 -10134 -9747 -681 9412 10526 2355 -7391 -10634 -4596 6344 11485 6403 -3974 -10749 -7488
753g488R957Q098j034r538r098m53P758J0049K680p384j0002m078N203J0258N985
$$ -7488 2469 10567 9533 -5 -9103 -9556 -1798 8251 10931 3547 -6455 -10533 -5330 4928 10913
768A0913l883r905p111J850R246Q243k73q513r090j673P450J0261K946o762r421
$$ 10913 7030 -2875 -9986 -8136 1110 9353 9080 567 -8523 -10196 -2746 7515 10461 3699 -5722
783e722m978M370J0145O358l276r776p027J488Q714Q384L13p714q976k789P106
$$ -5722 -10700 -6330 3815 10173 6897 -2879 -9906 -8418 296 8680 8993 1279 -7697 -10486 -3380
798c380R783L731n256r601n585L581J0032O603k062r067q077O20Q418Q589J312
$$ -3380 6403 10134 4878 -4723 -10308 -6727 3305 9908 7846 -1221 -9298 -8678 -260 8329 9641
813I641p306r027l270N972R538M591m522r564n738L163Q840O974j524q157p904
$$ 9641 2335 -6692 -9962 -3990 5548 10139 5617 -3947 -9685 -6522 2318 9292 7768 -389 -8293
828h293o92P479R168J896o427r055l716N212R225N213m368q665o452K526Q417
$$ -8293 -8985 -1506 7662 9558 3131 -5924 -9640 -4428 4797 10010 5642 -3023 -9475 -6949 1468
843A468P453p78q439p602j204O729R303K475n775r313l865M283Q658O011l244
$$ 1468 8921 8143 -296 -7898 -9102 -2373 6930 9405 3630 -5683 -9548 -5265 3393 9404 6160
858F160q766o427J620P697Q013mp249q332j851O062Q857L693n500q493m610L641
$$ 6160 -2606 -9033 -7413 284 8297 8293 1044 -7288 -9139 -3077 5780 9473 3973 -4520 -9130 -5489
874e489Q720N542k202p900o983J83Q005P796R32o625q136k565N303Q637M351m582
$$ -5489 3231 8773 6571 -1329 -8312 -8129 -124 7672 8604 1979 -6157 -8722 -3419 5218 9569 4987
890D987q498n095K780Q187O131j230p803o933l78O960P825J489o042p844k963
$$ 4987 -3511 -8606 -5826 2361 8492 7262 -541 -7474 -7852 -892 6933 8422 2380 -5464 -8427
905h427M451Q355M509l591q275n636K499P674O129l05p471p232q59O564P971J803
$$ -8427 -3976 4379 8888 5297 -2978 -8614 -6115 1559 7688 7383 -88 -7320 -8179 -1615 6356 8159
921H159m999q450l468L929Q491M584k408q190n899J421P397O675K50o824p392
$$ 8159 3160 -5290 -8758 -4829 3662 8246 5838 -2352 -8251 -6830 567 7242 7492 668 -6724
936f724j360N466Q049K864m556q110m326L689P786N505k201p612o480J022O836
$$ -6724 -8084 -2618 5431 8295 3739 -4371 -8697 -5008 2778 8283 6082 -1530 -8010 -6988 -152
951a52P109Q79o126p518k111N513P320L155l637p971m382K970P289N471j106p306
$$ -152 6957 7836 1710 -5808 -7919 -2406 4914 8069 4432 -3539 -7921 -4951 2338 7809 6703 -603
967f03o317L38N999P179J061n415p684k720M871P511L765l091p889m954K331P303
$$ -603 -6920 -6582 -583 6596 7657 2242 -5442 -8162 -3291 4220 7985 4894 -2995 -7949 -5618 1685
983A685N517n81o694o617p02O078P254J731m879p770l080M138P496L748k478p019
$$ 1685 7202 6621 -73 -6690 -7392 -1314 5940 7671 2792 -4978 -8058 -3920 3576 7324 4846 -2173
999b173n257J109P083O090j06o210o685j596N741P032K576m092p784l662L662
$$ -2173 -7430 -6321 762 6852 6746 536 -6149 -7745 -2004 5028 7604 3512 -4272 -7934 -4272
1014d272P068M425j589o982n541P30O343O366L97n818o644j569M676P007K845
$$ -4272 2796 7221 5632 -1350 -6891 -6161 182 6548 6945 1127 -5517 -7086 -2410 4597 7442
1029G442l377p269m148K618P149M819j398o178o348K63O013O379J162n299o775
$$ 7442 4065 -3204 -7352 -4734 2415 7234 5836 -342 -6690 -6427 -414 5965 7127 1828 -4947
1044d947k362M116P223L123k926o972m455K026O978M979o44n988o483l97N603
$$ -4947 -7309 -3193 4030 7153 4227 -2745 -7200 -5174 1804 6783 6139 151 -6332 -6729 -1126
1059a126O478J496m832o515l048M003O529M027k463o600n209J782O375N421k06
$$ -1126 5352 6848 2016 -4499 -7547 -3544 2985 7012 4549 -2051 -7260 -5478 897 6318 6112
1074F112n624o427q95N097O675J988m056o645l479L352O693M038k010o195n356
$$ 6112 488 -5939 -6834 -1737 4938 6926 2870 -3775 -7254 -3902 2791 6829 4819 -1376 -6732
1089f732R97O053N844J46n152o306j625M725O434K495l508o422l956K552O595
$$ -6732 -5735 318 6162 6308 1156 -5150 -6775 -2050 4384 6879 3371 -3051 -7007 -4455 2140
1104B140M445j370n987n141J11N343O133R26m851o501k182M485O269L132l008
$$ 2140 6585 5215 -772 -5913 -5802 -459 5674 6600 1749 -4752 -6934 -2449 3820 6952 3944
1119C944o642m209K038O286M816j083n353n630k94M889O092J462m489n790k666
$$ 3944 -2698 -6907 -4869 1417 6233 5150 -203 -5833 -6127 -1238 4854 6316 1827 -3963 -6629
1134f629L504O229L135k198n952m454J006O213N015k25n436n418r23M455O223
$$ -6629 -3125 3104 6239 4041 -1911 -6365 -5359 854 5869 5644 208 -5210 -6133 -1678 4545
1149D545J604l531o276k870K893O384L570k043n887m522J160N030N647l24m837
$$ 4545 6149 2618 -3658 -6528 -3635 2749 6319 4276 -1611 -6133 -4973 57 5704 5380 543
1164E43n313j399M153O017K462l560o029l175K149O140M346j506n577m876O5N092
$$ 543 -4770 -6169 -2016 4001 6463 2903 -3126 -6301 -4152 1988 6334 4828 -749 -5625 -5560 -468
1180d68N723Q27m644n818j889L870N743L114l083n660l525J663N401M539p92n364
$$ -468 5255 6082 1438 -4380 -6269 -2399 3344 6458 3375 -2285 -5810 -4147 1254 5793 5001 -363
1196c63m827k38M632N439J271m080o027j840L044N809L359k371n832l814J318
$$ -363 -5190 -5428 -796 4643 5914 1834 -4193 -6033 -2989 2820 6179 3808 -2024 -5838 -4520
1211d520N299M748m76n012n120o50M594N404J539l497n599k723K595O055L455
$$ -4520 779 5527 5051 39 -5081 -5731 -1137 4267 5806 2309 -3290 -6013 -3418 2637 6092
1226F092j919n974l898J278M778M750K03m904m794j128L685N602K130l056n894
$$ 6092 4173 -1801 -5699 -4421 357 5107 5310 406 -4388 -5516 -1831 3771 5901 2845 -3049
1241c049k677K283N244L668j133n323m457Q01M393M890P42m174n042j587L184
$$ -3049 -5726 -3443 1801 5469 4336 -987 -5444 -4643 -250 4640 5382 1208 -3834 -5421 -2237
1256b237N540K503k657n498l078J763M970M088n68n372m626L46M292M386J735
$$ -2237 3303 5806 3149 -2349 -5427 -3664 1306 5394 4826 -546 -5172 -4826 -534 3852 5587
1271E587m004n238j786K794N187K941k270m979l761J854M776L799k19m600m671
$$ 5587 1583 -3655 -5441 -2647 2540 5481 3211 -1768 -5529 -3675 1101 4900 4681 81 -4590
1286d590o35L955N063J613l630m919k415L002M768L051j484m844m516J598M297
$$ -4590 -5225 -1270 3793 5406 1776 -3143 -5558 -2556 2212 5263 3779 -1065 -5581 -3983 314
1301C14M134M91m464m637q84L493N076J886l109n164k385K246M815L622j383m808
$$ 314 4448 4939 475 -4162 -5046 -1553 3523 5409 2300 -2864 -5249 -3003 1812 5434 4051 -757
1317g57m269P96M074M506O28m026m645j397L136N020K301k535n284k705J642M943
$$ -757 -5026 -4230 -156 4350 4978 952 -3693 -5090 -1954 3066 5367 2832 -2452 -5157 -3515 1428
1333A428L406o12m695m141K4M125M512Q35l447m778j813K826N220K046k139m816
$$ 1428 4834 4222 -473 -4614 -4590 -465 4047 4882 1435 -3343 -5156 -2330 2890 4936 2797 -2019
1349b019l227J616M583L271J42m052m595m49L906M607R84l008m814j890K462M746
$$ -2019 -5246 -3630 953 4224 4366 314 -4281 -4730 -824 3783 4767 1759 -3055 -4945 -2483 2263
1365B263K817j373m846l666J080M017L933J5l757m635n00L225M729J898k790m942
$$ 2263 5080 3707 -1139 -4805 -3725 292 4225 4240 483 -4152 -4652 -1427 3302 5200 2410 -2532
1381b532k328K148M223L409j301m557l355K44M271L889J75l181m615j173K983
$$ -2532 -4860 -2712 1511 4920 3619 -938 -4293 -4049 222 4111 4286 1105 -3510 -4683 -1700
1396a700M337K094k330m673k586J708M501L134m20m567l937M81L497M243R52l391
$$ -1700 2637 4731 2401 -2272 -4858 -3150 1351 4485 4065 -502 -4439 -3958 -461 3782 4734 1343
1412A343m738j199K658M184K465j925m645l060J580M413L388n14m198l888k3L414
$$ 1343 -3395 -4594 -1936 2248 4713 2788 -1857 -4917 -3337 1076 4464 3950 -248 -4136 -4159 -745
1428g45M057J224k772m486k028K389M421K631j911m222k926J062L783L382L84
$$ -745 3312 4536 1764 -2722 -4750 -2361 2060 4691 2780 -1442 -4368 -3306 477 3859 4243
1443D243m170l904n75L010M676J341k566m478j987J459M571K797j098m278l423
$$ 4243 73 -3831 -4406 -1396 3280 4621 2055 -2423 -4410 -2951 1620 4417 3319 -959 -4382
1458d382R44L677L424M61l563m004j108K926M310K004k253m423k529J643M011
$$ -4382 -3438 239 3663 4124 561 -3443 -4551 -1625 2685 4689 2436 -1987 -4516 -2873 1138
1473A138L337j163l736l709K10L772L536P32l060l931j462K415M341K032j814
$$ 1138 4475 3312 -424 -4133 -3923 -151 3385 4117 1057 -2874 -4336 -1921 2420 4452 2638
1488B638m264k694J261L951L214l60l806l967L5L363L724J247l018m280j472K430
$$ 2638 -1626 -4320 -3059 892 4106 3746 -60 -4027 -3992 -629 3095 4342 1324 -2956 -4428 -1998
1504a998M035J941j165l930l014R64L891L047J87l683l694n31K912M049J045k350
$$ -1998 2037 3978 2813 -1117 -4131 -3167 724 3771 3958 275 -3419 -3950 -1038 3011 4056 1706
1520A706l904k055J910M288K329j389l712l104L49L663L579K92l016m166r61K698
$$ 1706 -2198 -4253 -2343 1945 4274 2885 -827 -3931 -3582 81 3660 3952 936 -3230 -4191 -1493
1536a493L946J580j973l832k072J058L937K985j123l534l038L26K991L407R38
$$ -1493 2453 4033 2060 -1772 -3844 -2786 1151 4136 3013 -521 -3559 -3233 -242 3165 4103
1551D103l058l985j260K552L629K171j844l741k852J104M195K605l87l374l227
$$ 4103 1045 -2940 -4200 -1648 1981 4152 2308 -1433 -4285 -3181 1014 3619 3232 -142 -3369
1566c369k63K799M035N49k425l687j682J974L759K539j760l822k474P03L895K925
$$ -3369 -3632 -833 3202 3751 1326 -2361 -4043 -2069 1690 4229 2469 -1353 -3827 -3124 771 3696
1582C696k77l125l326p78K802L644J421k359l743j962J695M192K142j420l630
$$ 3696 3419 294 -3032 -3810 -1008 2636 4057 1698 -2045 -4007 -2312 1880 4022 2602 -1028
1597a028k461L79L240L637k83l094l273q21K374L515J576j889l615j976J304L490
$$ -1028 -3489 -3110 130 3767 3484 390 -2883 -3704 -1330 2185 3761 1872 -1743 -3719 -2415 1075
1613A075K702o47l839k823M68L039L243L73k660l481j290K487L465J822j961l475
$$ 1075 3777 3130 -709 -3532 -3064 -25 3218 3591 931 -2550 -3840 -1353 2112 3934 1973 -1502
1629a502k315J136L634K620m51l200l030n61L071L769P79l008l288j370J887L599
$$ -1502 -3817 -2681 953 3573 3122 -78 -3108 -3669 -598 3171 3950 942 -2346 -3716 -1829 1770
1645A770J981j320l821k012O62L259K881j06l147k975q99K893L642P24k105l582
$$ 1770 3751 2431 -1390 -3402 -2740 519 3400 3294 147 -2828 -3727 -834 2808 3532 1427 -2155
1661b155j521J614L338K597j176l402k560N6L537K896J81l009l067o55K108L272
$$ -2155 -3676 -2062 1276 3873 2697 -705 -3265 -3209 328 3224 3405 396 -2671 -3326 -1218 2054
1677B054J355j669l416k025J220L552K534p01l491k512l15K941L327N93k642l038
$$ 2054 3409 1740 -1676 -3701 -2481 1071 3605 2904 -587 -3099 -3414 -473 2854 3447 805 -2233
1693b233j221J900L305J864j499l644j819O67L256K835k00l698k668K51K389L274
$$ -2233 -3454 -1554 1751 3615 2116 -1528 -3347 -2680 576 3411 3211 -487 -3155 -2904 -515 2759
1709B759O89k455l090j381J778L328J851j165l361k363P44K976K933j03l087k888
$$ 2759 3448 993 -2097 -3478 -1700 1628 3479 2314 -1047 -3410 -2666 310 3243 3140 53 -2835
1725b835l18K336L307J082k092l383j353J576L134J915r80l221k184M11K772K527
$$ -2835 -3153 -817 2490 3572 1480 -1903 -3256 -1680 1454 3369 2389 -832 -3016 -2605 167 2694
1741B694O90l052k962l69J789L483J177j912l170j664J330L198K042n27l269k632
$$ 2694 3384 332 -2630 -2999 -1210 2273 3450 1538 -1632 -3296 -1966 1232 3274 2747 -522 -3154
1757c154M55K355L012O38k477l052r65J674L065J845j855l022j970J125L042K223
$$ -3154 -2699 -344 2668 3306 829 -2223 -3188 -1514 1551 3396 1541 -1481 -3451 -2326 716 2939
1773B939m35k629k661M3K344K962Q20k529k963j268J779L053J711j204k924k268
$$ 2939 2504 -125 -2786 -2743 -399 2563 3383 854 -2109 -3377 -1598 1455 3166 1962 -962 -3230
1789c230Q57K748K562k80k572k790l09K309L047P33j791l212j197J408L324J601
$$ -3230 -2373 375 2937 2657 85 -2705 -3014 -705 2342 3075 1284 -1928 -3125 -1717 1607 3208
1805C208r51k867k529O51K607K302K26k274k738q08K365K815Q53j215l225j493
$$ 3208 2257 -610 -3139 -2488 119 2421 2647 373 -2365 -3173 -808 2007 2860 1645 -1580 -3073
1821c073J224K967J973p48k754k474MK579K834N34k237k796j105J886L005J396
$$ -3073 -1849 1118 3091 2343 -411 -2885 -2881 -302 2532 3066 829 -1967 -3072 -1186 1819 3215
1837C215j720k838j877R80L405J686n07k621k062n69K403L054J32k046k570j391
$$ 3215 1495 -1343 -3220 -2240 1165 2851 2344 -277 -2339 -2908 -505 2549 2681 635 -1935 -3326
1853c326J826L248J178j197k865j618K88K952K251j40k442k858K2K101K615R44
$$ -3326 -1500 1748 2926 1729 -1136 -2754 -2466 486 2737 2597 155 -2703 -2681 -580 2035 2979
1869B979k019k678j283J301K936J720q49k905j951K55L019K020Q4k204k670o28
$$ 2979 960 -1718 -3001 -1700 1236 2956 2107 -798 -2749 -2494 525 2545 2629 425 -2245 -2873
1885b873J965L016P76j681k684j534J027K928K088q31k753k102JK283K725M88
$$ -2873 -908 2108 2884 1203 -1481 -3015 -1988 940 3028 2197 -556 -2658 -2657 -374 2351 2839
1901B839k325k347j016K051K236J433j476k676j592P58L255J495n02k385k151
$$ 2839 514 -1833 -2849 -798 1438 2871 1395 -1281 -2873 -2115 1140 2635 2133 -252 -2403
1916b403l5K065K780L67j823k722r98J593K837R92r13k705k012R13K657J789j17
$$ -2403 -2438 -373 2407 2774 951 -1771 -2769 -1176 1661 2653 1740 -965 -2977 -2064 593 2382 2265
1933B265k179k431k29K018K672N94j651k781j154J512K623J446o98k947j741N51
$$ 2265 86 -2345 -2574 -556 2116 2710 1059 -1722 -2876 -1364 1259 2705 2007 -940 -2681 -2130
1949b130K466K082k0j913k763o73K272K378J081j495k827j018Q12K692J671o48
$$ -2130 336 2418 2398 485 -2278 -2951 -679 1699 2780 1285 -1542 -2560 -1748 944 2615 1967
1965A967k435k103J69K517K180Rj854k557n32J604K621J082j185k782j354Q25
$$ 1967 -468 -2571 -2402 115 2295 2304 450 -2107 -2639 -1035 1586 2668 1483 -1299 -2653 -1828
1981a828K675J670o61k208k091J62K049K129O21j631k566j100J634K593J038r14
$$ -1828 847 2517 1856 -352 -2443 -2281 -232 1897 2518 887 -1679 -2779 -1145 1448 2486 1572
1997A572k427j455J82K469K200k79k059k615k13K375K208P60j459k824j097J459
$$ 1572 -855 -2310 -2128 341 2541 2262 203 -2412 -2625 -250 1958 2718 1259 -1565 -2662 -1203
2013a203K304J576r59k561j947O95K296K210p5k166k189o00J888K133J191j555
$$ -1203 1101 2677 1718 -843 -2790 -2095 201 2411 2336 170 -2019 -2619 -731 1402 2593 1038
2029A038j962j667J115K330J555o23k337j902K20K237K599m52j503j929j115J529
$$ 1038 -924 -2591 -1476 854 2409 1786 -551 -2453 -2233 4 2603 2151 648 -1281 -2396 -867
2045h67K539Q54j444k178j701Q54K794J518l87k348j790o5J865K347N07j810k262
$$ -867 1672 2526 1082 -1096 -2797 -1943 851 2369 1982 -366 -2156 -2221 -356 1991 2498 688 -1574
2062a574r57J478K356J211j312k028j975J010K433J624l2k522j840J54J750K309
$$ -1574 -2531 -1053 1303 2514 1202 -826 -2801 -1791 642 2266 2234 -288 -2128 -1974 -224 2085
2078B085M57j322k616j067J385K437J058m84k693j474K98K339J880j82j931k047
$$ 2085 2542 1220 -1396 -2463 -1078 1359 2417 1933 -760 -2234 -1936 403 2283 2101 170 -1877
2094a877l77J695K092Q48j450k080j178R40K180J534m51k263j704J52K157J688
$$ -1877 -2254 -559 1533 2381 931 -1149 -2327 -1387 793 2327 1876 -387 -2091 -1939 218 1906
2110A906J1j599k009p64J613K359N77q93k231j501Q48K158J656k20k137j657l2
$$ 1906 1917 318 -1691 -2455 -842 1517 2094 1201 -1030 -2531 -1683 475 2131 1911 -226 -1883 -1915
2127a915J953J853K75j714j842j067J662K137J161j293j957j677J085J973J649
$$ -1915 38 1891 2166 452 -1390 -2457 -795 1342 2503 1210 -747 -2424 -1339 634 2283
2142B283kk574j743j08J961K058M41j438j948j170R49K270J570j291j805j495
$$ 2283 2281 -293 -2036 -2144 -183 1875 2316 878 -1070 -2240 -1291 979 2549 1258 -547 -2042
2158b042K52K085J748r3j799k146QJ474J894P99j219j989j146P40K173J578r84
$$ -2042 -1790 295 2043 1950 151 -1995 -1987 -513 1381 2180 961 -1028 -2174 -1434 739 2317 1333
2175A333j784j664L37K003J641K17j978j415p46J496J702J068j023k131j220P69
$$ 1333 -451 -2115 -1778 225 1866 2083 105 -1310 -2056 -560 1142 2210 1187 -944 -2164 -1395
2191a395J973J653q71j835j446J02J471K273R1j486k032q04J566J780J005r05
$$ -1395 578 2231 1360 -475 -1921 -1819 -348 1925 2016 530 -1502 -2306 -740 1040 2045 1140
2207A140k440q09O46K005J565m71j852j424k22J589J846L07j340j870m86P64J955
$$ 1140 -1300 -2109 -1463 542 2107 1636 -216 -1640 -1862 -273 1573 1880 540 -1330 -1816 -1052 903
2224I03J104m78k295j305L81J721J504L07j573k067l70J838J775N06r55k300o83
$$ 903 2007 1529 -766 -2071 -1690 31 1535 1842 269 -1798 -2168 -330 1445 1951 996 -1304 -1987
2241a987Q30J814J152l44j814j716K14J830J656M94k025j648n45J542J690Q18
$$ -1987 -1157 657 1809 1465 -349 -2065 -1851 -21 1635 2129 104 -1544 -2089 -547 1143 1961
2257A961j059k077j095N60K328J454l31k138j303NJ733J494L99j469j747p46J239
$$ 1961 902 -1175 -2270 -1710 618 2072 1741 -397 -1700 -1695 38 1532 1931 462 -1285 -2031 -792
2274g92J753R58q94j805j257N65J845J189l5j614j566p9J510J716N84j404j665
$$ -792 961 1919 1025 -780 -2037 -1472 373 1562 1527 -87 -1653 -1732 -222 1494 2078 674 -991
2291i91q66Q93K088J142j173j628j050j4J823J523j45j621j832j32J704J655M73
$$ -991 -1857 -964 1124 2266 1093 -535 -1585 -1599 224 1747 1602 -19 -1851 -1983 -279 1376 1849
2308A849j193j494j075N56K051J331n81j959j259J22J631J876j39j486j780m29
$$ 1849 656 -838 -1913 -1357 694 2025 1444 -515 -1774 -1652 -21 1855 1716 230 -1550 -1979
2324a979J298J893O54j047j559j215R60J586J367m63j885j174j9J593J653K14
$$ -1979 -681 1212 1866 819 -740 -1955 -995 591 1958 1495 -390 -1564 -1583 10 1663 1877
2340A877j411k070j83J151J620Q44r78j642j578J152J495J668n27j423j731L66
$$ 1877 466 -1604 -1787 -636 984 1828 850 -792 -2370 -1218 277 1945 1418 -5 -1736 -1370
2356a370J248J466O68j617j477q42J220J651R83n91j833j389L11J932J308j74
$$ -1370 -122 1344 2012 395 -1082 -1924 -704 947 1930 1339 -494 -1883 -1572 360 1668 1494
2372A494j315j580k82J369J464N44p87j792p40P03J612J333p29j763j445N11J643
$$ 1494 179 -1401 -1683 -314 1150 1694 907 -885 -1625 -922 690 2023 1294 -469 -1914 -1403 240
2389B40J246K71j710j407l49J042K006L39q69j575j139O93J981Q25m82j390j330
$$ 240 1486 1757 47 -1360 -1709 -667 1339 1678 809 -766 -1905 -1212 769 1594 1112 -278 -1608
2406a608J28J377J405M41j293j612l20R78J733M81o51j786j058Q66J626R42n65
$$ -1608 -1480 -103 1302 1743 450 -1162 -1482 -504 1229 1710 1059 -727 -1785 -919 707 1649 1084
2423A084j405j539M11J051J621K02j122j338p28P64K006O28n78j617j098K30J672
$$ 1084 -321 -1860 -1449 -398 1223 1425 303 -1035 -1763 -999 1007 1635 1057 -560 -1658 -1428 244
2440B44J352J02j638j451k35J248J426N28r17j549q77P59J645J156o14j385j537
$$ 244 1596 1698 60 -1391 -1626 -378 1048 1576 659 -890 -1767 -1008 637 1793 1179 -206 -1743
2457a743J01J712J633l21j011j660l37J170J435M41n43j553q30M92J363J125j39
$$ -1743 -1642 70 1703 1382 371 -1289 -1626 -456 979 1420 877 -676 -1506 -1014 349 1474 1335
2474A335j372j530J75J340J298K48r98j480m41O49J740L45m64j305j312O52J448
$$ 1335 -37 -1567 -1392 -52 1246 1494 496 -984 -1425 -776 964 1309 845 -460 -1772 -1120 328
2491C28J109p4j371j257l01J536R26Q17j190j455m63O26J487J092o29j632j542
$$ 328 1437 1363 -8 -1265 -1566 -30 896 1713 523 -932 -1395 -769 718 1810 1181 -451 -1993
2508a993Q17J530J070k0j316j704L43P94J563N70j097j331r07R49J656Q01n96
$$ -1993 -1176 354 1424 1404 88 -1616 -1273 -479 1084 1654 557 -774 -1681 -732 924 1725 1129
2525A129j577j156L02J580J085N8j169j379m02J099J599M00j085j379m11J66J300
$$ 1129 -448 -1604 -1302 278 1363 1421 252 -1127 -1529 -430 1169 1569 484 -895 -1306 -1140 160
2542A60J366m34j208j098p5J413J206J99j367j220l85P84J475M92p34j390o33
$$ 160 1526 1092 -116 -1214 -1289 124 1330 1529 162 -1058 -1443 -659 816 1308 574 -816 -1449
2559a449M43J443R51j02j601j186JJ381J408K26j417j027l73L85J954L57q24j052
$$ -1449 -1006 437 1388 1286 -315 -1501 -1500 -119 1289 1515 98 -929 -1302 -917 1037 1394 570 -482
2577d82j025N50J265J033j62j214j071j79J109J193M07q61j314n00L62J541Q36
$$ -482 -1507 -957 308 1341 1179 -35 -1106 -1285 -176 1017 1424 563 -751 -1251 -889 652 1488
2594A488j07j572j260L99J347J011N8j259j339PQ93J262P26j028j388p73O77J259
$$ 1488 1381 -191 -1451 -1052 295 1306 1364 105 -1234 -1227 -334 928 1654 626 -762 -1535 -858 401
2612D01R74l72j121j251J75J467Q85p4j018q13l03N32J219P79o89j412q25Q30
$$ 401 1375 1003 -118 -1369 -1194 273 1158 1084 66 -747 -1050 -518 701 1480 791 -621 -1446 -616
2630f16R51J462o71j198j163J15J270J049O9r75j257m91J124J152N42n01j685
$$ -616 335 1797 1126 -72 -1235 -1120 150 1199 1268 293 -964 -1455 -331 821 1363 862 -823
2647h23n34K86J364P40Q8j253j143R5R38J203J87n75j549l13O01J214Q37o32j214
$$ -823 -1357 -1071 293 1033 1121 -132 -1275 -1180 -242 961 1148 573 -976 -1289 -688 526 1363 731 -483
2666d83j180Q16R32R87L44j358j042k03J053R26O22p12j332p87N16J408R09n00
$$ -483 -1663 -847 85 1072 1416 58 -984 -1187 -134 792 1414 702 -630 -1417 -901 507 1416 916
2684I16j222j294M21J094J455P8j211j083j42M34J386O10q53r92r57N98R98J149
$$ 916 -306 -1600 -1179 -85 1370 1448 237 -846 -988 -554 832 1442 589 -403 -1360 -762 236 1385
2702A385m8j614r87M2R53J287M16r40j373m27P05J128P19l15j239j048M21J111
$$ 1385 1337 -277 -1264 -1222 -269 1018 1434 494 -879 -1306 -601 527 1246 931 -308 -1356 -935 176
2720A76J070l0j292j207o8J426Q10J89q01p94p33L99J479M37l69j066p27M6J090
$$ 176 1246 1216 -76 -1283 -1351 75 885 1074 273 -521 -1254 -855 624 1061 692 -374 -1101 -1055 35
2739C5R90J72j030j137n99J239J051N80o34j382l90M66J244Q17n44q70j095O6
$$ 35 1025 1197 167 -970 -1569 -330 721 1301 667 -715 -1105 -639 605 1422 878 8 -1087 -1021
2757a021J028R83p3n21r84n44M46J344M75n53j209m98K08J470Q27n04r48j023
$$ -1021 7 990 917 396 -588 -1132 -686 658 1133 580 -629 -1127 -919 551 1378 874 -74 -1097
2775a097j69J230Q44K10q08r72m16M85J591M09o77j170o75K13J265O17K25j249
$$ -1097 -1266 -36 808 1018 210 -762 -1178 -693 898 1307 630 -540 -1215 -1002 263 880 1105 -144
2793a44n92m81Q56R10O18p45j122l93P41J067P31o60r35p45n8Q63J244R3j070
$$ -144 -736 -1217 -361 549 1167 422 -700 -1093 -352 715 1446 786 -149 -894 -952 -89 1155 1248 178
2812A78j417M52L40J387M08j014j191r0K31J063O18j25r64o96q0J003R38O5r69
$$ 178 -1239 -787 -447 940 1348 334 -857 -947 -716 347 965 840 -124 -820 -900 103 1041 1106 137
2831A37r96m31Q28J132O78p95j031q22O83J352L75j51j040o91n0O11J177K22r23
$$ 137 -859 -1290 -462 670 1348 553 -478 -1300 -617 735 1110 959 -81 -772 -822 -211 966 1188 265
2850B65j240j00J12J612O84p14j003r10N22J067Q30m79p38r34j9O70J197p0o25
$$ 265 -975 -1075 -963 649 1333 619 -384 -1294 -772 295 1125 646 -92 -1026 -1045 -375 822 752 127
2869A27n14p38P04Q51N92m25q00j027Q6J190O64Q0q50q42j55O66Q75P11p34q45
$$ 127 -387 -1125 -421 430 1022 597 -203 -1230 -1144 46 710 790 -60 -902 -1057 -391 484 1195 461 -384
2889c84o64L96Q87Q15m70r47o75J36Q59R86J85r89r99J3O16J006K40l89j220n89
$$ -384 -1048 -652 235 1050 580 -367 -1042 -906 -47 939 1124 135 -864 -851 -235 771 1011 622 -598 -1187
2909a187N56J068M64J31j200r48K38Q66R71J23p11j005m29O55R10N11m20r45n82
$$ -1187 -631 437 901 1032 -168 -1116 -878 -12 959 1082 371 -634 -1063 -408 502 1013 593 -352 -934
2928i34J02J139P09Q0j359n81k2N44J179J92p59p72n99L50J107P25m45j050m44
$$ -934 -832 307 1016 1096 -263 -844 -866 -322 857 1049 290 -482 -1081 -731 376 1101 656 -394 -838
2947h38J31R67P77k02q20q56n8N72J144K62n57j019m37L38Q82Q03l79r76n27q8
$$ -838 -707 260 1037 835 15 -841 -899 -327 817 1079 522 -497 -934 -596 286 1089 710 -266 -793 -881
2967h81R50R02k26m88j098o5N10J085K73l90j202l66J09J146N93j4r28q77q4O79
$$ -881 69 971 745 257 -841 -906 -396 689 962 572 -630 -996 -887 259 852 838 -90 -967 -1051 -372
2987c72J191J98o73p06o32N98P77L91m06p07m86P6J015N82L8j112n18J14P18P82
$$ -372 819 1017 344 -362 -994 -396 381 772 366 -341 -827 -751 264 846 884 -228 -746 -632 86 868
3007H68K07o19j004l62L98Q24M78j15j014n86kJ095P75l63l76o78m45O51P83K78
$$ 868 1075 456 -548 -910 -512 312 790 675 -339 -925 -927 168 943 580 204 -474 -919 -268 515 793
3027G93m59q77l18L91Q27O84m17p52o08k54J312O00k3r36n74k60O06J013j59k78
$$ 793 334 -543 -861 -470 357 1041 624 -128 -736 -990 322 922 899 -37 -611 -871 -265 748 589 311
3047C11o65m75L77N04P55j06p53o02m9P85O10J52q62o95l55O08J110J35k99o36
$$ 311 -354 -829 -452 52 807 701 -52 -654 -703 82 692 844 -18 -713 -1068 -460 650 785 486 -150
3067a50o30k7R01O52N7p06p02j18M84P06M33r05o74l9J8J096M87n56m75m14k47
$$ -150 -780 -807 94 746 803 97 -605 -723 -239 467 900 -5 -679 -718 -700 396 883 327 -148 -562 -809
3088h09J115M15j07o98o13k73J058N73J94n88p26m07L60J056L80l87m84n93q8
$$ -809 306 721 614 -84 -697 -970 88 661 855 267 -459 -866 -506 550 930 543 59 -534 -622
3107f22Q72M82K7p52m24k70K13J125q2k49o43n47K57O60P64j76q06p79M01O25
$$ -622 250 732 759 7 -417 -687 -474 651 569 320 -323 -870 -613 47 811 635 -171 -950 -549 76
3127G6O97j64m96p21k53O74Q24J71k99q41l72J56R97M52j11o80r20N1P98L35O61
$$ 76 773 609 113 -608 -861 -187 637 808 509 -332 -704 -548 449 901 790 110 -810 -759 39 374 1035
3148A035o89r24k39M14O12P99m58p78n02J1P47Q26j69q42k90k85O24M02L03l88
$$ 1035 346 -578 -817 -403 209 1008 550 -228 -730 -719 28 854 685 -157 -447 -732 -108 294 597 209
3168B09m55p15K97J077J95k09m80n20P9M15O19K79o39q57j95O11O06L08o5j094
$$ 209 -246 -961 -664 413 608 399 -81 -601 -522 -107 512 791 152 -705 -900 -289 317 625 560 -534
3188e34k60L37O21N45j8p54m50O4O48M98j54m43o31k34M10O83L98m26n11k43k34
$$ -534 -794 -457 164 709 691 -63 -513 -449 199 697 543 100 -531 -765 -355 328 726 300 -211 -454 -688
3209f88P37N33k5m05q85K69J82Q47J15j90j057l55N81Q28K73j33q98m56K73O68
$$ -688 49 582 557 152 -733 -464 -282 565 680 490 -567 -922 -341 487 760 627 -271 -727 -454 214
3229B14N92j78n52p06N0O06M84J08l16o92m36N36O10kQ1n93n38q1Q75M66J08m64
$$ 214 806 628 76 -630 -580 26 510 618 302 -390 -826 -290 320 318 399 -194 -732 -813 62 528 636 172
3251A72o94l02N03O01L04k18q64m08M27Q73L52k90o30n07r2N34Q65M7m62q46J2
$$ 172 -522 -824 -321 280 584 366 -498 -906 -479 394 746 456 -174 -681 -773 -239 626 673 211 -635 -623
3272f23J41Q60L57l10o67o17O45J61N46K55j019l91q7Q05K22J68j82p26k95L92
$$ -623 -482 378 735 425 -242 -859 -214 -53 493 748 -271 -662 -749 56 278 446 264 -462 -757 -365
3292c65O59L92l07o25n57L47P56L32N9q19q36M06L87P59J33l38p30m03M45O54
$$ -365 294 686 379 -246 -803 -456 300 632 691 -128 -964 -558 -171 588 721 383 -347 -750 -305 349
3312C49L50n16j24q78K8J062M70j11p42m87O6J51O81M53l85p04l37L21O59O64
$$ 349 699 183 59 -819 -791 271 741 630 -112 -599 -533 -382 299 752 367 -337 -674 -353 306 970
3332I70m54m73r06K94O38P23j03m25o38k57M99N64M74l96n14p34L54L82N95l5
$$ 970 516 43 -863 -569 69 792 689 264 -374 -631 -132 432 906 510 -4 -738 -384 -2 593 558
3352E58o11o21j55O33P76K56p96l52j95K67M88L14l07o73j52l4P53N54k44m56
$$ 558 -53 -674 -829 -196 580 836 40 -312 -507 -240 248 562 255 -418 -570 -604 149 703 459 3
3372Co30j8O26M40L73k82p38n92N47N93M30l27l82o09N7M68N20P7j96o83j25L34
$$ 3 -627 -645 -19 421 794 512 -226 -818 -271 322 752 425 43 -566 -509 -41 479 556 360 -323 -448 -114
3394a14M13K94k50o42k32L12K56L98j19j45m71k73M72P15k28k22n01j86J88O39
$$ -114 299 593 343 -299 -531 -219 37 435 316 171 -300 -573 -101 614 386 164 -337 -523 -335 304
3414C04K88k38p82m64M04P06N33l44j78p22o6M98O55k8k85o09k84K13M63N09j72
$$ 304 592 354 -428 -892 -488 218 751 407 229 -493 -559 -61 594 566 281 -328 -612 -399 64 573 401
3435D01j98n65k22O88O93k28l66m92m70M31P11L52j36r05k86J67J078M4m20o46
$$ 401 203 -362 -584 104 797 569 203 -289 -759 -328 383 735 599 -306 -592 -425 653 697 277 -369
3455c69m42N38N34L33J53o01q19K3N20N15L12m66n65j62KO78J75J6l44p17o0P52
$$ -369 -811 -273 261 594 747 146 -673 -650 -130 385 697 231 -334 -496 -494 184 359 375 31 -686 -746 6
3477FM39K26o38m45j07L09O77P7j88m07n50J76O72L11p7l85m11k98M32L74J40
$$ 6 445 671 33 -412 -519 -210 467 544 356 -51 -601 -425 247 558 481 96 -315 -613 -181 193 333
3498C33k53k11l04o4N87N43l0m86n20p6M12N77r4k88n06l91Q13J80K57k54n89
$$ 333 80 -131 -435 -499 88 631 601 115 -405 -481 -69 508 414 126 -380 -771 42 222 479 225 -364
3519c64j98K37N71L35k23p16q7K5N11L98K76o71o80JM95N10j00j26n29k82L93
$$ -364 -562 -325 246 581 358 -358 -445 -420 91 489 765 94 -586 -585 -90 420 320 194 -335 -617 -224
3540b24O37K78r5n13n04j14L33Q59l5m22p07q1L88K72M91k42o04k54L15J27N12
$$ -224 413 691 596 83 -421 -535 -202 657 622 200 -507 -588 -200 72 563 321 -283 -537 -222 -95 417
3561D17P6o35l43j83M13O92j01l53m93o9K71M83N06k38k22n37P6Q9P62n4n54o32
$$ 417 493 -142 -485 -668 -255 437 336 -17 -510 -579 -308 175 681 443 221 -316 -240 -151 611 557 3 -629
3583f29R1J55Q59j1l23n88M8o8Q90J78j52n73j41k39M86N80J77o44p54L76J45
$$ -629 -538 -383 476 465 142 -446 -398 -466 424 602 450 -123 -264 -503 -17 563 740 96 -658 -282 -137
3604a37N35L5j05q70R7P7P53j79K99n99m27J05K30P03K34o00n73qL69K38N14l65
$$ -137 398 433 328 -542 -445 -368 385 206 505 -94 -521 -416 -186 517 751 151 -422 -430 -61 177 691 326
3626C26p38r5J86M58K98J7n37l89j26O46K68L34m64l98l23K94N32L48k49o25l72
$$ 326 -412 -507 -321 137 435 452 -85 -474 -600 46 314 648 184 -214 -537 -243 289 637 388 -237 -609
3647f09K79N29K36j75k33k72k92M56L71K67n6o28j77L6O21L9j56j74m10p8L44
$$ -609 -330 199 435 260 27 -245 -537 -81 290 557 501 -127 -304 -268 353 392 236 62 -348 -426 -82
3668h2M72J30o21p06Q9O88M35Q2j61n41l03P1M15M66o3k90q05K46M24M30K12l33
$$ -82 390 520 -101 -807 -718 -30 405 487 326 -215 -518 -447 -32 434 371 81 -724 -478 -54 376 588 255
3690B55o93k23O94J50K57N4m78n07N05L24K03O1o49k11l63K47Q24k45Jm72l96
$$ 255 -438 -661 33 183 440 494 16 -491 14 338 541 602 -47 -258 -621 -374 450 205 206 -266 -662
3711f62L20M52M03j67n52k67R4L20K97L13k67q46o5M49O24M9j74n17k84M01J69
$$ -662 -342 110 513 346 -206 -473 -379 -59 238 551 284 -562 -627 -178 446 495 321 -196 -480 -79 90
3732I0M81l56m00k38l8M85O44j50j44n99n8J09L10R9j57k65n83L82P49j18m0m54
$$ 90 571 215 -185 -423 -461 24 668 518 374 -225 -283 -174 136 235 78 -187 -770 -388 361 243 203 -251
3754b51k33Q3K27P00j06n44j1k68L31J56M39l0o82n33L12M99K26J1m15l81J1M01
$$ -251 -484 -401 -174 526 420 -124 -135 -403 -72 84 523 493 -189 -722 -410 89 315 326 -89 -470 -459 -58
3776e8P48m26l62j29k13J78L19M20J49p72l71O7M34K76L27m41l73j72K25O43m4
$$ -58 690 264 -98 -227 -440 -262 57 477 626 -146 -517 -450 -16 260 587 146 -227 -399 -174 469 425
3797D25N3o66l74MN76M71l73l92j87K13K5R24k4o01l53l33O67K20K89k63n09l10
$$ 425 478 -188 -562 -558 18 489 116 -276 -463 -250 -225 699 675 74 -279 -612 55 275 564 301 -208 -518
3819e18M06K42J71L34n91k62l85N48J88L48k11m51r5J88l0M65l13l60l52K14O29
$$ -518 -112 130 301 635 44 -218 -603 -55 133 481 270 -181 -276 -88 -118 347 34 -326 -678 -464 165
3840A65L86o5l32n80K58J61K76M00m84m94l04N14M0O77l1o81m92L74J62M24p2
$$ 165 551 486 154 -426 -168 -7 269 669 185 -309 -613 -99 -59 618 587 -94 -586 -212 -50 374 302
3861C02j23n27k32N45K67J41k78o23k6J46L86M45M6p27q0J04K69J85K66n63j45
$$ 302 179 -348 -580 -35 232 373 95 -528 -554 -408 -22 423 469 -258 -338 -234 35 220 486 -77 -222
3882b22J11J0L16M33o15n78J48k2N35J27m7l46j59k45O64R5R7l1n60l27K42P74
$$ -222 -111 -101 215 648 33 -545 -397 -419 116 243 196 -150 -309 -554 110 205 302 271 -289 -616 -374 400
3904D00j67M1n24J38k12M12L46r4n23j98j25O45J02K98n65p0k13j14O46R3K2n04
$$ 400 233 274 -250 -112 -324 88 434 340 -183 -381 -506 139 241 539 -26 -96 -309 -423 223 316 338 -166
3926a66j46R7L62J88l39j08k88r1N57K30K21k65l68k82J49N67L90o03m7o97J66
$$ -166 -312 -215 147 335 -4 -112 -400 -491 66 296 517 252 -116 -398 -249 318 708 105 58 -639 -473
3947d73Q08L0J20j05n96j29K69J63N44l99n12M0N9K94J91L29o50%l69L17M24j28
$$ -473 335 365 485 380 -216 -345 -76 87 631 232 -280 -240 -181 113 304 633 -17 -17 -386 -69 355 227
3969B27P3o26j37J95K84K92J3n45J3k11L22K67K22k75m99L35O3J37K86j68l63
$$ 227 300 -326 -463 -268 16 308 321 -224 -211 -422 -100 167 389 114 -385 -50 13 150 436 268 -95
3990i5n59L64M52J99M1n93k64J73K25L81l3m6m30k99L37O8L39j06j99n61M20L37
$$ -95 -654 -290 162 361 402 -191 -455 -282 -57 324 291 245 -185 -484 -147 -79 260 154 -45 -606 -186 151
4012A51J78k93J53m92k44M67K68J79n1n50m8J46O47M4k75m28n25M75J52M57j41
$$ 151 329 36 189 -303 -547 -80 188 367 316 -234 -282 -136 511 555 280 -148 -673 -198 -46 411 270
4033B70l13n38N7M04M88j04q2m77k05M12N05j60J63o65n7r2N45L02l5o55K4j33
$$ 270 -43 -581 -524 -120 368 264 182 -295 -500 -88 417 257 420 -245 -302 -394 151 453 418 -237 -213 -346
4055c46R7N64K74j58m08k65J35K57J35Q3m57k72P0M31J02p6j61k61K25M2L05Q8
$$ -346 -249 315 589 431 23 -242 -107 150 285 368 -89 -361 -291 140 242 166 5 -256 -31 11 316 404
4077D04l42j91n87M29M95L61k10m97J6j25R9N23j0r3l26m2m6L23M45n84m12j04
$$ 404 62 -129 -716 -287 208 569 359 -138 -122 -247 -148 375 365 272 -54 -96 -142 181 626 42 -370 -474
4099d74Q1L01M03J95n25k71k13L71M05R8m5n88k26N40j3O34n20k13j63j07L83
$$ -474 -393 -92 311 506 -19 -290 -503 -132 273 371 326 -262 -488 52 39 673 153 -60 -223 -330 53
4120E3J84J24Kp18k09M56L70J9j84m13m9qO13K6l34J91n02J40J13L09R5k32k36
$$ 53 237 361 363 -355 -564 -108 262 281 97 -316 -365 -373 240 266 -68 123 -379 -239 -126 183 278 46 -190
4143a90q5j38P68r5o7k49m35K89LO20Pl54l15l7J33N05r9j38k02l37M61J30K0
$$ -190 -275 -413 355 260 193 -56 -491 -202 -199 421 428 74 -241 -278 -145 360 261 123 -79 -416 45 175 195
4166A95k4l70k59L76l0L78K12m65k00m19N97pJ97l24j28j7J53L25M7M7n10k57
$$ 195 171 -199 -458 -82 -112 266 478 13 -187 -606 -9 -16 181 -143 -271 -288 -135 190 237 284 -226 -483
4188d83K06L59J43K52k76k19l49PM88J57l2n54k05M52J10J89O5m24Q4m75K38N03
$$ -483 -277 82 225 477 201 -18 -367 -360 128 285 253 -301 -506 -54 56 245 310 -114 -30 -505 -267 236
4210B36O9l37k01m8J49N18K92n56j21n98O24K4k26M77L6o44k76Q03j67K70j08
$$ 236 305 -32 -233 -281 -132 386 678 122 1 -597 27 51 -175 302 338 -306 -582 221 54 324 216
4231B16n68K69j84N73J36k13j00l35J08P5L16k0q1k36k36J16j8N33m25j53OJ13
$$ 216 -352 -83 -267 306 442 229 129 -206 -98 -23 293 273 192 -44 -280 -164 -182 351 -74 -227 -221 -108
4253a08J76J45j24j94r5j16M39J83J3k73l61J28J72K39K28l47k48j34M24N6J3
$$ -108 68 213 89 -105 -200 -316 123 306 319 46 -315 -187 -15 224 452 105 -143 -277 147 203 216
4274B16j41R8n67J92J92J15L58n01j83J59m38L94L38j30j66r2J19o3K72J85m53
$$ 216 75 173 -394 -202 -10 105 463 -38 -221 -62 -500 -106 232 102 -64 -156 -37 -100 172 357 -96
4295i6J31l40L48L28k61m5k16j35L82K09j73O7j56o43L83J64K31J01k06o6o7J07
$$ -96 35 -305 43 371 110 65 -151 -286 96 305 132 199 43 -600 -217 -53 178 279 73 7 -60 47
4317D7K3J53l3m19j29J78L6N91k70M9m05J25J74J91l05O7j7n80M81J30M16l33
$$ 47 70 223 190 -229 -358 -180 -144 447 177 226 -179 -54 120 311 6 73 56 -524 -43 87 503 170
4339A70l91j49K09L23Q9K5k10l35K31j06O58r0n29m9j83O3M40K30j61k23k04p4
$$ 170 -221 -370 -161 162 251 276 66 -269 -38 -144 514 424 -105 -154 -337 -274 166 396 235 12 -192 -266
4361b66K19K81j07k27N6l8j12O40J1l2o29p6J43J69J01km43j2j53L01M48K07n73
$$ -266 -47 234 127 -100 -44 -82 -194 446 457 425 -204 -280 -137 32 133 131 -312 -324 -477 -176 272 479 -94
4384i4j74l4M60J28j15j20j67k23J12N92j72k31Pl53L8K22L70k24N2l01l13N27
$$ -94 -268 -302 158 286 171 51 -116 -339 -227 365 193 -38 -31 -384 -346 -124 246 22 74 -227 -540 -13
4406a3j18N89l27m74J11K99k04P07l82k19k35m9N01j30L44n03j99P7J24RL74l10
$$ -13 -131 458 131 -343 -232 67 -137 570 188 -31 -266 -315 186 56 400 -103 -302 -225 -101 -92 282 -28
4428b8l14O3k2N28j17L26k93l37N0j04N01J81n43j82k52P1O78Q3j98j69m28L17
$$ -28 -342 -279 -301 227 110 436 143 -194 -144 -248 253 434 -109 -291 -543 -472 206 289 91 -78 -506 -189
4450a89N07K3l51Jm36P8J52M07L9o9q5j02m2K05J42j80l66J80j99K50L79p1l81
$$ -189 318 341 -10 -9 -445 -367 -215 192 231 162 77 -25 -67 138 280 100 -266 -86 -285 -35 344 273 -108
4473a08o0j57L30j18K54L1l09Nj28L64%K12l84j38J73j88N15n3j6n83k02K96L04
$$ -108 -168 -325 5 -113 141 172 -137 -132 -260 104 104 316 -68 -206 -33 -221 294 241 225 -358 -560 -264 40
4496D0K53j07l4j66r2J80J32J05k14n52J25J51M39j51J63m24L6k65N70J63p6m13
$$ 40 293 186 152 -14 -106 74 206 311 97 -455 -330 -179 260 109 272 -152 -116 -381 189 352 276 -137
4518a37k80K52K27J30O2j27m13K38r3Q2N0K21k69l32K72L16J04n1j45j72m9RL18
$$ -137 -417 -165 62 192 254 127 -286 -48 -141 -59 -9 212 -57 -389 -117 199 303 252 107 -65 -114 -105 213
4541B13K7j12m63J63K02L46j54L31o52J2rJ54L97m03k8j36k8J21M18k19j85n1
$$ 213 240 128 -335 -172 30 376 222 553 -99 -87 -96 58 455 52 24 -112 -140 -19 399 180 -5 -56
4563e6j23K5M00jm04K1J2m7M91r2l0k9l69Q3K9K69j87K86o73K37j16L84M4K00
$$ -56 -179 -154 246 245 -159 -138 -126 -173 318 226 196 167 -202 -119 -90 179 -8 278 -395 -158 -274 110 154 354
4587C54p53K52K65L3Q1j16J96o29k3L54J5J07K9j45l49N45j9l3k54j97O1j20M45
$$ 354 -399 -147 118 151 232 116 312 -317 -340 14 29 136 165 20 -329 216 197 164 -90 -287 -226 -346 99
4610I9N4N0o0l23k45J81N55k09o4k26k1k22L47L49j5k47r9k30L52J49o2k37J08
$$ 99 153 203 143 -180 -425 -244 311 102 38 -188 -209 -431 -84 265 250 3 -96 -326 26 175 113 -124 -16
4633a6k22K34L08j44p9j66L3K0J94P1j04j40k50L26L2n9L75m13k05J99q9K90J08
$$ -16 -238 -4 304 160 81 -85 -52 -32 162 233 129 -11 -261 65 97 38 413 0 -205 -6 -95 195 303
4656C03m8l16j51N9K00k9J64o2m31K21J3L0K29N0k07k17K61o2J62J88m09j58k46
$$ 303 255 -61 -212 -153 47 18 182 120 -311 -90 -77 -47 182 232 25 -192 69 7 169 357 -52 -210 -456
4679d56M22M4q3J36m27K0Q6J48K15M9k79J14j77J79K52J4o9r6k18J09K47J14m11
$$ -456 -34 10 -73 63 -364 -344 -258 -110 105 154 -125 -11 -188 -9 243 257 188 92 -126 -17 230 344 -67
4702f7K98l55m4K09K09k10p4k45M96o5k8J39n03m2m9L13L2J50j59j37q2o1N42
$$ -67 231 -124 -168 41 250 40 -34 -279 217 152 124 263 -240 -282 -331 -18 14 164 5 -132 -214 -275 267
4725B67K03m58J52k17O4M4j39qK20l03j01Q3J94K85p9k43L2j8K64k68J25j59K0
$$ 267 470 12 164 -53 11 55 -84 -92 128 -175 -276 -193 1 286 207 -36 -4 -22 242 -26 99 -60 -40
4748d0J42l59O00j62j59k10j78J38M38k54m3n2k28N66j59j43K00j59j25J82R5
$$ -40 102 -257 343 181 22 -188 -366 -228 210 -44 -87 -139 -367 199 40 -103 97 -62 -187 -5 90
4769I0j01L14j15m14mJ0L60R6k49j32k0O4N6L10j42k70jJ37l05K38J45n4j76M1
$$ 90 -11 303 188 -226 -230 -220 140 236 -13 -145 -165 -101 -45 265 123 -147 -148 -11 -316 -78 67 13 -163 -122
4793a22J34j09K09L5l52j5L89j82L19R1n66J70P7k72K03K19j59j71p3k12M75o
$$ -122 12 -97 112 147 -205 -220 169 -13 306 397 -169 1 78 -194 9 228 69 -102 -175 -387 88 82
4815H2N4k33k81J26J19M36j08k64n3r1J39J14J04j55J2j29j31J73L19j41J8m73
$$ 82 136 -97 -378 -252 -133 303 195 -69 -122 -213 -74 40 144 -11 1 -128 -259 -86 233 92 110 -363
4837c63L87L9j09K00p0j46j5q1O05j22Pl74l33K41J05K25p6O4m65J28m9M27o9
$$ -363 24 63 -46 154 84 -62 -77 -158 447 325 332 -42 -375 -134 -29 196 120 184 -281 -153 -202 225 156
4860A56L2k65N1j59M82o9j48j53Pj08K42J64l10J80rl39K85K80l44M2J5n1K4J21
$$ 156 188 -77 -26 -185 297 228 80 -73 -66 -174 68 232 -78 102 93 -246 39 319 -25 17 32 -19 5 126
4884A26P6q8j98J01j75J0rJ53l9j03R9k04K25K55k34k45L02j56J73NN4j92J15
$$ 126 202 114 -84 17 -158 -148 -157 -4 -43 -146 -47 -251 -26 229 -5 -250 52 -104 69 74 128 -64 51
4907E1p0p3p6J06M7J12l03J07J21J34o0j75j74O7L17Mrl67K45l03K08Q7J22L49
$$ 51 -19 -92 -168 -62 -15 97 -206 -99 22 156 96 -79 -253 -186 131 135 126 -241 4 -299 -91 -4 118 467
4931D67o66k07K04J91K22n4k58k27J76k2L72k41n2m2j70O2J67K37r6m8q1o9L35
$$ 467 -199 -406 -202 -11 211 157 -101 -328 -152 -174 198 -43 -95 -137 -307 -245 -78 159 63 15 -66 -135 200
4954B00k85o1J25o3k2m7M65l25J45p9k01k5J0M12j29l89N86l91l7N25m28M0j61
$$ 200 -85 -146 -21 -84 -106 -153 312 -13 132 53 -148 -173 -163 249 120 -269 317 -74 -111 414 -14 26 -135
4977a35K6M9O9K17j18p3R4j56J58k74K6K99j59o8NR4k7J0r8Q4l3m7J62n9k13P6
$$ -135 -109 -60 9 226 108 35 129 -27 131 -143 -117 182 23 -45 -40 54 27 37 -61 23 -10 -57 105 46 -167 -91
5003i1m6K02P9o6K1l9k31J96M9J8%l43L21n9J44J37j91j01l4o1l2N08l90n8J05
$$ -91 -137 65 144 78 99 60 -171 25 74 92 92 -251 70 11 155 292 101 0 -34 -95 -127 381 -9 -67 38
5028C8j08J73J96k9k31k16K52j15m3J00R5J3k98K05N3m2j43J89j20k17K39K14
$$ 38 -70 103 299 270 39 -177 75 -40 -83 17 112 125 -173 32 85 43 -100 89 -31 -248 -9 205
5050B05r4k23j91M25L6j77K45k08J83j40j30K18O1ll76q0J70J85Pj37Q8j5k21
$$ 205 111 -112 -303 122 158 -19 226 18 201 61 -69 149 210 207 -169 -249 -79 106 113 -24 64 49 -172
5073a72M05k13O7j40K05l8p1p1m27M41J65j49J04kk26J26o2K6q2j8rL10k37M3
$$ -172 233 20 87 -53 152 114 43 -28 -455 -14 151 2 106 104 -122 4 -58 -32 -114 -132 -141 169 -68 -25
5097b5k64L34j31J65K51k23l9k69J73R8K26m34l7k10L27J93K09k92M9l4j09j98
$$ -25 -289 45 -86 79 330 107 68 -201 -28 70 296 -138 -175 -385 -58 135 344 52 101 67 -42 -240
5119b40M9K84J00Rm47K86l2m8N5k28K03k25J00k7l2J12K19n18M59J47k23r3J71
$$ -240 -191 93 193 202 -245 41 9 -39 16 -212 -9 -234 -134 -161 -193 -81 138 -380 79 226 3 -90 81
5142H1j46lL48k01K25o26J03j19N75j80N8k5Q5j28P5k5N7q0j60PL5J32j79J87
$$ 81 -65 -68 280 79 304 -322 -219 -338 237 57 115 90 175 47 122 97 154 74 -86 -79 -44 88 -91 96
5166I6j68j40M80l34K2L3j48M8l08J94L04J43j77K7l7j2J5L8J55j70m73K16L61
$$ 96 -72 -212 268 -66 -44 -11 -159 -111 -419 -225 79 222 45 72 35 23 38 76 231 61 -412 -196 165
5189A65M5k60J87k96J3J95l82M34n0nj20J00j08L63k45K9k18O2j18J20m7K40n1
$$ 165 210 -50 137 -159 -146 49 -333 101 51 46 -74 26 -82 281 36 65 -153 -91 -209 -89 -136 104 53
5212E3K17m81J16L20n0l44N4P2K63j42J29k97J52J1P0k01K74k04k32K10p8N8L57
$$ 53 270 -211 -95 225 175 -169 -115 -43 220 78 207 -90 62 73 143 -58 216 12 -220 -10 -88 -30 327
5235C27k08K6q3k36J05J2Q4J80k95M5k05N20J7p3k61p1K05K32n5J54n10J14k28
$$ 327 119 145 62 -174 -69 -57 27 207 -88 -43 -248 272 289 216 -45 -116 89 321 266 420 -90 24 -204
5258b04R0J01j6M7N3O9m95L0K45K41j43L82m68J7R1K17l47Q6l99J22L40J35k51
$$ -204 -114 -13 -29 18 71 140 -355 -325 -80 161 18 400 -68 -51 40 257 -90 -4 -403 -281 59 194 -57
5281e7R3M3l89L93j11K04n5q3l7K0J09j94Q1JJ3j09L20m79M2L13l07L49k62L5
$$ -57 36 79 -310 83 -28 176 121 38 1 21 130 -64 17 18 31 -78 242 -237 -195 118 -189 160 -102 -67
5305f7L68j50n15L56j74J28K6K51j27k48J34j70R9R1r6q8M4L68K63k91k18M1o4
$$ -67 301 151 -364 -8 -182 -54 -28 223 96 -152 -18 -188 -89 2 -94 -182 -138 230 493 202 -16 25 -39
5328c9m72L79J75L4o0n6j05J3J70J44m38K51R4k6k36J89L6n6Kj2j76J91M5M5k6
$$ -39 -511 -132 43 77 17 -39 -144 -131 39 183 -255 -4 90 64 -172 17 53 -3 -1 -13 -189 2 47 92 66
5353F6n5N1j06J57k10O3Om9p6L19P9j86l05K31M6J10r2j35K06p5j7J37l0j81l3
$$ 66 11 62 -44 113 -97 -34 -28 -77 -153 166 245 59 -246 -15 31 141 49 -86 120 45 28 165 135 -46 -79
5378g9KK80L8J2j63nl01L32l34L33l15K42%l5K02k89J70P6m29J46N7ql9P2R9M1
$$ -79 -77 203 241 253 90 85 -216 116 -218 115 -200 42 42 7 209 -80 90 166 -263 -117 -60 -68 -107 -35 64 105
5404A05k27R8n2m0K29j54P2qm6L03j39k57K05l36M48k25o2K6K83k09O7k27J99
$$ 105 -122 -24 -76 -116 113 -41 31 23 -23 280 141 -116 89 -247 201 -24 -86 -60 223 14 81 -146 53
5427E3O4k04J02j84K55J08l81M88j56k53J92l09K25M0O5j37k7K41k82O5J60J5
$$ 53 117 -87 15 -169 86 194 -187 301 145 -108 84 -225 0 40 105 -32 -59 182 -100 -35 125 140
5449A40k62q1K87l18M27q6k72R4o6J93R7k54K61k06J30K3j34L4n3J60j07Q8j32
$$ 140 -122 -203 84 -234 193 107 -165 -71 -137 56 153 -101 160 -46 84 107 -27 7 -46 114 7 95 -37
5472c7L5j11J11Q5l24K23%j62J26n4NJ1J75r6J48p2j11o3J17R2J72m29J07J00
$$ -37 -2 -113 -2 83 -241 -18 -18 -180 -54 -108 -103 -92 83 -13 135 63 -48 -111 6 98 270 -159 -52 48
5496D8L1N9O4o8k92JJ78N8J44R8k13K2r3K0Op8K11k53q6K02j4J36k16K39l98O2
$$ 48 79 138 202 134 -158 -157 21 79 223 321 108 130 37 57 63 -15 196 -57 -143 59 45 181 -35 204 -194 -132
5522a32l68N29m1o7J00j97K26j33k0J36J43l6l45K30m6M4J19l12q9M54j01R7m30
$$ -132 -500 29 -12 -79 21 -176 50 -83 -103 33 176 140 -205 25 -21 23 142 -170 -259 195 94 191 -239
5545b39K42m2k2J50k11J85K2lk59L55j56r4j84K40k03j68J51L29n8J61k76j05
$$ -239 3 -39 -61 89 -122 63 85 82 -177 178 22 -72 -256 -16 -219 -387 -236 93 35 196 -80 -185
5567a85J63K65k07k16J81k33M19l40l9J87L2o2J7R7K13l44p9MN8j49M15l02J3
$$ -185 -22 243 36 -180 1 -232 187 -153 -192 -5 27 -35 -18 79 292 -52 -131 -127 -69 -218 197 -105 -92
5590i2K33k9k00K28o5M7j66p2L87j45Rl3k63L66q3n9M7j24j69K98p1P2L1l12K79
$$ -92 141 112 -88 140 75 122 -44 -116 271 126 135 102 -161 205 122 63 110 -14 -183 115 44 116 147 -165 114
5615A14m8k41N6K23r0L01l20J00l89J70K10j13j24Q9j09K36K31k03J08p2P6k06
$$ 114 66 -175 -119 104 14 315 -5 95 -294 -124 86 -27 -151 -62 -171 65 296 93 201 129 205 -1
5637aj33L7K6K43j92nJ32L68n03J01k15J49k16J81k72L02k0j38K56J39j65J01
$$ -1 -134 -97 -71 172 -20 -25 107 475 -28 73 -142 7 -209 -28 -300 2 -18 -156 100 239 74 175
5659A75k86k4J26j79J77j62K38k01J39j39L02j57N0j87K47j79R8J87l24KQ9P2
$$ 175 -111 -135 -9 -188 -11 -173 65 -136 3 -136 166 9 59 -128 119 -60 38 225 -99 -97 -8 64
5681F4k7Qr6j6K4oO6K96k03j87m8J05J4K18j68l9k8l6R0j81K58kr0j88K74l1j51
$$ 64 37 45 -51 -67 -43 -49 17 313 110 -77 -125 -20 -6 212 44 5 -23 -59 31 -150 108 106 16 -172 102 71 -80
5708h0n5J54j80J45j46K04K00k50j47J32l4j23J08r8K12P8p1Ok2J6j4J90nk50
$$ -80 -135 19 -161 -16 -162 42 242 -8 -155 -23 -57 -180 -72 -170 42 120 49 55 33 49 35 225 220 -30
5732c0J91k51L82k83J5J43j26J8J71j67j41l7L63k70J64r9l32N19l75K54k20J95
$$ -30 161 -90 292 9 24 167 41 59 230 63 -78 -115 248 -22 142 43 -289 230 -145 109 -111 84
5754H4k15L40n18R9J41o5J29k7RJ0N7K26l38R4P1j74J48q4n4M01j53k25m5k8J85
$$ 84 -131 209 -309 -210 -69 -134 -5 -32 -23 -13 44 270 -68 26 97 -77 71 -13 -67 334 181 -44 -89 -117 68
5779F8j77J6J61J1k07K22j69K27k88J79j2K03j73l9J36N5j29k60L28r1lj09J02
$$ 68 -109 -93 68 79 -128 94 -75 152 -136 43 31 234 61 22 158 213 84 -176 152 61 58 -51 51
5802E1j2J73k89j92l3L40k87K92lj19K18k17J51R1R7l78J06j15N8l9J78o7R5O9
$$ 51 39 212 -77 -269 -302 38 -249 43 40 -79 139 -78 73 164 261 -117 -11 -126 -68 -107 71 4 99 168
5826A68n62L57K00l6k59L47k69K78k3l11J55j40p7K72j36N1K06l07l07M60N7p8
$$ 168 -394 -37 163 127 -132 215 -54 224 201 -110 45 -95 -172 100 -36 15 221 -86 -393 67 124 46
5848D6P0j24j64J01LJ78j81m4J67k12K65J32l30M1k55N2K75J46j73J91o9l47J70
$$ 46 116 -8 -172 -71 -68 110 -71 -115 52 -160 105 237 -93 -52 -307 -255 20 166 -7 184 115 -232 -62
5871f2j4kNL10k36j78P9J47J5K97n66J81Q0l9N5J0O4j77K16q4L5J8j88J5k01L84
$$ -62 -76 -78 -73 237 1 -177 -98 49 64 361 -205 -24 56 17 72 82 146 -31 185 101 136 154 -34 -19 -220 164
5897A64M8k75j0Q6k11J18K58k70K5n3M98n92M7M37j11Qk86O0p6J17j14K79l83
$$ 164 212 -63 -73 13 -198 -80 178 -92 -67 -120 378 -214 -167 270 159 167 -119 -59 -135 -18 -132 147 -236
5920b36J1K79j00O8J34L6l03q0K97k1l6p3J11L0j95k1K69j20n9o8K12J7J88k28
$$ -236 -225 54 -46 22 156 192 -111 -191 106 85 49 -24 87 117 -78 -99 170 50 -9 -77 135 152 340 112
5944A12J84m16k65O22m2m2j72m3p3j96M45q2Rj36j56R9M1K16J73k21o8K3j26R7
$$ 112 296 -120 -385 237 195 153 -19 -62 -135 -331 114 32 41 -95 -251 -152 -111 105 278 57 -11 12 -114 -17
5968a7m8k0N9r1m3J51J00J22l51J9J20j85Q0J41M6j43j92p4M75j64QM6j49m6R5
$$ -17 -65 -85 -26 -117 -160 -9 91 213 -138 -119 1 -184 -104 37 83 -60 -252 -326 149 -15 -7 39 -110 -156 -61
5993f1J43j19k0N2j68j40O59n00J66k48j34K90q2J34P8L1J02m14L79J11J6l81
$$ -61 82 -37 -57 -5 -173 -313 346 -154 12 -236 -370 -80 -162 -28 50 81 183 -231 148 259 275 -106
6015a06oK49N7k07L9J02K07k65k84J76j9K18l73L8O4j36J58K25o9k10QJ83q4K62
$$ -106 -112 137 194 -13 26 128 335 70 -214 -38 -57 161 -212 -174 -110 -246 -88 137 68 -142 -134 49 -35 227
6039B27q5l94k2J24O3lL10p00L74j13P7K70J0l37J15k23L10J25J24k19j41j0J87
$$ 227 142 -252 -274 -150 -87 -90 220 -480 -106 -219 -142 128 138 -199 -84 -307 3 128 252 33 -108 -118 69
6062F9k02K53j19J0k38L17J20j86j16J13l42K27j40J7K44J59j75j20O4r2J30m7
$$ 69 -133 120 1 11 -227 90 210 24 -92 21 -321 -94 -234 -217 27 186 11 -109 -45 -137 -7 -54
6084e4o2KK0j34K03M9J45n4l27l0L62mm51K72p4k4O4K35M8j92J9J49kJ78pq1j53
$$ -54 -116 -114 -94 -228 -25 24 169 115 -212 -242 120 116 -335 -63 -137 -161 -97 138 186 -6 13 162 160 338 331 250 97
6111I7p9o8o4L25j1k92k5J44P3j65j22L83k25j56K64J00j88K56p8n58N59k41K68
$$ 97 18 -50 -114 211 200 -92 -117 27 100 -65 -187 196 -29 -185 79 179 -9 247 169 -389 170 -71 197
6134A97M5k11j40m4J35j37P7L00j17J64n21L59k23K36k17k21J36k79M64r1j32
$$ 197 242 31 -109 -153 -18 -155 -78 222 105 269 -252 107 -116 120 -97 -318 -182 -461 3 -88 -220
6155b20M93m92J02j43L97k13j4J93j21K68n7N4k63j65R6L29j20j56Q2J94m61q4
$$ -220 273 -219 -117 -260 137 -76 -90 103 -18 250 193 247 -16 -181 -85 244 124 -32 50 244 -217 -301
6177c01O3L93j27n7o7k2l7J77J34p6l9k20n8l3L24pm19L36J38J03Q9l35QR7q1
$$ -301 -238 155 28 -29 -96 -118 -155 22 156 80 41 -179 -237 -270 54 47 -372 -36 102 205 294 -41 -33 64 -17
6202a7K43M3k93j60J25j55J60r1M45k17k11JP0J05o5J34k41q7J03J74n1J05K04
$$ -17 226 269 -24 -184 -59 -214 -54 -145 300 83 -128 -127 -57 48 -17 117 -124 -211 -108 66 15 120 324
6225C24l72j41M8J70P5O1k58J15L6j19L1l6K6j91L99k92L43nMj14l75K50k02Q9
$$ 324 -48 -189 -141 29 104 165 -93 22 58 -61 -30 -66 -40 -231 168 -124 219 214 218 104 -271 -21 -223 -134
6249a34M84l2l35p9j86L21l2r6N5R4j47L09k23J31j27o4J16Ll1l3l3J74j83n9
$$ -134 350 318 -17 -96 -282 39 7 -89 -34 60 -87 222 -1 130 3 -61 55 58 27 -6 -39 135 -48 -107
6273a07N11l33n2o6r8O6K73k75J4P7l73N00kk38N3r1jl0J72N0J32L2j94jNR4R3
$$ -107 404 71 19 -47 -145 -79 194 -81 -67 10 -363 137 135 -103 -50 -141 -142 -172 0 50 182 214 20 19 24 118 211
6300B11j5m55M65q7lJ31j74R3k29J8k7PK75j17j31j87M45k51m3J76J8k96L1J28
$$ 211 196 -259 206 119 116 247 73 166 -63 -45 -72 -65 210 93 -38 -225 220 -31 -74 102 120 -176 -145 -17
6324a7M87k12l61J78r1j2L81m5k97j27P5j89N10j85r9R9j21k23R5K31p4M1j01
$$ -17 470 258 -103 75 -16 -28 353 308 11 -116 -41 -230 280 95 -4 95 -26 -249 -154 77 3 44 -57
6347e7k73O6L73J33j14J01j21j54J38J69k99j5O1k64Q6L58n3k39Q9j09O0P7J16
$$ -57 -330 -264 109 242 128 229 108 -46 92 261 -38 -53 8 -256 -170 188 135 -104 -15 -124 -64 13 129
6370A29n3j13N0k62J84M9L3K49l61J01n5p6K70p8l76K35M3K61m21K72K33m48M4
$$ 129 76 -37 13 -249 -65 -16 17 266 -95 6 -49 -125 145 67 -309 -74 -31 230 -191 81 314 -134 -90
6393i0j30j3K23J14r0k05J71o4KK04k98l1J24LQ6M4P9m53K33N8J33J98J3l01p2
$$ -90 -220 -233 -10 104 14 -191 -20 -84 -82 122 -176 -207 -83 -80 6 50 129 -324 -91 -33 100 298 311 10 -62
6418f2j09M6L15J17l78p2L6K65k48K98k16k21N9J06L30n0j61j68K15l69L41J25
$$ -62 -171 -125 190 307 -71 -143 -107 158 -90 208 -8 -229 -170 -64 266 216 55 -113 102 -267 74 199
6440A99r2j78J7j2J76m2j0k7M5l23O8K29M3j05r9K7K09j35K94j61R7l78j1oM01
$$ 199 107 -71 -54 -66 110 68 58 31 76 -247 -179 50 93 -12 -111 -84 125 -10 284 123 220 -158 -169 -175 226
6465B26j04l30R1j17M53k34l8K05k21l59L24K2M67m36n8k6N4K57m0N3j14r7N3
$$ 226 122 -208 -117 -234 219 -15 -53 152 -69 -428 -104 -82 385 -51 -109 -135 -81 176 136 189 75 -22 31
6488C1j72L77L1j92J16m31J94j61K93K0k00RL8K64j23J16j75k79L41o4m2J92j18
$$ 31 -141 236 267 75 191 -240 -46 -207 86 106 -94 -85 -47 217 94 210 35 -244 97 33 -9 183 65
6511F5l13j68L06K00k6K96m51k57o1N21k05J41k7N8j0l10L03o6j23J8J26J6o0
$$ 65 -248 -416 -110 90 64 360 -91 -348 -409 112 -93 48 21 79 69 -241 62 -4 -127 -109 17 33 -27
6534b7lJ23J34m33J22N6J60rj21K91m26O7J4L48l21J78ql64J88K37l11K39k02
$$ -27 -30 93 227 -206 -84 -28 132 123 2 293 -133 -66 -52 296 -25 153 145 -219 -31 206 -105 134 -68
6557f8o7o7L30j94k3M05m68k66O24j36J18q5l18K50P1K57l28J19j30j09J21j43
$$ -68 -135 -202 128 -66 -89 316 -152 -418 206 70 188 103 -215 35 106 363 35 154 24 -85 36 -107
6579a07K41j85RR9J39r8N4k09K26l6k17J89j21J17K07n02nJ38J56J23j19l01m6
$$ -107 134 -51 -42 57 196 98 152 -57 169 133 -84 105 -16 101 308 -194 -199 -61 95 218 99 -202 -248
6602b48K10K12J69l92m6j24J18N9N0L39n64J33q6j23M23O4j97O4k02K39l18K91
$$ -248 -38 174 343 -49 -95 -219 -101 -42 8 347 -217 -84 -170 -293 130 194 -3 61 -141 98 -220 71
6624G1q1J48k61k4L3RL05J19j42k22R3P4J75l27R7k20J67k59p4M92j11k18J28
$$ 71 -10 138 -123 -147 -114 -105 200 319 177 -45 48 122 297 -30 67 -153 14 -245 -319 173 62 -156 -28
6647b8J8J53J20j41j22k69K72nj1K88k36J20k84j22N06o6k68J38m86L37K85j38
$$ -28 -10 143 263 122 0 -269 3 -2 -13 275 39 159 -125 -247 259 193 -75 63 -423 -86 199 61
6669F1q4q0k49J55Q8J20J23q8J8K7j9rO2r9q8k52K6M87j2j26j28k06L85q0K41
$$ 61 -23 -103 -352 -197 -109 11 134 46 64 91 72 63 125 26 -62 -314 -288 199 187 61 -67 -273 112 32 273
6694B73j03L2l14J53k22J35J21j98P6Oj6K38j20R2R2l77R4o2K01R3j81m32M1J47
$$ 273 170 202 -112 41 -181 -46 75 -123 -47 -41 -57 181 61 153 245 -132 -38 -100 101 194 13 -419 -378 -231
6718b31N21j80Q3o0j45k34K03pK50j76j31N6K49o3K1L6j63l11K81J64P4k5k32
$$ -231 290 110 193 133 -12 -246 -43 -50 200 24 -107 -51 198 135 156 192 29 -282 -1 163 237 212 -20
6741b0k58k05N90J27j66q1l1m9q8J24J59Q4k45K09j52k64M05j4j86R2j03j11N98
$$ -20 -278 -483 107 234 68 -13 -44 -93 -181 -57 102 186 -59 150 -2 -266 139 125 -61 31 -72 -183 415
6764D15k58j83k12M4O62l11j06j1j50nN9J1K04o2j64l4k56J15K90O7p3m6j84n9
$$ 415 157 -26 -238 -194 468 157 51 40 -110 -115 -56 -45 159 97 -67 -101 -357 -242 48 115 42 -4 -188 -247
6788b47K54L05k23k66j2J47q5L18o1k9l80M40k42O0K32l00J88k91J81j21J96J8
$$ -247 7 312 89 -177 -189 -42 -127 191 130 101 -279 161 -81 -21 211 -89 99 -192 -11 -132 64 82
6810H2l69K76J7k90M88J7j41j4l6ON2nr9j71L0mK87M1K5k14P3j53O1K72n8j50
$$ 82 -287 -11 6 -284 204 221 80 66 30 36 88 83 -16 -187 -157 -161 126 167 192 -22 51 -102 -41 231 173 23
6836B3j60N9M6j15L21j5j15k02m0KM20k2k63j39K77k64K90j26j11l5P8k77N58
$$ 23 -137 -78 -32 -147 174 159 44 -158 -198 -196 224 202 -61 -200 77 -187 103 -23 -134 -169 -91 -368 190
6859A90N7j69j35k76P4J90J01J89j77k17j8M9M5J64k89K6M42k97N5KJ69n4o7Q
$$ 190 247 78 -57 -333 -259 -69 32 221 44 -173 -191 -142 -97 67 -222 -196 246 -51 4 6 175 121 54 62
6883F2N3p9l1K21l91J45j06J74K44l47p9J4mj3K77j36p9J04O6j0M5k63M2l1m6
$$ 62 115 36 5 226 -165 -20 -126 48 292 -55 -134 -120 -124 -137 140 4 -75 29 95 85 130 -133 -91 -122 -168
6908a68K4J3J81J25k92J46Rl53K45Q0l5J18j95p0J41N4j19M7p5R5J77j32K40k41
$$ -168 -144 -131 50 175 -117 29 38 -315 -70 10 -25 93 -102 -172 -31 23 -96 -49 -124 -29 148 16 256 15
6932A5k28R2R5O9Q4l25r4J37J54J22l01J31J9K2m0M7K34l73j04K02K4j09K37j64
$$ 15 -213 -121 -26 43 127 -198 -292 -155 -1 121 -180 -49 -30 -8 -48 -1 233 -140 -244 -42 -18 -127 110 -54
6956e4L6N0k73K69j76L10r1j97K1K02J88k32k2J87m17r4M98J4L3j31l79J33J47
$$ -54 -18 32 -241 28 -148 162 71 -126 -105 97 285 53 31 218 -199 -293 205 219 252 121 -258 -125 22
6979B2Q3j40onj40j05Q1N51o02J91J5lJ40L43j46j74l29m6P1J2K97j62j12j16
$$ 22 105 -35 -41 -46 -186 -291 -210 341 -261 -70 -55 -58 82 425 279 105 -224 -270 -199 -187 110 -52 -164 -280
7003b80L00j68J44N7j51J22q9m53N17K1Q7m75J50K91N9j31J08p0j94N2j66L42
$$ -280 20 -148 -4 53 -98 24 -65 -518 -1 20 107 -368 -218 73 132 1 109 39 -155 -103 -269 73
7025G3r1NQ1k2j84K93R0l0l68j3L05m18L37j13K8r0L7MJ64K52l24l0l3L3P9J22
$$ 73 -18 -13 68 46 -138 155 245 215 -153 -166 139 -279 58 -55 -27 -117 -80 -76 88 340 16 -14 -47 -14 65 187
7051A87K8j92l30J51J17P8R8m3j45j24J41J52j58R6r1J00j63J66M4J47k85j53
$$ 187 215 23 -307 -156 -39 39 137 94 -51 -175 -34 118 -40 56 -35 65 -98 68 112 259 -26 -179
7073a79L72r8k25L50k2l40o6N9n7R4K22j08k69J0K69O6j79Q7j83J41J46J01l00
$$ -179 193 95 -130 220 198 -142 -208 -149 -206 -112 110 2 -267 -257 12 78 -101 -14 -197 -56 90 191 -109
7096a09m8J16k03K96J05r6l0K1l41L33JJ05j8m2j67L8l46M91Rj97L5k11K04K24
$$ -109 -157 -41 -244 52 157 61 31 52 -289 44 45 150 132 90 -77 -39 -385 106 115 -82 -47 -258 -54 170
7120A70k16O5r2k8J00J17R6K06k66m41J69j4J75Q5j39k02L74r3j8J72l59j2m0
$$ 170 -46 19 -73 -101 -1 116 212 418 152 -289 -120 -134 41 126 -13 -215 159 66 48 220 -139 -151 -191
7143a91K21m9q2K42j03j63Q4K2L1r3J24j08j30O9o1J78j22J19J3o4J05M7k10j83
$$ -191 30 -19 -101 141 38 -125 -41 -19 12 -81 43 -65 -195 -126 -187 -9 -131 -12 1 -63 42 89 -121 -304
7167c04J70j13J98L23j47j55l00K46K41l49L38j3k34qJ4o8M14P4j05k68J4M0Q9
$$ -304 -134 -247 -49 274 127 -28 -328 -82 159 -190 148 135 -99 -107 -93 -161 253 327 222 -46 -32 8 97
7190I7j09K68k14m3K35l13K13J31k6m11j12K14L9K79k3k91P6j57K62k9O8j09n0
$$ 97 -12 256 42 -1 234 -79 134 265 239 -172 -284 -70 -31 248 225 -66 10 -147 115 86 154 45 -5
7213el0L7J66j32m4k65l4K80%J47j94k2K6k4J88m4K2r0O0p8J07j43M21m00J1k30
$$ -5 -35 2 168 36 -8 -273 -307 -27 -27 120 -74 -96 -70 -94 94 50 72 -18 42 -36 71 -72 349 -51 -40 -270
7239b70L77rK3J10m24m5J76J19JJ76l52R7j32k31N13l92J26J87j41k04J97K95
$$ -270 107 98 121 231 -193 -238 -62 57 58 234 -118 -21 -153 -384 129 -263 -137 50 -91 -295 -98 197
7261A97Jk19J8r8P9P0r6po9J79P1O5j97j03P0k09K58p0K80j24j93J41j75L45q1
$$ 197 198 -21 -3 -101 -22 48 -48 -55 -124 55 126 191 -6 -109 -39 -248 10 -60 220 96 -97 44 -131 214 133
7286A33j22N6j15j29m4L81J37l70L26k95k28M00k3k4l49L78Q6j50L6J07j44r1
$$ 133 11 67 -48 -177 -221 160 297 -73 253 -42 -270 130 107 83 -266 112 198 48 84 191 47 -44
7308d4Q5n6J77j43P9k9J79n87m7M09k6J21j55q0o6K78J38k20j09j24K28K24l50
$$ -44 41 -15 162 19 98 69 248 -339 -386 23 -3 118 -37 -117 -183 95 233 13 -96 -220 8 232 -118
7331a18L03j91j26L6J95j32%L5n1J13K4p9K19j72j76n3K26m5J05P8l65O5NJ64
$$ -118 185 -6 -132 -96 99 -33 -33 2 -49 64 88 9 228 56 -120 -173 53 8 113 191 -174 -109 -104 60
7355F0r5J77O2k52m7J39o5N2r1L8J20j84rJ29P5k74j8n3K15k87K52J27K2j26M0
$$ 60 -35 142 204 -48 -95 44 -21 31 -60 -22 98 -86 -95 34 109 -165 -183 -236 -21 -308 -56 71 93 -33 7
7380GJ31K37m93J19l22K43K90k7k67j85J64N2J40N4j2Kk61J6J67J30J00k06j89
$$ 7 138 375 -118 1 -321 -78 212 185 -82 -267 -103 -51 89 143 131 133 -128 -112 55 185 285 79 -110
7403a10J01j10R6L45j70k58l8MQ0R4r6JR1l78K55J14N3j13j73j40M43J40r5k84
$$ -110 -9 -119 -23 322 152 -106 -144 -140 -60 34 -62 -61 30 -348 -93 21 74 -39 -212 -352 91 231 136 -148
7427a48J2P8j06J13K39l03J5J45o0O8m0J0K90k81l59L3L45mQ7k29J96k01L77j35
$$ -148 -136 -58 -164 -51 188 -115 -100 45 -15 53 13 23 313 32 -327 -294 51 47 134 -95 101 -100 277 142
7451A42K1l70N26n33K97J24k26M2j1J85l76J14j71K94k89J45j92K71K06k51J75
$$ 142 163 -207 319 -214 83 207 -19 23 12 197 -179 -65 -236 58 -231 -86 -278 -7 199 -52 123
7472A23k45J15l21L57P0j79K83k61K39k58K25j49j66M1j42K27K24j49L08m53J8
$$ 123 -122 -7 -328 29 99 -80 203 -58 181 -77 148 -1 -167 -126 -268 -41 183 34 342 -111 -93
7493i3j93N07NJ71o14K50L0J0r0M66l95n1Mq9m5J90K25l75j35J02P5J20M4k93
$$ -93 -286 221 226 397 -217 33 63 73 -17 449 54 3 7 -82 -127 63 288 -87 -222 -120 -45 75 119 -174
7517a74M00l71L38m67N07k28j35K4NJ9J8j87K98k39m4J90k8J87m2m0l23Q4O4l8
$$ -174 226 -145 193 -274 233 5 -130 -106 -101 -82 -64 -251 47 -192 -236 -46 -74 113 71 31 -292 -208 -144 -182
7541a82K13K34j47l24J97J72R0m69R4P9P6J40r4j63j4l9j7R0q1L52m88o2L01j27
$$ -182 31 265 118 -206 -9 163 253 -216 -122 -43 33 173 79 -84 -98 -137 -154 -64 -145 207 -281 -343 -42 -169
7565a69K29K1l27J34R1o6K4M93l2n05J81Qj75J92J35l70K9K51l95K79Q5M6n4l26
$$ -169 60 81 -246 -112 -21 -87 -63 430 398 -107 74 82 -93 99 234 -136 -107 144 -251 28 113 159 105 -221
7589b21j41L29J56q0k3j6j24O5J95L9k87ko1K60j90O7K7q1k23J69L9K50k1J11
$$ -221 -362 -33 123 43 20 4 -120 -55 140 179 -108 -110 -171 89 -101 -34 -7 -88 -311 -142 -103 147 126 237
7613B37l06j27K47J01j19j75K29O9k39K99p6n4N2l33Q9L4N7m6k45L51l49J29J53
$$ 237 -69 -196 51 152 33 -142 87 156 -83 216 140 86 138 -195 -106 -72 -15 -61 -306 45 -304 -175 -22
7636b2R7qo8j52M25r1pQ7n21Q8J50J56j42J23j4k40Q0J64o2K54j31k16k79L12
$$ -22 75 67 -1 -153 272 181 174 261 -260 -172 -22 134 -8 115 101 -139 -59 105 43 297 166 -50 -329 -17
7660a7jJ84o4j33Q2O0R2k09K02k48k24J42J7K13K18r5l15l3p9R6L30j55k04J77
$$ -17 -18 166 102 -31 51 111 203 -6 196 -52 -276 -134 -117 96 314 219 -96 -129 -208 -112 218 63 -141 36
7684C6r8M5J75J55k11q3k33J80j30n2N2K32l06M6L57J37m09j73L59l75J80J00
$$ 36 -62 -17 158 313 102 19 -214 -34 -164 -216 -164 68 -238 -192 165 302 -107 -280 79 -296 -116 -16
7706a6K01l6k26K68n36J31L33j52Q3r3K51k68J97J47l44l6k81L69N7M6k07j17
$$ -16 185 149 -77 191 -345 -214 119 -33 50 -43 208 -60 137 284 -60 -96 -377 -8 49 95 -112 -229
7728b29L58k87L18L3k80K04k49R1K51J68k81J09l96lO7L31j3p3k53J19j36J70
$$ -229 129 -158 160 193 -87 117 -132 -41 210 378 97 206 -190 -193 -126 205 192 119 -134 -15 -151 19
7750A9J39j09K2j84J20L3om9L88l14j23J6K68j48K7m07L14n8J37R1k06L9J9K28
$$ 19 158 49 71 -113 7 40 34 -15 373 59 -64 -48 220 72 99 -308 6 -52 85 176 -30 9 28 256
7774B56n16M79l10K36l09J56p7j49L62m0l84J10J08R7J02j48l4k11J88k47J61
$$ 256 -260 219 -91 145 -164 -8 -85 -234 128 88 -296 -186 -78 19 121 -27 -61 -272 -84 -331 -170
7795a70M80m30L26l36O2J70l2J91k23r0j92K68oj24Q1k33K2J89J32j98K11k65
$$ -170 310 -120 206 -130 -68 102 70 261 38 -52 -244 24 18 -106 -25 -258 -236 -47 85 -113 98 -167
7817a67j58M15J2l8K02k97k19J18J42K45J2m43J78l4k22K81J37o5j38j20J73J15
$$ -167 -325 90 102 64 266 -31 -250 -132 10 255 267 -176 2 -32 -254 27 164 99 -39 -159 14 129
7839A29J09k02m3j68j13L98Q9j02k94Q7k75K61L69m31M20l94J26J28Q5L02l65
$$ 129 238 36 -7 -175 -288 110 199 97 -197 -110 -385 -124 245 -186 234 -160 -34 94 179 481 116
7860A16j12k51J50M7N3o7J3lJ16q7j53J55K75m51M9M5n4K98r3j70k1L9O1J85M1
$$ 116 4 -247 -97 -50 3 -64 -51 -54 62 -25 -178 -23 252 -199 -150 -105 -159 139 46 -124 -145 -106 -45 140 181
7885A81j81Q7j72J29j0J95l40J91j42j17M3N78l40j41k08M5J49K18j27K79n65
$$ 181 0 87 -85 44 34 229 -111 80 -62 -179 -136 442 102 -39 -247 -202 -53 165 38 317 -248
7906b48P5K32k9J81j95n5j03k45L56K22j57j58j22J50L03j82J52p0Jj06Q3K2l02
$$ -248 -173 59 30 211 16 -39 -142 -387 -31 191 34 -124 -246 -96 207 25 177 107 108 2 85 107 -195
7929a95m7K48J8j97L51J57J41m87j33J2N5L05k35P6Q2p2j37j14L31O7l82K44P
$$ -195 -242 6 24 -173 178 335 476 -11 -144 -132 -77 228 -7 69 151 79 -58 -172 159 226 -156 88 95
7952I5j48J61j14j49j05K27M8K10M2k72k89JJ39K45J29ol06L02j92n3K75l09n2
$$ 95 -53 108 -6 -155 -260 -33 15 225 267 -5 -294 -293 -154 91 220 214 -92 210 18 -35 240 -69 -121
7975a21J04n17O70j62J38K04n67oL48m1Q8j7l08K40j80K04n8j15J75J14m27K44
$$ -121 -17 -534 136 -26 112 316 -251 -257 91 50 138 121 -187 53 -127 77 19 -96 79 193 -234 10
7997A0K61j71j65j14j85K68o9K75j81J35m73L50%J92r5n4N3p0p9J05k6M5Q9j97
$$ 10 271 100 -65 -179 -364 -96 -165 110 -71 64 -409 -59 -59 133 38 -16 37 -33 -112 -7 -33 12 101 -96
8021i6n1K0jJ50L47l90l0L46k57q0O1k17J63k09K34O0K75l58K8k80J72k4L07M4
$$ -96 -147 -127 -128 22 369 -21 -51 295 38 -42 19 -198 -35 -244 -10 50 325 -33 -5 -285 -113 -137 170 214
8045B14k18J11m2n6K87j12k08l16L22K60j45q6l15K21k98M65J34M4k29j4J44l68
$$ 214 -4 107 65 9 296 184 -24 -340 -18 242 97 11 -304 -83 -381 84 218 262 33 19 163 -205
8067b05K70K10j41M8j44R9l33L68j45j36k6m6R0n9J37K8j28K58j09J8R4j54p4
$$ -205 65 275 134 182 38 137 -196 172 27 -109 -135 -181 -91 -150 -13 15 -113 145 36 54 148 -6 -80
8090h0j72K78j72K62K81m20K9J40r6L9P2j21Q1k4n4k2N9r8J00k93K74k08J8L09
$$ -80 -252 26 -146 116 397 -23 6 146 50 89 161 40 121 97 43 21 80 -18 82 -211 63 -145 -127 182
8114A82k53j20o6K45J17J24m36K81o8r5p6%L81l64L90j98j86K39J9O5j49m1j83
$$ 182 -71 -191 -257 -12 105 229 -207 74 6 -89 -165 -165 216 -148 242 44 -142 97 116 181 32 -9 -192
8137a92J29K82m1k06J5J6K6O1k10m1J99j16J7k6P2J87J3p3k8j45%P0K4k3%j0p5
$$ -192 -63 219 178 -28 -13 3 29 90 -120 -161 38 -78 -61 -87 -15 172 185 112 84 -61 -61 9 33 10 10 0 -75
8164g5M3K09l07R3J58j64n1K46jk79P7R5r0J90j16j25k09L89q2Q5j33j01J92j36
$$ -75 -32 177 -130 -37 121 -43 -94 152 151 -128 -51 44 -46 144 28 -97 -306 83 1 86 -47 -148 44 -92
8188i2M06l97p7
$$ -92 314 -83 -160
8191a60
$$ Imaginary data points
##PAGE= N=2
##DATA TABLE= (X++(I..I)), XYDATA
0@%%%%%%%%%%%%%%%%JrJ6j6J6j6J9k7L2l3M1m8N6o5P3q4R4j07J22j38J55j74J95
$$ 0 0 0 0 0 0 0 0 0 0 0 0 0 0 0 0 0 1 -8 8 -8 8 -8 11 -16 16 -17 24 -24 32 -33 40 -44 50 -57 65 -73 82 -92 103
39A03k18K42k68K98l31L67m07M49m95N48o02O60p28Q03q85R77j082J201j335J490
$$ 103 -115 127 -141 157 -174 193 -214 235 -260 288 -314 346 -382 421 -464 513 -569 632 -703 787
59G87j671J887k150K475k892L450m240N455p579J2373m7011J7610O9389q990k0050
$$ 787 -884 1003 -1147 1328 -1564 1886 -2354 3101 -4478 7895 -39116 -21506 47883 38893 18843
74A8843m6534k9047K0079N6316K4801p659m0881m4800n20N3317L8571j975k8554
$$ 18843 -27691 -56738 -36659 19657 44458 36799 -4082 -48882 -49402 3915 42486 40511 11957
87A1957l7777k2246L0076M8112J7338j9317l8974l2082J3150M5732K9413q869
$$ 11957 -25820 -48066 -17990 30122 47460 28143 -10831 -42913 -29763 15969 45382 36513
99C6513l2065l7209m424L7234L7452M168k4266l8097k0702K4312M3324J7185j7032
$$ 36513 4448 -32761 -37185 49 37501 41669 17403 -20694 -41396 -17084 26240 43425 26393
112B6393l5594k8985P535L9510K8473l157k8926l7121j0476L2355L9602Q253k2983
$$ 26393 -9201 -38186 -30651 8859 37332 34175 5249 -31872 -42348 -9993 29609 37862 14879
125A4879l6208k2150J7031L9968K2816j0411l3692l2359J204L7631L1926k57k5985
$$ 14879 -21329 -43479 -26448 13520 36336 25925 -7767 -40126 -38922 -1291 30635 30378 4393
138D393l2683j3008K3611L7197J4309j6720l3039k3350J1368L6277K3408o624
$$ 4393 -28290 -41298 -17687 19510 33819 17099 -15940 -39290 -27922 8355 31763 25139
150B5139k7020k8271l489K9353L1501M871k1938l0230j3936J9471L4227J4544
$$ 25139 -1881 -30152 -33641 -4288 27213 32084 10146 -20084 -34020 -14549 19678 34222
162C4222j4396k8839k0892P302L1315K3744l988k5710k7426m281K6313L0072N260
$$ 34222 19826 -9013 -29905 -22603 8712 32456 28468 2758 -24668 -28949 -2636 27436 32696
175C2696k0228k8334j4607J5386L1747J7576j2253k9034k2416M611K9729K4454
$$ 32696 12468 -15866 -30473 -15087 16660 34236 21983 -7051 -29467 -24856 4873 29327
187B9327j654k4089k7115p471K1566L0460R668j8087k8230j6082J1399K9563J9186
$$ 29327 27673 3584 -23531 -31002 -9436 21024 30692 12605 -15625 -31707 -20308 9255 28441
200B8441p861k6601k2463P77K5259K5243K237k0898k5722q832J7435K8371J1043
$$ 28441 20580 -6021 -28484 -27707 -2448 22795 25032 4134 -21588 -30420 -12985 15386 26429
213B6429j3758k5558j6033Q607K6263J9618n269k3386k1260k90K2234K4021L483
$$ 26429 12671 -12887 -28920 -20313 5950 25568 20299 -3087 -24347 -24637 -2403 21618 25101
226B5101j8364k3840q970J5044K6219J2592j1824k5030j5908P105K4829J9266
$$ 25101 6737 -17103 -26073 -11029 15190 27782 15958 -9072 -24980 -17875 6954 26220
238B6220l295k2566k1620j436K0325K4023N512j7347k4459j0485J3295K5395J3724
$$ 26220 22925 359 -21261 -22697 -2372 21651 27163 9816 -14643 -25128 -11833 13562 27286
251B7286r125k4305j7929M495K2731K0482m43k0429k2471m810J7325K4025P834
$$ 27286 18161 -6144 -24073 -19578 3153 23635 23192 2763 -19708 -24518 -7193 16832 24666
264B4666j4403k3542j2314R913K3411J5435o646k2056j7968J610K0454K0656J370
$$ 24666 10263 -13279 -25593 -15680 7731 23166 16520 -5536 -23504 -21894 -1440 19216 20586
277B0586j8056k0772o222J4791K2856R464j2255k2413j2297Q382K2093J5572m796
$$ 20586 2530 -18242 -24464 -9673 13183 22647 10392 -12021 -24318 -15936 6157 21729 16933
290A6933k0447j8153Q89J9615K0419K255j6453k0755p101J3595K2659J1128j0923
$$ 16933 -3514 -21667 -20778 -1163 19256 21511 5058 -15697 -22798 -9203 13456 24584 13661
303A3661k2561j3569P672K0847J7326l383j9757j9209j578J7754K1801M815j5676
$$ 13661 -8900 -22469 -14797 6050 23376 19993 236 -18973 -20551 -2797 19004 23819 8143
316H143k1266q613J1259K1429J3186q299k1833j5588M789J9990J7471j166j7805
$$ 8143 -13123 -21736 -10477 10952 24138 15839 -5994 -21582 -16793 3197 20668 19502 1697
329A697j9157l276J5098K0485O947j3222k0875r700R611J9853J2828n985j9700
$$ 1697 -17460 -20736 -5638 14847 21794 8572 -12303 -22003 -12392 7461 20289 14304 -5396
342e396j5361K344J8687J6975R22j6698j8211m435J3369K0129Q089j1839j9630
$$ -5396 -20757 -18413 274 17249 18171 1473 -16738 -21173 -7804 12325 20414 8575 -11055
355a1055j0638Q125J9634J3802m862j8604j5268O02J7089J8717K240j5801j8543
$$ -11055 -21693 -13568 6066 19868 15006 -3598 -18866 -18264 -1175 17542 19782 3981 -14562
368a4562n420J2481J8881R852q941k0274j1786N932J8834J5173k664j7836j5980
$$ -14562 -19982 -7501 11380 21232 12291 -7983 -19769 -13837 4997 20170 17506 -330 -16310
381a6310j128J4873J8367N253j3707j8974p493R998J8696J0971p206j8474j2939
$$ -16310 -17438 -2565 15802 21055 7348 -11626 -19119 -9121 9575 20546 13340 -5134 -18073
394a8073L128J7244J5402k28j6266j6559k539J3057J7333O545j1432j8192q682
$$ -18073 -14945 2299 17701 17473 1207 -15352 -17891 -4834 12499 19044 7612 -10580 -19262
407a9262Q488J7287J1585n183j8079j3218K423J5880J5852J090j5501j6557l380
$$ -19262 -10774 6513 18098 12915 -5164 -18382 -15959 -79 15773 16863 1362 -15195 -18575
420a8575J2335J7199P414j0218j8376r180P427J7465J2401m067j7017j3816Q16
$$ -18575 -6240 10959 18373 8155 -10221 -19401 -11974 5491 17892 13825 -3192 -17008 -16192
433a6192J4706J6144L146j3902j6924m961J0835J7082Q890p729j7994j0717N468
$$ -16192 -1486 14658 17804 3902 -13022 -17983 -7148 9934 18824 11095 -6899 -17616 -12148
446a2148J6296J3406k079j5388j4926n22J3046J5968M418j1549j6842o525R046
$$ -12148 4148 17554 15475 87 -14839 -15361 -2315 13653 18071 6522 -10320 -16845 -7799
459g799J6079R576n942j6692j1455L619J5080J3119k66j4352j5218j502J2037
$$ -7799 8280 17856 11914 -4778 -16233 -12614 2466 15585 15319 967 -14251 -15753 -3716
472c716J5068N280j0013j6542p312P929J5906R643n081j5585j2059K383J4284
$$ -3716 11352 16632 6619 -9923 -17235 -9306 6600 16243 11162 -4423 -16482 -14099 185
485A85J3756Q51j3046j5291l430J1621J5561N716q507j5665r075O123J5703J1245
$$ 185 13941 14792 1746 -13545 -16975 -5354 10207 15923 7416 -8249 -17324 -11201 4502 15747
499A5747l184j4945j3201J068J3405J3814K620j1146j5083n463R868J5362P409
$$ 15747 12563 -2382 -15583 -14515 -1110 12704 15324 4178 -10905 -16368 -6500 8862 16271
512A6271o924j4903r713M439J4570J1361j658j3315j2945r80J2028J3722L567
$$ 16271 9347 -5556 -15269 -10830 3740 15101 13443 128 -12817 -13797 -1769 11953 15520
525A5520r780j4633o196P925J4829P854n662j3991j0331K853J4235J1331q51j2332
$$ 15520 5740 -8893 -15089 -7164 7665 15519 9857 -4134 -14465 -11612 2623 13954 13103 771
539G71j2891k412J1352J3888M117q982j4154p076O573J4706Q702m515j3513j1002
$$ 771 -12120 -14532 -3180 10708 14825 5843 -8311 -15387 -8814 5892 14594 10079 -3434 -14436
553a4436J415J3374J2735j23j1205j3371l670R974J4385N593p906j3981q009N508
$$ -14436 -13021 353 13088 12965 1760 -11611 -15281 -5307 9078 14671 6765 -7216 -15225 -9717
567i717J4055R824l514j2843j0571k19J1766J3333J208j0061j2800m707Q286J3782
$$ -9717 4338 14162 10648 -2195 -12766 -12985 -1219 12114 13322 3261 -9539 -14246 -5960 7822
581G822O413o316j2925q814L867J3399J0074k274j1446j0984j233J0738J2663
$$ 7822 14235 7919 -5006 -13820 -9953 3446 13520 11246 -200 -11184 -12417 -1679 10984
594A0984K986r822j2402m970O696J3532P393n990j2601q341K200J2173J1058j202
$$ 10984 13970 4148 -8254 -13224 -6528 7004 14397 8407 -4194 -12535 -10335 1838 12896 11694
608A1694j1619j0733j865R452J2671L968q812j2116n982N572J2815Q583m826j2584
$$ 11694 75 -10658 -12523 -3071 9600 13568 4756 -7360 -13342 -7770 5045 13628 8802 -3782
622c782q551J128J1073J1410O61j0801j1497k147P902J2639N275p660j1965o503
$$ -3782 -12333 -11205 -132 11278 11939 1138 -10359 -12506 -4604 8035 13310 5650 -6315 -12818
636a2818M224J1903R094k619j2034r157L45J0061J1296J993r642j1454l176P140
$$ -12818 -8594 3309 12403 9784 -2250 -11407 -11062 -1001 10295 12288 2646 -8808 -11984 -4844
650d844J1867N809o090j1762o651L158J1576R066j797j1122r645k05R163J1403
$$ -4844 7023 12832 6742 -5020 -11671 -8513 3063 12129 10332 -790 -10435 -10640 -1477 9926
664I926K369q747j1175m356O462J1628O591m827j2039p279K701J0612R797q89
$$ 9926 12295 3548 -7627 -11983 -5521 6107 12698 7871 -4168 -11447 -8746 1866 11663 10774
678A0774j0651j0268j039Q578J1161L777q029j1156n197N477J1118P410m200j1164
$$ 10774 123 -10145 -11184 -2606 8555 12332 4303 -6853 -12050 -6573 4545 11955 7755 -3409
692c409q070J629J0002J0173N93r863j0377k059P574J0966M730o745j1418n514
$$ -3409 -11479 -9850 152 10325 10918 1055 -9322 -11381 -3807 7159 11889 5144 -6274 -11788
706a1788M620J0647P958k870j0842q006L36R694R945Q27q450j0561k290O524J0653
$$ -11788 -7168 3479 11437 8567 -2275 -10281 -9945 -251 9694 10521 2071 -8490 -10780 -4256 6397
721F397N448n497j1320o274M215J0138P930j495j0533q879K78Q834R647K322p910
$$ 6397 11845 6348 -4972 -11246 -7031 3107 11037 9542 -991 -9870 -9592 -758 8889 11211 3301
736C301j0745l454O227J0248N837m453j0831o898K633R944Q682p81r808r274j086
$$ 3301 -7444 -10898 -4671 5577 11414 6961 -3870 -10768 -8135 1809 10491 9710 -98 -9372 -10458
751a0458Q335R871L203o723j0621m850N132J0569O408l378j0407p304J537R267
$$ -10458 -2123 7748 10951 4228 -6393 -11243 -6111 4458 10866 7488 -2919 -10223 -8686 581
765E81Q390M20q777r102j635O648J0069L803n932r900n129L884R908P037k590
$$ 581 8971 9391 614 -8488 -10123 -3475 6594 10397 4465 -5435 -10564 -6680 3228 10265 7675
780G675r703p548Q54Q420Q929R09p875r171k710O555R942M424n341j0068n586
$$ 7675 -2028 -9576 -8722 -302 8627 9536 1661 -7510 -10220 -3665 6277 10701 5360 -4708 -10294
795a0294L960R115P370j682r469p838O4Q161Q763K171p236r698l208N498R573
$$ -10294 -6334 2781 10151 8469 -1000 -8838 -8774 -613 8150 10321 3085 -6613 -9821 -4323 5250
810E250N163m519r422n998K345R007P548o25r032q114p09P019R268K787o554r522
$$ 5250 10413 5894 -3528 -9526 -7181 1826 9374 8749 -283 -8397 -9106 -2087 7181 9968 3414 -6108
826f108l591M608R114N622l388q998o517J568Q212P999J13q085q517j111O417
$$ -6108 -9699 -5091 4023 9645 6257 -2741 -9258 -7690 522 8521 8634 549 -7968 -9079 -2662
841b662Q733L445n799q836m768M430Q735N747k072r038o773J086P742P928R31
$$ -2662 6071 9516 3717 -5119 -9887 -5457 3278 9025 6953 -2085 -8858 -7772 -30 7898 8829
856H829p207q828j761O013Q870L639m594r261m933L342Q722O335j702q509p138
$$ 8829 1622 -7206 -8967 -2954 5916 9555 4961 -4300 -9233 -5891 2831 9166 7464 -1045 -8183
871h183N5P532Q107J294n977r067l010N427Q707M521m007r000n076K220Q209O503
$$ -8183 -8128 -596 7511 8805 2828 -6239 -9249 -3822 4885 9406 5399 -3601 -8677 -6457 1752 8255
887H255p03p663p402n41O721P965J782n663q217l497M320Q473N008l419q273n422
$$ 8255 7552 -111 -7513 -8054 -1333 6632 8414 2751 -5466 -8963 -4643 3830 8838 5419 -2854 -8276
903h276J622P679O478N7p195p614j034O311P834K704n349p954m092L867Q154N306
$$ -8276 -6654 1025 7503 7560 365 -7249 -8283 -1972 5862 8566 3217 -4737 -8829 -4962 3192 8498
919H498k191q162o766J668P372P000M40o370q000k000N749P985L463m232q314
$$ 8498 6307 -1855 -8621 -6953 419 7419 7859 1489 -6511 -8511 -2762 5223 8686 4454 -3860
934c860m849L273Q142N223j087p736o521o8P079P281J448o136p997k163M551Q340
$$ -3860 -8709 -5436 2706 7929 6842 -894 -7415 -7483 -404 6877 8325 2189 -5808 -7971 -3420 4920
950D920L507l782p953m869K251P964N664j091o803o809o54O550P448J379n308
$$ 4920 8427 4645 -3308 -8177 -5926 2038 7702 6611 -192 -7001 -7655 -1105 6343 7722 2414
965B414p241l253M603P355M013l026p413n516K048P292O180r30o401o713j142
$$ 2414 -4827 -8080 -3477 3878 7891 4865 -2548 -8064 -6016 1276 7456 6526 125 -6588 -7730
980g730N812P882J951n223p547l308L652P802M336k388o954n693P32P058O439
$$ -7730 -1918 5964 7915 2692 -4855 -8163 -4511 3291 7627 5239 -1715 -7408 -6676 382 6821
995F821m0n793o835j721N104P468K861m244p175m319L090P317M853j730o633n762
$$ 6821 6781 988 -5847 -7568 -2464 5004 7865 3621 -3554 -7873 -4783 2534 7387 5657 -976 -6738
1011f738J20O704O323O02n180p110k069M637P082L504l775p073m187J988P232
$$ -6738 -6618 86 6409 7011 1831 -5279 -7348 -2711 4371 7875 4100 -2973 -7160 -5172 2060
1026B060N173j444o244n943l53O020P058J028n478o412k924M016P167L619k845
$$ 2060 7233 5789 -455 -6398 -6751 -731 6327 7355 1877 -4535 -7459 -3443 3724 7343 4498
1041D498o810n059J562P086N752j123n684o140j290N712O602J948m455o826l136
$$ 4498 -2312 -7371 -5809 1277 7029 5906 222 -5918 -7208 -1496 5106 7054 2599 -4227 -7363
1056g363L037P438L994k434o781n065J038O328O103K02n896o138j390M836O916
$$ -7363 -4326 3112 7106 4672 -2109 -7174 -6136 192 6295 6497 601 -5537 -6927 -2091 4825
1071D825K163l851o573l676K635P004M567k034o518m666J7O267O261J44n238o403
$$ 4825 6988 3137 -3436 -7112 -4477 2527 7094 5060 -1458 -6124 -6107 160 6421 6565 1327 -5076
1087e076j441L900O787L053l574o568m137K529O452M871j389n949n581k35N774
$$ -5076 -6517 -2617 4170 7223 3649 -2919 -7056 -4527 1925 6796 5407 -542 -6123 -6358 -584
1102e84O013J386m770o621k440M068O285L518l080o369m097J386O519M815n38
$$ -584 5429 6815 2045 -4576 -7016 -2948 3337 6855 3775 -2594 -6691 -5305 1214 6029 5491
1117E491n662n560o67N054O199J673m342o295k582L034O411L878k340o211m257
$$ 5491 -171 -5731 -6398 -1344 4855 6528 2186 -4109 -6691 -3657 2754 6632 4292 -1919 -6176
1132f176J189N699M928R2n314n382j499M431O153K544l908o066l242K718O357
$$ -6176 -4987 712 5640 5732 418 -4964 -6463 -2032 4121 6665 2757 -3309 -6551 -3833 2524
1147B524M119k080n838m489M40N520N209Q60m939o068j298M007N984K529l009
$$ 2524 6643 4563 -1275 -5764 -5324 196 5405 6265 1326 -4742 -6040 -2033 3951 6480 3471
1162C471o322l610K298N816M706j477n533m887O1N291N323Q46m323o123j957L927
$$ 3471 -2851 -6461 -4163 1653 6359 4882 -651 -5538 -5477 -186 5137 5983 1660 -4463 -6420 -2493
1178b493N768K712k318n847m172J745N792M685o92n064n440o84M702N631J688
$$ -2493 3275 5987 3669 -2178 -6350 -4605 1187 5872 5180 116 -5324 -6008 -1306 4325 6013
1193F013l709o011k732L006N981L467j974n791m351J426N032M937L23m735n847
$$ 6013 2304 -3707 -6439 -3433 2548 6015 4041 -1750 -6101 -4675 357 5294 5617 882 -4965
1208d965p62M352N203J916k940n973k950K551N756L740j567n412m565Q97M706
$$ -4965 -5727 -1375 3828 5744 2804 -3169 -6119 -3568 2188 5928 4361 -1051 -5616 -4719 -13
1223a3M961L70m156n338j487L872N355K144k680n687l187K045N628M071j238n159
$$ -13 4948 5318 1162 -4176 -5663 -1791 3564 5708 3028 -2659 -5846 -3801 1827 5898 4660 -499
1239d99m760N5N013M626J044l902n704j699L448N313K705k325n414l350J384N223
$$ -499 -5259 -5204 -191 4435 5479 1577 -4127 -5826 -2378 2935 5640 3315 -2099 -5449 -4065 1158
1255A158M005n42m519n136k47M429M793J532l573n553k154L029N302K935j966
$$ 1158 5163 4621 102 -5034 -5281 -852 3941 5473 1900 -3653 -5807 -2778 2524 5459 3493
1270C493n298l595J030M971M493l95m221n051j025M267N012J616l083n096k689
$$ 3493 -1805 -5400 -4370 601 5094 4699 478 -4573 -5598 -1331 3681 5297 2214 -2882 -5571
1285e571K343N722K601j141n225m030R52M728M285L03l860n057j408L617N202
$$ -5571 -3228 2494 5095 3954 -1271 -5301 -4349 379 4664 4967 1107 -3950 -5358 -1741 3461
1300C461J831k720n107k941J792N495L245o52m627m542J41M512M618N26l837m840
$$ 3461 5292 2572 -2535 -5476 -3684 1811 5056 4404 -223 -4765 -4624 -112 4506 5032 1195 -3645
1316c645j552L073M989K532k334m906l425J513N014L341n98m179m287m78M105
$$ -3645 -5197 -2124 2865 5397 3063 -1843 -5268 -3755 1259 4600 4002 -177 -4464 -4942 -837
1331h37M816R85l344n025j856K646N239K689k163m558l526Q80M740L628q3l948
$$ -837 3979 4964 1620 -3405 -5261 -2615 2624 5313 3150 -1408 -4934 -4054 686 4314 4231 283
1347B83m611l90L715M542J324k944m939k320K624M879K860j217m963l741M94M729
$$ 283 -4328 -4718 -1003 3539 4863 1919 -3020 -5340 -2716 2163 5023 3806 -1157 -4898 -4404 325
1363C25M085L6l682m618r92L524M477J791k479m655k698J770N009K866j080m501
$$ 325 4410 4446 764 -3854 -4846 -1322 3155 4946 2467 -2188 -4886 -3116 1893 4759 3679 -822
1379h22l579K48M042L986O57l439m507j695L434M472J845j703m845k880J288M737
$$ -822 -4401 -4153 -111 3875 4532 1093 -3414 -5109 -1675 2797 4642 2939 -1906 -4786 -3498 1239
1395A239L298r49l885l964j41L866M187J017l064m957j382K583M762J944j663
$$ 1239 4537 3588 -297 -4261 -4402 -536 3651 4668 1604 -3353 -4735 -2152 2610 4554 2891
1410B891m287l364R63M569L327j41l528m401m05L280M062J454k380m619k009K462
$$ 2891 -1396 -4760 -3797 772 4099 3958 430 -3971 -4376 -1096 2966 4420 2040 -2579 -4588 -2126
1426b126M197K698j387m463l427P96L967L664J62l567m124q53L326M098J549k287
$$ -2126 2071 4769 3382 -1081 -4508 -3712 255 3919 4081 514 -3610 -4463 -1137 2961 4510 2223
1442B223m526k194J748M332K932j106l917l441j05M136L617L95k816m618j243
$$ 2223 -2303 -4497 -2749 1583 4515 3409 -508 -3949 -4054 82 3699 4094 1278 -3340 -4583
1457d583K892M348J670k001m133k628J470M179K766r8m066l757k5L584L649O35
$$ -4583 -1691 2657 4327 2326 -1807 -4435 -2965 1214 3980 3882 -184 -3941 -3966 -382 3267 3902
1473C902k692m351j362K436M477J834j508m335k827J234L883L346p39l295l577
$$ 3902 1210 -3141 -4503 -2067 2410 4244 2736 -1599 -4426 -3192 691 4037 3298 3 -3574
1488c574o33L350L932J170k721l959j945J925M547K301j408m110k999P40L533
$$ -3574 -4207 -857 3075 4245 1524 -2435 -4380 -2455 2092 4393 2985 -1125 -4124 -3384 149
1503A49L473K71l350l962o79K804M087J510k389m042k118J499M077K905j038l760
$$ 149 3622 3893 543 -3419 -4098 -1294 2793 4303 1914 -2128 -4246 -2747 1330 4235 3197 -563
1519e63l177J70L434L746R1k977l493j024K496L863J686k141l930k444J411L818
$$ -563 -3740 -3570 -136 3610 3701 724 -2769 -3793 -1297 2566 4252 2111 -1819 -4263 -2852 966
1535I66L030r92l361l192j24L366L397Q20k657l939j470J991M369K051j880l655
$$ 966 3996 3004 -357 -3549 -3673 -307 3090 3910 1253 -2686 -4156 -2165 2204 4255 2375 -1280
1551a280k854J239L797L055n41l523l153n50K992L295J474k256l977j737J729
$$ -1280 -4134 -2895 902 3957 3416 -107 -3260 -3810 -818 2477 3951 1695 -2282 -4019 -2290
1566b290M255K256j336l932k854J080L255L028K84l434l349p69K887L553J707
$$ -2290 1965 4221 2885 -1047 -3901 -2821 434 3462 3746 312 -3037 -3806 -919 2634 4341
1581D341k388m142k080K013L765K430p20m202k628L24L157L456M76l218l651o34
$$ 4341 1953 -2189 -4269 -2256 1509 3939 3219 -983 -3611 -3287 -130 3326 3802 584 -3067 -3701
1597c701K241L785J385j707l612k489J599L579K690o81l703k737j55K759L845
$$ -3701 -1460 2325 3710 2003 -1609 -4098 -2499 1080 3770 3089 -614 -3351 -3506 -747 3098
1612C098N33k567l463j497K333L262J957j264l838k384Q74L688K602P1l092l588
$$ 3098 3631 1064 -2399 -3896 -1563 1699 3656 2392 -1446 -3830 -2956 732 3334 3405 313 -3275
1628c275j9K554L423J345k468m217j001J659L396K405j305l263l025J216K800
$$ -3275 -3294 -740 2683 4028 1560 -2657 -3658 -1999 1397 3802 2497 -766 -3791 -2575 225
1643B25L211J29l175l366m37K441L482J456k195l825j761J559L463K643r63l852
$$ 225 3436 3565 390 -2976 -3413 -972 2510 3966 1771 -2054 -3815 -2256 1207 3850 2887 -965
1659i65k840N80K957L275L07k696l222q90K261L163J717j764l752j682J282L118
$$ -965 -3805 -3225 -268 3007 3314 618 -2604 -3494 -1233 1930 3647 1883 -1869 -3551 -2269 849
1675H49K507o03l260k812J95K731L100R21k567l360j355K015L398J972j422l514
$$ 849 3356 2753 -507 -3319 -3124 -393 2707 3628 1061 -2299 -3654 -1639 1759 3731 2309 -1205
1691a205k221Q76L321K583k42k961l213j27K708K899R85k020l470j427J857L360
$$ -1205 -3426 -2550 771 3354 3112 151 -3062 -3189 -481 2418 3403 1383 -2087 -3514 -1657 1703
1707A703J926r31l503k752Q48L177K606j0k500l517j98K149L101J441k127l261
$$ 1703 3629 2698 -805 -3557 -2709 468 3074 3064 564 -2953 -3151 -1002 2099 3540 1413 -1848
1723a848j477J393L046K106o27l269k591L46K913K938J30k092l348q23J900L118
$$ -1848 -3325 -1932 1114 3220 2593 -676 -3267 -2921 -8 2930 3060 968 -2380 -3203 -1303 1815
1739A815J959j926l176k170J110L159K522n36k968k634k39K925K836M17k335k941
$$ 1815 3774 1848 -1328 -3498 -2388 771 3293 2757 -211 -2845 -3084 -159 2677 3094 759 -2182
1755b182j157K213L019J323j239l222k143Q55L160K293J18l109k712l20K468K998
$$ -2182 -3339 -1126 1893 3216 1977 -1245 -3388 -2533 627 2920 3038 -71 -2783 -3103 -635 2363
1771B363J027k194l303j387J733L171J706p08l442k397R83K725K885m08k654k715
$$ 2363 3390 1196 -2107 -3494 -1761 1410 3116 2408 -1034 -3431 -2448 277 3162 2754 100 -2615
1787b615n77K567K916R67j524l408j618J126L465J956j119k722k297J47K839K836
$$ -2615 -3192 -625 2291 3258 1734 -1674 -3292 -2166 1299 3255 2136 -586 -2883 -2736 103 2939
1803B939j96k316k643q33J832L074J448j856k888j941J322K944J974m83k862k196
$$ 2939 2743 427 -2216 -3049 -1217 1857 3305 1449 -1439 -3380 -2058 886 2860 2377 -485 -2681
1819b681j78K639K506N83k069k837j013J579L151J286j085l202j889J181K741
$$ -2681 -2859 -220 2286 2869 800 -2037 -3050 -1471 1680 2966 1881 -1321 -3210 -2029 712
1834G12K383m39k599k615l10K141K982N76j877k960q40J424K807J546q84k999
$$ 712 3095 2656 57 -2558 -2868 -727 2255 2831 954 -2006 -2846 -1422 1385 2931 2047 -952
1850i52j885O38K426K274J70k441k409n77J829K953J007j754k819j212J158K713
$$ -952 -2837 -2199 227 2501 2671 230 -2179 -2756 -927 2026 3033 1279 -1540 -2752 -1594 1119
1866A119K039j138k633k048J34K683K481K77k532k628m32J729K777J014j365k755
$$ 1119 3158 2020 -613 -2661 -2527 156 2637 2914 382 -2246 -2678 -949 1828 2842 1477 -1278
1882a278j659J084K442K454q55k853k118M15K071K443M06j631l022r64J932K744
$$ -1278 -2937 -1853 589 3043 2188 -665 -2783 -2368 -297 2146 2552 921 -2101 -3065 -1133 1611
1898A611J399j412k658j630Q89K259K379l22k392k758J9K075K754M42j773k615
$$ 1611 3010 1598 -1060 -2690 -1801 458 2837 2515 123 -2635 -2616 -541 2213 2655 882 -1733
1914a733j040J346K785J338p68k690j903N44K271K194J12k449k390m89K217K656
$$ -1733 -2773 -1427 1358 2696 1928 -762 -2665 -2121 150 2344 2456 7 -2383 -2872 -655 2001
1930B001R70j690k990j111J105K510K068q06k624k147L21K405K598q9k088k557
$$ 2001 2971 1281 -1709 -2820 -1715 795 2863 2057 -567 -2714 -2393 12 2610 2521 433 -2124
1946b124o88K016K544R14j457k443j443J306K030J968q23k435j876R6K363K265
$$ -2124 -2812 -796 1748 2662 1205 -1238 -2681 -1375 655 2623 1800 -635 -2511 -2415 -52 2213
1962B213J76j668k423q42J320K761J227j235k656j450P67K496J920m92k332j986
$$ 2213 2389 721 -1702 -2544 -1224 1537 2764 1529 -1127 -2577 -1810 686 2606 2114 -218 -2204
1978b204p1J638K308R61j714k634j145J406K664J348r65k207j803K31K544J863
$$ -2204 -2275 -637 1671 2632 918 -1716 -2861 -1455 1209 2557 1592 -615 -2418 -2187 357 2220
1994B220n4j962k121p01K096K416O99j601k564r34J014K283J724n98k611j730
$$ 2220 2166 204 -1917 -2618 -522 1894 2593 992 -1572 -2506 -1492 791 2515 1917 -694 -2424
2010b424O23J748K404N4k491j795m55J487K566Q14j197k674j405R23K666J823
$$ -2424 -1801 -53 2351 2405 -86 -1881 -2336 -849 1717 2531 1334 -1340 -2745 -1822 844 2667
2026B667j075k000k078J45K242K200K30j760k367n03J134K442J184j171k350j270
$$ 2667 1592 -408 -2486 -2341 -99 2101 2331 571 -1796 -2299 -1165 1277 2461 1290 -1060 -2330
2042b330O12K283J884j79k333k137j70J967K423L22j531k335j437J754K453J108
$$ -2330 -1718 565 2449 2270 -63 -2200 -2370 -403 2020 2342 811 -1524 -2961 -1207 1246 2354
2058B354p29k564j309N30K039J798L16k354j984m58J692K147R11j488k074j342
$$ 2354 1625 -939 -2248 -1718 321 2119 2435 81 -1903 -2361 -669 1478 2389 901 -1173 -2515
2074b515J087K379J862j119k745j307K48K150J967Jj978k019m93J884K254P78
$$ -2515 -1428 951 2813 1694 -1051 -2358 -2110 40 2007 2008 30 -1989 -2482 -598 1656 2434
2090B434j125k522j034P63K116J742n66k437j429q4K339J840J13j570k404n51
$$ 2434 1309 -1213 -2247 -1484 632 2374 1808 -629 -2058 -2142 197 2037 2150 580 -1824 -2375
2106b375J462K161J331j419k028j520M97K407J818l65k000j621l98J960J930M15
$$ -2375 -913 1248 2579 1160 -868 -2388 -1891 516 2334 1969 -31 -1652 -2050 -90 1840 2255
2122B255j448k370n14J015K283J348j078k502j127L26K098J862k12k179j516m35
$$ 2255 807 -1563 -2077 -1062 1221 2569 1491 -1011 -2138 -1812 286 2148 1936 -243 -1759 -2194
2138b194J688K291L78j307k221j082J144K131J277n27k051j546K22J982J746O5
$$ -2194 -506 1785 2163 856 -1365 -2447 -1303 828 2105 1578 -473 -2019 -1797 185 1931 1996
2154A996j710k057l79J600J760Q39j245j698j295P61K061J245j25k157j612L28
$$ 1996 286 -1771 -2150 -550 1210 2049 804 -894 -2189 -1428 633 1878 1753 -404 -2016 -1688
2170a688J940J430K6j598j771n49J338K222P81q72k364r02P91J780J391l78j468
$$ -1688 252 1682 1708 110 -1661 -2210 -872 1350 2131 1259 -1105 -2007 -1216 564 1955 1577 109
2187A09k062P6J780J360J033j717j994q57J419K009J067r76j973j345N25J766
$$ 109 -1953 -1877 -97 1263 2296 579 -1415 -2272 -853 1156 2223 1247 -726 -2071 -1546 220
2203B20J631q2j819j900Q7J347J946Q50j541k141r09J215K061J206j086j584j437
$$ 220 1851 1769 -50 -1950 -1863 -516 1430 2280 739 -1402 -2311 -1096 965 2171 1085 -499 -1936
$$ [...]
8191A27
##END NTUPLES=NMR FID
##END=
