##TITLE=1H_DE-60k_D2O'
 D2O
 8 sc, 
 2.7.2024
##JCAMPDX= 6.0         $$ Bruker NMR JCAMP-DX V2.0
##DATA TYPE= NMR FID
##DATA CLASS= NTUPLES
##ORIGIN= UXNMR, Bruker Analytische Messtechnik GmbH
##OWNER= root
$$ XWIN-NMR		Version 3.5
$$ Tue Jul  2 14:29:32 2024 Russian Standard Time (UT+4h)  she@DPX200
##.OBSERVE FREQUENCY= 200.131
##.OBSERVE NUCLEUS= ^1H
##.DELAY= (6, 6)
##.ACQUISITION MODE= SIMULTANEOUS
##.ACQUISITION SCHEME= undefined
##.AVERAGES= 8
##.DIGITISER RES= 18
##SPECTROMETER/DATA SYSTEM= spect
##.PULSE SEQUENCE= zg30
##.SOLVENT NAME= DMSO
##.SHIFT REFERENCE= (INTERNAL, DMSO, 0, 15.7039)
##AUDIT TRAIL= $$ (NUMBER, WHEN, WHO, WHERE, WHAT)
$$ ##TITLE= Audit trail, XWIN-NMR		Version 3.5
$$ ##JCAMPDX= 5.01
$$ ##ORIGIN= Bruker BioSpin GmbH
$$ ##OWNER= she
$$ F:/spectra/data/she/nmr/H-F/1/audita.txt
$$ ##AUDIT TRAIL=  $$ (NUMBER, WHEN, WHO, WHERE, WHAT)
(   1,<2024-07-02 14:28:34.23 +0400>,<she>,<DPX200>,
      <created by zg, POWCHK disabled, PULCHK disabled
       configuration hash MD5:
       00 E9 B6 7A A2 85 ED C7 34 08 36 98 17 FE 4E 26
       data hash MD5: 16K
       A3 04 62 C3 F2 C4 AB 0B 7C 3D 8C 89 10 37 BC A4>)
$$ ##END=
$$ 
$$ hash MD5
$$ F3 FF 3B C3 F5 4D 5B 79 A0 C2 F3 C1 80 59 59 AD
##$RELAX= 
##$RELAX= 
##$RELAX= 
##$RELAX= 
##$RELAX= 
##$RELAX= 
$$ Bruker specific parameters
$$ --------------------------
##$DU= <F:/spectra>
##$EXPNO= 1
##$NAME= <H-F>
##$PROCNO= 1
##$TYPE= <nmr>
##$USER= <she>
##$AMP= (0..31)
100 100 100 100 100 100 100 100 100 100 100 100 100 100 100 100 100 100 
100 100 100 100 100 100 100 100 100 100 100 100 100 100 
##$AQSEQ= 0
##$AQ_mod= 1
##$AUNM= <au_zg>
##$AUTOPOS= <>
##$BF1= 200.13
##$BF2= 200.13
##$BF3= 200.13
##$BF4= 200.13
##$BF5= 200.13
##$BF6= 200.13
##$BF7= 200.13
##$BF8= 200.13
##$BYTORDA= 1
##$CFDGTYP= 0
##$CFRGTYP= 5
##$CHEMSTR= <none>
##$CNST= (0..31)
1 1 145 1 1 1 1 1 1 1 1 1 1 1 1 1 1 1 1 1 1 1 1 1 1 1 1 1 1 1 1 1 
##$CPDPRG= <>
##$CPDPRG1= <>
##$CPDPRG2= <>
##$CPDPRG3= <>
##$CPDPRG4= <mlev>
##$CPDPRG5= <mlev>
##$CPDPRG6= <mlev>
##$CPDPRG7= <mlev>
##$CPDPRG8= <mlev>
##$CPDPRGB= <>
##$CPDPRGT= <>
##$D= (0..31)
0 1.2 0 0 0 0 0 0 0 0.06 0 0.03 0 0 0 0 0.0002 0 0 0 0 0 0 0 0 0 0 0 0 
0 0 0 
##$DATE= 1719916113
##$DBL= (0..7)
120 120 120 120 120 120 120 120 
##$DBP= (0..7)
150 150 150 150 150 150 150 150 
##$DBP07= 0
##$DBPNAM0= <>
##$DBPNAM1= <>
##$DBPNAM2= <>
##$DBPNAM3= <>
##$DBPNAM4= <>
##$DBPNAM5= <>
##$DBPNAM6= <>
##$DBPNAM7= <>
##$DBPOAL= (0..7)
0.5 0.5 0.5 0.5 0.5 0.5 0.5 0.5 
##$DBPOFFS= (0..7)
0 0 0 0 0 0 0 0 
##$DE= 6
##$DECBNUC= <off>
##$DECIM= 32
##$DECNUC= <off>
##$DECSTAT= 4
##$DIGMOD= 1
##$DIGTYP= 9
##$DL= (0..7)
0 120 120 120 120 120 120 120 
##$DP= (0..7)
150 150 150 150 150 150 150 150 
##$DP07= 0
##$DPNAME0= <>
##$DPNAME1= <>
##$DPNAME2= <>
##$DPNAME3= <>
##$DPNAME4= <>
##$DPNAME5= <>
##$DPNAME6= <>
##$DPNAME7= <>
##$DPOAL= (0..7)
0.5 0.5 0.5 0.5 0.5 0.5 0.5 0.5 
##$DPOFFS= (0..7)
0 0 0 0 0 0 0 0 
##$DQDMODE= 0
##$DR= 18
##$DS= 0
##$DSLIST= <SSSSSSSSSSSSSSS>
$$ [...]
##$SUBNAM2= <"">
##$SUBNAM3= <"">
##$SUBNAM4= <"">
##$SUBNAM5= <"">
##$SUBNAM6= <"">
##$SUBNAM7= <"">
##$SUBNAM8= <"">
##$SUBNAM9= <"">
##$SW= 18.0517599122864
##$SWIBOX= (0..15)
0 0 2 0 0 0 0 0 0 0 0 0 0 0 0 0 
##$SW_h= 3612.71676300578
##$TD= 16384
##$TD0= 1
##$TE= 0
##$TE2= 300
##$TE3= 300
##$TEG= 300
##$TL= (0..7)
0 120 120 120 120 120 120 120 
##$TP= (0..7)
150 150 150 150 150 150 150 150 
##$TP07= 0
##$TPNAME0= <>
##$TPNAME1= <>
##$TPNAME2= <>
##$TPNAME3= <>
##$TPNAME4= <>
##$TPNAME5= <>
##$TPNAME6= <>
##$TPNAME7= <>
##$TPOAL= (0..7)
0.5 0.5 0.5 0.5 0.5 0.5 0.5 0.5 
##$TPOFFS= (0..7)
0 0 0 0 0 0 0 0 
##$TUNHIN= 0
##$TUNHOUT= 0
##$TUNXOUT= 0
##$USERA1= <user>
##$USERA2= <user>
##$USERA3= <user>
##$USERA4= <user>
##$USERA5= <user>
##$V9= 5
##$VALIST= <valist>
##$VCLIST= <CCCCCCCCCCCCCCC>
##$VD= 0
##$VDLIST= <DDDDDDDDDDDDDDD>
##$VPLIST= <PPPPPPPPPPPPPPP>
##$VTLIST= <TTTTTTTTTTTTTTT>
##$WBST= 1024
##$WBSW= 4
##$XGAIN= (0..3)
0 0 0 0 
##$XL= 0
##$YL= 0
##$YMAX_a= 68800
##$YMIN_a= -100400
##$ZGOPTNS= <>
##$ZL1= 120
##$ZL2= 120
##$ZL3= 120
##$ZL4= 120
##$ABSF1= 10
##$ABSF2= 0
##$ABSG= 5
##$ABSL= 3
##$ALPHA= 0
##$AQORDER= 0
##$ASSFAC= 0
##$ASSFACI= 0
##$ASSFACX= 0
##$ASSWID= 0
##$AUNMP= <proc_1d>
##$AZFE= 0.1
##$AZFW= 0.1
##$BCFW= 1
##$BC_mod= 2
##$BYTORDP= 1
##$COROFFS= 0
##$CY= 11.3945322036743
##$DATMOD= 1
##$DC= 2
##$DFILT= <>
##$DTYPP= 0
##$F1P= 15.6554695791079
##$F2P= 12.8336369535428
##$FCOR= 0.5
##$FTSIZE= 0
##$FT_mod= 4
##$GAMMA= 1
##$GB= 0.15
##$INTBC= 1
##$INTSCL= 1
##$ISEN= 128
##$LB= 0.24
##$LEV0= 0
##$LPBIN= 0
##$MAXI= 10000
##$MC2= 0
##$MEAN= 0
##$ME_mod= 0
##$MI= 1.114404
##$NCOEF= 0
##$NC_proc= 0
##$NLEV= 6
##$NOISF1= 3.799351
##$NOISF2= 2.8
##$NSP= 1
##$NTH_PI= 0
##$NZP= 0
##$OFFSET= 15.70392
##$PC= 1
##$PHC0= -25319.7
##$PHC1= 6.98748
##$PH_mod= 1
##$PKNL= yes
##$PPARMOD= 0
##$PSCAL= 0
##$PSIGN= 0
##$REVERSE= no
##$SF= 200.130013532006
##$SI= 16384
##$SIGF1= 3
##$SIGF2= 2
##$SINO= 400
##$SIOLD= 16384
##$SREGLST= <1H.CDCl3>
##$SSB= 0
##$STSI= 0
##$STSR= 0
##$SW_p= 3612.71676300578
##$SYMM= 0
##$S_DEV= 0
##$TDeff= 0
##$TDoff= 0
##$TI= <>
##$TILT= no
##$TM1= 0
##$TM2= 0
##$TOPLEV= 0
##$USERP1= <user>
##$USERP2= <user>
##$USERP3= <user>
##$USERP4= <user>
##$USERP5= <user>
##$WDW= 1
##$XDIM= 8192
##$YMAX_p= 0
##$YMIN_p= 0
$$ End of Bruker specific parameters
$$ ---------------------------------
##NTUPLES= NMR FID
##VAR_NAME=  TIME,          FID/REAL,        FID/IMAG
##SYMBOL=    X,             R,               I
##VAR_TYPE=  INDEPENDENT,   DEPENDENT,       DEPENDENT
##VAR_FORM=  AFFN,          ASDF,            ASDF
##VAR_DIM=   8192,          8192,            8192
##UNITS=     SECONDS,       ARBITRARY UNITS, ARBITRARY UNITS
##FACTOR=    0.0002768,     1,               1
##FIRST=     0,             0,               0
##LAST=      2.2672688,     0,               0
##MIN=       0,             -100400,         0
##MAX=       2.2672688,     68800,           0
$$ Real data points
##PAGE= N=1
##DATA TABLE= (X++(R..R)), XYDATA
$$ [...]
$$ plain form
1862 -437 -364 -261 311 574 265 -346 -416 -102 209 345 216 38 -188 -197 472 352 190 -372 -539 -291 -73
1883 -73 665 409 -203 -456 -440 18 453 317 -190 -572 -455 9 348 383 -126 -565 -572 -146 561 434 527 -489
1905 -489 -452 -71 263 455 258 -495 -210 -219 213 395 399 -270 -473 -342 274 531 546 -50 -279 -228 -84 446
1927 446 323 -234 -439 -313 46 534 91 -174 -393 -378 47 438 284 81 -227 -244 -196 361 327 122 -276
1948 -276 -250 -225 195 360 258 -112 -351 -185 189 216 150 -284 -441 -345 216 326 162 52 -402 -363 332 350
1970 350 403 -99 -227 -195 -226 292 484 -70 -386 -137 -35 193 378 20 -503 -363 100 263 445 263 -289
1991 -289 -478 80 367 288 412 -59 -297 59 199 343 352 10 -445 -405 54 218 345 -118 -279 -272 65 267
2013 267 313 224 -299 -558 -49 442 392 66 -488 -276 -124 22 116 188 -412 -207 -303 409 395 316 -116 -333 -22
$$ packed form
1862d37P3J03N72K63l09o11p0L14L11J36j29j78k26rO69j20j62n62j67K48K18
1883g3P38k56o12k53J6M58M35j36n07l82J17M64L39L5n09m39pM26P07j27R3j016
1905d89L7L81L34J92j97p53K85rM32J82Mo69k03J31O16K57J5n96k29N1J44N30
1927D46j23n57k05J26L59M88m43k65k19J5M25L91j54k03l08j7M8N57l4k05l98
1948b76K6K5M20J65j02l70k39J66L74K7o6m34j57R6N61J10j64j10m54L9O95J8
1970C50N3n02j28L2l1N18J92n54l16K49J02K28J85l58n23J40M63J63J82j82n52
1991b89j89N58K87p9J24m71k38L56J40J44Rl42m55M0M59J64J27m63j61PL37K02
2013B67M6q9n23k59N09M91n0l26n54K12J52J46R4P2o00K05r6P12j4p9m32k17L11
$$ plain form
2036 -22 -33 379 102 -301 -452 -265 279 297 87 -164 -474 -229 119 368 185 -62 -154 -186 -156 405 694 -162
2058 -162 -330 -132 45 268 328 -80 -97 -603 -106 72 249 263 -371 -496 -240 407 537 271 84 -358 -68
2079 -68 291 23 -49 -57 -392 -603 -69 374 600 -256 -265 -168 -91 173 -110 61 63 194 10 325 169 190 -15 -354
2103 -354 -193 41 478 232 -133 -130 -163 277 278 241 81 -216 -262 -199 182 188 -50 -255 131 182 384 196 -206 -298
2127 -298 -407 -19 377 225 -68 -373 -131 -24 48 209 -41 -250 -308 -89 82 204 379 47 -187 -107 269
2148 269 360 112 -377 -298 -143 331 336 172 -17 -221 -326 78 314 259 -155 103 -140 153 171 -85 106 -366
2170 -366 -370 192 209 317 -5 -187 -463 -6 333 198 70 -152 -149 -530 18 345 29 -344 -375 -89 76 530
2192 530 157 -200 -354 -74 123 244 289 -226 -391 -69 53 153 249 -61 -512 -121 -27 353 152 -124 -131 -295
$$ packed form
2036b2j1M12k77m03j51J87N44J8k10k51l10K45L48K49j83k47r2l2L0N61K89q56
2058a62j68J98J77K23O0m08j7n06M97J78J77J4o34j25K56O47J30k66j87m42K90
2079f8L59k68p2ql35k11N34M43K26q56rR7P7K64k83J71KJ31j84L15j56K1k05l39
2103c54J61K34M37k46l65Ll3M40Jl7j60k97m6O3L81Ok38k05L86N1K02j88m02r2
2127b98j09L88L96j52k93l05K42J07P2J61k50k09n8K19J71J22J75l32k34Q0L76
2148B69R1k48m89P9J55M74Nj64j89k04j05M04K36n5m14K58k43K93J8k56J91m72
2170c66mN62J7J08l22j82k76M57L39j35j28k22Ll81N48L27l16l73l1K86J65M54
2192E30l73l57j54K80J97J21M5n15j65L22J22J00R6l10m51L91R4L80k01k76pj64
$$ plain form
2214 -295 24 205 216 80 68 -27 -103 70 90 -110 -302 -381 -5 -42 245 22 52 -92 -312 209 24 292 -115
2237 -115 -489 -30 130 284 -4 -135 -182 -44 199 293 459 117 -34 -278 189 234 -158 151 -216 -10 106
2258 106 -29 157 51 -142 -323 -129 185 352 197 -55 -354 -60 100 246 -230 -122 36 -351 51 193
2278 193 62 108 -163 -34 -151 1 195 -416 -124 -384 4 146 164 55 49 -21 231 177 191 156 -111 -87 63
2301 63 390 -95 -38 155 -207 -374 199 245 188 -145 -67 42 147 429 -48 -77 -17 -36 135 218 230 -58 10 -14
2325 -14 -35 416 444 -110 45 -11 -50 212 -203 168 -221 -242 -25 213 324 62 25 -257 116 59 324 -122 -37
2348 -37 -216 -404 51 22 91 -140 -268 -174 -12 24 -140 -32 -228 -160 77 266 272 164 22 -191 148 -73 352
2371 352 0 -151 -314 -175 55 160 64 -153 -218 -80 -220 347 152 -86 -9 68 30 182 -8 -2 -142 -215 -200
$$ packed form
2214b95L19J81J1j36j2r5p6J73K0k00j92p9L76l7K87k23L0j44k20N21j85K68m07
2237a15l74M59J60J54k88j31m7J38K43R4J66l42j51k44M67M5l92L09l67K06J16
2258A06j35J86j06j93j81J94L14J67j55k52k99K94J60J46m76J08J58l87M02J42
2278A93j31M6k71J29j17J52J94o11K92k60L88J42J8j09op0K52n4J4l5k67K4J50
2301F3L27m85N7J93l62j67N73M6n7l33P8J09J05K82m77k9O0j9J71Q3J2k88O8k4
2325a4k1M51K8n54J55n6l9K62m15L71l89k1K17K38J11k62l7k82L73n7K65m46Q5
2348c7j79j88M55k9O9k31j28R4J62L6j64J08j96O8K37J89Oj08j42k13L39k21M25
2371C52l52j51j63J39K30J05r6k17o5J38j40N67j95k38P7P7l8J52j90Oj40p3J5
$$ plain form
2394 -200 123 139 -259 -174 -47 192 -158 -30 -86 86 -55 -427 -57 388 -100 -58 -20 -178 -108 106 100 92 -226
2417 -226 -246 220 309 -86 93 -59 -171 323 78 173 5 -456 -209 -50 13 -85 126 -29 -107 -221 36 128
2439 128 94 -110 -388 -227 84 -5 205 -264 -277 199 462 275 -31 -56 -183 -106 -116 49 -10 -166 -59 -148 12
2462 12 429 -257 103 -245 115 129 189 209 -135 -223 -138 -10 71 -7 -106 -201 -63 159 -118 -11 14 -121 -166 67
2486 67 -180 25 36 53 -159 -14 283 78 16 -22 -2 -19 -302 140 85 -129 9 -186 50 65 352 3 86
2509 86 -398 -256 -87 -6 240 -83 -216 -42 186 -61 -63 135 -313 60 228 35 98 -74 115 -269 113 224
2531 224 74 -96 -84 -429 37 -124 -74 -154 -256 -32 172 168 270 -222 20 125 -114 168 15 -135 -110 -137
2553 -137 -8 105 -43 -88 -202 134 -3 360 66 125 28 -108 -182 64 118 157 -156 182 -45 12 195 -36
$$ packed form
2394b00L23J6l98Q5J27K39l50J28n6J72j41l72L70M45m88M2L8j58P0K14oql18
2417b26k0M66Q9l95J79j52j12M94k45R5j68m61K47J59O3r8K11j55p8j14K57R2
2439A28l4k04k78J61L11q9K10m69j3M76K63j87l06k5j27P7j0J65n9j56J07q9J60
2462A2M17o86L60l48L60J4O0K0l44q8Q5J28Q1p8r9r5J38K22k77J07K5j35m5K33
2486F7k47K05J1J7k12J45K97k05o2l8K0j7k83M42n5k14J38j95K36J5K87l49Q3
2509H6m84J42J69Q1K46l23j33J74K28k47kJ98m48L73J68j93O3j72J89l84L82J11
2531B24j50j70J2l45M66j61N0q0j02K24K04mJ02m92K42J05k39K82j53j50K5k7
2553a37J29J13j48m5j14L36j37L63k94N9r7j36p4K46N4L9l13L38k27N7J83k31
$$ plain form
2575 -36 -213 320 222 156 -41 187 -48 -87 151 -46 32 -18 -200 -130 59 -31 -33 188 -151 134 -173 -52 -110 -73
2599 -73 162 -21 191 -271 197 253 335 33 -125 108 -50 357 8 -232 -335 -133 -18 152 -78 -70 -226 234
2621 234 13 45 -19 196 -89 12 -14 -44 181 174 -88 -166 97 -316 113 279 -11 -237 -61 5 -75 -78 104 -147
2645 -147 -136 75 -439 56 168 -267 -27 -209 38 -22 178 -87 54 -54 78 -60 -9 98 -74 122 241
2666 241 144 37 -155 -56 27 142 66 54 -2 71 -361 37 38 -5 -61 137 -26 -53 90 368 72 64 180 -64 357
2691 357 -168 27 22 89 -85 207 117 136 -61 -142 -15 -63 239 -145 -24 -248 124 -80 -49 -23 60 -245 -176 40
2715 40 10 47 91 -76 81 -65 -51 -37 -152 68 -23 -40 171 362 -170 -251 226 -138 -56 -24 88 -116 198 -146
2739 -146 -119 -65 101 -48 108 -144 192 118 25 157 -10 59 240 2 -53 -56 108 -276 42 -102 8 -70 -124
$$ packed form
2575c6j77N33r8o6j97K28k35l9K38j97P8n0j82P0J89r0kK21l39K85l07J21n8L7
2599g3K35j83K12m62M68N6Q2l02j58K33j58M07l49k40j03K02J15J70k30Qj56M60
2621B34k21L2o4K15k85J01k6l0K25pk62p8K63m13M29J66k90k26J76O6q0lJ82k51
2645a47J1K11n14M95J12m35K40j82K47o0K00k65J41j08J32j38N1J07j72J96J19
2666B41r7j07j92R9Q3J15p6j2n6P3m32L98Jm3n6J98j63k7J43K78k96qJ16k44M21
2691C57n25J95nO7j74K92r0J9j97q1J27m8L02l84J21k24L72k04L1K6Q3l05O9K16
2715D0l0L7M4j67J57j46J4J4j15K20r1j7K11J91n32q1M77l64Q2L2J12k04L14l44
2739a46K7N4J66j49J56k52L36p4r3J32j67O9J81k38n5lJ64l84L18j44J10p8n4
$$ plain form
2762 -124 -41 -146 -50 47 370 279 -35 -21 -142 165 34 -117 27 69 -124 -2 32 -33 -316 -80 48 -25 75
2785 75 -112 129 90 142 93 -6 113 272 87 -51 5 -59 179 -26 -125 225 143 -78 -49 139 118 92 -44 -263
2809 -263 36 84 -174 -189 9 -43 200 -51 85 -100 7 -42 129 97 -117 -63 106 112 -135 144 107 49 -8 -23
2833 -23 74 228 110 -313 -122 120 -59 164 -52 -82 94 13 -155 155 56 -108 46 109 38 -220 -124 61 158
2856 158 -19 154 227 -12 -79 -244 -137 -224 -59 -182 151 -66 -167 -122 34 -73 -96 -219 -91 -146 50 -68
2878 -68 -137 -286 138 159 -18 261 -214 -214 163 -59 -54 111 -294 -27 -262 84 -16 52 41 -252 -235 -130 -108 -239
2902 -239 -109 -54 165 -193 -343 77 227 127 46 -130 152 81 -89 80 -27 -1 -123 -90 -176 46 -315 48
2924 48 123 -60 112 -64 -228 -206 -24 157 -148 248 2 212 -173 45 -188 -197 325 -21 -34 83 81 260 95
$$ packed form
2762a24Q3j05R6R7L23r1l14J4j21L07j31j51J44M2j93J22L4o5k83K36J28p3J00
2785G5j87K41l9N2m9r9J19J59j85j38N6o4K38k05r9L50q2k21K9J88k1k6j36k19
2809b63K99M8k58j5J98n2K43k51J36j85J07m9J71l2k14N4J69Ok47K79l7n8n7j5
2833b3R7J54j18m23J91K42j79K23k16l0J76q1j68L10r9j64J54O3p1k58R6J85R7
2856A58j77J73P3k39o7j65J07q7J65j23L33k17j01M5J56j07k3j23J28n5J96j18
2878f8o9j49M24K1j77K79m75%L77k22NJ65m05K67k35L46j00O8j1k93J7J05K2j31
2902b39J30N5K19l58j50M20J50j00q1j76K82p1j70J69j07K6j22L3q6K22l61L63
2924D8P5j83J72j76j64K2J82J81l05L96k46K10l85K18k33rN22l46j3J17kJ79j65
$$ plain form
2947 95 -150 171 306 150 14 40 -29 -47 270 -51 1 -72 150 3 -166 -157 -97 -18 191 -2 90 -1 182 288
2971 288 -256 -46 -83 78 -222 -16 -79 162 -311 -118 24 242 -79 -121 166 -95 -9 -38 -42 -434 -233 -226 68
2994 68 -124 -100 42 103 143 177 -153 113 157 -65 -382 200 118 84 27 -31 -111 -25 170 30 -23 223 -25 143
3018 143 -113 150 39 -13 240 215 184 116 -124 -98 85 301 154 185 -157 -281 59 -323 31 14 132 182 -206
3041 -206 26 213 99 203 -36 -29 1 279 66 65 432 -92 -204 221 131 -339 272 -131 -29 -167 3 211
3063 211 -9 19 -1 14 -118 206 441 -281 -17 -13 -118 -276 -147 114 65 -148 -178 30 -369 105 28 -113 215
3086 215 94 126 -134 -183 2 -267 222 242 81 52 47 279 179 319 95 -19 58 288 -179 271 -141 -6
3108 -6 118 -158 -82 76 20 -140 64 4 -178 320 44 173 -21 -24 258 -298 -106 34 71 -136 201 -291 29
$$ packed form
2947I5k45L21J35j56j36K6o9j8L17l21N2p3K22j47j69RO0P9K09j93R2r1J83J06
2971B88n44K10l7J61l00K06o3K41m73J93J42K18l21m2K87k61Q6k9ml92K01PK94
2994F8j92K4J42O1M0L4l30K66M4k22l17N82q2l4n7n8q0Q6J95j40n3K46k48J68
3018A43k56K63j11n2K53k5l1o8k40K6J83K16j47L1l42j24L40l82L54j7J18N0l88
3041b06K32J87j14J04k39PL0K78k13jL67n24j12M25r0m70O11m03J02j38J70K08
3063B11k20K8k0J5j32L24K35p22K64Mj05j58J29K61m9k13l0K08l99M74p7j41L28
3086B15j21L2k60m9J85k69M89K0j61k9nK32j00J40k24j14P7K30m67M50m12J35
3108fJ24k76P6J58n6j60K04o0j82M98k76J29j94lK82n56J92J40L7k07L37m92L20
$$ plain form
3131 29 -95 -12 191 -204 -68 95 -200 -108 -144 -80 -119 34 -107 -216 -156 58 201 74 27 -73 136 148 15
3154 15 84 97 -15 84 155 -41 419 31 -81 -171 -53 189 192 197 6 -70 -24 -81 80 17 -145 -132 -150 -162 65 -8
3180 -8 -108 -78 -172 5 42 39 196 41 -357 -214 286 44 198 -129 -59 -116 70 27 -140 -172 -176 -7 0 0 -200 26
3206 26 -69 -131 170 -76 7 9 -98 -329 -142 5 193 43 -428 161 193 -89 197 96 103 -77 175 134 272
3229 272 -11 -1 -118 5 69 7 -101 -35 133 257 92 -160 -267 -125 -210 49 129 104 -17 80 91 -59 306
3252 306 222 137 14 -50 -172 181 289 124 154 13 91 45 -70 175 -59 208 -236 120 64 -41 190 -102
3274 -102 -136 -178 66 105 81 -104 -11 41 -96 146 -134 60 -191 -339 -217 29 5 49 34 -75 245 -101 -173
3297 -173 -101 -12 -78 -22 72 140 -22 -104 -158 23 147 334 2 74 150 66 62 98 -94 34 49 -148 -295 4 131
$$ packed form
3131B9j24Q3K03l95J36J63k95R2l6O4l9J53j41j09O0K14J43j27m7j00K09J2j33
3154A5O9J3j12R9P1j96M60l88j12r0J18K42LNj91p6M6n7J61o3j62J3j8j2K27p3
3180hj00L0r4J77L7lJ57j55l98J43N00k42J54l27P0n7J86m3j67l2mJ69P%k00K26
3206B6r5o2L01k46Q3Kj07k31J87J47J88j50m71N89L2k82K86j01Pj80K52m1J38
3229B72k83J0j17J23O4o2j08O6J68J24j65k52j07J42q5K59Q0k5j21R7J1j50L65
3252C06q4q5j23o4j22L53J08j65L0j41P8m6j15K45k34K67m44L56n6j05K31k92
3274a02l4m2K44L9k4j85R3N2j37K42k80J94k51j48J22K46k4M4j5j09L20l46p2
3297a73P2Q9o6N6R4O8j62q2n4J81J24J87l32P2P6q4mL6j92J28J5j97j47K99J27
$$ plain form
3322 131 -128 -53 -163 -135 63 -57 -103 -323 60 -228 151 180 -325 43 -213 285 28 4 14 98 -74 108
3344 108 54 108 16 -298 -79 94 40 -177 -114 11 -195 -141 -1 -240 -31 -118 82 -71 -121 78 163 -6 -41
3367 -41 -40 95 115 -153 92 -121 -181 29 -22 -53 -59 51 -157 36 434 3 138 22 -113 145 -57 -6 -131
3390 -131 -29 179 -2 85 195 148 -68 62 133 -201 -119 -122 32 -2 80 13 186 416 -8 88 189 -195 133
3413 133 -8 -150 -44 -195 -428 34 -40 -241 35 -185 253 11 -30 -22 -185 -85 -83 -167 161 -155 89 273
3435 273 -213 -109 66 1 -201 -257 -28 -22 -219 67 172 137 -288 -182 18 54 43 -47 76 4 -186 172 103
3458 103 -106 -335 33 -38 152 -63 -69 -86 -148 25 -156 -132 -392 41 -137 82 -81 -87 -67 29 207 70 -95
3481 -95 -104 94 105 -117 -172 117 14 -251 -166 -42 -168 -128 69 228 -214 -25 6 66 46 -86 -38 -264 -118 -273
$$ packed form
3322A31k59P5j10K8J98j20m6k20L83k88L79K9n05L68k56M98k57k4J0Q4j72J82
3344A08n4N4r2l14K19J73n4k17O3J25k06N4J40k39K09q7K00j53n0J99Q5j69l5
3367d1JJ35K0k68K45k13o0K10n1l1oJ10k08J93L98m31J35j16j35K58k02N1j25
3390a31J02K08j81Q7J10m7k16J30P1l34Q2lJ54l4Q2o7J73K30m24R6J01l84L28
3413A33j41j42J06j51k33M62p4k01K76k20M38k42m1Qj63J00Kq4L28l16K44J84
3435B73m86J04J75o5k02n6K29Oj97K86J05l5m25J06K00L6j1r0J23p2j90L58o9
3458A03k09k29L68p1J90k15oj7o2J73j81K4k60M33j78K19j63oK0R6J78j37j65
3481i5rJ98J1k22n5K89j03k65Q5J24j26M0J97J59m42J89L1O0k0j32M8k26J46j55
$$ plain form
3505 -273 -111 -54 186 -140 -262 -18 -97 -75 124 331 -96 96 143 101 63 -111 -23 145 87 -65 8 26 -121
3528 -121 91 -127 79 93 63 -89 14 83 -59 -283 -139 85 -35 -136 -242 185 97 -271 -110 -107 212 -30
3550 -30 -311 138 -192 -87 174 96 63 -100 -280 -125 14 -261 -149 129 -124 -162 -113 121 94 -161 54 2
3572 2 220 92 60 173 150 161 143 -25 -93 -78 -161 17 34 66 -40 219 12 132 -40 191 98 -203 -75 2
3596 2 -115 262 102 133 160 105 80 219 -131 -250 86 126 -50 -316 208 368 11 -102 -88 -35 145 -53 48
3619 48 -27 -44 196 77 101 206 -16 87 170 -145 154 12 -107 2 -86 -230 -301 -83 -29 -73 -252 250 -129
3642 -129 -124 22 -300 88 318 -13 -89 188 -28 89 -13 18 -34 113 24 17 80 -28 18 -75 116 -37 -19 59
3666 59 101 -343 12 51 -358 -329 168 -261 -5 -108 294 -108 26 -89 -171 -18 -205 3 65 -203 -49 219
$$ packed form
3505b73J62N7K40l26j22K44p9K2J99K07m27J92M7m2l8j74Q8J68n8j52P3J8j47
3528a21K12k18K06J4l0j52J03O9j42k24J44K24j20j01j06M27q8l68J61LL19k42
3550c0k81M49l30J05K61p8l3j63j80J55J39k75J12K78k53l8M9K34k7k55K15n2
3572BK18j28l2J13k3J1j8j68o8J5q3J78J7L2j06K59k07J20j72K31r3l01J28P7
3596Bj17L77j60L1K7n5k5J39l50j19L36M0j76k66N24J60l57j13J4N3J80j98J01
3619D8p5j7K40j19K4J05k22J03Q3l15K99j42j19J09q8j44p1K18N4m4j79N02l79
3642a29NJ46l22L88K30l31p6K77k16J17j02L1n2J47q9pO3j08M6r3J91j53J8P8
3666E9M2m44L55L9m09K9M97m29K56j03M02m02J34j15q2J53j87K08O2k68J54K68
$$ plain form
3688 219 0 121 3 3 14 -93 174 108 79 112 44 -32 -256 31 -35 1 -181 -243 -102 6 127 -82 -122 -333
3712 -333 23 281 -5 50 -151 280 -53 145 14 -143 -60 110 -74 148 -112 54 132 -11 40 -200 30
3733 30 -146 420 32 347 6 -373 -27 171 -247 74 9 -203 122 -210 -45 296 -154 83 -116 76 19
3754 19 -115 -44 -30 214 -74 -13 -83 -44 -173 -71 -9 -92 -78 -196 -103 -213 266 -193 -313 -32 149 126 47 -96
3778 -96 84 -93 -227 -140 -32 98 127 -280 62 -11 100 -260 205 -38 -371 126 186 -184 -69 -36 -225 -15
3800 -15 161 15 72 110 -47 42 146 146 120 -435 -227 -13 -38 233 -176 28 -11 132 115 -76 34 121 -37 -41
3824 -41 -14 127 160 -208 -14 191 148 46 220 43 -117 -90 -116 36 101 129 -53 2 -46 46 119 -158 180 198
3848 198 78 193 207 82 -11 -187 36 352 -204 -107 157 35 138 -195 -89 197 135 33 195 -136 -227 75
$$ packed form
3688B19k19J21j18%J1j07K67o6k9L3o8p6k24K87o6L6j82o2J41J08J21k09m0k11
3712c33L56K58k86N5k01M31l33J98j31j57Q3J70j84K22k60J66P8j43N1k40K30
3733C0j76N66l88L15l41l79L46J98m18L21o5k12L25l32J65L41m50K37j99J92n7
3754A9j34P1J4K44k88O1p0L9j29J02O2q3J4j18R3j10M79m59j20K81J81k3p9j43
3778i6J80j77j34Q7J08J30K9m07L42p3J11l60M65k43l33M97O0l70J15L3j89K10
3800a5J76j46N7L8j57Q9J04%k6n55K08K14k5K71m09K04l9J43j7j91J10Q7j58m
3824d1K7J41L3l68J94K05m3j02J74j77j60K7k6J52O5K8j82N5m8R2P3k77L38J8
3848A98j20J15J4j25r3j76K23L16n56R7K64j22J03l33J06K86o2j02J62l31r1L02
$$ plain form
3870 75 -252 134 -105 -100 76 -26 -101 71 142 160 -173 -196 -85 -116 -167 51 145 221 -188 15 -396 -174 -77 -197
3894 -197 29 139 185 76 -64 -40 32 -93 299 4 17 -174 57 -183 216 -87 -218 164 275 -13 -46 -52
3916 -52 -54 -45 460 281 -115 21 40 21 1 60 -41 -68 166 -81 81 277 3 8 8 86 -185 343 -230 -592 -102
3941 -102 -206 -10 16 46 -24 -196 88 72 -217 9 69 -142 -339 196 -96 288 -108 -147 -40 -44 82 228 208
3964 208 2 -24 76 322 240 9 -30 224 -32 -20 174 3 -124 99 125 -289 -22 -90 -367 -87 163 -129
3986 -129 -105 20 -89 -117 -105 22 139 192 22 -87 -206 194 -65 107 70 60 5 53 17 -4 155 144 -110 -34
4010 -34 -101 -82 341 64 31 152 -9 202 225 172 -203 -5 9 32 102 -147 -102 33 34 -5 -105 -25 102 97 114 -165
4036 -165 186 -167 28 -12 -73 -103 -26 163 -178 59 -114 143 106 203 55 23 -111 189 -42 -43 -321 -38 -276
$$ packed form
3870G5l27L86k39NJ76j02p5J72P1J8l33k3J11l1n1K18R4P6m09K03m11K22R7j20
3894a97K26J10M6j09j40K4P2j25L92k95J3j91K31k40L99l03j31L82J11k88l3o
3916e2kRN05j79l96J36J9j9k0N9j01k7K34k47J62J96k74N%P8k71N28n73l62M90
3941a02j04J96K6L0p0j72K84j6k89K26O0k11j97N35k92L84l96l9J07mJ26J46k0
3964B08k06k6J00K46q2k31l9K54k56J2J94j71j27K23K6m14K67o8k77K80K50k92
3986a29K4J25j09k8J2J27J17N3j70j09j19M00k59J72l7j0n5M8l6k1J59j1k54P6
4010c4o7J9M23k77l3J21j61K11K3n3l75J98J4K3P0k49M5J35Jl9j00Q0J27nJ7k79
4036a65L51l53J95m0o1l0P7J89l41K37j73K57l7R7j48l2j34L00k31jk78K83k38
$$ plain form
4059 -276 -302 96 163 9 -40 136 -47 309 154 -37 -58 -242 114 -276 -7 111 58 -28 126 137 312 115
4081 115 -251 129 -236 24 16 -66 96 -134 -70 48 -147 81 160 13 -15 116 8 0 -196 -81 -39 129 -85
4104 -85 109 294 121 -110 78 64 341 -71 -122 -56 7 193 391 -172 -94 82 177 74 -155 34 -44 -231 -70
4127 -70 -186 2 41 -184 163 -8 229 -60 199 161 -336 131 -75 478 180 -159 -315 -216 154 -114 106
4148 106 170 -53 -100 -40 -50 -47 66 -47 161 1 78 194 -221 51 131 -139 105 -116 39 370 2 -179 111
4171 111 -10 -52 14 -85 170 -114 0 228 12 -390 157 78 -47 0 202 -98 -106 236 35 34 -4 -51 -134 39
4195 39 185 343 65 215 -391 219 116 49 -73 -78 74 -143 78 88 30 -206 10 -73 128 -17 30 296 -186
4218 -186 -167 -119 19 49 108 -368 -1 3 163 10 174 -312 -171 -115 -179 -60 16 83 -13 -68 -14 -4 134 151 -56
$$ packed form
4059b76k6L98O7j54m9J76j83L56j55j91k1j84L56l90K69J18n3q6J54J1J75j97
4081A15l66L80l65K60qq2J62k30O4J18j95K28P9j47k8J31j08qj96J15M2J68k14
4104h5J94J85j73k31J88j4K77m12n1O6O3J86J98n63P8J76R5j03k29J89p8j87J61
4127g0j16J88L9k25L47j71K37k89K59l8m97M67k06N53k98l39j56R9L70k68K20
4148A06O4k23m7O0j0LJ13j13K08j60P7J16m15K72Q0k70K44k21J55L31l68j81K90
4171A11j21m2O6r9K55k84J14K28k16m02N47p9j25M7K02l00qL42k01jl8m7q3J73
4195C9J46J58k78J50o06O10j03o7j22nJ52k17K21J0n8k36K16q3K01j45M7K66m82
4218a86J9M8J38L0N9m76L67MJ60j53J64m86J41N6o4J19P6O7r6n5N4J0J38J7k07
$$ plain form
4243 -56 -325 -12 256 -4 -176 -134 -153 271 245 9 -5 24 -38 -281 141 170 80 -127 -203 70 142 186 246 -310
4267 -310 39 -114 290 222 10 79 -164 164 38 -142 -107 179 -88 52 -44 -130 101 -87 -230 -237 297 -173
4289 -173 117 57 -143 -150 -158 184 76 60 -199 -38 221 310 219 -197 -222 -264 -233 117 274 429 38 -199 -74 -114
4313 -114 85 41 91 -171 -170 86 -277 -80 -247 12 139 -70 -80 187 35 -66 55 -136 -116 109 -48 -143
4335 -143 -100 -131 99 320 -110 -203 -156 76 40 153 -42 -203 38 95 123 135 181 -18 -104 -190 -33 -42 102 84 -51
4360 -51 -76 -95 244 19 -49 107 -99 21 21 198 127 155 -270 -159 -274 123 -139 78 -142 -59 42 131 -279
4383 -279 -111 78 -136 103 366 1 -69 143 -179 186 142 -138 168 154 -255 0 27 95 53 260 -55 -83
4405 -83 -16 -119 -27 18 -203 -63 -72 124 102 -174 -223 -6 -119 138 336 -7 -71 -61 -82 95 186 123 168 -155 188
$$ packed form
4243e6k69L13K68k60j72M2j9M24k6k36j4K9o2k43M22K9r0k07p6K73P2M4O0n56
4267c10L49j53M04o8k12O9k43L28j26j80L5K86k67J40r6q6K31j88j43pN34m70
4289a73K90o0k00pqL42j08j6k59J61K59Q9r1m16k5m2L1L50J57J55l91k37J25m0
4313a14J99m4N0k62JK56l63J97j67K59J27k09j0K67j52j01J21j91K0K25j57r5
4335a43M3l1K30K21m30r3M7K32l6J13j95j61K41N7K8J2M6j99q6q6J57rJ44j8j35
4360e1k5j9L39k25o8J56k06J20%J77p1K8m25J11j15L97k62K17k20Q3J01Q9m10
4383b79J68J89k14K39K63l65p0K12l22L65m4k80L06j4m09K55K7O8m2K07l15k8
4405h3O7j03R2M5k21J40rJ96k2k76m9K17j13K57J98l43o4J0k1J77R1o3M5l23L43
$$ plain form
4430 188 -7 -235 -222 -18 78 -50 54 88 231 -51 23 -5 -124 239 18 -91 -157 11 139 91 169 50 -46
4453 -46 71 186 146 10 -171 -141 -34 -112 -40 20 222 -89 -7 47 201 224 28 -208 43 -232 228 105 -159
4476 -159 124 -75 69 258 122 32 -46 -159 100 118 91 19 -332 -228 37 -90 72 -237 -486 -79 186 133
4498 133 247 -18 -48 3 -157 204 94 218 27 -314 -55 356 170 128 -110 -120 51 37 16 125 113 -30
4520 -30 -157 4 147 -54 -92 4 -133 -184 -17 337 -93 -110 174 40 -126 58 -103 -35 -486 84 31 158
4542 158 -132 -228 -16 -136 -62 95 6 -131 -353 304 -83 -88 459 31 112 105 -289 155 233 188 -218 -152 -63 -65 -29
4567 -29 -111 60 -189 12 101 115 -98 289 -21 180 157 33 -100 -76 120 -103 -169 -195 77 -12 131 0 -26
4590 -26 377 147 55 -165 -9 -132 133 53 -252 227 29 91 137 256 -26 -4 -109 39 324 127 108 -104
$$ packed form
4430A88j95k28J3K04R6j28J04L4J43k82P4k8j19L63k21j09o6J68J28m8P8j19r6
4453d6J17J15m0j36j81L0J07p8P2O0K02l11Q2N4J54K3j96k36K51k75M60j23k64
4476a59K83j99J44J89j36r0p8j13K59J8k7p2l51J04K65j27J62l09k49M07K65n3
4498A33J14k65l0N1j60L61j10J24j91l41K59M11j86m2k38j0J71j4k1J09j2j43
4520c0j27J61J43k01l8R6j37n1J67L54m30j7K84j34j66J84j61O8m51N70n3J27
4542A58k90r6K12j20P4J57q9j37k22O57l87nN47m28Q1pl94M44P8m5m06O6Q9kL6
4567b9q2J71k49K01Q9J4k13L87l10K01k3j24j33K4J96k23o6k6K72q9J43j31k6
4590b6M03k30r2k20J56j23K65q0l05M79j98O2M6J19k82K2j05J48K85j97j9k12
$$ plain form
4612 -104 11 -312 -56 80 147 -111 103 113 3 -195 123 103 32 -158 -41 306 -109 77 -111 -201 -293 31
4634 31 14 -124 -270 116 138 -39 83 -10 16 -156 -2 278 51 64 144 72 -192 -24 -125 224 -203 -29 -124
4657 -124 -154 207 65 -88 -51 -37 100 -9 35 -17 -13 -71 246 156 155 -117 -175 -42 -287 -57 122 32 134 -15
4681 -15 -175 80 112 10 -223 11 -55 -42 230 -129 -53 -161 -50 -100 85 -157 -103 -159 -64 -151 -16 182 74
4704 74 68 -135 -169 107 272 -200 -253 -10 -98 73 114 -216 9 -309 -253 2 418 92 -149 197 -229 6 1
4727 1 -3 -81 169 185 80 -43 -153 6 56 -217 172 138 -91 156 -115 81 236 149 141 -54 55 -121 437 139
4751 139 -21 -311 179 -42 7 77 81 310 73 -36 -173 166 301 32 -53 126 -99 -2 71 174 -133 142
4773 142 -5 10 -1 26 21 -101 -243 158 73 -84 -133 -110 -266 24 194 25 200 89 -133 24 -127 -167 -47
$$ packed form
4612a04J15l23K56J36O7k58K14J0j10j98L18k0p1j90J17L47m15J86j88r0r2L24
4634C1j7j38j46L86K2j77J22r3K6j72J54K80k27J3Q0p2k64J68j01L49m27J74r5
4657a24l0L61j42j53L7J4J37j09M4n2Mn8L17r0jk72n8J33k45K30J79r0J02j49
4681a5j60K55L2j02k33K34o6J3K72l59P6j08J11n0J85k42N4n6R5q7J35J98j08
4704G4ok03l4K76J65m72n3K43q8J71M1l30K25l18N6K55M16l26k41L46m26K35n
4727Amp8K50J6j05j23j10J59N0k73L89l4k29K47k71J96J55q7qj95J09j76N58k98
4751A39j60k90M90k21M9P0MK29k37j09j37L39J35k69q5J79k25R7P3J03l07K75
4773A42j47J5j1K7nj22j42M01q5j57m9K3j56K90J70j69J75j11k22J57j51m0J20
$$ plain form
4796 -47 -315 -536 236 88 -14 -117 -319 -175 199 154 147 -42 -253 -243 101 272 -25 27 -148 -347 68 -230
4818 -230 -63 -220 -21 66 -167 264 205 134 -92 -70 -25 -19 -131 128 64 116 -131 147 305 13 -108 -141 -92 -55
4842 -55 5 42 -125 -8 -252 -245 28 241 -28 -247 -61 -187 172 203 -35 -58 -105 108 99 -40 -116 98 -94 -101
4866 -101 -68 -19 0 -109 -14 -38 299 -132 50 23 -222 123 -94 -58 -151 -158 -241 -89 -51 36 -247 -320 55 -41 -14
4891 -14 -137 108 87 116 -349 -3 103 72 120 12 -160 -1 81 104 46 -15 -214 11 56 125 -31 103 95 375
4915 375 -9 -224 -45 27 -221 -211 348 172 -93 137 -134 -52 -88 -30 -29 -128 -227 -46 120 319 -7 -128 -37
4938 -37 53 170 -126 160 -84 -134 44 -319 5 203 -208 -162 -20 -131 -290 136 214 -42 206 -120 -234 115
4960 115 -150 7 -256 -6 150 249 -181 220 15 -153 97 -223 425 -2 166 -6 126 -27 175 -23
$$ packed form
4796d7k68k21P72j48j02j03k02J44L74m5pj89k11J0L44J71k97N2j75j99M15k98
4818b30J67j57J99Q7k33M31n9p1k26K2M5Oj12K59o4N2k47K78J58k92j21l3M9L7
4842e5O0L7j67J17k44PK73K13k69k19J86j26L59L1k38k3m7K13rj39p6K14j92p
4866a01L3M9J9j09R5k4L37m31J82k7k45L45k17L6r3pq3J52L8Q7k83p3L75r6K7
4891a4j23K45k1K9m65L46J06l1M8j08j72J59Q2K3n8o1j99K25M5O9j56J34qK80
4915C75l84k15J79P2k48J0N59j76k65K30k71Q2l6N8Jr9r9J81J66J99l26j21R1
4938c7R0J17k96K86k44n0J78l63L24J98m11M6J42j11j59M26P8k56K48l26j14L49
4960A15k65J57k63K50J56R9m30M01k05j68K50l20O48m27J68j72J32j53K02j98
$$ plain form
4980 -23 -21 35 -94 91 -51 -110 -165 -63 286 -123 62 235 -2 71 233 -159 64 128 49 4 -64 322 -275 -72
5004 -72 102 -193 -101 171 -142 -79 -169 -82 32 140 158 253 148 359 24 109 128 -90 64 -71 -72 32 -58 193
5028 193 -129 -126 -201 -180 209 140 -171 -58 19 -242 -67 -43 82 134 -97 8 158 38 -78 -156 -136 1 145
5051 145 275 -110 16 -188 68 -23 157 92 112 -4 -124 61 -56 -106 319 21 103 -184 119 145 251 116
5073 116 -267 -476 -19 137 81 -307 -49 90 -224 4 -62 124 55 264 -146 -109 107 -179 -92 28 -301 -189
5095 -189 90 -178 12 -126 102 232 43 -33 -16 -288 78 -120 117 119 211 -123 -106 121 138 145 182 198 -25 -47
5119 -47 81 -238 -244 -184 -451 -348 35 19 342 6 -196 81 85 92 307 109 -129 5 69 -199 143 -252 60
5142 60 -112 113 275 127 212 -303 -155 26 24 -110 60 -234 -242 -60 107 -286 43 -32 19 -90 14 112 -25
$$ packed form
4980b3KN6j29J85j42n9n5J02L49m09J85J73k37P3J62l92K23O4p9m5o8L86n97K03
5004g2J74k95R2K72l13O3r0Q7J14J08J8R5j05K11l35Q5J9k18J54j35jJ04r0K51
5028A93l22Lp5K1L89o9l11J13P7k61J75K4J25N2k31J05J50j20j16p8K0J37J44
5051A45J30l85J26k04K56r1J80o5K0j16j20J85j17n0M25k98Q2k87L03K6J06j35
5073A16l83k09M57J56n6l88K58J39l14K28o6J86o9K09m10L7K16k86Q7J20l29J12
5095a89K79k68J90j38K28J30j89p6J7k72L66j98K37KR2l34J7K27J7PL7J6k23k2
5119d7J28l19oO0k67J03L83j6L23l36k02K77MPK15j98k38J34O4k68L42l95L12
5142F0j72K25J62j48Q5n15J48J81kj34J70k94qJ82J67l93L29p5N1j09J04R8j37
$$ plain form
5165 -25 155 110 -194 23 163 -243 -225 27 -252 56 0 -7 -96 56 -76 -87 -8 -238 101 -86 -33 -70 137 53
5189 53 15 -365 80 -131 23 29 131 137 -63 85 241 43 50 -231 -248 -8 -93 127 -244 -196 -110 -61 70 -140
5213 -140 -28 -205 -290 -71 83 56 -94 124 159 -89 68 -62 145 -47 49 106 74 31 48 -62 1 -25 -172
5236 -172 120 36 101 -257 265 65 -12 -24 83 129 -303 -239 38 -3 182 126 18 315 20 151 148 257 103
5259 103 -82 196 24 125 -31 -121 -165 24 204 -91 28 45 -81 49 74 -9 -34 -106 -11 262 53 -41 19
5282 19 22 34 -107 -42 -66 273 -109 -24 107 -53 -17 -80 -167 111 -88 17 34 142 10 140 -174 -7 293 232
5306 232 63 -311 -130 -92 33 52 37 -217 123 -80 -2 122 -215 -193 228 33 121 -35 16 -123 14 94 -20
5329 -20 270 111 -194 -105 99 11 321 25 -17 -215 -18 208 244 148 161 26 74 151 -40 -196 48 82 -213
$$ packed form
5165b5J80m5l04K17J40m06J8K52k79L08n6pq9J52j32j1P9k30L39j87N3l7K07q4
5189E3l8l80M45k11J54OJ02Ok00J48J56j98Pk81j7K40q5K20l71M8Q6M9J31k10
5213a40J12j77q5K19J54k7j50K18L5k48J57j30K07j92R6N7l2m3J7j10O3k6j47
5236a72K92q4O5l58N22k00p7j2J07M6m32O4K77m1J85n6j08K97k95J31lJ09j54
5259A03j85K78j72J01j56r0m4J89J80k95J19J7j26J30K5q3k5p2R5K73k09r4O0
5282A9LJ2j41O5k4L39l82Q5J31j60L6o3q7K78j99J05J7J08j32J30l14J67L00o1
5306B32j69l74J81L8J25J9j5k54L40k03P8J24l37K2M21j95Q8j56N1j39J37Q0j14
5329b0K90j59l05Q9K04q8L10k96m2j98J97K26L6r6J3j35M8P7j91j56K44L4k95
$$ plain form
5352 -213 -112 41 -110 129 -127 172 -89 218 6 -75 188 196 -211 56 124 161 -30 -8 -48 -173 285 -162
5374 -162 -138 -133 -10 45 -83 49 27 -192 64 175 167 -204 -419 205 -47 211 150 -109 -207 -278 169 -36 -51 304
5398 304 60 -29 38 33 -23 32 181 -37 -35 -49 83 -52 -162 -129 -108 -36 -147 86 226 -91 -181 -168 14 178 77
5423 77 305 -65 -131 95 -94 45 -273 128 -40 -117 140 131 107 -115 15 -151 3 -147 23 -125 172 -163
5445 -163 37 -26 -93 224 -6 72 -8 6 -65 -13 147 141 -211 115 54 -203 -327 -181 -141 165 124 -50 -27 -33 -28 225
5471 225 -352 32 -87 -43 14 53 13 134 238 -124 55 -277 29 -1 -150 113 -11 -143 -53 -169 -355 84
5493 84 143 -128 -55 0 18 146 268 125 -40 -216 159 -76 -130 185 -146 122 -38 7 43 -16 -60 -225 -88
5516 -88 89 -309 -237 -231 99 -38 -70 149 149 8 -154 -18 -38 104 -21 15 13 -226 200 -219 160 -40 83 -15
$$ packed form
5352b13J01J53j51K39k56K99k61L07k12q1K63Qm07K67O8L7j91K2m0j25M58m47
5374a62K4NJ23N5j28J32k2k19K56J11ql71k15O24k52K58o1k59r8p1M47k05j5L55
5398C04k44q9O7nn6N5J49k18Kj4J32j35j10L3K1P2j11K33J40l17r0J3J82J64j01
5423G7K28l70o6K26j89J39l18M01j68p7K57rk4k22J30j66J54j50J70j48K97l35
5445a63K00o3o7L17k30P8q0J4p1N2J60ol52L26o1k57j24J46M0L06m1j74K3oNK53
5471B25n77L84j19M4N7L9m0J21J04l62J79l32L06l0j49K63j24j32R0j16j86M39
5493H4N9k71P3N5J8J28J22j43j65j76L75k35n4L15l31K68j60M5L6n9m4j65J37
5516h8J77l98P2OL30j37l2K19%j41j62J36k0J42j25L6kk39M26m19L79k00J23r8
$$ plain form
5540 -15 254 176 -216 155 -93 -48 32 218 -72 217 -90 -59 35 -62 155 -199 -13 -26 99 -106 -74 99 -45
5563 -45 57 194 -28 -18 -29 93 -4 -49 -236 -48 69 2 112 38 -96 -417 -203 147 200 189 213 -22 332
5586 332 49 -40 39 181 -200 13 -215 -118 137 9 -119 149 -277 -25 141 14 176 -1 113 -230 186
5607 186 143 -107 176 124 -164 220 133 33 -211 88 -42 -214 -42 -126 -101 138 -134 254 -25 61 -21 -204
5629 -204 240 162 261 -23 38 142 8 -68 34 50 -85 -36 113 13 -95 -220 81 13 172 213 81 -55 21
5652 21 -12 -96 207 141 9 158 -149 -187 -110 -169 -174 132 -108 183 139 21 74 -69 -24 -81 235 -100 197 -7
5676 -7 -122 50 173 -167 45 -27 -15 -160 30 106 33 112 176 106 -86 42 150 -10 -50 102 144 -165 -133 23
5700 23 15 -27 130 -38 267 -41 27 21 -48 -222 119 72 -116 41 -65 265 147 38 287 -126 -211 -97 -140 -142
$$ packed form
5540a5K69p8l92L71k48M5Q0J86k90K89l07L1R4r7K17l54J86j3J25k05L2J73j44
5563d5J02J37k22J0j1J22r7m5j87J88J17o7J10p4j34l21K14L50N3j1K4k35L54
5586C32k83q9P9J42l81K13k28R7K55j28j28K68m26K52J66j27J62j77J14l43M16
5607A86m3k50K83n2k88L84q7j00k44K99j30j72J72q4K5K39k72L88k79Q6q2j83
5629b04M44p8R9k84O1J04j34p6J02J6j35M9J49j00j08j25L01o8J59M1j32j36P6
5652B1l3q4L03o6j32J49l07l8P7n9nL06k40K91m4j18N3j43M5n7L16l35K97k04
5676gj15J72J23l40K12p2J2j45J90P6p3P9O4p0j92J28J08j60m0J52M2l09L2J56
5700B3qm2J57j68L05l08O8oo9j74L41m7j88J57j06L30j18j09K49m13q5J14m3k
$$ plain form
5724 -142 -199 196 -4 -104 332 -198 145 -130 -340 -127 42 -31 -46 127 -198 -164 -30 -72 209 -22 1 72
5746 72 -227 -147 -110 24 29 -94 -235 214 -164 -47 -168 -224 -112 -43 -52 162 8 159 162 -135 28 -130 110 -4
5770 -4 124 141 -24 3 19 -149 29 104 6 58 157 -21 -43 248 -162 -144 113 135 -313 115 -223 73 86 -247
5794 -247 -27 -43 0 156 271 -84 -119 11 -138 -204 105 -224 47 -64 -66 -162 77 125 97 -36 -118 213 -22
5817 -22 -14 -106 110 113 -8 64 2 60 -135 185 165 172 38 -69 137 -17 47 -103 126 179 201 10 162 210 -93
5842 -93 100 -6 -144 -173 -17 -5 33 -20 -68 -103 -14 -251 168 -296 84 85 -148 39 300 -60 23 -114 27 194
5866 194 -19 63 28 -77 -112 564 -112 -46 90 -21 -33 -27 -52 122 -42 206 -21 28 -157 146 134 -212 44
5889 44 -77 268 -120 -73 24 43 -149 -93 85 -218 -218 142 4 -142 -217 114 125 -9 140 157 152 -164 -17 -46
$$ packed form
5724a42n7L95k00j00M36n30L43k75k10K13J69p3j5J73l25L4J34m2K81k31K3P1
5746G2k99Q0L7J34Nj23j41M49l78J17j21n6J12O9rK14j54J51Lk97J63j58K40j14
5770dJ28J7j65K7J6j68J78P5r8N2R9j78k2K91m10J8K57K2m48M28l38K96J3l33
5794b47K20j6M3J56J15l55l5J30j49o6L09l29K71j11kr6K39M8k8j33q2L31k35
5817b2Qr2K16Lj21P2o2N8j95L20k0Pj34j07K06j54O4j50K29N3K2j91J52M8l03
5842i3J93j06j38k9J56J2L8n3m8l5Q9k37M19m64L80Jk33J87K61l60Q3j37J41J67
5866A94k13Q2l5j05l5O76o76O6J36j11j2Ok5J74j64K48k27M9j85L03j2l46K56
5889D4j21L45l88M7R7J9j92N6J78l03%L60j38j46p5L31J1j34J49J7nl16J47k9
$$ plain form
5913 -46 86 169 156 187 -111 243 15 449 67 -106 -398 115 63 102 169 162 -77 -76 -226 -29 -5 133 -134 -134 284
5938 284 61 -191 23 51 -36 -75 255 10 409 32 -56 -11 249 66 -177 -232 -275 -124 1 -112 100 -185
5960 -185 210 -24 6 409 12 -51 -60 189 70 -45 163 -72 25 91 -95 266 -89 20 -119 31 -227 272
5982 272 -207 -126 -52 -163 26 67 189 45 -120 -207 -213 -244 -70 -208 -128 -107 344 -173 71 308 -174 -38 -61
6005 -61 -13 28 42 193 227 38 71 245 413 -81 -64 -39 -194 -18 31 10 -171 2 14 -21 112 50 -288 -34
6029 -34 -48 33 -10 102 105 37 93 183 -166 122 -152 108 9 47 41 42 128 -35 6 -126 14 -65 -34 150 -121 -160 34
6056 34 6 92 -31 28 41 -90 58 168 -95 25 -129 78 128 188 114 -241 -226 -35 17 131 6 97 7 8 221
6081 221 0 28 37 235 167 -272 62 -147 -27 -233 87 35 64 46 -72 45 -332 -48 30 -147 218 -149 -17
$$ packed form
5913d6J32Q3j3L1k98L54k28M34l82j73k92N13n2L9O7pk39Jj50J97K4J38k67%M18
5938B84k23k52K14K8q7l9L30k45L99l77q8M5K60j83k43n5m3J51J25j13K12k85
5960a85L95k34L0M03l97o3rK49j19j15K08k35R7O6j86L61l55J09j39J50k58M99
5982B72m79Q1P4j11J89M1J22j44j65q7ol1J74j38Q0K1M51n17K44K37m82J36k3
6005f1M8M1J4J51L4j89L3J74J68m94J7K5j55J76M9k1j81J73J2l5J33o2l38K54
6029c4j4Q1m3J12Lo8N6R0l49K88k74K60r9L8oJQ6j63M1j32J40p9L1J84k71l9J94
6056C4k8Q6j23N9J3j31J48J10k63J20j54K07N0O0p4l55J5J91N2J14j25R1r0JK13
6081B21k21K8RJ98o8m39L34k09J20k06L20n2K9j8j18J17l77K84P8j77L65l67J32
$$ plain form
6104 -17 11 -69 121 -102 -238 -179 127 -119 196 179 -196 141 26 -56 -142 -80 -61 192 183 160 16 80 -110 43
6128 43 -129 164 -362 42 -71 -5 150 43 26 77 82 -194 -31 -16 19 45 193 -76 -27 74 -40 221 65
6151 65 -28 -60 29 195 94 10 -282 -95 72 -151 90 -150 -13 -220 -97 -100 -147 -260 -76 -36 277 129 235
6174 235 63 39 32 -121 -9 40 39 -126 80 -264 -18 -98 151 23 -125 172 -4 -72 -229 -88 -156 155 207
6197 207 -64 -116 139 -174 262 109 -73 -85 154 -83 24 60 -260 377 -13 -93 -279 90 206 -109 -99 -256
6219 -256 395 255 -156 18 165 56 -17 -222 193 -43 207 183 -220 67 -151 50 179 -117 10 -24 127
6240 127 75 141 123 -131 -75 72 -22 40 189 9 -108 -5 29 13 -121 145 182 -7 104 -19 -114 51 -50
6263 -50 316 -75 -58 277 -1 61 -26 -35 -18 205 47 65 53 97 30 191 30 -132 200 10 112 -15 116 -170
$$ packed form
6104a7K8q0J90k23j36N9L06k46L15j7l75L37j15q2q6O2J9K53rk3j44O4j90J53
6128D3j72K93n26M04j13O6J55j07j7N1Nk76J63J5L5K6J48k69M9J01j14K61j56
6151F5r3l2Q9J66j01q4k92J87J67k23K41k40J37k07J23lm7j13J84M0L13j48J06
6174B35j72k4pj53J12M9jj65K06l44K46q0K49j28j48K97j76o8j57J41o8L11N2
6197B07k71n2K55l13M36j53j82j2K39k37J07L6l20O37l90q0j86L69J16l15J0j57
6219b56O51j40m11J74J47j09p3k05M15k36K50k4m03K87k18K01J29k96J27l4J51
6240A27n2O6j8k54N6J47r4O2J49j80j17J03L4j6j34K66L7j89J11j23r5J65j01
6263e0L66l91J7L35k78O2q7rJ7K23j58J8j2M4o7J61j61j62L32j90J02j27J31k86
$$ plain form
6287 -170 -151 145 50 22 -70 -76 -97 228 54 30 -156 11 -298 -119 27 -147 -76 279 50 26 -9 290 243 81
6311 81 -67 189 168 64 -27 7 68 170 179 155 29 230 220 259 38 -99 -156 247 -62 -36 -131 346 -69 -316
6335 -316 -88 235 114 -419 -146 -55 -4 -31 96 56 91 113 7 -29 -86 288 -182 -24 76 -427 -222 -79 51
6358 51 -39 143 -158 18 -39 -52 14 311 34 -120 -17 -55 10 233 -109 -135 -166 36 -191 -113 -156 -9 231 -199
6382 -199 189 154 -113 -81 91 185 51 153 122 7 -56 -71 -129 -145 -86 -213 -147 111 52 114 45 87 -15 40 -30
6407 -30 90 -21 -68 -59 -189 120 134 3 -15 12 -154 -199 -205 6 176 -112 -104 -290 -152 -264 45 108 279 -59
6431 -59 -3 68 -6 -1 -13 -103 29 304 73 -103 225 -63 -281 44 -78 -110 355 82 17 15 20 11 -261 81 277
6456 277 8 -39 287 -69 -161 -64 158 309 -74 80 -290 173 -50 -98 -50 245 -234 -98 100 -19 -258 -25
$$ packed form
6287a70J9K96r5k8r2ok1L25j74k4j86J67l09J79J46j74P1L55k29k4l5K99m7j62
6311H1j48K56k1j04r1L4O1J02Rk4j26K01j0L9k21j37n7M03l09K6r5M77m15k47
6335c16K28L23j21n33K73R1N1k7J27m0L5K2j06l6n7L74m70J58J00n03K05J43J30
6358E1r0J82l01J76n7j3O6K97k77j54J03l8O5K23l42k6l1K02k27P8m3J47K40m30
6382a99L88l5k67L2J72R4j34J02l1j15o3j5n8j6N9j27O6K58n9O2o9M2j02N5p0
6407c0J20j11m7Rj30L09J4j31j8K7j66m5oK11J70k88Qj86J38j12L09O3J71l38
6431e9N6P1p4Nj2r0J32K75k31j76L28k88k18L25j22l2M65k73o5kNrk72L42J96
6456B77k69m7L26l56r2R7K22J51l83J54l70M63k23m8M8K95m79J36J98j19k39K33
$$ plain form
6478 -25 25 -90 -24 -216 -71 -15 -19 -105 154 77 56 85 167 238 137 -6 -152 -159 -84 440 -161 -23 -67 125 21
6503 21 -102 -127 -57 71 67 -318 21 -266 179 -210 -50 19 -79 61 -151 93 -24 335 150 -198 133 3
6525 3 169 -237 -117 117 -94 55 19 -2 -82 191 4 151 113 -131 -37 -97 88 -154 -120 -117 -47 87 -126 -114
6549 -114 -45 188 143 96 166 -75 -2 79 108 -50 -182 160 145 -156 91 86 -193 117 273 165 4 -156 -246 -75
6573 -75 77 -88 179 -25 -25 59 0 66 -36 -1 272 117 147 88 -6 -66 -183 27 -69 100 -2 6 141 172 32
6598 32 -188 -107 -15 117 -3 53 171 -56 33 246 16 -24 -76 24 82 107 262 67 95 236 171 -308 75 176
6622 176 -82 220 50 94 -28 179 -250 -92 -47 264 -78 -65 24 61 -77 -296 -122 -151 -188 -103 -80 -94 -105 71
6646 71 -74 -90 -272 59 54 -148 78 -29 -193 233 169 179 88 -45 -100 -227 -175 84 38 -158 -176 18 169 131
$$ packed form
6478b5N0j15O6j92J45N6mq6K59p7k1K9Q2P1j01j43j46pP5N24o01J38m4J92j04
6503B1j23k5P0J28ml85L39k87M45l89J60O9r8J40k12K44j17L59j85l48L31j30
6525CJ66m06J20K34k11J49l6k1q0K73j87J47l8k44R4o0J85k42L4LP0J34k13J2
6549a14O9K33m5m7P0k41P3Q1K9j58j32L42j5l01K47nk79L10J56j08j61j60r0J71
6573g5J52j65K67k04%Q4n9O6j02L5K73j55L0n9r4o0j17K10r6J69j02QJ35L1j40
6598C2k20Q1R2J32j20N6J18k27Q9K13k30m0n2J00N8K5J55j95K8J41o5m79L83J01
6622A76k58L02j70M4j22K07m29J58M5L11l42J3Q9L7j38k19J74k9l7Q5K3j4j1J76
6646G1j45j6j82L31nk02K26j07j64M26o4J0r1j33n5j27N2K59m6j96j8J94J51l8
$$ plain form
6670 131 172 -85 110 -77 -64 33 126 -202 27 116 -52 -193 -38 82 18 -11 133 251 -187 -31 -102 -13 60
6693 60 97 -262 65 -24 196 -31 158 32 102 -28 42 -76 -89 -1 -4 -122 34 -23 66 -91 -63 -108 -212 167
6717 167 99 115 -82 68 0 -142 34 139 86 -104 -128 302 79 356 -185 -89 -54 57 -315 -95 56 -120
6739 -120 -13 -109 189 -101 32 72 86 123 -248 -47 154 90 -210 -116 -5 15 -120 242 150 -99 5 -108 -195
6762 -195 89 -76 -22 209 80 -19 27 -22 101 -73 68 -18 -24 -300 -59 282 16 -32 -238 180 -235 -143 164
6785 164 -61 -94 27 -41 178 96 191 66 136 -304 -25 33 -3 117 -133 -36 37 -21 72 -9 -89 52 128 10 95
6810 95 52 140 -57 258 -203 163 -11 219 62 -178 94 -23 47 -170 -38 -4 77 -134 108 -97 171 106
6832 106 -42 -62 65 26 45 -83 -164 -42 48 -181 78 -24 -15 -28 2 67 -324 -276 37 106 -2 69 48 -59 -76
$$ packed form
6670A31M1k57J95j87J3R7R3l28K29Q9j68j41J55J20o4k9J44J18m38J56p1Q9P3
6693F0L7l59L27q9K20k27J89j26P0j30P0j18j3Q8lj18J56n7Q9j57K8m5j04L79
6717A67o8J6j97J50o8j42J76J05n3j90k4M30k23K77n41R6L5J11l72K20J51j76
6739a20J07r6K98k90J33M0J4L7l71K01K01o4l00R4J11K0j35L62r2k49J04j13q7
6762a95K84j65N4K31j29r9M6m9J23j74J41q6ok76K41L41k66m8k06M18m15R2L07
6785A64k25l3J21o8K19q2R5j25P0m40K79N8l6J20k50R7P3n8R3q1q0J41P6j18Q5
6810I5m3Q8j97L15m61L66j74K30j57k40K72j17P0k17J32L4Q1k11K42k05K68o5
6832A06j48k0J27l9J9j28q1J22R0k29K59j02Rj3L0O5l91M8L13O9j08P1k1j07j7
$$ plain form
6857 -76 -72 151 -20 -16 66 -26 85 -1 11 134 -137 252 95 -103 35 -37 29 104 58 -88 20 -60 -6 29 8 -10
6883 -10 -41 -30 9 -207 -41 54 -67 20 2 124 -339 204 76 -73 5 -13 11 -32 63 -137 390 -183 -224 17
6907 17 4 -104 75 139 136 -117 133 -62 84 141 196 128 -33 -174 -103 149 -133 -147 -129 -98 77 -27 76 -96
6931 -96 64 127 -119 107 -237 77 -179 87 63 21 -67 -155 152 2 89 -84 295 -246 -121 -30 49 -70 -182
6954 -182 -157 -119 -182 86 268 167 -127 -317 183 126 -1 145 -76 199 -213 70 -165 -203 15 -58 -189 -254
6976 -254 104 -81 -231 76 -237 203 230 -51 -209 84 170 -188 -57 81 49 41 28 238 181 236 20 -259 208
6999 208 -19 -60 273 -140 -6 -196 123 77 261 -147 -210 -58 421 -144 14 111 -49 -119 14 -1 -374 -33
7021 -33 204 13 -135 26 263 255 108 15 8 124 -87 -129 10 -121 -20 -77 115 -116 172 267 -157 24 181
$$ packed form
6857g6MK23j71MQ2r2J11q6J2J23k71L89j57j98J38p2O6P5m6j46J08q0N4L5k1j8
6883a0l1J1L9k16J66R5j21Q7j8J22m63N43j28j49P8j8K4m3R5k00N27n73m1K41
6907A7j3j08J79O4lk53K50j95J46N7N5o8j61j41P1K52k82j4J8L1J75j04J03j72
6931i6J60O3k46K26l44L14k56K66k4m2q8q8L07j50Q7j73L79n41J25R1P9j19j12
6954a82K5L8o3K68J82j01k94j90N00n7j27J46k21K75m12K83k35l8K18p3j31o5
6976b54L58j85j50L07l13M40K7k81j58K93Q6l58J31J38l2qj3K10n7N5k16k79M67
6999B08k27m1L33m13J34j90L19m6J84m08o3J52M79n65J58R7j60p0J33j5l73L41
7021c3K37j91j48J61K37qj47r3pJ16k11m2J39j31J01n7J92k31K88R5m24J81J57
$$ plain form
7044 181 165 43 -78 -356 75 214 61 0 349 49 -155 -258 -81 78 105 369 -192 118 256 -121 -102
7065 -102 42 -38 70 68 27 163 27 87 80 247 -102 124 -68 137 185 -145 -120 168 -52 -161 -84 -19 109 58
7089 58 171 178 -184 -220 -89 22 -246 215 -47 -90 -76 162 -112 -192 -43 -191 37 12 161 -110 -41 210 126
7112 126 160 -252 -54 -33 41 -364 96 99 178 228 -140 250 129 -20 -45 -159 -124 28 23 -88 374 140 -68 -222
7136 -222 -173 -123 13 280 73 194 -196 -58 33 102 195 -32 -97 42 -103 -87 -82 -46 47 46 56 144 -113 -31 -185
7161 -185 73 196 -86 -298 -269 0 -72 -123 -139 -168 -128 257 117 20 67 220 -72 124 -10 165 -120 176 130
7184 130 103 -294 135 36 -4 73 71 223 -22 36 -252 136 -169 -94 283 -175 32 -78 329 -106 -1 -52 -7
7207 -7 -14 -128 170 145 -327 26 -122 -153 -21 -113 45 101 -34 -79 308 159 457 47 -73 -168 -127 252 -318 226
$$ packed form
7044A81j6j22j21k78M31J39j53o1L49l00k04j03J77J59K7K64n61L10J38l77J9
7065a02J44q0J08km1J36j36O0pJ67l49K26j92K05M8l30K5K88k20j09P7O5J28n1
7089E8J13Pl62l6J31J11k68M61k62m3J4K38k74q0J49j48K28k5J49k71O9K51q4
7112A26L4m12J98K1P4m05M60LP9N0l68L90j21j49k5j14L5J52nj11M62k34k08j54
7136b22M9N0J36K67k07J21l90J38R1O9R3k27o5J39j45J6NL6R3jJ0Q8k57Q2j54
7161a85K58J23k82k12K9K69p2n1j6k9M0L85j40r7M7J53k92J96j34J75k85K96m6
7184A30k7l97M29r9m0P7kJ52k45N8k88L88l05P5L77m58K07j10M07m35J05n1M5
7207gpj14K98k5m72L53j48l1J32r2J58N6j35m5L87j49K98m10j20r5M1L79n70N44
$$ plain form
7231 226 106 -155 8 16 136 -157 202 -33 -147 271 164 259 251 17 -128 -31 -108 -66 72 -133 -74 235 -65
7254 -65 -74 176 -53 -193 -115 204 55 142 217 20 -142 -54 -223 43 -33 -96 -118 -14 -137 -166 -175 -22 -34 149 182
7279 182 -168 -75 378 -36 -23 -58 -42 -195 51 31 173 -61 -51 -64 -156 103 -156 117 -76 134 130 77 -36 19
7303 19 227 -132 -178 33 -77 105 -25 32 -197 -67 167 -180 139 -63 -168 -236 37 181 -27 83 -111
7324 -111 -224 86 258 32 67 7 92 36 87 -139 -14 -56 179 51 332 -88 180 -230 -222 -14 -78 -111 83
7347 83 -97 10 -89 -168 -53 192 108 35 -41 -235 21 -15 -142 -169 185 -357 170 8 -35 -107 159 -141 38
7370 38 -263 -25 -228 60 93 -255 97 -90 118 47 -77 123 62 278 -198 -40 269 -163 176 -198 175
7391 175 -44 -118 92 33 -116 -147 -149 107 -156 -29 204 -143 -18 -66 66 85 -157 -68 19 345 -44 86 -139
$$ packed form
7231B26j20k61J63QJ20k93L59k35j14M18j07R5qk34j45R7p7M2J38k05N9L09l00
7254f5rK50k29j40P8L19j49Q7P5j97j62Q8j69K66p6o3k2J04j23k9rJ53j2J83L3
7279A82l50R3M53m14J3l5J6j53K46k0J42k34J0j3r2K59k59K73j93K10mn3j13N5
7303A9K08l59m6K11j10J82j30N7k29J30K34l47L19k02j05o8K73J44k08J10j94
7324a11j13L10J72k26L5o0Q5n6N1k26J25m2K35j28K81m20K68m10QK08o4l3J94
7347H3j80J07r9p9J15K45q4p3p6j94K56l6j27k7L54n42N27j62m3p2K66l00J79
7370C8l01K38k03K88L3l48L52j87K08p1j24K00o1K16m76J58L09m32L39l74L73
7391A75k19p4K10n9j49l1kK56k63J27K33l47J25m8J32J9k42Q9Q7L26l89J30k25
$$ plain form
7414 -139 -323 -48 159 257 -31 145 189 58 13 -81 203 153 12 -333 94 -68 0 308 -31 -204 -181 -55
7436 -55 -11 448 -122 39 108 -110 -105 16 21 187 -1 -42 -136 -298 30 20 117 161 412 52 -165 154 56 50 -3
7461 -3 296 255 -101 -47 -210 -208 191 35 -122 -169 -165 -109 62 0 -220 -92 68 67 -143 -117 -125 163 -31 203 -103
7486 -103 24 -138 135 -94 -55 -56 3 46 -69 -93 407 132 135 -186 -104 -156 -73 -47 -131 7 76 -160 -43 7 -187
7511 -187 95 66 -14 91 112 207 193 -54 93 -175 18 26 17 -170 229 -179 -196 9 -7 -69 9 -134 -20 11 -126
7536 -126 -135 62 -244 -41 -176 -118 160 186 -312 147 247 70 -211 -268 69 -227 -80 -13 131 96 -54 -56 -12
7559 -12 -121 -118 101 -190 -15 83 97 -133 237 51 -85 -4 345 43 182 163 -220 -97 -286 178 -3 218
7581 218 303 -75 -115 51 14 175 80 -224 -249 -80 166 141 -29 -193 -314 134 -101 -54 -171 23 64 -256 43
$$ packed form
7414a39j84K75K07R8k88J76M4j31m5r4K84n0j41l45M27j62O8L08l39j73K3J26
7436e5M4M59n70J61O9k18NJ21NJ66j88m1r4j62L28j0R7M4K51l60k17L19r8on3
7461cK99m1l56N4j63KL99j56j57m7MN6J71o2k20J28J60jk10K6qK88j94K34l06
7486a03J27j62K73k29L9jN9M3j15k4N00k75Ll21Q2n2Q3K6q4J38O9k36J17N0j94
7511a87K82k9q0J05K1R5j4k47J47k68J93Qrj87L99m08j7K05j6o2P8j43J14L1j37
7536a26rJ97l06K03j35N8K78K6m98M59J00j77k81n7L37k96J47O7J44l5j50kM4
7559a2j09LK19k91J75R8J4k30L70j86j36Q1L49l02J39j9l83J23j89M64j81K21
7581B18Q5l78m0J66l7J61r5l04k5J69K46k5j70j64j21M48k35M7j17J94M1l20K99
$$ plain form
7604 43 261 -46 -134 5 6 -100 76 -86 5 113 352 -59 7 23 -52 -107 29 -18 -279 -35 -54 97 -136 76
7628 76 -24 87 -140 -122 23 43 -111 134 -60 67 -69 33 -3 -102 204 -178 47 56 -135 -172 -133 -93 80
7651 80 -6 104 249 -91 -129 -245 37 176 -212 263 -51 -137 270 6 52 111 -27 -40 -26 266 -13 62 -116
7674 -116 54 163 -378 14 148 128 219 -8 -90 168 -28 89 -13 -3 73 -24 101 193 -210 41 196 -13
7696 -13 -142 -107 58 52 -141 259 -79 20 102 -152 -256 78 118 238 3 5 0 172 90 64 247 319 -116 -95 11
7721 11 35 108 -33 -215 -233 -131 113 133 -151 145 166 70 56 -216 -104 384 -212 136 365 -102 220 23 83
7744 83 -207 70 324 68 83 133 -290 -25 406 -199 80 -43 -162 173 135 -145 112 46 6 109 -87 -330
7766 -330 -55 154 -95 -131 -18 -5 -133 116 -130 47 54 31 116 166 222 102 115 -63 207 -111 -310 61 9
$$ packed form
7604D3K18l07q8J39Jj06J76j62R1J08K39m11O6J6p5n5J36m7k61K44j9J51k33K12
7628G6j00J11k27J8J45K0j54K45j94J27j36J02l6r9L06l82K25Rj91l7L9M0J73
7651H0q6J10J45l40l8j16K82J39l88M75l14q6M07k64M6N9j38j3J4K92k79P5j78
7674a16J70J09n41L92J34k0R1k27q2K58j96J17j02J0P6r7J25R2m03K51J55k09
7696a3j29L5J65oj93M00l38R9Q2k54j04L34M0J20k35KnJ72q2k6J83P2m35K1J06
7721A1K4P3j41j82j8J02K44K0k84K96K1r6j4k72J12M88n96L48K29m67L22j97O0
7744H3k90K77K54k56J5N0m23K65M31o05K79j23j19L35l8k80K57o6m0J03j96k43
7766c30K75K09k49l6J13J3j28K49k46J77Pk3Q5N0N6j20J3j78K70l18j99L71n2
$$ plain form
7789 9 9 -224 21 67 -94 -15 -120 -140 -62 220 -121 273 -75 143 64 -264 64 -43 -73 8 -153 -182 -23 98
7813 98 101 245 -9 60 279 134 121 49 18 32 108 113 -3 -357 7 -87 98 -127 95 174 -217 50 -278 130
7837 130 -92 -182 -165 61 94 -105 44 36 43 85 98 -268 -9 138 -155 198 -61 -83 70 108 10 -121 -23 124
7861 124 -259 210 55 147 24 -95 -65 -242 -110 18 141 235 257 257 127 55 -72 -86 -133 -281 -48 268 -66
7884 -66 -218 160 -68 63 -54 185 -58 -100 226 72 -242 270 31 -34 103 -185 -150 142 -214 22 -99
7905 -99 -181 111 125 -88 -211 -11 -118 121 171 -183 232 61 35 165 105 -94 43 -143 85 45 -27 137 90
7928 90 -93 -155 -86 -219 -203 -254 186 86 218 16 203 -78 146 152 -97 173 -83 71 15 -86 -61 240 137
7951 137 -33 109 26 -102 341 -355 -111 230 104 12 277 -78 330 198 -31 184 -172 -91 207 -17 -220
$$ packed form
7789I%k33K45M6j61P9j05k0P8K82l41L94l48K18p9l28L28j07l0Q1j61k9J59J21
7813I8LJ44k54O9K19j45j3p2l1J4P6Nj16l54L64r4J85k25K22P9l91K67l28M08
7837A30k22r0J7K26L3j99J49qPM2J3l66K59J47k93L53k59k2J53L8r8j31R8J47
7861A24l83M69j55R2j23j19L0j77J32J28J23R4K2%j30p2j27j4m7j48K33L16l34
7884f6j52L78k28J31j17K39k43m2L26j54l14N12k39o5J37k88L5K92l56K36j21
7905i9q2K92J4k13j23K00j07K39N0l54M15j71k6J30o0j99J37j86K28m0p2J64m7
7928I0j83o2O9j33J6n1M40j00J32k02J87k81K24Ok49K70k56J54n6j01K5L01j03
7951A37j70J42q3j28M43o96K44L41j26r2K65l55M08j32k29K15l56Q1K98k24k03
$$ plain form
7972 -220 -169 1 79 70 22 289 176 165 268 23 -224 91 -29 65 -27 66 74 -3 13 -6 -230 1 11 324 285
7997 285 195 118 -183 10 96 41 41 98 106 -17 -45 191 195 -59 118 -14 -198 100 -312 -155 188 65 142 -127
8021 -127 -150 196 83 -193 -62 97 -105 -3 94 -51 -221 205 120 -196 30 115 68 -29 -63 133 -238 185
8043 185 -46 168 89 107 218 58 30 91 -142 4 -27 -96 234 -56 -118 21 202 -50 155 121 251 179 -166
8066 -166 73 -167 -240 -73 95 -42 -104 112 -124 55 -28 179 97 -68 130 -47 104 -80 125 278 -161
8087 -161 -225 130 85 14 16 -197 19 -64 -62 95 68 163 157 -30 -359 112 158 -76 102 -94 58 347 -162 107
8111 107 -122 -50 -122 -103 -188 -87 247 -173 4 -24 141 19 217 -253 -106 -171 -14 -126 -241 -196 112 72 -211
8134 -211 -91 -81 129 -113 52 -283 9 4 139 67 91 244 209 140 -81 -10 -79 -126 -65 -35 68 20 -96 -128 33
$$ packed form
7972b20N1J70P8rm8K67j13j1J03k45k47L15j20R4r2R3Qp7J6j9k24K31J0L13l9
7997B85r0p7l01J93Q6n5%N7Qj23k8K36Mk54J77j32j84K98m12J57L43j23P7k69
8021a27k3L46j13k76J31J59k02J02R7j45j70M26q5l16K26Q5m7r7l4J96l71M23
8043A85k31K14p9J8J11j60k8O1k33J46l1o9L30k90o2J39J81k52K05l4J30p2l45
8066a66K39k40p3J67J68j37o2K16k36J79q3K07q2j65J98j77J51j84K05J53m39
8087a61o4L55m5p1Kk13K16q3KJ57k7R5oj87l29M71M6k34J78j96J52K89n09K69
8111A07k29P2p2J9q5J01L34m20J77k8J65j22J98m70J47o5J57j12j15M5L08m0k83
8134b11J20J0K10k42J65l35K92nJ35p2K4J53l5o9k21P1o9m7O1L0J03m8j16l2J61
$$ plain form
8159 33 -105 -7 11 182 67 -152 -16 50 -57 42 -62 72 114 79 181 70 94 -145 49 21 -28 243 173 47
8183 47 -8 87 -6 59 -159 34 -105 67
$$ packed form
8159C3j38R8J8J71j15k19J36O6j07R9j04J34M2l5J02j11K4k39J94k8m9K71p0j26
8183D7n5R5r3O5k18J93j39J72
8191F7
$$ Imaginary data points
##PAGE= N=2
##DATA TABLE= (X++(I..I)), XYDATA
$$ plain form
0 0 0 0 0 0 0 0 0 0 0 0 0 0 0 0 0 -7 7 -7 7 -7 13 -14 14 -20 21 -27 28 -35 40 -44 51 -58 65 -76 84 -97 106
37 106 -120 134 -149 168 -184 205 -228 253 -279 307 -339 373 -411 453 -500 550 -606 672 -742
56 -742 825 -918 1026 -1153 1309 -1495 1733 -2041 2458 -3066 4033 -5809 10182 -48306 -23090
71 -23090 68800 47095 13976 -45186 -75139 -34885 42235 58302 30172 -25325 -69220 -45715
83 -45715 36183 66303 30980 -17159 -47554 -41694 17278 62797 44377 -6250 -41484 -41097 8802
96 8802 59927 51465 698 -37688 -40835 561 53565 55383 7186 -34456 -41927 -10611 41607
109 41607 59534 17074 -33675 -47463 -19004 31150 55063 21629 -28393 -46079 -27504 13157
121 13157 47233 31786 -20073 -49840 -34703 5469 39644 32380 -13221 -45377 -36390 -3853
$$ packed form
0@%%%%%%%%%%%%%%%pJ4j4J4j4K0k7K8l4M1m8N5o3P5q4R5j09J23j41J60j81K03
37A06k26K54k83L17l52L89m33M81n32N86o46P12p84Q64r53J050j156J278j414
56g42J567j743J944k179K462k804L228l774M499n524P099r842J5991n8488K5216
71b3090R1890k1705l3119n9162k9953M0254P7120J6067k8130n5497m3895K3505
83d5715Q1898L0120l5323m8139l0395N860N8972M5519j8420n0627l5234L87M9899
96H802N1125q462n0767l8386l147M1396N3004J818m8197m1642p471L1316N2218
109D1607J7927m2460n0749j3788K8459N0154K3913l3434n0022j7686J8575M0661
121A3157L4076j5447n1859k9767J5137M0172L4175p264m5601l2156Q987L2537
$$ plain form
133 -3853 29800 35725 -2347 -42960 -40903 -5796 27437 34597 3866 -35483 -40052 -9354 24108
146 24108 35895 13274 -28044 -41937 -12387 24363 37857 18988 -19616 -39898 -17044 22039
158 22039 39244 25346 -9840 -36573 -23521 16073 40209 30237 -3208 -32592 -26973 9393
170 9393 36357 31699 3402 -26790 -30714 -176 32308 32973 6047 -23644 -31195 -7155 25465
183 25465 31033 8196 -20612 -31859 -13393 19345 30664 10218 -18862 -32443 -17780 13354
195 13354 29670 13705 -16837 -32669 -21052 8057 28191 17807 -12055 -32233 -24496 3943
207 3943 27928 22625 -6831 -29682 -25741 -729 24981 26671 955 -25538 -27460 -4380 22844
220 22844 29043 7482 -20279 -26347 -7391 19100 29555 13201 -14984 -25624 -10268 15892
$$ packed form
133c853L3653N925l8072m0613K057L5107L3233P160l0731l9349m569L0698L3462
146B4108J1787k2621m1318j3893K9550L6750J3494j8869l8604k0282K2854L9083
158B2039J7205j3898l5186k6733J3052L9594K4136r972l3445k9384N619L6366
170I393K6964m658k8297l0192l924L0538L2484O65k6926k9691p551K4040L2620
183B5465N568k2837k8808j1247J8466L2738J1319k0446k9080j3581J4663L1134
195A3354J6316j5965l0542j5832J1617K9109K0134j0384k9862k0178P737K8439
207C943K3985n303k9456k2851L941K5012K5710J690k5716k6493j922K3080K7224
220B2844O199k1561k7761o068J8956K6491J0455j6354k8185j0640J5356K6160
$$ plain form
232 15892 29113 16511 -10374 -24842 -12793 12666 27276 18366 -6864 -24195 -16149 8066
244 8066 26159 20514 -4132 -24009 -20289 3736 23981 21792 -1215 -23656 -23674 -1835 20947
257 20947 22815 2665 -21210 -26437 -7297 16879 23244 6474 -18175 -27008 -11765 12529 22973
270 22973 10372 -13566 -26565 -15031 9441 22212 13199 -9138 -23747 -16615 5949 22282
282 22282 16275 -5585 -21679 -17193 3612 21133 18481 -906 -19034 -18703 777 20921 21214
295 21214 2162 -16850 -19033 -2181 18183 23419 7031 -14585 -20587 -5936 15946 23962 10167
308 10167 -11807 -21159 -9411 11099 22930 13504 -8581 -21514 -13344 7423 20567 14481 -5462
321 -5462 -20588 -16410 2645 18391 15453 -2897 -19485 -17899 -436 15535 15971 -5 -17088
$$ packed form
232A5892J3221j2602k6885j4468J2049K5459J4610q910k5230j7331Q046K4215
244H066J8093n645k4646j9877L720K4025K0245k189k3007k2441j8K1839K2782
257B0947J868k0150k3875n227J9140K4176O365j6770k4649q833J5243K4294J0444
270B2973j2601k3938j2999J1534K4472J2771r013k2337j4609P132K2564J6333
282B2282o007k1860j6094M486K0805J7521k652j9387j8128L31J9480K0144K93
295B1214j9052j9012k183J6852K0364N236j6388k1616o002J4651K1882Q016j3795
308A0167k1974r352J1748K0510J1831r426k2085j2933Q170K0767J3144o086j9943
321e462j5126M178J9055J5746k938j8350j6588J586J7463J5971M36j5976j7083
$$ plain form
334 -17088 -19007 -3358 14061 16759 2442 -15307 -19670 -5873 12382 17379 5909 -12092 -19935
347 -19935 -8752 10917 19082 8786 -9536 -18958 -10321 8530 19201 12475 -5671 -17897 -12751
360 -12751 5572 19155 14804 -2291 -15540 -13515 2141 17210 16626 1028 -14070 -14847 -696
373 -696 15125 16862 2939 -12061 -15371 -3388 12257 16814 5183 -10921 -16323 -5600 9899
386 9899 16237 6587 -10071 -16403 -8505 7349 15702 8839 -7983 -17048 -10745 4744 14867 10380
400 10380 -5100 -16726 -13008 2083 14044 12212 -2344 -15359 -13966 -113 12849 13376 1110
413 1110 -12775 -15046 -2639 11825 14372 3762 -10535 -14643 -4383 10161 14420 6157 -7452
426 -7452 -14307 -6547 8587 15451 7803 -5980 -13677 -7761 6589 14854 9297 -3763 -13295 -9354
$$ packed form
334a7088j919J5649J7419K698j4317j7749m363J3797J8255M997j1470j8001p843
347a9935J1183J9669Q165j0296j8322r422Q637J8851J0671o726j8146j2226N146
360a2751J8323J3583m351j7095j3249K025J5656J5069n84j5598j5098p77J4151
373f96J5821J737j3923j5000l310J1983J5645M557j1631j6104n402J0723J5499
386I899O338r650j6658o332P898J5854Q353o863j6822r065O303J5489J0123m487
400A0380j5480j1626L718J5091J1961j832j4556j3015J393J3853J2962N27j2266
413A110j3885k271J2407J4464K547j0610j4297m108J0260J4544M259q263j3609
426g452o855P760J5134O864p648j3783p697N916J4350Q265n557j3060r532L941
$$ plain form
440 -9354 4213 14616 10860 -2327 -12384 -11185 1619 13099 12365 -380 -12190 -12089 -1032
453 -1032 11264 13152 1792 -10857 -13589 -4278 8938 13349 3566 -9567 -13935 -5954 6840 12579
467 12579 6021 -7526 -13984 -7250 4771 12307 7578 -5357 -13012 -8570 3253 11582 9127 -2746
481 -2746 -12503 -9817 1865 11357 9965 -757 -11240 -10737 534 10733 10985 1600 -9370 -11182
495 -11182 -1616 9680 12046 3919 -7792 -11875 -3913 8458 12976 5258 -5985 -11772 -5830 6272
509 6272 12496 6864 -4042 -11278 -7306 3837 11898 7923 -3125 -10835 -8082 1750 10355 8823
523 8823 -1485 -10244 -9617 -35 9276 9384 -121 -9777 -10195 -1753 7730 10013 1883 -8669 -10973
538 -10973 -2876 6982 10317 3669 -7060 -11280 -4780 5831 10558 5609 -5573 -11076 -6067 4767
$$ packed form
440i354J3567J0403l756j3187j0057J199J2804J1480p34j2745j1810J01J1057
453a032J2296J888j1360j2649k732R311J3216M411r783j3133m368P981J2794N739
467A2579o558j3547o458O734J2021P536m729j2935p655M442J1823Q329k455j1873
481b746r757K686J1682R492j392j0722j0483N03J1271J0199K52r385j0970j812
495a1182R566J1296K366q127j1711m083P962J2371M518p718j1243n787N942J2102
509F272O224n632j0906p236L972J1143Q061l975j1048p710K753R832Q605j532
523H823j0308q759O27R582R311J08r505r656m18Q442R483K283q130j0552k304
538a0973Q097R858L335o648j0729m220O500J0611M727m949j1182n503N009J0834
$$ plain form
552 4767 10504 6845 -2753 -10454 -7396 3085 10126 8061 -1149 -9149 -7922 1294 9478 8988 738
567 738 -8119 -8897 -425 8472 9306 1875 -7118 -8944 -1845 7187 9460 3183 -6071 -9486 -4103 5848
583 5848 9706 4013 -4941 -9606 -5592 4313 9724 5047 -3997 -9316 -6853 2844 9451 6582 -2559
598 -2559 -9025 -7430 463 8394 7434 -884 -8429 -7911 -393 7184 8374 637 -7888 -8119 -1998 6330
614 6330 8754 2324 -6349 -8320 -2904 5086 8733 3959 -5097 -8414 -3532 4592 8571 4899 -3756
629 -3756 -8339 -4510 3479 8395 5950 -2443 -8322 -5746 2424 8149 6696 -747 -7389 -6677 857
644 857 7568 7001 440 -7093 -7724 -550 6615 7301 1625 -5880 -8030 -2232 5263 7342 2569 -4981
660 -4981 -7820 -3847 4441 7612 3512 -3955 -7538 -4706 3019 7413 4318 -2922 -7473 -5495 2043
$$ packed form
552D767N737l659r598p701L058J0481P041k065r210q000J227R216Q184m90q250
567G38q857p78Q472Q897Q34p431q993j826P099R032K273o277r254l415N383R951
583E848L858n693q954m665M014R905N411m677r044n319K463R697O607k869r141
598b559o466J595P893P931r60q318p545N18P518P577J190p737q525k31O121Q328
614F330K424o430q673j971N416P990L647m774r056l317M882Q124L979l672q655
629c756m583L829P989M916k445q393n879K576Q170N725j453p443o642P12P534
644H57O711n67o561p533o31P174P165O86n676p505k150N798P495K079m773p550
660d981k839L973Q288L171m100p467l583K832P725M394l095p240m551J978P538
$$ plain form
675 2043 7152 4996 -1824 -6816 -5880 644 7072 6342 -631 -6859 -6044 -55 6347 6959 737 -5872
691 -5872 -6389 -1471 5395 7279 2099 -5193 -6894 -1903 4097 7515 3556 -3632 -6811 -3098 3474
706 3474 7096 4387 -2532 -6659 -3917 2325 6696 4705 -1726 -6493 -4951 1413 6115 5144 -624
721 -624 -5983 -5654 104 5517 5826 290 -5692 -6290 -605 5166 5718 1090 -4955 -6600 -1959 4291
737 4291 5974 2324 -3930 -6681 -3044 3495 5956 2668 -2989 -6371 -3776 2393 5978 3767 -1717
752 -1717 -6037 -4397 1993 6079 4614 -1031 -5446 -4866 776 5855 5164 -88 -4832 -5017 -107 5359
768 5359 5600 756 -4339 -5201 -926 4352 5979 1466 -3646 -5624 -2145 3924 6116 2451 -2939 -5647
784 -5647 -2885 2962 5812 3304 -2580 -5676 -3652 1790 5573 3857 -2033 -5305 -4138 794 5203
$$ packed form
675B043N109k156o820m992R36O524O428p30o973o228Q15N989O402O12o222o609
691e872n17M918O866J884n180p292j701M991O000L418l959p188l179L713O572
706C474L622k709o919m127K742O242M371j991o431m767J542O364M702r71n768
721f24n359L29N758N413L09n536n982n98N685N771N52m628o045j645M641O250
737D291J683l650o254k751L637O539K461l288n657l382K595O169L585k211n484
752a717m320J640O390M086j465n645m415N80N642N079o91n252m744j85M910N466
768E359K41m844n095q62M275N278J627m513n112j978L479O069K192l665n390k708
784e647K762N847K850k508n884l096K024N442L783j716n890l272J167M932M409
$$ plain form
799 5203 4283 -902 -5007 -4384 -201 4479 5002 228 -4919 -5004 -619 3737 4836 1306 -3964 -5428
815 -5428 -1639 3318 5028 2161 -3136 -5218 -1909 2986 5196 2573 -2429 -5259 -2773 2475 5311
830 5311 3066 -1439 -4991 -3405 1393 5037 4149 -666 -4613 -3937 782 4497 4314 175 -3942 -4268
846 -4268 -201 4141 4717 859 -3810 -4545 -928 3440 4256 1260 -3106 -4841 -2054 3051 4833 2056
862 2056 -2250 -4774 -2879 2125 4460 2540 -2131 -4779 -3052 1294 4621 3205 -1314 -4648 -3347
877 -3347 459 4212 3432 -568 -4227 -3755 -245 3756 4171 316 -3725 -4153 -759 3482 4612 1079
893 1079 -3116 -4382 -1148 2882 4504 1773 -2169 -4402 -1888 2654 4443 2375 -1749 -4086 -2475
908 -2475 1629 4021 2916 -1349 -4281 -3208 750 4035 3194 -442 -4115 -3265 346 3639 3664 7
$$ packed form
799E203r20n185m105O23M183M680N23m774n147q5M385M356J099l530n270j464
815e428L789M957J710k867n297k082L309M895K210k623n002k830K486N248K836
830E311k245m505l552J586M798L644q88m815l947O76M719L715j83m139m117l26
846d268M067M342N76l858m669p35L617M368Q16k996m366j735K787N105J782k777
862B056m306k524J895N004K335j920m671k648J727M346L327j416m519l334J301
877c347L806L753p80m000l659M72L510M001M15l855m041m28L394M241J130l533
893A079m195j266L234M030J622k731l942k233K514M542J789k068m124k337J611
908b475M104K392j105m265k932J073L958L285q41l636l673Q50L611L293K5l657
$$ plain form
924 7 -3591 -4003 -445 3390 3821 450 -3135 -3999 -1168 2686 3599 1349 -2672 -4187 -1594 1928 3731
941 3731 2020 -1964 -3959 -2448 1649 3658 2571 -977 -3736 -2685 944 3661 2790 -636 -3872
956 -3872 -3198 530 3471 3315 -56 -3228 -3243 -231 2821 3450 594 -2859 -3111 -420 3008 3558 1048
973 1048 -2663 -3412 -1202 2338 3679 1540 -1678 -3721 -1775 1890 3676 1996 -1681 -3430 -2255
988 -2255 1301 3396 2485 -983 -3667 -2824 479 3250 2752 -507 -3160 -2912 -165 3004 2781 19
1004 19 -3020 -2829 -504 2608 2961 519 -2387 -3410 -891 1946 3341 1131 -2080 -3028 -1561 1601
1020 1601 3403 1427 -1395 -3343 -1847 1338 3421 2178 -1471 -3125 -2045 755 3221 2400 -742
1035 -742 -2869 -2385 427 3000 2644 207 -2658 -2805 80 2538 3118 547 -2396 -2882 -513 2119
$$ packed form
924Gl598m12L558L835M31l371l585q64K831L854R13k250m021j515K593L522J803
941C731j711l984j995J511M097K009j087l548k759J051L629K717q71l426l236
956c872O74L728K941j56l371l172j5L012L052O29k856l453k52K691L428N50k510
973A048l711p49K210L540J341k139l218k043J946L665J786j680l677j749J175
988b255L556K095r11l468k684Q43L303K771m98l259k653K48K747L169k23k762
1004A9l039J91K325L112L53k442k906j023K519K837J395k210l211r48J467L162
1020A601J802j976k822j948J496L185K083j243l649j654J080K800K466q21l142
1035g42k127M84K812K573l56k437k865j47K885K458N80k571k943m86K369K632
$$ plain form
1051 2119 3083 853 -2226 -3302 -1121 2027 3109 1240 -1916 -3280 -1498 1802 3051 1672 -1270
1066 -1270 -3206 -1960 1177 2864 1820 -682 -2807 -2300 636 2700 2185 -159 -2856 -2793 6 2456
1082 2456 2517 194 -2299 -2538 -400 2550 2704 534 -1836 -3064 -844 1838 2789 834 -1578 -2542
1098 -2542 -1093 1362 2926 1221 -1338 -2405 -1548 951 2746 1815 -1003 -2602 -1593 659 2655
1113 2655 2131 -617 -2261 -1805 138 2369 2256 -85 -2496 -2335 -117 2050 2703 367 -2254 -2536
1129 -2536 -775 1776 2614 1108 -1775 -2688 -1332 1757 2418 957 -1283 -2653 -1378 1255 2415 1363
1145 1363 -906 -2543 -1534 846 2510 1692 -373 -2278 -1876 625 2293 1997 -237 -2115 -2069 40
1161 40 1994 1997 -19 -1404 -2196 -480 1814 2311 737 -1428 -2249 -871 1665 2418 1014 -1276 -2258
$$ packed form
1051B119R64k230l079j076K181L148J082j869l156j364J782L300J249j379k942
1066a270j936J246L137J687j044k502k125N07K936K064n15k344k697O3K799K450
1082B456O1k323k493k39K138K950J54k170k370j228K220K682R51j955k412r64
1098b542J449K455J564j705k559j067Q57K499J795r31k818j599J009K252J996
1113B655n24k748j644M56J943K231j13k341k411J61K218K167O53k336k621k82
1129b536J761K551Q38j506k883r13J356L089O61j461k240j370J275K633J160j052
1145A363k269j637J009K380J664q18k065j905M02K501J668k96k234j878M6K109
1161D0J954Lk016j385p92J716K294M97j574k165q21J378K536P53j404k290r82
$$ plain form
1178 -2258 -1075 1216 2324 1387 -1251 -2212 -1201 898 2039 1579 -858 -2178 -1510 406 1935 1831
1194 1831 -361 -2057 -1861 403 1863 1956 -276 -1867 -1892 -156 1981 2026 61 -1691 -2124 -633 1697
1211 1697 1991 498 -1476 -2197 -847 1445 1914 820 -1283 -2094 -1001 951 2067 1264 -762 -1784
1227 -1784 -1270 647 2032 1398 -317 -1905 -1696 526 1704 1847 113 -1576 -1728 207 1946 1895 39
1244 39 -1519 -1585 -332 1630 1940 475 -1173 -2044 -402 1456 1896 586 -1066 -2026 -1088 1030 2178
1261 2178 781 -1058 -1996 -912 444 1850 1289 -590 -2061 -1454 310 1842 1600 -292 -1810 -1489
1277 -1489 85 1591 1657 -157 -1718 -1816 -88 1419 1625 593 -1549 -1874 -453 1172 2200 871
1293 871 -1177 -1723 -339 1013 1918 890 -1019 -1696 -1040 883 1864 744 -407 -1895 -1445 546 1698
$$ packed form
1178b258J183K291J108r37k638r61J011K099J141m60k437j320O68J916J529j04
1194A831k192j696J96K264J460R3k232j591k5J736K137M5j965j752m33J491K330
1211A697K94j493j974p21J350K292M69j094k103q11J093J952J116q03k026j022
1227a784N14J917J385o34j715j588K09K222J178J43j734j689j52J935J739n1j856
1244C9j558o6J253J962L10j465j648q71J642J858M40j310j652r60R38K118J148
1261B178j397j839r38J084J356J406n61j879j471O07J764J532k42j892j518L21
1277a489J574J506O6j814j561r8J728J507K06j032k142l25J421J625J028j329
1293H71k048n46J384J352R05j028j909o77O56J923R81j120j151j488M50J991J152
$$ plain form
1310 1698 1278 -335 -1828 -1615 274 1847 1362 -264 -1555 -1376 36 1474 1605 158 -1559 -1754
1326 -1754 -390 1116 1283 411 -1273 -1408 -526 805 1457 717 -872 -1476 -878 920 1781 599 -520
1343 -520 -1572 -1145 623 1745 723 -407 -1749 -983 183 1553 1269 -287 -1372 -1467 247 1403
1359 1403 1597 114 -1524 -1208 -205 1135 1580 224 -1134 -1332 -287 1167 1710 585 -1189 -1233 -472
1376 -472 769 1713 765 -810 -1601 -720 615 1527 920 -302 -1633 -852 433 1317 1119 -464 -1477
1393 -1477 -1280 514 1399 1008 -63 -1383 -1292 34 1151 1030 415 -1143 -1581 -112 1012 1143 308
1410 308 -1000 -1501 -659 964 1406 612 -740 -1426 -917 877 1426 702 -421 -1485 -1011 419 1475
1427 1475 931 -83 -907 -640 323 1526 1090 -374 -959 -908 -124 1352 1117 -245 -708 -1099 -430 1132
$$ packed form
1310A698m20j613j493K13J889J573m85j626j291J79J412J438J31j447j717j95
1326a754J364J506J67q72j684j35Q82J331O52p40j589o04N98J798Q61j182j119
1343e20j052M27J768J122j022j130j342P66J166J370k84j556j085r5J714J156
1359A403J94j483j638L16J003J340M45j356j358j98J045J454N43j125j774m4P61
1376d72J241R44r48j575p91Q81J335R12o07j222j331P81J285Q84j98j583j013
1393a477J97J794Q85l91j071j320R1J326J117j21o15j558m38J469J124J31q35
1410C08j308n01Q42J623M42p94j352o86N09J794N49p24j123j064M74J430J056
1427A475n44j014q24K67R63J203m36j464n85N1P84J476k35j362m63l91O69J562
$$ plain form
1445 1132 1076 126 -1131 -1240 -509 773 1498 464 -803 -1154 -569 785 972 604 -582 -1329 -619 254
1463 254 1339 1098 -434 -1374 -640 285 980 942 -364 -1097 -916 -112 872 1012 -89 -1185 -1006 -36 949
1482 949 939 470 -901 -1197 -151 564 1038 275 -624 -1348 -450 829 1396 645 -482 -1579 -558 606
1500 606 1259 580 -452 -701 -725 311 1139 816 -123 -1153 -1020 204 959 1005 96 -953 -912 -183 1024
1519 1024 1001 74 -639 -1092 -370 682 1023 -11 -819 -1271 -482 847 1294 287 -645 -993 -733 520
1537 520 895 308 -504 -961 -797 332 1149 708 -435 -1003 -811 465 1117 753 -90 -930 -844 95 960
1556 960 871 -113 -1157 -882 36 564 1113 349 -521 -1220 -218 658 702 554 -653 -910 -460 289 1026 440
1576 440 -342 -1048 -621 297 769 614 -448 -706 -745 149 783 652 -368 -747 -604 72 973 804 -91 -873
$$ packed form
1445A132n6r50j257j09P31J282P25j034j267l51N85J354J87l68j186p47P10Q73
1463B54J085k41j532r40P34R25O95l8j306p33J81Q04R84J40j101j096J79R70R85
1482I49j0m69j371k96J046P15M74p63q99p24Q98J279N67p51j127j097J021J164
1500F06O53o79j032k49k4J036Q28l23r39j030J33J224P55M6r09j049M1P29J207
1519A024k3r27p13m53P22J052L41j034q08m52P89J329M47j007r32l48K60J253
1537E20L75n87q12m57J64J129Q17m41j143n68J92J276O52l64q43q40Q6R39Q65
1556I60q9r84j044K75R18N28N49p64q70o99J002Q76M4j48j207k57M50P49P37n86
1576D40p82p06M27R18M72j55j062k58l9Q94O34j31j020l79J43O76R01j69q95p82
$$ plain form
1596 -873 -806 -52 968 1003 -36 -545 -775 -411 437 970 371 -574 -757 -383 767 1184 325 -551 -912 -352
1616 -352 412 833 640 -440 -1041 -537 375 880 233 -140 -940 -922 434 585 755 -183 -652 -775 -34 750
1636 750 782 -164 -737 -887 150 650 676 454 -693 -991 -276 490 359 280 -456 -916 -98 454 859 419
1656 419 -389 -752 -634 401 922 459 -28 -606 -444 122 644 618 -16 -468 -514 80 633 562 17 -848 -760
1677 -760 -163 506 761 295 -760 -669 -365 561 612 276 -545 -777 -136 526 811 364 -314 -602 -372 224
1697 224 434 367 -199 -566 -210 72 678 620 -226 -658 -356 271 752 656 -81 -757 -416 23 781 336 77
1718 77 -368 -349 19 756 670 -37 -375 -899 -148 382 543 114 -596 -868 -285 472 854 517 -466 -790 -537
1739 -537 280 1018 428 -339 -658 -571 245 496 502 21 -718 -505 -25 613 353 -169 -364 -519 -218 379 488
$$ packed form
1596h73O7P54J020L5j039n09k30L64Q48N33n99r45j83L74J150M17q59q76l61N60
1616c52P64M21j93j080o01N04R12N05o47l73q00J8J356J51J70r38m69j23P41P84
1636G50L2r46n73j50J037N00K6k22j147k98P15P66j31p9p36m60Q18N52M05m40
1656D19q08l63J18J035N21m63m87n78J62N66N22k6o34m52m6N94N53p1n45q65Q8
1677g60N97O69K55m66j055R1L04R26N1l36q21k32O41O62K85m47o78k88K30N96
1697B24K10o7n66l67L56K82O06n8q46m32L02O27M81r6p37o76L41M39P58m45k59
1718G7m45J9L68P37q6p07l38n24P51N30J61m29p10k72N83P57L82l37r83l24K53
1739e37Q17P38n90p67l19Q7Q16K51Om81p39K13M80O38k60n22j95j55L01N97J09
$$ plain form
1760 488 -19 -420 -487 288 331 467 211 -538 -594 -34 494 767 418 -292 -389 -471 101 302 279 26 -308 -279
1782 -279 -81 1014 436 -301 -483 -530 95 654 842 -22 -753 -438 82 404 574 63 -393 -604 -335 403
1802 403 546 -6 -219 -348 -272 428 489 320 -347 -505 -224 252 256 113 -349 -403 -331 61 675 597 5 -317
1824 -317 -362 146 306 569 -443 -377 -597 -104 447 426 -60 -439 -366 112 471 500 76 -307 -377 -112 304 280
1846 280 -14 -384 -285 -127 225 693 228 -292 -711 -140 411 513 188 -182 -302 -324 153 266 59 -56 -286
1867 -286 -304 40 178 278 9 -120 -330 38 467 390 190 -535 -828 -474 446 498 99 -218 -477 -138 291
1888 291 591 274 -227 -624 -151 493 386 302 -298 -310 -297 206 400 282 -84 -598 -232 -47 453 512 50
1909 50 -598 -142 241 742 389 -98 -276 -416 -14 331 264 -196 -156 -429 -18 266 474 49 -354 -430 -89
$$ packed form
1760D88n07m01o7P75M3J36k56p49n6N60N28K73l49p10r7q2N72K01k3k53l34K9
1782b79J98J095n78p37j82m7O25N59J88q64p31L15N20L22J70n11m56k11K69P38
1802D03J43n52k13j29P6P00O1j69o67j58K81M76Mj43m62n4P2L92O14p8n92l22
1824c17m5N08J60K63j012O6k20M93N51k1m86l79P3M78L59K9m24l83p0K65M16k4
1846B80k94l70R9J58L52M68m65n20m19N71N51J02l25l70j20k2M77J13k07j15k30
1867b86j8L44J38J00k69j29k10L68M29p7k00p25k93L54R20N2l99l17k59L39M29
1888B91L00l17n01l97M73O44j07q4o00j2J3N03J94j18l66n14L66J85N00N9m62
1909E0o48M56L83N01l53m87j78j40M02L45o7m60M0k73M11K84K08m25m03p6L41
$$ plain form
1930 -89 213 668 39 -43 -476 11 34 320 157 -239 -473 -59 66 332 341 -63 -422 -380 110 175 379 102
1952 102 -781 -211 -4 520 384 -102 -112 -317 84 521 347 412 -523 -356 -192 107 692 49 -424 -136 -70
1973 -70 96 616 397 -169 -290 -155 182 410 234 -91 -259 -468 195 262 331 -29 -363 -346 88 285 272 113
1995 113 -324 -268 -258 352 314 355 -230 -377 -175 380 424 135 -313 -407 -100 257 320 251 41 -340 -421 94 155
2018 155 314 73 -346 -375 134 402 75 -123 -345 -330 -103 487 421 23 -376 -253 112 365 213 75 -278
2039 -278 -576 407 343 289 -70 -534 -212 -127 197 251 116 -313 -418 -60 387 338 302 -218 -366 -111 247 513
2061 513 -35 -276 -110 -385 368 329 350 -119 -228 -366 -34 85 114 -225 -120 -209 68 257 417 79 -18 -181
2083 -181 -177 286 493 -36 -80 -643 -20 284 138 186 -329 -424 -215 332 275 190 18 -320 -88 70 294 197 146
$$ packed form
1930h9L02M55o29q2m33M87K3K86j63l96k34M14J25K66Rm04l59M2M90O5K04k77
1952A02q83N70K07N24j36m86j0k05M01M37j74O5r35J67J64K99N85o43m73K88O6
1973g0J66N20k19n66j21J35L37K28j76l25j68k09O63O7O9l60l34J7M34J97j3j59
1995A13m37N6J0O10l8M1n85j47K02N55M4k89m48r4L07L57O3o9k10l81q1N15O1
2018A55J59k41m19k9N09K68l27j98k22J5K27N90o6l98l99J23L65K53j52j38l53
2039b78k98R83o4n4l59m64L22Q5L24N4j35m29j05L58M47m9l6n20j48K55L58K66
2061E13n48k41J66k75P53l9K1m69j09j38L32J19K9l39J05q9K77J89J60l38r7j63
2083a81MM63K07n29m4n63O23L04j46M8n15r5K09N47n7q5j72l38K32J58K24r7n1
$$ plain form
2106 146 -331 97 121 217 117 -34 31 -447 -239 214 268 -82 -458 -283 -129 178 323 123 -307 -214 -8 -32
2128 -32 166 186 -76 -306 -181 -76 85 -22 -278 -194 -254 190 203 303 -146 -280 -40 126 229 339 76 -130
2150 -130 -593 96 321 121 96 -224 -229 143 116 409 82 -267 -252 66 180 500 88 -233 -401 -118 64 456
2172 456 409 35 -177 159 229 322 244 26 -157 -469 -69 315 260 -75 -519 -1 190 402 268 67 -481 -466
2194 -466 191 263 165 -32 -204 -209 -11 162 242 174 -367 -678 -43 54 393 216 -289 -247 51 166 300 182 -168
2217 -168 -138 62 42 233 -223 157 -209 -25 173 280 399 112 -4 -316 -178 211 230 -115 -79 -269 -51
2238 -51 55 324 -97 -159 -277 -427 -39 348 108 -48 -45 -33 159 336 554 -213 -56 -1 -22 448 251 -106
2260 -106 -294 54 14 338 370 -11 -331 -70 9 151 156 253 -145 -12 -120 250 47 219 21 -85 -55 220
$$ packed form
2106A46m77M28K4R6j00j51O5m78K08M53N4l50l76J75J54L07J45k00m30R3K06k4
2128c2J98K0k62k30J25J05J61j07k56Q4o0M44J3J00m49j34K40J66J03J10k63k06
2150a30m63O89K25k00k5l20nL72k7K93l27l49J5L18J14L20m12l21j68K83J82L92
2172D56m7l74k12L36P0R3p8k18j83l12M00L84n5l35m44N18J91K12j34k01n48J5
2194d66O57P2r8j97j72nJ98J73Q0o8n41l11O35R7L39j77n05M2K98J15J34j18l50
2217a68L0K00k0J91m56L80l66J84J98J07J19k87j16l12J38L89J9l45L6j90K18
2238e1J06K69m21o2j18j50L88L87k40j56LJ2J92J77K18p67J57N5k1M70j97l57
2260a06j88L48m0L24L2l81l20K61P9J42NR7l98J33j08L70k03J72j98j06L0K75
$$ plain form
2282 220 451 214 -106 -312 43 153 123 27 -73 -167 -129 274 225 389 -264 -178 179 23 104 -54 79 -512
2304 -512 -382 -25 268 41 70 -31 -249 -192 159 103 139 -128 -60 -26 86 185 -224 99 -206 1 234 24
2326 24 14 -121 -154 -82 123 260 254 -187 -330 -222 42 29 160 73 -480 -82 86 -85 4 24 48 -186 -7 96
2350 96 84 -61 -17 -390 394 160 402 322 -35 -268 66 37 62 -173 -43 -2 -180 4 -64 27 -313 -81 -180
2373 -180 116 153 -32 150 -352 -32 362 32 145 -196 -355 -383 -130 282 170 152 -84 -74 141 180 221 149
2395 149 -190 4 28 132 -24 80 -185 -369 -23 -175 21 37 -79 65 -99 98 338 103 15 -221 -363
2416 -363 67 96 186 -116 -446 -486 -12 331 -136 -25 58 -76 105 82 115 -152 -85 -110 -288 147 266 -75 27
2439 27 -171 125 73 199 29 -289 -241 -385 104 -5 262 46 -131 146 239 367 219 -40 78 147 -135 -62
$$ packed form
2282B20K31k37l20k06L55J10l0r6j00r4L8M03m9J64o53Q6L57j56Q1j58J33n91
2304e12J30L57K93k27K9j01k18N7L51n6L6k67O8L4J12R9m09L23l05K07K33k10
2326B4j0j35l3P2K05J37om41j43J08K64j3J31q7n53L98J68j71Q9K0K4k34J79J03
2350I6j2j45M4l73P84k34K42q0l57k33L34k9K5k35J30M1j78J84o8R1l40K32r9
2373a80K96L7j85J82n02L20L94l30J13l41j59k8K53M12j12j8k36J0K15L9M1p2
2395A49l39J94K4J04j56J04k65j84L46j52J96J6j16J44j64J97K40k35q8k36j42
2416c63M30K9R0l02l30m0M74L43m67J11Q3j34J81k3L3k67O7k5j78M35J19l41J02
2439B7j98K96n2J26j70l18M8j44M89j09K67k16j77K77R3J28j48k59J18O9k82P3
$$ plain form
2461 -62 291 -53 -185 148 41 199 288 -88 -135 -218 -156 89 107 -29 -148 133 -111 84 -187 59 -269 -305
2483 -305 56 -85 260 52 -148 -82 -72 84 304 -98 172 201 -234 -57 226 195 -145 -211 -227 -24 -99 258
2505 258 -7 -181 -148 -256 114 85 83 277 12 -68 7 -287 63 -223 -96 246 177 176 -84 210 -87 -90 -200 122
2529 122 69 34 -203 -36 -24 128 -94 32 -88 -17 2 -98 342 132 138 -183 10 -247 -15 -108 -198 -75 -25
2552 -25 -304 218 248 -4 -64 409 253 94 159 -81 -119 -107 -132 338 223 83 -159 -61 209 192 106 54 -210 1
2576 1 206 210 -21 -244 -112 -129 57 155 -88 -137 -302 -234 101 184 11 -141 -36 -177 -59 28 146 2 162
2599 162 59 -181 77 68 168 -67 -99 -151 138 -106 -31 -85 -129 -66 -173 1 -29 -50 -89 -246 39 60 -58 224
2623 224 -5 -52 -119 117 5 257 -148 -8 -36 134 -10 102 -86 5 174 -9 62 91 86 -22 -217 -106 -160
$$ packed form
2461f2L53l44j32L33j07J58Q9l76m7q3O2K45J8j36j19K81k44J95k71K46l28l6
2483c05L61j41L45k08k00O6J0J56K20m02K70K9m35J77K83l1l40o6j6K03p5L57
2505B58k65j74L3j08L70k9kJ94k65q0P5k94L50k86J27L42o9jk60K94k97lj10L22
2529A22n3l5k37J67J2J52k22J26j20P1J9j00M40k10Ol21J93k57K32r3r0J23N0
2552b5k79N22L0k52o0M73j56j59O5k40l8J2k5M70j15j40k42R8K70j7q6n2k64K11
2576AK05Mk31k23J32j7J86R8k43m9j65O8L35Q3j73j52J05j41J18Q7J18j44J60
2599A62j03k40K58rJ00k35l2n2K89k44P5n4m4O3j07J74l0k1l9j57K85K1j18K82
2623B24k29m7o7K36j12K52m05J40k8J70j44J12j88R1J69j83P1K9nj08j95J11n4
$$ plain form
2646 -160 168 71 -160 -290 120 84 -235 -106 172 -136 -56 89 133 -18 -423 -4 -201 65 203 -127 -6
2667 -6 -116 -171 -239 48 201 -59 -27 129 10 -17 -26 8 -89 -10 133 -104 -11 52 -183 22 -49 88 -158 -62 -268
2692 -268 -66 95 -84 19 -57 -368 -249 6 -191 374 182 -220 70 -136 37 72 220 -150 -281 -225 79
2713 79 26 -48 -25 51 -63 54 7 151 -68 -76 53 -188 39 61 268 -66 201 103 -14 115 -12 29 -132 49
2737 49 19 39 -28 194 -155 -72 -277 -73 193 -187 -132 73 -130 122 289 -136 -156 -48 -31 -41 334 -18 167
2760 167 -246 -138 -231 163 -34 3 -5 -55 71 4 10 -30 20 -136 -206 -336 -197 70 -12 -92 17 169 103 36 -223
2785 -223 -118 347 -197 66 114 -39 -358 75 10 239 109 147 -62 125 148 319 68 175 -92 -30 67 236
2807 236 90 -282 -241 -213 -15 -99 155 -129 -135 -34 -190 66 -102 -57 7 187 99 -95 102 -46 -209 256 -99
$$ packed form
2646a60L28r7k31j30M10l6l19J29K78l08Q0J45M4j51m05M19j97K66J38l30J21
2667fj10n5o8K87J53k60L2J56j19k7rL4r7P9J43k37R3O3k35K05p1J37k46R6k06
2692b68K02J61j79J03p6l11J19K55j97N65j92m02K90k06J73L5J48l70j31N6L04
2713G9n3p4K3P6j14J17m7J44k19qJ29k41K27K2K07l34K67r8j17J29j27M1j61J81
2737D9l0K0o7K22l49Q3k05K04K66l80N5K05k03K52J67m25k0J08J7j0L75l52J85
2760A67m13J08r3L94j97L7qn0J26o7Om0N0j56p0j30J39K67q2q0J09J52o6o7k59
2785b23J05M65n44K63M8j53l19M33o5K29j30L8k09J87K3J71k51J07k67O2R7J69
2807B36j46l72M1K8J98q4K54k84oJ01j56K56j68M5O4J80q8j94J97j48j63M65l55
$$ plain form
2830 -99 -85 89 25 53 -88 -143 45 -27 16 -11 -146 93 -28 265 -110 149 -149 -18 140 -215 -241 131 -5
2853 -5 -121 21 85 78 -58 -74 6 133 211 218 168 -120 53 -121 -288 -22 -81 198 -22 -82 -39 167 131 -206 -92
2878 -92 43 -169 96 404 71 -108 -50 -25 231 1 -55 57 -151 37 -169 -159 59 68 -103 254 -3 -16 111
2901 111 -54 -439 152 -125 114 -110 -254 84 -126 111 -163 10 -204 89 -41 -96 -5 -25 0 -133 -232 -202
2923 -202 327 117 -54 118 -104 -46 77 249 -146 -105 -6 -330 177 279 -126 -32 26 -23 -70 42 -136 145
2945 145 0 54 -87 -63 -59 -93 -233 12 -50 27 69 -24 48 -136 -103 34 -86 7 -17 94 -257 296 144 -22
2969 -22 -157 30 15 -86 129 54 -207 33 -156 -53 -12 102 -187 -313 -50 -193 -28 7 116 59 57 31 -4
2992 -4 -35 31 16 -361 65 -143 -93 -399 -281 132 -119 241 74 68 218 -350 -60 112 28 77 156 -65 -68 -7 -42
$$ packed form
2830i9J4J74o4K8j41n5J88p2M3k7j35K39j21K93l75K59k98J31J58l55k6L72j36
2853ej16J42O4pj36j6Q0J27P8Pn0k88J73j74j67K66n9K79k20o0M3K06l6l37J14
2878i2J35k12K65L08l33j79N8K5K56k30n6J12k08J88k06J0K18Rj71L57k57j3J27
2901A11j65l85N91k77K39k24j44L38k10K37k74J73k14K93j30n5R1k0K5j33r9L0
2923b02N29k10j71J72k22N8J23J72l95M1R9l24N07J02m05R4N8m9m7J12j78K81
2945A45j45N4j41K4Ml4j40K45o2P7M2r3P2j84L3J37j20R3k4J11l51N53j52j66
2969b2j35J87j5j01K15p5k61K40j89J03M1J14k89j26K63j43J65L5J09n7kk6l5
2992dl1O6j5l77M26k08N0l06J18M13k51L60j67oJ50n68K90J72q4M9P9k21lO1l5
$$ plain form
3017 -42 219 -164 12 -89 145 154 223 190 -200 -145 23 30 119 49 -24 115 -55 268 336 94 -7 -18 -292 -129
3041 -129 84 74 -192 -293 -20 0 165 -74 -195 -160 340 98 -187 -43 47 -208 -60 -39 40 317 -1 124
3063 124 -118 -110 86 10 172 61 5 -104 112 -26 -20 -40 -188 145 -117 52 243 -146 40 -291 -159 271
3085 271 -47 139 -122 187 111 -197 404 -164 118 -143 -29 -192 -229 -149 -128 114 -39 85 219 31 226
3106 226 185 -18 -11 -42 126 78 -130 121 -23 35 54 -88 4 135 17 4 -165 -152 -37 38 10 -53 117 -152
3130 -152 -74 -83 -171 132 212 108 -64 -146 124 80 135 7 110 -18 -340 -72 -85 -186 45 -249 121 157 257
3153 257 -17 62 -154 111 -49 16 -127 153 205 -93 295 -22 -26 156 154 -153 149 0 57 29 48 -175 -310
3176 -310 -148 -22 -115 65 152 -206 -144 -64 -5 71 72 -210 9 196 159 142 -73 -126 5 35 81 30 9 -81 82
$$ packed form
3017d2K61l83J76j01K34RO9l3l90N5J68PQ9p0p3J39j70L23O8k42j01j1k74J63
3041a29K13j0k66j01K73K0J65k39j21L5N00k42k85J44R0k55J48K1P9K77l18J25
3063A24k42QJ96p6J62j11n6j09K16j38Ok0j48L33k62J69J91l89J86l31J32M30
3085B71l18J86k61L09p6l08O01n68K82k61J14j63l7Q0K1K42j53J24J34j88J95
3106B26m1k03Pl1J68m8k08K51j44N8J9j42R2J31j18j3j69J3J15P5k8o3J70k69
3130a52P8rq8L03Q0j04j72q2K70m4N5j28J03j28l22K68j3j01K31k94L70L6J00
3153B57k74P9k16K65j60O5j43K80N2k98L88l17mJ82kl07L02j49N7k8J9k23j35
3176c10J62J26r3J80Q7l58O2Q0N9P6Jk82K19J87l7j7k15n3J31L0M6n1k1r0J63
$$ plain form
3201 82 203 85 -35 -86 10 -286 134 92 35 -59 93 102 69 -37 85 213 -430 -311 26 84 -51 -137 -74 59
3225 59 -238 43 6 20 39 -109 -117 265 89 -1 -114 96 -297 32 -100 -217 5 -121 -184 136 -108 -156 121
3248 121 105 -35 -73 17 -133 -42 -56 52 75 57 105 -269 -168 -133 -77 68 93 28 -17 -151 87 -10 15 -103 -196
3273 -196 -144 63 267 -108 -10 -297 -149 -71 38 -62 -244 -61 -63 -70 124 35 303 -231 -160 -70 -187 102 152 -54
3297 -54 46 0 229 -54 -69 -182 16 -148 24 -12 -231 -298 110 179 104 40 -61 -62 80 128 -118 108 -64 55
3321 55 47 -178 -117 160 -42 -153 -139 159 -7 -38 195 -166 70 -139 -229 -40 22 -123 -52 -162 -115 4 -4 321
3345 321 -23 -134 91 144 -203 -104 156 -52 -187 104 -32 -97 -101 109 104 377 72 75 143 217 76 -156 53 88
3369 88 164 352 77 -105 229 74 -417 158 -89 -2 -122 -49 -85 144 166 -87 141 -23 293 211 -65 99
$$ packed form
3201H2J21j18j20n1R6k96M20m2n7r4J52Rl3j06J22J28o43J19L37N8j35q6O3J33
3225E9k97K81l7J4J9j48qL82j76r0j13K10l93L29j32j17K22j26o3L20k44m8K77
3248A21j6j40l8R0j50R1j4J08K3j8M8l74J01L5N6J45K5o5m5j34K38r7K5j18r3
3273a96N2K07K04l75R8k87J48P8J09j00j82J83kpJ94q9K68n34P1R0j17K89N0k06
3297e4J00m6K29k83j5j13J98j64J72l6k19o7M08O9p5o4j01jJ42M8k46K26j72J19
3321E5qk25O1K77k02j11J4K98j66l1K33l61K36k09r0J89O2j45P1j10M7J19qL25
3345C21l44j11K25N3l47R9K60k08j35K91j36o5mK10nK73l05LO8P4j41k32K09L5
3369H8P6J88k75j82L34j55m91N75k47Q7j20P3l6K29K2k53K28j64L16q2k76J64
$$ plain form
3391 99 -32 -102 94 -31 -284 32 -206 408 21 212 -233 -61 52 -186 95 -229 84 -163 -140 -63 74
3412 74 -117 323 207 -241 -46 11 -158 123 -132 -173 214 -60 190 -12 69 -377 -165 -187 20 -271 46 -95
3434 -95 18 37 -133 46 114 -5 -54 96 -176 -21 36 -50 -144 337 87 -41 -137 -115 -85 280 -170 -89 -87 -15 -90
3459 -90 -51 -67 9 -199 212 -7 -183 -73 -41 130 -51 166 50 84 -118 58 -122 -325 -76 -194 -14 55
3481 55 152 -197 118 151 59 311 -174 -158 -48 -282 176 137 90 -145 -51 148 -54 114 -22 -80 -179 -28 -344
3504 -344 48 -5 -8 -241 -10 -199 269 102 -99 -126 -101 -65 -176 -87 25 -199 66 244 129 222 -32 138 -181
3527 -181 94 -126 147 285 84 -207 188 153 -76 4 100 -226 -137 39 -41 103 -75 65 83 319 -47 -286
3549 -286 -3 48 -84 -250 -59 67 203 -252 -460 79 -74 177 130 -94 -33 0 -18 267 -27 60 -143 -163
$$ packed form
3391I9j31p0J96j25k53L16k38O14l87J91m45J72J13k38K81l24L13k47K3P7J37
3412G4j91M40j16m48J95N7j69K81k55m1L87k74K50k02Q1m46K12k2K07k91L17j41
3434i5J13J9j70J79O8j19m9J50k72J55N7q6r4M81k50j28r6K2L0L65m50Q1KP2p5
3459i0L9j6P6k08M11k19j76J10L2J71j81K17j16L4k02J76j80k03K49j18J80O9
3481E5R7l49L15L3r2K52m85J6J10k34M58l9m7k35R4J99k02J68j36n8r9J51l16
3504c44L92n3lk33K31j89M68j67k01k7K5L6j11Q9J12k24K65J78j15R3k54J70l19
3527a81K75k20K73J38k01k91L95l5k29Q0R6l26Q9J76q0J44j78J40J8K36l66k39
3549b86K83N1j32j66J91J26J36m55k08N39j53K51m7k24O1L3j8K85k94Q7k03k0
$$ plain form
3571 -163 -130 270 230 111 -217 81 -124 166 -31 58 -53 10 -81 219 87 140 75 80 93 124 -228 -36 -263 -308
3595 -308 74 -73 68 104 -90 27 -83 335 189 -12 -140 237 110 -20 45 10 168 -39 90 59 -128
3616 -128 252 -133 -300 225 97 385 81 87 -91 10 229 274 168 -36 -142 -173 35 98 184 84 -246 22
3638 22 -51 58 122 43 51 47 63 -70 -35 -38 -68 -112 -176 276 172 17 -60 -25 150 -187 99 180 -88 -134 75 -149
3664 -149 -11 1 -22 -166 -146 -40 -215 45 333 14 -52 -348 156 -311 307 -159 47 133 22 -127 -7 -65
3686 -65 -38 -298 -89 -216 209 -152 107 64 -16 110 158 114 40 61 -54 129 10 83 -174 190 58 150 -254
3709 -254 -28 -135 -4 -64 298 -60 4 145 6 224 388 379 114 56 167 -295 -123 -112 -74 -22 -150 217 23
3732 23 38 77 -179 -199 -3 193 54 138 92 36 -241 76 103 25 192 -190 -196 -76 293 -188 122 -3 64 -45
$$ packed form
3571a63L3M00m0j19l28K98k05K90j97Q9j11O3r1L00j32N3o5NJ3L1l52J92k27m5
3595c08L82j47J41L6j94J17j10M18j46k01j28L77j27j30O5l5J58k07J29l1j87
3616a28L80l85j67N25j28K88l04Oj78J01K19M5j06k04j06l1K08O3Q6j00l30K68
3638B2p3J09O4p9QmJ6j33L5ll0m4o4M52j04j55p7L5J75l37K86Q1k68m6K09k24
3664a49J38J2k3j44K0J06j75K60K88l19o6k96N04m67O18m66K06Q6j11j49J20n8
3686f5K7k60K09j27M25l61K59m3q0J26M8m4p4K1j15J83j19P3k57L64j32R2m04
3709b54K26j07J31o0L62l58O4J41j39K18J64rk65n8J11m62J72J1L8N2j28L67j94
3732B3J5L9k56k0J96J96j39Q4m6n6k77L17K7p8J67l82oJ20L69m81L10j25O7j09
$$ plain form
3756 -45 126 138 -11 -188 125 -131 -79 -108 -46 16 136 -123 -264 88 24 158 -165 -35 85 439 35 40 -69
3779 -69 84 -242 -11 196 26 115 -204 -93 -54 58 -71 -66 -220 -107 107 -8 13 -188 -226 57 12 -91 160
3802 160 -38 86 -192 -39 -135 110 0 -126 -9 181 15 100 189 -179 -27 -36 322 151 -364 99 -93 -13
3824 -13 67 34 95 41 313 -146 -51 -124 12 27 -188 156 -60 -75 -107 -41 -28 -129 32 -178 117 -114 -182 -235 68
3849 68 213 207 142 -95 -118 114 128 -181 -30 56 -10 -238 15 -20 -3 138 -220 -268 -70 381 -145 6 -35 111
3873 111 17 -41 -170 14 -64 -157 103 275 -147 -148 155 -66 -5 160 171 149 -94 -204 56 128 98 138 -257 14
3897 14 -214 153 190 90 -14 53 -161 159 165 -75 -150 -267 -248 -115 208 -4 55 -127 -34 -51 116 5 -391
3920 -391 -89 127 -34 120 148 -54 -3 -189 242 4 136 -258 107 50 77 125 -75 -180 6 -20 130 -35
$$ packed form
3756d5J71J2j49j77L13k56N2k9O2O2J20k59j41L52o4J34l23J30J20L54m04Nj09
3779f9J53l26K31K07j70Q9l19J11L9J12j29Nj54J13K14j15K1k01l8K83m5j03K51
3802A60j98J24k78J53r6K45j10j26J17J90j66Q5Q9l68J52rL58j71n15M63j92Q0
3824a3Q0l3O1n4K72m59R5p3J36J5k15L44k16j5l2O6J3j01J61k10K95k31o8n3L03
3849F8J45oo5k37k3K32J4l09J51Q6o6k28K53l5J7J41l58m8J98M51n26J51m1J46
3873A11r4n8j29J84p8r3K60J72m22jL03k21O1J65J1k2k43j10K60P2l0M0l95K71
3897A4k28L67L7j00j04O7k14L20Ok40p5j17J9J33L23k12N9j82R3j7J67j11l96
3920c91L02K16j61J54K8k02N1j86M31k38J32l94L65n7K7M8k00j05J86k6J50j65
$$ plain form
3942 -35 80 95 -42 -146 7 102 155 -83 30 -1 -64 -81 167 40 -83 105 -108 -113 -9 61 17 -131 56 -329
3966 -329 -166 -201 -16 -5 -171 -243 76 219 -77 72 -136 -136 1 401 270 41 -296 -196 72 96 -299 -10
3988 -10 0 -106 4 249 -89 -5 63 -87 -7 211 197 -351 5 -12 104 -29 -62 3 60 -174 -83 -198 -70 91
4012 91 -243 35 -58 2 58 -146 -47 -334 -126 125 17 -98 106 37 -36 -139 65 -55 -27 -170 -137 110 -25
4035 -25 401 -86 124 -55 -257 145 106 -93 102 106 -62 93 145 231 137 -226 141 -66 123 -63 96 29 -242
4058 -242 -33 -44 -37 18 57 -40 -145 46 -14 -134 -232 -50 245 210 -20 -34 -193 140 -41 48 161 -40 -97 -24
4082 -24 36 -12 21 -83 -340 -181 -104 -35 -181 -3 11 31 -10 221 107 96 109 156 -35 72 145 -208 15 -54 207
4107 207 -310 92 107 95 -151 26 124 128 -185 140 -82 80 -46 234 34 -94 -55 -34 21 196 214 -83 142
$$ packed form
3942c5J15J5j37j04J53R5N3k38J13l1o3j7K48j27j23J88k13nJ04P0m4j48J87l85
3966c29J63l5J85J1j66p2L19J43k96J49k08%J37M00j31k29l37J00K68K4l95K89
3988a0J0j06J10K45l38Q4O8j50Q0K18j4n48L56j7J16j33l3O5N7k34R1j15J28J61
4012I1l34K78r3O0N6k04R9k87K08K51j08j15K04o9p3j03K04j20K8j43L3K47j35
4035b5M26m87K10j79k02M02l9j99J95Mj68J55N2Q6r4l63L67k07J89j86J59o7k71
4058b42K09j1PN5L9r7j05J91o0j20r8J82K95l5k30j4j59L33j81Q9J13k01n7P3
4082b4O0m8L3j04k57J59P7O9j46J78J4K0m1K31j14j1J3M7j91J07P3l53K23o9K61
4107B07n17M02J5j2k46J77R8Ml13L25k22J62j26K80k00j28L9K1N5J75J8k97K25
$$ plain form
4130 142 -3 -149 198 -44 387 -37 -244 -39 255 -81 125 53 116 52 -300 -64 -15 -160 -172 108 -217 -168
4152 -168 5 123 59 12 131 189 -181 277 -75 -348 -197 107 -327 38 -30 -100 89 -84 162 -18 151 -210
4174 -210 -150 390 294 -201 -304 -216 -61 19 -55 140 -57 -268 318 -30 -149 232 155 -215 -64 -19 -164 246
4196 246 -351 94 -184 -83 -32 -52 -79 24 -161 -16 148 73 101 55 -157 -165 2 172 -197 -395 119 26 -3
4219 -3 133 -58 220 -149 -220 -168 60 11 136 9 -20 -131 65 238 156 -169 -119 124 -19 -39 19 97 -245 96
4243 96 238 203 83 -223 88 87 239 33 214 -139 -227 162 121 16 197 -156 -51 85 -2 -146 -178 -45 -136
4266 -136 -252 56 51 7 14 43 -133 439 138 102 -15 -103 -152 -103 55 8 -286 76 112 177 215 444 245 -155 123
4291 123 -279 16 30 67 -50 22 -217 -39 205 127 41 19 -154 246 11 92 -7 17 53 -26 79 -150 -65 147
$$ packed form
4130A42j45j46L47k42M31m24k07K05K94l36K06p2O3o4l52K36M9j45j2K80l25M9
4152a68J73J18o4m7J19N8l70M58l52k73J51L04m34L65o8p0J89j73K46j80J69l61
4174b10O0N40r6m95j03Q8J55Q0p4J95j97k11N86l48j19L81p7l70J51M5j45M10
4196B46n97M45k78J01N1k0k7J03j85J45J64p5K8m6k12qJ67J70l69j98N14r3k9
4219cJ36j91K78l69p1N2K28m9J25j27k9j11J96J73q2l25N0K43j43k0N8P8l42L41
4243I6J42l5j20l06L11jJ52k06J81l53q8L89m1j05J81l53J05J36q7j44l2J33r1
4266a36j16L08nm4PK9j76N72l01l6j17q8m9M9J58m7k94L62L6O5L8K29j99m00K78
4291A23m02K95J4L7j17P2k39J78K44p8q6k2j73M00k35Q1r9K4L6p9J05k29Q5K12
$$ plain form
4315 147 -71 -114 18 137 121 230 -148 -36 -105 300 187 79 -39 -201 -187 -198 -123 -50 -105 77 71 -323 205
4338 205 153 -191 -184 -231 140 63 -134 -177 43 -69 -127 91 -90 -127 8 -113 128 -171 -18 -21 97 -124 -11
4361 -11 168 133 -303 0 -117 82 -91 132 341 -214 82 -141 130 12 23 -253 146 13 96 129 73 -55
4383 -55 -220 -142 -146 6 -32 -53 29 86 66 -21 -101 -73 -110 155 48 175 116 -37 53 -153 131 -53 278 -54 118
4408 118 -63 -175 14 -84 -8 -45 -292 3 153 141 4 -90 -209 -177 164 260 173 -112 -155 11 37 276 177 135
4432 135 -36 -117 -43 -28 -38 58 173 112 75 -38 265 18 -214 -86 -202 -59 48 -50 9 51 101 65 198 -57
4456 -57 -122 100 176 -102 -143 97 -32 -211 160 233 490 18 -35 -132 -127 136 -147 89 -120 -55 3 -62 402 156
4480 156 227 -105 -18 125 -100 -260 211 -138 -172 -35 212 113 -193 -185 34 127 -9 99 -96 -47 -71 143 213
$$ packed form
4315A47k18m3J32J19j6J09l78J12o9M05j13j08j18j62J4j1P5P3n5J82ol94N28
4338B05n2l44Pm7L71p7j97m3K20j12n8K18j81l7J35j21K41k99J53lJ18k21J13
4361a1J79l5m36L03j17J99j73K23K09n55K96k23K71j18J1k76L99j33Q3L3n6j28
4383e5j65P8mJ52l8k1Q2N7k0q7q0K8l7K65j07J27n9j53R0k06K84j84L31l32J72
4408A18j81j12J89r8P6l7k47K95J50j2j37r4j19L2L41R6q7k85m3J66K6K39r9m2
4432A35j71q1P4J5j0R6J15o1l7j13L03k47k32J28j16J43J07r8N9M2N0l6J33k55
4456e7o5K22P6k78m1K40j29j79L71P3K57m72n3r7NK63k83K36k09O5N8o5M64k46
4480A56P1l32Q7J43k25j60M71l49l4J37K47r9l06QK19R3j36J08j95M9k4K14P0
$$ plain form
4503 213 103 235 35 -281 -91 122 13 -31 -199 -171 -130 92 24 126 -105 -259 -101 97 -63 -42 7 -155
4525 -155 -203 191 80 20 114 9 -287 -172 86 -193 -145 -33 -206 -27 -122 34 -27 62 -137 326 42 -188
4547 -188 163 -24 150 81 136 218 9 21 73 121 208 22 -100 -35 -33 -89 74 71 166 -388 -367 63 -122 189 104
4572 104 13 -3 10 126 -112 -23 85 0 -258 -17 -80 202 160 -124 -132 -184 -28 -62 -130 29 27 46 185 -66 -9
4597 -9 -130 -26 177 -97 209 -34 74 218 -177 -73 -230 62 -440 -439 270 69 33 56 -84 -122 -177 -11 187
4620 187 183 -194 119 9 -115 -22 -51 -136 -116 -31 -67 -103 -11 -121 -133 -91 -117 -280 -62 -124 -173 -187 16 3 -60 55
4646 55 -64 28 -64 119 61 25 1 92 -16 -89 -68 192 379 28 115 -53 171 94 -173 -391 -161 -202 155 302
4670 302 -69 62 308 -11 68 5 -64 -84 154 260 -41 319 178 -63 311 -116 281 -120 -56 -108 -103 14 76
$$ packed form
4503B13j10J32k00l16J90K13j09m4j68K8M1K22o8J02k31j54J58J98j60K1M9j62
4525a55m8L94j11o0R4j05k96J15K58k79M8J12j73J79r5J56o1Q9j99M63k84k30
4547a88L51j87J74o9N5Q2k09J2N2M8Q7j86j22O5Kn6J63lR5n54K1M30j85L11q5
4572A04r1j6J3J16k38Q9J08q5k58K41o3K82m2k84qn2J56l4o8J59kJ9J39k51N7
4597ij21J04K03k74L06k43J08J44l95J04j57K92n02JP09k01l6K3j40l8n5J66J98
4620A87ml77L13j10j24R3k9q5K0Q5l6l6R2j10j2M2k6j63K18o2m9j4K03j3o3J15
4646E5j19R2r2J83n8l6k4R1j08p3K1K60J87l51Q7j68K24p7k67k18K30m1L57J47
4670C02l71J31K46l19P9o3o9k0K38J06l01L60j41k41L74m27L97m01O4n2NJ17O2
$$ plain form
4693 76 -97 102 120 -225 97 118 69 -71 -55 157 79 78 64 31 59 -96 -230 -39 -20 135 -139 10 -190 207
4717 207 -5 126 -116 -194 -134 -326 155 267 -185 166 142 -16 -155 329 89 -165 -50 106 -24 -92 170
4738 170 -18 -27 163 182 132 256 -132 236 105 -232 30 37 -19 -79 -122 118 -34 99 -251 -98 -172 -254 134 -92
4762 -92 101 -193 -384 -153 -6 163 -151 67 -102 -56 117 -66 -57 52 -146 -161 -80 -14 17 2 -60 95 -21
4785 -21 117 231 55 -157 -36 40 203 -4 -116 85 116 -283 217 209 -410 129 -152 226 140 156 -40 218
4807 218 97 245 -82 140 293 -134 -66 42 -34 -79 -103 283 -124 -181 39 -94 -55 -32 -44 103 108 300 240 42
4831 42 -141 -196 -41 -106 30 108 -168 35 -174 -45 237 3 83 -4 -80 240 -29 5 -110 -40 -156 -9 78
4854 78 -49 67 -38 -90 -51 -7 134 -210 -342 -200 -72 83 123 -134 10 29 -36 20 270 -84 -212 -153 -258
$$ packed form
4693G6j73J99J8l45L22K1m9j40J6K12p8jj4l3K8j55j34J91J9J55k74J49k00L97
4717B07k12J31k42p8O0j92M81J12m52L51k4j58j39M84k40k54J15J56j30o8K62
4738A70j88rJ90J9n0J24l88L68j31l37K62Pn6o0m3K40j52J33l50J53p4q2L88k26
4762i2J93k94j91K31J47J69l14K18j69M6J73j83RJ09j98j5Q1O6L1j5o2J55j16
4785b1J38J14j76k12J21P6J63k07j12K01L1l99N00qo19N39k81L78q6J6j96K58
4807B18j21J48l27K22J53m27O8J08p6m5k4L86m07n7K20j33L9K3j2J47NJ92o0j98
4831D2j83n5J55o5J36P8k76K03k09J29K82k34Q0q7p6L20k69L4j15P0j16J47Q7
4854G8j27J16j05n2L9M4J41l44j32J42J28J55M0k57J44J9o5N6K50l54j28N9j05
$$ plain form
4877 -258 52 -121 17 99 -84 -175 131 -177 -15 -56 -62 227 39 90 -201 90 -69 341 -93 265 -69 149
4899 149 -46 -11 16 157 -47 -217 -66 -198 -143 147 121 211 -151 -160 -6 23 316 -89 148 -197 68 -4 194
4922 194 -147 -46 -46 -64 33 -112 224 -105 -128 74 -21 53 142 77 -304 117 -197 369 256 68 116 -14 47 72
4946 72 186 -140 -271 -224 180 188 180 -15 5 13 -161 434 -59 -17 -114 -209 -103 92 342 144 61 177 24 71 -79
4971 -79 194 -30 102 -155 -56 43 3 156 177 29 127 36 -66 -78 -118 -86 -147 147 102 22 -192 20 42 204 285
4996 285 -225 -178 27 42 -121 175 205 142 37 76 -58 -57 -150 -253 -145 41 429 -58 366 -175 43 -167 86
5019 86 -40 -63 22 65 218 -26 -2 159 -49 -264 -177 -64 156 94 -55 6 -157 10 -80 -33 311 35 -155
5042 -155 96 -113 105 155 -172 -171 25 -15 -45 268 95 -127 -22 40 -10 137 84 92 31 -68 143 -21 25 -125
$$ packed form
4877b58L10j73J38Q2j83r1L06l08J62m1oK89j88N1k91K91j59M10m34L58l34K18
4899A49j95L5K7J41k04j70J51j32N5K90k6R0l62rJ54K9K93m05K37l45K65p2J98
4922A94l41J01%j8R7j45L36l29k3K02r5P4Q9o5l81M21l14N66j13j88M8j30O1K5
4946G2J14l26j31M7M04Qqj95K0Qj74N95m93M2r7r5J06J95K50j98q3J16j53M7j50
4971g9K73k24J32k57R9R9m0J53K1j48R8r1j02j2m0L2o1K94m5q0k14K12K2J62Q1
4996B85n10M7K05J5j63K96L0o3j05L9j34Jr3j03J08J86L88m87M24n41K18k10K53
5019H6j26k3Q5M3J53k44K4J61k08k15Q7J13K20o2j49O1j63J67r0M7L44k76j90
5042a55K51k09K18N0l27JJ96m0l0L13j73k22J05O2n0J47n3Qo1r9K11j64M6j50
$$ plain form
5066 -125 82 12 -154 53 130 190 5 62 -143 68 -100 -58 -95 162 286 124 301 -231 -223 39 -13 -125 262
5089 262 -13 -139 -167 73 123 91 -95 -236 -159 29 151 -166 -253 11 -86 64 -92 -82 64 9 -161 -181 333
5112 333 -180 -322 102 147 -308 157 -26 -105 -242 -430 226 -240 125 118 63 99 19 136 71 42 -17 236 155 170
5136 170 17 59 146 232 -16 -109 -33 -53 -63 25 -16 -52 -140 -30 -70 -20 -73 -71 10 -49 236 -27 -3 -130 -4 -31 -62
5163 -62 -93 -34 135 -31 139 110 -150 9 141 207 -66 196 -34 -81 -171 235 69 16 45 113 124 -75 38 162
5187 162 -118 -335 -89 -320 196 -7 254 31 -94 -292 129 68 -98 167 -175 -147 20 169 -158 -33 152
5208 152 47 49 10 -209 133 -247 -76 -188 -114 52 37 -219 -51 39 -22 16 345 -14 -50 -49 -124 119 130 272
5232 272 -6 10 -94 198 -58 -206 90 241 -132 265 -258 291 -215 21 -117 39 285 -47 330 135
$$ packed form
5066a25K07p0j66K07P7O0j85N7k05K11j68M2l7K57J24j62J77n32QK62n2j12L87
5089B62k75j26k8K40N0l2j86j41P7J88J22l17q7K64r7J50j56J0J46n5j70k0N14
5112C33n13j42M24M5m55M65j83p9j37j88O56m66L65pn5L6q0J17o5k9n9K53q1J5
5136A70j53M2Q7Q6k48r3P6k0j0Q8m1l6q8J10m0N0n3KQ1n9K85k63K4j27J26k7l1
5163f2l1N9J69j66J70k9k60J59J32O6k73K62k30m7r0M06j66n3K9O8J1j99J13J24
5187A62k80k17K46k31N16k03K61k23j25j98M21o1j66K65l42K8J67J49l27J25J85
5208A52j05Kl9k19L42l80J71j12P4J66j5k56J68R0o1L8L29l59l6Jp5K43J1J42
5232B72k78J6j04K92k56j48K96J51l73L97n23N49n06K36j38J56K46l32L77j95
$$ plain form
5252 135 40 -9 158 98 -129 101 -43 186 175 279 119 -89 43 27 -42 -22 17 -72 -22 218 -28 60 -84 148
5276 148 -158 197 -9 -44 -18 -18 152 -58 -235 -255 111 -191 -31 32 243 -245 -56 -27 -103 -277 78 94 -53
5299 -53 52 74 -71 -83 -22 -26 -6 -142 -37 27 121 -37 -156 -140 72 -119 -32 -49 48 -24 22 -110 9 61 244
5324 244 48 -234 42 136 96 -21 -32 264 -9 -49 126 -3 164 -253 105 -53 110 220 -60 8 -92 -188
5346 -188 -119 124 189 -8 36 -199 152 -92 8 -125 -17 108 182 81 339 155 -65 97 4 -108 -48 -302
5368 -302 -59 6 -53 193 51 -113 -74 -131 237 179 244 -22 -14 -135 -9 165 -13 389 -176 97 -8 116 298
5391 298 -139 -307 -15 120 99 -198 22 -63 -337 -29 54 -1 -31 -180 -25 77 9 209 -225 -26 -254 20
5413 20 -117 125 9 -107 -213 -70 13 89 152 -4 158 -64 54 160 -167 92 -28 -63 358 -210 41 -45
$$ packed form
5252A35r5m9J67o0k27K30j44K29j1J04j60k08J32j6o9K0L9q9N0K40k46Q8j44K32
5276A48l06L55k06l5K6%J70k10j77k0L66l02J60O3K11m88J89K9p6j74L55J6j47
5299e3J05K2j45j2O1mK0j36J05O4R4j58j19J6K12j91Q7j7R7p2M6j32J19N2J83
5324B44j96k82K76R4m0j17j1K96k73m0J75j29J67m17L58j58J63J10k80O8j00r6
5346a88O9K43O5j97M4k35L51k44J00j33J08J25P4j01K58j84k20J62r3j12O0k54
5368c02K43O5n9K46j42j64L9n7L68n8O5k66Qj21J26J74j78M02n65K73j05J24J82
5391B98m37j68K92J35k1k97K20q5k74L08Q3n5l0j49J55J02o8K00m34J99k28K74
5413B0j37K42j16j16j06J43Q3P6O3j56J62k22J18J06l27K59j20l5M21n68K51q6
$$ plain form
5435 -45 224 -37 -206 109 -25 -321 -173 -73 -236 59 75 311 47 63 -165 241 52 31 94 -26 49 115
5457 115 -246 169 -67 -149 -361 -76 39 74 247 -97 202 95 310 280 0 -149 -151 -16 -28 203 23 -23
5479 -23 16 60 -180 90 218 67 41 95 152 32 -29 -177 143 163 -145 -48 -33 -252 -245 89 47 -27 114 -269 -149
5504 -149 -128 -237 52 273 286 363 -135 99 131 115 -188 -38 131 66 76 52 -24 -284 131 209 -26 -135 11
5527 11 -334 73 59 -330 19 71 -237 67 -198 -147 187 -14 68 -189 -78 97 -3 35 130 62 -68 -127 202
5550 202 -66 -203 113 -71 26 309 78 158 46 154 2 82 -1 -32 -39 -87 247 -11 90 71 -74 131 73
5573 73 207 276 103 119 -40 -171 -15 92 309 117 26 -241 -105 -6 306 -28 -182 91 126 -22 -46 -175
5595 -175 302 -234 54 62 236 -82 -11 246 185 85 13 -135 -138 55 11 18 -192 -122 -28 54 184 -1 43 -143 40
$$ packed form
5435d5K69k61j69L15j34k96J48J00j63K95J6K36k64J6k28M06j89k1O3j20P5O6
5457A15l61M15k36q2k12K85J15L5J73l44K99j07K15l0k80j49kJ35j2K31j80m6
5479b3L9M4k40K70J28j51k6N4N7j20o1j48L20K0l08R7J5k19PL34m2p4J41l83J20
5504a49K1j09K89K21J3P7m98K34L2j6l03J50J69o5J0k4p6k60M15P8k35j09J46
5527A1l45M07j4l89L49N2l08L04k65N1L34k01Q2k57J11J75j00L8R5o8j30n9L29
5550B02k68j37L16j84R7K83k31Q0j12J08j52Q0q3l1pm8L34k58J01j9j45K05n8
5573G3J34O9j73J6j59j31J56J07K17j92r1k67J36R9L12l34j54K73L5j48k4j29
5595a75M77n36K88QJ74l18P1K57o1j00p2j48lJ93m4Pk10P0R4Q2J30j85M4j86J83
$$ plain form
5620 40 97 -144 236 -33 120 108 -107 -99 -136 257 78 -12 96 63 -202 -91 89 -115 186 243 119 -201 316
5643 316 -36 -169 73 -11 -203 113 -34 -121 -8 -387 254 271 -81 -158 -15 -117 26 -171 -221 223 -132 167
5665 167 99 12 75 104 59 -116 -137 -139 -270 -210 -62 171 -20 -50 -49 -90 -62 152 74 54 136 -40 -172 185 -58 158
5691 158 -113 11 78 -134 298 -39 -272 -21 -81 -69 -8 86 -198 -80 146 -103 -124 246 129 194 21 -114
5713 -114 52 -216 0 -86 33 73 -207 111 398 170 70 -25 25 156 -244 65 85 -30 -122 -9 57 -27 71
5736 71 -160 -92 219 -171 84 41 99 -57 48 75 32 77 74 3 232 40 -106 -209 -193 18 26 -4 66 254 -426
5761 -426 181 -40 -100 -198 9 -55 44 -135 -261 180 -207 233 -232 -26 -195 47 -22 -91 88 -2 28 22 32 -72
5785 -72 -94 248 -57 265 147 -20 -54 -160 -49 91 77 -7 78 14 171 -199 2 -149 11 63 -102 -223 60
$$ packed form
5620D0N7k41L80k69J53j2k15Ql7L93j79r0J08l3k65J11J80k04L01N7j24l20N17
5643C16l52j33K42q4j92L16j47q7J13l79O41J7l52p7J43j02J43j97n0M44l55K99
5665A67o8q7O3K9m5j75k1kj31O0J48K33j91l0Jm1K8K14p8k0Q2j76j32L57k43K16
5691A58k71J24O7k12M32l37k33K51o0J2O1R4k84J18K26k49k1L70j17O5j73j35
5713a14J66k68K16q6J19M0k80L18K87k28j00r5N0J31m00L09K0j15r2J13O6q4R8
5736G1k31O8L11l90K55m3N8j56J05K7m3M5lp1K29j92j46j03J6K11Ql0P0J88o80
5761d26O07k21o0r8K07o4R9j79j26M41l87M40m65K06j69K42o9o9J79r0L0oJ0j04
5785g2k2L42l05L22j18j67l4j06J11J40j4q4Q5o4J57l70K01j51J60N2j65j21K83
$$ [...]
8191E9
##END NTUPLES=NMR FID
##END=
