##TITLE=1H_DE-60_EA_d6.T
 DMSO-d6
 8 sc, 
 3.7.2024
##JCAMPDX= 6.0         $$ Bruker NMR JCAMP-DX V2.0
##DATA TYPE= NMR FID
##DATA CLASS= NTUPLES
##ORIGIN= UXNMR, Bruker Analytische Messtechnik GmbH
##OWNER= root
$$ XWIN-NMR		Version 3.5
$$ Wed Jul  3 15:17:46 2024 Russian Standard Time (UT+4h)  she@DPX200
##.OBSERVE FREQUENCY= 200.1314
##.OBSERVE NUCLEUS= ^1H
##.DELAY= (6, 6)
##.ACQUISITION MODE= SIMULTANEOUS
##.ACQUISITION SCHEME= undefined
##.AVERAGES= 8
##.DIGITISER RES= 18
##SPECTROMETER/DATA SYSTEM= spect
##.PULSE SEQUENCE= zg30
##.SOLVENT NAME= DMSO
##.SHIFT REFERENCE= (INTERNAL, DMSO, 0, 15.7039)
##AUDIT TRAIL= $$ (NUMBER, WHEN, WHO, WHERE, WHAT)
$$ ##TITLE= Audit trail, XWIN-NMR		Version 3.5
$$ ##JCAMPDX= 5.01
$$ ##ORIGIN= Bruker BioSpin GmbH
$$ ##OWNER= she
$$ F:/spectra/data/she/nmr/H-F/1/audita.txt
$$ ##AUDIT TRAIL=  $$ (NUMBER, WHEN, WHO, WHERE, WHAT)
(   1,<2024-07-03 15:16:46.67 +0400>,<she>,<DPX200>,
      <created by zg, POWCHK disabled, PULCHK disabled
       configuration hash MD5:
       00 E9 B6 7A A2 85 ED C7 34 08 36 98 17 FE 4E 26
       data hash MD5: 16K
       66 18 E8 DC E3 70 5B D9 29 D9 8F 82 31 F2 04 71>)
$$ ##END=
$$ 
$$ hash MD5
$$ BB 29 31 3D D8 5F 5B 22 07 4B 6E CB A9 75 50 17
##$RELAX= 
##$RELAX= 
##$RELAX= 
##$RELAX= 
##$RELAX= 
##$RELAX= 
$$ Bruker specific parameters
$$ --------------------------
##$DU= <F:/spectra>
##$EXPNO= 1
##$NAME= <H-F>
##$PROCNO= 1
##$TYPE= <nmr>
##$USER= <she>
##$AMP= (0..31)
100 100 100 100 100 100 100 100 100 100 100 100 100 100 100 100 100 100 
100 100 100 100 100 100 100 100 100 100 100 100 100 100 
##$AQSEQ= 0
##$AQ_mod= 1
##$AUNM= <au_zg>
##$AUTOPOS= <>
##$BF1= 200.13
##$BF2= 200.13
##$BF3= 200.13
##$BF4= 200.13
##$BF5= 200.13
##$BF6= 200.13
##$BF7= 200.13
##$BF8= 200.13
##$BYTORDA= 1
##$CFDGTYP= 0
##$CFRGTYP= 5
##$CHEMSTR= <none>
##$CNST= (0..31)
1 1 145 1 1 1 1 1 1 1 1 1 1 1 1 1 1 1 1 1 1 1 1 1 1 1 1 1 1 1 1 1 
##$CPDPRG= <>
##$CPDPRG1= <>
##$CPDPRG2= <>
##$CPDPRG3= <>
##$CPDPRG4= <mlev>
##$CPDPRG5= <mlev>
##$CPDPRG6= <mlev>
##$CPDPRG7= <mlev>
##$CPDPRG8= <mlev>
##$CPDPRGB= <>
##$CPDPRGT= <>
##$D= (0..31)
0 1.2 0 0 0 0 0 0 0 0.06 0 0.03 0 0 0 0 0.0002 0 0 0 0 0 0 0 0 0 0 0 0 
0 0 0 
##$DATE= 1720005406
##$DBL= (0..7)
120 120 120 120 120 120 120 120 
##$DBP= (0..7)
150 150 150 150 150 150 150 150 
##$DBP07= 0
##$DBPNAM0= <>
##$DBPNAM1= <>
##$DBPNAM2= <>
##$DBPNAM3= <>
##$DBPNAM4= <>
##$DBPNAM5= <>
##$DBPNAM6= <>
##$DBPNAM7= <>
##$DBPOAL= (0..7)
0.5 0.5 0.5 0.5 0.5 0.5 0.5 0.5 
##$DBPOFFS= (0..7)
0 0 0 0 0 0 0 0 
##$DE= 6
##$DECBNUC= <off>
##$DECIM= 24
##$DECNUC= <off>
##$DECSTAT= 4
##$DIGMOD= 1
##$DIGTYP= 9
##$DL= (0..7)
0 120 120 120 120 120 120 120 
##$DP= (0..7)
150 150 150 150 150 150 150 150 
##$DP07= 0
##$DPNAME0= <>
##$DPNAME1= <>
##$DPNAME2= <>
##$DPNAME3= <>
##$DPNAME4= <>
##$DPNAME5= <>
##$DPNAME6= <>
##$DPNAME7= <>
##$DPOAL= (0..7)
0.5 0.5 0.5 0.5 0.5 0.5 0.5 0.5 
##$DPOFFS= (0..7)
0 0 0 0 0 0 0 0 
##$DQDMODE= 0
##$DR= 18
##$DS= 0
##$DSLIST= <SSSSSSSSSSSSSSS>
$$ [...]
##$SUBNAM2= <"">
##$SUBNAM3= <"">
##$SUBNAM4= <"">
##$SUBNAM5= <"">
##$SUBNAM6= <"">
##$SUBNAM7= <"">
##$SUBNAM8= <"">
##$SUBNAM9= <"">
##$SW= 24.0689651099613
##$SWIBOX= (0..15)
0 0 2 0 0 0 0 0 0 0 0 0 0 0 0 0 
##$SW_h= 4816.95568400771
##$TD= 16384
##$TD0= 1
##$TE= 0
##$TE2= 300
##$TE3= 300
##$TEG= 300
##$TL= (0..7)
0 120 120 120 120 120 120 120 
##$TP= (0..7)
150 150 150 150 150 150 150 150 
##$TP07= 0
##$TPNAME0= <>
##$TPNAME1= <>
##$TPNAME2= <>
##$TPNAME3= <>
##$TPNAME4= <>
##$TPNAME5= <>
##$TPNAME6= <>
##$TPNAME7= <>
##$TPOAL= (0..7)
0.5 0.5 0.5 0.5 0.5 0.5 0.5 0.5 
##$TPOFFS= (0..7)
0 0 0 0 0 0 0 0 
##$TUNHIN= 0
##$TUNHOUT= 0
##$TUNXOUT= 0
##$USERA1= <user>
##$USERA2= <user>
##$USERA3= <user>
##$USERA4= <user>
##$USERA5= <user>
##$V9= 5
##$VALIST= <valist>
##$VCLIST= <CCCCCCCCCCCCCCC>
##$VD= 0
##$VDLIST= <DDDDDDDDDDDDDDD>
##$VPLIST= <PPPPPPPPPPPPPPP>
##$VTLIST= <TTTTTTTTTTTTTTT>
##$WBST= 1024
##$WBSW= 4
##$XGAIN= (0..3)
0 0 0 0 
##$XL= 0
##$YL= 0
##$YMAX_a= 160895
##$YMIN_a= -199801
##$ZGOPTNS= <>
##$ZL1= 120
##$ZL2= 120
##$ZL3= 120
##$ZL4= 120
##$ABSF1= 10
##$ABSF2= 0
##$ABSG= 5
##$ABSL= 3
##$ALPHA= 0
##$AQORDER= 0
##$ASSFAC= 0
##$ASSFACI= 0
##$ASSFACX= 0
##$ASSWID= 0
##$AUNMP= <proc_1d>
##$AZFE= 0.1
##$AZFW= 0.1
##$BCFW= 1
##$BC_mod= 2
##$BYTORDP= 1
##$COROFFS= 0
##$CY= 11.3945322036743
##$DATMOD= 1
##$DC= 2
##$DFILT= <>
##$DTYPP= 0
##$F1P= 15.6554695791079
##$F2P= 12.8336369535428
##$FCOR= 0.5
##$FTSIZE= 0
##$FT_mod= 4
##$GAMMA= 1
##$GB= 0.15
##$INTBC= 1
##$INTSCL= 1
##$ISEN= 128
##$LB= 0.24
##$LEV0= 0
##$LPBIN= 0
##$MAXI= 10000
##$MC2= 0
##$MEAN= 0
##$ME_mod= 0
##$MI= 1.114404
##$NCOEF= 0
##$NC_proc= 0
##$NLEV= 6
##$NOISF1= 3.799351
##$NOISF2= 2.8
##$NSP= 1
##$NTH_PI= 0
##$NZP= 0
##$OFFSET= 15.70392
##$PC= 1
##$PHC0= -25501.26
##$PHC1= 4.787481
##$PH_mod= 1
##$PKNL= yes
##$PPARMOD= 0
##$PSCAL= 0
##$PSIGN= 0
##$REVERSE= no
##$SF= 200.130013532006
##$SI= 16384
##$SIGF1= 3
##$SIGF2= 2
##$SINO= 400
##$SIOLD= 16384
##$SREGLST= <1H.CDCl3>
##$SSB= 0
##$STSI= 0
##$STSR= 0
##$SW_p= 3612.71676300578
##$SYMM= 0
##$S_DEV= 0
##$TDeff= 0
##$TDoff= 0
##$TI= <>
##$TILT= no
##$TM1= 0
##$TM2= 0
##$TOPLEV= 0
##$USERP1= <user>
##$USERP2= <user>
##$USERP3= <user>
##$USERP4= <user>
##$USERP5= <user>
##$WDW= 1
##$XDIM= 8192
##$YMAX_p= 0
##$YMIN_p= 0
$$ End of Bruker specific parameters
$$ ---------------------------------
##NTUPLES= NMR FID
##VAR_NAME=  TIME,          FID/REAL,        FID/IMAG
##SYMBOL=    X,             R,               I
##VAR_TYPE=  INDEPENDENT,   DEPENDENT,       DEPENDENT
##VAR_FORM=  AFFN,          ASDF,            ASDF
##VAR_DIM=   8192,          8192,            8192
##UNITS=     SECONDS,       ARBITRARY UNITS, ARBITRARY UNITS
##FACTOR=    0.0002076,     1,               1
##FIRST=     0,             0,               0
##LAST=      1.7004516,     0,               0
##MIN=       0,             -199801,         0
##MAX=       1.7004516,     160895,          0
$$ Real data points
##PAGE= N=1
##DATA TABLE= (X++(R..R)), XYDATA
$$ [...]
1922b12J26J93k47L87k17K4o2oRj8nq8k5m7K6J70R6L8m37K79K61n14K31p3K32
1947A21Q3j44L26l18j8j18J62l12K25L03o48M84l18K90j18N9m4L0k2N9m36K88
1969f6O5K2o6j18J8K19k27J50k10O8K78k19n8K6M3j14L51k08L01j96j84J26k36
1992b35K96o6Q6j40n38O84j44J69Pk50j82J66K50l06L08O2l74J54p5j32K45L4
2014A9k21M45k28k5l1l0K8j36Q6K80j8r1P1j65m4L2p8K12J60m82J86Pl9J01k35
2039a96K31K84o04M15j40m08K76j47J76K94j53k45J96qo8K26j08L23l65m3k21
2060b85L96j38j02J80m7l7k93K75k56L68j32M2O4J34k61J83o2N4o6K11l03J78
2082A03j13N5J24k04L25n34L2L32k28l3K22k80KJ74K13%k49j26J16J99k47l20
$$ y = [-212, -86, 107, -140, 247, 30, 54, -8, -14, -5, -23, -28, -116, -141, -188, -162, 8, 104, 142, -295, -16, 245, -269, -38, -111, 121, 204, 60, 386, 68, 50, -68, 94, -218, 7, 310, -338, 146, -172, 118, 0, 59, 15, 45, 23, 82, -354, -66, -1, 21, -45, -163, -145, 74, -153, -3, -213, -145, 133, -86, -144, -118, -75, -189, 162, -46, 255, 59, -125, 1, -235, 61, -5, 81, -59, -597, 87, -57, 112, 119, -131, -313, -147, 103, -203, 105, 167, -207, -53, -128, -260, -15, 19, -202, 243, 15, -10, -41, -71, -43, -179, -93, 187, 169, 78, 149, -16, -60, -28, -106, 106, 266, -216, -30, -23, -62, 39, -196, 35, 319, -285, 130, -10, -418, -142, -289, -113, 181, 28, -217, -21, -29, -97, 129, 21, 344, -21, -64, -285, 111, -27, -129, 51, 4, -33, -326, -51, -307, 61, -71, -29, 35, 169, -92, 91, 29, 83, 17, 228, -75, 103, -10, 45, 169, -35, 290, -244, -212, 120, -108, -141, 81, -199, -197, -23, 190, 190, -59, -185, -69, 130, -117, -437]
2104d37M18L28l03j97K54k65J0o7L43J32j76p8R9j90J27J90k36L41k81k52J59
2125h1J35K7k42J54lj13k01L13M9N3j89R3m2J78l48J17N3M16l82Q6k29j60K38
2148g8M0J5J5j77K34k12J15k33J05K77q8j74L62k38K26k90K17j74J1K24m08J83
2170d8O0j59J0L0O1P9j00m0J45O1L1j23q1J88q0Q4l9k72L13L3Rk49J40Kl40J99
2196h6j2J52M1r8J70m53L93J5k89L0J56Mj05J60j97q4K91k14K98k35k17J90k09
2219b99r7K55M17k38Q8k75M1J69P3o6k17J31M11l68k29J06N7j87L80J82m36l00
2241d02N0L26K43j93j67J01M7K07j13j4M9l33L47l04J12p7L18j5j67jj7j20K29
2264A06k71P3j1J8L50n42J67J60k33Q9l4O3j11P7J11Mk34K08j82J80m8j5j96J92
$$ y = [-437, -19, 309, 6, -191, 63, -202, -192, -259, 84, 216, 40, -38, 61, -129, -2, 188, -48, 293, 12, -240, -81, 54, 81, -161, -7, -10, -123, -324, -11, 38, 91, -98, -5, -47, 131, -217, -100, -47, 369, -13, 73, -156, -316, -78, -38, -23, -8, -185, 49, -163, -48, -281, -176, 101, 13, -161, 201, -37, 189, -101, 116, -58, -47, 177, -231, -48, 12, -147, -137, -107, -46, 33, -67, -107, 38, 99, 130, 7, -74, 114, 34, 118, 79, -193, 120, 153, 162, -87, 53, 55, -285, -86, -98, 54, 95, -3, 167, -286, 107, 122, -167, -137, 19, 23, -82, 78, -119, -203, 88, -126, 172, -63, -280, -90, -299, -396, -141, 276, 38, 126, -149, -108, 61, 134, 68, -149, -18, 393, 25, -204, -98, -41, -228, 152, 334, -102, -402, -352, -26, 217, 24, -143, -42, 5, 212, 99, 85, 134, -199, 148, -156, -44, -121, 197, 182, 15, 14, -3, -123, 106, -165, -92, -103, -85, 265, -277, -110, 50, -183, -94, -128, -65, -176, -99, 12, 16, -218, -10, -192, -12, -60, -75, -271, -79]
2288g9K6K45j26m02N05J34j36k70N4K60j73l0j7K13l57O0L30k97m6P9jj43L07
2311A36O3l23J43q3j6M7OM2k01J48K53p0k47J40m57M32L8M7j77J29l08M72Jk61
2335d6J40l7M5K1j85j57L31o0j97L15J78n44P8j65R1N6J65O0k78J43m0L12j00
2358A26r6O7j40j51J41J7r1J40l03R1L78L1j57pj6j09J80k02K49l76J99o1j2K69
2382A67j75K98k67R3n3J91j08k45O3K48o22O21L0m02J46J03k6l09J18j76L50l16
2404b71L64q0K12l68J63J70l30M83l21k0PK5j77J8l5P7J9K02j25RQ1k02K53O3
2428B17m51M96k57N0J34j22K01j36j86L1r8K90j85j16R9J05K52l09qj62O6P5N2
2451C8Q9j1k63k5K40j28K77m81K74LJ1q5J55J42r3j88o5K82J88l86k1J3j96J74
$$ y = [-79, -53, 192, 66, -336, 169, 303, 167, -103, -49, 211, 38, 8, -9, 204, -153, -93, 237, -60, -106, -27, -28, -171, 136, 199, -124, 19, -64, -80, -33, -27, 15, -186, -38, 215, 145, -102, 38, -419, 13, 51, 98, -79, 50, -258, 214, 215, -46, 94, 57, 102, 123, -62, -219, 112, 52, -145, 170, 348, -196, -118, -283, -192, -136, 29, 89, -189, -46, -86, 226, 126, 30, 97, -43, -194, -53, -36, -127, 13, -290, -199, 179, 210, 53, 46, 30, -79, 101, -101, 148, -228, -29, -90, -102, 167, -8, 290, 23, 116, 63, 254, 146, -99, -36, 212, -410, 211, 241, -161, -15, 88, 62, -247, -129, -305, 45, -271, 93, 13, 225, -143, 20, 190, -140, 343, 22, 2, 9, 34, -143, -125, -160, -83, -64, 138, 13, 22, 103, -99, 154, 217, -234, 262, 5, 55, 189, 67, 268, 132, -54, -23, -121, 169, -16, -132, -33, 72, 324, 15, 7, -155, -89, -14, 38, 127, 116, -147, -172, 68, -60, 217, -264, 10, 13, 24, -61, 94, 236, 143, -45, -110, 172, 360, -26, -47, -34, -230, -56]
2475e6j27Q7K56j05j41N7J51m99P6J91Q1j15n1L97k78K47J1k33k71J45M21m34
2497a90P7K87k27M26l05nJ10k34J83j57J89j83k30K61Q7N5j1J82m41K35k44L24
2519A89n05M36j01J27Q3l70j3LL05R2k01j02P6l3RM2j49p5o1N26l70J01O6j95
2543a20J1K64J05l83M55l30j49K17j50M1J97j50k39L14PMj79o8O5j99K24J40O3
2566A40l51J88l3M9m3r0L66j06j85j31L48k57P1J1J28K2j88J51P3j80J97L0l06
2589i6K19l53J76Q0q7pJ48j91K76k6p8j70j00OL47k10r9K51M7k42K4N08l77n1
2613eJ2J07n36J83J24K3K91j07k1N3k55J97j58P5M2qJ29n3j78j7R8J57m4L29m59
2638b1J21J2L9k69RK55j70k89K14K93j47l08L69K73k74nr3K2j35j6n2J99J03K43
$$ y = [-56, -183, -96, 160, 55, -86, -29, 122, -377, -301, -110, -29, -144, -195, 202, -76, 171, 182, -51, -322, -177, 244, -190, -113, 174, -53, 373, 68, 63, 173, -61, 122, -35, 154, -29, -259, 2, 89, 144, 133, 315, -126, 109, -135, 189, -316, 120, 19, 146, 229, -141, -154, -151, 154, 246, 45, -57, 19, -14, -5, 37, -112, -187, -248, 278, -92, 9, 75, -120, -109, 155, 260, -123, 332, 2, -147, 70, -80, -39, 158, 8, -231, 83, 90, 94, -85, -153, -88, -287, -63, 77, 140, -211, -23, -56, -7, -50, -140, 226, 120, -65, -196, 152, -105, -34, -23, 105, 127, -61, 90, 163, -17, 180, 210, -96, 123, -230, -54, 26, -61, -68, 80, -111, 165, 139, 61, -109, -209, -203, 144, -66, -165, 86, 133, -109, -85, 423, 46, -5, 7, 114, -422, -239, -115, -92, 199, 92, 71, 124, -131, 66, -92, -17, 25, 17, 146, 93, -85, -102, -4, 153, 109, 438, -21, 100, 112, 151, -118, -109, 146, -24, -313, -99, 194, 47, -261, 108, 381, 107, 102, 9, 31, -104, -120, -172, 27, 130, 373]
2662C73l33J18J19k52L21k25j59r8r8J4K63K2O3j82K09R1j73L6R3k04k30J38L28
2685B34l61J14n0M1j14K98k03J0q8P0M1K94m47l4K02o5J98j78l1K00r9j10J43
2708F5l00K87R9j20j2j79N55k04n0m16L53J79o06L17k23N08n42J84J10J47l05
2729a53j15L26J99j53k09J79R0j22k58J64K96l32J11j42K05j84J7J84N6k08j94
2750b43M45l76K0M35j76l2P2J03m77L08o2R6k9k43L06k82J65K45l35m5K47r7r8
2773e3J35p3O4k93Q3K31p0J30k29j00L60j3J01k15N6j44K23l84j29M15N0k8k32
2796a15J71Q1m01J84R9J73O9k54L74n84K19Q7oj84J2L8j40K06K3q5l02K54Q8R3
2820A00O9o6k28r2lJ02K30J91n58J59J69Q0o5k28nq2M74n23J80N4j4j00K77o1
$$ y = [373, 40, 158, 277, 25, 346, 121, -38, -136, -234, -220, 43, 65, 128, -54, 155, 246, 73, 109, 202, -2, -232, -94, 234, -127, -13, -63, -22, -136, 162, -41, -31, -119, -49, -8, 286, -161, -195, 7, -58, 140, -38, -69, 131, 32, -78, 65, -235, 52, 151, 31, 19, -160, 395, 191, 141, -275, 78, 257, -349, -32, -255, 253, -289, -105, 5, 152, -153, -268, 58, 257, 104, -105, 74, 164, 42, -216, -52, 244, -88, 23, -119, 86, -98, -81, 103, 159, -49, -243, 202, -174, -154, 281, 105, 73, 145, 248, -229, 79, 17, 113, 84, -159, 147, -135, 30, 275, -60, -105, 142, 45, -53, 82, 9, 73, -220, -137, 94, 24, 154, -75, -175, 185, 172, 273, 58, 114, -30, 193, -191, -320, 95, 145, 117, -115, 56, 137, -264, -80, 19, 192, 261, 7, 381, -203, 16, 103, 97, -87, -75, -37, -177, 29, 52, -33, -335, -81, 7, 100, 169, 103, -125, -217, -220, -118, 112, 303, -255, -96, 73, 153, 88, -140, -145, -227, 247, -276, -96, -42, -56, -156, 121, 60]
2844F0NQr9j09J98J99k6j31k67J46l65K66K90k99J8J15l27M17M9k27J47k80L38
2867A26kj65j95N1J66o0j36K29n8K11j82J70j13P4J01k33RM7k00L57l30j31K15
2890d9j5K30J28k71J57k09L8k29j7K77j0J39j61J37l96K02m0K12k73L9K0L66o1
2913B14Q3j03Ml66n1J78M3J53j88K45l32J33j70J94J69k91j0K45K5Nm73K02j56
2936b47M35r3rk13J55J81q7k81R3l2K19k64K52k84P8J20J64k72J12k00K39K39
2958C05n22L41Nj9k62K95M1l43k34J85J35r5J87K60j88k45M52k92om7J23j79Q3
2981b0jK72k91o9K99l25K06q3P5J6k85M61n00L22l17K77oj36K09O9j89lj29J20
3005b8J41m2j09J96Qj5l10K37j66k74N34m45N76k43j55J5l13K30k0J22K26k74
$$ y = [60, 65, 73, -26, -135, 63, 262, 236, 105, -162, -16, -381, -115, 175, -124, -106, 9, -318, 99, 148, -79, 68, -212, 126, 124, -41, -236, -185, -19, -79, -215, 14, -44, 167, -15, 155, 42, 116, 217, -16, -7, 40, -160, 197, -133, -264, -49, -64, 166, 294, 23, 180, -29, 9, -220, -237, 40, 30, 169, 8, 145, -251, -49, -89, 123, -150, -111, -91, 275, 214, 297, 194, 198, -168, -219, -41, 2, 155, -33, 212, -120, 13, -157, 37, 206, -85, -95, 150, 175, 180, -293, -91, -247, 188, 95, 86, -127, 28, 209, 122, -159, -66, -98, 121, -143, 109, -175, -97, 23, 187, -85, 27, -173, 66, 305, -217, 124, 129, 110, -152, 143, 184, -159, -393, -208, -73, -168, 19, 279, 91, -154, 298, 6, 0, -47, 76, -103, -20, -21, 251, -40, -109, 190, -135, 71, -12, 63, 79, -206, 255, -245, 77, -240, 37, 31, -105, 104, 173, -16, -19, -148, -28, 113, 71, -38, 158, 166, 151, -159, 78, -88, -362, 172, -273, 303, 60, -95, -80, -393, -163, -183, -61, 165, -109]
3027a09l13M03k18K04J29J82k4J51n20K9J43j94K11K6n3k9J93l6l92K98j00j07
3049a26M05k42J00k94L58l32K3m2L27l5mj59k15J15J6K11j9J99k01J7n9l5k26
3072b18L82k36n9K94l47J35J79k95K58k80L52j68K4pR3j93J32m5L03k63J36l6
3094A41l07J56m58M27J67l9r3R0o4l9m6M5R6r6lK27m61N23m28P0j68J10K5J15
3118a0J71j27N9k42L14j41j1l52L35p1L86k75j78L75l02k58M49j16j66M02l71
3139a29J25K55k9k84P2j19l5K07l3k79Q9K05M6j35J33k40J88o0k18M92n53K38
3161f4K56k32J36j01R5M9j41j37oJ75j03P7p3r9R4K84l17K89J02n69M27M3j43
3184D2k97J83n8K82K24k96j09r9P2K19l31r7N34k19k43K88r0J8j86K23K6k45O1
$$ y = [-109, -422, -19, -237, -33, 96, 278, 254, 405, -115, -86, 57, -137, 74, 100, 47, 18, 211, 175, -217, 81, -19, -126, 279, 37, 137, -157, 201, -131, -108, -150, 177, 142, 138, -21, -236, -121, -105, 106, 87, 286, 85, 102, 43, 8, -218, 164, -72, -131, 163, -184, -49, 130, -165, 93, -187, 165, -3, 21, 14, 107, -86, 46, 1, 304, 41, 177, 141, -166, -10, -468, -41, 126, 87, -6, 84, 20, -19, -65, -20, 76, -20, -23, 204, -257, 266, -162, -92, -260, -150, -125, -10, 161, 34, 93, -149, 165, 24, 13, -339, -4, -75, 311, 36, -142, 233, -69, -327, 122, 6, -160, 242, -129, -4, 251, 222, -62, 10, -109, -144, 63, 30, -249, -160, 45, 91, -44, 89, -151, 37, -23, -241, 251, -302, -64, 192, -40, 96, -5, 90, 139, -2, -139, -145, 30, -73, 4, -69, -168, -74, 210, -107, 182, 284, -285, 142, 185, 42, -255, -72, -130, 152, 376, 80, -29, -128, -56, 163, -168, -265, 269, 50, -193, 95, 5, 23, -163, 60, 86, -159, -98]
3207i8J34R7j61j78J36q1K98k49J0K01m7J59M4j55k67L2j00J77O1n3ol0mL28m54
3232b06J37K5k67M85p1o5n6m9j00M36l57L00j84K19k74m8J6K02j35O8m39M93k09
3255g9K98rl56K04q3J06q6J17k50K26l96J83j8J15l31L25j54rJ33N2K27o5j98
3278d8J16k37J96K3j16K37K8k72L7j26K72k27M45m53j92L72j60L35n23M07K0l6
3300I8R9k22J3J38j04n1j71k38K61N9K63j84K94q2j19K45l05oJ55O4l19j60K57
3323a5J50L2m50P4M82n02J41o6o8J25k24j65K96Q7J28J2J11k18o7K03N5j92k6
3346i7%N4R1j10K45l83J1J32J81r9J71m5k41n8K75nK3j59mJ34l35K98j20J62m9
3371G2N6n3P8j75J55L6j66J57J08k32J90k55p5J36J05k48k6j8M83k0m05j46N65
$$ y = [-98, 36, 133, -28, -206, -70, -151, 147, -102, -92, 109, 62, 221, 265, 110, -157, -125, -225, -48, 13, -40, -46, -76, -80, 248, -206, -69, -44, -311, 174, 103, 38, -18, -67, -167, 269, -88, 212, 28, 247, -27, -75, -59, 143, 8, 76, -363, 130, -79, 219, 210, -146, 58, -25, 81, -5, 112, -138, 88, -308, -125, -143, -28, -359, -34, -188, -197, -64, -12, 215, 150, -48, 68, -169, 27, 50, -66, 171, 199, -73, -36, -162, 110, -117, 328, -125, -317, 55, -105, 230, -293, 114, 134, 98, 197, -25, -12, 126, 22, -29, -200, -438, -177, -118, 145, -39, 255, 173, 54, 299, -6, -12, 143, 207, -112, -272, -15, 135, 167, -283, -209, 273, -229, -88, -154, -222, -97, -321, -486, -190, -103, 25, 37, 148, -70, -137, 66, 121, -71, -97, -97, -43, 48, -62, 183, -200, -189, -57, 124, 25, 196, 151, -90, -148, 127, 122, 145, -14, -18, 116, -219, 79, -41, 121, 72, 128, 75, 153, -22, 133, 169, 3, 160, 268, 36, 226, -29, -104, 32, 137, -111, -137, -155, 328, 308, -97, -243, 322]
3394C22k85j37j24L0M18m35K97k3r4L8k8j5p8J56O9k85j57K21oQ5O8J26l59K28
3418C2k1K48j28k56K18q8J89m05R6L62k95M0MJ48o0r5%q4K26n3m4q8j7L96m82
3443a57P8M45k41j68J02j02J12j25J01j1k14l58M10MO5p9J19k08K79j90J68p8
3465d8k8J39j33K69k87L0J03j37j53K91P2j16L49m08k1P6j75K42O9k07P1J50k90
3488a42J98j08J20k17P7j29R0J1J15k5N4l73L15j79M82k20k47L34l45L65R5j73
3510I8j9k83K31J49j34p4l28NL52r9j39J52k1K05p7L9q1K68M7m40mN3r0L32j25
3535A7l0mQ2K9K0m8l75L78j31m6j51K73rJ9k05j44N74k93K89l27J9Q7%J34K8k07
3561b1J1J2n0n9K06k39J18q5M66l43N3k04J01K08l45k02M21Kj62K81J6l96K39
$$ y = [322, 37, -100, -224, -194, 224, -211, 86, 63, -31, 7, -21, -36, -114, 42, 111, -174, -331, -110, -116, -31, 37, 163, -196, 32, 11, 259, 131, -125, 93, 5, 194, -211, -115, 247, -48, -8, -4, 144, 84, -11, -11, -95, 131, 78, 34, -54, -71, 325, -157, -79, 366, 125, -43, 59, -43, 69, -56, 45, 34, -180, -538, -128, -124, -59, -138, -19, -227, 52, -138, 30, -48, -76, 63, -70, 199, -88, -58, 45, -92, -245, 46, 118, 2, 351, -57, -78, -2, -177, 65, 134, -73, -2, 148, -142, 56, -52, 68, -149, -72, -201, -111, -100, 15, -10, 44, -329, -14, -193, 289, 69, -178, 156, -189, 176, 271, 98, 79, -204, 27, 176, 42, -32, -360, -355, -3, -102, -241, -89, -110, 95, 18, 57, -24, 244, 291, -149, -153, -100, -190, 142, 17, -13, -17, 65, 94, 114, 66, -309, 69, -62, -108, -259, 14, 5, 24, -181, -325, 249, -44, 245, -82, -63, 24, 24, 158, 186, -21, -10, 2, -48, -107, 99, -140, -22, -107, 359, 16, 69, -135, -34, 174, -171, -373, 48, 50, -112, 169, 185, -211, 28]
3584B8q2O5k73M00j19k86N44k69o8M9p4oQ4n0l3K21j90m01O84n25M38j89L41q7
3608B02ll91J65R9k54K32l19L01n1j01J31K3J44p1L4j24o2L6L6j41n2L43k96K00
3632H1k78N81k87Mj44p9J5K09j59Q3n4J06k35M3K45m61P8M60k49n2K35J65k29
3655G8l79K40p4K52Q6j74P1J0j98K51j47or8L24J3k37P2L6j45k62J09K45j19j8
3679g0p4K23k68P6p7P6L66l15Q1P4j93r8MLN1L67p9k6r7j14j09M39j09l7j95K0
3705h1K39m41J93j81K66n1J55R6m2k17PrJ57j99M2k3K65k50K19P9k3k35K24j73
3729A7j63K89k82J48r5q1J65J72j30K67k13K9l9l2l8L3j89J72K48j97l26K03j94
3752b36L49j99k54M51m90L48M7l21K50j30K09J6k30n2J3Q6J62M3N9L5j24k21K49
$$ y = [28, -54, 11, -262, 138, 19, -267, 277, 8, -60, -11, -85, -91, -7, -57, -90, 131, -59, -460, 224, -301, 137, -52, 289, 202, 199, -192, -27, 72, -182, 50, -269, 32, -19, -120, 11, 34, 178, 107, 141, 17, -45, -9, 27, -114, -166, 177, -119, 81, -197, 384, 97, 101, -43, -122, -107, 102, -57, 26, -28, 78, -157, -114, 131, -330, -252, 208, -41, -93, 142, 307, 78, -301, -61, -135, 117, 203, 29, 100, 110, -88, 163, 16, 10, -88, 236, 249, 12, 84, 120, -25, -287, -178, 67, -52, -70, -144, 79, -189, -113, -190, -114, 252, -63, 18, 92, -101, -199, -195, -192, -141, 226, 147, 121, 24, -90, -199, 240, 131, 94, -101, -81, 158, -283, -90, -271, -5, -56, 99, 195, 153, -64, -57, -66, 91, -108, -66, -89, 176, -74, 145, 224, 201, -34, 190, 17, -146, 143, -139, 9, -86, -167, -2, 170, 40, 307, 94, 123, 84, 52, 14, 47, -142, 30, 278, 81, -245, -42, -236, 113, -86, -340, 111, -379, -31, 16, -305, -55, -185, 24, 40, -190, -242, -229, -143, 19, 62, 121, 156, 32, -189, 60]
3775F0k4j64n6o2M83k51q6j01K3M38n12m1R7O6J14k35L85j4J72l86K65l56N13
3798C28k15o0k0j69o9K91J44m1k90K07j12J18l52L11q3O3q3J06k04l5L8K40j03
3821A0J31l23N66m13N7J67m25K35n4J81k14PL5n8J55r4RK81m49QJ32j04p6J84
3845e2j3j1Q9o7k89M23J89l49j64J19L04j30lQj62o4K04k25M55k52j13L72m65
3868a96J77j14k9P3K87k7J18l37R6q4J84k17M84k71j65J9k69JM15l27J44j40O00
3891D22l72Q8l6l12K46j92K38j91K33p6J88m85L60l53K82K4j21L28j90jm2p5l53
3914c90J17M54l56n5L34m2k6J83k86j25J00n3mJ40J54l04K55k22K58L7l6p8j45
3937i0K11j29j26K24K78j89j74l05N38k52J84l18p9L27O6J30k30K28r0J6m5l43
$$ y = [60, 36, -128, -184, -246, 237, -14, -100, -201, -178, 260, -252, -293, -196, -130, -16, -251, 134, 120, 292, -94, 171, -185, 328, 113, 53, 33, -136, -205, 86, 230, 189, -101, 106, -6, 112, -240, 71, -12, 51, -32, 74, -130, -165, -127, 113, 10, 141, -182, 384, -29, 28, 195, -230, 5, -49, 132, -82, -75, -40, -98, 57, -37, -28, 253, -196, -188, -56, -160, -236, -52, -65, -76, 13, -54, -343, 80, 269, -80, -244, -125, 179, 49, 46, 54, -108, -172, 32, -193, 262, 10, -103, 269, -196, -19, -133, -162, -89, 198, 171, 289, -48, 48, -36, 148, -69, 415, 144, -21, -2, -271, -270, 145, -182, -38, -178, 422, 50, 138, 102, -210, 36, -156, 82, -109, 124, 48, 236, -249, 111, -242, 40, 64, -57, 271, 81, 80, 38, -37, -390, -273, 181, -175, -230, 104, 62, 36, 219, -67, -192, -92, -145, -149, -9, 145, -159, 96, -126, 132, 169, 133, 55, -90, 121, -8, -134, 90, 368, 179, 5, -300, 238, -14, 170, -148, -227, 100, 166, 296, 66, 294, 204, 220, 175, -168]
3959a68J58M7l54M02Q5k56L0M3k09L54l52K90p0j87k47L28K84n57M64k49M24m19
3981a59m2q0M09J39K13o52K72m84L11Q3J96k96N67m76P0k33n2J18j2J28m0k64
4003b84K74K40m12K67o5M4L72m94O9l2j47M96k91j69M23k80j7J73j66j75J0L10
4025A46q6j42K94n02M76j07L7j99j98K66J6L2K4k17j25K55N6j79O2p6J12J67k22
4048a10N3q7L38j63j36L6K31j18q1J44l2j49O7O1j0j29M6m7M31N3m17J74k79O6
4072e8l49N93k22j55J51L4n4j04N33k35m32M68l59K29j98K29K9l20K02L02m97
4093b13L55k92P3l07L43j56R3K73k52M0l1m1q1L23R8k93j0o6k18K59k9j25K41
4116a6R2l5K12l85K1K35m26L01k03J13p9K96j55K12p2k27O6J32j16L6k22L03K31
$$ y = [-168, -10, 37, -317, 85, 170, -86, -56, -13, -222, 132, -220, 70, 0, -187, -434, -106, 178, -379, 85, -164, 260, -159, -201, -281, 128, 267, 480, -172, 100, -384, -73, 10, 206, -90, 477, 1, 71, -162, -214, -96, -108, 20, -20, -284, -10, 230, -182, 85, 20, 64, 436, -58, 11, -21, -168, 328, 37, -132, 291, 11, -6, 167, 1, -174, -164, 146, 60, -82, 212, -290, 186, 79, 116, -83, -281, -15, 1, 33, 57, -160, -285, -30, 26, -153, -91, -167, -55, 112, -110, -57, -144, 194, 31, -105, -69, 162, 44, -37, 107, 75, -74, -7, 54, 44, -85, -39, -86, 345, 398, -19, 155, -124, -58, -407, 186, -36, -191, -40, -6, -60, -164, 369, 134, -298, 170, -189, 40, -158, 71, 100, -220, -18, 284, -213, 142, -150, -77, -384, -41, -197, -104, 169, -83, -43, -74, -115, -196, 127, 225, -68, -78, -144, -362, -103, -132, -257, -16, 76, 41, 253, -132, -111, 124, -302, -1, -204, -91, -170, 126, -29, 183, 111, -116, -50, 82, -34, 2, -220, 83, 314]
4139C14m02RJ69j38J65p6J88k90R8M6p7q4o4MK3L20j95K1q6k39o2L69k86N16k00
4164D3Q6j35Pj50L8J39J88j30j40K39qn4l34K41J38q4j16L56k53m2k5N4j21j87
4188b50N50m07j22L6J62L9OJ28j19j45J2J02j2j1L5j60L6m6M20j3k05j11J09k18
4212a84j66L18N8n6L73l22j34j12r4K19K04m0M7J07j22k6k58L07n66M20K4j07
4234a10j35q2K43L28l88M4j14P2L06k0k27j28J79M8j6J14l27J96J5j2j17Q4j37
4257a84r2J64L01rk16j73K20O2j60P5k0j83K82J96%k13j22J90O8l14K30p4O3k63
4281a72L1J93m0J01j63k28M34n2l8n1j32J76j21q1L29k2j31r4J46O1l0l78K21
4304d1k62M80l45J14j61L28m9M4m20K50j23j59L44rj46J31K36n28L46J46l55J20
$$ y = [314, -88, -79, 90, -48, 117, 41, 229, -61, 37, 83, 6, -78, -142, -138, -115, 205, 10, 31, -55, -294, -356, 13, -273, 243, 43, 129, -6, 1, -149, -111, 28, 216, 86, -54, 185, 177, 123, -211, 30, 168, 84, -32, 324, 71, 29, 4, 58, -63, -250, 300, -107, -229, -193, -31, 8, 14, 142, 23, -122, -110, -8, -20, -31, 4, -156, -120, -166, 254, 241, 36, -75, 34, -184, -350, -32, 26, -30, 343, 21, -113, -225, -319, -100, 104, 64, 111, 218, 96, 70, -188, 119, -447, -27, -3, -110, -245, -327, -84, 244, -144, -100, -214, -142, 164, 144, -83, -211, -32, 16, 0, 114, -213, -17, -2, -14, -131, -47, -184, -276, -112, 189, 180, -36, -209, 11, 73, -87, -12, -32, -215, 67, 263, 263, 50, -72, 118, 186, -128, 102, 28, 91, -172, -141, 52, 12, 113, -50, -278, 156, 104, 66, 15, -117, 59, -62, -143, 186, 164, 33, -61, 85, 146, 116, -262, -41, -303, 177, -168, -54, -215, 113, 64, 108, -312, -62, -185, -344, 0, -9, -155, -24, 212, -316, 30, 176, -179, -59]
4326e9L09k69J95m00L14N3l80K08K69j98M6r9L3j36J55l21L61j0j55P2O4JJ13
4349A66k38O8M7o5n4J44p5L25l92j59J4J99J31j99J37L0r1P1j27L46j1l5K8l46
4373h6L41k17j41Q3j17J53r4R1r2L67m35M8j35K72M5L9k96L52q9m5K9j13qj0j57
4398b15P30o45K07M0o1r5M1K08m75K77j52K10k38J12N2l7K53Pl63K55j31L56k14
4421A22j95n9K87N7k09r5N4K7oj45oJ11O9J73J95j86j62KK55k67K43k85j77L27
4445A30j60RjJ99l16O0j26M27l8j44l5k8j76Q9K95k3l53J58q5Q5L31l87p2L07
4469A46O1l62r3K31J37j58m0J85j44J36j89Q8J65l2k86M8L3P6Q2j65J26n6J13
4492A02M5l91L58P4l4j35K8j23K08m2l94M88l23L31l52p3K93l28j5K36J96M0m07
$$ y = [-59, 250, -19, 176, -224, 90, 143, -237, -29, 240, 42, 88, -11, 22, -114, 41, -280, 81, 71, -84, -12, 52, 53, 166, -72, -4, 43, -22, -76, 68, -7, 318, -74, -233, -219, -20, 111, -88, 49, 79, -12, 59, -68, 278, 267, 232, 260, -86, 255, 38, -103, -20, -137, 16, -78, 13, -79, 288, -147, -99, -234, 38, 83, 122, -174, 178, 89, 44, 73, -40, -48, -58, -215, 515, -130, 77, 117, 56, -39, 2, 210, -265, 12, -140, 70, -168, -56, -4, -41, 212, 219, -144, 111, -20, 336, 122, -73, -132, 155, 212, 3, -92, -38, -11, -17, -162, -168, -57, 12, 185, 380, 194, 32, 34, 289, 22, 265, -20, -197, 130, -30, -21, -22, 177, -139, -79, -205, 222, 184, 40, 5, -23, -199, -110, 185, 162, -191, -33, -118, -33, 298, -89, -161, 146, 207, -155, -248, -17, 120, -38, -78, 107, -37, 99, -90, -2, 163, 131, -155, -107, -74, 2, 84, -81, 45, -11, 102, 147, -244, 114, 188, 154, 19, 47, -76, 132, 90, -304, 184, -139, 192, -160, -233, 60, -268, -283, -47, 149, 189, -218]
4515b18K99L5l68PM83k32q4J61m3j32K59l41K15R0j67N8k05K52n1o0J57j53N0
4538A2q7M28l41n9o2K54r9L6k33j54K87j25J27L06m02J33J56kJ3l65L06Lk54P3
4562d9rk9j52K88l09M70K9j78k50j62L82n3p0J75j99N6J47l41J09l7K11q6k56
4585c13N48k18JJ71m54L35j30L94n38J66L2k25J46L9J72l98L23O0n17L64K91m16
4607a67K92n1r0Rj66L8L60j64K0J19j04m3N6l30J73Kj14k3L51j40j1J44m53J56
4631a36j03J9L39J03k24j54J15m8K83J72m09J25o2k50L1N3L22k49q2M39l57O3
4653a0J1J56n7q1R1L84n85K29j62O8J35m27J26k68L54J95m2J58n8l73r2J73j34
4676b09j95N97j21p7N3K14m97K03n5K14p0q3k44O8J08j94J84J74l07O64l24j64
$$ y = [-218, 81, 116, -252, -245, 238, 6, -78, 83, 40, -92, 167, -174, 41, 131, -36, 22, -183, 69, 18, -42, 115, -38, 12, -75, 353, 12, -47, -109, 145, 46, 82, -151, -305, -18, -143, -16, 290, -112, 21, 177, 175, 188, -177, 129, 132, -122, -49, -58, -87, -239, 49, -260, 210, 239, 61, -189, -351, 31, -22, -92, 83, -116, -60, 87, -254, -145, -182, 29, -57, -313, 235, 17, 18, 189, -265, 70, -60, 334, -204, -38, -6, -231, -85, -46, 126, -272, 51, 111, -406, -42, 249, -167, 125, 74, -16, -7, -173, -135, 225, 61, 81, 200, 96, 53, 109, -221, -48, -46, -160, -183, 168, 28, 17, 161, -292, -136, -239, -220, 119, 222, -2, -156, -41, -89, 194, 366, -43, 82, 20, -230, -199, -146, 176, -73, -155, 284, -73, -10, 1, 157, 100, 19, 110, 494, -91, 138, -24, 44, 179, -248, -122, -390, -36, 159, 117, 275, 217, -156, -248, -75, -209, -404, 193, 72, -5, 48, 262, -235, -32, -87, 127, 57, -26, -270, -202, -94, -288, -104, 70, -237, 427, 103, -61]
4698f1J60k08K19j03k8l58N13m8m30K49O1j9Nj25n0J50K4J25l32J47K16k92k8
4721b13K64j4k65K3K65l02k46N06k26J86L0k21J02L56k57L1l44M09m00J20O02
4742D06k68o12M49l1K7o0K58k11K71k80q6J57O3J90k55N9j28K48j80N4r2L8J40
4765A57j91K22m63N05o1q8o7k10L31k44J99j1k7l1m4K18j97K02j29j26M18n78
4787b15J85k3K5j9L27q5l12J10q5K39l69M00Jjj48N2K28m63M26l56m2J13p6m8
4811a36K09J51m00J20L46m39J94J83k94L1J25k82K12J38J09k09J66m92K95j16
4831h9K01l15K20k56J42P4K59m05p4K89m7j98j00K03J53J49l19L8P8k13M08k80
4853h2K25k50J18n2J32P9j05j64l4L02k39K20j44r5K30r7j35K64n01K00J1M03
$$ y = [-61, 99, -109, 110, 7, -21, -379, 134, 86, -344, -95, -34, -53, -48, -173, -223, -73, -49, 76, -256, -109, 107, -185, -213, 51, 37, -228, -205, 60, -242, -488, 18, -208, -22, 8, -213, -111, 245, -12, 19, -325, 84, -316, -196, 406, 138, -474, -25, -56, -29, -89, 169, -42, 229, -51, -137, 20, 83, 273, 18, 77, -51, 197, 17, 71, -21, 17, 157, -34, 188, -275, 230, 169, 81, 14, -196, 135, -109, 90, 79, 52, 21, -23, 195, -2, 200, 71, -55, 363, -215, -30, -53, -28, -47, 280, 195, -117, -7, -92, 147, -222, 178, 179, 178, 30, 82, 310, -153, 273, -83, -125, -12, -88, -136, 73, 224, -176, -56, 290, -149, 45, 228, -66, -35, 90, -192, 20, 158, 267, 58, 224, -268, 27, -89, 112, -203, 17, -239, -97, -23, 236, -169, -243, 46, -1, -199, -299, -96, 57, 206, -113, -75, 3, -210, 198, -82, 143, -107, 11, -41, 91, 170, 65, -99, -133, 169, -70, 150, 6, -89, 141, 44, -91, 173, -328, -128, -117, 286]
4875B86l04K2K00l65L58k1p4m03M59k15K99m67r7O9K96oj90k90M12r6J13J18k59
4898a55J94l0j72Q6J35R2K79n79L6Q1q6K49O1j44K06j91Q2J68m3o89N32j12P7
4921G7m8l6N1ql3O1m07K77J62l19J92J51j43q2J34J31k53j88p7J84K81j54M10
4944C63n50J90k00n3K87l6k06J99J56k32M4J5J38j37k35L93Jl32L67k57J7J23
4966E5q7J14m33L75k28L33l6J34k00r7J51k04O0J71P8m73M14j81J82l92K08j0
4988f6l9J00J8rk0J20j06nk07K18NK8R5k31J48j28J57r8j75O9K0J11j2q0j88J77
5014i8O3r1N02l90l5K06K3m63N6J39j41J59p4J77L8j51Q2k08K37J06j56k28L46
5037I9p2R4j7k59M25m03j28J94j02j05J38K28k4R7o7K86n11J65j15j99M23j45
$$ y = [286, -18, 4, 204, -161, 197, 176, 102, -301, 158, -57, 242, -225, -322, -253, 43, 37, -153, -443, -31, -127, -14, 104, -155, 39, 9, -163, -77, 58, 150, 429, -150, -114, -33, -119, 130, 191, 47, 253, 62, 144, 312, 269, -420, 112, 0, 77, 29, -7, 44, 36, 3, 64, -343, -66, 96, -223, -31, 120, -23, -105, 29, 160, -93, -281, -358, -174, 107, -47, 363, -187, 3, -197, -250, 37, 1, -205, -6, 150, -82, -38, -23, 115, -22, -257, 136, 137, -195, 172, -85, -68, 55, -32, 82, -351, 24, -204, 129, 93, 227, 27, -70, 81, -123, -63, 108, 186, -287, 127, -54, 128, -264, -56, -66, -105, -5, 13, 4, -16, 104, -2, -7, -214, 4, 9, 37, 132, -99, 49, -79, 78, -20, -195, -126, -106, 5, -7, -87, -275, -98, -35, -126, 376, -14, -49, 157, 180, -283, -227, -88, -229, -70, -144, 33, 71, -80, 2, -206, 31, 137, -19, -247, 99, 27, 121, 104, -155, 270, -133, -261, -67, -169, -274, -136, 92, 68, 165, 98, 384, -127, 38, -77, -276, 147, 2]
5059BL9m8O2j66k95N42J2j53j63R8J53r0m3K02l2J12l89J74J73r8Q7j97RJ11K1
5084A23J1p3m10L60J8l61P69m06J67P7m12R0k88N90j42k37l7N3j1J9oj35J09L32
5108B00k99p8J66J19k94O1m5R2J92k67K81l5o9k14K87l5k32K03j26K78l8m6Nk50
5132a44J24J80p4j85M2k6J22mn0P9mK3R1k66L48k35J08m71K76K44m02R9o2K14
5156B7k69M42O5k95n7J6nR2k5J28k76K98j07m8k80M09k09J35j55O2m2P7j62J86
5180Gp5JJ56k30O6j62Q3K79n3k47M06k94R6M5j55p3JK93r3L3o3m53N32j56K41
5205A85j12N9m9j45J1K36m09N41l58K5j61J13m47L42L37l6M6j46P9K04j78k06
5227f9J4R4p7J37j47J30k12k7J83k28M30j82J0k15P7L21o6M3l03J0lN6j89J40
$$ y = [2, 41, -7, 55, -111, -406, 136, 148, -5, -168, -70, 83, -7, -50, 152, 120, 232, -157, 17, 190, 92, 179, -18, -9, 102, 123, 134, 61, -349, 11, 29, -332, 437, 31, 198, 275, -137, -47, -335, 255, 113, -124, -161, -108, -119, -100, -106, -241, -132, 200, -99, -177, -11, 108, -186, -125, -170, -78, 114, -153, 128, 93, 24, -190, 97, 62, -170, 33, -93, 185, 147, 101, 106, -144, -20, 160, 86, -99, -57, -83, 39, 35, -15, 64, 60, 83, 174, -92, 256, 21, 129, -342, -66, 178, -224, -125, -187, 27, -242, 200, 265, -30, -87, -71, -76, 16, -9, 119, -157, 141, 34, -14, -294, 115, -94, 41, -114, -52, -94, -17, -179, 7, -68, -67, 89, -141, -75, -237, -154, 125, 72, -175, 231, -63, 33, 78, -77, -150, -149, 144, 51, 84, 21, -432, 100, -56, 185, 73, 132, 83, -62, -51, 185, -224, 317, -41, -16, -177, -64, -511, -169, 168, 132, 178, 32, 111, 315, 137, -69, -55, 39, -38, 99, -48, 82, -130, -157, 26, -202, 228, 46, 56, -159, -82, 239, 173, 216, -87, -77, -80, -24, -213, -73]
5251g3L5N5Pj07K14o6j1j40J46j68N0j14J99J63m62L42j11K67j61m2J34m71K65
5274d9J93p7O4O4n96N61l42K76J10k70L35k59j62nJ43O7M8J2p5K5n24O37K60o50
5298b14M10k50J16L14k86j58K87k13k5r5r0K3K53L8j00Q4k24J13N2j1j40L51j92
5321D3k54L50P6o7j53o4K28J06n07J76j38K00P5q0j22L04r5j34J23Q7J26m44K87
5344A23k56L1N6L3M6J2J40l8L4k36K4M4L7R5J56m47K21L3k42l9J48l7n8J20Q2
5369H2m9J29l89J4P0K97l79L44nj72OJ38j22K75l72r0L04j11K04j45l16J46L83
5392B42j88j33K2J70j47m8j66K56O7pj13j7j81M50k21p5R4j30J54P1q5O0O7k6
5416A16k46L00l92J92J9J26m03K65q4K67j54j46N3o7n5J93J50j82K12j78q5pp5
$$ y = [-73, -38, 17, 24, -83, 131, 65, 54, -86, 60, -108, -58, -172, 27, 190, -272, 70, -41, 226, 65, 23, 157, -314, -49, 144, 67, 131, 195, -401, 160, -182, 94, 204, -66, 269, 10, -152, -157, -14, 53, 101, 113, 38, 63, -461, 176, 436, -214, 196, -54, 62, 376, 90, -68, 219, 6, -19, -114, -204, -181, 72, 110, 10, 94, -130, -17, 35, 24, -116, 235, 43, -211, 139, 215, 148, -5, -69, 159, 265, -242, -66, -204, -4, 71, -9, -131, 173, 78, -56, 67, 154, 280, -164, 123, -133, -102, -46, -13, 33, 45, 185, 147, 181, -55, -31, 13, 50, 145, 301, -146, 75, 108, -134, -173, -25, -62, -120, 0, 82, 33, 162, -227, -213, -143, 154, -225, 119, 114, -58, -52, 86, -36, 239, -133, -223, 81, -30, 174, 29, -287, -141, 242, 54, -79, -57, 113, -34, -82, -248, 8, 75, 68, -45, -62, -243, 207, -14, -89, 5, -125, 29, 100, 15, 75, 142, 116, -130, 170, -222, -30, -11, 115, -288, -23, -107, 160, 6, -140, -87, -154, -209, -16, 134, -48, 164, -14, -99, -106, -181]
5439a81K6K33r2j26n6J66K79Rk22N82o15k60J73J52r1k29J25J67J15k50J41N1
5461I7L67n38q3M3J53l50K11K14P1k62j59L54j30O8J40j97m1K3J57k1l30L1J28
5484e4o4J71j23J8O4K2J58j25jP3j77J15Lm9k27J94m1J1J61l00L14k27Q7j04M8
5509e3K32k22nL76l04J59j36N0m7j68O6J65L7j81J68m69L14Pj94N41j87j21J66
5532A94j62K15l15j81j29N13Jl6j93J26l44M8L59j56o9J18q3k83M61j8j76j6J76
5555E0LN0kk30k35L69J41k00qK35o8pj43K6J31m3O4M9p9q0K03n17K80j91o8K18
5581e2j24J65K8J70j52j86K77l55K60j10j78K00k19j64o1N62k49O7K86k15N2L
5603EJ7l86L00J9j41M50l92J99j80j84L60J14k42r0K41l74K46J46p6lM7r4j8j2
$$ y = [-181, -155, 78, -14, -140, -196, -30, 249, 258, 36, 618, 3, -257, -84, 68, -23, -252, -127, 40, 155, -95, 46, 97, 464, -74, -157, -114, 39, -311, -100, 114, 185, -77, -236, 118, -12, 56, 196, -1, -42, -19, 138, 117, -213, -182, -54, -118, 53, -70, -52, 12, 34, 192, 67, 66, 139, -38, 77, 80, 31, -196, -2, -43, -32, 129, -171, 143, -84, 3, -101, -53, 179, -43, -48, 328, 24, 183, 47, 97, 50, -118, -52, 113, 150, -31, 137, -332, -18, -11, -205, 336, 149, 28, 194, 32, 247, -68, -249, -378, 135, 136, 100, -93, 33, -311, -263, 96, -60, -129, -11, -94, -377, 84, 66, -110, -126, 50, 53, 103, 101, -129, -364, 5, 146, -54, -62, 173, 105, 98, -45, -19, 112, 69, 133, 182, 103, 23, 226, -291, -11, -202, -270, -52, -176, -11, 17, 187, 35, -151, 126, -229, 31, -79, -257, -57, -276, -440, -501, 61, -188, -121, 165, -50, 2, 5, 22, -364, -64, -45, -186, 264, -128, 71, -109, -293, 67, 181, -61, -151, 90, -284, -38, 108, 32, 29, 76, -18, -36, -48]
5627d8L5j90M13k80J72j46R4p8K9NJ02k06O8N84n88J21k67P5K16l26L14k14J43
5650B8J8k25L38pk42P3M8J43j1m25L81q0q9k2j65n1M3K42m9K0R6k50L04Jj36M05
5676C88m34rj2J28j10J53j11N7Jp0J07m3L7J48l79L36k24J24J28k48N9J38j23
5699D1p4l1O5j48K31k07N1m8p8J75j98L45m16N4N02m64J20r2J8M26k48p6k84K63
5723g3P4J01l5l5j13O3j23J50L81l41J50r7jj35K88l00j00K05j48j45K44j10K09
5746A09l40J11J10j39Q0j03K8J45Q6M7k44J70j45J96j38L45r2k58j64M2K11K34
5768B91n14L63m45L73O7k00j42J82J53p5l0P1j38j77K89r2K01M6l3k19J09j2J38
5791B06j94j3j60j56J94K2P1k16K28m9J73j66j61L95j24K24m44J31r8L20O2l33
$$ y = [-48, -13, -203, 210, -70, 102, -44, 50, -28, 1, 6, 108, -98, -30, 554, -34, 87, -180, -105, 111, -215, 99, -115, 28, 46, -179, 159, 152, -90, -17, 31, 174, 163, -262, 119, 39, -50, -72, -237, -288, -245, -3, -52, -32, 64, -186, 118, 119, -17, 388, -46, -55, -67, 61, -49, 104, -7, 50, 51, -19, 88, 45, 82, 230, -149, 187, -37, 87, 215, -33, 26, 164, 41, -33, -64, 1, -147, 84, -123, -72, -120, -198, -23, -221, 124, -292, -238, 264, -200, -80, -172, -154, 272, 24, -52, -336, -73, 1, 102, 67, 32, -81, -18, -141, 9, 390, 49, 199, 102, 101, -34, 254, -46, -146, 59, -89, -234, 10, -100, 109, -231, -120, -10, -149, -69, -172, -144, 1, 87, 134, -110, 60, -85, 111, -27, 318, 226, -32, -196, -154, 57, 291, -223, 140, -305, 68, 135, -65, -207, -25, 128, 53, 23, 94, -44, -221, 68, -24, 177, 223, 190, -29, 80, 68, 206, 12, -1, -161, -317, -123, -101, -30, -246, -18, -67, 106, -60, -221, 174, 50, 274, -170, -39, -137, 183, 245, -88]
5813h8q4K52J54j59K75m49j28n3M74j70J22k82P9J75j6J01l31J36J59k87J89j94
5835a25L6j84K40J43j80LO5k27K61j19M2J95j04Ml24J62K18P9K69o44P4K83k2
5858A45m34J19j05Q2J71J02J7m0k06M25k70J33O0l51p9K06j68J26P5k42M82j46
5880A02m1p9J33j34j02M14m21J82k96L66l27J09K62j25l3k5j84L55l59K19J9O9
5902A04Rl19L68k70Q7J92n7R7l27K51j37K21j13j58J92j14K38j15k60k6m4J62
5924a9Mj22L5j73K48L07j86Rk27K1J97j09j90m3K86k06rJ50J05o7r0k58M66l82
5948b53J59K2K65n6k49R1K7j02Q7o9R5J22j08K7K9r4J32K7j66L3k70J68K9O8j23
5973a09J90r8j68K44j27J17J30j22j7J64j37k17K60k55O15l34k74R1m2J08O4j42
$$ y = [-88, -172, 80, 234, 75, 350, -99, -227, -280, 194, 24, 146, -136, -57, 118, 102, 203, -128, 8, 167, -120, 69, -125, -89, -273, -33, 110, -70, -67, -2, -229, 32, -87, -45, 150, 46, 50, -274, -112, 106, 185, 454, -190, -116, 167, 145, -289, -170, -275, -193, -22, 80, 97, 57, -149, 276, 6, 139, 199, -152, -231, -25, -193, -67, 8, -234, 248, 102, 61, -18, 115, -19, -121, 293, -128, 54, -242, 124, -203, -94, 168, 43, 10, -15, -199, 156, -203, 16, 35, 104, 113, -206, 162, -108, -21, 171, 114, 211, -116, 135, -2, 219, 106, -52, 140, 26, 264, 149, -111, -137, -181, -19, -15, -137, -102, -275, -27, 280, 94, 103, -124, -103, 94, -15, -205, -248, 38, -168, -177, -27, 78, 11, -79, -337, 129, -253, -94, -72, 193, 137, -112, -21, 6, -96, -9, -78, 17, 139, 31, 58, 87, -7, 125, 152, -14, 19, -251, -83, -54, 14, -109, 81, -17, -185, 59, -68, 49, 179, 57, 40, 204, 67, -150, 110, -145, 470, 136, -138, -47, -89, 19, 83, -59]
5995e9j0K56k90N7JK81m7N8m61K28J2l93K54j53M8K43p6L43J8j57R2j05L2k87
6019a15K12O7k60O7L70k50J5k95J21M11j54j60j73J57l34L15o2j97O85l07j12
6040Aj35P07o33k24m6M27qR4k13J3l2j54K00J02m01Q1J39K35k52o4J72mR2k18
6064a21M36k40N0k55m3o6K95J60j35j24rJ3j20J58M6n2j19J20p4K79k88K60k62
6087i1M21n31J45J91j41P2k73Q2L35j28J80j57l1O6j1k90J8K82K24m00J76l12
6109a73K47K9j00j41P7j50J70P8L2k05l1J27LP6r5Qj69O09o33M20k95K80j67J2
6133Ik23J92m2N4J38m2M2j96J2l2Q2J42k14M3L60m51J47R6k1m3J2Mk11K35P8k02
6159c1J07o4k8K11l25J71j26J33k6n07L24P9R5K49k48L44o3j89N1k93K96j35n0
$$ y = [-59, -69, 187, -103, -46, -45, 236, 189, 247, -214, 14, 26, -367, -113, -266, -218, 25, -51, 292, 310, 153, 245, 140, 172, -115, 97, 164, -96, -29, 341, 91, 106, -189, -68, 343, 189, 29, -144, 13, -321, -6, -68, -265, 420, 113, 1, -134, 573, -60, -284, -330, 97, 89, 183, -30, -17, -49, -203, -3, 99, -302, -221, -82, 153, -99, -163, 9, 5, 97, -121, 315, 75, 125, -130, -173, -239, 56, 216, 81, -43, -52, -39, -159, -1, 45, -7, -126, -6, -80, 199, -89, 171, -91, 330, -201, -56, 135, -6, 66, -207, -125, 210, 82, 262, 105, 74, 140, 129, -161, -143, 139, 363, -37, 139, -173, 74, 103, 3, -138, -61, -211, -41, 37, 69, -136, -167, -40, -37, 39, -56, -48, -217, 392, -241, 179, -116, 164, -3, 9, -214, -22, -64, -10, 128, 86, 128, -68, -56, -88, -6, 136, -78, -35, 325, -126, 21, 117, 96, 53, 65, 69, -142, 93, 171, -31, 76, 12, -16, 195, -130, 41, -85, 48, 22, -485, -161, -82, 13, 262, 14, 358, 295, 106, 157, -136, 160, 25, -25]
6182b5J66l22K07J31j02j13M33l9j39j59J78j81j41J8N0K5M0J66k68J82j65L16
6204B58j94n1np1K16k30M17j10m16J69j73L54N1k50j17m2K88k35J5J66J09l95
6226b46N0K98l5k22K5J11k7n8J71m4K44j53N1j69m30K79K00k89K08M8J61k60K18
6249A31J7n4P1k01k8K19R3m08N18k62k71J50J47Ll3N4j7j13J5Oo2l3K08j78p2
6274a00J49j94J74j58J78pK00k95L21l31J35j33R3O0N0k22K80Pk42J45R3j25j23
6297d5J82k23O9n5M2k74L72j73L16q6k18K88l15M3K00l96L77l66L38J29n26K61
6319f0L0N4j24qJ28Q6l30J75l21M92l9j32mJ28l47M0oN58l73N4J8M6j95L00J61
6344C31k72j62J25k2n6j48J47q1R2J94l60K86l7j82K83N8m39L78l11J18q9N0J59
$$ y = [-25, 141, -181, 26, 157, 55, -58, 375, 336, 197, 38, 216, 35, -106, -88, -38, -13, 27, 193, -75, 107, -58, 258, 64, 13, 8, -63, 153, -77, 340, 230, -186, -17, -190, 164, 215, -35, -152, -194, 94, -141, -126, 40, 149, -246, -196, 102, 67, -155, -130, -19, -46, -104, 67, 23, 267, 114, 165, -4, -434, -155, 45, -244, -36, 12, 173, -87, 131, 148, 94, 165, -36, -64, 155, 248, -160, 358, 96, -175, -25, 122, 125, 92, 146, 129, 16, 31, 37, -25, -58, 150, -28, -100, 49, -145, 29, -129, 49, 42, 242, -53, 268, -63, 72, -61, 32, 92, 142, -80, 200, 207, -35, 110, 203, 78, -45, 137, -86, -17, -72, -30, -304, 68, -105, 211, 125, -93, 195, -120, -77, 123, -273, 104, -262, 76, 205, -321, -60, -30, 24, -100, -108, 20, 106, -224, -49, -370, 122, 83, -49, -53, 75, -272, -232, -238, 320, -53, 1, 19, 65, -130, 170, 331, 59, -103, 22, 0, -56, -204, -57, -138, -46, 148, -212, 74, 37, -145, 138, 196, -243, 135, -176, -58, -147, -97, 62]
6367F2j40r0J23J65l10L58j72L1l41L57l59M64k09J67k09J83J63l94K26P4j47
6388BK85q9m3M8n0r4K2l9j03l4J84Jp4P6j10K54m13n9N0K41N8j96L04m17J34P7
6414A5J75l06L0Q9k5N7k73K45j26J42RR7n3j28K50k3%k44K1J16j75M1J5k7K55
6439A77j3k22k5J49j31j28K97J56J2k49P7p7p2l59K89j93L62m5n2J16o1k22L78
6462A64k51k49M64k18k67N43m38P9K79m6l15K69O2j26J8j93M17m48j34N07j8K7
6484A26k67L71r2K13l06J4r4q2K82o1J37j25j57j62K05J74j05Pq6P3P7p0k68L43
6508A47j63j1j50J35kM5k92O25k35j15J37m2j17R2p1n2R8k48J24J25J50k79K20
6531A21l53n7L07l3K4j12K37j90K32j34R4k0k71K46l00J82k55J76R6k23K59J72
$$ y = [62, -78, -168, -45, 120, -190, 168, -4, 27, -314, 43, -316, 148, -61, 106, -103, 80, 243, -151, 75, 149, 2, 287, 198, 155, 203, 153, 59, 81, 42, -61, -95, 89, 90, 16, 92, -18, 236, -177, -236, -186, 55, 113, -83, 221, -196, -62, 15, 190, -116, -86, 3, -22, 35, -238, 7, -119, 23, 32, 129, 76, -52, 198, 175, 175, -69, -48, 68, -107, -66, -51, -78, 177, 164, -58, -83, 66, -65, -193, 104, 260, 272, 23, 100, 23, -49, -408, -119, -312, 50, 5, -47, 69, 8, -214, 164, -87, -336, 128, -90, -357, 186, -252, -173, 106, 60, -255, 14, 76, -50, -32, -225, 192, -256, -390, 117, 99, 126, -141, 230, 138, 351, 45, 59, -35, -117, 165, 104, 241, 116, -41, -203, 2, 176, 71, 78, -8, 65, 142, 72, -196, 147, -16, -27, -177, -42, -44, 1, -291, 334, 99, -16, 121, 79, -38, 54, -17, -69, 29, -219, -95, 30, 180, -99, 121, -232, -289, 18, -15, 9, -103, 134, -56, 176, 42, 136, 116, -155, 91, -209, -27, -282, -106, -10, -233, 26, 198]
6553A98m08J33K83l48o0J31J95m31M00l0n3K14R7l19O6j91K26l13K92J56k8r3
6575A17k56J69j4n2N3J94k71K86j86n7m1R3J11j45M9N7l05M89k26J59J1k12M5
6598F8k00K20j20K76k36k86M00k08k4J47l6k81K43L8r6K72k11J87l92L82l07j05
6620b69K58r5K6J16r3J89j25m41N69M0k08k9Q4m17K31K59o2J46j06l49L26j25
6642g5K48k7m28P0L73J66l16l54R0K47j83L66j56K92n3k56K49j72j53j11K40K77
6664C34m38L25k82K32j66K11m12k05L40M6k11P8J36M30l31m14L13J81J99J32m82
6685A6j54L41j85K29j75r7j41L93m04J97J35l19km9L4m8J64n9J36k20K73K2l4
6708E3R4O8o6m36J53J49K5Rj67j28J41Q8j22J72K91k50j37n3L46p0l79K21k0J73
$$ y = [198, -210, -77, 206, -142, -202, -71, 124, -307, 93, 63, 10, 224, 321, 2, 68, -123, 103, -210, 82, 238, 210, 117, -139, 30, 16, -36, 17, 211, -60, 226, 40, -17, -58, 35, 146, 1, 50, 107, -198, 291, 65, 224, 235, 23, 68, -132, 88, -32, 244, 8, -278, 122, -86, -110, 37, 1, -280, -37, 1, -95, 177, -34, 153, -239, 143, -164, -269, -11, -106, -80, 36, -57, 132, 7, -434, 135, 175, -33, -62, 22, -395, -164, 95, 33, 179, 73, -276, 50, -75, 173, 146, -282, -212, 161, 327, 11, -343, -253, -6, -189, 177, 21, 313, 260, 4, 253, 81, -72, -183, 57, 334, -104, 221, -61, 171, 5, 216, -196, -401, -61, -15, -226, -148, -12, 418, 87, -327, -14, 167, 366, 498, 16, -138, 203, 18, 247, 72, -25, -166, 227, -177, 20, 155, -164, -166, -215, -181, -229, -65, -124, 12, -208, 65, 87, 53, 147, 215, 149, -287, -134, 15, 40, 49, -118, -246, -105, -17, -139, 33, 324, 74, -63, -116, 230, 160, -219, 2, -18, 155]
6732A55l16J74j00rm1M66n11O8L47o8k01M3j42J79K13l75K5j35K37M5N79n36j39
6755d2Om81O45l32K22j07K6L0R9R5k66J53l05n4K93N2q2r1K59j37L24m28J40Q8
6779A07j37L04m50P2o2J02J39j21k29L84n8r3Q0m5K08j33l37K63L68m71R6Pk09
6802b15K35K17l78J05N5O1j5m8j06j60L2K23j91L22k03J26n2K50l20j03J49N5
6824C9L51n15R6L16n5j83L7k40M5J65n1O9n1k51J93K24j42r7M9J01P2L37l63j87
6848d1K45l92J98Q2k36k39K02m8P7K86j18l19L10O5j93J16Q9m2q6J63k36K50n14
6871c81K70J77j11M32n84K18k27K01M7k55O8K10k34N1K16k31P2n3J27Oj50J67
6893C6j66j1n4L46k14n7L10m5l17K03j46J76J31k91L17l66J16j55J72m9k8J72
$$ y = [155, -161, 13, -87, -96, -137, 329, -182, -114, 233, 165, -36, 7, -135, 44, 257, -118, -93, -228, 9, 54, 633, 97, -42, -36, -517, 128, -204, 18, -89, -63, -33, 66, 161, -105, 48, -257, -311, -18, 34, -48, -139, 120, -17, 307, -121, 19, 107, -30, 274, -176, -104, -166, -64, 75, -46, -275, 109, 51, -42, 38, -7, 201, 68, -269, -6, 362, -109, -13, -6, -215, 20, 237, -141, -36, 19, 80, 65, 17, -89, -249, -217, 6, -185, 137, -66, 60, 8, 258, -62, -165, -16, 39, 390, -125, -29, 287, 232, 49, 86, -154, -109, 56, 5, 74, 23, -228, -35, 189, 47, -50, -1, 100, 172, 509, 146, -41, 204, -188, 10, 92, -144, -383, -181, -229, -152, 134, 16, -303, 7, 72, -121, -5, 84, 42, -44, 119, -117, 133, -381, -111, 66, -45, 387, -197, 21, -206, -5, 42, -213, -145, 65, -169, -118, 98, -133, -61, -114, 13, 19, -131, 36, -130, -141, -195, 151, -63, -120, 190, 145, -172, 31, -115, 61, 192, -99, 218, -148, -32, -187, -15, -64, -92, 80]
6915H0l83J42J62j7K63m18M81k63k24J47O6L8J08jj32j18J03l5j77Q3Q6m8k03
6938b60M39j18j72L63k62J3P0k29L0N5J37j99K3J41l26P06k38j85K8l4K3j66L25
6961A64o9O3L7Ol70O7J34j3o6j22QK85q2k97P5K43Q4j02j23ON8j14MLL8j01L41
6988A57j00N2j70J9r2L02k73K13j55j31l4J36o9q4k0N39l60M1j64j7K67k72K79
7011F4J12q2k97K07j24k8L13L0j14L7q3K07l66k88M31j45o4o4K43N2J45l38R7
7034e5J72oK26j8n36K6K34J6%n35N49K45o7r5j54K59k35k08M15n13K71J33l18
7057a94L71n18K52J6J43l99L19j21K27q8K53j57l4j00L0k5q9qJ71m4p4P6j1j61
7081a65K34j86L49j43j85o3M41k21j31K03l73N49k14K14l47m2N4r4K18j12J00
$$ y = [80, -303, -161, 1, -16, 247, -171, 310, 47, -177, -30, 36, 74, 182, 181, 49, -69, 34, -1, -178, -95, -9, -57, -260, 179, 61, -111, 252, -10, 3, 73, -156, -126, -71, 66, -133, -110, 31, -295, 411, 173, -12, 16, -18, 5, -161, 164, 95, 158, 195, 201, -169, -102, 32, 19, -47, -169, -161, 124, 42, -255, -180, 63, 147, 45, -78, -72, -14, -128, -124, -121, -83, -184, 157, 57, 109, -61, -42, -134, 168, -105, 108, -47, -178, -212, -76, -145, -229, -249, 290, -70, -29, -193, -210, 57, -215, 64, 176, 94, -203, 4, -120, -148, 165, 195, 81, 118, 35, 242, -124, -412, 19, -126, -190, -254, -11, 41, 186, -152, -55, 117, 111, 337, 319, -217, -191, 43, 59, 59, -476, 73, 318, 251, 156, 2, 261, 26, -182, 233, -280, -9, 124, -194, 177, -341, -89, -73, 70, -329, -10, -131, 96, 8, 261, 104, 70, -30, 0, -25, -114, -122, 49, 5, -69, 7, -4, -165, 69, -117, 232, 89, -96, -159, 282, 61, -70, 133, -240, 309, 95, 309, -38, -80, -26, -120, 98, -14, 86]
7102H6n0k62M29j46R2j66j44K19j66j30L92l52J45k8P3j73J20J61Q4j77j0j2K2
7125GK9k13L4J41o2J33j41k03J6L06O5k02k19K86m03N20q6J11j90R5O5j54J19
7148E4k56L45M4l81J29l0J23k95L31M7k88K49LM1J71j51m36K23R0O7k74L06k69
7171a57j3J48K01r0p6k73K66M28m21j73K39l63Q0j9K63K1j39M0K32r7M8m02J56
7194a01K50o8J7jl34K95L9k3n2R2j1l60K43R5j40J60Rm8J61m66K95L1o6r6OL0
7220d3j81L46k19K73q7k8k31J00Pk70N13j09k1j56M5Q7Pk14L23j01j8R0k47N4
7244h0J33j51j66L98j92J75k86J28r0J80k16K16o6K16k50K76r0k42J12P3K1l2
7266F7j59K74k00j9L33l25Q7o0l8J04p4rK97l11J67n9j45nM1K64j76M38o82j61
$$ y = [86, 36, -226, 203, 57, 149, -17, -161, 58, -108, -238, 154, -198, -53, -81, -8, -181, -61, 100, 184, 7, -3, -15, 7, 36, -177, -143, -2, -64, 69, -72, -275, -259, 47, 112, -90, -309, -23, -426, 94, 8, 119, -71, 24, 89, -65, 54, -202, 143, 187, -194, -65, -95, 28, -267, 64, 111, -177, 72, 75, 116, 287, 136, -300, -77, 13, 80, -194, 112, -157, -170, -22, 179, 89, 13, -260, 6, 434, 13, -160, 79, -284, -204, -223, 40, 61, -78, -38, 194, 97, 145, -257, -101, 149, 81, 98, 97, -237, 58, 97, 74, 22, 114, 103, -257, -14, 81, -59, 101, 110, 62, 223, -243, 52, 83, 17, -79, -73, -43, -224, 122, -97, 176, 89, 61, -170, -70, -63, -333, 180, 71, 50, -106, -61, 26, 33, -181, 142, 41, 23, 113, -134, -80, 53, -98, -264, 134, -58, 117, -169, -41, -131, 49, -167, 49, -17, 199, -51, 225, 135, -107, 5, 78, 99, 67, -92, 182, -18, -37, 296, -29, 58, -2, -40, 64, -10, -19, 278, -33, 134, 75, -70, -75, -34, 230, 54, 492, -190, -351]
7290c51L62J64j67l1j02J77k48K78j61K23r3J38j0j54j41J80k07P5L41k54k3n5
7312e9J52m06K96N3k00R9j08J86k3j82L39l63pJ64j13J65O4l79M97j72J8m5j50
7335a74q6L49j02l7n8L84k37ok77K23o0LJ16kk91L40J13j13J2L0n3k50J28J26
7359G8k9l5M49m89q5O1J35K4k89K68k42R4J35N3j97K75k11M4k50K16K84k64k24
7382a99r1M44k31k11L67j33o4J63L1P8O8m28L83M6k88J78o85O39J43m83Q5K12
7404B4k49L43L5J29k71J9j0r8K60n9k29R7O3j22m4K06k93N2N7K22k3k77q6K58
7428DJ07j20N2k14J37J21J69K3j44m89K91Q2j43N56l46j20L6j87K41k27l7J30
7450g8J7P0P9j01j29J57j46o0K47k66K50Jj43q0J86l5j07J25o1OL56j7m62L16
$$ y = [-351, 11, 175, 8, -23, -125, 52, -196, 82, -79, 144, 51, 189, 179, 25, -116, 64, -143, -68, 273, 19, -4, -59, 93, -313, -17, 36, -164, -65, -173, 13, -10, -192, 147, -216, -223, -59, -172, -7, 57, -322, 175, 3, 21, -24, -174, -260, 89, -13, -50, -108, 276, 39, 33, -244, -21, -81, -78, 38, 36, -255, 85, 198, 85, 97, 127, 74, -176, -48, 78, 49, 14, 463, -26, -111, -50, 85, 109, -180, 88, -154, -60, 75, 128, -69, 206, -5, 39, -211, 5, 289, 25, -199, -290, 154, -77, -288, 79, -54, -118, 45, 76, 154, 222, -206, 177, 223, -65, 113, -572, 67, 210, -273, -188, 24, -225, 118, 153, 282, 11, 30, 20, -78, 182, 123, -106, -9, 54, -68, -112, 94, -199, -147, -90, 132, 109, -168, -254, 4, 111, -9, 43, -171, -34, 87, 256, 279, 135, -354, -63, 19, -124, 432, 86, -34, 2, -185, 56, -171, -208, -78, -61, 9, 88, -13, -142, 15, -131, -191, 56, -210, 40, 41, -102, -182, 4, -31, -138, -13, -74, -68, 288, 271, -191, 125]
7474A25j90j32L7K38j69m1p0M23k10J52k41K21j04L8N8l1j88J61j27K55n11J43
7496a63L2j62M41l20M60m50Q8j78KJ77j70J82J36L26o47K73P0j42q6J37J13l56
7518b37K35j55M46m62M10k79j20J60O0J93l57J54n3Q2O8k79K0j5O1J71l64L17
7540E6j11r0J8m8J75Q2j54J71k11K31J83k85j06L6O1J55N4j12j77K25k29K34N0
7563B08l47J92l18J57J95l39J90j12R0K99l19p8J15K06j23L2j19J13j22J68o1
7584B7m7J68m07M32j95o6l2J76l4l26j6M58j07O6r4j84K52j52p5L8K32j46M9j22
7608a05N2K90l63M4j04j35K34j6M3Q4l31J82K68k05Q0j5J44l86R7J97K71k58j03
7631c5J75k60K13J52k29k29M37j36k81L19J95j93q3J05P4o20K92J50m2L02l79
$$ y = [125, -65, -197, -160, 78, -91, -132, -202, 221, 11, 163, -78, 143, 39, 77, 135, 104, -84, 77, -50, 205, -306, -163, -131, -293, 148, -172, 288, -162, -74, -252, -250, -73, -243, -61, 75, 401, -246, 27, 97, -45, -131, 6, 119, -237, -2, -157, 289, -173, 237, -42, -162, -2, 58, 251, -106, 48, -5, 77, 145, -134, -114, -129, -68, 103, -261, 56, -55, -145, -127, -175, 0, 82, -72, 99, -112, 119, 302, 17, -89, -53, 8, 163, 217, 105, -72, 153, -76, 158, 208, -139, 53, -265, -108, 87, -252, -62, -174, -84, 215, -104, -182, -67, 139, 16, 48, -71, 42, -80, 88, 27, -20, 148, -259, 173, -22, -88, -120, 56, 22, -304, -320, 138, 31, 97, 3, -181, 71, -81, -156, -118, 114, -32, 17, -105, -53, 237, -126, -82, -186, -321, -87, -103, -60, 24, -307, -125, 143, -62, 18, 3, 147, -239, -142, 55, 326, 68, -35, 140, -120, 93, 245, 16, -213, 224, 88, -193, 126, 321, 128, 45, 150, 224, -396, -104, 46, 4, 306, -73]
7652g3J31k77K13K01j19j59L37j54k99K02J23n5O6k1R3l19J38r6M8K74l27J97
7674A24k24L34j54m1J14k11k82L51k50J83J13J31k90P1K59l30K23j91J48j69J01
7695A0N9k77K31R9k04k15K40L7J90j69j31L33j68Q5m32L63J1J41j32Q6l14Rn5
7718b03J91j01N4k8j2K45p5j41O4j25O6Q5L7k79N3MJ15K27l71O8L58l04Q9k28
7742b11M14J51n10K77k17lK13P7k70l5K46K2k07lK6k03L47k24J49J65J5n05N69
7765B83j64L7l03L65n30O21l96J37o4m9j91M97j3j99l24L14J86r1p0j24P9M7n9
7788a1j37L40j48Q8k12R4j39L53nJj85K8o9m6J99j49J21k9l15L67k63O0M7P3j03
7813d0M85o78J52j52Q8K30M5k10m7O9q0p5RL57l04L38l21K19M2l05L63m3l00K86
$$ y = [-73, 58, -219, -6, 195, 76, -83, 254, 100, -199, 3, 126, 71, 137, 116, 209, -110, 28, -68, -20, 254, -73, 124, -100, 234, 80, 39, 153, -58, -340, 11, -239, -56, 57, 188, -102, -31, 228, -102, 121, -70, 78, -91, 10, 69, -208, 23, 122, -82, -297, -57, -20, 170, 1, -130, 203, 35, 120, -312, 51, 62, 203, 71, 157, -157, -148, -203, -12, -113, -59, -87, -99, 146, 71, -70, -6, -131, -65, 20, 57, -222, -169, -165, -50, 177, -194, -126, 232, -72, 17, -211, 203, 354, -156, 121, -96, -99, 114, 191, -79, -114, 132, 154, -53, -56, -30, -233, 114, -110, 39, 204, 219, -286, 283, 119, 156, -147, 218, -312, 309, -87, 50, -14, -63, -254, 243, 230, 31, -293, 21, 207, 116, 46, -78, 1, 48, -11, -148, 192, 44, 132, -80, 14, -125, 228, 223, 224, 39, 67, -2, -48, 151, 2, 123, 94, -221, 146, -117, -57, -10, 63, -40, 445, -233, -81, -233, -145, 85, 130, -80, -127, -58, -138, -213, -204, 153, -151, 187, -134, 85, 127, -178, 185, 142, -158, 128]
7837A28l26Q4m0J52p4R2L1j97J3J04J99k34l0K67k34j17L44k17L7J3j50J06L41
7860B92j25k25J91J51j08j12m3k8OJ4M4K86r1l18k1J99k39l55L21l4M42m10J48
7883a5N4L2K27n08L85k94j3J77R4j47o6k29K74r6K12j22q4M2J64k49Q3J26j68
7906a21q7K86K8j44J84M5k77J15R1j17K42l61j21L28j50j99r3N38k32j20K75k26
7928a16J59R7k65J02N6P4j14j56K16J02k17j41L04r9K37l79M71m84K22K87j18
7949B38j08p9J58j68O7m67K42K7j08M11l49P8j14K83P1k74K31kJ28m76K68l8l2
7972a3K48k67J09k21j6K25p1p6J20j15n3L76k2l07J45n6lro2n5k6L24j54p3k8
7997h0J08J27k4j6k1Rj29l23K46kK19K4j62j54J86j81J31J38j96J8L9O3l9K49
$$ y = [128, -198, -114, -154, -2, -76, 16, 47, -150, -137, -33, 166, -68, -98, 169, -65, -182, 162, -55, -18, -5, -155, -49, 292, 167, -58, 133, 284, 176, 64, 21, -7, -1, 13, 57, 343, 252, -66, -87, 112, -127, -482, -161, -195, 247, -163, -15, 39, 71, 298, -210, 175, -119, -132, 45, 139, -8, -74, -303, -29, -125, 87, -35, -119, -77, 87, -162, -79, 47, -121, -208, 78, 106, -38, 146, 191, -86, 29, 120, 3, 245, -116, -237, 91, -59, -258, -351, 187, -45, -165, 110, -116, 43, 140, -125, -23, 33, 107, -7, -163, 53, 155, -62, -203, 101, 2, 239, -140, 331, -153, 69, 356, 238, 130, 51, 209, 41, 108, -359, -117, -90, -198, 213, -136, -58, -172, 111, 182, -92, 139, 137, 265, -211, 57, 19, -13, 235, -32, 77, -144, -160, 65, -6, -82, 38, -77, -130, 246, 224, -83, 62, 6, 3, -6, -68, -123, -149, 175, 21, -52, -80, 28, 155, 131, 115, 94, 103, -26, -349, -103, -105, 114, 138, -24, -178, 8, -173, -42, 96, -100, -82, -43, 20, -19, 230]
8021B30l5n9j39j98M35k96K5O6l6q0J48K72l93J1J34K98j94l70M03l04j8M8K32
8044A80m1j71J0j11L0Nm1K08K28j64p6N0NM4R5m71K67j99L67l79J94o7m3J65l6
8069D9P5j32o5j50L05r4j89N12k76J19m37l0K45k13J72P3r1o5K28K54m81L55j60
8092Dl7j3K59J02l70K03k55J31k44K61o8J4j9K8Q7k20M8K66k55K9J21j84j27J47
8116i2J50K1PJ66j11n6j59J53J61J62n29L02jj27l86J56J55M3K15m00J46M4j95
8139a75L23k41N5l85K64K01k2j09K56j40k2M0j57N4j15L2K23k28L44j20j24J67
8161A21P4j30m0kr0p5L42ok68K53m05J90l34M31M3q2J01P3m33K86KJ2j08M12n25
8186a58J11M0K36l83J17
$$ y = [230, 195, 136, -3, -201, 234, -62, -37, 29, -7, -87, 61, 333, -60, -49, 85, 383, 189, -181, 222, -82, -100, -52, 180, 139, -32, -22, -133, -103, -98, -139, 69, 297, 133, 57, 107, 112, 156, 251, -220, 47, -152, 215, -164, 30, -37, -80, 85, 49, 124, -8, -73, -223, 82, -12, -201, 311, 35, 154, -283, -313, -68, -281, -109, -36, -127, -192, 36, 290, -191, 164, 4, -33, -46, 213, 315, -55, 148, -107, 24, -220, 41, -27, -13, -32, -4, 83, -137, -89, 177, -78, -49, 72, -112, -239, -92, 58, 79, 86, 252, 141, 85, -74, 79, 240, 402, -127, 175, 174, 47, -339, -183, -28, 15, 230, -170, -24, 20, -175, 148, -93, -38, -423, -159, 42, 20, -89, 167, 27, 5, 45, -112, -58, -173, -141, 82, -146, 198, 78, -46, 121, 195, 65, 25, 23, -67, -142, 200, 194, -74, 179, -226, -36, -370, 61, 104, 22, 123, 196, -237, 49, 51, 63, -45, 367, -158, -47, -7, 229, -154, -37]
8191c7
$$ Imaginary data points
##PAGE= N=2
##DATA TABLE= (X++(I..I)), XYDATA
0@%%%%%%pJ4j4J4k1K8l3M0m9O3p7R1j05J20j41J68j96K25k58K96l37L82m34M90
30B59n53O24p01P85q77R79j088J208j342J488j649J827k024K241k481K751l055
47a608L400l795M251m783N415o184P144q380J0036j2390J6033k2492L7453j38358
61a14258q5543J20249K935J01750R9804L5958m2193k1536n0904p3631p3662j1377
73a12408K2783L9313L9141N7242L1766q542k8190j7305l0735l7715j9035J6735
85d6950K4889K2085K3089K9898R683k5417l4091j5652j6012k2491R62K7578J8072
98d357P908K2054K0261q350j9687j0856j4674k0618m936J2447J2730N972Q260
111F154J1723L181r596j0037k814o234j0260J864J4041P830J053M645L819o009
$$ y = [0, 0, 0, 0, 0, 0, 0, -7, 7, -7, 7, -14, 14, -19, 21, -28, 35, -42, 49, -56, 64, -77, 91, -105, 120, -138, 158, -179, 203, -231, 259, -294, 330, -371, 414, -463, 516, -572, 636, -706, 782, -867, 960, -1064, 1177, -1304, 1447, -1608, 1792, -2003, 2248, -2535, 2880, -3304, 3840, -4540, 5496, -6894, 9139, -13353, 24100, -114258, -199801, -79552, -76617, 25133, 124937, 160895, 118702, 97166, 46262, -27369, -101031, -112408, -89625, -50312, -11171, 46071, 77837, 69295, 41105, 23800, -6935, -44650, -63685, -46950, -22061, 24, 23113, 53011, 62694, 37277, 3186, -12466, -28478, -50969, -50007, -22429, -4357, 3551, 25605, 45866, 37516, 17829, 6973, -7701, -28319, -33255, -20808, -8078, -2106, 6154, 17877, 21058, 11462, 1425, -1389, -7623, -17883, -16019, -1978, 5852, 6905, 11550, 15369, 9360]
125I360j0765m734n24m795m031O783J0427K702K404O665j76r624n844L57l433
140e228m464K275N057K067J118K888K468j902m618k634Q08p49r34K940M331k88
156C135j625J779L13l951k910K5K25j515J231M101K237n85n7J242j091l548n38
173a532R41j639n75J653J872l80L06Q07n2j396j091K50Q21p00O1J288Q32n69n02
192C95M85o54j326o63J040j63k11J064J444j35o46L88L21j461q43M99J34k71K3
211e80Q84l2k24J69L63r8p89O6K75P6k58M69l1J42n69J73J95m60k44o8N94n1k80
234b78O35M31n97k67L27j92n1k82K78j79j11L76k10L06l19J03M46m75j99K61M49
255D52o15J55J92j93q0o3k5N02n06K1L16j01k36j46M35r3p0Q2j35N1r3N2K90n78
$$ y = [9360, -1405, -6139, -6663, -11458, -15489, -8706, 1721, 4423, 6827, 13492, 13316, 3692, -2152, -1795, -5228, -9692, -7417, -2360, -293, 825, 3713, 6181, 4279, -339, -2973, -2165, -2914, -3848, -908, 3423, 3135, 1510, 3289, 3602, -349, -3259, -3234, -3009, -4524, -3293, 808, 3045, 2460, 2403, 3645, 2554, -994, -1532, -591, -2230, -2805, -1152, 720, 340, 646, 1453, 1401, 5, -1086, -836, -15, -715, -654, 634, 1466, 897, 395, 880, 226, -1100, -1763, -723, -886, -1097, -33, 1411, 1276, 630, 1018, 1339, -122, -965, -466, -332, -603, -580, 304, 272, 48, 217, 580, 482, -307, -241, 34, 110, -148, 321, 290, 432, -137, 36, 231, -229, -473, -541, 53, 2, -278, 357, 788, 191, -76, 251, 59, 8, -274, 4, -175, -286, 90, -120, 186, -133, -30, 416, -59, -258, 3, 452, -163, -8, 184, -9, -89, -152, -177, 325, -181, -160, 156, 55, -181, -327, 108, 15, -55, 27, -108, -57, -150, -98, 192, -386]
279c86K05J09J82q1r4J42k8l80K22K33l91R8J32j3j11K23n1N5j29J77l37L21j94
302i6M0K46n3p2m0K79j66n6M8j61M1j8m85M69M3j04j0O7j12J10K9q5L3K00j12
327C5J4k40Q7J06j49J20j42J93k1j65J01K53l25K23j53m7j4k93K17M39k80K04
349A63R6j47l6K2j1l4k51L40r7k01J41j47L28k23j67K14j8k1K28j12J89m77j8
372b39k12M90Mn3J75j25K22j83j63J35N7q4n0Q4k34K26K40l81K6J0P9l4j14R0
396c4o8K73j51J32O6l76L91m58K41l27L12J80k14j61K02j02L27k38j21L75l77
417a28k42L84J38q5Q3j19k63J01K89l36Lj05L09j34K16K18l83O4j1K3j78OK11
440F1mJ86Lk10m4Q9q8Qj00R0p4R6j54K70j92L9M00l58j60J23J62k86K06k69J79
$$ y = [-386, -181, -72, 110, 29, -65, 77, 49, -331, -109, 124, -267, -169, -37, -50, -161, 62, 11, 66, -63, 114, -223, 98, -96, -56, 190, 137, 65, 25, 304, 138, 82, 130, -31, 10, -8, -493, -24, 19, -85, -95, -28, -140, -30, -1, -86, -53, 147, 35, 49, -191, -104, 2, -147, -27, -169, 24, 3, -162, -61, 192, -133, 90, -63, -110, -124, -417, -200, 239, -41, 163, 259, 112, 76, 98, 87, 53, -198, 142, 45, -156, -15, -162, 166, -57, -224, -10, -28, -49, 179, 67, 256, -221, -239, -451, 39, 43, -10, 165, 40, 262, 79, -84, 51, 108, 24, -26, 58, -176, 50, 290, -91, -65, -55, 24, -10, -124, -34, -102, 171, 20, 152, 218, -158, 233, -225, 16, -311, 1, 181, -33, -194, 8, -94, 233, -5, -126, 249, -128, -370, 14, 152, 67, 150, 31, -232, -131, 158, -178, -175, -280, 29, -105, 111, 329, -54, 10, -1, 22, -156, -150, 61, 57, 243, 246, 36, -8, 81, -7, 1, -99, -9, -83, 13, -141, 129, -63, -24, 376, 18, -142, -19, 143, -143, 63, -206, -27]
465b7JJ84P8k70J59l4l2J07j38j78J40J13j59L0rOk07L03R1k37L6P9n8J97rk36
491g0l7J67j60n8J44J4o1N5k90L05mMm7J23K1L09p61K36L14j35k05N18n38J13
515d3l9N9M14k63J7m64K67k65K21L15l04N1O1J09j55n8J84k51L23m08J91J36j66
538f8K70r9j38k7r2L06l32L37K1R7j60m9l4K5k01L80k56O4n7j9r2Q1K47n69M16
563E1k54kJ04l78N07K03k24MJ70Rk71K29k90J72j37K92On2J4q0J81j41nk93J04
588h1j69k7M15l36K00j07J88k0J0n5j26M5Q3k17R7R8J43O5j34L3J23l4m62N70
612C02n25J44l7N2N23m45n8k40k8K40K54k53K85j25N2k25j16K03m3k7oN3J69l47
636a98J31j03K92K1k46J0o1M38j07j70n14N54j30k9J45K34l89QJ77N9N1j57m9
$$ y = [-27, -26, 158, 236, -34, 125, 91, 59, 166, 28, -150, -10, 103, -56, -26, -35, -29, -236, 67, 158, -79, -43, 36, -22, 175, 166, -70, -107, 60, -100, -158, -14, 0, -61, -6, -296, 9, 5, 9, -38, 85, 106, 415, -346, -110, 204, 69, -136, 382, -156, -43, -82, -23, 391, 128, 145, -319, -52, -317, -96, 219, -85, -34, 27, 136, -19, -77, 107, -144, 179, -229, -38, 98, -68, 202, 103, -35, -62, -154, 152, -180, 157, 178, 275, 115, 66, 32, 57, -144, 236, -20, 44, -13, -32, -124, -43, 204, -365, 51, -203, -205, -101, -479, 28, 231, 7, 11, 181, 190, -81, 148, -142, 30, -107, 185, 191, 139, 153, 73, 254, 113, 108, -185, -81, -250, -277, 138, -198, 2, -105, 83, 63, 73, 18, -108, -63, 20, -197, -100, -2, 141, 206, 72, 105, 228, 194, -268, 302, -223, -79, -116, -64, 459, 14, -44, -284, -312, -72, 182, -71, 214, 89, 141, -84, -200, 3, -40, -67, -73, -20, 149, -198, -67, -170, 122, 143, -103, -93, -154, 284, 177, 7, -507, 47, -83, -112, 33, 267, -122, -114, 63, 122, 173, 16, -33]
659c3j1J50l27L89k35qJ26k91J66R7j42J58o4k21J17J14j54L2R0r5L79k24L6j02
683e3r8L33j50J23k23j14L0J62o9M0J11k87L63j06L8K4R4L5K13n60k17J05J52
706e4o5J87p3j2m5N1P5j43J09m95K93Q2mj54J32PO1K43k54j36J80J9J98k98O3
731c3J79k36K59l06m3m0K22J01R4n02L85k28j20L72k57J2K01J26k99K10k21J9
753a05K9k45K97k46M83j94j49M8J90P2j96J00r4Q8Q1m91L93j10K7J79JJ19k05
776G2K48m42R2J15J92k65J76k01M03l53J57l39L6L45l13K99j68j44R9j2mQ3m3
799C3k35J80J41m6L3L3j05p4L15n46K56k94L50rj82k51L37M8j34P9j45o0R3L21
823A38k91j13K42K04l15k7J05RJ57j41K6o8q4j12L2K19k21K58k74L57q9l2K18
$$ y = [-33, -44, 106, -221, 168, -67, -75, 51, -240, -74, 23, -119, 39, -25, -246, -129, -15, -169, -137, -47, -142, 237, 13, 49, -53, -151, 182, 32, 155, -68, -182, -152, 10, -59, -19, 92, -195, 168, 62, 100, 124, 218, 253, 466, -94, -311, -206, -54, -119, 68, -5, -17, -62, -11, 64, -79, 30, -465, -172, -90, -94, -248, -116, -109, -48, 195, -59, -195, -15, 4, 202, -96, -33, 146, -90, 169, -137, -180, -220, 2, 103, 197, -305, 80, -148, -268, 104, -153, -141, 60, 186, -113, 97, -124, -105, -76, -321, -24, -270, 213, 19, -130, -82, 108, 180, -16, 84, -10, 78, 159, -332, 61, -49, -22, 157, 158, 277, 72, 320, -122, -30, 85, 277, 12, 188, -13, 390, 37, 194, -145, -109, 236, -77, 222, 54, -90, 9, -3, -7, 76, 33, -202, -22, 119, 73, 106, 139, 34, -40, 275, -271, -15, -309, 41, 32, -150, -401, -64, -16, -150, -71, -216, -276, -183, 138, -153, -266, -24, 180, -135, -162, -57, -48, 109, -32, -6, -74, -158, -270, -238, -19, -240, 18, -256, 101, 12, -20, 198]
846A98j36r5Pj26J82m9j29O6pK4K8J99m20M21j39k4J09R6l81L42k16J8J10K7R3
871A98R3j45m5r5j27J2K36r4J13l71Q3J05j03J60k63K49O1j80J93k77M05l73O9
894i6q3M21l70L32k76k85L95m6j95j13N98k04j04Q8K54o19L3J30J60r4k2K40J80
917C24p13L59J49r4n5q9K12o5j10O7L8l46K16j0j1J55j91K73l8k01K88j35rll68
942c57L36J43m75K52J49j21J4K40m4k70j05L78N1j40J37k48k84N1L27j09j78N33
964B80m28J75k37J28ooL19k69k53L79j20n3k28L43j27M2q5K6J09K57k08r7K78
987B19k30N5l9j25J36j37O9L4J07q9N6K2k80K88j41K33q4l6j93L26j8j54l45N97
1011B71j52n9k0j08K7J11k58J72J7j15l6K3J76k24M11Kq3Nj03J31q5o5L7p2J22
$$ y = [198, 62, -33, -26, -152, 30, -19, -148, -82, -89, -65, -37, 162, -258, 163, 24, 0, 109, 205, -176, 166, -50, -32, 78, 105, 198, 291, 146, 101, 6, -121, -109, 127, 33, 146, -225, -142, -37, -140, 20, -243, 6, 67, -113, 80, -197, 208, -165, -96, -179, 242, -128, 204, -72, -357, 38, -8, -203, -316, 282, 78, -26, 62, 316, -303, -270, -140, 20, -74, -96, 144, 324, -389, -30, 119, 25, -30, -119, 93, 28, -82, -15, 23, -323, -107, -117, -128, 27, -164, 109, 71, -130, 158, 23, 14, 11, -357, -21, 122, -353, -101, 48, -73, -59, 181, 137, -133, -238, 140, 191, 51, 188, -60, -344, -293, 34, -75, -253, 280, -148, 27, -210, -82, -88, -94, 225, -44, -297, 82, -38, -91, -319, 24, -103, -61, -146, -120, -11, 246, 38, -59, 219, -11, 44, 5, -120, 16, -121, -52, -18, 89, 0, 56, 78, -202, 86, -55, 178, 94, 58, -135, 191, 173, 19, -326, 271, 119, 60, 40, -68, -41, 70, -188, -16, 1, -114, -150, -127, 49, -175, 236, 238, 155, 160, 57, 188, 103, 38, 75, 3, 125]
1036A25k84K34l0l20K54r4J24l90M93K3k1j61M1pk17j43L00L02m30K89pj26J49
1059A04n2O3j47j11RQ3K91k24kj22n0L13j2j88O8N8k77N15k37J80m79N19l23j67
1083a88L33k44K17l55M5q5N03o4j47L3M1K7k67Q8J11j41J17j01j25M12k52K13
1105A71k80L29k73J62k69R8L24k90JK02l16r7j47K88k5J95j35J01Po3N7N1l38
1128b47N4Q7o9k26O42j12q2j92J45K3Pj06r2J02n4J82l79K92J0N7k27l4K91k03
1152a31K34r1K37j87j69K68j54J20M4k35p6J72J38k30R6J41k31j1p5o3J4N8J15
1175a6j17Jj30J08Q3J90m04J28N6K14k23J55j53O4qN0j61J17J4K8K43r1m87M25
1199H6k13L43m04K38j45l9L45m15N89n98K90l8L0m38N30k73K22j66N5J47k15J35
$$ y = [125, -159, 75, 45, -275, -21, -115, 9, -381, 112, 135, 114, -47, -6, -13, -230, -373, -73, 229, -201, 88, 81, -45, 104, 52, 115, -32, -143, -134, -51, 240, 16, 14, -108, -158, 155, 143, -45, 23, 81, -196, 319, 82, 262, -217, 302, -21, -188, 145, -99, 118, -237, -192, -277, 226, 162, 15, 48, 89, 116, -151, -63, 48, -93, 24, -77, -202, 210, -42, 171, -109, 220, -53, 109, -160, -62, 262, -28, -27, 175, -141, -238, -385, -97, -122, 73, -62, 39, 46, -17, 40, 91, -247, -193, -106, -175, -401, 241, 129, 47, -145, 0, 23, 30, -76, -168, -66, -120, 62, -317, -25, -15, 42, -185, -219, 72, -131, 103, 12, 249, 62, -107, 161, 7, 127, 171, -64, -140, 32, 170, -60, 36, 177, -54, -65, -140, -203, -189, -131, -16, -133, -132, -262, -154, -71, 119, -285, -157, -101, 113, -110, 45, -108, -44, -52, -2, -163, -46, -32, -4, 239, 148, -339, 86, -127, 216, -188, 50, -95, -134, 211, -204, 385, -213, 77, 39, 69, -369, 161, -112, 110, -56, -1, 146, -69, 66]
1221F6j49J12j54L14j26o6Q2m9k91N11k49j93L1L77k55n2LJ71j49Q0j90L08j54
1244b2j33J40j52J30P3j93J71j94K20J49l30J18K82k72l0n5Q2J92k13m5O4J18
1266A00j66j54J4J26L63o21K95j36K40k47N1K33k87J29R3K61l85Q3q4J17K32l47
1288i0J49N8l17K05j5m7M64n37L2n9J21J97j55M5m3j73J61l5j17K93k03j5o2P1
1312g2J73J39n2om58L40j22R6k37J85m36O80Q0l00J07j46p7K9J17Q9r7L07l65
1335b6J3L7K19n53L70J61l36K4J12N9O0k10K78q5k52J71j41K26j40j96J55%j12
1358a66M16k85n5L75m01J12l45N26k74j30K01P8l29J67K14k32J17Q3J28m62J57
1379a05P0Ok3j29L20l40R1K33m9P6mO6k94L0K85j33M5k20q0j43L74m4l4N2J21
$$ y = [66, -83, 29, -125, 189, 63, -3, 79, 30, -261, 250, 1, -192, -161, 216, -39, -91, -88, 83, -66, 14, -176, 132, -22, -155, -15, -167, -37, 36, -157, 14, -180, 40, 189, -141, -23, 259, -13, -43, -98, -16, 176, -37, -82, -18, 100, -66, -220, -206, -80, 283, -338, -43, -179, 61, -186, -135, 98, -189, -60, 33, 294, -91, -8, -92, 25, 257, -90, 59, 117, -200, 5, -10, -57, 407, -130, -98, -157, -36, 161, 6, 51, 8, -165, -4, -39, -156, 137, -66, -81, -143, -72, 101, 240, 188, 182, -276, 64, -58, 38, -199, -14, -450, 230, 310, 10, 117, -29, -106, -77, 40, 129, 32, 339, -26, -13, 24, 243, -310, 60, 221, -115, -91, 21, 80, 140, -70, 208, 123, -129, 42, -99, 127, -13, -209, -54, -54, -166, 250, -35, -90, 285, -116, -4, -349, 177, -97, -227, -26, 52, -277, -110, 104, -128, -11, 72, 200, -262, -105, -35, -29, -52, -181, 139, -201, -110, 123, 74, 150, 146, 212, -82, -52, 233, 100, 145, -75, -155, -298, 76, 32, -2, 50, 171]
1404A71l08J59k73M20j56j59L23k70j07J02R8O1p6L53q29M98k81J56Q6n4K12l0
1426I6l01J63k6K16n73N90Q1k17j12J23j20J22M4l14J36Q0k3J19o0q9L99k34j75
1449g5K63j53k76K57J1p1K99j96mk64K35P1l49J44J22k30J3K30k06m6L05j84R7
1472gK55l08m0j2J36l12L08j49J54N2K1r1n9J19p0K76j84q6r7J71j11nj79K24
1496Fj87J83R3R2m75K66L12k46k52J04J01j21L58k3R3K2j82J29j69J99k38j68
1518a03o9J57K48k61NJ00k50J94J9k04Q3K4K30j84M5L2k76m1N5J16K31j07o2r5
1542a13J14J50j80P0J80%m78J21J4J9P2l88J21L93j30J38J03j67j35j89M89L6
1564B40k71n2L42J2l72J27n20N58J16j68k88L27p5q1J30n5j61N7nK5L03n7k22
$$ y = [171, -137, 22, -251, 169, 13, -146, 177, -93, -200, -98, 0, 61, -15, 338, -491, 7, -274, -118, -32, -86, 126, 96, -205, -42, -68, 148, -425, 165, 246, 29, -83, 40, -80, 42, 86, -228, -92, -12, -35, 84, 24, -65, 334, 100, -75, 188, 35, -241, 16, 27, -44, 255, 59, 55, -209, 26, 97, -252, -108, 14, -216, -203, 27, -179, -225, 80, -104, -7, 248, -60, -100, -112, 24, -288, 20, -129, 25, 77, 98, 7, -52, 67, -3, 273, 89, 3, -94, 77, -34, -39, -218, 6, -181, 2, 95, 187, -288, -22, 290, 44, -208, -104, -3, -124, 234, 211, 304, 326, 144, 273, 104, 303, 65, -103, -172, -15, 233, -28, -23, 77, -173, 21, 40, -164, -81, -57, 173, -11, 34, 66, -210, -251, -196, -80, 151, 44, -18, -113, 1, 151, -29, 41, 221, 221, -257, -136, -122, -103, -31, -419, -298, 95, -35, 103, 206, 39, -96, -285, 204, 240, -31, -83, 259, 271, -101, 26, -494, 64, 180, 12, -276, 51, -24, -105, 25, -30, -191, -134, -139, -114, 189, 132, -90]
1587i0L81k15k94P1M2P5L04j38r6j01M8J21k26J58j15r7J40m1r5K92J10l47K99
1610A86l38K57m3L13l55l6n0p3j31M85r8l41K33O3Q1j95J93l0k2L7j5j90k42L49
1634C8O6l25K59j27j02KJ38O6jk06K61k98K55K57m18L89k60l7J8p8K23k82L73
1657B11K9m5j65L0k08K75q1j91k7J36J09pJ4j50r9K56K25l10J27k63rL77kn98
1681c66N95l49k0L29m52K85J32J6j58Q0n3r2k06L15J89j29j24m5l8j22J70J73
1703A30o0l51K82J4k65L57Q8l36J93MN0p0k04N60m65jr7j10K50j7j21N33m84j1
1727a31K71k36r8M28O0l28m0j47K77o8q1J60K6K51l28q2K04m0O5K4k44R1J12j25
1751B1P9l4K83l85j14J22Q0m2N7m0J78j82k49Q1L82K11N5m63L06l76Lj30q8j2
$$ y = [-90, 291, 76, -218, -147, -105, -30, 274, 136, 40, -61, -13, 108, -118, 40, -75, -172, -32, -73, -168, 124, 234, -113, 186, -152, 105, 62, 375, 20, -16, -66, -139, -270, 215, 117, -224, 9, 72, 153, -42, 151, 121, 99, 136, 121, -69, -311, 38, 104, -221, 38, -89, -191, -189, -51, 15, 14, -192, 69, -229, 26, 283, -135, 254, -6, -43, -25, -103, 120, -162, 211, 240, 195, 30, 60, -148, 127, 46, -145, -172, -36, 73, 66, 80, -70, -169, 87, 312, 2, 129, -134, -143, 234, 232, -366, 229, -120, -140, 189, -263, 22, 154, 170, 12, 92, 39, -53, -259, 56, 245, 116, -8, -53, -91, -213, -43, 130, 70, -281, 1, 15, -250, 107, 195, -141, 52, 56, 106, 36, -168, 392, -73, -74, -171, -281, -31, -48, -169, 364, -120, -131, 140, -96, -194, 234, 294, -34, -74, -221, 56, -12, -93, 67, 93, 344, 16, -66, 138, 98, 163, 187, -57, 34, 146, 21, 100, 66, 349, -36, -150, -28, 52, 10, 67, 27, 205, 23, -226, -145, 237, 448, 503, 40, 346, -30, -27, -157, -245, -257]
1775b57K67k15L21j46PM3l2j67K19l1j77J14q6M7j09J08N17n21K27k93L87r3l51
1798b21P0K17l4K5O3k23n2M7Q2m4J35j15j68L29Ol25n7N54j14k01n0J74p3P0J37
1823B32J4p4k18Q6j77J8R4n2l0k8K65r7j3R9j9MM8m6j86J91j72L26l48K48n0j12
1849CJJ36m33N15n2J06m82K73p3M6J7p5lK05l70K39K84m45K60j7j57J52J23n64
1873c11L85r2J01K09k48J81j15kj6n0J44Mm8j92k8J41o4K4K8K05m23N4J12N2k8
1898B3J24l33K69r7r6K30k76K10l43L83j97K02o2K03m18O01r0l06M1Nj0l09O8
1921a78J49p2j20K35K84k88Q6j65L01l37M5O3K67r6rk43J69k03J63j15j07J50
1943b1j96L66j35l9K15j32J44n05R7K83k55L68l45J70lJ23k60K79j24o8m5k09
$$ y = [-257, 10, -205, 116, -30, -23, 20, -12, -179, 40, 9, -168, -54, -140, -93, -202, -94, 423, -98, 129, -164, 223, 130, -221, -151, 66, 32, 57, 120, -103, -155, -108, -26, -70, 65, -50, -218, 111, 117, -208, -265, 289, 175, -26, -76, 98, 25, 95, 232, 246, 172, -46, 40, -137, -119, -25, -77, -107, -135, 130, 33, 20, 119, 100, 104, 152, 106, -80, 111, -61, 265, -83, 165, 115, 3, 4, 140, -293, 222, 170, 276, -206, 67, -6, 40, 57, -18, -21, 184, -186, 53, 337, -108, 152, 135, -22, 130, 253, -311, 74, -18, 83, 292, 44, 225, 110, 108, 92, 42, 186, 190, 142, -50, -78, 63, -1, 23, 51, 256, -167, -113, -1, 51, 23, 147, -186, 83, -14, -110, 120, -156, 54, -289, 94, -103, 99, 37, 240, -178, 423, 333, 27, 68, 73, 63, -246, -178, -29, -101, -221, 14, 298, 10, 96, -69, 232, -105, -60, 3, 270, 174, 165, -78, 91, -112, 51, -64, -171, -21, -217, 149, 14, -25, 190, 58, 202, -303, -206, 77, -178, 190, -155, 15, 12, 135, -125, 154, 30, -38, -83, -292]
1965b92L71l32L0O5oJ79L50j81k59j15L00j00K00j52j43k40K80J54k39J49K03
1986B22j54j48R6Lo1P5l72L16j68J97o9J39j02J73k14j7R0N4R1n7J59n85M99k70
2010a03J70J26k89J14J99R3k78K95l53n2K95l6l48L14l64L01j36J18m47M64J75
2031B58k60R3k61j93K28J23J09k74J26L2M6o9N9J59j60j46L21k82K77l99o1M25
2053A51J6m21J95k15K14J36k40p2M75k65J97m14K23O7J94k72L4K9j52J65J84k92
2075f3P3j57L5j75M5M38k07J56l34k3m1L37k05J07J25k01K47l23KJ65R5o5N0n8
2099B3J56j25P5K6Ln0J51r7l35J61k53K54p9K05n1o9J25k82n8J62M9o3N62n35
2123d5K20k93N9jJ48l61M91k86M04k47l67K04J55o1k65O5L51k30P3O5l57J64j34
$$ y = [-292, 79, -253, -223, -158, -164, 15, 365, 184, -75, -190, 110, 10, 210, 58, -85, -325, -45, 109, -130, 19, 222, 68, -80, 16, 19, -42, 33, -339, -23, -191, 6, -63, 76, -26, 147, -67, -84, 6, 60, 151, 94, 253, -332, 167, -103, 67, 193, -96, 18, 217, 310, 32, 327, -26, -78, 217, 181, -167, 147, -217, 84, -52, 66, -381, 83, 258, -2, 91, -170, -363, -135, -12, 97, -177, -51, -19, 27, -42, 17, 176, 16, -130, 191, -91, 186, -213, -274, 151, 167, -254, -59, -274, -60, 76, -164, -236, 239, -26, 171, -243, -20, 47, 241, -31, 3, 32, -120, 45, 229, -63, 10, -147, -112, -287, -242, 196, -11, 145, -189, -212, -253, 84, -121, -14, 111, -90, 157, -166, -164, 1, 96, 31, 81, 23, 179, 54, 129, 155, 158, 108, 259, 162, -173, -12, -265, -11, -90, 115, 64, -5, 120, -162, -220, -58, -9, -72, 490, -45, 175, -118, -59, -60, 88, -273, 218, -68, 336, 89, -278, -74, 81, 20, -245, -180, 171, -59, 14, 79, -278, -114, -248]
2146b48K40O4j86q0L10k6j35J68k45J57q8l2K51l76L80l98J86L3j32n7O51l09
2168A28j78k00J69J33k30P3j70L22j3j39J84L26m17k31Q7J42J30Q5k35m5L47l11
2190d3K81j14k25j9K95r3J16k5m67M49K24n45K02J5k52K94j79Q0n4j3K12l11j
2213a73J91l7K45Q2m77k0l8K0N66m04L7q8J70P6qj99J34l67J47N5P0K00m37R7
2237a58o4K79rJ3l9K5J1r8n3L01J18k13q9m7k18K10J91k87o9J13L52j54q3j01
2261f9L35k90J31J74k58k69K69K60k98J46q7l2j91L89l88L02j70k6N9K07o38P63
2283C19l88O1j23K71j20J51j7r4R5k61J81M47l30k93K16M8j6j84J33l8N9j85J2
2306e6r9K76j37q7M9N05n55J35K09kk57L7q3J95j91j4R0r4K38j60j03j7J00L32
$$ y = [-248, -8, 56, -130, -210, 100, 74, -61, 107, -138, 19, -69, -101, 150, -226, 154, -244, -58, -25, -157, -214, 437, 128, -50, -250, -81, 52, -178, -105, -275, 47, 34, -105, 79, 405, -12, -243, -156, -14, 116, 201, -34, -79, 268, -43, 238, 124, -101, -120, 175, 82, 198, 173, -294, 155, 379, -166, 36, 51, -201, 93, -86, -6, -60, -73, 139, -172, -173, 18, -19, 226, 308, -169, -189, -227, -207, 359, -45, -8, -96, 74, 150, 142, -57, 77, -290, -143, -88, -18, 182, -255, -158, -222, 57, 48, 61, 22, 47, 58, -40, -93, 208, 326, 113, 24, -23, -241, -31, 160, -127, -196, -83, 269, 115, 32, -69, 266, -24, 107, 281, 23, -246, 23, 283, -15, 131, 44, 12, -179, 210, -178, 124, -46, -72, -13, 194, -444, 319, -69, -8, -131, 140, 20, 171, 154, 60, 155, -106, 75, 522, 192, -101, 115, 163, 147, -37, 96, 58, 117, -68, -56, -155, 121, -16, -103, -54, 451, -104, 31, 240, 238, -19, 18, -65, 130, -61, -75, 15, -79, 159, -1, -104, -121, -21, 311]
2330C11j82l16L35k13j83L26m6j31K29rk41m5R3j4J16j54K88O8l96N8J27j13k23
2353c15K41J2K15l38j62L27P6J30j11J71j78J16L1k56J65l4l2k17L37k70K00j72
2375f4L04o3m09K36k2k6k04j77n1L46j77M42k01k49Q8J24N3j2J28j19LK02K49
2398D01k60l16J40k1k9J98l50O9L00j7r3J80p4j06j34N5o3l8kk3l6J65k6L4j77
2423b23K28K21l75J05J46j85J93j36j26J95j02L32k88n3K51n69N86k43P1M6p7
2444cJ1k9q4p3R6K46J53n09M75k55K16o99O75m87K51J21j13k19M3J65K88j31l67
2467b29N32l34K31j9l27K14J9J44k74J02o9J21j17k7QOR9k27q6K28L07l64K93
2490B31k71J38J01k69l1p5K47l38J46k2L12j50j14J44M6q6k47L16Q6p9k61K41
$$ y = [311, 129, -187, 148, -65, -248, 78, 32, -99, 130, 121, -120, -165, -72, -86, 30, -124, 164, 232, -164, -106, 21, -92, -315, -74, -62, 153, -185, -347, -20, 56, 186, 75, 246, 68, 184, 215, -41, 124, 90, 58, -159, 178, -92, 108, -64, 240, 177, -232, 4, -18, -44, -248, -425, -476, -130, -307, 135, -66, -315, -227, -103, -50, -62, 66, -53, -50, 152, 401, 141, -175, -35, -56, -85, 113, -237, -168, 132, 115, 22, 202, 128, 22, -112, -57, -120, -158, -160, -183, -219, -54, -80, -46, -223, 5, 226, -149, -44, 102, -83, 110, -26, -152, 43, -59, 273, -15, -68, 183, -386, 200, -43, 28, 74, -3, 8, -21, -105, -178, -82, 164, 317, -192, 283, 28, 244, -455, 220, -267, -16, 105, -8, -227, -184, -19, 269, 138, -229, 303, -31, 200, 181, -146, 68, 87, 231, -43, 59, -10, 111, -6, -33, -25, -19, 80, -147, -233, -5, 302, -62, 231, -40, 98, 199, -70, -101, -176, 71, -267, -121, -143, 169, 19, -95, 49, 95, 9, -238, 78, 164, 85, -176, 65]
2512F5n9j50O2N68q40L68J06l15J28n8LJ36J76k95Rp9Q0K3K39j69k95L74k7j14
2536f4J82j73m01O76j69j33M5K8k38L19k85J84j47pJ88O7n2J77k55J12j48L07
2558B13j63l01K24o5K26j61J30j7J2l69K96j64Q5O8K1l5O1j92J39j58r0p6J8N29
2582B31k34kK16n14N08mj32j15Q9J10l08R1q7J48J58J2Q5j63l86J38J27M4J24
2605A36k77N1J06J70n82jM07k33Q0j86L50j40j21K88N8j12P5j56j6M36k81J98
2627B50J13k39j97J79m2P5nm14K50Q0j86N8ro6L0L11j03k05RJ72j41P6Q6k61K29
2652E0O16p65R3P7r6R1k73J04J70k88L25R0k52J23k6m7K25j56p8j33O5J61J58
2675B34m56N02q5j97J14Rk86L94l51K76q9O6Ok4q1j45K11k26N0K76k29jJ12j60
$$ y = [65, 6, -144, -82, 486, -354, 14, 120, -195, -67, -125, -122, 14, 190, -105, -96, -175, -95, -72, 167, -2, -297, 77, 50, -64, 118, -55, -456, 220, 51, -82, -37, -9, -247, 72, -213, -29, -176, -183, 5, 72, 20, 197, -58, 54, -94, 213, 50, -251, -27, -92, 134, -27, 103, 86, 98, -271, 25, -139, -54, 14, 35, 0, 61, -131, 8, -150, -240, -316, -298, 231, -3, -5, 211, -303, 205, 201, 69, -46, 43, 153, -155, -64, -151, -3, 155, 167, 252, 89, -297, -159, -32, 12, 136, -141, -90, 16, 186, -396, -397, 10, -223, -143, -329, 21, -119, -240, 48, 106, -6, 69, -87, -103, 333, 52, 250, 363, 124, -73, 106, 64, 139, 134, -280, -30, 50, -136, -78, -87, -153, -123, 188, 85, -120, -111, 61, -80, -4, 82, -179, 50, 666, -99, -6, 71, -25, 66, -207, -103, 67, -221, 104, 194, -58, 65, 39, -8, 217, 61, -17, -150, -85, 76, 234, -222, 280, 195, -2, 112, 121, -165, 229, -122, 154, 65, 131, 137, 113, 32, -113, 98, -128, -78, 198, -31, -32, 80, -80]
2699h0J88l4j56j0J40j41L18l2k66J19K3p4j80K70J6P8Q3l04K62l8k57P6m9jj2
2724f1j66J78L5N1L59m87J23Nk2qK25m89L27k80J91r8J28M9k33J04P2Q8K9R2k11
2749An2j56m0o1L95r3K9k46J9L9J03K90j83r5J06k76K77k25pL07j01j15J61k29
2773a52J13M6j4J30j20J21k61j9J11J10k00Qj59N57k94k97O1M9J67o9k3P8J05
2796D8j74Q0p1J42J14L6j72l74O80j31N4k23k95N95m64n5K88l1r9k56K32oL93
2819C11j50l53k0o5K99k74L13j81l0M15j53l11m1K7J02N5k7M55m67l5J5J51j90
2842a54J94r2M57m72K74j20k00K21k44J71P8k22K75Kj18j13K6j18K8K79r8k76
2864b22K71M9l67K39o8RNl10L39Q1j95L47j75R3m01N61j51P3j91N8J34j98L27
$$ y = [-80, 108, 74, -82, -92, 48, -93, 225, 193, -73, 46, 69, -5, -185, 85, 101, 179, 262, -42, 220, 182, -75, 1, -48, -49, -61, -227, -49, -14, 37, 396, -91, 32, 37, 15, 7, 232, -257, 70, -210, -19, -117, 11, 60, -173, -69, 3, 91, 120, 212, 1, -51, -207, -247, -308, 87, -6, 23, -223, -204, -165, -62, 228, 45, -50, 56, -220, 57, -168, -175, 132, 31, -84, 77, -152, -39, 7, -7, 123, 3, 124, -137, -156, -45, 65, -135, -127, -286, 271, -23, -320, -259, -210, -43, -112, -135, -57, 48, -126, -46, -117, 25, 139, 175, 3, -371, 309, 178, 232, 9, -286, 309, -155, -210, 78, 47, -52, -308, -76, -82, 311, 161, -192, -212, -277, 22, -252, 61, -120, -150, 265, 112, -199, -240, -213, -111, -56, -83, 372, -95, -130, -115, 36, -154, 40, -52, 405, -67, 207, 87, -113, 108, -136, 35, 113, -109, 166, 168, 50, -63, -37, -155, -127, 152, 54, -222, 49, 98, -269, -30, -98, -89, -84, -394, -55, 26, -169, 178, 3, 96, -305, 256, 105, 178, -13, 45, 179, -19, 308]
2887C08m94L38j86m60N72j49K90l76K60J06j59K41j41j98j39L14o8o6j20K24k7
2908G0j86J80m3L63n04k8J16J96j24q7k04LR0J84j27K43l2J39l22oL89k02m7k71
2932b10J37p2J57j21K92m26J86L87k45k18K22l9o9J86l59P1J7L33j27K26m68J15
2954b5J78k06j33M05q2k56J59j23M4J61Pk25j2J79J25k46K45l58n4K54J02j55
2976a6O1K9k54L27M1l79L45k66k76K88o7n9K15j69J95n6K36k18Jn2Q1n6p2j5j16
3001b52N69l88J58q5J16j97P9M91k91l90rK99k39k4R9O0o6M7n3Rj76J01J06O7
3025C1J72j99J18R8m43K66K30k74J42j33K63m37K06K6J80l72R0K7L3qk34K24o
3048@K25l67K31j28j93K23l3n7o8L44k53l1N4j03K04O5o7k60L28r1l3K66P2n80
$$ y = [308, -186, 152, -34, -494, 78, -71, 219, -157, 103, 209, 50, 291, 150, -48, -187, 127, 59, -7, -127, 97, 70, -116, 64, 21, 384, -120, -148, -32, 164, 40, -47, -251, -248, -158, 26, -101, 142, 110, 249, -73, -79, 310, 108, 61, -210, -73, -145, 12, -109, 183, -243, -57, 330, 85, -133, 89, 50, -19, 167, -192, -121, -104, 229, 102, 328, -140, -25, 153, -53, -186, 219, 137, -119, 40, -83, -39, 122, 129, -96, -108, 71, 196, -50, 195, -163, -217, 37, 139, -16, 45, 74, -180, 147, 188, -191, 154, -112, -388, -100, -167, -226, -11, -180, 15, -41, 195, -23, -22, -74, 7, -49, -121, -136, -252, 317, -71, 87, 2, 118, -79, 0, 491, 200, -190, -199, 100, -139, -163, -64, -4, -70, -23, -76, -67, -243, -142, -36, 31, 203, 4, 122, 220, -223, 43, 273, -1, 141, 8, 271, -166, 40, 66, 246, -126, -36, -9, 24, 16, -218, 6, 0, 225, -142, 89, -39, -232, -9, -42, -99, -167, 177, -76, -107, -53, -156, 48, 113, 46, -214, 114, 23, -10, 256, 328, -252]
3072b52L27Pj21L26m36N12n08n5J67j8J6KO2O6j17k1J67J12j39K39l77K54k11
3095BK28m31r7L73r8j61K22j81m8M00k0o3j52J52j9k2j50M8K41p1j53k03J68J78
3119A43m32M34j73J82K9j6j16k24M28j19k90L00k30p7L21k13K69L1l88K18j02
3140b5p1J57j08J30j88p6K59o5j35J52K92k35J29j95k2n0j10O8M8q7J54p2N7j80
3164a73M71n09r3J54Q0K3o5J04j4m6n51P53m5J2rj55J28q4j2m4j35M20l10k6M24
3189B98Ll70Q8K4LJ2Q2o4L0l13J91O7K16k05n3j32K23k4k49K74j6l51M29k27o
3214g0L9n3K11m8j7j10O2j33K23o9q8J66k89n5M18j02j43P3j9m2j50m3M73p1j17
3239D6p1J82o3j92j57R6N9J30K14m80K57n7p5M44j95j83j80N19l92j1K35j6k13
$$ y = [-252, 75, 82, -39, 287, -149, 363, -145, -200, -33, -51, -35, -33, 29, 95, -22, -43, 124, 236, 97, 336, -41, 213, 2, 230, -201, -298, 75, -23, -184, 38, -143, -191, 209, 189, 126, -26, 126, 107, 85, -65, -17, 224, 153, 0, -203, -35, 143, -289, 145, -28, 154, 183, 167, 51, -173, 255, 136, -154, 146, -84, -161, 160, -53, 216, 247, -141, 77, -25, -96, 61, -47, 83, -105, -181, 78, 13, -122, 30, 322, 87, 216, 21, -1, -51, -161, -93, -45, -132, 22, -50, 7, -173, 298, -211, -304, -150, -70, -47, -112, -8, -22, -68, -619, 134, 89, 101, 92, -63, 65, -19, -31, -75, -210, 210, -100, -126, 298, 301, -69, 19, 43, 46, 58, 140, 76, 106, -207, -16, 51, 267, 62, 9, -123, 100, 76, -173, 101, 85, -266, 163, -64, -70, -31, -84, 127, 79, 62, -48, 14, -119, 104, 35, -53, 113, -176, -231, 187, 85, -58, 15, -4, -46, -196, -239, 234, 163, 46, -25, 157, 94, -98, -255, -159, -100, 30, 244, -236, 21, -36, -111, 333, 138, -45, -225, 294, -98, -109, 126, 110, -103]
3262a03q7L22q9J42j75j51J0J33k34J06O1J01j96J99K00k97j9OQ7J68l83L72j3
3285A60j95K32j15J00j71Q1p1o0J05M9l8J26k11j49K9P4m1J89K4q8j41L56l32
3308h7K4Q4J28L3m27M92j11j80L3j43J51PNl5J05n4l01L12j68J1q5l1L57m8ON5
3334A33n9m1J52l57M12l67r6K8K47l3j11p8L07N7k15J03j76M5L5n0K54J18l61
3357e3L59k94m8L76l07N7k47O4J88j57L0J67j36nK61k1m22K39M5l54K53n0j57
3380b12J06J8N1k47L77R0j34j07N8k37J08K17J04j63j80N32l58k87J97M2r8K03
3402H0j50Jm4j47J3K35J03j73rl3K47l64K63J68j46N2j00j1k1J61j60k9J96M15
3426E47l66j79k64J68N5j64O7K36j41j84L49R2o9l7l49J51KOL2J35j58L3J31p9
$$ y = [-103, -190, 132, 43, 185, 10, -141, -131, 2, -232, -126, -65, 36, -160, 39, 239, -58, -77, -71, 16, 184, -199, 173, 160, -35, 197, 82, 182, 11, 92, 21, -39, 66, 115, 77, 203, -8, -157, -128, -54, -95, 94, 118, 30, -111, 245, -87, -63, 21, 149, 182, -245, 247, 136, -44, -11, -154, -3, 4, 9, -26, 79, 25, -276, 36, -132, -121, -206, -237, 120, 72, 78, 133, 74, 33, 185, -172, 240, -127, -223, -195, 52, 19, -92, -170, 137, 194, -21, 82, -94, -49, -14, -64, 190, 308, -53, 306, 12, -36, 340, 33, 90, -157, -93, 95, -62, -32, 135, -1, -6, 255, 234, -188, 51, 96, -258, -5, -55, -212, -106, -88, -37, -284, 93, 183, 49, -58, 0, -237, -129, 88, 192, 29, -151, 381, 23, -264, -67, -25, -123, 80, -70, -69, -113, -260, -247, -12, 91, -82, -91, -124, 123, -241, 22, 190, 44, 96, -4, -15, -36, 125, -35, -64, 132, 547, 181, 2, -262, -94, -39, -203, -136, 100, -41, -225, 124, 216, 147, 110, -239, -88, -86, -80, -48, 87, -71, -38, 93, 14]
3450A4L3j07r5R7j62K25J2j44K67j34J65k84m7J47k01J99L57m62mK66j78J54j05
3473A3N3K03jr8O0k12j89L57j68Q1n45L84J66k08R1k33K26j24K11Nn9k0J86j30
3497D9l01L18m9P7KO4j04j38K91j63j36M19j91l17J69j19J58m3ol60J00N95m27
3520a12K58l31J29R7k5J30m55Q3L70k54R6j9j17L30m82N20k24P3j50l0oK23l20
3543b16K31J23j54J8n4J8o5nj5J63J10k0L2l3m9k75N14k60m5p5k82N8M83N9j23
3568A38k80O2J57j03k43L18k31K42j07K00j76K53l06p7J04j2K34j41K28k88K16
3589A88k64R2J57m25O1L00K7k20K61k36J22r5Q8Q1k75M5J69k97J37M4l5L4K0j49
3613a70Q9q8j64Q1L82j1Q1k18M0j48j61J36J99J05l34N2J23K63j51N3N7j95K01
$$ y = [14, 47, -60, -155, -58, -220, 5, 17, -127, 140, 6, 171, -113, -160, -13, -214, -15, 342, -120, -124, 142, -36, 118, 13, 66, 269, 268, 170, 230, 18, -171, 186, 18, 99, -446, -62, 104, -104, -13, -246, -20, -144, 67, 72, 13, -7, 179, 49, -252, 66, 17, 94, 96, 160, 56, -82, 209, 46, -90, 329, 138, -179, -10, -129, 29, -14, -20, -380, -280, 315, -112, 146, -185, -56, 41, 16, 146, -309, -226, 144, -110, -14, -33, -150, 180, -302, 218, -6, 67, -83, -113, -119, 104, -216, 15, 138, -16, 2, -52, -34, -99, -104, -119, 44, 154, 134, 166, 133, 84, -191, 323, 63, 18, -57, -339, -281, 202, 261, 138, -142, -80, 77, -26, -269, 49, -182, 60, -47, 153, -23, 230, -76, -153, -49, -61, 173, 32, 260, -28, 188, -76, 16, 173, -252, -191, 109, 136, -84, 177, -59, 63, -32, 56, 137, -138, -93, 76, -221, -84, -40, -75, -41, -21, -170, -81, -169, -333, -252, 130, 119, 200, -18, 22, -126, -287, -151, 48, 153, -181, -129, -6, 257, 106, 159, 216, 21, 222]
3636B22K2l60J75J05m12M3K05Q4o12P49j63J32k07OL06m64J00M4j0Q1m3J1j90
3659a76L2J2p8J39J19j55K04l32L10K6p9M5j69o2L50j36J51j41k12K20OK34l69
3682f1j15L40k60M5%K0M1l9L57k14k38L73n68J00L00j69j01L77l15pN2O3Q5P5
3706A41l2m47M61m39J47K80k08o6K71K59k57j12k06K6O6N2q7L14k70N0J00J48
3728A91k93j06M70N2j76j98k4JO5J85L81o78r9K77N0N3k23J57j85p5J58l8O8P2
3752H5j40j55M41j98J80l09n9J07k8j5J95k34J20P9oL2k13J22J84q3p2M2n5K88
3776C08l73p4J93j82J63o6j45K18j73K83k16O6l39M25n8L50k62l52J76k2K53j19
3798E4j28O1j71l5L66l72N3Q4J23q1L08l61K43j20J7K66k82O0q5O0j46K6J39j59
$$ y = [222, 244, -116, 59, 164, -248, -205, 0, 84, -528, 221, 58, 190, -17, -11, 295, -169, -69, -25, -35, 46, 3, 14, -176, -144, -132, -210, -71, 48, -107, 97, -235, 75, 101, 22, 67, -102, -164, 186, 50, 201, 60, -152, 68, 74, 308, -61, -176, 164, -96, -51, -51, -31, 10, -29, 328, 114, -124, 249, -319, -219, 81, -88, -189, 188, -127, -134, -82, -19, 66, 141, 109, -338, 123, -316, -169, 111, -97, -163, 108, 367, 110, -2, -208, -182, -116, -64, -151, 163, -107, -57, 43, 191, -102, -208, 262, 314, 138, -60, -84, -83, -18, 167, 548, -130, -229, 48, 98, 151, -72, 85, -100, -175, -17, -55, 13, 85, -55, -210, 231, 33, 213, -96, -155, -48, -76, -91, 104, -130, -10, 69, 63, 95, -118, 4, 188, 105, 33, 75, 20, 308, -65, -139, 54, -128, 35, -31, -176, 42, -131, 152, -64, 2, -337, 88, 30, 380, 118, -234, -58, -80, 173, 54, -74, -13, -184, -219, 147, -225, -172, -88, 35, -46, 262, -99, 144, 24, 41, 307, 25, 85, 0, 60, -86, -60, 79, -80]
3822h0J19J18k52P4J32Q9q3o1K3j71J60L5R0n77K98Q6p7J28k31P6R3j91Q2J94
3846G4r9K97k58q4K1j6j21J96M71o56q2L32q1J38l38J32N0j91L55l56M2k28M38
3869C6M5k55M92l84j8J23o7k95M9N13M8k05j65r1L74l31k08L52k6j17k1nJ29k68
3893b95M15j73J25J31l94L24k57Q2J13O3k26J3o9Q7K07J3Qq4l77K01J63N8k59
3916a31J9K86n6j77J25j13j79L9M84n19K25R1j64n2K06j24K04j89R8j63j10J53
3938d7o3K96j82Ok9j73L10q6j04l14L43L5K7K3j15L51K3j26r2k21J7L73l36j11
3962a95J07J51j63m0L8j11nO1K01k08K71k42K49j29N9j41M76m57J06k43J65JO0
3985A1O7p9J42j90J00k18L93j47j02n8K09R4j87k11O72m27l97L24j30K52j94K12
$$ y = [-80, 39, 157, -95, -21, 111, 200, 117, 56, 79, -92, 68, 103, 193, -384, -86, 0, -77, 51, -180, -104, -11, -202, -120, 74, -25, 272, 14, -70, -49, -65, -186, 10, 481, -175, -257, 75, -6, 132, -206, -74, -24, -215, 140, -216, -174, -402, 36, 81, -174, 318, -66, -84, 39, -28, -323, -274, 239, 287, 82, -83, -174, 200, -131, -339, 13, -13, -130, -151, -156, -27, -295, 120, -53, 72, 203, -191, 133, -124, -42, 71, 134, -92, -79, -148, -61, 146, 159, 167, 83, -294, -93, 70, 128, -131, -112, 174, 118, -59, 66, -47, -226, -187, 297, -222, 3, 94, -70, -122, 84, -40, 164, -25, 73, -90, -200, -47, -110, 186, 4, 10, -19, -192, 118, 32, -72, -386, -43, -8, 19, 42, -73, 278, 301, 175, 83, -138, -121, 252, -84, -195, -88, 63, -100, -140, -102, -213, -218, -157, 44, -164, 107, -135, 114, -15, 44, -97, 379, -78, 28, -215, -50, -49, 11, 78, -1, 141, -49, 51, -167, 226, 79, -23, -81, 128, 222, 35, -176, 496, 69, -328, -4, -134, 118, -76, 136]
4007A36l01J31Q7n9qK51k70J6j39J43P1N4j23JJ4P9p1j05k76L36J9J72q0Jk10
4032a31M8J72P1k25J41j16K03o8K36p4k46J01Q2j40j54J07k75M20j6r7J28k75
4054a08L26m19L9R7O2j68K72J38l69J82kj51n5k2L08j66N3k84L02K8j90o3L29
4077A39k06n8J74Mj6j00J85l10P3L98k13j94J00L3o1j13L25J13m22P0J4L70n58
4100b53J15j19K25J56K16m16j72M76j82j48R4l65N86l30J03k9r3M59k35J3n9J59
4122B01K8j97j82J54j11K97k08J9q1l1K31k72J37r5J69O8m70L60r4J86j61MJ88
4145A40L1k21o4q1J70P6k98L50j81J43k0n7o7L86n53K10j01K35%l01J00J11J06
4168A14j05K9j25P2J76l15J05l2J59j61q8j72M31j29J57l53L01J1j98j72L9K93
$$ y = [136, -165, -34, 53, -6, -14, 237, -33, -17, -156, -13, 58, 112, -11, -10, 4, 83, 12, -93, -369, -33, -14, 158, 78, 79, -131, -83, 89, 160, -65, 76, -40, 163, 95, 331, 257, 11, 112, 194, 54, -100, 7, -268, 152, 136, 39, 167, -108, 218, -201, -162, -65, -3, -171, 101, 239, -130, 52, 50, -101, -156, -178, 130, -36, 17, -267, 35, 63, -127, -190, 139, -67, -125, 49, 53, 37, -63, 122, -188, -115, 283, 70, -124, -24, 9, -52, -165, 160, 273, -149, -79, -65, 305, -253, -138, -257, -32, 124, 340, -76, -248, 228, 46, -102, -8, -373, 213, -117, -14, -43, -136, 323, 88, 101, 42, 201, 229, 32, -150, 4, -107, 190, -18, 1, -80, -111, 120, -152, -15, -110, 59, 127, -343, 17, -77, 109, -52, -48, 140, 171, -50, -114, -195, -25, 51, -247, 103, -78, 65, 45, -12, -79, 307, -246, -36, -137, 98, 98, -203, -103, 8, 114, 9, 38, -87, -15, 161, -154, -49, -81, 78, -83, -171, -343, 88, -41, 116, -237, 64, 75, -123, -295, -256, 37]
4190C7k15M24o4k37J94oJ14r0m17M27k97J54N2o3j02R5k18J73P3M2r6K83n6j09
4214I8J29k32k0J01j26O0K11j80r1j6J84k4pM9L45n30j86N22n44J68K55j05m5
4237A6j79J8q0K07J07NM6o0Q6k43k02Q2J09m4o9M03l87L0J83j46J10K33j38j01
4261a4m2q1K85q3k0j83L52l76K43kj19k3J26j03J18m9j68L27N1q9j28j02L09k31
4285bj10O3K53j71K0J94l68J47k57L39N6k00n24M53l7j30Q6J33R1k97N6N0L56
4308B01l68K11J80q7N8l52L30j28l5K72m4k62J3K25l98N30k63M5L0k27j75K31
4330a3K38k30J06R2r3k17L57k89J98q7j20K43q4R2n2Kl51P3j29O4L78L3q7%q4
4355D0j14K98j48l57L52p9m9j83M6J99J23J66m53L09j68K48n16J45K37o9N2K85
$$ y = [37, -178, 246, 182, -55, 139, 133, 247, 157, -260, 167, -130, 24, 76, 13, -89, 6, -212, -39, 34, 76, -20, 263, 207, 98, 227, -5, -25, 76, -50, 10, 221, 41, -50, -66, 118, 94, 87, 136, 481, -49, -235, 287, -257, -89, 166, 61, 16, -163, -145, -225, -18, 89, 94, 140, 80, 166, -77, -279, -197, -88, -132, -201, 202, -185, -155, 28, -118, -8, 225, 87, -14, -56, -137, 148, 65, 45, -138, 214, -162, 81, 79, -40, -63, 63, -40, 78, 29, -139, 188, 239, 150, 22, -80, 229, -2, -112, -49, 204, 33, 53, 247, -121, 26, -231, 108, 164, -36, -560, -107, -144, -274, -188, -55, 36, -261, -205, -155, 201, -167, 44, 224, 137, 195, -157, 173, 45, 10, 282, 238, -24, -11, 214, -184, 346, 83, 128, 158, -69, -244, -13, 225, -5, 101, 193, 100, -117, 240, -49, 149, 62, -58, 185, 101, 193, 141, 143, -208, -135, -264, -200, 178, 211, 124, 124, 40, -74, 224, 76, -281, 71, -8, -57, -240, -194, 5, 128, 294, -159, 150, -18, 230, -286, -141, 96, 27, 79, 364]
4377C64k23j15K95l87L69m70L24n1j72R2L45l10k6k9K08j74j0P1J60j54o0q8q4
4400a25N5o1M30j36k31k24L95k2j88K65j4l38j6k9J88Q0n21N26l00L43K9p5j77
4423a46J62J58l14l2K43j04m9N25l23k70QL66o1k07K75o7j75q9j19K1O7Q8j50
4446a93J74l47L02m4M7J27J08pj81j22n1Q0L10q1k6L3q1q8J13k41K66L7m98K01
4470a62M07q9k77j20L32o0L3l32K00K11K2m78M39J4j65J55J66m00mj61M33k07
4492d3q5J98J86l05K59l24m0L01k6J5L7p7J38m60K38j26L00j5k04j60Q8J97K8
4515A20n8K5q8j27o0M29m51L14M5o3L1n7k48K22j2K91l92J94j78r1O0o0l1K99
4539A14j4k11k62K82K22j39J43j65l1M1k5J1ML1Q2o5K1j15O53m78p4k98J99J02
$$ y = [364, 141, 26, 321, -66, 303, -167, 157, 106, -66, 26, 371, 61, 35, 6, 214, 40, 30, 101, 261, 107, 47, -41, -125, -70, -131, 299, 163, -68, -292, 103, 81, -107, 158, 144, -194, -210, -239, -51, 29, -492, 34, -266, 77, 106, 31, -146, 16, 174, -140, -172, 71, -33, -82, 443, 120, -150, -142, 224, 163, -44, 231, 164, -11, -100, -219, -198, -131, -43, -193, -19, -366, -64, -108, -61, 66, 174, 167, -14, -136, -187, -107, 203, 122, 96, 129, 48, -40, 73, -168, 98, 135, -363, -162, 245, 156, -121, -241, 91, 31, 64, -268, -68, 143, 165, -313, 126, 140, -25, 130, 296, -104, -108, -269, 164, -43, -128, 70, 256, -49, 210, -114, -154, 147, 121, 136, 173, 96, 234, -226, 12, -114, 186, 171, -33, -193, -105, 92, 120, 62, 87, -1, -128, -188, 241, -210, 104, 149, 86, 117, 60, -188, 34, 22, 313, -79, 115, -63, -154, -94, -154, -185, 114, 100, -111, -373, -91, 131, -8, 135, -30, -61, -20, -45, -34, -30, 1, 83, 18, 39, -76, 577, 99, 25, -273, -74, 28]
4563B8nl1K08p9lj55n8j8O1q9K00J17k9l31K21p1P5l22M65j62J98l32k59K48L86
4588B63l19qN8N0j4o3L8j11k41M54k79J53M6n1L47m43qM8j55J87l1k78M43j74
4612h8J07N4P9j66r7P2j3J13L64n80J41k7J31k20K73pj20k67J38M04l24j35k51
4635d19O80j69j74k3L5J44j99k61M29p9N5q2N1J25p6J27l35L01l16L24J30j12
4657A56r6q6L79m0n33O0J46n7L40k69K49p7l75L34j77L8ql7P2j39J28p5J1K00
4681A44n1j04k33K17J73J12n51K37L70m12J07j36K15l01K44J50k19N6j11k30N20
4702A97m72M17k80J28Q4k86K63j96K30n1J00j14K66l27k0j0P8N15p81M14k88J24
4724iK18k15J10n8L00n0j65m8Oj42K6K8m3J19Q9k22J17P3j27k50P2K71k83J41
$$ y = [28, 23, -8, 200, 121, 118, -37, -95, -113, -52, -141, 59, 176, 147, -184, 37, -34, 41, -281, 184, 22, 220, -112, -371, -123, 263, -56, -64, -6, 44, 30, -33, 5, -106, -347, 107, -172, -19, 27, -24, 323, -120, -128, -80, -235, -48, -79, -357, 86, -88, 19, 73, 152, -14, -111, -39, -52, 61, 425, -155, -14, -41, 90, -130, 143, 136, 16, -251, -113, 291, -33, -168, -419, 261, 92, -82, -105, -70, 74, -125, -386, 43, -36, 19, -63, -12, 113, 37, 164, -171, 130, -186, 138, 268, 156, 60, -26, 353, 313, -220, -160, -14, -71, 269, 0, 249, 172, -203, 131, -46, -8, -16, -53, 19, -120, 8, -67, -56, 144, 93, -11, -244, -27, 146, 258, -293, -56, 314, -98, 9, -127, 88, -213, 31, 181, -38, 18, -93, -323, 197, -275, 142, -138, -10, 74, -212, 51, -145, 85, 34, 134, 20, 286, -41, -61, -71, 7, 522, -259, 155, -133, -9, 209, -6, 104, 46, 346, 296, 131, 83, 89, -53, -27, 1, -42, 77, 166, -56, 61, 134, 7, -243, -171, 100, -183, -42]
4748d2j9p8J70j2k1r3J07j29J99J99j74j39P9k35J37R5j13j27N44o06r8M16l05
4771b45J90k20M86n8j71o5j16L62l36K66j30j67J16J07P3j36j30J76p9Q5kk63
4793b57M63k76j01K23q3K27m32L02m62L45R3j56M50j89k72m1K5K00J58l75K20
4814F2K4k93R4J28K50l82M52j73j0k80O6J32k5r3l8m7K35J2j4Pr7l52K46K16m1
4839G9o6J38l4j3j40j58L12O5m26L3K62q4l1J47pk07J09k97K49k31K70j27j20
4862b77J93j41L06qJ3N3k57J88k80J60J7n7j08L1J9J98l0L81k36k34p7l7J48l1
4886f6p7J14j21J46j7j00l1J47K7k89L29j21J07p4N9l83L04J07j19j06L45j36
4908D5j15M6j5m2l9J28K18l28J74J8l0j29L0Q4N9k09j07K85j87M2R3M9M5l7J03
$$ y = [-42, -61, -139, 31, 19, -2, -95, 12, -117, 82, 281, 107, -32, 47, -188, -51, 44, -69, -196, 348, -258, -356, 60, -245, -55, -275, 211, 153, -18, -83, -199, 163, -173, 93, -37, -204, -88, 19, 92, -44, -174, 2, -77, 8, 6, -257, 206, -70, -171, 52, -31, 196, -236, 66, -396, -51, 42, -114, 336, 147, -125, -166, -141, 59, 217, -158, 62, 86, -207, -113, 15, 265, -117, 335, 162, 152, -128, -62, 70, 45, -48, -86, -133, 102, 114, 100, 107, 10, -342, -96, 120, 79, 13, 151, 117, 104, -36, -194, 118, 183, -243, -210, 52, -32, -63, 84, 77, -130, -21, -318, -69, -300, -30, -157, -277, -84, -225, 81, 73, 86, 139, -118, 70, -210, -50, -33, -90, -198, -167, -148, 50, 20, 401, 165, -69, -146, -183, -35, -66, -143, -29, -150, -4, -21, -121, -152, -5, 22, -267, 62, -59, 48, -26, 33, -350, -46, 61, -58, -164, 181, 45, -70, -24, -39, -81, -120, 8, 226, -102, 72, 90, 60, -69, -39, 45, 104, -105, -212, 73, -114, -72, 21, 70, 115, 78, 181]
4933A81J07j91j97J64L23m43O7j40P0J29k42K79k1K1q9l6q2K42j19r4m1j44L25
4956F9l7m6J11J03Qk16K99k89n7J21M0M7m41K01Q3r6qL26n71O91n60r2J07LL84
4981A80l68L28J06k42n2k46K12j31k2O8K79O9l05K79m74M01K4Ko6P4k55M49m94
5004a84J67K44m97L33k40K11k48L01j48K25m9J62l72K01m07M54j5M5j86j47K38
5025H8J04l28J81j21j18M33l67j38L48l90J47k10M43k12J96J28k91M13l87J78
5045I7j51J05J8k57l0J45M58k44j5l07J04j53J70Q7P4p4Jr6R7Nm5j12K95m34L86
5070A24R6q7j69j34L23k26J23L4J04k30n0K04jk34K80m12J14K06l9r4j01J7K6
5093a26P7O0n3J49j34J66o17M86m2K45m70n8L10L2j16L0j3K22Q5mm07J06K84l09
$$ y = [181, 288, 97, -100, 64, 387, -56, 11, -129, -59, 70, -172, 107, 86, 107, 18, -18, -100, 142, 23, -71, -112, -256, 69, 32, -14, 97, 200, 208, -8, 291, 2, -55, 66, 106, 153, -288, -87, -4, -100, -108, 218, -353, 338, -222, -314, -207, -204, 180, -188, 140, 246, 4, -48, -294, -82, -213, -235, -167, 112, 181, -124, 155, -319, 82, 106, 108, 42, 116, -139, 310, -184, -17, 227, -270, 63, -177, 34, -214, 87, -61, 164, 115, 277, -95, 106, -301, 153, 138, 183, -3, -150, 88, 192, -136, 45, -76, -194, 239, -128, -266, 82, -308, -161, -371, 72, -140, 56, 184, -107, 306, -81, 97, -54, 51, 69, -188, -218, -73, 385, 141, 126, -181, -77, -230, -60, 27, 101, 27, 28, -68, 29, 34, -11, -123, 172, -262, 124, 220, 133, -36, -170, 153, -73, 50, 84, 188, -42, -92, 112, 111, -123, 157, -255, -141, 65, 26, -68, -169, -152, -126, -49, 11, -42, 107, -27, 139, -478, 8, -34, 211, -259, -317, -7, 25, -91, -61, -74, 148, 233, 229, -178, -72, 212, -97]
5117i7kj08J72O6j62J33M9j68L2K07j00q4J70k07j27p4L56j74q8L16r2j69K83
5140A32q8j31K98j58k6n0j75M63k39j9j87K46j59L11l50R2k33J40J46J31k53J10
5162AJ80k56N6p4J73j4O6j3n13L48J21n3J18o1j61J16J94k32OJ00j85K57m92J45
5186a73M52j94j20j85Q5K30l4j78kp0J56J17k75K19j41K96j75rJ6K01n6pk38J60
5210G5j33m2Q9J58j61j02K16j74K53k49J89j36m0L19l44J19K87m59j22L54k68
5231a71NM75m47L6K86l30J76j61J59l4l7j16K28k44K4J66j34kJ92J3j65n1M0J82
5255I0Q2l25p0J36N8J1l5j19P8m5N9r6L52j13k1l92K69J29q0J24K06k21J1O0k90
5280a42O31m95q2M22N5l42k11K91J42j66j57q3K56k25M77n60J03J39r5L47l18
$$ y = [-97, -99, -207, -35, 31, -131, 2, 51, -117, -85, 122, 22, -62, 108, -99, -226, -300, 56, -118, -206, 110, 18, -151, 132, 44, -87, 211, 53, 27, -23, -198, 265, 26, 7, -180, 66, -93, 218, -132, -40, -273, -133, 13, 144, -109, 1, 181, -75, -19, -93, 80, 66, 132, 119, -394, -46, 75, 22, 140, 79, -82, 34, 228, -4, 2, 102, -83, 174, -318, -173, 279, 85, -35, -220, -135, 95, 61, -117, -119, -189, -33, 84, -191, 28, -113, 183, 8, -1, 15, 216, 160, 153, -85, 75, -58, -100, -11, 147, -14, -116, 100, -74, 179, -70, 119, -17, -57, 262, -82, 37, 324, -135, -257, 97, -171, -166, 309, -138, -102, 184, -146, 30, -131, 28, -6, -43, -159, 69, -175, -151, 15, -119, -121, 71, 84, -81, -132, -92, 90, 172, -153, -223, -87, -29, -18, -53, -172, -94, -139, -80, -176, 176, 63, 42, -350, -81, 48, -32, 92, 298, 77, 88, 148, -142, 489, -6, -88, 334, 389, 47, -164, 127, 269, 103, -54, -137, 119, -106, 371, -189, -86, 53, -42, 305, -13]
5301a3LR0j79J14rK4k43J76J10j49j2m2K76k79K18N9j43k37K0NN6J30LK00l6k16
5327g4J66l7J50M6j30r1K55q5j51l32M22k29J74j20j4P9P6j62k65M00J54k29J06
5350A09m85J51L86m57M36q5J93L0pn00K92j10J63J74m45j48M31k7q3j50k31L44
5372a9P2r8j39K28Q2k11p5K64jK06o5j56k0J21l72K87r8j30L05k50L66j35k50
5395h8N2q6Q3k0q3J5J77N1j30Q5j3R2m02K69K25k66J08r5K34o8jj11J83l24Qj54
5421b59K42J02Rn6j01LJ43MJ13qk90K28k20J72k68nM47l48m8J15n4L35l25j9R3
5446EK24k90m3M56N4n97k3L77j7r0N6o2m02K10M20j26m27j0R8L64k95K09o7N1
5470G5j48J94l4m5J67j25j4n2k85M72j36j0j84K20P1l1l08K11m5K52j80k16J6
$$ y = [-13, -10, 80, -99, 15, 6, 30, -213, -37, 73, -76, -88, -130, 146, -133, 85, 144, 1, -236, -216, -211, -155, -25, -22, 178, 142, -74, 92, 55, 205, 251, 121, 30, 285, 200, 49, -283, 139, -90, 84, -36, -50, 29, 105, -57, -322, 78, 232, 3, 109, -376, -225, 161, -296, 140, 55, 248, 278, 271, -229, 63, -47, 116, 290, -155, -303, 128, 101, 18, -132, -363, -19, 53, -45, -184, 44, 126, -85, -160, 104, 103, 309, 244, 88, 68, 189, -183, 104, 6, -124, 181, -69, 297, 162, -88, -36, -122, -39, -59, -142, -127, 50, 101, -29, 56, 43, 135, -267, 2, 227, -39, 69, -26, 208, 140, 139, 28, 211, -113, -105, -259, -17, 85, 94, 38, -63, -60, 83, 87, 200, 192, -98, 130, -90, 82, -186, -191, 256, -92, -140, -25, -79, 256, -69, -88, 5, 229, -61, -104, 352, 406, -191, -214, 163, 146, 56, 112, 50, -352, -142, 278, 152, -275, -285, -187, 177, -118, 91, 24, 75, -73, 121, 87, 42, 209, 84, 70, 18, -267, 205, 69, 59, -125, 95, 166, 135, -173, 38, -7, 245, 65, -151, -135]
5493a35J01K98m81M36J0l16L48p6j97N6j29J19J97l39r1L34j40O7J63l29N5L92
5515C43l53J8j77J58k70pK40j08L0J45n1J89p8j98O7L33l16P8k9J67q6j42L93
5538C46k88J94j56k67K77j16P9j18K19j65J62m0K17o01Q0m6J64L44n9N9m21J1
5560a25oK81M7k89n7P9r7L51l52O9o5R4K07j27o6J93k65j79M01j03Q2q4l32P80
5584D37m36J39j14Q2j76J37K5M5k97J84L36k75l82R1K54J72m61N1K68j92J59l39
5606b92O35k22k16J52o0j58K07j65QM9L71l6n08L43j15j24J43j19k48P03l79J20
5628H9k49j51k9M56pk39J43k06K29m3K15l74K50J28r1j33j26K01j54J18P0j25
5650b8K64l53l5K10J17k37J93k22L10k83J63k62L01m7m29K94k9O5j52M15l47O
$$ y = [-135, -34, 264, -217, 219, 229, -87, 261, 185, -12, 44, -85, 34, 231, -108, -199, 135, -5, 62, 225, -104, -49, 343, -10, 8, -169, -11, -281, -288, -48, -156, -126, 19, -32, 157, 79, -119, -52, 281, -35, 43, 14, 181, 95, -47, 346, 58, 252, 96, -171, 106, -10, 69, -49, 170, 5, 167, 127, 344, -257, -177, -223, -59, 285, 226, 285, -136, -125, -131, 150, 197, -92, -149, -70, -167, 184, -168, -99, -164, -70, 137, 10, -56, 137, -128, -307, 94, -9, 73, -11, -343, 437, 1, 140, 26, 108, -68, 69, 94, 139, -158, 26, 362, 87, -295, -204, 50, 222, -239, -188, 80, -112, 47, -292, 343, 121, -95, 57, -3, -161, 46, -119, -111, -62, 309, 273, -235, 108, -7, -131, 12, -107, -355, 348, -31, 89, -160, -311, -340, 116, 109, -130, 13, -193, 36, -7, 208, -166, 84, 212, 121, -12, -138, 63, -91, 27, 97, -28, 236, -117, -152, 58, 175, -62, 131, -91, 219, -64, 99, -163, 138, 91, -338, -44, -73, -8, -160, 255, -92, -86]
5672h6R2J43l31K53m17J72J86j03L88l74r4N3M31m34K22j24J25j01J21k14N3K59
5694B20l61M36m50k1k18L42k39K71K65n15P18q6r4k57N7R7k65Q8q8J18j17R0K12
5717B03l03K02j43J42j87j4P7j25L84m98J64rJ57oJJ6N6l54J11J5J0R4k09M3M63
5742B90k63r3k02K54K44j98k23L57q3pJ05l46K27O0j39R0P9NJ8k44p6J77nK9M9
5767A05k96L37K06m58q9J16J18k12K8J79J06k42L30m87K47N1j32K40M2j20J42
5788B11k0l17J14N6l16L18J31k32J56j79J40k75J14k2M3K08j43m9J6j49L5K26
5810F6n8K26m78L91j31j79k4J87j70K59LJ15o1q8k28J64O4Q1l0l04L4J13K23r1
5834H4J09j06k47M7k44M73m23M97p5j83J73k84N23l81K41n1j56l27M61j49K86
$$ y = [-86, 6, 149, -182, 71, -346, -174, 12, -91, 297, -77, -171, -118, 313, -121, 101, -23, 102, 1, 122, -92, -39, 220, -141, 295, -155, -176, -394, -52, -291, -20, 245, -270, 448, 362, 268, 11, 68, 165, -100, -12, -100, 18, -99, -9, 203, -100, 102, -41, 101, -86, -100, -23, -148, 236, -262, -98, -107, 50, 44, 45, 61, 117, -237, -126, -111, -101, -7, -216, -173, 290, 27, -66, -268, -14, 230, 32, -191, 166, 83, 76, 181, -165, 62, 122, -17, 73, 152, 157, 175, -69, -145, 32, 27, 56, 105, -191, 146, 352, -106, -195, -79, 39, -173, -145, 34, 140, -102, 228, -259, -12, 39, -93, 147, 189, 69, 211, 191, -126, -12, 44, -272, 46, 177, -55, 101, -78, 62, -213, -99, -121, -78, 130, -13, -62, -46, -195, -160, 66, 8, 234, -244, 147, 16, -163, -187, 0, -170, 89, 92, 207, 146, 58, -170, -6, 58, 139, 109, -195, -161, -48, 175, 84, 193, 87, -160, -113, -357, 116, -307, 190, 115, -68, 105, -179, 344, -37, 204, 153, -3, -330, 131, -18, 268]
5855B68J61k77l05M58q1j33Q1k63K86l08J0l5J76k67N20j36l01K25J9N8k88Q8
5877d4p1M0K5J68k37j75K94q3j70K73rP4l07K31k8J09j49K4R9j26L74j23K3l68
5901a56L40L8q0l76L24J07n5M2j87K30l54K86m4r1J25j47J21m5K05l77J51mk86
5924b33K16j4R2k29K08j8J32m02K44L17k58m5M5j75j26K2j78K91J55OM72m12K49
5947C59l52l01K45j45M08j99K39j35j4Kk00K34n0J48j10k34J6J44l8K51k50n4
5969c6J59J57k32N9m03L3L00k99K10K57l41j40P4Q6K21j88j57K30j27K20J26k63
5991e4K14l99K14l21K76J76k15J04K38j94k25J9K22J71ok47L2M3K7o2J47j55j5
6014a0o3l7j54K76L3j08R2J18l69K19m1j87J00K67P0l23N4K39k57K81k63r4k6
$$ y = [268, 429, 152, -153, 305, 224, 91, 172, -91, 195, -113, -103, -138, 38, -229, 291, 155, -146, 79, 98, 156, -132, -44, -115, -75, -50, 118, -119, -294, 0, -83, -253, 20, 11, 85, -222, 9, -19, 90, -59, -35, 64, -62, 312, 189, 212, -156, 184, 222, 142, -234, 90, 197, 142, 184, -3, 227, -127, 159, 115, 24, 149, 2, 123, 78, 283, -94, 57, 53, -233, -17, -31, 61, -168, 40, 22, 154, -248, -4, 313, 55, 10, 55, -120, -246, -224, -402, -111, 44, 50, 522, 110, 359, 7, -294, -49, -194, 214, 15, 254, 119, 105, 107, -93, 141, 91, 239, 129, -105, -89, 55, 17, 268, 18, -36, 123, 280, 48, 107, -296, -263, 37, -262, -52, 205, -136, -276, -202, -116, 105, -83, -240, -10, -137, 83, 209, -54, 160, -239, -25, -346, -70, 106, -109, -5, 233, 39, -186, -167, 55, 226, 220, -27, 5, 48, 75, 13, 160, 5, -10, -73, -110, -264, 12, 45, -63, 29, 147, -222, -3, -44, -231, -131, 136, 206, -117, -63, 176, -81, 200, -63, -157, -183]
6037a83K15m1l27K70j14J69j23J0K8J44k53KJ64oO8Mk17K10K14l01J0J10q8oR
6062c2l6j5L68k17j67K42O6p0k07p5J21J69p0k40L5J51j2O7l43K83K30m17J41
6085b8j60O1J37p3Jo4L3R1j2K12l56q3J26J62K6L9p9j28L58k35j68O0J98K45k97
6110F6k11M8L21l90M73l56j30K87O7l32K85j68n4J04K3k28P8R6o6P5J02j2l72
6133b94J85L45m4L10n98k52N08n3Q4K03p54M74j06k79rJ76J28nk5j31L32l02N
6156a02J5K6k1K5J51r9K14k98r2L54l41K81j80J26j03j98J90jk98J25J25J02L12
6179C13k37j6J29k8j72k70K07J14J49j67j83J58J11n36L90Q0o1Pk12M23m7l57
6201b05L52j30k1R4k13R0L90k12k10K13R3k63j18J58%j03L1J84J15rk67L49j82
$$ y = [-183, 32, -9, -336, -66, -180, -11, -134, -124, -96, 48, -205, -203, -39, -45, 23, 27, -190, 20, 234, -67, -57, 53, -35, -41, -32, -68, -83, 285, 68, -99, 143, 209, 139, -68, -143, -22, 147, 77, -163, -128, 23, 11, 78, -265, 18, 248, -169, -28, -188, -127, 10, -63, -62, -126, -93, -2, -14, 198, -158, -241, -115, 47, 73, 112, 33, -95, 263, 28, -140, -80, 118, 363, 66, -145, -97, 224, -166, 307, -49, -179, 108, 175, -157, 128, -40, -94, 10, 33, -195, -117, -21, -87, -12, 90, 78, -294, -109, 236, 192, 502, -96, -348, 160, 107, 191, 394, -360, 114, 8, -271, -280, -104, 24, 19, -6, -137, 195, -107, -102, -87, -61, -82, -57, 94, -5, 209, -89, -181, 173, -168, 113, -67, 59, -44, -242, -52, -53, -351, -226, -101, 1, 313, 76, 60, 189, 161, -11, -281, -74, 40, 189, 22, -161, -3, 108, -428, -38, 42, -19, -12, -224, 199, 152, -205, 147, 17, -4, 90, -123, -33, 357, 145, -65, 148, 241, -22, -140, 18, 18, -85, -54, 130, 245, 236, -31, 318, 136]
6224A36l42K56J24l93L84j59L6k3q1J58k00J87l39L60N6l8j30j79L50j78J18K5
6246A28m19K50J81l7k44J90o4J70m32M83k37m4J43r8j1J89j75L8J61J4k83K71
6268A74k68K10l1j38p5J43Mj48M4n1o7L36j65N8J8m8m3J6j79K5k4J58J19K6l5
6293E9p7k10M32Jo7k13J16j5J98l24j12K11J83k73l7N4K55m74N54j58l97R7L56
6316A59m38o7M02J66j59m23M87n3k5J6J65k46N7O5j34j1J02p1K87j59J79l55Q1
6339B5m7j44p8K55l2m9R5M1k44O1J74K55l51O5j67O3l8P0L52j90k09j15K79M2
6363A13j46p4k5N9o6L04j51k44J8Q4k39N53k89q1L29k31O3r3K7L9J6J37k79J11
6387f5J8J2J11jl41M08k10J12J59m82L77K89m25m1k11N18l40K40K3l39L13k17
$$ y = [136, -206, 50, 174, -219, 165, 6, 42, 19, -62, 96, -104, 83, -256, 104, 160, 122, -8, -187, 163, -15, 103, 128, -291, -41, 140, 103, -141, 49, -15, 155, -277, 206, -31, -75, 68, -30, -41, 148, -27, 11, 172, 186, -97, 174, -94, 116, 85, -53, -128, 15, 19, -129, -85, -136, -203, 133, -32, 26, 44, -4, -47, -31, -210, -185, -209, -51, 68, 94, 59, -18, -228, 204, 205, 138, -75, 41, 26, 224, -100, -212, -1, 182, -91, -128, -74, 181, -293, 261, 103, -294, -197, 159, -279, -346, 56, 222, 63, -360, 127, 74, 49, 65, 230, -16, 41, 106, -28, -39, 63, -8, 279, 120, 299, -56, 25, -22, -166, -244, 11, -21, -70, 25, 66, -178, -117, 57, 312, -39, 26, -141, -78, -116, -46, 306, 116, -93, -208, 71, 113, -33, -107, -132, -73, -139, 165, 14, -230, -212, -128, -367, 186, -103, -184, 145, -86, -23, -116, -89, -50, -34, 103, -176, -65, -47, -35, 76, 75, -266, 142, -68, 44, 203, -279, 98, 387, -38, -79, -290, 228, -112, 128, 151, -188, 125, -92]
6409i2J83J36Lj52q9J09l42K20r4J33n3J88j22N0r5K1J5J3l00M16r4l18J17J07
6433d0j35Q9L80n17L98k57J42j54R1q1L30j36m89K52K64j11j70J30J83j10J5j44
6455g0l7N7J71j70Q7l6k0o8j90J59K70M2l73L63j33P9q1q6j15K87l59K07p9m6
6479a41j33L55p5P6QL9q6J07k67j91M28P4l4k31l2J33J17o1l07K60P0k57K56j98
$$ y = [-92, 91, 227, 230, 78, -11, 98, -244, -24, -118, 15, -38, 150, 28, 78, -17, 4, 19, 32, -268, 148, 54, -264, -147, -40, -175, -86, 294, -223, 175, -82, 60, -94, -3, -84, 246, 110, -379, -127, 137, 26, -144, -14, 169, 59, 74, -70, -107, -50, 121, -49, 38, 2, -18, -86, -276, -117, 153, 195, -178, 185, 52, 131, 50, -36, -151, 136, -223, -16, -95, -141, -274, 81, 6, 82, 90, 129, 43, 150, -117, -308, 120, 194, 160, -71, -103, 30, 147, 86, -221, 39, 109, -148, 108, -90]
$$ [...]
8191A86
##END NTUPLES=NMR FID
##END=
