##TITLE=1H_DE-60_EA-d6
 DMSO-d6
 8 sc, 
 3.7.2024
##JCAMPDX= 6.0         $$ Bruker NMR JCAMP-DX V2.0
##DATA TYPE= NMR FID
##DATA CLASS= NTUPLES
##ORIGIN= UXNMR, Bruker Analytische Messtechnik GmbH
##OWNER= root
$$ XWIN-NMR		Version 3.5
$$ Wed Jul  3 14:30:23 2024 Russian Standard Time (UT+4h)  she@DPX200
##.OBSERVE FREQUENCY= 200.1314
##.OBSERVE NUCLEUS= ^1H
##.DELAY= (6, 6)
##.ACQUISITION MODE= SIMULTANEOUS
##.ACQUISITION SCHEME= undefined
##.AVERAGES= 8
##.DIGITISER RES= 18
##SPECTROMETER/DATA SYSTEM= spect
##.PULSE SEQUENCE= zg30
##.SOLVENT NAME= DMSO
##.SHIFT REFERENCE= (INTERNAL, DMSO, 0, 15.7039)
##AUDIT TRAIL= $$ (NUMBER, WHEN, WHO, WHERE, WHAT)
$$ ##TITLE= Audit trail, XWIN-NMR		Version 3.5
$$ ##JCAMPDX= 5.01
$$ ##ORIGIN= Bruker BioSpin GmbH
$$ ##OWNER= she
$$ F:/spectra/data/she/nmr/H-F/1/audita.txt
$$ ##AUDIT TRAIL=  $$ (NUMBER, WHEN, WHO, WHERE, WHAT)
(   1,<2024-07-03 14:29:25.53 +0400>,<she>,<DPX200>,
      <created by zg, POWCHK disabled, PULCHK disabled
       configuration hash MD5:
       00 E9 B6 7A A2 85 ED C7 34 08 36 98 17 FE 4E 26
       data hash MD5: 16K
       23 B9 3D 0E E0 C9 66 D5 2A A7 47 62 37 E6 57 B5>)
$$ ##END=
$$ 
$$ hash MD5
$$ 23 AD AE 50 EF 60 4A 9F 5F D6 7B CC 49 68 0A A5
##$RELAX= 
##$RELAX= 
##$RELAX= 
##$RELAX= 
##$RELAX= 
##$RELAX= 
$$ Bruker specific parameters
$$ --------------------------
##$DU= <F:/spectra>
##$EXPNO= 1
##$NAME= <H-F>
##$PROCNO= 1
##$TYPE= <nmr>
##$USER= <she>
##$AMP= (0..31)
100 100 100 100 100 100 100 100 100 100 100 100 100 100 100 100 100 100 
100 100 100 100 100 100 100 100 100 100 100 100 100 100 
##$AQSEQ= 0
##$AQ_mod= 1
##$AUNM= <au_zg>
##$AUTOPOS= <>
##$BF1= 200.13
##$BF2= 200.13
##$BF3= 200.13
##$BF4= 200.13
##$BF5= 200.13
##$BF6= 200.13
##$BF7= 200.13
##$BF8= 200.13
##$BYTORDA= 1
##$CFDGTYP= 0
##$CFRGTYP= 5
##$CHEMSTR= <none>
##$CNST= (0..31)
1 1 145 1 1 1 1 1 1 1 1 1 1 1 1 1 1 1 1 1 1 1 1 1 1 1 1 1 1 1 1 1 
##$CPDPRG= <>
##$CPDPRG1= <>
##$CPDPRG2= <>
##$CPDPRG3= <>
##$CPDPRG4= <mlev>
##$CPDPRG5= <mlev>
##$CPDPRG6= <mlev>
##$CPDPRG7= <mlev>
##$CPDPRG8= <mlev>
##$CPDPRGB= <>
##$CPDPRGT= <>
##$D= (0..31)
0 1.2 0 0 0 0 0 0 0 0.06 0 0.03 0 0 0 0 0.0002 0 0 0 0 0 0 0 0 0 0 0 0 
0 0 0 
##$DATE= 1720002565
##$DBL= (0..7)
120 120 120 120 120 120 120 120 
##$DBP= (0..7)
150 150 150 150 150 150 150 150 
##$DBP07= 0
##$DBPNAM0= <>
##$DBPNAM1= <>
##$DBPNAM2= <>
##$DBPNAM3= <>
##$DBPNAM4= <>
##$DBPNAM5= <>
##$DBPNAM6= <>
##$DBPNAM7= <>
##$DBPOAL= (0..7)
0.5 0.5 0.5 0.5 0.5 0.5 0.5 0.5 
##$DBPOFFS= (0..7)
0 0 0 0 0 0 0 0 
##$DE= 6
##$DECBNUC= <off>
##$DECIM= 24
##$DECNUC= <off>
##$DECSTAT= 4
##$DIGMOD= 1
##$DIGTYP= 9
##$DL= (0..7)
0 120 120 120 120 120 120 120 
##$DP= (0..7)
150 150 150 150 150 150 150 150 
##$DP07= 0
##$DPNAME0= <>
##$DPNAME1= <>
##$DPNAME2= <>
##$DPNAME3= <>
##$DPNAME4= <>
##$DPNAME5= <>
##$DPNAME6= <>
##$DPNAME7= <>
##$DPOAL= (0..7)
0.5 0.5 0.5 0.5 0.5 0.5 0.5 0.5 
##$DPOFFS= (0..7)
0 0 0 0 0 0 0 0 
##$DQDMODE= 0
##$DR= 18
##$DS= 0
##$DSLIST= <SSSSSSSSSSSSSSS>
$$ [...]
##$SUBNAM2= <"">
##$SUBNAM3= <"">
##$SUBNAM4= <"">
##$SUBNAM5= <"">
##$SUBNAM6= <"">
##$SUBNAM7= <"">
##$SUBNAM8= <"">
##$SUBNAM9= <"">
##$SW= 24.0689651099613
##$SWIBOX= (0..15)
0 0 2 0 0 0 0 0 0 0 0 0 0 0 0 0 
##$SW_h= 4816.95568400771
##$TD= 16384
##$TD0= 1
##$TE= 0
##$TE2= 300
##$TE3= 300
##$TEG= 300
##$TL= (0..7)
0 120 120 120 120 120 120 120 
##$TP= (0..7)
150 150 150 150 150 150 150 150 
##$TP07= 0
##$TPNAME0= <>
##$TPNAME1= <>
##$TPNAME2= <>
##$TPNAME3= <>
##$TPNAME4= <>
##$TPNAME5= <>
##$TPNAME6= <>
##$TPNAME7= <>
##$TPOAL= (0..7)
0.5 0.5 0.5 0.5 0.5 0.5 0.5 0.5 
##$TPOFFS= (0..7)
0 0 0 0 0 0 0 0 
##$TUNHIN= 0
##$TUNHOUT= 0
##$TUNXOUT= 0
##$USERA1= <user>
##$USERA2= <user>
##$USERA3= <user>
##$USERA4= <user>
##$USERA5= <user>
##$V9= 5
##$VALIST= <valist>
##$VCLIST= <CCCCCCCCCCCCCCC>
##$VD= 0
##$VDLIST= <DDDDDDDDDDDDDDD>
##$VPLIST= <PPPPPPPPPPPPPPP>
##$VTLIST= <TTTTTTTTTTTTTTT>
##$WBST= 1024
##$WBSW= 4
##$XGAIN= (0..3)
0 0 0 0 
##$XL= 0
##$YL= 0
##$YMAX_a= 110469
##$YMIN_a= -159322
##$ZGOPTNS= <>
##$ZL1= 120
##$ZL2= 120
##$ZL3= 120
##$ZL4= 120
##$ABSF1= 10
##$ABSF2= 0
##$ABSG= 5
##$ABSL= 3
##$ALPHA= 0
##$AQORDER= 0
##$ASSFAC= 0
##$ASSFACI= 0
##$ASSFACX= 0
##$ASSWID= 0
##$AUNMP= <proc_1d>
##$AZFE= 0.1
##$AZFW= 0.1
##$BCFW= 1
##$BC_mod= 2
##$BYTORDP= 1
##$COROFFS= 0
##$CY= 11.3945322036743
##$DATMOD= 1
##$DC= 2
##$DFILT= <>
##$DTYPP= 0
##$F1P= 15.6554695791079
##$F2P= 12.8336369535428
##$FCOR= 0.5
##$FTSIZE= 0
##$FT_mod= 4
##$GAMMA= 1
##$GB= 0.15
##$INTBC= 1
##$INTSCL= 1
##$ISEN= 128
##$LB= 0.24
##$LEV0= 0
##$LPBIN= 0
##$MAXI= 10000
##$MC2= 0
##$MEAN= 0
##$ME_mod= 0
##$MI= 1.114404
##$NCOEF= 0
##$NC_proc= 0
##$NLEV= 6
##$NOISF1= 3.799351
##$NOISF2= 2.8
##$NSP= 1
##$NTH_PI= 0
##$NZP= 0
##$OFFSET= 15.70392
##$PC= 1
##$PHC0= -25509.1
##$PHC1= 15.98748
##$PH_mod= 1
##$PKNL= yes
##$PPARMOD= 0
##$PSCAL= 0
##$PSIGN= 0
##$REVERSE= no
##$SF= 200.130013532006
##$SI= 16384
##$SIGF1= 3
##$SIGF2= 2
##$SINO= 400
##$SIOLD= 16384
##$SREGLST= <1H.CDCl3>
##$SSB= 0
##$STSI= 0
##$STSR= 0
##$SW_p= 3612.71676300578
##$SYMM= 0
##$S_DEV= 0
##$TDeff= 0
##$TDoff= 0
##$TI= <>
##$TILT= no
##$TM1= 0
##$TM2= 0
##$TOPLEV= 0
##$USERP1= <user>
##$USERP2= <user>
##$USERP3= <user>
##$USERP4= <user>
##$USERP5= <user>
##$WDW= 1
##$XDIM= 8192
##$YMAX_p= 0
##$YMIN_p= 0
$$ End of Bruker specific parameters
$$ ---------------------------------
##NTUPLES= NMR FID
##VAR_NAME=  TIME,          FID/REAL,        FID/IMAG
##SYMBOL=    X,             R,               I
##VAR_TYPE=  INDEPENDENT,   DEPENDENT,       DEPENDENT
##VAR_FORM=  AFFN,          ASDF,            ASDF
##VAR_DIM=   8192,          8192,            8192
##UNITS=     SECONDS,       ARBITRARY UNITS, ARBITRARY UNITS
##FACTOR=    0.0002076,     1,               1
##FIRST=     0,             0,               0
##LAST=      1.7004516,     0,               0
##MIN=       0,             -159322,         0
##MAX=       1.7004516,     110469,          0
$$ Real data points
##PAGE= N=1
##DATA TABLE= (X++(R..R)), XYDATA
0@%%%%%%%%%%pJ4j4J4j4K1k8K8l5M2m9N8o4P5q8R9j11J28j46J64j86K06k28K57
$$ 0 0 0 0 0 0 0 0 0 0 0 -7 7 -7 7 -7 14 -14 14 -21 21 -28 30 -34 41 -47 52 -59 69 -77 87 -99 107 -121 136
34A36k90L23l58L99m44M90n41N99o62P35q14R02j005J119j250J406j589J807k074
$$ 136 -154 169 -189 210 -234 256 -285 314 -348 387 -427 475 -530 589 -661 745 -844 963 -1111
53a111K414k860L471m368N808q493J5173o1191j08165J31453Q6215n2740o2621
$$ -1111 1303 -1557 1914 -2454 3354 -5139 10034 -51157 -159322 -27869 58346 5606 -57015
66e7015J4945L4447K8885L485j7894j6318J8068K5622p745m0186j2256L1487J9960
$$ -57015 -42070 -7623 21262 24747 6853 -9465 8603 34225 26480 -13706 -25962 5525 25485
79B5485k9465k9586J0789K7004K663j1797l417J0007N880l94K092M93p657r52
$$ 25485 -3980 -33566 -22777 4227 6890 -4907 -8324 1683 7563 7169 9261 9754 2097 1145
93A145P250n473j7007K360J8094k338j6562J490J3657J929l959K961J274l826
$$ 1145 8395 2922 -14085 -11725 6369 4031 -12531 -11041 2616 4545 586 3547 4821 995
107I95Q2M146j328n688j593L435Ln969p92P642K297o290q71O610J532l122N79
$$ 995 1077 5223 3895 -1793 -3386 49 52 -5917 -6709 933 3230 -3060 -3931 2679 4211 1089 1668
124A668K026j917l281L67L201k415l218J911K267k863r79M526J470l037n20L128
$$ 1668 3694 1777 -1504 -1137 2064 -351 -3569 -1658 609 -2254 -3233 1293 2763 -274 -794 2334
140B334k44j937M34J184j669j961N42J544n00j829P65J972p12o92J327J562j301
$$ 2334 2090 153 587 1771 102 -1859 -1317 227 -273 -2102 -1337 635 -77 -769 558 2120 819
157H19j300J045Q77j388p05J208k69j724J12J141N38j274L81J467k49r70R76M64
$$ 819 -481 564 1441 53 -652 556 287 -1437 -1325 -184 354 -920 -539 928 679 -291 685 1149
175A149p05r41P31J03r12j36P31j17n19m8O31M72l62k42M73K17o06P9N89l78o90
$$ 1149 444 -497 234 337 -575 -711 20 -97 -616 -664 -33 439 77 -165 308 525 -81 -2 587 209 -481
196d81M33M19n66m14O61J25m27O1N19j37o7j95O26k95k41k12L27pn05L4K17J40
$$ -481 -48 371 -195 -609 52 177 -250 -189 330 193 126 -69 557 262 21 -191 136 129 -376 -342 -125 15
218A5n11N25K10r4j86J17K56P0o40K47J16k94l63O34qm78M3N56n8l15j78O45k55
$$ 15 -496 29 239 145 -41 76 332 402 -238 9 125 -169 -532 102 94 -384 -341 215 157 -158 -336 309 54
241E4l9J09K52j67l57L53k8l74R7O4P0n61L47L65k10L0j04L52K2k50k08K50l59
$$ 54 15 124 376 209 -148 205 177 -197 -100 -36 34 -527 -180 185 -25 5 -99 253 275 25 -183 67 -292
264b92L56k48j8N1j49M63J86k14r4k25K78j6k19J99N3m05N0L39o4l99N56j78j7
$$ -292 64 -184 -202 -151 -300 163 349 135 41 -184 94 78 -141 58 111 -294 -244 95 31 -368 188 10 -7
287gj44M02k30j78J50K49l18L15mk20N9k01o7J23J7K42k01J16k08J97l6m7j45
$$ -7 -151 251 21 -157 -7 242 -76 239 235 15 74 -127 -194 -71 -54 188 -13 103 -105 92 56 9 -136
310a36o6p2M68j79J80l35K77P4j05L0j04j46K76j25lk31L93j91J98l38J66k44
$$ -136 -202 -274 194 15 195 -140 137 211 106 136 32 -114 162 37 34 -197 196 5 203 -135 31 -213
332b13K51o0K08l05J79p7j18L33o3O4j4j21j92K13l87K16L2N3K58n20M32k79j47
$$ -213 38 -22 186 -119 60 -17 -135 198 135 199 185 64 -128 85 -302 -86 -54 -1 257 -263 169 -110 -257
355b57J75Q0k49Q9K15m2K87k22j8R3k81L9N1K16k51J59l2L4k24k7Q9J4%J03R4
$$ -257 -82 -2 -251 -162 53 11 298 76 58 151 -130 -91 -40 176 -75 84 52 86 -138 -165 -76 -62 -62 41 135
380A35j54Q7k08J56j22K03j29K08k33J55J95k80nK57k72J55j74O3L27l64r4P3
$$ 135 -19 68 -140 16 -106 97 -32 176 -57 98 293 13 8 265 -7 148 -26 37 364 0 -94 -21
402b1k1k9j76J25J69q6J60j0k11J02j75K69j81J1n1K04J24J13j77L1j28o7L10
$$ -21 -42 -71 -247 -122 47 -39 121 111 -100 2 -173 96 -85 -74 -125 79 203 316 139 170 42 -25 285
425B85m05J98j32J19k10Q5J54J66l28L47m75K42J43l63j28M08k94J04K46k46M08
$$ 285 -120 78 -54 65 -145 -60 94 260 -68 279 -196 46 189 -174 -302 106 -188 -84 162 -84 324
446C24j29j05j1p2j17J87K16j22j03M2M4k29J8k74K37L0J21L9j11K4k63J16M5
$$ 324 195 90 79 7 -110 77 293 171 68 110 154 -75 -57 -331 -94 -64 57 96 -15 9 -254 -138 -93
469i3O0J07l1R3k98L54m73L93K68l42J11j96K63k87M0k45K06j27NK58j20J34j35
$$ -93 -33 74 43 136 -162 192 -281 112 380 38 149 -47 216 -71 -31 -276 -70 -197 -192 66 -54 80 -55
492e5o3l9R4J23k15J1J04MK43m4M7l50J67j06J41M6l38L49k16M12l55l7q4K89
$$ -55 -118 -157 -63 60 -155 -144 -40 -36 207 163 210 -140 27 -79 62 108 -230 119 -97 315 -40 -77 -161 128
516A28P6l61pK00p8Q9j17l7J9J35K8O8m46J28M62l65k63qK73k10J80K18P9l51
$$ 128 204 -157 -164 36 -42 47 -70 -107 -88 47 75 143 -303 -175 287 -78 -341 -349 -76 -286 -106 112 191 -160
540a60J41m8K13n8k09nK98j46j76L20l27J31J01j68j11J8Q4N1jK53k16j4J4N8
$$ -160 -19 -67 146 88 -121 -126 172 26 -150 170 -157 -26 75 -93 -204 -186 -102 -51 -52 201 -15 -29 -15 43
564D3k6N7J70k09K1m66M48Pr0Q8N6j05j0k37J92k5K4o4P7K34J67j68k07K85k80
$$ 43 17 74 244 35 56 -410 38 45 -45 43 99 -6 -16 -253 -61 -86 -62 -126 -49 185 352 184 -23 262 -18
589a8oO2j71K20k37J90j69m6J03l1N4J45k6Q9k16J85l29L0J65P3j76K17o1k16
$$ -18 -24 38 -133 87 -150 40 -129 -175 -72 -103 -49 96 70 159 -57 128 -201 -171 -6 67 -109 108 47 -169
613a69L07k40J04MoK98l02n0m9O0M2J06j69J86r5J47k49K20l79L19q0K0M6P2l23
$$ -169 138 -102 2 6 0 298 -4 -54 -103 -43 -1 105 -64 122 27 174 -75 145 -234 85 5 25 71 143 -180
638a80J14K62l82K56j47l4L09m5k0l63P2L82j93j19J2K63m13L30no5j44J50j45
$$ -180 -66 196 -186 70 -77 -111 198 153 133 -230 -158 224 31 -88 -76 187 -226 104 99 34 -110 40 -105
661a05K44l03K4J35n0P1l17K06J31O5k9M5M0l94L21l79l5N26j30k28J30k1m5K7
$$ -105 139 -164 -140 -5 -55 16 -301 -95 36 101 72 117 157 -237 84 -295 -330 196 66 -162 -32 -53 -98 -71
685g1N3j7l7J92L29o73R2k00K58J00j92K54j01j10M09k24j15J32k1m5k45J61P9
$$ -71 -18 -35 -72 120 449 -224 -132 -332 -74 26 -166 88 -13 -123 286 62 -53 79 58 13 -232 -71 8
708HJ5j67K56l44L91l79L61j44J63k39O8P7o8L08o7k40K64l43Q7J3nJ23l37K23
$$ 8 23 -144 112 -232 159 -220 141 -3 160 -79 -11 66 -2 306 239 -1 263 -80 7 20 15 138 -199 24
732B4N4l43R2J28j02J43N4k44L73k60q7L44j00j05j2J87n12M35r3p6j62M10J61
$$ 24 78 -265 -173 -45 -147 -4 50 -194 179 -81 -168 176 76 -29 -41 146 -366 69 -24 -100 -262 148 309
755C09j47k34l67P23l04L7j21J85N8k75J67j02m8J89L64k62p9k01j2K8p2J04K4
$$ 309 162 -72 -439 284 -20 17 -104 81 139 -136 31 -71 -119 70 434 172 93 -108 -120 -92 -164 -60 -36
778c6N6p1J57m1k59J14K3K51l84K41l0k56Qo4K25J37j15j00J98j37J14j28O0j41
$$ -36 20 -51 106 65 -194 -80 -57 194 -190 51 21 -235 -227 -291 -66 71 -44 -144 54 -83 31 -97 -37 -178
802a78N2J65j4K3P7k34K18k96R8J69j56j25M5l12L10J10r4J57o4J30mP1L6J41
$$ -178 -126 39 25 48 125 -109 109 -187 -89 80 -76 -201 -156 -468 -158 -48 -142 15 -49 81 77 148 184 325
826C25oj94j83K13K3j44L6k41K03J7j8j6k58RQ0J0J73P8j06P0j00L17j92M0k98
$$ 325 319 125 -58 155 178 34 70 -171 32 49 31 15 -243 -234 -154 -144 29 107 1 71 -29 288 96 136 -162
851a62L72j61J78j47J3J1l14J96j26O7k3J7m9j17j82N51l80L39j93M3L23j88K04
$$ -162 210 49 227 80 93 104 -210 -14 -140 -73 -96 -79 -128 -245 -427 124 -256 83 -110 -67 256 68 272
874B72l65j3j18K11J3l1R6lK27l25k00N38l04k3O6J57n7j92K54l0n0k76K73k87
$$ 272 -93 -106 -224 -13 0 -31 65 62 289 -36 -236 302 -2 -25 41 198 141 -51 203 173 123 -153 120 -167
898a67J67J18p4k54K55j15J60j3R2k76j81L80k64J53J10r1J61k96K55k11k70K68
$$ -167 0 118 44 -210 45 -70 90 77 169 -107 -288 92 -172 -19 91 0 161 -135 120 -91 -361 -93
920i3Q5j57J65m9J79k77K19k91K48M7R1j6k40q1K90j0K10n94K36l12L91n3o0R9
$$ -93 -8 -165 0 -49 130 -147 72 -219 29 76 167 151 -89 -170 120 110 320 -274 -38 -350 41 -12 -72 27
944B7q2p3j0K04l8r6M4j2rK06j36J62l72J02K49O0k32J13J7k80J49K1j4K7n4j31
$$ 27 -55 -128 -138 66 28 -68 -24 -36 -45 161 25 187 -185 -83 166 226 -6 107 124 -156 -7 14 0 27 -27 -158
970a58K64RK2j02J76k90l9L77p04N50l17NK61L19m23O7N8k17L77j91l07J67P8
$$ -158 106 115 137 35 211 -79 -118 259 -445 105 -212 -207 54 373 -50 17 75 -142 235 44 -263 -96 -18
993a8J8K37l06K53P1j28O7l05Q5M9m1k3lk22L37kk96J70P6j07J57LR2k02J67j83
$$ -18 0 237 -69 184 255 127 194 -111 -26 23 -18 -41 -44 -266 71 69 -227 -57 19 -88 69 72 164 -38 129 -54
1019e4j6j23L87j39j15J05o1k75L87j0K88j82k20n5K2m8L01l46J33m4j7K26l83
$$ -54 -70 -193 194 55 -60 45 -16 -291 96 86 374 192 -28 -83 -61 -109 192 -154 -21 -65 -82 144 -239
1042b39J50J63K21l92%J09R3l77K45n1M31k09j33j23J5J29j34K9K99n3k8P8j33
$$ -239 -89 74 295 -97 -97 12 105 -272 -27 -78 353 144 11 -112 -97 32 -102 -73 226 173 145 223 90
1065I0k0qJ62k52J28n40N27M9m25L42R4J25m30L15m0K40n09R7J3m9M9J71n1k50
$$ 90 70 62 224 -28 100 -440 87 136 -289 53 147 272 -158 157 117 357 -152 -55 -42 -91 -42 129 78 -172
1089a72n9K52J56K2j71j60NJ23Q4Pj73K69l36k12M29j79Q9J02L1P2l77K65n38
$$ -172 -231 21 177 199 28 -132 -127 -4 80 87 -86 183 -153 -365 64 -115 -26 76 107 179 -198 67 -471
1112d71L71k09M86j64K01k00j59N1nL23k20l72M91j71L8J47k11NQ4p6J5J94k41
$$ -471 -100 -309 177 13 214 14 -145 -94 -99 224 4 -368 123 -48 -10 137 -74 -69 15 -61 -46 148 -93
1135i3J01K84l07K13j90j70K67j94K16k45l0O2M6Mk17J79J85j69JJ67L00m40K49
$$ -93 8 292 -15 198 8 -162 105 -89 127 -118 -148 -86 -40 -36 -253 -74 111 -58 -57 110 410 -30 219
1158B19Ml34J1J68j12K56j44N7lj59K7L2R3j38K08j95K04j91Rk10N6J73k0j05
$$ 219 223 -111 -100 68 -44 212 68 125 122 -37 -10 22 115 -23 185 -10 194 3 12 -198 -142 31 11 -94
1182i4j86J50l6J34j28L59J40l23J06k7k67K94j25K10k28J29k53J08K50P8k91
$$ -94 -280 -130 -166 -32 -160 199 339 16 122 95 -172 122 -3 207 -21 108 -145 -37 213 291 0
1203@J42j23J82j82kO0l2Rj55L32m19K13j42J34j43M8k0L6J93j94J49o4J22M5
$$ 0 142 19 201 19 17 77 45 54 -101 231 -188 25 -117 17 -126 -78 -98 -62 131 -63 86 22 144 189
1227A89j48j63l4M0M98o78K06J73J10k76k0J20N2r1J20J56j20j12L5p7J25k64
$$ 189 41 -122 -156 -116 382 -296 -90 83 193 -83 -103 17 69 -22 98 254 134 22 57 -20 105 -159
1249a59J24K8n6j73L22k12L9J79P1l13K26kp6J37l2mo3k43n9O24j59l71J7n3L19
$$ -159 -35 -7 -63 -236 86 -126 -87 92 163 -150 76 74 -2 135 103 99 36 -207 -266 358 199 -172 -155 -208 111
1274A11k75R2j02j00J30K81j41P6Pk23J92k33M9K31j30j60k7q7J63L02m0j14j95
$$ 111 -164 -72 -174 -274 -144 137 -4 72 79 -144 48 -185 -136 95 -35 -195 -222 -309 -146 156 116 2 -193
1297a93K40M8k12m6L09k77O1J96n04J37K04K72j48k7k25M96n32k4K69L80k74P3
$$ -193 47 95 -117 -163 146 -131 -70 126 -378 -241 -37 235 87 60 -165 331 -201 -225 44 424 150 223
1319B23l80P2J21J9j14J04nP1O1k38J20k52K86j04M9j91M09Pl79Q9K58Ln02K42
$$ 223 -157 -85 36 55 -59 45 40 111 172 -66 54 -198 88 -16 33 -158 251 258 -121 -32 226 229 -273 -31
1343c1L3K00k43j29k2J24L30k73L8j20L27j13M5j26n1k8j89K02J07k3n8p3L50
$$ -31 2 202 -41 -170 -192 -68 262 -11 27 -93 234 121 166 40 -11 -39 -228 -26 81 58 0 -73 277
1366B77k58Q6j17Qj23J62j50n1M45l49K64k18R7k14j00L93k25m4K40j12l7J24
$$ 277 19 105 -12 -4 -127 35 -115 -166 279 -70 194 -24 73 -141 -241 152 -73 -117 123 11 -26 98
1388I8j39Q0r9N2r5K37J5k75O7N7J34j82P1k23Q0M14l13j03M0rJ13O1l8l30Q6
$$ 98 -41 39 -60 -8 -103 134 149 -126 -59 -2 132 -50 21 -202 -122 292 -21 -124 -84 -93 20 81 43 -287 -201
1413b01K68j65RL21j88j30J71J7j93J18J36l32N3M27k57J08j79R3N0k07J64k68
$$ -201 67 -98 -89 232 44 -86 85 102 -91 27 163 -169 -116 311 54 162 -17 76 126 -81 83 -185
1435a85J74R4k30J19Qj2O7k30J02M7J73j84j33L95m91L36j54J97k88J24j16K56
$$ -185 -11 83 -147 -28 -20 -32 35 -195 -93 -46 127 -57 -190 205 -286 50 -104 93 -195 -71 -187 69
1457F9l45J09L39l81K56j84j55L67l46rK05K24k4j68K38k36K35oj58J47l14L29
$$ 69 -276 -167 172 -209 47 -137 -292 75 -271 -280 -75 149 125 -43 195 -41 194 188 30 177 -137 192
1479A92J61l49j95J98j37K21j08J72k10K08j83Rq6J60J1k94K25j27Q2j37M01j92
$$ 192 353 4 -191 7 -130 91 -17 155 -55 153 -30 -21 -107 53 64 -230 -5 -132 -50 -187 214 22
1501B2r9j17j1K92l26K23M9mj96J68j34M1J26j46L21j75r4L00m34J95N1j54J45
$$ 22 -77 -194 -205 87 -239 -16 33 29 -167 1 -133 -92 34 -112 209 34 -60 240 -194 1 52 -102 43
1524D3J04j1m00K37J95r1n3k06J52K1J84J1O4m51l8j6O8J81l9J31J3k59K95jj73
$$ 43 147 136 -264 -27 168 77 24 -182 -30 -9 175 186 250 -201 -239 -255 -187 -6 -45 86 99 -160 135 134 -39
1549c9l1J07Q6j17J16J52l89j1L47o7k33L12k97J49o3l0k46R8J01l1K23j86J21
$$ -39 -70 37 123 6 122 274 -115 -126 221 154 -79 233 -64 85 22 -8 -254 -156 -55 -86 137 -49 72
1572G2j58L94k43k95K45j8l2p5M38m43L10j59l1j46J34P9r1k5L01k09j73J4q1
$$ 72 -86 308 65 -230 15 -3 -35 -110 328 -115 195 36 5 -141 -7 72 -19 -44 257 48 -125 -111 -192
1595a92K05q6R2K45j6k57j12J29k33L49k43J78k98L16o2M3j14K2mm3K28j83j91
$$ -192 13 -73 19 264 248 -9 -121 8 -225 124 -119 59 -239 77 15 58 -56 -34 -38 -81 147 -36 -227
1618b27K76M3j14RL2m3p3J93j89Q5o5L27k74Mj90l2J81N5j23J26N2p3o3Q7j44
$$ -227 49 92 -22 -13 19 -24 -97 96 -93 -8 -73 254 -20 -16 -206 -238 -57 -2 -125 1 53 -20 -83 4 -140
1643a40J26j68J51nj33J42NJ96j47j16K07j25j42o8J65j21K93o8k71L82j71k1
$$ -140 -14 -182 -31 -36 -169 -27 -22 174 27 -89 118 -7 -149 -217 -52 -173 120 52 -219 163 -8 -29
1665b9N9L2l8O8j79q5K4J59R7j52k94L45J29O7j25k56L34k64J89p3L3J39k11r1
$$ -29 30 62 24 92 -87 -172 -148 11 108 -44 -338 7 136 203 78 -178 156 -108 81 8 41 180 -31 -122
1689a22N87k80p3j57L12l58N0J05r8M4J20J09k20j16k76L21M8R0MO4l51l1J4M59
$$ -122 465 185 112 -45 267 -91 -41 64 -34 10 130 239 19 -97 -373 -52 -4 86 90 154 -197 -228 -214 245
1713B45l03J40j86L5n6J5M03l84K83k37J65j23l08L18M25k85r2l0l5k0Q4j20j74
$$ 245 -58 82 -104 -69 -125 -110 293 -91 192 -45 120 -3 -311 7 432 147 55 25 -10 -30 54 -66 -240
1736b40L69k83Q4n4M1J79j29j8l2K05j15q4j51J64n2K52l15J74J16k95K65k2j26
$$ -240 129 -154 -70 -124 -83 96 -33 -51 -83 122 7 -77 -228 -64 -116 136 -179 -5 111 -184 81 59 -67
1759f7j21j5L32Ok10l1K15k48P7O1m44N95l3j11j74K89k79K23Nj91K58j31n0K31
$$ -67 -188 -203 129 135 -75 -106 109 -139 -62 -1 -445 150 117 6 -168 121 -158 65 70 -121 137 6 -44 187
1783A87j55K12m6l54K16j05K9J30LK3k04M1J07j91j4j87K38k33K67J29j51J13
$$ 187 32 244 198 -156 60 -45 -16 114 117 140 -64 -23 84 -107 -121 -308 -70 -303 -36 93 -58 55
1805E5K13k31rj17K40J99m48q6m1L07K64k32l02k6L32j87J67k41n2M51m2l73L20
$$ 55 268 37 28 -89 151 350 -98 -184 -225 82 346 114 -188 -214 118 -69 98 -143 -195 256 214 -159 161
1828A61l4k31L38l36J88L6l26J07L35m43J73j1l5K0j17J61k22K02j4O9k24K95
$$ 161 127 -104 234 -102 86 122 -204 -97 238 -205 -32 -43 -78 -58 -175 -14 -236 -34 -48 21 -203 92
1850I2m7R8l57P0J09K16l41M2m5K04k0k01J28J15K1n1P2J42l61K46j46rP6k99
$$ 92 45 143 -214 -144 -35 181 -160 -118 -163 41 21 -180 -52 63 84 33 105 247 -114 132 -14 -23 53 -246
1874b46K92J18J93l40L2k4J5J9k8k7J00K1QN7j71j18j47J9L18n9k2L37m23J38
$$ -246 46 164 357 17 49 25 40 59 31 4 104 125 133 190 19 -99 -246 -227 91 32 10 347 -76 62
1898F2J02J2l9j30j5j14J31K30k38j70J9J69M8j16J93n4J7l90J81K24K0K59k01
$$ 62 164 176 137 7 -8 -122 9 239 1 -169 -150 19 67 -49 144 90 107 -283 -102 122 142 401 200
1921B00M4j75J55l34J38j06J78l16J61k28M2PJ89M8N5p3M2J74p4M2k15L6R3j25
$$ 200 244 69 224 -110 28 -78 100 -216 -55 -283 -241 -234 -45 3 58 -15 27 201 127 169 -46 -10 83 -42
1945d2k57K96J46N9m98L03K4J41m80L95K88j08q3l03J23j91J19J37L57k86O3j34
$$ -42 -299 -3 143 202 -296 7 31 172 -308 87 375 267 184 -119 4 -187 -68 69 426 140 203 69
1967F9j15J20m11M43J3k42L0m3K48j66K94k93n7J59J66k89J28k61qM5J78n12L78
$$ 69 -46 74 -337 106 119 -123 -93 -136 112 -54 240 -53 -110 49 215 -74 54 -207 -215 -170 8 -504 -126
1990a26r3L32L5q5l95N44r1L9J16k64l6p4j78O4J39p5K95k61L4k3P6J41j1M2P1
$$ -126 -219 113 148 63 -332 212 121 160 276 12 -24 -98 -276 -212 -73 -148 147 -114 -80 -103 -27 114 103 145 216
2015B16j33Q4k03j2K41k62k39L09K27j71l1J0r9L51n27P5K90O7j25m69M40P9K9
$$ 216 83 167 -36 -48 193 -69 -308 1 228 57 26 36 -63 288 -239 -164 126 193 68 -401 39 118 147
2038A47j14k31K08j97J90K61l26j67L57m21M49j99J07j13J59l39J95J21j22J45
$$ 147 33 -198 10 -187 3 264 -62 -229 128 -293 156 -43 64 -49 110 -229 -34 87 -35 110
2058A10l85M36l01R7P4K0l28J25K91l14J14j21L07j52J41k08J86R2j40q0K80l71
$$ 110 -275 161 -140 -43 31 51 -277 -152 139 -175 -61 -182 125 -27 114 -94 92 184 44 -36 244 -127
2080a27N1Q0q7l23N62k73K60l24M20k43j29J89j64L79l52L87m38J37k58L41j72
$$ -127 -76 4 -83 -406 156 -117 143 -181 239 -4 -133 56 -108 271 -81 306 -132 5 -253 88 -84
2101h4L1L6p0J68o7L5J48j83P2j80L71l04K53l34J48k14L55q6n6p3J22l12K47
$$ -84 -53 -17 -87 81 14 49 197 14 86 -94 277 -27 226 -108 40 -174 181 95 39 -34 88 -224 23
2124B3k34M09j00J7k03J11N6r5J69K2l80J66l44M21J62n4l4k42M66k57j80J70
$$ 23 -211 198 98 115 -88 23 79 -16 153 175 -205 -39 -383 38 200 146 112 -130 336 79 -101 69
2146F9j32rn1O2J6j81o1L2K14J97o6k57N54l37q0J43o5Q6q8P0j92K54j69r5J37
$$ 69 -63 -72 -123 -61 -45 -226 -287 -255 -41 156 90 -167 387 50 -30 113 48 134 46 116 -76 178 9 -86 51
2171E1K47j62l30J0R0P5j61K19k4P9k80J77qk5j35M06k10K53l61L23k09K5J18
$$ 51 298 136 -194 -184 -94 -19 -180 39 15 94 -186 -9 -17 -42 -177 229 19 272 -89 234 25 50 168
2194A68p1j77J7K17J04r1j41p0q3R4K34O2m27M7P6K48m01j2lK08k55K91l1j26
$$ 168 97 -80 -63 154 258 167 26 -44 -127 -33 201 263 -164 -117 -41 207 -194 -206 -209 -1 -256 35 4 -122
2218a22J32j16K66j25k38L54p3M9p8N5J8Q8k87J13l06M06k70n0K09J15l67L61
$$ -122 10 -106 160 35 -203 151 78 127 49 104 122 210 -77 36 -270 136 -134 -184 25 140 -227 134
2240A34J38L7m60L5K21j38l5L77k46k4K67j85K2r6r7L4k32J82N0Lo0K53j44j08
$$ 134 272 309 -151 -116 105 -33 -68 309 63 39 306 121 143 47 -50 -16 -248 -66 -16 -13 -73 180 36 -72
2264g2J47j79J28l2p2K40J0J27k08j66J37l00M02j79J3MJ51P3j94j4k54K95j38
$$ -72 75 -104 24 -8 -80 160 170 297 89 -77 60 -240 162 -17 -4 0 151 224 30 16 -238 57 -81
2287h1L64o20K27J37j83q6K37r0L0OO4q0J81L5m3j03K6j47L48k90J11J87j30j63
$$ -81 283 -337 -110 27 -156 -242 -5 -95 -65 -59 5 -75 106 141 98 -5 21 -126 222 -68 43 230 100 -63
2311f3K35k34J30j44J72J34j60l19J09J42j19jm1K04k7k39M46j40r1L98m72j14
$$ -63 172 -62 68 -76 96 230 70 -249 -140 2 -117 -118 -159 45 18 -221 225 85 -6 392 -80 -194
2333a94Q8J42j25L3M3l64M63J03l82J77q3o3l9Q6L53k99q5r3L08k34N4N8l3J15
$$ -194 -106 36 -89 -56 -13 -377 86 189 -193 -16 -99 -162 -201 -115 238 -61 -146 -239 69 -165 -111 -53 -86 29
2357B9LP7j25j97J57o1J58J1J30j12j75l5L6K06k34Q9J49j37M0j6K00K5k97P1
$$ 29 32 109 -16 -213 -56 -117 41 52 182 70 -105 -140 -104 102 -132 -43 106 -31 9 -7 193 218 -79 -8
2381hj12q1K15J72n5j1l12O7n1K70Q4m8j85J09k86Q4J80k13R9J80j07k04N03j71
$$ -8 -120 -201 14 186 131 120 -192 -125 -176 94 178 130 -55 54 -232 -148 32 -181 -82 98 -9 -213 290 119
2405A19l65L4J0K62l0L64l68L5j49K81n1k69o1K76K5m4m80M85J37l12K21K7m9
$$ 119 -246 -212 -202 60 30 394 26 61 -88 193 142 -127 -188 88 113 69 -411 74 211 -101 120 147 98
2428I8k28J46r0j8J90j08M4r1L2k24J09O3J45K3l12N4L55j87k44J06K75l16j31
$$ 98 -130 16 -74 -92 98 -10 34 -57 -25 -249 -140 -77 68 91 -221 -167 188 1 -243 -137 138 -178 -309
2451c09M16j85j80L40k75k39M02L43j80k39J81Rk48k53L65J53j59O6J72j31k78
$$ -309 107 -78 -258 82 -193 -432 -30 313 133 -106 75 84 -164 -417 -52 101 -58 8 180 49 -229
2472b29K8J38L45o2k02l0k5N5J60m4l27J95J91j6k19p0MK20r9k12K77J36k85M2
$$ -229 -201 -63 282 220 18 -12 -37 18 178 134 -193 2 193 177 -42 -112 -108 112 13 -199 78 214 -71 -29
2496b9NJ74K43n21J05q1K8L69j54m66R2J44j1L43J1k01K6J33J27k04j24P3j7j43
$$ -29 -24 150 393 -128 -23 -104 -76 293 139 -327 -235 -91 -102 241 252 51 77 210 337 133 9 82 65 -78
2520g8J13J31j13n0r3P3n1n0j33L05J08q6j15PJ02n7K02k56l56m5K52J5L35j51
$$ -78 35 166 53 3 -90 -17 -68 -118 -251 54 162 76 -39 -32 70 13 215 -41 -397 -442 -190 -175 160 9
2544Ik02K88j49R3J69q8m51R7L33J37j86K8m2l2j2J87l83L22j00l7Q9Q3p0l09
$$ 9 -193 95 -54 39 208 120 -331 -234 99 236 50 78 36 4 -8 179 -204 118 18 -19 70 153 83 -226
2568b26K31J74j98Oj10K68k83J8K23q3l5K00l14R9o0K74l01J91r7L19r0J46k50
$$ -226 5 179 -19 -13 -123 145 -138 -120 103 20 -15 185 -129 -30 -90 184 -117 74 -23 296 206 352 102
2591A02K0j46j81K15K2J22j99m5K8K45K13j24j67k88K10j16j07K12k83K58J06
$$ 102 122 -24 -205 10 32 154 -45 -90 -62 183 396 272 105 -183 27 -89 -196 16 -267 -9 97
2612I7J28j80j99M21m95L3q3J17j97K25K82j11MJ92l42MJ19p9n7L25k25R2J52
$$ 97 225 45 -154 267 -228 -195 -278 -161 -358 -133 149 38 42 234 -108 -104 15 -64 -121 204 -21 71 223
2635B23k7q0k22ML12j97r2J61Mj94j21K78k53K79p0k36k13N93R9K03m73P1r9J89
$$ 223 196 116 -106 -102 210 13 -79 82 86 -108 -229 49 -204 75 5 -231 -444 149 248 451 -22 49 -50 139
2659A39j0j41j78k1L11j93L02j64J99M1n40L27L4r8j9L0J67l94J80k78K24J37
$$ 139 129 -12 -190 -211 100 -93 209 45 244 285 -255 72 106 8 -11 19 186 -208 -28 -306 -82 55
2681E5J12K5j10l8l3n5M32m35R6j77K42j46l5M04o28K07pK9R3k8J23o0m59P15
$$ 55 167 192 82 44 11 -44 388 -47 49 -128 114 -32 -67 337 -291 -84 -91 -62 31 3 126 66 -393 322
2705C22l33K86n11L49k0k30J11j23K33j30Oj16l4L0L68k65K27J09P6m22L16r6
$$ 322 -11 275 -236 113 93 -137 -26 -149 84 -46 -40 -156 -190 -160 208 -57 170 279 355 -67 249 153
2727A53j32m9n6J74K47n07J53R0J46m58J35J00m0J99l80J38QK35k89J97j99M4
$$ 153 21 -28 -84 90 337 -170 -17 73 219 -239 -104 -4 -44 155 -225 -87 -79 156 -133 64 -135 -91
2749i1J64l05M11j87o4K25m49L29K60l71K09j0j48J74j37K37o65J96J95K32m13
$$ -91 73 -232 179 -8 -72 153 -296 33 293 -78 131 121 -27 147 10 247 -418 -222 -27 205 -208
2770b08J67O7K13l2l69J92J18j41j02J5J90J15k22k21K18k10K30n7K26l67M66
$$ -208 -41 26 239 207 -162 30 148 7 -95 -80 110 225 3 -218 0 -210 20 -37 189 -178 288
2791B88l53J62k23J34j74K65k64J66j71J69r6J70L33l55N4l70M46o1O5k53j04
$$ 288 -65 97 -126 8 -166 99 -165 1 -170 -1 -97 73 406 51 105 -265 181 120 185 -68 -172
2812a72k5L32j84L0pK09p7k20Q3m5P4K70n20L19R4r8nm9k6kj76M80l32K87l74
$$ -172 -197 135 -49 -19 -26 183 106 -114 -31 -76 -2 268 -252 67 161 63 58 9 -17 -19 -195 285 -47 240 -134
2837a34M51l56l36L51m5L35j1l27p4K9L13k51R0r6J34J24n63L67r1o6P7K44k86
$$ -134 317 -39 -375 -24 -69 266 255 -72 -146 -117 196 -55 35 -61 73 197 -366 1 -90 -156 -79 165 -121
2860a21J13k90M74J2J3j26j14L23k46P3j39MJ87m8R4m61M29k31r3K05l0r1R7l3
$$ -121 -8 -298 176 188 201 75 -39 284 38 111 -28 -24 163 115 209 -252 177 -54 -147 58 28 -63 34 1
2884Aj23L1J26j51O0K95m7k83M1k3L0K89j16k70R8J50n7k02J0L73q3m59O45k82
$$ 1 -122 -91 35 -116 -56 239 192 -91 -50 -73 -43 246 130 -140 -42 108 51 -151 -141 232 149 -310 335 53
2908E3J56j87K43J09l53L59n19K88j11J16J60m50J34K69m30J10k44L73j42o3n7
$$ 53 209 22 265 374 21 380 -139 149 38 154 314 -136 -2 267 -163 -53 -297 76 -66 -129 -186
2929a86L2j0j4J06j6j67O65k00k84R4j4j8j8l4l21M99j96k07L56m1K27j83P4J23
$$ -186 -154 -164 -178 -72 -88 -255 410 210 -74 20 6 -12 -30 -64 -385 114 -82 -289 67 26 253 70 144 267
2953B67m4k79m2o4K30j73K1J27p7J24L9r8m2M5J64k48K65J2j31K19l84K46o0k55
$$ 267 223 -56 -98 -162 68 -105 -84 43 -34 90 129 31 -11 34 198 -50 215 227 96 315 -69 177 117 -138
2977a38J74J01l9j8j50L13k48n2O4j29J84j71J86K85n40K01P2k54L19M1l19K59
$$ -138 36 137 98 80 -70 243 -5 -57 7 -122 62 -109 77 362 -178 23 95 -159 160 201 -118 141
2999A41K31o58K48J01J67k99o0j42O4L55k87N8Q0K05K6K4k02k22K16j89L04j60
$$ 141 372 -286 -38 63 230 -69 -129 -271 -207 148 -139 -81 -1 204 230 254 52 -170 46 -143 161 1
3021AK21l21p5L11j69K19Q2k06j03P9j35K85l15q9M3R0L61l43J82k95J40p6mK07
$$ 1 222 -99 -174 137 -32 187 269 63 -40 39 -96 189 -126 -215 -172 -82 279 -64 118 -177 -37 -113 -117 90
3045I0K9j07J6J18o4m2j68J41M2k15K55R6j84q6L37j95K79k70Jp0j1K01l79K69
$$ 90 119 12 28 146 82 40 -128 13 55 -160 95 191 7 -79 258 63 342 72 73 3 -8 193 -186 83
3069H3m63N30k46RP1j48j6K12j5j7j73L1J05Q5l5J0J8j74j62K95M8k40J20j52
$$ 83 -380 150 -96 -87 -16 -164 -180 32 17 0 -173 -142 -37 48 13 23 41 -133 -295 0 48 -192 -72 -224
3093b24L37L8l74R8P6P1K7M1n6j18J27p9K21j47k7LJ11J00k42J23K66q2r7J16
$$ -224 113 151 -223 -125 -49 22 49 90 34 -84 43 -36 185 38 11 14 125 225 -17 106 372 290 193 309
3117C09j40k71K13j20K9n9J88J3m2L2m55M61m81R4K73J45m0L4m05J23J96m03o6
$$ 309 169 -102 111 -9 20 -39 149 162 120 152 -303 158 -323 -229 44 189 149 183 -222 -99 97 -306 -372
3140c72M54j16j42k4L17N4j59k57J90Rj81K25K55m45K15j50O6L36l14Q6q0M1N
$$ -372 82 -34 -176 -200 117 171 12 -245 -55 -46 -227 -2 253 -192 23 -127 -61 275 -39 47 -33 8 13
3163A3K35m21M29j39j4O0k58N0L34m36L59Q0l46j79K32O5j8j3j41L11k92m3m8
$$ 13 248 -173 256 117 103 163 -95 -45 289 -147 212 292 -54 -233 -1 64 46 33 -108 203 -89 -132 -180
3186a80K94J20k26K24j75J38k01r7J65j06j3j37P4K70O3l07K4J72l20L31l54L9
$$ -180 114 234 8 232 57 195 -6 -103 62 -44 -57 -194 -120 150 213 -94 -70 102 -218 113 -241 -202
3208b02M37l83jn4R0J91J29l00j4K35k94J13Q0J71j91R3k12K10k40M02l14j29
$$ -202 235 -148 -149 -203 -113 78 207 -93 -107 128 -166 -53 27 198 7 100 -112 98 -142 260 -54 -183
3230a83K95j3j94K77k41JJ92N7K4k98J89l05J48Q2r1J03q0j42M0J07K4J13k53
$$ -183 112 99 -95 182 -59 -58 134 191 215 -83 106 -199 -51 31 -60 43 -37 -179 -139 -32 -8 105 -148
3253a48r3M09J21ok75jK92l68o4K15k5p0J1o6P9o6O0Q1j89L67J99n34L27k19j65
$$ -148 -241 168 289 283 8 7 299 -69 -133 82 57 -13 -2 -68 11 -55 5 86 -103 264 463 -71 256 37 -128
3278a28L48m19K57m48M17q8m99K89K96m1q3l1M90n18j64K62L76j19k86K14M3k19
$$ -128 220 -199 58 -390 27 -61 -560 -271 25 -16 -99 -130 360 -158 -322 -60 316 197 -89 125 168 -51
3300e1k29K17J35K22j84l22K02j27K05r3J41l29K27j65R0qO3P6l7P1j88J48j00
$$ -51 -280 -63 72 294 110 -212 -10 -137 68 -25 116 -213 14 -151 -61 -69 -6 70 33 104 -84 64 -36
3323c6j10J45L22k18k94J20P4P7r6k3K42j41j38J86J6l21Q4J65j07K73l1m23L95
$$ -36 -146 -1 321 103 -191 -71 3 80 -16 -39 203 62 -76 110 126 -195 -111 54 -53 220 189 -234 161
3346A61n21L74J57j47K0Pj9P3M7j51k26J78K69k23r4j61L47k92J47L36l52J97
$$ 161 -360 14 171 24 44 51 32 105 152 1 -225 -47 222 -1 -95 -256 91 -201 -54 282 -70 127
3368A27k87l3K68J07k64J25o3J50J19o29K56J16k23J31j05M45j58j23k3o1K08
$$ 127 -160 -193 75 182 -82 43 -20 130 249 -380 -124 -8 -231 -100 -205 240 82 -41 -64 -125 83
3389H3j00R8j61J87j88j25K94N6j1k47QJ70j69K36K4j73J17k08J55m6l35J55K3
$$ 83 -17 81 -80 107 -81 -206 88 144 133 -114 -106 64 -105 131 155 -18 99 -109 46 0 -335 -180 -157
3412a57J6K89j25r3l5O5k28J55M34m90J60k10J93K61k65J57j64O5K9r3j82J31
$$ -157 -141 148 23 -70 -105 -40 -268 -113 321 -169 -9 -219 -26 235 -30 127 -37 28 57 -36 -218 -87
3434h7M47l96j6l2j15K94l8l0J42o1k68q5M10l94j6J44l6N1J83k9k61L24J59l40
$$ -87 360 -36 -52 -84 -199 95 57 27 169 108 -160 -245 165 -229 -245 -101 -137 -86 97 68 -193 131 290 -50
3458e0kJ19j40J57Q5j00O4r8k62L50j00l3J30l95K35K65k45oj89L01nOj08q4R8
$$ -50 -52 67 -73 84 169 69 133 35 -227 123 23 -10 120 -275 -40 225 -20 -26 -215 86 81 87 -21 -105 -7
3483gk10L39J16N1j88k97J19N5k55N22l06RN5K0k72O8J52k23M35l22R5k1L01J15
$$ -7 -217 122 238 289 101 -196 -77 -22 -277 245 -61 -52 3 23 -249 -181 -29 -252 183 -139 -44 -65 236 351
3507C51o95O6L21j9k39j9K83m8K56k78K3N8J65o9l8n9J01m12L16k59K60n4J04
$$ 351 -344 -278 43 24 -215 -234 49 1 257 -21 2 60 225 156 118 59 160 -252 64 -195 65 11 115
3530A15j49J44j38q8L6J81J7l27K98j92j05K60J55l37J92k43R3K3n8Q1K40j77
$$ 115 -34 110 -28 -116 -80 101 118 -209 89 -103 -208 52 207 -130 62 -181 -88 -65 -123 -42 198 21
3552B1j97Q5o6J03L7J49j48p4o1Q8m1j08L86oj74K26k76J68j91P8P0o9J14k68
$$ 21 -176 -91 -157 -54 -17 132 -16 -90 -151 -63 -104 -212 174 168 -6 220 -56 112 -79 -1 69 0 114 -154
3576a54K91k92L24m5l56J99l0Q8o7J09L0j85Q4j01K53j50l77J02N25k51j46K11
$$ -154 137 -155 169 124 -232 -33 -63 25 -42 67 97 -88 -4 -105 148 -2 -379 -277 248 -3 -149 62
3598F2n29Q69m71J17M2j09J12m8J44k51n2j5O9Kj60J20M1k3L51l27k73K20J50
$$ 62 -467 402 -69 48 90 -19 93 45 189 -62 -114 -129 -60 -58 -218 -98 -57 -80 271 -56 -329 -109 41
3621D1J16j57k8r6J9L37j95j91N1j55K20k5L61j88r2J79k72n5j5L99l72k03L22
$$ 41 157 0 -28 -124 -105 232 37 -154 -103 -258 -38 -63 298 110 18 197 -75 -130 -145 254 -118 -321 1
3644Aj53K48l69L59k64K35J24k03K32j5q4R4n04N60M3j19m54L82J0N1J16l50k9
$$ 1 -152 96 -273 86 -178 57 181 -22 210 195 111 205 -299 261 304 185 -269 113 123 174 290 -60 -89
3667h9j72J71J10j2M1J29k35o3p5P6Q1k0n0j95L58j77L20j11j70L33m91Q1M18
$$ -89 -261 -90 20 8 49 178 -57 -120 -195 -119 -38 -58 -108 -303 55 -122 198 87 -83 250 -241 -160 258
3690B58l56l0J39k35K65M3j4k38J60M5l02R1L34m04L31J50j88J4l65L36P9k41
$$ 258 -98 -128 11 -224 41 84 70 -168 -8 37 -265 -174 160 -244 87 237 49 63 -302 34 113 -128
3712a28J92k54k11L92k11K82M0l7k0J25k72J1P6J14k02J43L0J93k35Q3J29j07
$$ -128 64 -190 -401 -9 -220 62 102 65 45 170 -102 -91 -15 99 -103 40 70 263 28 111 240 133
3734A33j71J40jK7j20k4r1J87q9k26J41K73j82N6M4pK4k40O0R4j31M7l1K51j43
$$ 133 -38 102 101 128 8 -16 -107 80 -9 -235 -94 179 -3 53 97 90 114 -126 -66 28 -103 -56 -87 164 21
3759B1J9j27K44m14K81l48J18P9J56j42j07j69J41J91K90m23j20O37p26N11l5
$$ 21 40 -87 157 -257 24 -324 -206 -127 29 -113 -220 -389 -248 -57 233 -190 -310 327 -399 112 77
3780G7m9l23N43m9l42K50k49J88l48L12P3j50K1J67j52Q1k59K32j53R0L1m0l0
$$ 77 28 -295 248 199 -143 107 -142 46 -302 10 83 -67 -46 121 -31 50 -209 23 -130 -40 -9 -49 -79
3803g9K08L1m5j28QK1p0j88O18k90k75K36j31j37N3J49J83P4k31m5k8k40M36o0
$$ -79 129 160 115 -13 -5 16 -54 -242 376 86 -189 47 -84 -221 -168 -19 164 238 7 -38 -66 -306 130 70
3827G0j05J52j94m7K78j77o9K01j58P8K94k96k87J90p6p9j90M33j5j51N1L2k05
$$ 70 -35 117 -77 -124 154 -23 -92 109 -49 29 323 27 -260 -70 -146 -225 -415 18 3 -148 -97 -65 -270
3850b70L20k20L45j35K1l77M40k40J71K15m98K67Q0N3k21j1J91l33m3K85j83J52
$$ -270 50 -170 175 40 61 -316 124 -116 55 270 -228 39 119 172 -49 -60 131 -202 -245 40 -143 9
3872Ik02ll9J73J03p4k33J75k07K99n7j11L8O9R1J1j2K63m85J76N2P1r3j00J48
$$ 9 -193 -196 -235 -62 41 -33 -266 -91 -298 1 -56 -167 -129 -60 31 42 30 293 -192 -16 36 107 14 -86 62
3897F2k9j52L15j11j19K00j02J10j92pj01O2J65Q0q5l05L74l12r6J81K87k40m0
$$ 62 33 -119 196 85 -34 166 64 174 -18 -25 -126 -64 101 181 96 -209 165 -147 -243 -62 225 -15 -55
3920e5J07l1J03k27M4K4j45K78j14J76R0j18p2l71OL31M2l79K55K64k91l62N11
$$ -55 52 21 124 -103 -59 -35 -180 98 -16 160 250 132 60 -311 -305 26 68 -311 -56 208 -83 -445 66
3943F6l5l27K48J76M9k71j90L32Qk55K66K40p04N14r9j1l0J39k19m2L58n27K88
$$ 66 31 -296 -48 128 177 -94 -284 48 56 -199 67 307 -397 117 18 7 -23 116 -103 -145 213 -314 -26
3966b6K07r6r1l44K08r6K78k5J40n3p6j15J29q9K30l22Q0J76k10R8M7J28m39M29
$$ -26 181 85 -6 -350 -142 -238 40 15 155 102 26 -89 40 -49 181 -141 -61 115 -95 3 50 178 -261 168
3990A68j22J40n31M12r4j50j21L06j6j63K73k69P5o4J82P7j43J14j06Q1n1j88
$$ 168 46 186 -345 67 -27 -177 -298 8 -8 -171 102 -167 -92 -156 26 103 -40 74 -32 49 -2 -190
4012a90o9M19pk79k9j7O6k5j02K39j3p8J87j62j54K28P6M3J76l6l54n2K48j56
$$ -190 -259 160 153 -126 -155 -172 -106 -131 -233 6 -7 -85 102 -60 -214 14 90 133 309 273 -81 -133 115 -41
4036d1L01M5n19O2J84J55q5k84K68j79J24K7j52L04j0l72L94l85L07k6j0o5j11
$$ -41 260 305 -214 -152 32 187 102 -182 86 -93 31 58 -94 210 200 -172 222 -163 144 118 108 43 -68
4059f8P4K37j36J24q4q6p8ork1p6K37N7j63PO3k41j15K4J39J93J68P1l97K73k54
$$ -68 6 243 107 231 147 61 -17 -23 -32 -53 -129 108 165 2 9 72 -169 -284 -260 -121 72 240 311 -86 187 -67
4085f7N6K35j82p4J08j13j66M77k2k72K7n6J6K55k30k17L97k13l69N89l45m2O41
$$ -67 -11 224 42 -32 76 -37 -203 274 252 -20 7 -49 -33 222 -8 -225 172 -41 -410 179 -166 -208 433
4108D33k70j26o5K65j52l6o2r3n0O7J88j57J88J3j7K4j35j44j50K04J74j47k27
$$ 433 163 37 -28 237 85 49 -13 -106 -156 -89 99 -58 130 143 126 150 15 -129 -279 -75 99 -48 -275
4131b75K89n1J58k89rL5J75J22j69K69k5n08M15j16j77q5L16r6k62M67k28M25
$$ -275 14 -37 121 -168 -177 -142 33 155 -14 255 230 -278 137 21 -156 -241 75 -21 -283 184 -44 381
4153C81m31J39r8j10J74j67OR3J19q4k2l5j08j88K42nM9P5m6op4lj2J99j16M2
$$ 381 -50 89 -9 -119 55 -112 -106 -13 106 22 0 -35 -143 -331 -89 -94 -45 30 -16 -22 -96 -99 -111 88 -28 14
4179A4J58l01K9K40l9l70M07k10l8L25l38K25m0Q1j76J94l3k66J54Q0j66k8J98
$$ 14 172 -129 -100 140 101 -269 138 -72 -110 215 -123 102 62 143 -33 161 128 -138 16 96 -70 -98 100
4202A00m8j53nKK33l11O7L36l74J7J84q2n2J3Q3M6J80k40J60k21QL5J84j73K22
$$ 100 52 -101 -106 -104 129 -182 -115 221 -153 -136 48 -34 -86 -73 10 56 236 -4 156 -65 -57 -22 162 -11 211
4227B11j77M8j64j9OJ00O9l06M25o7j92Kk5L5J77k05l34N75O2k34k11K86j18k11
$$ 211 34 82 -82 -101 -95 5 74 -232 193 126 -66 -64 -89 -54 123 -82 -416 159 221 -13 -224 62 -56 -267
4251b67L69k68j31J85M1K2Q9j40o7Q1J21K38n04K97N5n7q6j73K30j34M90k22l22
$$ -267 102 -166 -297 -112 -71 -49 40 -100 -167 -86 35 273 -231 66 121 64 -22 -195 35 -99 391 169 -153
4274a53J63l95j25L81K13Pk20J76pK8L2k32M43l95L8j24O07o92J45j09K11q9J08
$$ -153 10 -385 -510 -129 84 91 -129 47 40 68 100 -132 311 -84 -46 -170 437 -255 -110 -219 -8 -97 11
4297A1K51m41L15k85R8J91k25K12n9l00M93l72J85l37L34k30K15k6l35L02j45
$$ 11 262 -179 136 -149 -51 140 -85 127 68 -232 261 -111 74 -263 71 -159 56 30 -305 -3 -148
4318a48K01j36N2J63J5L1K7o9k62L7o2J46j89L70j51J10M3k47j50K6M28j56m7
$$ -148 53 -83 -31 132 147 178 205 136 -126 -89 -151 -5 -194 176 25 135 178 -69 -219 -193 235 79 32
4341C2M6K7k05m5K17o4l1K7p1q9J46k5J46L0J19l44j46M16L3m30K18L07m24J29
$$ 32 78 105 -100 -145 72 8 -23 4 -67 -156 -10 -35 111 141 260 -84 -230 186 219 -211 7 314 -110 19
4365A9K06m37J78pK40j24l2J15j62J07j50o9J16J33l42L78l34pK12J19M2k13k26
$$ 19 225 -212 -34 -41 199 75 43 158 -4 103 -47 -116 0 133 -209 169 -165 -172 40 159 201 -12 -238
4388b38K19J02l03N58l41J98l78k6O8R5K5O3N5k17O0K3J32r6o0J73O2m3k09l7
$$ -238 -19 83 -220 338 -3 195 -183 -209 -141 -46 -21 42 97 -120 -60 -37 95 -1 -61 112 174 131 -78 -115
4412a15J52l9L83m14o3K06j43L0J49j34R1p8j61J29q5K3j65O7K08l4j68K20k1
$$ -115 37 -2 381 -33 -96 110 -33 -3 146 12 103 25 -136 -7 -92 -69 -234 -167 41 7 -161 59 38
4435C8m58M17l4J19K4kK2Rj80J41K69n83K15M9j26q0J75R9j88p6K19l36K30J14
$$ 38 -420 -3 -37 82 106 104 126 135 -45 96 365 -218 -3 46 -80 -160 15 114 -74 -150 69 -267 -37 77
4459G7N4M7j22j30j1L49k89R2k72K00L2k55J20q9M22l95J44L51k59J81k09j95
$$ 77 131 178 56 -74 -85 264 -25 67 -205 -5 27 -228 -108 -197 225 -170 -26 325 66 247 38 -157
4481a57J75l09L66j32J36J12p9Qq1P3j83%O9K0j33p1R2K3PJ64l8K3K25m94J99
$$ -157 18 -291 75 -57 79 191 112 120 39 112 -71 -71 -2 18 -115 -186 -94 -71 -64 100 62 85 310 -184 15
4506A5p2k93M02K31l86K49j35l5J86n40K26Q0J07j26L8J08J36k47j77L90l06j0
$$ 15 -57 -350 52 283 -103 146 11 -24 162 -378 -152 -72 35 -91 -53 55 191 -56 -233 157 -149 -159
4528a59K24J53k61J67l5j07p4M2q7M2J66J41k54J26j89J10L7l7k6J39p6l15K82
$$ -159 65 218 -43 124 89 -18 -92 -50 -137 -95 71 212 -42 84 -105 5 42 5 -21 118 42 -273 9
4551IJ0P3Nj63L27l61M21l38o8k1N3Q8J94j81O7j66m9L1J68k67L39m37o6K84K84
$$ 9 19 92 97 -66 261 -100 321 -17 -85 -106 -53 35 229 48 115 -51 -100 -69 99 -168 171 -266 -332 -48 236
4576B36j85j94K71l52L28o3j0OQ3j47j03J73q3J13n1R0k33J44J91j61q0m3J49
$$ 236 51 -143 128 -224 104 41 31 37 120 -27 -130 43 -40 73 22 112 -121 23 214 53 -27 -70 79
4599G9J99k89L9J7RJ5PK5k45n7J27N0qj63M1j4L11j2j68k35K14M3p8lm9K45j95
$$ 79 278 -11 28 45 54 69 76 101 -144 -201 -74 -24 -32 -195 -154 -168 143 131 -37 -272 -58 -15 -93 -96 -145 100 -95
4626i5K5k37J77J45R7k31k15M93k28j58L42n01O53p1K9L6n7k87n9K92l79L91j82
$$ -95 -70 -307 -130 15 112 -119 -334 159 -69 -227 115 -386 267 196 225 261 204 -83 -142 150 -229 162 -20
4649b0J24j91J78l7Qj06N0l7K43K0j81j4j08P8j39J65N7J2l0rj78o2Q6J92j49
$$ -20 104 -87 91 54 62 -44 6 -31 212 232 51 37 -71 7 -132 33 90 102 72 63 -115 -177 -91 101 -48
4674d8l0n1o1J18J7J32p3K5j61J22j1n1K70o8j65j22J81j02M3O7P5O7k63kn9J88
$$ -48 -78 -129 -190 -72 -55 77 4 29 -132 -10 -21 -72 198 130 -35 -157 24 -78 -35 32 107 174 -89 -91 -150 38
4700C8q0L2k8L3N7k68K19N7m4j2Q3J04m1r6J15l22J93M4k03L74k88L3J82M6k48
$$ 38 -42 -10 -38 -5 52 -216 3 60 16 4 87 191 150 54 169 -153 40 84 -119 255 -33 0 182 228 -20
4725b0J64M2m87J42K25m4k94L05q7L84p2k5l83L1N5l3M01k15j79K0K86K20l89
$$ -20 144 186 -301 -159 66 22 -272 33 -54 330 258 233 -150 -119 -64 -97 304 89 -90 -70 216 436 47
4748D7N1J1j81q2K94k40Q3J6k06K05k06J72rK58l80K39j39k38M27l22J12K90l63
$$ 47 98 109 -72 -154 140 -100 -17 -1 -207 -2 -208 -36 -45 213 -167 72 -67 -305 122 -200 -88 202 -161
4771a61M13m22N4K87j33J1j31J71O3j94K29o25M81L85m21P7k13L03k65j5K67n9
$$ -161 252 -170 -116 171 38 49 -82 89 152 -42 187 -438 43 428 7 84 -129 174 -91 -106 161 102
4793A02L3m67K46L4j03J82k49M6K13q3j50J18L2K4P0j04J38M3J22k39o1L1M7l1
$$ 102 135 -332 -86 -52 -155 27 -222 -176 37 -46 -196 -78 -46 -22 48 -56 82 125 247 8 -53 -22 25 -6
4817fq2K60j99q1L48m02K6K73j65j2J21j45K82j17k29Jk8L6N0j47K18%M8J98l55
$$ -6 -88 172 -27 -108 240 -162 -136 137 -28 -40 81 -64 218 101 -128 -127 -155 -119 -69 -216 2 2 50 248 -107
4842a07J09N5M3r5L22l85J55l02L40j68nj60L36O8k64J67k4k92J03L83m14j02
$$ -107 2 57 100 5 327 -58 97 -205 135 -33 -38 -198 138 206 -58 109 85 -207 -104 279 -135 -237
4864b37L52j78k02K25J01j16j3J73j76n2j09J76j27M8O6R0L37k31L10l25J0Q9
$$ -237 115 -63 -265 -40 61 -55 -68 105 -71 -123 -232 -56 -183 -135 -69 21 358 127 437 112 122 211
4886B11j74M3j50n2K41Mk38j5K01l17K80j80K72k3P2j49N2J14l77M85n62K69l01
$$ 211 37 80 -70 -122 119 123 -115 -130 71 -246 34 -146 126 103 175 26 78 192 -185 300 -262 7 -294
4909b94K08M00k97lMk69K15R4O5o0j78L10m06J37K6J43K19j34k07qK2J61j65k1
$$ -294 -86 314 17 14 18 -251 -36 58 123 63 -115 195 -211 -74 -48 95 314 180 -27 -35 -13 148 -17 -38
4933c8K05l21L1L67n14K53K28j82k06q0L29j23J60p1j10N0k33K02L57l45J90J
$$ -38 167 -154 -123 244 -270 -17 211 29 -177 -257 72 -51 109 38 -72 -22 -255 -53 304 -41 149 150
4955A50l05J7K54o7l64J72M5O0J30j76L31j64PP0Rm01L66M8j23K3k80L46l08K10
$$ 150 -155 -138 116 49 -315 -143 -98 -38 92 -84 247 83 90 160 169 -232 134 182 59 82 -198 148 -160 50
4979E0R1j63J83j8k1j5j02k28K11l07N49l74J3M23l02l14M9P11o96K75P3J65l09
$$ 50 141 -22 161 143 122 107 5 -223 -12 -319 230 -144 -131 292 -10 -324 -275 436 -260 15 88 253 -56
5002e6l09K27M29m30M2K07k62J27k0K3o7r0K32L9m00K46j81j33L07J37lk79J95
$$ -56 -365 -138 291 -139 -97 110 -152 -25 -45 -22 -89 -179 53 92 -308 -62 -243 -376 -69 68 65 -214 -19
5025a9J67J1k30R7l3k70J17L18M8k08o9J29k48K02%k16K2j7L09j27q9J00L4j64
$$ -19 148 159 -71 26 -7 -277 -160 158 206 -2 -71 58 -190 12 12 -204 -182 -199 110 -17 -106 -6 28 -136
5049a36J7J1J33k12J93K79q4Q8j95r5k6R6q2k23O1O5J1J5J8K08l01K27l30P5M9
$$ -136 -119 -108 25 -187 6 285 201 289 94 -1 -27 69 -13 -236 -175 -110 -99 -84 -66 142 -159 68 -262 -187 -138
5074a38J99j37O6k24K00O7j91L24lj32K3m31K24J86O3j63K65k06M9j51ko3N4P5
$$ -138 61 -76 -10 -234 -34 33 -158 166 163 31 54 -377 -153 33 96 -67 198 -8 41 -110 -112 -175 -121 -46
5098d6n6j00L67O3l39j23L27j7m14L88J01m25M18q8oj62J28N0m1l5m2N27m68k25
$$ -46 -102 -202 165 228 -111 -234 93 76 -338 50 151 -274 144 56 50 -112 16 66 25 -10 -52 475 7 -218
5122b18K84J47j50n0p6O9Q2j27J12K17l64Q0Q3k02M00q1k68J82J31l48J6N4N7
$$ -218 66 213 63 13 -63 6 88 -39 73 290 -74 6 89 -113 287 206 -62 120 251 -97 -81 -27 30
5145C0k19L9K21m5n8J93m9r5j75K57Qj66K77l60K06o3o3K07l25K35j75j07K47
$$ 30 -189 -150 71 26 -32 161 112 17 -158 99 107 -59 218 -142 64 1 -62 145 -180 55 -120 -227 20
5168B0j44M28m42M15l93K52k3J11k86J89j56J34L2o5J53m84J87J62oj68K28l25
$$ 20 -124 304 -138 277 -116 136 113 224 -62 127 -29 105 137 72 225 -259 -72 90 84 -84 144 -181
5190a81K7l0L73j06k02j0K06m4Q6J11q1k25J31l3j58K0J06lj18j02M97j79k80
$$ -181 -154 -184 189 83 -119 -129 77 33 119 230 149 -76 55 22 -136 -116 -10 -13 -131 -233 264 85 -195
5213a95Q3q4N8m0J54m3o0L29k32j20J15j06j4Q5J36O7J25m31K3O4O4j29k45M41
$$ -195 -112 -196 -138 -178 -24 -67 -127 202 -30 -150 -35 -141 -155 -70 66 133 258 -173 -150 -86 -22 -151 -396 45
5237D5M8l9Q8K37l38M13m33j70K45K3k74K09O5j59O0Pl2J44qj94j04M29k97J36
$$ 45 93 54 142 379 41 454 21 -149 96 119 -155 54 119 -40 20 27 -5 139 131 -63 -167 262 -35 101
5261A01n5J46Qp3L1j11K28k78o6J05R4k6k68q4J91k58J92n1K63r0J77m66K86P3
$$ 101 46 192 200 127 158 47 275 -3 -69 36 130 104 -164 -248 -57 -315 -123 -174 89 -1 176 -290 -4 69
5285F9k27J84L1n55N04m9J39q2k4J37Jj90K23q4j64L47k68J74J01l12L24m40J13
$$ 69 -158 26 57 -498 6 -43 96 14 -10 127 128 -62 161 77 -87 260 -8 166 267 -45 279 -161 -48
5308d8M19m29j64J55J72Kn91K87L55k29J11j17J80r6l90M41J05j60O4Q7l47M4
$$ -48 371 -58 -222 -67 105 107 -484 -197 158 -71 40 -77 103 7 -383 58 163 3 67 154 -193 -149
5330a49J98N7n4p3k3M23l55p4j90L65k33J16O8j95M9O3J83n06O21n27j1J85j85
$$ -149 49 106 52 -21 -44 379 24 -50 -240 125 -108 8 76 -119 -70 -7 176 -330 291 -236 -247 -62 -247
5353b47M13k46J55o6r6m6L44l39p7L15L2K7k75J64l4J2p3R9k22J94k5J51l75K08
$$ -247 166 -80 75 9 -87 -133 211 -128 -205 110 142 169 -106 58 24 36 -37 62 -160 34 9 160 -215 -7
5377gj34N5n1P0Rq9K36r0J97j21l21Q2L21k66K11Oj77R8rk62K4L22n32L51l0K82
$$ -7 -141 -86 -137 -67 -58 -147 89 -1 196 75 -246 -164 157 -109 102 108 -69 29 20 -242 -218 104 -428 -77 -107 175
5403A75p2j93j75M7k1J2K43k44J2L22j27j1k4j30J05J00J66m46K52J02m42L04
$$ 175 103 -90 -265 -218 -239 -227 16 -228 -216 106 -21 -32 -56 -186 -81 19 185 -261 -9 93 -349 -45
5425d5J28j21J3Q9J04j84O4j48L02j76j29J51J09k19K4K7K79n1k55J73L9J0l03
$$ -45 83 -38 -25 64 168 -16 48 -100 202 26 -103 48 157 -62 -38 -11 268 217 -38 135 174 184 -119
5448a19n5L20j42j16J43J93J2m37K79N9n3r4r8K56K1n28K87K16j69J80k66K28
$$ -119 -174 146 4 -112 31 224 236 -201 78 137 84 -10 -108 148 169 -359 -72 144 -25 155 -111 117
5470A17j63q2L05j62J6j29j33J90P5R4l40J0L49k04L33q7m86J76L16k62R0k14
$$ 117 -46 -128 177 15 31 -98 -231 -41 34 128 -212 -202 147 -57 276 189 -297 -121 195 -67 23 -191
5492a91N54n62K20j40J16L19m44J4J43j49L55j26Q7k66J61r6J0k61K39J1pj6k09
$$ -191 363 -199 21 -119 -3 316 -128 -114 29 -120 235 109 196 -70 91 -5 5 -256 -17 -6 -13 -29 -238
5515b38L30j63j6l3m6K98l77N9L89l34K15k0krj84k5M23k09k48K68l1N7k07M0
$$ -238 92 -71 -87 -120 -166 132 -245 -186 203 -131 84 64 62 53 -131 -156 267 58 -190 78 47 104 -103 -63
5539f3J35K31l48m5K66r5L2nn3k64L54r4j31J09l17J87J05k47K23j07L39j77J73
$$ -63 72 303 -45 -90 176 81 113 108 55 -209 145 51 -80 29 -288 -101 4 -243 -20 -127 212 35 208
5562B08j47K20k98mRn0L61q0nl30K88q8j38J86m48O24o28J86J04r2K4p7L75n53
$$ 208 61 281 -17 -21 -12 -62 299 219 214 -116 172 84 -54 132 -316 308 -320 -134 -30 -122 -98 -175 200 -353
5586c53L65M4j49J10po2n0J38O1l35K29L40m09K08k38K38k1k03N3M3n11L62Q2
$$ -353 12 56 -93 17 10 -52 -102 36 97 -238 -9 331 -78 130 -108 130 109 -94 -41 2 -509 -147 -65
5609f5K08j80L87l64J73m6m1P1mk83J9J12J40Pm19L02N9J49p2j28q8j39J34K02
$$ -65 143 -37 350 -14 159 113 72 143 139 -144 -125 -13 127 134 -285 17 76 225 153 25 -63 -202 -68 134
5633A34j89J64m13M48l26L76l20j31M67j48k68j22L75k39K56j24o9L36k38j36
$$ 134 -55 109 -304 144 -182 194 -126 -257 210 62 -206 -328 47 -192 64 -60 -129 207 -31 -167
5653a67K96j34J8n0k26M35m9k30R4J74k64k3L79o8k68j76K68K30r2r8NR1O8K70
$$ -167 129 -5 13 -37 -263 172 123 -107 -13 161 -103 -126 253 185 -83 -259 9 239 147 49 54 145 213 483
5677D83n49r6J60m6P4l58K85K91m41K48JO0M5j56j72l1M25l84M92l49M2j18L19
$$ 483 -66 -162 -2 -48 26 -332 -47 244 -197 51 52 112 157 1 -171 -202 223 -161 331 -18 24 -94 225
5700B25k70K63l11m2P8J84l59K67J07J34k62l1K6j38r1M3J8J06r6L0K83o6o1k02
$$ 225 -45 218 -93 -135 -57 127 -232 35 142 276 14 -17 9 -129 -220 -177 -159 -53 -149 -119 164 98 37 -165
5724a65J15o9k7K46j15LJ29l17K36K89j20j95j24j24N68n76J56J40O9k16J79m
$$ -165 -50 -119 -146 100 -15 -12 117 -200 36 325 205 10 -114 -238 330 -246 -90 50 119 -97 82 78
5746G8j22J2%OL60k96j80K97k65K51r2j48J03J24m30L81K07m1l29P4K60n22L27
$$ 78 -44 -32 -32 -26 334 38 -142 155 -110 141 49 -99 4 128 -302 79 286 245 -84 -10 250 -272 55
5769E5J34k30NJ83j55j7k7J99p2L6JK57n28J44j30K53o7J74m03j21R8O1J25j0
$$ 55 189 -41 -36 147 -8 -25 -52 147 75 111 112 369 -159 -15 -145 108 41 215 -188 -309 -211 -150 -25 -35
5793c5k37K29o1R1q4J40j98M56l11l70K7J81J59l8J26k25K98k49nl2M50n58K72
$$ -35 -272 -43 -104 -13 -97 43 -155 301 -10 -380 -353 -172 -13 -51 75 -150 148 -101 -106 -138 312 -246 26
5816B6J98m54J22J6oJ02j46N0M3M71n68K55j05J54j37J36k82k7Q6J06J97j21j31
$$ 26 224 -230 -108 -92 -98 4 -142 -92 -49 422 -146 109 4 158 21 157 -125 -152 -66 40 237 116 -15
5839a5K7K46l00K27j59L65n39J45K02k16J27r4r6L26l4l24J76K04n03R4J86m3
$$ -15 12 258 -42 185 26 391 -148 -3 199 -17 110 16 -80 246 212 -112 64 268 -235 -141 45 2
5861Bj71K17JJ77n68M83k65p5M26l04J26J9m5n5J53j5j54l0J17j91L59j22j33
$$ 2 -169 48 49 226 -342 141 -124 -199 227 -77 49 68 23 -32 121 106 -48 -78 39 -152 207 85 -48
5884d8Rj79L51m1K6j01j92R8k1m3J55j30J76J78m19q9K18J62K51l61L68k53j45
$$ -48 -39 -218 133 92 118 17 -175 -77 -98 -141 14 -116 60 238 -181 -270 -52 110 361 0 368 115 -30
5907c0J8J07k99O2J76n0j12J99p1l6K1j05N1K40k87J54L6n2k96N64q6m00N89j11
$$ -30 -12 95 -204 -142 34 -16 -128 71 0 -36 -15 -120 -69 171 -116 38 74 22 -274 290 204 -196 393 282
5931B82l73o1K23L2K31m43J14J72k60lJ50M5k72K28k18J20KL17l33L10k10M8K1
$$ 282 -91 -152 71 103 334 -109 5 177 -83 -86 64 109 -163 65 -153 -33 -31 286 -47 263 53 101 122
5954A22K6l2l11J2L11Q5r6P6l08J99M11m34j02K39k6j75k76L06J86J12m25j51
$$ 122 148 116 -195 -183 128 213 117 193 -115 84 495 61 -41 198 172 -3 -279 27 213 325 -100 -251
5976b51M72m37PJ72j57K69k16N2q5n7j4L88l54J08j46K40K50R7j82l36M63q4j63
$$ -251 221 -216 -209 -37 -194 75 -141 -89 -174 -231 -245 143 -211 -103 -249 -9 241 338 156 -180 283 199 36
5999C6j24J42oj16O3kj13K58l08j28K85L8J96k21j63j51J82R6l50N11j78R1j46
$$ 36 -88 54 48 -68 -5 -7 -120 138 -170 -298 -13 25 221 0 -163 -314 -132 -36 -386 125 -53 38 -108
6022a08R5K62k66J70N0n50L07K08j58J30m27K36L5p0J95q2k10L66k02j41p1L7
$$ -108 -13 249 -17 153 203 -347 -40 168 10 140 -287 -51 -16 -86 109 27 -183 183 -19 -160 -231 -194
6044a94K30r3L2K28J00l45J70j14JL4k8l04l6L30o0K16l65M82j61l74M12k09k34
$$ -194 36 -57 -25 203 303 -42 128 14 15 49 21 -283 -319 11 -49 167 -198 284 123 -251 161 -48 -282
6067b82N44m80R9N13m76L9k15K57Q2j78J08k3J8k9k20N36k33J54j64r3K6J19J00
$$ -282 262 -218 -119 394 -82 -43 -258 -1 81 -97 11 -12 6 -23 -243 293 60 214 50 -43 -17 102 202
6090B02k52j11L74j17Jo6J96j45J04m14K44j9l15L97j55j88QK41J36o9NJ55Q5
$$ 202 -50 -161 213 96 97 31 227 82 186 -228 16 -3 -318 79 -76 -264 -256 -15 121 52 57 212 297
6113B97L4l06J80m07K33lj58k23K62j7q1N26l81J02j28J12rr5K84j72K14j11k78
$$ 297 331 25 205 -202 31 28 -130 -353 -91 -108 -189 337 -44 58 -70 42 33 -62 222 50 264 153 -125
6136a25J52J00j82J3K39k47L39m03J80j52m03L60O9o1O2l53L24K09j60m9J40k01
$$ -125 27 127 -55 -42 197 -50 289 -114 66 -86 -489 -129 -60 -121 -59 -412 -88 121 -39 -88 52 -149
6158a49J87M4r3L9L4n5K55j16k10J67p5Q9j20QL3J68j54l20L70j94j23J08L7m09
$$ -149 38 82 -11 28 62 7 262 146 -64 103 28 117 -3 5 38 206 52 -268 102 -92 -215 -107 -70 -479
6182d79N12q2mJ29p4j66J94j09q7J2K67k58J65J37j21M69m87k3j92K28K65l47
$$ -479 33 -49 -53 76 2 -164 30 -79 -166 -154 113 -145 20 157 36 505 18 -5 -197 31 296 -51
6204e1K53j42o4J11j10K1j39L26j1k18P3r8o3O7Q9L1k72J25n8J38k66J78P7j6
$$ -51 202 60 -4 107 -3 18 -121 205 194 -24 49 -49 -112 -45 44 75 -197 -72 -130 8 -258 -80 -3 -19
6228a9J23p4K20j38J89j66o1p0j91J44N5l0J42l64qL85qq4J3J01k95J06m0Qm0
$$ -19 104 30 250 112 301 135 74 4 -187 -43 12 -18 124 -240 -248 137 129 45 58 159 -136 -30 -70 -62 -102
6253a02K39j92n5m7N6k01K48P4K27m93K43J27j49J91q5j25K33l79L25J24l64K
$$ -102 137 -55 -110 -157 -101 -302 -54 20 247 -246 -3 124 -25 166 81 -44 189 -190 135 259 -105 -103
6275a03K15m8j03M96n42K79j92n8k37J80N4J43R8K71o85L44n5j67J84k38R5j66
$$ -103 112 64 -39 457 -85 194 2 -56 -293 -113 -59 84 182 453 -232 112 57 -110 74 -164 -69 -235
6297b35L34PKj27j7l7J63j23q2o7K57J3l84K56k21L29J00p1p2m69M50J81O0j69
$$ -235 99 106 108 -19 -36 -73 90 -33 -115 -182 75 88 -296 -40 -261 68 168 97 25 -444 6 187 247 78
6321G8j75J13Q3J70l10L9L53m74M6M5J70j73j08p0L76K1j72m18M18k12L46K8o7
$$ 78 -97 16 99 269 -41 -2 351 -123 -77 -32 138 -35 -143 -213 163 184 12 -406 12 -200 146 174 107
6344A07j73k38L66K7n0Q2L10l66J77j08j00MJ79k37M4K11k10J1J54l59l04K46
$$ 107 -66 -304 62 89 39 121 431 65 242 134 34 38 217 -20 24 235 25 36 190 -169 -473 -227
6366b27K50K13p7l18j4M56k79o8L05j57k27J9J01L0L92l18j64K30k55J19J81j90
$$ -227 23 236 159 -159 -173 283 4 -64 241 84 -143 -124 -23 7 399 81 -83 147 -108 11 192 2
6388Bj62K81m64N27l86K28k22K13L2J39M7j62j29q2j06J27J8n9J76J10p4j46J52
$$ 2 -160 121 -343 184 -202 26 -196 17 49 188 235 73 -56 -138 -244 -117 -99 -158 18 128 54 -92 60
6411F0LJ4j13j06K74k14J80k48M67k08j0J4r3K05l45k14L65j1J26k64M6L2j65
$$ 60 63 77 -36 -142 132 -82 98 -150 317 109 99 113 20 225 -120 -334 31 20 146 -118 -72 -40 -205
6434b05M37j56n51M47M0J01k16M2J06J30k73J07j42L58j31j04M6j9R5j43J35k48
$$ -205 232 76 -475 -28 12 113 -103 -61 45 175 -98 9 -133 225 94 -10 36 17 112 -31 104 -144
6456a44K08K55m21n0N6R2J98j23L9j94N2p6Q4n4K55k33k83K70N1p2K64o7O3l44
$$ -144 64 319 -102 -152 -96 -4 194 71 110 -84 -32 -108 -24 -78 177 -56 -339 -69 -18 -90 174 107 170 -174
6480a74K08J24J27k24k07L71l3l05L19l91Q7J34J49l45J4J16P0k60K37K18k31
$$ -174 34 158 285 61 -146 225 192 -113 206 -185 -98 36 185 -160 -146 -30 40 -220 17 235 4
6501DR2p6K9l0K11n38L71q7L48m62J46o7n1J89l0K2j3j60N0N2r9k19J12J59J06
$$ 4 96 20 49 19 230 -308 63 -24 324 -138 8 -59 -110 79 49 71 58 -102 -52 0 -99 -318 -206 -47 59
6526E9q5PK41n32J39K37j49J48Oj48J20P5j32L9J72l75J66K81k32J86k01Q1Q2
$$ 59 -26 -19 222 -310 -171 66 -83 65 71 -77 43 118 -14 25 197 -178 -12 269 37 223 22 103 185
6549A85l25K13k07L27j22O0j22j05N8kK02k06Q2J64l18n8J79R8j06L84l23J54
$$ 185 -140 73 -134 193 71 131 9 -96 -38 -40 162 -44 38 202 -116 -174 5 103 -3 381 58 212
6571B12l91Q5K51p1n7k82L18k75K3N44k59k95L23l10OK72J61k60Q3q3K01r1o9
$$ 212 -179 -94 157 86 29 -253 65 -210 -187 357 98 -197 126 -184 -178 94 255 -5 78 -5 196 105 36
6594C6J01j92K8r9J53k87Q3l6L95k79J97n49K14L65j83K5j8O0k7p5K0Q3k44J50
$$ 36 137 -55 -27 -126 27 -260 -177 -213 182 -97 100 -449 -235 130 -53 -28 -46 14 -13 -88 -68 15 -229 -79
6618g9R3L17m79p2k20M26q3J08o1k09L50j83L3L1M31n10K2L57o1k28J48m2j04
$$ -79 14 331 -148 -220 -440 -14 -97 11 -50 -259 91 -92 -59 -28 403 -107 -85 272 211 -17 131 89 -15
6641a5n6K59l43J96k25J04J12J69k2l69n6J32O3K00k24j38K06m1j40R7l7j32K83
$$ -15 -71 188 -155 41 -184 -80 32 201 179 -190 -246 -114 -51 149 -75 -213 -7 -48 -188 -91 -128 -260 23
6664B3%p6K6J95p9r4j28L07O4j58p7L3k81K53j39j91P0J83M6P3j85L2j75K22l7
$$ 23 23 -53 -27 168 89 -5 -133 174 238 80 3 36 -245 8 -131 -322 -252 -69 -23 50 -135 -103 -278 -56 -93
6689i3N2k25L87K2j43J18j44J69j23J94l39J18M6o3k09J33L32k63lK11k43M7Q3
$$ -93 -41 -266 121 143 0 118 -26 143 20 214 -125 -7 39 -24 -233 -100 232 -31 -34 177 -66 -19 64
6712F4J97l88J53j12j12J88K97p5j52J35r6qj22Q5j75K05k77J51R5L24m70K71
$$ 64 261 -127 26 -86 -198 -10 287 212 60 195 99 91 -31 54 -121 84 -193 -42 53 377 -93 178
6734A78k6k75L7JR2J9Kj25p7K97Jl6k12J13l7K13j6l08J07k85K42Lk1k91L12r0
$$ 178 152 -123 -86 -85 7 26 28 -97 -174 123 124 88 -124 -11 -48 165 149 -159 -52 -337 -95 -92 -113 -404 -92 -182
6760a82N8K71l8o2Q2j08P0j82k14K80P1J56l00K98n9j32j9P6j57Q5j77L92r7l66
$$ -182 -124 147 109 47 129 21 91 -91 -305 -25 46 202 -98 200 141 9 -10 66 -91 -6 -183 209 112 -254
6784b54K13l53N91j72M7J50l71J10l8K02O0k60K9P6K29l35P0J41J64j55k30m2
$$ -254 -41 -394 197 25 72 222 -149 -39 -77 125 185 -75 -46 30 259 -76 -6 135 299 144 -86 -128
6806a28M23l52J94m34J98M5J31m5k01K29J1L4k68K19n1n7l2j06J6R5nk68M74p4
$$ -128 295 -57 137 -297 -99 -54 77 32 -169 60 71 105 -163 56 5 -52 -84 -190 -174 -79 -84 -352 122 48
6830D8j1k98K63O5j72K24j38N0K98o9l3j9l9o8l09K05Qr7N40n12l35O77m26M09
$$ 48 37 -261 2 67 -105 119 -19 31 329 260 227 208 169 101 -208 -3 5 -92 448 -64 -399 278 -148 261
6854B61l65r8L53l75K54L19l46K13l68M25k40k87k3R8o3K67J56l70J7M28l84J22
$$ 261 -104 -202 151 -224 30 349 3 216 -152 273 33 -254 -277 -179 -242 25 181 -189 -172 256 -128 -6
6876fK57k06J0k49L08j64L16j23J31l13m3M23m16J13j74L07N0l74L0k9J06P6j40
$$ -6 251 45 55 -194 114 -50 266 143 274 -39 -82 341 -75 38 -136 171 221 -153 -123 -152 -46 30 -110
6899a10K21O1Q4k95p5j33m4L89j19p7j88L13J54k30r8K38j29k9K9j31K89J01J5
$$ -110 111 172 256 -39 -114 -247 -291 98 -21 -98 -286 27 181 -49 -147 91 -38 -67 -38 -169 120 221 236
6922B36k03j16P7k30K19lm9K33l29K60j75M8J37j90L47j56k03L02O5m82J79K95
$$ 236 33 -83 -6 -236 -17 -20 -69 164 -165 95 -80 -32 105 -85 262 106 -97 205 270 -212 -33 262
6944B62l25Oj00L17m40J60L2o2J10M5J41L3l79L02j86J55l94J68K91l5j22j60
$$ 262 -63 -57 -157 160 -280 -120 -88 -150 -40 5 146 179 -200 102 -84 71 -323 -155 136 101 -21 -181
6966a81L57r5j91O6J02p3L68m49K76m02L64j2r4j82J39M9n6k15L45j47k07J51
$$ -181 176 81 -110 -44 58 -15 353 -96 180 -222 142 130 36 -146 -7 42 -14 -229 116 -31 -238 -87
6988h7nJ02OJ98L3Rl02R0j18J80j02J86l41J71j58J20k1l0k2J31J61j78K97n05
$$ -87 -92 10 16 214 247 256 -46 44 -74 106 4 190 -151 20 -138 -18 -39 -69 -91 40 201 23 320 -185
7012a85M52m4k48j4k4O8J56m90L22J54l10K14l30k26N10O7m8j71J00K4P1k64L22
$$ -185 267 223 -25 -39 -63 5 161 -329 -7 147 -163 51 -279 -505 5 72 24 -147 -47 -23 48 -216 106
7035A06n9J82k21j73K99j72Q5M4k23M14l6m18P1j65L46q3j85R8K78j37J87n7j36
$$ 106 47 229 8 -165 134 -38 47 91 -132 282 246 -172 -101 -266 80 -3 -188 -90 188 51 238 181 45
7058D5K57j49J46j86k11k7J00L47m22J38K56n01L42j45J49k71J84k70K51r2l2
$$ 45 302 153 299 113 -98 -125 -25 322 -100 38 294 -207 135 -10 139 -132 52 -218 33 -59 -91
7079i1J27J6M6O1j84j67K05p2j15L41j57k09Q8K93k26Q5L29k37k89k7M31k07k0
$$ -91 36 52 98 159 -25 -192 13 -59 -174 167 10 -199 -111 182 -44 41 370 133 -156 -183 248 41 21
7102B1pK38k74ok60J24K93j31j13l9K71R7j65j39l1L93l58o7J19k23L68kk33M5
$$ 21 14 252 -22 -28 -288 -164 129 -2 -115 -154 117 214 49 -90 -121 272 -86 -153 -34 -257 111 109 -124 -79
7126g9Q4R2k86K55l12O4K04j7M6j4k9jm9l41M49o9J63j78l5J18l82K29N2mJ58
$$ -79 5 97 -189 66 -246 -182 22 5 51 37 8 7 -42 -383 66 -3 160 -18 -53 65 -317 -88 -36 -40 118
7151A18l5r7j65l6K03k01K21j60n3M4P1K13m8J7k32n9kK28k6k52jL40M0J54l19
$$ 118 83 -14 -179 -215 -12 -213 8 -152 -205 -161 -90 123 75 92 -140 -199 -201 27 1 -251 -252 88 128 282 -37
7176c7o5J69N4R5J3n1n6k21j29K47R8K47k17%ok42O4j40M5R5J1K5J04l0j54L7
$$ -37 -102 67 121 216 229 178 122 -99 -228 19 117 364 147 147 141 -101 -37 -177 -132 -37 -26 -1 103 73 -81 -44
7202d4J01j05J04K29m60p1L38M6r6P6M2MN7km54J90J71j09K25j59k05mL9J71k65
$$ -44 57 -48 56 285 -175 -246 92 138 42 118 160 164 221 219 -235 -45 126 17 242 83 -122 -126 -87 84 -181
7227a81L54k69j5L22j11l77M15k31R1R6j06j14J44L42p60L72j04J02P0L5J13k36
$$ -181 173 -96 -111 211 100 -277 138 -93 -2 94 -12 -126 18 360 -400 -28 -132 -30 40 75 188 -48
7249d8J62L07n14j9L08j24q3J95k60K2j8nP1L1K62o03L66L8j24K11k46L89k40
$$ -48 114 421 -93 -112 196 72 -11 184 -76 -54 -72 -77 -6 25 287 -316 50 88 -36 175 -71 318 78
7272G8j55N5J20j34k01L58j25L32k89Q8j86j81J36J22l85L68j47K06J10k18J61
$$ 78 -77 -22 98 -36 -237 121 -4 328 39 127 -59 -240 -104 18 -367 1 -146 60 170 -48 113
7293A13r7%Q9l00Q4J87k52K44q2o2J93OmK22k95L30m24P5L3Qj57K56k01J94R8
$$ 113 16 16 105 -195 -111 76 -176 68 -14 -76 117 123 119 341 46 376 -48 27 60 68 -89 167 -34 160 258
7318B58j26J17j08m1r2j05K57m8L9m27L25m14K84J13k80L99o5o3k99LK66j14p8
$$ 258 132 249 141 100 8 -97 160 112 151 -276 49 -365 -81 32 -248 151 86 23 -276 -273 -7 -121 -199
7341a99P4J79J09m59J61J36J80l51K54m95M43J64o1K18k15JK32m48q7M0J0%J85
$$ -199 -125 54 163 -296 -135 1 181 -170 84 -411 32 196 135 353 138 139 371 -77 -164 -124 -114 -114 71
7364G1l27PL50J77r0j15N1k49o9k8k8M74k13k89J90q6O8J06NP7M4l1k37K07k2
$$ 71 -256 -249 101 278 188 73 124 -125 -194 -222 -250 224 11 -278 -88 -174 -106 0 5 82 126 95 -142 65 43
7389D3qP6Q3l15j23J48M5o1Q8J48r7K14j67j06J9J2P8j07o2J77J43n64P6J20m3
$$ 43 35 111 194 -121 -244 -96 -51 -112 -24 124 27 241 74 -32 -13 -1 77 -30 -92 85 228 -336 -260 -140 -183
7414a83L02k00PK02Nk28O3L47j15j76o4K08Q7O4l21o5j6OO7j70J24m1M14l15n0
$$ -183 119 -81 -74 128 133 -95 -32 315 200 24 -40 168 255 319 -2 -67 -83 -77 -10 -180 -56 -97 317 2 -48
7439d8J57j8l56K08J83J9j2j49k24K62K73n45j03L23Q8j03qP4J2j71M78k71k06
$$ -48 109 91 -265 -57 126 145 133 -16 -240 22 295 -250 -353 -30 58 -45 -53 21 33 -138 340 69 -137
7462a37P5j73L55l01J73k22L95k97L42k11MJ32q4k5k63J38j47L83m21L60r9p6
$$ -137 -62 -235 120 -181 -8 -230 165 -132 210 -1 3 135 51 26 -237 -99 -246 137 -284 76 -23 -99
7484i9k5K19J69j99R6j07k60L32k72K14J68l20N1K52j30N7j49j51PJ93J2j66J65
$$ -99 -124 95 264 65 161 54 -206 126 -146 68 236 -84 -33 219 89 146 -3 -154 -147 46 58 -108 57
7507E7O1j19l5J39R4k12J85k41J25j68q4M38k79Q9K27l37K25M2J06j94r6l53N52
$$ 57 118 -1 -36 103 197 -15 170 -71 54 -114 -198 240 -39 50 277 -60 165 207 313 119 23 -330 222
7530B22k29k26K38k2N8m8j39J27M02o25Q8j73L93j09j17K04R4k87j04J54M75p30
$$ 222 -7 -233 5 -17 41 -7 -146 -19 383 -242 -154 -327 66 -43 -160 44 138 -149 -253 -99 376 -354
7552c54L34k2l19M53j94Q7n1l3r9K71n8P1k04J09n6K4p8P3J75j20k23J19R9k0
$$ -354 -20 -42 -361 92 -102 -15 -66 -99 -198 73 15 86 -118 -9 -65 -41 -119 -46 129 9 -214 -95 4 -16
7576a6Q4k4p3K64q2j27l4K70k63j76K85J3m0k06L19m52K25J24m4j09J13J51k10
$$ -16 68 44 -29 235 153 26 -8 262 -1 -177 108 121 81 -125 194 -258 -33 91 47 -62 51 202 -8
7599hn9k14K83J07j08J79l10J44m2Q3J76l87L02k70J49p3M01k40j14k36K22M3
$$ -8 -67 -281 2 109 1 180 -130 14 -28 55 231 -156 146 -124 25 -48 353 113 -1 -237 -15 28
7621B8j34K16K49o19L1J99P8P3q3j41J55j45j20j03K01M0j21J12J33J22n02M62
$$ 28 -106 110 359 -260 -229 -30 48 121 38 -103 52 -93 -213 -316 -115 -75 -196 -84 49 171 -331 131
7643A31j09J19j63M3J95p1k18M4m4j10K48L6p9J41j25K14j70l38J59j01Q0PJ76
$$ 131 22 141 -22 21 216 145 -73 -29 -73 -183 65 101 22 163 38 252 82 -256 -97 -198 -118 -111 65
7666F5Q8j52p4k42N3M59j20j60M5Q8L13l55O4j80J9J14J87m3J57m07o8l3L8k5
$$ 65 153 1 -73 -315 -262 197 77 -83 -38 50 363 8 72 -108 -89 25 212 169 326 -81 -149 -182 -144 -169
7690a69L69l94J65J30l52K63n4J88k58K46k15K07N2J04l03R7M2J79m31O3J90L5
$$ -169 200 -194 -29 101 -251 12 -42 146 -112 134 -81 126 178 282 -21 76 118 297 -134 -71 119 154
7712A54j99o3j2K62m5K23m93L19m69J76P1R4j89P8j82L96P4q0o6k1P2R9k15J58
$$ 154 -45 -108 -120 142 97 320 -173 146 -323 -147 -76 18 -171 -93 -275 121 195 115 49 28 100 199 -16 142
7736A42K7j82K79n26K48k45J82K50j91K69j59R7k1RN2k24K0N5k32K14l78L42j4
$$ 142 169 -13 266 -260 -12 -257 -75 175 -16 253 94 191 170 179 231 7 27 82 -150 64 -314 28 14
7759A4J87l78j55K14pL72J18l69Q8J51l52L58k68K78k4m41R9l24K31K18J04o5
$$ 14 201 -177 -332 -118 -125 247 365 -4 84 235 -117 241 -27 251 227 -214 -115 -439 -208 10 114 49
7781D9k96L89m3j68J96m37M68j95J3k58J55K57l31L30K3k72K11k19K70k70M31
$$ 49 -247 142 99 -69 127 -310 158 -37 -24 -282 -127 130 -201 129 152 -120 91 -128 142 -128 303
7802C03k01k44j12K59K24M6j31J2N9k18O1K72j90o3j52RJ85K3jk07k5j9L82M6
$$ 303 102 -142 -254 5 229 275 144 156 215 -3 58 330 140 77 -75 -66 119 142 141 -66 -91 -110 272 318
7826C18k60p9L9L03m01K51r4J6j37k62L86k07J46l03L69j20m9J33j31P9k67L57
$$ 318 58 -21 18 321 -80 171 77 93 -44 -306 80 -127 19 -284 85 -35 -84 49 -82 -3 -270 87
7848H7J52k58L34l07P8m19K79L10o0l9j42m5K64J55k43l98M87k57k1L68l66r9
$$ 87 239 -19 315 8 86 -333 -54 256 196 157 15 -30 234 389 146 -252 235 -22 -43 325 -41 -140
7870a40L88l44R1k18K63J57pm49J83K13p6K77m27J44r0j35L08k59L51n22M20j26
$$ -140 248 -96 -5 -223 40 197 190 -259 -76 137 61 338 -89 55 -35 -170 138 -121 230 -292 128 2
7892Bk30PM15j39R0k4k45L88l60mJ15N9l1K67m04L40j81P5j19j30q7P6K80l01
$$ 2 -228 -221 194 55 145 121 -124 264 -96 -100 15 74 43 310 -94 246 65 140 21 -109 -196 -120 160 -141
7916a41J05k30L64l97L02N1Q8k53M70l79j54J12k14J68j09L40l08J81PJ22l3q3
$$ -141 -36 -266 98 -299 3 54 142 -111 359 -20 -174 -62 -276 -108 -217 123 -185 -4 3 125 92 9
7938IJ01K3j34M61l82ML05j12m56M0J74J99k25K07J09l54K00j49j41Q6l76N39
$$ 9 110 133 -1 460 78 82 387 275 -181 -141 33 232 7 214 323 -31 169 20 -121 -35 -411 128
7960A28k53j09K33K86m46K92j49J68r5j2o0K0j01k18K79J63k56j40l4M83l65O4
$$ 128 -125 -234 -1 285 -161 131 -18 150 55 43 -17 3 -98 -316 -37 126 -130 -270 -304 179 -186 -122
7982a22M25k43n6K3j86M31M7j99j5m63K52J72P4j08k80J88K70j19m37L73j58J80
$$ -122 303 60 4 27 -159 272 319 120 105 -358 -106 66 140 32 -248 -60 210 91 -346 27 -131 49
8004D9k8K6m02M82k56K3J52R7j1j53J4k65N61m39M6j27K25r5J47l%k23J56m5J56
$$ 49 21 47 -355 127 -129 -106 46 143 132 -21 -7 -272 289 -150 -104 -231 -6 -101 46 43 43 -180 -24 -69 87
8029H7M5k35k07L54r8K2q1k56K03M23l22K16k0j73M0q2Or9M20k18r5q5K77j36
$$ 87 132 -103 -310 44 -54 -32 -113 -369 -166 257 -65 151 131 -42 -2 -84 -78 -177 243 25 -70 -155 122 -14
8053a4J42k14K7J35l80L53j21J87k27K80k83j1L05l39J16k02lN26l12j9K63m02
$$ -14 128 -86 -59 76 -304 49 -72 115 -112 168 -115 -126 179 -160 -44 -246 -249 277 -35 -54 209 -193
8075a93L59J12k24j41R7k04J70J57q1o8J86m17o1K93J09k50j23N06m87K74Q7p
$$ -193 166 278 54 -87 10 -194 -24 133 52 -16 170 -247 -308 -15 94 -156 -279 227 -260 14 101 94
8097I4L4O9k4p4k71J01j05R5J80j93K13j14J72j68j39L25l12P8M1j34K47O9l68
$$ 94 128 197 173 99 -172 -71 -176 -81 99 -94 119 5 177 9 -130 195 -117 -39 2 -132 115 184 -184
8120a84K74j31O2J13J04j04r8J23N3j42Q8j58k50K46K5k12M09k31J51j39j79o7
$$ -184 90 -41 21 134 238 134 36 159 212 70 158 0 -250 -4 21 -191 218 -13 138 -1 -180 -247
8142b47J39K6k8J90M5q2j07K4J13m4o8J99J46m61J43l71L94J18j53l8j30K16k36
$$ -247 -108 -82 -110 80 125 43 -64 -40 73 29 -39 160 306 -155 -12 -383 11 129 -24 -62 -192 24 -212
8165b12J70q4K71j48J90n2M6l75L21k15K93k22J08J70j11l6J61j44k28k81M32
$$ -212 -42 -126 145 -3 187 135 181 -194 127 -88 205 -17 91 261 150 114 275 131 -97 -378 54
8186E4j04J24nm5Q5
$$ 54 -50 74 69 24 109
8191A09
$$ Imaginary data points
##PAGE= N=2
##DATA TABLE= (X++(I..I)), XYDATA
0@%%%%%%%Pj4J4j4K1k8K8l5M7n4O3p7R1j05J26j47J68j96K24k56K91l29L74m23
$$ 0 0 0 0 0 0 0 0 7 -7 7 -7 14 -14 14 -21 26 -28 35 -42 49 -56 70 -77 91 -105 119 -137 154 -175 199 -224
31b24M75n33N96o67P45q29R23j024J134j257J393j542J706j890K095k324K586
$$ -224 251 -282 314 -353 392 -437 486 -538 596 -661 732 -810 896 -994 1101 -1223 1363
48A363k882L222l625M103m681N399o316P536r253J1874j6414K6480r0546M7280
$$ 1363 -1519 1703 -1922 2181 -2500 2899 -3417 4119 -5134 6740 -9674 16806 -73740 -26460
62b6460J36929j01088n9441K6450N9850N488q727l1314j0145J1771K1501j9540
$$ -26460 110469 9381 -50060 -23610 36240 41728 33001 1687 -8458 3313 24814 5274
74E274l3437o144L8384J4996k8344k5845K4067L0211j67j9088k123J0044N343
$$ 5274 -28163 -34307 4077 19073 -9271 -35116 -11049 19162 18995 -93 -2216 7828 13171
87A3171o077l014k181o077l011O829l128j1945M703J8967j094j6383K261J7041
$$ 13171 7094 4080 1899 -4178 -7189 -360 -3488 -15433 -10730 8237 7143 -9240 -6979 10062
101A0062Q52q807j55J364m152q03L359k159m816o33M788J086l966L88P634K036
$$ 10062 10914 2107 1952 3316 -836 -1639 1720 -439 -5255 -5888 -1100 -14 -3980 -3592 4042 6078
117F078o799j505O549J542n258j247J904j510l402J261K805j301l058K862K738
$$ 6078 -721 -2226 4323 5865 607 -640 1264 -246 -3648 -2387 418 -883 -3941 -1079 1659
132A659j817j076L906J616m200j308K957j81k633o6J011j239j147J303J496k40
$$ 1659 -158 -1234 2672 4288 88 -1220 1737 1556 -1077 -1143 -132 -1371 -2518 -1215 281 41
148D1j269J020J820l70j118N80J306j581j657J110R98j305j222J442J02j179M60
$$ 41 -1228 -208 1612 1242 124 704 2010 429 -1228 -118 880 -425 -1647 -205 -103 -1282 -822
165h22J675M3j218L48J151o38p33J53J168j340q41O49L81n17j49N64J31m67n1
$$ -822 853 896 -322 26 1177 539 -194 -41 1127 -213 -1054 -405 -24 -541 -690 -126 5 -462 -513
184e13R45J35m06l16M41K15p55k5R69p49m64K23N39n81K15M14J19m27l57N44O10
$$ -513 432 567 161 -155 286 501 -254 -279 690 -59 -523 -300 239 -342 -127 287 406 -21 -378 166 776
205G76r35q5L89O6k50k97L20j66j18j11L49P1j99L51J67R0m70J3J29k62J0k65
$$ 776 -159 -244 145 211 -39 -336 -16 -182 -300 -411 -62 9 -190 161 328 418 -52 -39 90 -172 -162 -427
227d27N63l70k5J95L13l38j93O52m69K50k57K34R8k62J85k9j34k22K6L61j70l10
$$ -427 136 -234 -259 -64 249 -89 -282 370 -99 151 -106 128 226 -36 149 120 -14 -236 -210 151 -19 -329
249c29K66K90m15J85J16m4J41l33K37O2k89J79L87k30l91j99K06K48l2J33j73
$$ -329 -63 227 -188 -3 113 69 210 -123 114 176 -113 66 453 223 -168 -367 -161 87 55 188 15
270A5j63O1o1k2J40LK14k51L2J79m85L78R2k85n1J85P2j15J60j61p4N9R1K3m43
$$ 15 -148 -87 -148 -170 -30 -27 187 -64 -32 147 -338 40 132 -153 -204 -19 53 -62 98 -63 -137 -78 13 36 -407
295d07M17j8k28N39m10L24p0j90J77j70j4M7K05n00M00j7j03R8j72J64j71q1j7
$$ -407 10 -8 -236 303 -107 217 147 -43 134 -36 -50 -3 202 -298 102 85 -18 80 -92 72 -99 -180 -197
318a97O11k80k90L4M30n48N07j61o2Q1J32r7kj70l6jm0j72K81R9m85N94m15J06
$$ -197 414 134 -156 -122 308 -240 267 106 44 125 257 160 158 -12 -48 -49 -89 -261 20 119 -366 228 -187 -81
342h1j50J76L02l15K87o62L86j34J20j10K41j85J40j85nO5K21l34K24Q7q2o4r9
$$ -81 -231 -55 247 -68 219 -443 -57 -191 -71 -181 60 -125 15 -170 -175 -110 111 -223 1 88 6 -58 -157
365a57K97k58L33m84M51k19J79r6j1pk70K50l0Q1j77K60l74K74j34o0j08L74l00
$$ -157 140 -118 215 -269 182 -37 142 46 35 28 -242 8 -22 59 -118 142 -232 42 -92 -152 -260 114 -186
388a86M6J27q6j34J25J34Q3l45L32k94J68j39J45J50q3l0Qr4K14k21J6k2p7J05
$$ -186 -140 -13 -99 -233 -108 26 109 -236 96 -198 -30 -169 -24 126 43 13 21 -73 141 -80 -64 -86 -163 -58
412e8J16j72O9J97n0j71O9L39m1j15P3j34k9j62k20M8L40K00l49L57n33P8K05
$$ -58 58 -114 -45 152 102 -69 0 339 298 183 256 122 93 -69 -289 -241 99 299 -50 307 -226 -148 57
435E7jJ03kK4k55L0L63j86Q5J5k18J5k65L61kN8O5k71j24J26P1k61Q1j35l1L27
$$ 57 56 159 157 181 -74 -44 319 133 218 233 15 30 -235 126 124 182 247 -24 -148 -22 49 -212 -131 -266 -297 30
461C0Q9L8j53j19O4J6J40n9J80m30K00R2J5l81K56J65m00J15k7Q2J83j54J6L08
$$ 30 119 157 4 -115 -51 -35 105 46 226 -204 -4 88 103 -278 -22 143 -257 -142 -169 -87 96 -58 -42 266
485B66n32K65K40J9m17j9K70m55L25j47M9Q7K21k05J39N0k19p8L10p8q4k91L31
$$ 266 -266 -1 239 258 -159 -178 92 -363 -38 -185 -136 -49 172 -33 106 156 -63 -141 169 91 7 -284 47
508D7k99K74r6O3K06k19L6K44m72K33M4j88N9J71N7o8L8J83m86K99n1K4j83K33
$$ 47 -252 22 -74 -11 195 -24 12 256 -216 17 61 -127 -68 103 160 92 130 313 -173 126 75 99 -84 149
532A49j00J05o0l41L82j23n5k30J52J43j57Q6M2qj12k43L83J51l13k1M91j71j06
$$ 149 49 154 94 -247 135 12 -43 -273 -121 22 -135 -49 -7 -15 -127 -370 13 164 -149 -170 321 150 44
555D4nl05K47J14k51O4J47J4j8j6m78M27O7k68M01j41k25K27l38Q7m4L90N1l75
$$ 44 39 -266 -19 95 -156 -92 55 69 51 35 -443 -16 51 -217 184 43 -182 45 -293 -206 -250 140 191 -184
579a84O9J36j17M4M1l92L41j20K67k79mK39J71l46J39J69l6P8P1j48n03N51j67
$$ -184 -115 21 -96 -52 -11 -403 -62 -182 85 -194 -198 41 212 -134 5 174 138 216 287 139 -364 187 20
602B0P3oJ42m39J00M5J54j0j10l9k40J78m5J39j60j20M59j1k90j78J35K61L9J78
$$ 20 93 87 229 -210 -110 -65 89 79 -31 -70 -310 -132 -177 -38 -198 -318 141 130 -160 -338 -203 58 97 275
626B75l35l9L05l64j28K64J74p0M5R8l28r6N2Q5K17l13K85k6j54J45m2J23K25
$$ 275 -60 -99 206 -158 -286 -22 152 82 127 225 -103 -199 -147 -62 155 -158 127 101 -53 92 50 173 398
649C98l5m52K13r7P7p0j35K24j21j16J21L6j28j90O13l57L07k38m9K46m36J1j4
$$ 398 363 -89 124 27 104 34 -101 123 2 -114 7 43 -85 -275 338 -19 288 50 1 247 -189 -178 -192
672a92M24j75K72j23j92l2q3mr0J80k62M54j89j4k91N32p6J9j08K26l05J25l2
$$ -192 232 57 329 206 14 -18 -101 -105 -195 -15 -277 177 -12 -26 -317 215 139 158 50 276 -29 96 64
695F4J66j82J08m76J52L24R6k00j34K52k03k18Q5J02J92j94K51l98P3L41j80j11
$$ 64 230 48 156 -320 -168 156 252 52 -82 170 -33 -251 -166 -64 128 -66 185 -213 -140 201 21 -90
717i0J20n4J43j34j70K39rm5K9J25l71k4L38l02J93p1lP5J26nj46J52k03j03n1
$$ -90 30 -24 119 -15 -185 54 45 0 29 154 -217 -241 97 -205 -12 -83 -86 -11 115 110 -36 116 -87 -190 -241
742b41L40k65K2J20Q1j49J88k59L27l17MP3J27j55J47j91L2J90j51N1j65K99j61
$$ -241 99 -166 -144 -24 57 -92 96 -163 164 -153 -149 -76 51 -104 43 -148 -116 74 -77 -26 -191 108 -53
765e3J4k03L11J88k53j39J39J8r2L49k31j28k81J73K50j50m4o8J79j44K27J25
$$ -53 -39 -242 69 257 4 -135 4 22 -70 279 48 -80 -361 -188 62 -88 -132 -200 -21 -165 62 187
787A87N8j51k47k26M12N4J09m24O4R0m3L84K08m27j32J19k57K38o6j43K46n1l6
$$ 187 245 94 -153 -379 33 87 196 -228 -164 -74 -117 267 475 48 -84 35 -222 16 -50 -193 53 2 -34
810c4j77K6N15l60K38k16M30n13m8K84o3N3l32L16p9K39k80J05k74L67m0j09k55
$$ -34 -211 -185 330 -30 208 -8 422 -91 -139 145 82 135 -197 119 40 279 -1 104 -170 197 157 48 -207
833b07J47L41p6r2k26J77q9l0j94K34M4J28l48j24L42j69M2J50j51P2K79m37K24
$$ -207 -60 281 205 113 -113 64 -25 -55 -249 -15 29 157 -191 -315 27 -142 -100 50 -101 -29 250 -187 37
856C7j74K90l6j67J86j26l44J52N3p1K41nj70p4N17rj95Q4j74k91K38j3k25O5
$$ 37 -137 153 117 -50 136 10 -334 -182 -129 -200 41 36 -134 -208 309 300 105 189 15 -276 -38 -51 -276 -211
880b11M62r3j28NR5j42K06k44J10j25L51m46K27mK0k86K7K68J6J8j44J73m16J25
$$ -211 251 158 30 35 130 -12 194 -50 60 -65 286 -160 67 63 83 -203 -176 92 108 126 -18 155 -261 -136
904a36N7o6L00o2J36l63m9L11n4j65J22O5n2J90l19M94n00M28k64qN7j29l85K87
$$ -136 -79 -145 155 93 229 -134 -183 128 74 -91 31 96 44 234 -85 409 -91 337 73 65 122 -7 -392 -105
928a05n9L09l37J81J25j37j45J16J26l11J90k01J92k6K3J54K30k70R5k38M77m24
$$ -105 -164 145 -192 -11 114 -23 -168 -52 74 -237 -47 -248 -56 -82 -59 95 325 55 150 -88 389 -35
950c5J7MO8l3n7o1L03o7P9j27j31K21j31L03k32o2j14K23l13j28J81L2J74k88
$$ -35 -18 -14 54 21 -36 -97 206 139 218 91 -40 181 50 353 121 59 -55 168 -145 -273 -92 -60 114 -174
974a74J5K72l40N49k57j30J02J99r5k10j13K04j0j45J98k97M69j33K6j76j00n0
$$ -174 -159 113 -227 322 65 -65 37 236 141 -69 -182 22 12 -133 65 -232 237 104 130 -46 -146 -196
996a96M39k87j45K92k63m9J10O0j54J59p7M13p5o2o0m01K60j8j89K72J23j77j90
$$ -196 243 -44 -189 103 -160 -209 -99 -39 -193 -34 -111 302 227 165 105 -296 -36 -54 -243 29 152 -25 -215
1019b15L14m86O12k46J96p6jj09j52L2L17k1k05K66j66K51n24K98q2J14R5l60
$$ -215 99 -387 225 -21 175 99 98 -11 -163 -131 186 165 -40 226 60 311 -213 85 3 117 212 -148
1041a48o6L07J11k66J88k9m35P31l54j2m4L9lN8J90q07N43l9L84n18L51m02K39
$$ -148 -214 93 204 -62 126 97 -338 393 39 27 -17 22 19 77 267 -540 3 -36 348 -170 181 -221 18
1064A8n9L7J45k54q8J63j2k1J63q0R8j64k1l2k97L23O3l8m8M84k97k02J28J55
$$ 18 -41 -4 141 -113 -201 -38 -50 -71 92 12 110 -54 -75 -107 -404 -81 -18 -56 -104 380 83 -119 9 164
1088A64j55N4n6K4L4K02k66o9j77K85R4J56l23K47k62K90k27oJ04N5j77j93L35
$$ 164 9 63 7 31 65 267 1 -68 -245 40 134 290 -33 214 -48 242 15 9 113 168 -9 -202 133
1111A33j17j13r5J82o7K06m8K2k86O0J6Q6Rj42J37k02M06j82j89N0j67M09n5m0
$$ 133 16 -97 -192 -10 -77 129 81 103 -183 -123 -107 -21 -12 -154 -17 -219 187 5 -184 -134 -301 108 53 13
1135A3N3NO9k06j09L31j01n8j07n7J71K16l99J36O8j90K09l63K11O2j11K38K4
$$ 13 66 71 140 -66 -175 156 55 -3 -110 -167 4 220 -179 -43 25 -165 44 -319 -108 -46 -157 81 105
1158A05J39k46r7L96k86k9L87k60p2m2R6r1K0j05R0L6l85M60P5k86j50R5r8K48
$$ 105 244 -2 -99 297 11 -18 369 109 37 -5 91 0 20 -85 5 41 -344 116 191 -95 -245 -150 -248 0
1182@m0nL2K84j78j75Q8K85l31K06k69K51P1m18J65nL82o27K25m6NK76P0l19L5
$$ 0 -40 -45 -13 271 93 -82 6 291 -40 166 -103 148 219 -199 -34 -39 343 -284 -59 -105 -100 176 246 -73 -38
1207c8J48lk55K09k5J14p2j00O65n37M2l14J73l39M52o4j81L8j76J87J0K20j62
$$ -38 110 107 -148 61 36 150 78 -22 643 106 148 -166 7 -332 120 56 -125 -87 -263 -76 -66 154 -8
1230hM4k60k1j4K11Q2K98m82nK12j42N2k52L4K18j43O70k86k7l73L56k31P4o1
$$ -8 36 -224 -245 -259 -48 34 332 -150 -155 57 -85 -33 -285 -251 -33 -176 494 208 181 -192 164 -67 7 -54
1254e4J0K67k39J76k70O8O3K49l67K76m18L48k24L7O0j9K42j93k07K09k37L83
$$ -54 -44 223 -16 160 -110 -42 21 270 -97 179 -239 109 -115 -78 -18 -37 205 12 -195 14 -223 160
1276A60j54l16J45M94m05m4L34j29J26j75r6k0J3L3J01m19O18l34L1K92k44R2
$$ 160 6 -310 -165 329 -76 -120 214 85 211 36 -60 -80 -67 -34 67 -352 266 -68 -37 255 11 103
1298A03j70O9J92k9k10M9K66m04K99l13L61n88M96j7n3K0j39j0K32kj92P0J57
$$ 103 -67 2 194 165 -45 4 270 -134 165 -148 213 -375 121 104 51 71 -68 -78 154 152 -40 30 187
1321A87k30k32N48n39J36K06j93K86j42J06k63R5K84k27R7Q5k63J02m6k21M6L57
$$ 187 -43 -275 273 -266 -130 76 -117 169 27 133 -130 -35 249 22 119 204 -59 43 -3 -224 -178 179
1343A79j92k35J63K28j03r4J65k38k47N63L2n57N09k53J51J83r1r2j91J2L6K45
$$ 179 -13 -248 -85 143 40 -54 111 -127 -374 189 221 -336 173 -80 71 254 163 71 -120 -108 -72 173
1365A73l47J25K49k07qk38J98K25k3k56L2p0OK04K38j89Q1M0j47r8jN4j25Q7j99
$$ 173 -174 -49 200 -7 -15 -253 -55 170 147 -109 -77 -147 -141 63 301 112 193 233 86 -12 -13 41 -84 3 -196
1390a96L15K26j48J5k14j14L84k60R9j14k87M53J03L7j79M1m61N07k40K1lK05
$$ -196 119 345 197 212 -2 -116 268 8 107 -7 -294 159 262 299 120 161 -300 207 -33 -12 -15 190
1412A90k51j43P6K3J2r2K33l49M63k32m6r1K04p0M48l74J98l26m7P5K14j96L03
$$ 190 -61 -204 -128 -105 -93 -185 48 -301 162 -70 -116 -207 -3 -73 375 1 199 -127 -174 -99 115 -81 222
1435B22l45J15j60K35l28M00k0j16M1o0R2j32J97k44N19l28k17J65L27n41O42
$$ 222 -123 -8 -168 67 -261 139 119 3 44 -16 76 -56 141 -103 416 88 -129 36 363 -178 464
1456D64l64o6j67M9K77M9j13j31k7m9J09M5N7qk36j52o1M90m76K33R9j07K17p3
$$ 464 100 34 -133 -84 193 242 129 -2 -29 -78 31 76 133 125 -111 -263 -324 166 -310 -77 22 -85 132 59
1480E9K22m92M90O4m88q5K66j71K7L66m7k48K1L67l37k06L45N5Qj14k9j65K24
$$ 59 281 -211 279 343 -145 -230 36 -135 -108 258 211 -37 -16 351 14 -192 153 208 216 102 73 -92 132
1503A32P3k36k43K07M1J49J32m64L15k24J99k08R6J68rj64k14K45K0j17P6J27
$$ 132 205 -31 -274 -67 -26 123 255 -209 106 -118 81 -127 -31 137 128 -36 -250 -5 15 -102 -26 101
1525A01p2N1Q1n45L01qL17j61m5jJ56J9m9J3j21k7j35J09K88m77o5L69l89L41
$$ 101 29 80 161 -384 -83 -91 226 65 20 19 175 194 145 158 37 10 -125 -16 272 -205 -270 99 -290 51
1549E1j26O2P3J7r8l9J12l29L44N7l05K49k58M15o02J82M6J82nl64N38k67K8P9
$$ 51 -75 -13 60 77 -21 -60 52 -277 67 124 -181 68 -190 225 -377 -195 -149 33 28 -336 202 -65 -37 42
1573D2j29NJ94j39o7ML40p0j79K26l34L35j39Pm5Q6k29Lj6K75Lq1k86k2L94m13
$$ 42 -87 -82 112 -27 -94 -90 250 180 1 227 -107 228 89 96 51 137 -92 -89 -105 170 173 92 -194 -216 178 -235
1599b35K92O4j0m36K30JJ67m1j82O3K34k65L12K6k62n1O2K47k30j06j4J63j89
$$ -235 57 121 111 -325 -95 -94 73 32 -150 -87 147 -118 194 220 -42 -93 -31 216 -14 -120 -134 29 -160
1622a60k9L14mK1j30k89M55l38m1L93l57OK20l27K95N6JL7j51N2J76j64k10L0
$$ -160 -189 125 121 142 12 -277 178 -160 -201 192 -165 -159 61 -266 29 85 86 123 -28 24 200 36 -174 -144
1646a44J82J6j57j74K69j36o3M81l75P8K01m0M0k27r8L22k51J6j20J04K12k37
$$ -144 38 54 -103 -277 -8 -144 -207 274 -101 -23 178 138 178 -49 -147 175 -76 -60 -180 -76 136 -101
1668a01J9K01p6R0j94L02l98J21K56k42o3J28k23L39k42K26j89QJ54k41M6J13
$$ -101 -82 119 43 133 -61 241 -157 -36 220 -22 -85 43 -180 159 -83 143 -46 -38 116 -125 -79 34
1690C4j2R7k47NO9Q7K10k58R9j40L8M0K31j39j08o9o3J29K60j55k03J55J71j35
$$ 34 22 119 -128 -123 -54 33 243 -15 84 -56 -18 22 253 114 6 -63 -126 3 263 108 -95 60 231 96
1714I6l12N0K75l6j17J51R3k36J10J72j77j96J2qJ30K14m37J04J39j87L14k70
$$ 96 -216 -166 109 73 -44 107 200 -36 74 246 69 -127 -115 -123 7 221 -216 -112 27 -160 154 -116
1736a16L23n94L94l8j85N63o35K58L65m64K95l60K40j58K39K52l63P1j40q9L44
$$ -116 207 -387 7 -31 -216 347 -288 -30 335 -129 166 -194 46 -112 127 379 16 87 -53 -142 202
1757B02j18J79k40p5K39j21l34K35j22J36J68l6J35j54j4j24R3k51L90l34J79
$$ 202 84 263 23 -52 187 66 -268 -33 -155 -19 149 113 248 94 80 -44 49 -202 188 -146 33
1778C3Q6k23J64J05j81L4J04k63L16j23J0P7l58J96J29l14K41p9j20L28k13L29
$$ 33 119 -104 60 165 -16 18 122 -141 175 52 62 139 -219 -23 106 -208 33 -46 -166 162 -51 278
1800B78j02J76m82L46j85p4J63j59J00R5M8k17J34j02M0l3k46M46k00P3j62Q5
$$ 278 176 352 -130 216 31 -43 120 -39 61 156 204 -13 121 19 59 26 -220 226 26 99 -63 22
1822B2k04M34k84J77M6P6j94l31L13P5n9j90Q1J03j54J80Q4k19l5J37R5k72p7
$$ 22 -182 252 -32 145 191 267 73 -258 55 130 71 -119 -38 65 -89 91 175 -44 -79 58 153 -119 -196
1845a96J00J77o0L9p2O6k11K31l5K44n5q02M13n9K07jk0J89j81J88j52J34l29
$$ -196 -96 81 21 60 -12 54 -157 74 39 283 228 -574 -161 -220 -13 -14 -34 155 -26 162 10 144 -185
1868a85jR6k5O9p2L43j4j80j69J40l15K44M2J99j89j28L3R6J71j95K72n96K99
$$ -185 -186 -90 -115 -46 -118 225 211 31 -138 2 -313 -69 -27 172 -17 -145 -112 -16 155 -40 232 -364 -65
1891f5O4m0lJ36J5n0M2k24L38k83Q6j30K82L6l43Q1r7n2J83l00L68m2m3k19J25
$$ -65 -1 -41 -44 92 107 57 99 -125 213 -70 16 -114 168 204 -139 -58 -155 -207 -24 -324 44 2 -41 -260 -135
1916a35q5K21o3q1j30J14J71k83J74J29L54m11j82K24j0K88l50j34O9J83l30J07
$$ -135 -220 1 -62 -143 -273 -159 12 -271 -97 32 386 -25 -207 17 7 295 -55 -189 -120 63 -267 -160
1938a60M22j75K91m39K14l08R1j78J71l3j29L08q2J15k22J40K0J9k18J88j00p2
$$ -160 262 87 378 -61 153 -155 -64 -242 -71 -104 -233 75 -7 108 -114 26 46 65 -153 35 -65 -137
1960a37K2J47K8k4N2O2L4l96M10l49O5O7jj01n4J24L70m54J94K01j11k71R4Q7
$$ -137 -115 32 60 36 88 150 184 -212 198 -151 -86 -19 -20 -121 -175 -51 319 -135 59 260 149 -122 -28 59
1984E9j40o3K22Ql70K50J08k92K8L16k31Lk32r7M17o8L7J08k35J40J86n07L63
$$ 59 -81 -144 78 86 -284 -34 74 -218 -190 126 -105 -102 -334 -431 -14 -82 -45 63 -172 -32 154 -353 10
2007A0K96k77J24k63J73k54J75r9r1M65r2Nk91N4Jp2R6q4%j6J7L5J18J84l45R4
$$ 10 306 29 153 -110 63 -191 -16 -115 -206 259 167 172 -119 -65 -64 -136 -40 -124 -124 -140 -123 -88 30 214 -131 -37
2033c7K83mj65k12J94J76k90J93JJ73k71k6j36M22k72j64K41j31J9K1q1M71j92
$$ -37 246 242 77 -135 59 235 -55 138 139 312 41 15 -121 301 29 -135 106 -25 -6 15 -66 405 213
2056B13L7k64N2N2k20Q3q9NJ69k7J41k45J50k9N4j04j07J48J05O2n27O70l06j40
$$ 213 250 -14 38 90 -130 -47 -136 -131 38 11 152 -93 57 28 82 -22 -129 19 124 186 -341 329 23 -117
2080a17J0L08O8O9o50K90k5Q8j45j29N98m50M4j07M0K89j25L4k0k1j80%K71k53
$$ -117 -107 201 269 338 -312 -22 -47 41 -104 -233 365 -85 -41 -148 -108 181 56 90 70 49 -131 -131 140 -113
2104a13p4M24j80m6O4Q6j20j83L23k47j9jO2l2j84R2L00J55k42j33L3j02P4O2
$$ -113 -187 237 57 11 75 161 41 -142 181 -66 -85 -86 -24 -56 -240 -148 152 307 65 -68 -35 -137 -63 -1
2128ao7j51M18o6j71k52L58k62N98l53J1r0q1L6P6mP9J7m3K45j21j26j24K25k59
$$ -1 -68 -219 199 133 -38 -290 68 -194 404 51 62 -28 -109 -73 3 -1 78 95 52 297 176 50 -74 151 -108
2153a08L4J72l79K64O8j00r1Q8j14M5QJ17J84j44O1j73J21l86K74O5M29k29k71
$$ -108 -74 98 -281 -17 51 -49 -140 -52 -166 -121 -113 4 188 44 105 -68 53 -333 -59 6 435 206 -65
2176f5k11M14k30p1k9O6J26K05l13M83m98K28QO0l46j2L96m20J29J44L1J61m96
$$ -65 -276 138 -92 -163 -192 -126 0 205 -108 375 -123 105 113 173 -173 -185 211 -209 -80 64 95 256 -240
2199b40N7K99j30k01j30N60m85K67J15j24Q4j03K81k67M4N4j88K34q1L15k36j57
$$ -240 -183 116 -14 -215 -345 215 -270 -3 112 -12 72 -31 250 -17 27 81 -107 127 46 361 125 -32
2221c2K3j5j10J0J53j46R7k09K53k17K81q3m44L10J66k26O4L77m93L50P0l91J10
$$ -32 -9 -24 -134 -124 29 -117 -20 -229 24 -193 88 5 -439 -129 37 -189 -125 252 -241 109 179 -212 -102
2244a02R9m53O46k89j35L01P0l70J66k3J52R5m82K25R4J86l49K14L2l64J54K59
$$ -102 -3 -456 190 -99 -234 67 137 -233 -67 -90 62 157 -325 -100 -6 180 -169 45 77 -287 -133 126
2266A26k39Q7L14m96Q8L35O6k33k05J49r8M79k1k20jj12j11k6J43q1L21l70j98
$$ 126 -113 -26 288 -208 -120 215 281 48 -157 -8 -106 373 352 132 131 19 -92 -118 25 -56 265 -105 -303
2289c03L54N6k16j03J20r1K61j01p3j05J30M1M6L38j51l56N5OJ82qj3j53L3j71
$$ -303 51 107 -109 -212 -92 -183 78 -23 -96 -201 -71 -30 16 354 203 -153 -98 -92 90 82 69 -84 -51 -222
2313b22J40J84N1j24J50O9k58k13J99K06k42K6j4j63J30j12L16j10r1m5K30j40
$$ -222 -82 102 153 29 179 248 -10 -223 -24 182 -60 -34 -48 -211 -81 -193 123 13 -78 -123 107 -33
2335c3K04l67J66j25J26Q9R7j06p1J2K27j81n10O10l88K51K7J03j35O5j24n0K38
$$ -33 171 -196 -30 -155 -29 60 157 51 -20 -8 219 38 -472 138 -250 1 28 131 -4 61 -63 -113 125
2358A25n0L03n47O6L7k0K4J8J51j69o3K41k88J13K3K01m32L67j67RJ36k32O01
$$ 125 75 378 -169 -103 -66 -86 -62 -44 107 -62 -125 116 -172 -59 -36 165 -267 100 -67 -58 78 -154 447
2381D47n28J99N9m0R5l78k77P26k33K11q8n2L5j94J9k04K94p0J05j31J04k17K02
$$ 447 -81 118 177 137 232 -146 -423 303 70 281 193 141 176 -18 1 -203 91 21 126 -5 99 -118 84
2404H4L6k18L2M02k28k9k98K85p0l34N36k53J04J87m70L3M50m04k1K20k48K70
$$ 84 120 -98 -66 336 108 79 -219 66 -4 -338 198 -55 49 236 -234 -201 249 -155 -176 44 -204 66
2426F6k50K15k33J40r4r7J88k59L00j76l7K27j33M0J30l71N04M0j22Lj71O0j73
$$ 66 -184 31 -202 -62 -156 -253 -65 -324 -24 -200 -237 -10 -143 -103 27 -344 160 200 78 81 -90 -30 -203
2449b03L61q8k19oN2j82J16N7J52j11jN30n03p4L0J44o1j05J42l5K46j98K1K7
$$ -203 158 70 -149 -155 -103 -285 -169 -112 40 -71 -72 458 -45 -119 -89 55 -6 -111 31 -4 242 44 65 92
2473I2k09J49p7L16m30L98j12K8k08rJ03k62L88k73N5j29K35J33k80j89L04Q5
$$ 92 -117 32 -45 271 -159 239 127 155 -53 -62 41 -221 167 -106 -51 -180 55 188 -92 -281 23 108
2495A08K2k20o6L46k8m0j07R6j63K5j05L7r6L47j03J14j76J36k86K23k25L64O4
$$ 108 130 -90 -156 190 162 122 15 111 -52 -27 -132 -95 -191 156 53 167 -9 127 -159 64 -161 203 267
2518B67j28K33l86L6j27K64l02j33L36Q6j55l2J28N1l94M19j97l9j53N8M23k18
$$ 267 139 372 -14 22 -105 159 -143 -276 60 146 -9 -41 87 138 -256 163 -34 -73 -226 -168 255 37
2540C7k9P3%k29KL5J59O6j39l14P77m05k15M20j79k73J3M86n93L22j44J75J56
$$ 37 8 81 81 -148 -146 -111 48 114 -25 -339 438 33 -182 238 59 -214 -201 285 -308 14 -130 45 201
2563B01j45j20K9j55K32p9p0J09j94M10k08n5r0p8K76K28k3l87q6R7rL09m40j02
$$ 201 56 -64 -35 -190 42 -37 -107 2 -192 218 10 -45 -135 -213 63 291 268 -119 -205 -108 -117 192 -248 -350
2587c50N81k89r9o0L61r9J9n5L8k2r6j40J85L98l25J45Jm42L09j48j1J60L0K77
$$ -350 231 -58 -157 -217 144 45 64 9 47 25 -71 -211 -26 372 47 192 193 -249 60 -88 -99 61 91 368
2611C68j77l04J5k89N17k04N1R8j73K25j52L34k04J96n17L14j58Q2M8L08n19L71
$$ 368 191 -113 -98 -387 130 -74 -23 75 -98 127 -25 309 105 301 -216 98 -60 22 70 378 -141 230
2633B30j64Nl36m9M9J86j23K04j18Q3K63l31M67n35L11l05l0L75j79r1jo8M4J28
$$ 230 66 71 -265 -314 -265 -79 -202 2 -116 -33 230 -101 366 -169 142 -163 -193 182 3 -88 -89 -157 -113 15
2657A5j45j61L42j27j10K81m30J86K78j8n20L61q4J06m1J66qj16J3o0L08j89k1
$$ 15 -130 -291 51 -76 -186 95 -335 -149 129 111 -409 -48 -132 -26 -67 99 91 -25 -12 -72 236 47 26
2680B6j50K19K0L2j94J60j49J09j11J89j88K19l04M49n1k33k99J75K08L3L2l91
$$ 26 -124 95 115 147 -47 113 -36 73 -38 151 -37 182 -122 327 276 43 -256 -81 127 160 192 -199
2702a99L92r9K71m91j12J13rJ81l0k27K66J3J90k70Q4j87k72L39J69L8k82J28
$$ -199 193 94 365 -126 -238 -125 -134 47 17 -210 56 69 259 -11 73 -114 -386 -47 122 160 -122 6
2724Fj78K48Jl91K83j18L74k57J9l1L50j80j33q6l6K85l46L40J2k79k44N38o1
$$ 6 -172 76 77 -314 -31 -149 225 -32 -13 -44 306 126 -7 -93 -129 156 -190 150 162 -117 -361 177 116
2747A16j4p5J84k15K78L4l73j94K66L8k13J62l0J08k03k37J94M11m63K28J80J4
$$ 116 102 27 211 -4 274 308 -65 -259 7 45 -168 -6 -36 72 -131 -368 -174 237 -226 2 182 196
2769A96j29j59k4J09J40k18p8K10O5q5j17k93M43M4%l9K14l67J03ML6R9j92Kj19
$$ 196 67 -92 -116 -7 133 -85 -163 47 112 27 -90 -383 60 104 104 65 279 -88 15 19 55 154 -38 -36 -155
2794a55RM61l57J21P0k1K40m39J97j5p1p1J7J15p6j02R2p2r1K56j30J66l89k2
$$ -155 -146 315 -42 79 149 128 368 -71 126 111 40 -31 -14 101 25 -77 15 -57 -148 108 -22 144 -245 -267
2818b67M12l85J72j6K38j22K27l09J08nr2J37q2LK46l91J37J48R7j59l39J99J87
$$ -267 145 -240 -68 -84 154 32 259 -50 58 53 -39 98 16 19 265 -126 11 159 256 97 -242 -43 144
2841A44m3P4j68k05J5L33j07l67L01J65J23k46k28J81p3j3J39J69n04N60j95R7
$$ 144 101 175 7 -198 -183 150 43 -324 -23 142 265 19 -209 -28 -101 -114 25 194 -310 250 55 152
2863A52j14JK45k02n3J05j17J74Kn04K55Q3LQj0L03k84k79R0j04L34j72J25l44
$$ 152 38 39 284 82 29 134 17 191 193 -311 -56 27 30 38 28 331 47 -232 -142 -246 88 -84 41 -303
2887c03j01L06o2n9K38P8m09M09o6R6Nj89R1j1K78j97J05j44j03J84j40P5j29
$$ -303 -404 -98 -160 -219 19 97 -312 97 31 127 132 -57 34 23 301 104 209 65 -38 146 6 81 -48
2910d8M38l52J73k93J01j81J66J42J57j44K70n50M43p1l06n7l3K73j68lk07K08
$$ -48 390 38 211 -82 19 -162 4 146 303 159 429 -121 322 251 -55 -112 -145 128 -40 -43 -250 -42
2932d2j19n1R7Q8j46L27r7J93m54J13L10j14k91J41K99k62l30J64J73P7J31k07
$$ -42 -161 -212 -115 -27 -173 154 57 250 -204 -91 219 105 -186 -45 254 -8 -338 -174 -1 76 207 0
2954@K9k13J67J6L3m7J97k72l5Q3k28K51K72l82K4M31l88PJ00j28q2K12Nk32K55
$$ 0 29 -184 -17 -1 32 -15 182 -90 -125 -42 -270 -19 253 -129 -105 326 -62 -55 45 -83 -165 47 52 -180 75
2979G5j88m3K21k95J12O9L20l28j16J51k3R4j32jJ42j90J98K02k90M0l7j50K10
$$ 75 -113 -156 65 -230 -118 -49 271 -57 -173 -22 -45 49 -83 -84 58 -132 66 268 -22 18 -19 -169 41
3002D1P5k67k64M31n0q2K7L01k07o8K38Jk47K47k5l22M42J58j43m64R9K42l87
$$ 41 116 -151 -415 16 -34 -116 -89 212 5 -63 175 176 -71 176 151 -171 271 429 286 -178 -79 163 -224
3025b24K12N5K4J18r1K19j01l81J8J73l7J80r4j76m7L56j89J23j48k53K35J13
$$ -224 -12 43 67 185 94 313 212 -169 -151 22 -15 165 71 -105 -152 204 15 138 -10 -263 -28 85
3047H5j3j95J57l5j4J41N5n15M49p2j23J57k6J47q6L0N1j97J49j94j95K51K7j99
$$ 85 72 -123 34 -1 -15 126 181 -334 115 43 -80 77 51 198 112 142 193 -4 145 -49 -244 7 34 -165
3071a65J34J82J56n00J65L62m23l12K08L46j03j50Q4J30PL2j15J31j26q1J00p8
$$ -165 -31 151 307 -193 -28 334 -89 -401 -193 153 50 -100 -16 114 121 153 38 169 43 -38 62 -16
3093a6J90k37l0N3P0k88L87Q0J6J09m43L20j37j54J47o7N0m8K4n3L2Lj91j4M42
$$ -16 174 -63 -93 -40 30 -258 129 209 225 334 -109 211 74 -80 67 0 50 2 26 -27 5 8 -183 -197 245
3118B45m40M6J76J09m20J00J19R9O9P4k33L49l39Q0J77j05j8j05J38p2K75k35
$$ 245 -195 -149 27 136 -284 -184 -65 34 103 177 -56 293 -46 34 211 106 88 -17 121 49 324 89
3140H9l24N1J67J79Rk75J99j37j7j60N67m31m1J88L0K36k78o1j51J44J18j24J65
$$ 89 -235 -184 -17 162 171 -104 95 -42 -59 -219 348 -83 -124 64 94 330 52 -9 -160 -16 102 -22 143
3163A43k00J62k72J15J18M0q8j9k5J71j23m21M83J10Q3k62P7l43J50L73l78q8
$$ 143 -57 105 -167 -52 66 106 18 -1 -26 145 22 -399 84 194 277 15 92 -251 -101 272 -106 -194
3185a94K22j03J60R0j53j01j11L70J07K22n83K71k80J81J03j74k31J6L35k1J34
$$ -194 28 -75 85 175 22 -79 -190 180 287 509 -74 197 -83 98 201 27 -204 -188 147 126 260
3206B60j37q8k31L68m17J40m86J87L07K05K8l42J6K20K24k50o2M1L95n74J98r9
$$ 260 123 35 -196 172 -245 -105 -591 -404 -97 108 136 -206 -190 30 254 4 -58 -17 378 -196 2 -97
3228i7R4j65J15o2M03k37K2o6MJ48r5l48K13p0K0L78j78j26K09K88p50N03j87
$$ -97 -3 -168 -53 -115 288 51 73 7 11 159 64 -284 -71 -141 -121 257 79 -47 162 450 -300 203 16
3251A6k0r0N7L9L24j64N4P2l27k7K14j98K0J21k32J90l1K54j24p3r9j0m8Q9Q4
$$ 16 -4 -94 -37 2 326 162 216 288 -39 -66 148 -50 -30 91 -141 49 18 272 148 75 -24 -34 -82 7 91
3276I1j69k6J02k35L39j72L30j58j69j10K15l95L77J40j21L8j66j01K63rjK96
$$ 91 -78 -104 -2 -237 102 -70 260 102 -67 -177 38 -357 20 160 39 77 -89 -190 73 64 63 359
3298C59n10L3M2J54lj91j93M10k17K16l62O6J81M25m08j10J61O6J44l57k1L90
$$ 359 -151 -118 -76 78 75 -116 -309 101 -116 100 -262 -196 -15 410 2 -108 53 119 263 -94 -115 275
3320B75k99J92k23K63r0p1j07p2K10k23J22k62M31qn9L34m88j15J00QJ19j26k5
$$ 275 -24 168 -55 208 118 47 -60 -132 78 -145 -23 -285 146 138 79 413 -75 -190 -90 -82 37 -89 -114
3343a14r5JJ91m0rN1L42j29l29K8L6pL1L48j52k93M20m98J10L54k79M7K4j2J3
$$ -114 -209 -208 -17 -57 -66 -15 327 198 -131 -103 -67 -74 -43 305 153 -140 280 -218 -108 246 -33 14 38 26 39
3368C9J26l79M65l72R0M7j40N0L53m99J41p5J15L5k84M76j45o9k26L67j35J51
$$ 39 165 -214 251 -121 -31 16 -124 -74 279 -220 -79 -154 -39 -4 -288 188 43 -26 -252 115 -20 131
3390A31k09j64L35l71Q3L38r2j30j5J32p9N7o3r4Q3J70P1j23qQ1l63J9K8L66k96
$$ 131 -78 -242 93 -278 -195 143 51 -79 -94 38 -41 16 -47 -141 -58 112 183 60 52 133 -230 -211 -183 183 -113
3415a13M60L2k49J22k93P7j27K17k04J67k24K25O5j20p0J92j49Q4p9O7j14K37
$$ -113 347 379 130 252 -41 36 -91 126 -78 89 -135 90 155 35 -35 157 8 92 13 80 -34 203
3437B03l18J09J01j60K91j52O0k59M36l68m8K17k21K26j94J71k32M20l18m1L08
$$ 203 -115 -6 95 -65 226 74 134 -125 311 -57 -105 112 -109 117 -77 94 -138 282 -36 -77 231
3458B31p3j56k45M84l00J91P8l90j20M04J13l68K27R6j52J67j44j97k1L86j51
$$ 231 158 2 -243 241 -59 132 210 -180 -300 104 217 -151 76 172 20 187 43 -154 -175 211 60
3479F0k08L64R6l48J58km44M25j08j9N8Q5j13L0K16k13J99K12k01n8k74J48O3
$$ 60 -148 216 312 -36 122 120 -324 101 -7 -26 32 117 4 34 250 37 236 448 247 189 -85 63 126
3502A26l76M39l8j63j00k89L18K08K93k92j74q4J0J06P8j40k29K78q7K57k17K71
$$ 126 -250 189 151 -12 -112 -401 -83 125 418 126 -48 -132 -122 -16 62 -78 -307 -29 -116 141 -76 195
3524A95L2k35o5k34L34k26L06k08K12m13M71j90Q6K53l96R5k11J93j17J81P3L8
$$ 195 227 -8 -73 -307 27 -199 107 -101 111 -302 169 -21 65 318 -78 17 -194 -1 -118 63 136 174
3546A74j42J16QJ4j16K36l78j70K19j18J83O1j28j14K94k56L01k42L31k37J44
$$ 174 32 148 156 170 54 290 -88 -258 -39 -157 26 87 -41 -155 139 -117 184 -58 273 36 180
3567A80j50j69j73M92j31q5K00k5j40k36L99J09l70L47n79J33K96m51K82j01L49
$$ 180 30 -139 -312 180 49 -36 164 139 -1 -237 162 271 -99 248 -331 -198 98 -353 -71 -172 177
3588A77k32J25j64l8K63k3j11m3R7l0rK5r9l2J28k52N64j05o15L47m2L5J39p9
$$ 177 -55 70 -94 -132 131 108 -3 -46 51 21 12 37 -62 -94 34 -218 346 241 -374 -27 -69 -34 105 26
3612B6J0l23J35o2L05j44K5l8l00K96J9L2n4J05j09K30j04j92K72Ro2j24R8NO8
$$ 26 36 -287 -152 -214 91 -53 -28 -66 -366 -70 -51 -19 -73 32 -77 153 49 -143 129 138 76 -48 50 55 123
3637A23k09m5R2J28j38k1l8J54J02P7l65M6Q7j95K17j09r1O4L34j83k33M12l90
$$ 123 -86 -131 -39 89 -49 -70 -108 46 148 225 -140 -94 -7 -202 15 -94 -185 -121 213 30 -203 209 -181
3660a81K43N1j15K86l54R4k59L01k10K72n0J88l30j31N29k63j7j55RJ55m05N30
$$ -181 62 113 -2 284 -70 24 -235 66 -144 128 78 266 -64 -195 334 71 54 -101 -92 63 -342 188
3682A88m9l30K20J36l12pJ01N4K07j60k82K85N0k29R4K70l30R5r3L06j02k96K42
$$ 188 139 -191 29 165 -147 -154 -53 1 208 48 -234 51 101 -128 -34 236 -94 1 -92 214 112 -184 58
3705E8J27l24Q1k8J79j8k90L53k08q6J39k17M53o1j77k49N91l34l9p0l0J49J20
$$ 58 185 -139 -58 -86 93 75 -215 138 -70 -156 -17 -234 219 158 -19 -268 323 -11 -50 -120 -150 -1 119
3728A19j1p7j85J56l8K1J24N9k78n0M66n30R7R6M6r9O6J33K9m81L77K04k22J43
$$ 119 108 31 -154 2 -36 -15 109 168 -110 -160 306 -224 -127 -31 15 -84 -18 115 144 -337 40 244 22 165
3752A65m4k7q2j2P3O2k20K74l63L11P7j55j05o8P9j62r7M27l7j59L45k65K14n7
$$ 165 121 94 12 0 73 135 -85 189 -174 137 214 59 -46 -114 -35 -197 -294 133 96 -63 282 17 231 174
3776A74j79J84m05j8M21k50K53k22P3O9k7rL4j18m7j2J76l48K34L29l87L75j7
$$ 174 -5 179 -226 -244 177 -73 180 -42 31 100 73 64 98 -20 -67 -79 97 -251 -17 312 -75 300 283
3799B83l63j30K87j90L71l80j49K75n4L53l42M37k46k62J69k54M99n82K58O0j13
$$ 283 -80 -210 77 -113 258 -122 -271 4 -50 303 -39 398 152 -110 59 -195 304 -278 -20 40 -73
3820g3J18j73L9R8j43%J29j54q3m2O14m95J35k42L11J26N8j95j12L57k77k64L67
$$ -73 45 -128 -89 9 -134 -134 -5 -159 -242 -284 330 -165 -30 -272 39 165 223 28 -84 273 -4 -268 99
3843I9L9j31j98R7m1M4J02J96l67M35m15K91K7k45K30l46J4K52n1L6p7J42Qj97
$$ 99 138 7 -191 -94 -135 -91 11 207 -160 275 -140 151 178 -67 163 -183 -169 83 32 68 -9 133 141 -56
3867e6J72j50j47L20j99j04J80J60o2k40L43m71O03m41N3j63J75l28N37q7j23
$$ -56 116 -34 -181 139 -60 -164 16 176 114 -126 217 -254 349 -92 -39 -202 -27 -355 182 95 -28
3888b8P9J93l36j3J83o9P6p4p6K05l33L19j96O8n8j58J84J84l77K38j64L94j37
$$ -28 51 244 -92 -105 78 9 85 11 -65 140 -193 126 -70 -2 -60 -218 -34 150 -227 11 -153 241 104
3911A04l40L09k43K2M8P3o6J58m1n3P3o3K02j97L8k86K41k48L54j0l32Q9j7K9
$$ 104 -236 73 -170 -148 -100 -27 -93 65 24 -29 44 -19 183 -14 24 -262 -21 -269 85 75 -257 -168 -185 -156
3935a56N7N5NJ26J98n4n12J31J90J71q6j31j09K55m9l39j83N75m09M8N03j34l44
$$ -156 -99 -44 -39 87 285 231 -281 -150 40 211 125 -6 -115 140 91 -248 -431 144 -265 -217 286 152 -192
3958a92L33l81L51k45M21K0j40l52K52K51k41j44K46k61R7j5K07j54k28J22L13
$$ -192 141 -240 111 -134 287 307 167 -185 67 318 77 -67 179 -82 15 0 207 53 -175 -53 260
3979B60j35k54K79k84j87M35j02J20L8m8k16K75l55J46r6j24J79J06J60k96k61
$$ 260 125 -129 150 -134 -321 114 12 132 170 122 -94 181 -174 -28 -124 -248 -69 37 197 -99 -360
4000c60M17j98N88l67M3o8k60K85j66K46j17J64k38K43m35L25p7J40j16J56K08
$$ -360 57 -141 447 80 123 55 -205 80 -86 160 43 207 -31 212 -223 102 25 165 49 205 413
4021D13l07j89K94m59K45k96K91p6l2L89m15K35k2M5P9rl72L65k09L19l16j33
$$ 413 106 -83 211 -248 -3 -299 -8 -84 -116 273 -142 93 71 116 195 186 -186 179 -30 289 -27 -160
4043a60k0K3J55L04l52j8j14Q1J74j76K5n3J77k63J1L35k37J31N4k54L6M7K54
$$ -160 -180 -157 -2 302 -50 -68 -182 -101 73 -103 -78 -131 46 -217 -206 129 -108 23 77 -177 -141 -94 160
4066A60k93p2J12R0j8K23l34J46L37j03l76K32o6L9l80L17p5L58l87J45n9lj23
$$ 160 -133 -205 -93 -3 -21 202 -132 14 351 248 -128 104 38 77 -303 14 -61 297 -90 55 -4 -7 -130
4089a30J84ll8L03l56J24k1j74RJ08j90M4p5L78k00L0J15L21k16m41J58L27l13
$$ -130 54 51 13 316 -40 84 63 -111 -102 6 -184 -140 -215 163 -37 -7 108 429 213 -228 -70 257 -56
4112e6RQ7j58L75k01k1k10K55k10j18K50K20j95K3k70J29J30j77M87l14J24j01
$$ -56 -47 40 -118 257 56 35 -175 80 -130 -248 2 222 27 50 -220 -91 39 -138 349 35 159 58
4134E8J06r9l83N09J75l00m3m5LQ6j18j95L20J07l42j2p2J4M71j02l65L51Rrl17
$$ 58 164 65 -318 191 366 66 23 -22 -19 67 -51 -246 74 181 -161 -173 -245 -231 240 138 -227 124 133 124 -193
4159a93N21j37j65L1j57R2J40m7K18k06l7kO1J12l35p3J67J09p3J30k79K78J75
$$ -193 328 191 26 57 -100 -8 132 85 303 97 60 58 119 231 -104 -177 -10 99 26 156 -123 155 330
4182C30l28J51j88J47o5k42L85p1j47p8O9mn7J96M1k45K84k97K13j69j34L58k24
$$ 330 2 153 -35 112 47 -195 190 119 -28 -106 -37 -41 -98 98 139 -106 178 -119 94 -75 -209 149 -75
4205g5j31O21o46Q7K43LL5l67M22n1p6K25Kj17n55N99l95J93l43L56J93j44j24
$$ -75 -206 415 -231 -144 99 102 137 -230 192 141 65 290 292 175 -380 219 -176 17 -326 30 223 79 -45
4228d5R9j5m97N00q7m0l47O09N1k03N6j29P6p7K13k80K8K72l79L91q5L83l63k57
$$ -45 54 39 -458 42 -45 -85 -432 177 228 25 81 -48 28 -49 164 -116 -88 184 -195 196 111 494 131 -126
4252a26K06j09M3k34J68L71m72L70l70J33P7j55M63l79jJ30n2J66m73K40K5M2
$$ -126 80 -29 14 -220 -52 319 -153 217 -153 -20 57 -98 365 -14 -15 115 63 229 -244 -4 21 63
4274F3P0J08m20K46k9J07N7k61k70K52K2J60j37J61O7m14L39k51J99P9Q2l85J80
$$ 63 133 241 -179 67 38 145 202 -59 -329 -77 -55 105 -32 129 196 -218 121 -130 69 148 230 -155 25
4297B5q0M9J0Q0Q7j13JQ3k55J40o6l9q8K23P8k3n1J46p3j79NK05k0k83pj60L07
$$ 25 -55 -6 4 84 171 58 59 142 -113 27 -39 -78 -166 57 135 112 61 207 134 -45 -40 165 145 -138 -145 -305 2
4324BK1j35K70k2r0j80K24J13J18k59k17K00M5j47jl1J66k8j8l02L50q4k9L1P8
$$ 2 23 -112 158 136 46 -134 90 203 321 62 -155 45 90 -57 -58 -89 77 49 31 -271 79 -5 -34 -3 75
4349G5k68J62K26k60O2N2O0j89M20k18j30Oj36NK96j07l9J27q4k37K78p7M0j32
$$ 75 -193 -31 195 -65 -3 49 109 -80 340 122 -8 -2 -138 -133 163 56 17 144 60 -177 101 24 64 -68
4373f8J39J4Q3k11L6N5R7l08n3Q8J57K40j87O5K9j01J53k74k50L04k64J82L64
$$ -68 71 85 168 -43 -7 48 145 -163 -216 -128 29 269 82 147 176 75 228 -46 -296 8 -256 -74 290
4396B90j91j95j24O2J57j2k85K85j11J09K96k59M8N0r7P9j35N8J24l50N26p5l22
$$ 290 99 -96 -220 -158 -1 -13 -298 -13 -124 -15 281 22 70 120 23 102 -33 25 149 -201 325 250 -72
4419g2k91M00n7j60L53l32j1J78m8K58n7L4m15K41J27l34K15P2j10K8Q8j48j80
$$ -72 -363 37 -20 -180 173 -159 -170 8 -40 218 161 195 -220 21 148 -186 29 101 -9 19 107 -41 -221
4442b21J59j34K72j93j15J86j19M37j94J53l75K01o6j89L13J6O3Q0k38p8j38K57
$$ -221 -62 -196 76 -117 -232 -46 -165 272 78 231 -144 57 -9 -198 115 131 194 274 36 -42 -180 77
4464G7k54j11M30j51j7L29k54l0K2j86J75o1M1Q3R0l74j78N05r7L8j15J55J51
$$ 77 -177 -288 142 -9 -26 303 49 19 41 -145 30 -31 10 93 183 -191 -369 136 39 77 -38 117 268
4487B68l03k6o9O0L33l28Q2k26m4L25kmk73L37j38j30K51m03L14J15p8k04k5L56
$$ 268 -35 -61 -130 -70 263 -65 17 -209 -253 72 70 66 -207 130 -8 -138 113 -290 24 139 61 -143 -168 188
4511A88n9j85j35N9J66J7o0M0q7p2q7R6M6J91j0p3J17J32n14K70mj26K23j48%
$$ 188 129 -56 -191 -132 34 51 -9 31 -56 -128 -215 -119 -73 118 108 35 152 284 -230 40 36 -90 133 -15 -15
4536a5J9J09l7j45o6O5NM49n49J54P3j21n5Q4K55j61j49K65k03J46m97K93K42
$$ -15 4 113 76 -69 -135 -70 -65 384 -165 -11 62 -59 -114 -30 225 64 -85 180 -23 123 -374 -81 161
4559A61m19K61K15N6j88l80L34j58J70m9j93K99j93J82k45M7J05N2K14l5k78p7
$$ 161 -258 3 218 274 86 -294 40 -118 52 3 -190 109 -84 98 -147 -100 5 57 271 236 -42 -119
$$ [...]
8191b7
##END NTUPLES=NMR FID
##END=
