##TITLE=1H_DE-60_EA
 D2O
 8 sc, 
 1.7.2024
##JCAMPDX= 6.0         $$ Bruker NMR JCAMP-DX V2.0
##DATA TYPE= NMR FID
##DATA CLASS= NTUPLES
##ORIGIN= UXNMR, Bruker Analytische Messtechnik GmbH
##OWNER= root
$$ XWIN-NMR		Version 3.5
$$ Mon Jul  1 16:33:17 2024 Russian Standard Time (UT+4h)  she@DPX200
##.OBSERVE FREQUENCY= 200.1313
##.OBSERVE NUCLEUS= ^1H
##.DELAY= (6, 6)
##.ACQUISITION MODE= SIMULTANEOUS
##.ACQUISITION SCHEME= undefined
##.AVERAGES= 8
##.DIGITISER RES= 18
##SPECTROMETER/DATA SYSTEM= spect
##.PULSE SEQUENCE= zg30
##.SOLVENT NAME= D2O
##.SHIFT REFERENCE= (INTERNAL, D2O, 0, 15.7039)
##AUDIT TRAIL= $$ (NUMBER, WHEN, WHO, WHERE, WHAT)
$$ ##TITLE= Audit trail, XWIN-NMR		Version 3.5
$$ ##JCAMPDX= 5.01
$$ ##ORIGIN= Bruker BioSpin GmbH
$$ ##OWNER= she
$$ F:/spectra/data/she/nmr/H-F/1/audita.txt
$$ ##AUDIT TRAIL=  $$ (NUMBER, WHEN, WHO, WHERE, WHAT)
(   1,<2024-07-01 16:32:20.87 +0400>,<she>,<DPX200>,
      <created by zg, POWCHK disabled, PULCHK disabled
       configuration hash MD5:
       00 E9 B6 7A A2 85 ED C7 34 08 36 98 17 FE 4E 26
       data hash MD5: 16K
       6D 16 4D FA 89 41 A9 29 57 4F 5A C8 56 0D 23 5B>)
$$ ##END=
$$ 
$$ hash MD5
$$ 7D 5E 81 09 19 B5 9C CD E2 0C 52 AB 62 42 53 FC
##$RELAX= 
##$RELAX= 
##$RELAX= 
##$RELAX= 
##$RELAX= 
##$RELAX= 
$$ Bruker specific parameters
$$ --------------------------
##$DU= <F:/spectra>
##$EXPNO= 1
##$NAME= <H-F>
##$PROCNO= 1
##$TYPE= <nmr>
##$USER= <she>
##$AMP= (0..31)
100 100 100 100 100 100 100 100 100 100 100 100 100 100 100 100 100 100 
100 100 100 100 100 100 100 100 100 100 100 100 100 100 
##$AQSEQ= 0
##$AQ_mod= 1
##$AUNM= <au_zg>
##$AUTOPOS= <>
##$BF1= 200.13
##$BF2= 200.13
##$BF3= 200.13
##$BF4= 200.13
##$BF5= 200.13
##$BF6= 200.13
##$BF7= 200.13
##$BF8= 200.13
##$BYTORDA= 1
##$CFDGTYP= 0
##$CFRGTYP= 5
##$CHEMSTR= <none>
##$CNST= (0..31)
1 1 145 1 1 1 1 1 1 1 1 1 1 1 1 1 1 1 1 1 1 1 1 1 1 1 1 1 1 1 1 1 
##$CPDPRG= <>
##$CPDPRG1= <>
##$CPDPRG2= <>
##$CPDPRG3= <>
##$CPDPRG4= <mlev>
##$CPDPRG5= <mlev>
##$CPDPRG6= <mlev>
##$CPDPRG7= <mlev>
##$CPDPRG8= <mlev>
##$CPDPRGB= <>
##$CPDPRGT= <>
##$D= (0..31)
0 1.2 0 0 0 0 0 0 0 0.06 0 0.03 0 0 0 0 0.0002 0 0 0 0 0 0 0 0 0 0 0 0 
0 0 0 
##$DATE= 1719837140
##$DBL= (0..7)
120 120 120 120 120 120 120 120 
##$DBP= (0..7)
150 150 150 150 150 150 150 150 
##$DBP07= 0
##$DBPNAM0= <>
##$DBPNAM1= <>
##$DBPNAM2= <>
##$DBPNAM3= <>
##$DBPNAM4= <>
##$DBPNAM5= <>
##$DBPNAM6= <>
##$DBPNAM7= <>
##$DBPOAL= (0..7)
0.5 0.5 0.5 0.5 0.5 0.5 0.5 0.5 
##$DBPOFFS= (0..7)
0 0 0 0 0 0 0 0 
##$DE= 6
##$DECBNUC= <off>
##$DECIM= 32
##$DECNUC= <off>
##$DECSTAT= 4
##$DIGMOD= 1
##$DIGTYP= 9
##$DL= (0..7)
0 120 120 120 120 120 120 120 
##$DP= (0..7)
150 150 150 150 150 150 150 150 
##$DP07= 0
##$DPNAME0= <>
##$DPNAME1= <>
##$DPNAME2= <>
##$DPNAME3= <>
##$DPNAME4= <>
##$DPNAME5= <>
##$DPNAME6= <>
##$DPNAME7= <>
##$DPOAL= (0..7)
0.5 0.5 0.5 0.5 0.5 0.5 0.5 0.5 
##$DPOFFS= (0..7)
0 0 0 0 0 0 0 0 
##$DQDMODE= 0
##$DR= 18
##$DS= 0
##$DSLIST= <SSSSSSSSSSSSSSS>
##$DSPFIRM= 0
$$ [...]
##$SUBNAM2= <"">
##$SUBNAM3= <"">
##$SUBNAM4= <"">
##$SUBNAM5= <"">
##$SUBNAM6= <"">
##$SUBNAM7= <"">
##$SUBNAM8= <"">
##$SUBNAM9= <"">
##$SW= 18.0517328524113
##$SWIBOX= (0..15)
0 0 2 0 0 0 0 0 0 0 0 0 0 0 0 0 
##$SW_h= 3612.71676300578
##$TD= 16384
##$TD0= 1
##$TE= 0
##$TE2= 300
##$TE3= 300
##$TEG= 300
##$TL= (0..7)
0 120 120 120 120 120 120 120 
##$TP= (0..7)
150 150 150 150 150 150 150 150 
##$TP07= 0
##$TPNAME0= <>
##$TPNAME1= <>
##$TPNAME2= <>
##$TPNAME3= <>
##$TPNAME4= <>
##$TPNAME5= <>
##$TPNAME6= <>
##$TPNAME7= <>
##$TPOAL= (0..7)
0.5 0.5 0.5 0.5 0.5 0.5 0.5 0.5 
##$TPOFFS= (0..7)
0 0 0 0 0 0 0 0 
##$TUNHIN= 0
##$TUNHOUT= 0
##$TUNXOUT= 0
##$USERA1= <user>
##$USERA2= <user>
##$USERA3= <user>
##$USERA4= <user>
##$USERA5= <user>
##$V9= 5
##$VALIST= <valist>
##$VCLIST= <CCCCCCCCCCCCCCC>
##$VD= 0
##$VDLIST= <DDDDDDDDDDDDDDD>
##$VPLIST= <PPPPPPPPPPPPPPP>
##$VTLIST= <TTTTTTTTTTTTTTT>
##$WBST= 1024
##$WBSW= 4
##$XGAIN= (0..3)
0 0 0 0 
##$XL= 0
##$YL= 0
##$YMAX_a= 146879
##$YMIN_a= -145606
##$ZGOPTNS= <>
##$ZL1= 120
##$ZL2= 120
##$ZL3= 120
##$ZL4= 120
##$ABSF1= 10
##$ABSF2= 0
##$ABSG= 5
##$ABSL= 3
##$ALPHA= 0
##$AQORDER= 0
##$ASSFAC= 0
##$ASSFACI= 0
##$ASSFACX= 0
##$ASSWID= 0
##$AUNMP= <proc_1d>
##$AZFE= 0.1
##$AZFW= 0.1
##$BCFW= 1
##$BC_mod= 2
##$BYTORDP= 1
##$COROFFS= 0
##$CY= 11.3945322036743
##$DATMOD= 1
##$DC= 2
##$DFILT= <>
##$DTYPP= 0
##$F1P= 15.6554695791079
##$F2P= 12.8336369535428
##$FCOR= 0.5
##$FTSIZE= 0
##$FT_mod= 4
##$GAMMA= 1
##$GB= 0.15
##$INTBC= 1
##$INTSCL= 1
##$ISEN= 128
##$LB= 0.24
##$LEV0= 0
##$LPBIN= 0
##$MAXI= 10000
##$MC2= 0
##$MEAN= 0
##$ME_mod= 0
##$MI= 1.114404
##$NCOEF= 0
##$NC_proc= 0
##$NLEV= 6
##$NOISF1= 3.799351
##$NOISF2= 2.8
##$NSP= 1
##$NTH_PI= 0
##$NZP= 0
##$OFFSET= 15.70392
##$PC= 1
##$PHC0= -25323.54
##$PHC1= 16.98748
##$PH_mod= 1
##$PKNL= yes
##$PPARMOD= 0
##$PSCAL= 0
##$PSIGN= 0
##$REVERSE= no
##$SF= 200.130013532006
##$SI= 16384
##$SIGF1= 3
##$SIGF2= 2
##$SINO= 400
##$SIOLD= 16384
##$SREGLST= <1H.CDCl3>
##$SSB= 0
##$STSI= 0
##$STSR= 0
##$SW_p= 3612.71676300578
##$SYMM= 0
##$S_DEV= 0
##$TDeff= 0
##$TDoff= 0
##$TI= <>
##$TILT= no
##$TM1= 0
##$TM2= 0
##$TOPLEV= 0
##$USERP1= <user>
##$USERP2= <user>
##$USERP3= <user>
##$USERP4= <user>
##$USERP5= <user>
##$WDW= 1
##$XDIM= 8192
##$YMAX_p= 0
##$YMIN_p= 0
$$ End of Bruker specific parameters
$$ ---------------------------------
##NTUPLES= NMR FID
##VAR_NAME=  TIME,          FID/REAL,        FID/IMAG
##SYMBOL=    X,             R,               I
##VAR_TYPE=  INDEPENDENT,   DEPENDENT,       DEPENDENT
##VAR_FORM=  AFFN,          ASDF,            ASDF
##VAR_DIM=   8192,          8192,            8192
##UNITS=     SECONDS,       ARBITRARY UNITS, ARBITRARY UNITS
##FACTOR=    0.0002768,     1,               1
##FIRST=     0,             0,               0
##LAST=      2.2672688,     0,               0
##MIN=       0,             -145606,         0
##MAX=       2.2672688,     146879,          0
$$ Real data points
##PAGE= N=1
##DATA TABLE= (X++(R..R)), XYDATA
$$ [...]
1948G8k88L96l59J23J93j71J90j02j1j07J46j14k5J39j02J41L1J46l22J5k2r2
1970a17L06j56m3K42k49j83J49q7K7J86k94M14Q1p0k02p4J76O1m15K6M8R2J11
1993B9j24L50m26L9o0Q6J71k19P5j83N07l33R8j55R8M14l95O9j91R0J48J05J5
2016B08j93J21j22J01J55k01J84l45M1J63k15K54j74K04k41k51O28k48j16J62
2036A15n2k16K68j08l34L20KJ42jJ07K2p6l12k3L1Q4j3N1k57O0l3j06L55k25J56
2061d3k11K41J83k84M13l29q9L27m43M35j83J63J12j94l13K84K7j32k0j32p4M49
2083A87k47J95N0j91j83L34k75J99R4j51l2KJ39j83J22k72K69j42K23R7qR2k48
2106G1j1m36M07J03j90P6j4r1k6N7J71k73q3K59K8J23K3j22J74m57j34K67j11
$$ plain form
1948 78 -210 186 -173 -50 143 -28 162 60 49 -58 88 -26 -51 88 -14 127 158 304 -18 -3 -25 -117
1970 -117 189 33 -10 232 -17 -200 -51 -138 -111 75 -219 195 276 206 4 -70 106 167 -248 -222 -174 -82 29
1993 29 -95 255 -171 -132 -192 -106 65 -154 -79 -262 245 -88 10 -145 -47 367 -28 41 -150 -60 88 193 208
2016 208 15 136 14 115 270 69 253 -92 -51 112 -103 151 -23 181 -60 -311 317 69 -47 115
2036 115 63 -153 115 7 -327 -7 -5 137 136 243 265 189 -123 -146 -115 -31 -44 7 -250 -190 -223 -329 26 -199 -43
2061 -43 -254 -13 170 -114 299 -30 -119 208 -235 200 17 180 292 98 -215 69 96 -36 -56 -188 -262 187
2083 187 -60 135 185 -6 -189 145 -130 69 163 12 -20 -18 121 -62 60 -212 57 -85 138 235 227 319 71
2106 71 60 -376 31 134 -56 20 6 -85 -111 -54 117 -156 -239 20 48 171 194 72 246 -211 -345 -78 -189
2129a89P0j92J65J82K1m3J82l69P6J40j97RJ36j88K33K88l35j9j45j68L23Rp0
2152h1j40K34j20Q5J1k4j87J42L34m15K32J4J11p2j39j20L21j90P4l73M14J84
2174B95l57l1J37r2L3J37L6k44M7J91l43L28J22L9p6M9o22L15J1J16q0Jk62K19
2198c1K54o0q5k99N5M57m46Q6L75p46K78n9J2K33j10J05j91M39l88J15l56J29
2220b33Q9J02L28l54J29j14J42q0k42J73k3O2K92k89K25k82mj9K74n9l09P9O5
2243d8m9j08R4J21L04j81j88n1L15J1l29K14J85k67J8L9k48L65j70Pj67o5NK94
2267A01k93L18l77L36j28J1J64p5J06n4j67P5j50K05J57m2j06K53m76j96L06J83
2289A51j26j32K29M1o3k04K66n1J59l72k0k24N83k24Q7pl3j66J85R4l01N1J59
$$ plain form
2129 -189 -119 -311 -146 36 57 14 196 -173 -97 43 -154 -145 -9 -197 36 324 -11 -30 -175 -343 -20 -11 -81
2152 -81 -221 13 -107 -22 -11 -35 -222 -80 254 -161 71 85 196 124 -15 -135 186 -4 70 -303 111 295
2174 295 -62 -93 44 -48 -15 122 158 -86 -39 152 -191 137 259 298 222 271 -351 -36 -25 91 11 12 -250 -31
2198 -31 223 163 78 -221 -166 291 -155 -69 306 -440 -162 -221 -209 24 -86 19 -172 267 -121 -6 -362 -233
2220 -233 -144 -42 286 -68 61 -53 89 9 -233 -60 -83 -21 271 -18 207 -75 -79 -98 176 117 -192 -113 -48
2243 -48 -97 -205 -111 10 314 133 -55 -106 209 220 -109 105 290 23 41 80 -168 197 27 34 -133 -198 -193 101
2267 101 -192 126 -251 85 -43 -32 132 57 163 109 -58 17 -133 72 229 187 81 334 -142 -338 -32 151
2289 151 25 -107 122 163 100 -104 162 111 270 -102 -122 -346 237 13 100 93 60 -106 79 173 -128 -77 82
2312H2q6Mk9k20N7J55M12m25Mn8k5J03k6J42n5P2k03r7r7L61j29mL21j52l34M8
2338a79K6P6j6J08j61L04l71K15K1l47M50k81J52K4oq4K27l7q9k49K71L40m04
2361a0k80L47l28M44k18K02k2l43J26J06K0l9J82n36M66J70k37j55K80k03J92
2382A64m30o4N55n3k24j45P5L77k1l12R1RL0M8k06L43j81p4j37nL27j92MJ95k07
2407c3M7N0o4k38M42r6j22q6%K17j37j72O0L79j11%j15K67l37Q3J86l88J16J29
2431G7l47K53j36L35L0k74KL31j74O5q7r9N3l3k84J57j41L97m02J64J87J7k60
2454a69K52j3M8j04j31J01J34j72M9q8L3J68n6J35n72J97R3O3k8l4K5J33J54j22
2478I6m43KP06k54K07m33J58j87J37J23N9r6ql7n3K59j46j55k57L80l96N14j96
$$ plain form
2312 82 -4 0 -29 -249 -192 -37 375 -50 -46 -104 -129 -26 -52 90 35 107 -96 -193 -290 71 -58 -62 259 107 -227 -179
2338 -179 -153 -77 -93 15 -146 158 -213 2 23 -324 126 -155 -3 21 15 -69 158 121 32 -217 54 394 -10
2361 -10 -290 57 -271 173 -45 157 135 -208 -82 24 44 5 187 -349 117 287 50 -105 175 -28 164
2382 164 -266 -330 225 172 -52 -197 -122 255 234 -78 13 22 52 100 -106 237 56 -18 -155 -160 167 -25 -21 174 -33
2407 -33 14 64 0 -238 204 108 -14 -100 -100 117 -20 -192 -132 247 136 136 21 288 -49 34 220 -168 -52 77
2431 77 -270 -17 -153 182 212 -62 -60 271 97 162 75 -24 29 -4 -288 -131 -272 125 -277 -113 74 91 -169
2454 -169 83 70 118 14 -117 -16 118 -54 -5 -93 -60 108 52 187 -385 -188 -95 -32 -60 -94 -69 64 218 96
2478 96 -347 -345 361 107 314 -119 39 -148 -11 112 171 75 67 30 -23 236 90 -65 -322 58 -338 176 -20
2501b0J23R5m88L14J15N7j94p8m0Q5j96L76j55J15j01O9O8l80L23r4j27K04k60
2524a89K68p7p9J47K82l60j64O1O5K8J25J60j73M6q5r1m8J54K07k48j79kn5m6
2548b53K27J36k9N4j21p8kJ05R4r8J06k64Kq2j22K41k0Km8J45N0l71P8P9N7K1
2574i1o3M40k56n3OK3j43K68j06j35J39J11r5n9k28J68K01Q2m34J08p8L29J1k81
2598a36K18N1j40M1j84J48L7k27O4O1J44J10J27k8l5m29K51j13J25K4j67O8k8
2621a8j45L62l14L59j10m08M73l42j5L29l82J59j56K52n3j62J52L21k72k18K90
2642A02j28N9o0J5L5R7K5j3L86q63L55p7j30K34k15KK09L15j64j44n32N71l06
2665b27Q6o3LK3J88j84K35k69p7M6K09K92k31J84J75k95k92J29J60L1Rk82J04
$$ plain form
2501 -20 103 198 -290 24 139 196 2 -76 -116 -31 -227 149 -6 109 8 77 145 -235 88 -6 -133 71 -189
2524 -189 79 2 -77 70 352 -8 -172 -111 -46 -18 107 267 94 140 55 -36 -84 70 277 29 -150 -152 -207 -253
2548 -253 -26 110 81 135 14 -64 -66 39 133 35 141 -123 -121 -203 -325 -84 -104 -102 -150 -5 45 -326 -248 -169 -112 -91
2574 -91 -154 286 30 -23 -17 6 -137 131 25 -110 29 140 45 -14 -242 -74 127 209 -225 -117 -195 134 145 -136
2598 -136 82 133 -7 34 -150 -2 35 -192 -128 -67 77 187 314 286 251 -178 73 -40 85 109 -58 10 -18
2621 -18 -163 199 -115 244 134 -274 199 -143 -158 171 -211 -52 -208 44 -9 -171 -19 302 30 -188 102
2642 102 -26 33 -27 -12 23 120 145 132 518 -345 10 -67 -197 37 -178 -176 33 348 184 40 -492 79 -227
2665 -227 -141 -204 -201 -178 10 -174 61 -208 -285 -239 -30 262 31 215 390 95 -197 -68 92 123 132 -150 -46
2688d6J14R2k13k07K97k12K54Q3o1l57M19j29j0k05J73N2P2k25J91k71K88r8K47
2711B48j79j87J41n5j58K57j25J6M1J6m1j86J96n5J43L3k11J72k97J58Q0j00L56
2734B63k12K5q2n8J08k3P2j0j79J76o9rj6J11r3j31M45k77N4K2j10p0P3O7l23
2759b46L33K4J96k66O2l04J90l2r3K61j55j4L2O7J52k93m8K26j10r1L68J65k95
2782A29l05K44l66l6K18q8K51j94J25J99j15j88L88k27K03k78r1K19l3l41L34
2803D8k90L41j84Q9j4P6K16l87Q5K09p5N7l98M05p8k23K17j44J60M6j16O2j00
2826BJ28j34J36qk59k06K65r8J32L0p0J82K2j67N9p0j52M72n95L42n9K5L2j49
2850a40k8J04J75k72L57l93L42l58K30j91N10j45j54J16j66n3L7m4K0J19q4m2
$$ plain form
2688 -46 68 160 -53 -260 37 -175 79 162 101 -256 163 34 24 -181 -8 44 116 -109 82 -189 99 1 248
2711 248 69 -118 23 -32 -190 67 -58 -42 -1 15 -26 -212 -16 -71 72 105 -106 66 -231 -73 7 -93 263
2734 263 51 76 -6 -64 44 21 93 83 -96 80 11 2 -14 97 4 -127 318 41 95 117 7 -63 10 77 -246
2759 -246 87 111 307 41 103 -201 -11 -43 -136 125 -30 -44 -12 55 207 -86 -134 92 -18 -109 259 424 129
2782 129 -176 68 -298 -334 -116 -204 47 -147 -22 177 62 -126 262 35 238 -40 -131 88 55 -286 48
2803 48 -242 99 -85 4 -10 66 282 -105 -20 189 114 171 -227 178 100 -123 94 -50 110 156 40 102 2
2826 2 130 -4 132 124 -135 -341 -76 -174 -42 -12 -82 100 122 -45 14 -56 -208 264 -331 11 -48 -23 9 -140
2850 -140 -168 -64 111 -161 196 -197 145 -213 17 -174 336 191 37 153 -13 -66 -29 -73 -53 66 -18 -60
2872f0l3L55k77j91N52l02k83L39J9l24L01k55K63L6j53K60n24L30qk12K45j93
2894a15M17k05l8J61j87j90M0P6k05Q7L31J69m65J9J46J43j00j92J9J81l7q6k8
2917e9R6j01p9Q4K67k36K26k99j25L09n2p5Q2n3k07j9O8K09j37L2m4Q0N1m5K54
2942B27k92J35J39m38K54Jj7P2j51k3J74Nk19l14O24N1o5k6k65K11o3j00K2l3
2966i1j75K4M61k80j60O22p5o62L41r9P6J62m32L70j30QK49l27K31J20l13R4J0
2989B4j8l03M33k8j5p0j61K36m6n0Q8K61o70M66j95l7k08N33j31n1J35k14J94
3012A73k33J50k20J5L13j13j12J83k30J80k68L50K10n13L00k84m4J98p5k0j34
3033a74J70K23l91K28r1K12l70M9J32J17p4j80K61l14Q5M31k11j87O9j1J76j16
$$ plain form
2872 -60 -93 262 -15 -206 346 44 -239 100 119 -205 96 -159 104 140 -13 247 -277 53 45 -167 78 -115
2894 -115 302 97 59 220 33 -157 -117 -41 -246 -159 172 341 -124 -105 41 184 84 -108 -89 92 55 -31 -59
2917 -59 37 -64 -143 -59 208 -28 198 -101 -226 83 31 -44 38 -15 -222 -241 -173 36 -101 -69 -113 -33 18 -27 227
2942 227 -65 70 209 -229 25 26 9 81 -70 -93 81 86 -133 -447 177 228 163 137 -128 83 20 -80 -58 -91
2966 -91 -266 -242 219 -61 -221 401 326 -336 5 -94 -18 144 -288 82 -48 -40 209 -118 113 233 -80 14 24
2989 24 6 -297 136 108 93 23 -138 98 52 2 90 351 -319 147 -48 -85 -293 240 109 58 193 -21 173
3012 173 -60 90 -130 -115 198 85 -27 156 -74 106 -162 188 398 -115 185 -99 -143 55 -20 -40 -174
3033 -174 -4 219 -172 56 -35 177 -193 -144 -12 105 31 -149 112 -202 -117 314 103 -84 -15 -26 150 34
3055C4l9Q4k3j7J77l89J28o9K47j31J95n03K11J95k52nq0J36L0Pj4R3J42j8j32
3080GP4k96L14l28J70J29j43K03l2o0K12m85K57j3J96j24n8n5q2L33l38J74j0
3103D5j44J83j92R4L57j84J18l51RK29k13j09L86k05j75LK82j17L6j33J04j56
3125a33JJ13q6l1K60j63l63L45j85L00N8l04o4K79QK5J9m38K91j87K88o2k45L80
3149A06k59K11J8n5j86l9P1j32K9J04K82P6j87k95K10K27k32jM7o5Q5L6o9J11
3173I3J37l17K44p3r9mk1K24j63q8L8M34m63Q9J65K8j38j29j97M77k84l7RQ1m36
3198d30Q21k51J08J6l27J3k1L23l14J17m7k88K64P5J57l89K82k99Q8K4R5q2M4
3221b1m0K61k27n4Jj13M26m85J11K36J83r9L4k26Ol1O4r4j71K35j01R0k9o6J3
$$ plain form
3055 34 -5 79 56 39 216 -173 -45 -114 133 2 197 -306 -95 100 -152 -157 -237 -101 -71 -64 -78 15 157 139 7
3080 7 81 -215 99 -229 -59 70 -73 130 98 38 250 -235 22 9 205 81 23 -32 -114 219 -119 55 45
3103 45 -99 84 -108 -14 343 159 277 -74 -65 164 -49 -158 228 23 -152 -149 133 16 52 -81 23 -133
3125 -133 -132 -19 -105 -136 124 -39 -402 -57 -242 58 116 -188 -252 27 35 60 79 -359 -68 -255 33 -29 -274 106
3149 106 -153 58 76 21 -165 -204 -133 -265 -236 -132 150 226 39 -256 -46 181 -51 -52 -5 -70 15 51 -18 93
3173 93 230 -87 157 84 -15 -19 -40 184 21 -67 -29 405 -58 31 196 224 86 -43 -240 237 -47 -84 -75 6 -430
3198 -430 391 140 248 264 -63 -50 -71 252 -62 55 8 -280 -16 59 216 -173 109 -190 -102 -78 17 -65 -21
3221 -21 -61 200 -27 -81 -80 -193 233 -252 -141 95 278 179 213 -13 -7 -38 26 -68 -239 -4 -105 -15 -44 -110 -97
3246i7J5j95K70k37N87l42Q2nJ46Q2k03O8Q7k42k8K60j84K53l47O5K16m33J82
3269@j74j06M87j29p7k19L39j90Ko6L26l61J71J17J1k93J95N8j57K63l56P4J5
3292g0k10L89j77mj33K51R6k98K77M3l34J17K5J30J0j20K37k44M42m79J65J35
3314B48j59P9R6k78m7L9n1N6J95j59J07L0K02n78L79m07Q7P6j34N37k65p9Kj35
3338a59J9L06k75j71L62k34J27N0k80K97O7kl45J76J77j25k8j96L33o7r7J8K22
3361A75Jj03p2K28m27O0K8p0J48P1j09j29O8p6K37j05J72j99K99m4R2O5l93n7
3385a40K59k90J68M5k63M47j80J73k63K06l34kK13p0K30l41qj21J66K27q6lj5
3408A8J18o0L5kk5J30k15q8R0q8K67j71j68K32k89K25K02o3j85L03n84N23l52
$$ plain form
3246 -97 -82 -277 -7 -244 343 1 83 78 224 306 103 171 258 16 -12 248 64 317 -30 35 251 -182 0
3269 0 -174 -280 207 78 1 -218 121 -69 -67 -133 193 -168 3 120 131 -162 33 91 -66 197 -159 -85 -70
3292 -70 -280 109 -68 -72 -205 46 142 -156 121 164 -170 -53 -28 102 112 -8 229 -15 427 -52 113 248
3314 248 89 168 264 -14 -61 -22 -73 -17 178 19 126 156 358 -220 159 -248 -161 -85 -219 318 53 -26 -24 -159
3338 -159 -140 166 -109 -280 82 -152 -25 25 -255 42 109 107 -238 -62 115 -10 -38 -234 99 32 -65 -47 175
3361 175 176 73 1 229 -198 -138 -110 -180 -32 39 -70 -199 -131 -207 30 -75 97 -102 197 153 245 310 -83 -140
3385 -140 119 -171 -3 42 -221 226 46 219 -44 162 -172 -174 39 -31 199 -142 -150 -271 -105 122 36 33 18
3408 18 136 76 111 109 84 214 -1 -89 1 -87 180 9 -159 73 -216 9 211 148 -37 266 -318 205 -147
3431a47j75K98%R2j82Q9r0L04l9k28lj36K8J00K16j08l11M41r2M8P8l83K21j13
3455i2L08k34J6j55L51j36J65j27J78m39k00M29k13l58K34J72PJ42j75K27k3j2
3477F5n4nJ1O8r8J4m2R0K0j63L09k05j91j83M31j81L9L11l14J64l66J96J9J9j95
3502b41K58j45J10J36l95kJ72M59k13j03j2k55L52%j06J67k11j47M72m72K48q1
3524iQ7J55k43N7j1k32L81j03j15n7j56L88k17J06O0l29Q8J21J21p4P5k67j21
3547b95J04J63L97m24j53J27NP5m8l00P20m07r4l6K9J39K18l24K25j55K77M3o02
3570c16k8L55j66R7K19m76M86k28o0J29k15M5J81O1j50L89k50j13K18p0JQ0j03
3593H6n4j62L15p8J46j13k83k06K51K90R1k56J53j10K7j69L7K84k53J20j51j16
$$ plain form
3431 -147 -322 -24 -24 68 -114 -25 -115 189 150 -78 -81 -217 -189 -89 127 19 -292 149 57 105 183 -200 21 -92
3455 -92 216 -18 -2 -157 194 58 223 96 274 -165 -365 64 -149 -507 -273 -101 -94 48 -127 100 77 65
3477 65 11 6 17 85 -13 1 -41 49 69 -94 215 10 -181 -364 67 -114 -75 236 -78 86 -280 -84 -65 -46 -241
3502 -241 17 -128 -18 118 -277 -279 -107 352 139 36 24 -231 121 121 15 182 -29 -176 296 -176 72 -9
3524 -9 78 233 -10 47 36 -196 185 82 -33 -90 -246 142 -75 31 91 -238 -150 -29 92 18 93 -174 -295
3547 -295 -191 -28 369 -55 -208 -81 -76 -1 -49 -349 371 -36 -130 -166 -137 2 220 -104 121 -34 243 286 -316
3570 -316 -344 11 -155 -58 161 -315 171 -57 -117 12 -203 -158 23 84 -66 323 73 -40 178 108 109 189 86
3593 86 32 -130 185 107 253 140 -143 -349 -98 192 283 27 180 70 97 -72 -35 249 -4 116 -35 -151
3615a51j24J69R6J50J21m30J25k3J6k43K74P8k42K0J35J49j62M9r7j2j26L01o
3638F7j35Q0M9j69J85k2k89L14n8j87j8J08O7M6L5o9K04l54L54j75K10l06J08
3661D5j1kq4J2Q8LJk44J02N53k54j30j21O8r0M4p6J26P4j79K25o5J16l14K50k36
3687i9J24l7K19j3j54R3l69K77l08M23J8j17J54k14r7L8k3j30J04N4O6m2o1J38
3711D4J04o6j08j74K73n4p0J23Q0k07K68k29J69k6m6M3J82k52p9L11n94M38n5
3734G5o0n1J64j29R1J20k25Q3o1J24k44j73L95k00J89j0j97Q5K03j48q9j07k8
3757a93K23q5K12j54N1J9J8l3OJ91k50O8J49k23J49l04j9J81k0M3L4P6l8N0o9
3782H2j32k6k15K14J88j35J19R2k26k12O6J97k29J4K27l3l13O86l66K50k32R6
$$ plain form
3615 -151 -275 -106 -10 140 261 -169 -44 -67 -51 -294 -20 58 -184 -164 -29 120 -42 7 -90 -102 -228 73 67
3638 67 -68 12 61 -108 77 55 -234 80 22 -165 -183 -75 -8 38 73 4 208 -146 208 33 243 -63 45
3661 45 34 32 -52 -40 48 51 52 -192 -90 463 209 79 -42 26 -64 -20 -96 30 104 -75 150 85 201 -113 137 -99
3687 -99 25 -12 207 194 40 133 -236 41 -267 156 174 57 211 -3 -100 -62 -85 -215 -111 -57 9 -33 -94 44
3711 44 148 82 -26 -200 73 19 -51 72 152 -55 213 -16 153 127 81 124 306 54 -25 286 -308 130 75
3734 75 15 -36 128 -1 90 210 -15 68 7 131 -113 -286 109 -91 98 88 -109 -24 179 31 -58 -165 -193
3757 -193 30 -55 157 3 54 73 91 58 64 255 5 73 222 -1 148 -156 -175 6 -14 29 63 139 101 151 82
3782 82 -50 -76 -291 -77 111 -24 95 187 -39 -251 -185 12 -217 -203 24 -9 -322 364 -2 248 16 112
3804A12k80K52r6K2j3R2p9j74J65j65M8pL10j51R6j55J90p3K7j99N1O0k74L01
3828F0J29k55j47J24J47k58K98q0L15m90K24K50j96o4k60L77j97k37M05j26l8
3849a9M0k07M41n4j36k36M7R2K5j43j30J00J44Q9J49Lq1l17L77j81Q9M4j04O8
3873A00J28l29K02j08QN9j71K86l89O5J97n9j01K69q0NJ17K3m08M2J40q0Q1j63
3897a66J27K10j30j75m9N8rQ3J03j87Q1l1K67q9J90k64k64O6K18r5j4J44J41l07
3921i2J48J51k34O3j02k27L74k83M59l9m5q5J86j23j52j65K42r7QJ21K4j63o7
3944i8J28M0k64L6M94m82J87K34o1n57M86o3N8j30M3k53K91j74P0P8k62L16j01
3967A6k57L33n5k42J73J9k4K48k34j98L16l48M31j74j84n9J84j13Q0K13J16k48
$$ plain form
3804 112 -168 84 -12 10 -3 89 10 -164 1 -164 -116 -123 187 36 132 -23 167 94 121 -78 -27 33 -241 60
3828 60 189 -66 -213 -89 58 -200 98 18 333 -157 67 317 121 57 -203 174 -23 -260 145 19 -19
3849 -19 21 -186 255 201 65 -171 -124 -32 -7 -150 -280 -180 -36 53 202 205 124 -193 184 3 92 136 32 100
3873 100 228 -101 101 -7 1 60 -111 175 -214 -149 48 -11 -112 157 77 82 199 222 -186 -144 -4 -84 -3 -166
3897 -166 -39 171 41 -134 -183 -125 -134 -51 52 -135 -54 -85 182 93 283 19 -245 -179 39 -56 -70 74 215 -92
3921 -92 56 207 -27 36 -66 -293 81 -202 257 218 173 88 274 151 -1 -166 76 -21 -13 108 132 -31 -98
3944 -98 30 70 -194 -158 336 -146 41 275 214 -343 143 80 138 8 51 -202 89 -85 -15 63 -199 117 16
3967 16 -241 92 37 -205 -32 -13 -37 211 -23 -221 95 -253 178 4 -180 -239 -55 -168 -88 125 241 -7
3989gl2K50j19q5J99j41j08K95l03L26k66K06l81K48k29K25l1l9J4K94j66j49
4011AJ35m53P56j37k83K8k3j32P9L12m43M5j60K20J45j43M2L39q9j85m4qk11J99
4035a0K0L8J60k01J44k43Lq2L09j27q4J57k39N1P1J13m4K15M5n26M74J7k25J6
4059E2O6L4j71L2K08l7k29J68m8r3j27o9J87k48Q7L14m13L29j7n1J87k16R2m6
4083iJ17J05j54O0l20J84J59j30j58n1L01k38Q9RQ1J28l49l0K15r0k41L49k2l0
4107b5K01j79j39J11J0J70k76K76p3j18K08o8l08L96k44R1j15J90k69J15L7r4
4129a03J05j55L9K52k17m8J64j59P8j19J82j07N0j54K91n3J4R6l00j91K69K79
4151B13k82J20m7Q3O9k24k07K06J04j80J68k81K98j80L37m29K43L9K5J60J89n23
$$ plain form
3989 -7 -39 211 92 7 206 65 -43 252 -51 275 9 215 -166 82 -147 78 47 8 22 316 150 1
4011 1 136 -317 439 302 19 47 24 -108 -29 283 -160 -115 -275 -55 90 -53 -11 328 239 54 10 2 -209 -10
4035 -10 10 48 208 7 151 -92 -89 -171 138 11 -73 84 -155 -104 -33 80 36 251 296 -230 244 261 36 52
4059 52 118 152 -19 13 221 184 -45 123 75 -18 -145 -214 -27 -275 -188 126 -287 42 25 -26 161 -55 37 -9
4083 -9 108 213 59 119 -201 -17 142 12 -146 -197 104 -134 -45 -36 45 173 -176 -206 9 -81 -322 27 5 -25
4107 -25 176 -3 -142 -31 -21 149 -127 149 76 -42 166 98 -210 186 -58 33 -82 108 -161 -46 -9 -103
4129 -103 2 -153 -114 138 -79 -127 37 -122 -44 -163 19 -88 -38 -192 99 46 60 156 -144 -335 -66 213
4151 213 -69 51 4 87 156 -68 -275 -69 35 -145 23 -258 40 -140 197 -232 11 50 75 235 424 -99
4173i9K31l16M11l47j00K91r1J41l03K98l01K53K42m61K95j20p0N3p7L59m88j81
4195c80J30J93l1K39k11L29k58M5Q7m28K17L7k67K01J53n0p4J9P6m04L30R9m3
4218IRp0o9J44J02j85J66r7j67J6L0J41j27P8J14p1j22J14l0j61J55q1J88q1r3
4243h8P3J96k23M0n9mp5r3M0k2K20J71n38L75j06K20j80r2R2j04J47J29P5j93
4267AM6l56K28k25L06K10j67J12m7j48L46m22J14L2M29m48j70L49p1j5j85J48
4289F7j81J79j27j02L8J42k25N7K7K63l64K01K65m34M39j60k69J46P2k36L8L9
4311a25J0k07L13J27j06j98R1P1O7q6k9o0J72N3l17K28n5J35m7j49M73k80k50
4334a69J30j22Q8M1MK45l72P7k1K20j64l00K44j89K71P2j64KK48l70L8J55J21
$$ plain form
4173 -99 132 -184 227 -120 -220 71 -20 121 -182 116 -185 68 310 -151 144 24 -46 7 -70 289 -199 -380
4195 -380 -250 -57 -88 151 -60 269 11 56 143 -285 -68 -31 -298 -97 56 6 -68 -49 27 -377 -47 52 9
4218 9 18 -52 -121 23 125 -60 106 9 -158 -142 -112 29 -98 -20 94 23 -99 15 -15 -176 -21 -102 86 5 -88
4243 -88 -15 181 -42 -2 -61 -65 -140 -233 -193 -215 5 176 -362 13 -93 127 -53 -145 -53 -157 -10 119 194 1
4267 1 47 -309 -81 -306 0 210 43 155 108 -40 306 -116 -2 30 459 11 -159 190 119 104 -81 67
4289 67 -114 65 -62 -164 -126 16 -209 -152 -125 138 -226 -25 240 -194 245 85 -184 -38 34 -202 -164 -125
4311 -125 -115 -322 -9 118 12 -186 -95 -24 43 -43 -72 -132 40 93 -224 4 -51 84 37 -112 361 81 -169
4334 -169 -39 -161 -73 -32 -28 217 -155 -78 -99 121 -43 -343 -99 -288 -17 55 -109 -107 141 -229 -191 -36 85
4357H5N6l57J21q5L74k21L6M5r3J01J5j36J41k33J66K64l20m3L14p7l55Q7J15
4380@l1Q0m1j60J39j44%M03o6j02l08j97L32J86k31K02m9J89k63N9J17L6J3j80
4404a6j32Q2O6rJ35l4k65J84j54J50N9l04K58K42k37Oj40jK23j00K36l09K37o48
4428d71N53l8k4j93K19o9L6N4L14k23q3L8q4j77P1j43K18J02j02q4M1J53l12K53
4452D9o5M8J12J27p3l08J93l03l2N1K02k9K13k54J32p9O5k82M07k71J53J50l34
4475a28J99k39Q7Q9J0P5k8NJ92l13M6q0J55J05j04j96K08j39m4o1J24J08k1j06
4499e6K8j5j39J84j79L67k54j30J76L7j0O1j93K06J1J6R3k29n5o3J30KJ57m9N2
4524A48j85j07J80J50k33j04J77J06j61J26J2J15k01L4m15L43k04K07J59j09k3
$$ plain form
4357 85 141 -216 -95 -180 194 -27 9 54 -39 62 77 -59 82 -151 15 279 -41 -84 230 153 -202 -115 0
4380 0 -31 49 8 -152 -13 -157 -157 246 180 78 -230 -427 -95 91 -140 62 13 202 -61 -2 115 151 164 -16
4404 -16 -148 -66 0 -9 126 92 -173 11 -143 7 66 -238 20 262 25 31 -109 -110 113 13 249 -60 177 -471
4428 -471 82 44 20 -173 46 -23 13 67 381 158 75 113 29 -148 -77 -220 -2 100 -2 -86 -45 108 -204 49
4452 49 -16 32 144 271 198 -110 83 -220 -252 -201 1 -28 185 -69 63 -16 49 -233 174 -97 56 206 -128
4475 -128 71 -168 -81 8 18 93 65 70 262 -51 -5 -85 70 175 71 -125 83 -56 -100 -161 -37 71 50 -56
4499 -56 -28 -43 -182 2 -177 190 -64 -194 -18 19 9 70 -123 83 94 110 203 -26 -81 -144 -14 -12 145 96 148
4524 148 -37 -144 36 186 -47 -151 26 132 -29 97 109 224 23 57 -358 -15 -219 -12 147 38 15
4545A5KK90k41N2l81J13J69J45m11k7l7M26n40O9L27K21k86N2J42p1j9p1K73m26
4569b14N53l41Q7J4l99M01j18k23K04j62j76N48k17J67Mk85J26lK4m0k62K33L15
4592B36n13K95O7j05J7k28q0L99k2L5k44L70q9j82q7N19j50k78J05N3k15k4L39
4615B18k52M64l15j01Q3r0j57J39M31k63k76R0j46K85j13N4J16k44K9k6Q5j1l55
4638c55M64j22j34K59q8J27k17K39m28K05M3K38l84K16k64M6j03J81N56l43j93
4659e7O1m5m4m5O6K7M5k55L04j58P0K61o5j24k5n2N4M2O8o5j7j48oQ5K0o2pJ55
4687H3n5J94K6j19j24n3L20j08k29o5J94L15N9m05J07k76R1J2n3M33n62J50j69
4710b34J56K64j14j30J34n2K6j1j05N4J13k00q6J94o7j3N1M6m4j4n1m8K14j04
$$ plain form
4545 15 17 307 66 118 -263 -150 19 164 -247 -274 -311 115 -425 -356 -29 192 -94 -42 100 29 10 -61 212 -214
4569 -214 339 -2 85 99 -300 101 -17 -240 -36 -198 -374 174 -43 124 128 -157 -31 -34 -10 -50 -312 -79 236
4592 236 -277 18 85 -20 -3 -231 -311 88 66 101 -143 227 138 -44 -131 388 238 -40 65 118 -97 -121 218
4615 218 -34 430 115 14 97 7 -150 -11 420 157 -119 -29 -175 110 -3 51 167 -77 -48 -74 11 0 -355
4638 -355 109 -13 -147 112 24 151 -66 173 -255 -50 -7 231 -153 63 -201 -155 -258 -77 479 136 -57
4659 -57 4 -41 -85 -130 -64 -37 8 -247 57 -101 -31 230 165 41 16 -36 18 60 128 63 46 -102 -108 -23 -3 -65 -72 83
4687 83 28 222 248 129 5 -48 272 164 -65 -130 64 379 438 33 140 -136 -45 -33 -86 347 -215 -65 -234
4710 -234 -78 186 72 -58 76 24 50 39 -66 -12 101 -99 -185 9 -58 -71 -20 26 -18 -32 -83 -131 83 -21
4734b1K10Nk0k25k85J93P9j96K31K17k10j13K08J71l68P3K39j03J48k31j36L5
4756i9k8J89l3j20k96M19k54L62k96J02m7L43j62k6j60J94k37J75Q9j38J43P1
4778A91k82M2J79j47n8J78k18J97P7j73l10K14J23J47l65K2K53N5%L8o4M0m24
4801b85K12O5j30L53k41J88M7l90j19P5N49l69pK80j9q7n38L75l10M34k94L56
4823A45j68j4j47L52j98kj17N2J33j04M5K48K9k22j88J12j01Q7k82L60k49j58
4845c87M14Q7k72M2J2j4n0J34o6p8K65k09k3J83l15M07k36K33q8j01k98O57m08
4868a11J06J34K6m35J68P2M2j65J95J2J04k97K15K92n18J58J35Nk08j65q8O09
4890B86m38L06q5j35K72l06j54K47J56k68J67p4J46l52J33M16n88oL95J1j88K71
$$ plain form
4734 -21 189 194 174 -51 -336 -143 -64 -260 -29 188 -22 -135 73 244 -124 -51 188 85 233 2 -134 -99
4756 -99 -127 62 29 -91 -387 32 -222 140 -156 -54 -101 242 80 54 -106 88 -149 26 115 -23 120 191
4778 191 -91 -49 130 -17 -75 103 -115 82 159 -14 -324 -110 13 160 -205 -183 70 125 125 163 99 139 -285
4801 -285 -73 -8 -138 215 -26 162 209 -181 -300 -225 324 -45 -52 228 209 122 -416 -41 -351 83 -211 145
4823 145 -23 -37 -184 168 -30 -32 -149 -97 36 -68 -23 225 254 32 -156 -44 -145 -58 -340 20 -229 -387
4845 -387 27 114 -158 -116 -104 -118 -168 -34 -100 -178 87 -122 -145 38 -277 130 -106 127 39 -62 -360 297 -111
4868 -111 -5 129 155 -280 -112 -40 2 -163 32 44 148 -149 66 358 -160 -2 133 138 -70 -235 -323 286
4890 286 -152 154 69 -66 206 -100 -254 -7 149 -119 48 -26 120 -232 -99 317 -271 -277 118 129 -59 212
4912B12r7Rj81J49j53L0j7J4N6q5j54J86k45P8L45m1k30L7j38L22j79PK04k19
4936i0K77p2m9j00j06L7J64k13J88K23l13J19M4j63K69m54N12j92k95K30Lj3P2
4959G8j42O8M01p49K40J08j29Q7l35N70k84j60J55J56j76K03O2R5j73k20M20l11
4981c6K08j05R9J56l34O9k5R0k46K19Q9l8K8k19r6K5L34j93n8O0k18L7K74J58
5005B78k31j56Q0j24J05Q3j82j96L02R7m5M0j45L40l28J36j5M0j4P0j9k42J01
5028b5J43k03mk62K33L29k75m0O1K30j44n5q4J67l66L99n2J38l41l17N79o1l8
5051A2k47J25j19K25k1qK61k81m3M6K3O3J30k40J53k8k15RM30l35M26l11l22M51
5075A84l45J08n2k8R7Q7N9l2p3RO2l53K4R2J36k5o9m7P4P2k08L32J1Mk31l2J64
$$ plain form
4912 212 115 124 -57 92 -61 -31 -48 -34 22 -63 -217 -31 -276 -198 147 106 -124 -87 -225 97 -82 -75 129 -90
4936 -90 187 115 66 -34 -140 -103 61 -152 36 259 -54 65 109 -54 215 -239 273 81 -214 16 19 6 78
4959 78 -64 4 405 -344 -104 4 -125 -38 -373 197 -87 -247 -92 64 -112 91 153 248 75 -145 275 -36
4981 -36 172 67 166 322 -12 57 32 122 -124 95 184 146 174 -45 -141 -116 218 25 -33 27 -191 -154 120 278
5005 278 47 -109 -29 -153 -48 35 -147 -343 -41 56 11 51 -94 246 -82 54 39 79 65 135 116 -126 -25
5028 -25 118 -85 -89 -351 -118 211 -64 -104 -43 187 43 -12 -96 71 -295 104 52 190 -151 -468 111 50 12
5051 12 -235 -110 -229 -4 -25 -33 228 -53 -96 -50 -27 36 166 -74 79 51 -164 -155 275 -60 366 55 -267 184
5075 184 -161 -53 -105 -133 -36 51 110 78 5 14 76 -277 -253 -161 -25 -50 -119 -166 -92 -20 -228 104 115 119 -112 -144 20
5102B0l5m30J49J70L05m49N03K34l45k46j63K81q0L46L9k63P9K3j77k44K00L1
5124e2K93k09N9J02M4k28j66J32j92J14l4L47k06o3j76K05j09J94j41J50k56K08
5146A6J02q4j79M61j57k49k22L97j8o3r7K57l32J92J68N5k25Kj09J35J6K51k56
5169F1K50j94l41L79k04r3J20J05J63m45J08J46P1j26Q1p2l7J94j27q1L1j4K56
5192B31k87J31Q6k89Q7k8K83p1j25J38N2J84l37n2p8k10L21K89o2m26n3J86J68
5215A38j23j76p1RK11n3M1n6M42m50N51m82k72K09K07j18j29J32j11M6J43L55
5237D43o66L05J23l60Ko5J36M30m28l6j67J29r8J30K77k28L0k84L78p8P2m4J71
5260A72l39L41k75L40j69q2L3K55m82j3K02K2jm24M49j9k38K65k78K11K26J3o4
$$ plain form
5102 20 -15 -445 -296 -126 179 -270 233 467 122 -124 -287 -6 -86 260 299 36 115 138 -39 -283 -83 -52
5124 -52 241 32 91 193 237 9 -157 -25 -217 -103 -137 210 4 -59 -235 -30 -139 55 -86 64 -192 16
5146 16 118 34 -145 316 159 -90 -312 85 67 4 -93 164 -168 24 192 247 22 24 -85 50 66 317 61
5169 61 311 117 -224 155 -49 -142 -22 83 246 -199 -91 55 126 0 81 9 -28 166 39 -42 -11 -25 231
5192 231 -56 75 161 -128 -41 -69 214 143 18 156 208 392 55 3 -75 -285 36 325 263 -163 -216 -30 138
5215 138 15 -161 -232 -223 -12 -65 -24 -80 362 -88 463 -19 -291 -82 125 7 -122 10 -101 -55 88 443
5237 443 -223 82 205 -155 -153 -218 -82 348 -80 -116 -283 -154 -252 -122 155 -73 -43 -327 51 -27 45 1 172
5260 172 -167 174 -101 239 70 -12 21 276 -206 -219 -17 5 4 -420 29 10 -228 37 -241 -30 196 209 145
5283A45l22J06J06rn2J29o3j6J00Mk43kK28k21J71j50K04l11L02Q5r9j39j60O8
5307a39q8M56j97K50k49j22P5l7m9J03k63K19jm1M1J83k47k28J23J45J16n8J57
5330A49j00l61M82l7r4k4P7k53J98j87J44n9L04n43J69K29l1k7j30j51J61O9m7
5353f2M35l56J87M2l24K3O2n7O1m7K62j81k3j96L25Pj63L7m2m1J78j70M1J17l15
5378b00J71J00j19J04n0j72k5K36M9l37QK73J17k00o1Lj57K90n7r9J02k0N7j13
5402a00J20j78M00N6k31jl41N56j20j95J00j13J5J56p8p1o5Jm0L71m53K39l45
5425c17K38J60k19k1K32j43j10K86n0j40K1k34K80J13j88L39m14K88l66K05k41
5446b81N3N00k25L8j83L61l49J95j0j48L32n95K00o8K95lo1k30J04o3L55k6j48
$$ plain form
5283 145 -177 -71 35 26 -26 103 40 24 124 128 -115 -117 111 -110 61 -89 115 -196 106 191 92 -47 -207 -139
5307 -139 -227 229 32 282 33 -89 -14 -51 -100 3 -260 -41 -42 -83 -42 141 -106 -334 -211 -66 50 -8 149
5330 149 49 -312 170 133 39 15 92 -161 37 -150 -6 -65 239 -304 -135 94 63 36 -94 -245 -84 -15 -62
5353 -62 373 17 204 246 -78 -55 7 -50 11 -36 226 45 22 -174 151 158 -5 32 -10 -51 127 -43 -2 115 -200
5378 -200 -29 71 -48 56 6 -166 -191 45 94 -243 -235 38 155 -45 -106 -103 -260 30 -27 -126 -24 -44 13 -100
5402 -100 20 -158 242 298 67 66 -275 281 161 -34 66 -47 -32 124 46 -25 -90 -89 -129 242 -211 28 -317
5425 -317 -79 81 -138 -159 73 -70 -180 106 56 -84 -63 -297 -17 96 -92 247 -167 121 -245 -40 -281
5446 -281 -228 272 47 85 -98 263 -86 109 99 -49 283 -312 -112 -180 115 112 51 -179 -75 -138 217 191 43
5469D3J27P2k04P4k78O6j85p5N99k47j00Q5lo1J03j16K05j42P4k5l4M7M02l68
5493E9j27K50J9j10k06J38N3j38N7J93p9qJ22L2k66K05j78l0J20j18j54Q5K22
5516A41m48L8L40J36j43j19J71j47L9OO5l91L63K04l46j40K79p4k19J25L8n6L23
5539A85J08ql68L8m9K67l65K31j1j01N6J6J2J24J43j95j79K35l6k69K33n5p4j33
5563a95J9l5J91J48l32N52j09j14j74k00K95j45K08L8k49L7J62k27K9J49k12K51
5585H7j98J39j68J96J03k04K24j64N0p1K4j69jj07Q5L91m05K22l01N27l27J84
5607A17j64pK51j11k21J32K04j36J2J26j74J02j10k7k2L1RKL0k20J51k09L27m3
5631E0j46Q0K59j64k34J75n6j8J34l54J54K08m8J83j49l4k32J58K37k90K34n03
$$ plain form
5469 43 170 242 38 112 -166 -100 -285 -360 239 -8 -108 -23 -26 -87 16 -100 105 -37 37 12 -22 25 427 59
5493 59 -68 182 201 91 -115 23 76 -62 -5 188 109 101 223 255 -11 194 16 -14 106 -12 -166 -81 141
5516 141 -307 -269 71 207 64 -55 116 -31 8 14 79 -312 51 255 -91 -231 48 -26 -245 -120 -82 -138 185
5539 185 293 285 -83 -45 -94 173 -192 39 28 -73 -17 -1 11 135 278 83 -96 139 103 -166 67 12 -62 -195
5563 -195 -176 -211 -20 128 -204 348 239 125 -49 -249 46 -99 109 147 -102 -65 97 -130 -101 48 -164 87
5585 87 -111 28 -140 56 159 -45 179 15 65 -6 18 -151 -152 -259 -174 217 -188 34 -267 260 -67 117
5607 117 -47 -54 197 86 -135 -3 201 65 77 203 29 131 21 -6 -28 3 12 14 44 -176 -25 -234 93 50
5631 50 -96 -16 243 79 -155 20 -36 -54 80 -274 -120 88 40 223 74 40 -192 -34 203 -87 147 -356
5653c56N58M2l61K72k5j98J11r1j66Q7K11n3k82J51K23p5J39j36R9k56pK9r5J30
5677d9n2J58j24Q7J08k33J43j45K08K60k13k18J24P3j52m6L07k84R6j90K05k16
5699a53J83K65j49j11%l4q6J98j85k0L15l10O6j26L08k51J27J04MK42n67L4j88
5722c34J84J67l05L55j42j04n5J93l4M2L6pK01R3J12m29L61m25l5J5J53J9J28
5745A89k12L09j39j84L9k55K97J26j63P5Lk81J33k89K97j02K4K49l58L6L27k21
5767a00N0K3j76K09q9L52k73J69j02n5J28J39O8j75j06j1R4j31Kk28L05k52M4
5790a15j39L50j88J95j51J02j13K00m90M15N9l67nJ65R1K71n64M17l01N8J22O1
5812G3n4K0k11J37L9n8jK7J8k82J24Q9K17k97L3J99j55o6K02K30l95J43Q5p4l98
$$ plain form
5653 -356 202 244 -117 155 130 -68 43 -48 -214 -127 84 31 -251 -100 123 48 187 51 150 -106 -113 -84 -179 -49
5677 -49 -101 57 -67 20 128 -105 38 -107 101 361 148 -70 54 127 -25 -71 236 -48 48 -142 63 -153
5699 -153 30 295 146 35 35 1 -85 113 -72 -92 223 -87 -21 -147 161 -90 37 141 145 387 -180 -146 -334
5722 -334 -150 17 -288 67 -75 -179 -234 -41 -75 -33 3 -4 197 290 402 -27 334 -91 -126 -111 42 61 189
5745 189 -23 286 147 -37 2 -253 44 170 7 82 85 -196 -63 -352 -55 -157 -133 116 -242 -206 121 -100
5767 -100 -50 -27 -203 6 -83 269 -4 165 63 8 136 275 343 168 62 51 145 14 16 -212 93 -159 -115
5790 -115 -254 96 -92 103 -48 54 -59 141 -349 66 125 -242 -247 -82 9 280 -284 133 -168 -110 12 73
5812 73 19 39 -172 -35 4 -54 -55 -28 -10 -292 -168 -79 138 -159 -126 73 -82 -148 54 284 -111 32 117 43 -355
5837c55J3L50J7k37K08J98k08J27j94J03o8p9J94j28N2j39M09m74Q6J10J64J62
5859C11k64r5Q1jl8j88J65p1k5M83m83n0L42l60L36j28k93K51j70J58J85j66l8
5882e8J89j40j9J08l82K16k0k21M51J8j51O6K5p4k82K50P9k02K68J07j61q4J60
5905A43J97j75m0j66J6K80M9j09j40k58J47L6M8j85J71j06L57k14K87k11k20p2
5927a65K62j89L26j8j18j24K72k45q0R0P2k35M0J36m7j08j89M24r1O3l22K48K58
5950B60k98J39k79J33K2m21N13L92m89j35L53j20r4m6J40l44K67P3J45m89J24
5971a54K12l37L33k81R9K7J64j08l08K65K58m0j53m4K83j88m0j51L16m55L79R9
5993A76j06k25pK30j03J07KJ0j12Q3m1j43k24N41k53K95m00m2l0N85j92k27j64
$$ plain form
5837 -355 -342 8 25 -212 -4 194 -14 113 -81 22 -46 -125 69 -59 -7 -146 263 -211 -125 -15 149 311
5859 311 47 -48 33 32 -6 -194 -29 -100 -125 358 -125 -175 167 -193 143 15 -278 -27 -197 -39 146 -20 -58
5882 -58 131 -9 -28 80 -302 -86 -106 -327 124 142 -9 57 82 8 -274 -24 55 -147 121 228 67 -17 143
5905 143 340 165 125 -41 -25 255 304 195 55 -203 -56 -20 28 -157 14 -92 265 51 338 127 -93 -165
5927 -165 97 -92 234 216 98 -26 246 1 -79 11 83 -152 -112 24 -23 -131 -320 104 13 76 -246 2 260
5950 260 -38 101 -178 -45 -23 -444 69 461 -28 -163 190 70 -24 -70 70 -274 -7 66 211 -278 -154
5971 -154 58 -279 54 -227 -128 -101 63 -45 -353 -88 170 130 -23 -67 216 28 -12 -163 153 -302 77 176
5993 176 70 -155 -162 68 -35 72 74 84 -28 55 14 -129 -353 188 -65 230 -170 -212 -242 343 151 -76 -240
6016b40J24M3N5R5j17r4J50j59l1J45K24O4j90K36k88k5j22K49l19J82j5J21l03
6039b15J71J59%j44J8j23J71j9l68K91K60j78j13P8k1J34j78M3l1j4J61k97M63
6062B48P6k51l73N2R8j14L35j05J14O1k44o3J19L3k45J35J61k5J83j47j69j22
6084b43L59o5o0o1K21l7k68L20J1k72k4K61k70K04J07j26l8L7J50j30o2j46qJ47
6108GN2J5j09K70m04N7J31M8q6J05n8K26m44L75Lk27K04k27J99k08j0j94k7M01
6132I9k2j9NK14l27N3j85J39j9n2J29j00J05J9q3L36j42j54m4J53k13K93j29j02
6156d6K57l61L55o0q5k71J07k9K36m9Q6j82M1j87PJ06K90J5n03L56j62j7J00J02
6180A06mM3M5Q1l09k11L4J7M17k13K30j95R4%P4j41J9k02N0j26L23k30J67L36
$$ plain form
6016 -240 -116 -73 -18 77 -40 -134 16 -143 -174 -29 195 259 69 305 17 -8 -130 119 -200 -18 -33 88 -215
6039 -215 -44 115 115 -29 -11 -134 37 18 -350 -59 201 23 -90 -12 -33 101 -77 -34 -65 -79 82 -215 248
6062 248 324 73 -300 -248 -150 -264 71 -34 80 141 -103 -166 -47 -14 -259 -124 37 12 195 48 -121 -243
6084 -243 116 51 -9 -70 151 114 -154 166 177 -95 -119 142 -128 76 183 57 19 56 206 76 14 -132 -140 7
6108 7 59 74 -35 235 -169 -112 19 67 -19 86 28 254 -190 185 188 -39 165 -62 137 -71 -81 -275 -302 99
6132 99 77 58 63 277 -50 3 -182 -43 -62 -114 15 -85 20 39 -44 292 150 -4 -48 105 -108 185 56 -46
6156 -46 211 -150 205 145 60 -211 -104 -133 103 54 140 -42 -1 -188 -181 -75 215 230 -273 83 -79 -96 4 106
6180 106 102 145 190 271 -38 -249 -215 -198 219 6 236 41 135 135 209 68 87 -115 -65 -191 132 -98 69 405
6204D05m69j13J31R4J88j07j25K68k21j92J12J74p4J35j93J09k93M7k68M10j29
6225a11L12k43J88J16l63M5K86k74K41m9j23m6R9k52o4J02oJ58M0J05l87K15k04
6248b15L65l62K15p1K87J9k15Q6M0k49L65j36K6l8K7j45p8J65o6j72K4J97j90
6271a21k9J75j3L04k80j60P4o0j3q2R0p9K13j27J88K94l46l5k9j8L7Pp6K83j33
6296F4q5K6Q0k08lM0p1J57j2j07J19j51J63K70l01J61L2r6j49MR8j62K32j88R8
6321A1K5N4J1m5k68L85j45p2M44l66j22J6J41ln6J61k36k68L13o8J49R7l88N93
6345C63l05l49L63k23J29k63N09r7k32L28k97J93q8K42m58J85K15q8J16m44K40
6366C9K03l21n3l7K07L7r4K1j13R1k19J57k33L07j33M12k89Q4K2J18Rm41L66j19
$$ plain form
6204 405 -64 -177 -46 48 236 129 4 272 51 -141 -29 145 71 206 13 122 -171 -124 -392 18 -111
6225 -111 201 -42 146 262 -101 -56 230 -44 197 148 25 -21 78 -174 -238 -136 -142 16 56 161 -226 -11 -215
6248 -215 150 -212 3 -68 219 238 23 109 149 -100 265 129 155 117 144 -1 -79 86 20 -152 -128 69 -121
6271 -121 -150 25 12 316 36 -124 -50 -110 -123 -205 -115 -194 19 -108 80 374 28 -7 -36 -54 -17 -10 -86 197 64
6296 64 -21 5 85 -123 -126 -86 -157 0 -12 -119 0 -151 12 282 -19 142 174 78 -71 -67 31 -131 101 -87 11
6321 11 36 90 101 56 -212 173 28 -44 400 34 -88 -72 69 66 10 171 -65 -333 -20 -88 61 158 -230 363
6345 363 58 -291 72 -151 -22 -285 224 127 -105 223 -74 119 31 273 -185 0 215 127 243 -201 39
6366 39 242 -79 -132 -169 38 75 -19 2 -111 -20 -239 -82 -315 -8 -141 271 -18 66 88 206 215 -226 140 21
6390B1j94j61J32M56r9l04L08k19K81l45M00l84j90J0J97k30J58K03K9l04K24
6411a1N9j03j00J00q1K5p4J86q1L28M9k70r3J79r9j06J52j92K59l27L56o8J6o2
6435D2J20k99J07PO8j59O3P6J34p9j64J82k55L35j07K23l85J68j38m6R7o7K37
6458A60J29k10J08m36L41k24k7J74J62k81J84n5j78J47j19J71J73n28K90j62O0
6479a21Q0j9L0m4O4R5P3m60J92k37L83Mj29K17j31L7M3J39k15j64J78j14K62j77
6503a4k22K19Q0j18J17k25M06n81N83L0m72J38L43l05j21J27O7J80j21j11J06
6524A06o3l79L43K31L6m50P3K30j65j2Q7l5P6j57L8j2J16N3K24k55j76J19j27
6547i9J40j94L15l99J6L45J89k80k21L54rn4j35L18l46J17R8k36oK0J32m90O10
$$ plain form
6390 21 -173 -334 -202 254 155 -149 159 -60 221 -124 276 -108 -298 -288 -91 -321 -163 40 69 -235 -11
6411 -11 48 -55 -155 -55 -136 -111 -185 1 -80 248 297 27 -66 113 14 -92 60 -132 127 -200 156 88 104 42
6435 42 162 -137 -30 -23 45 -114 -51 25 159 80 -84 98 -157 178 71 294 -91 77 -61 -107 -10 -77 160
6458 160 289 79 187 -249 92 -132 -159 15 177 -104 80 25 -153 -6 -125 46 219 -309 -19 -181 -121
6479 -121 -41 -60 -30 -74 -10 85 158 -302 -110 -347 36 40 -89 128 -3 34 77 216 1 -163 15 -99 163 -14
6503 -14 -236 -17 63 -55 62 -163 243 -338 245 275 -197 -59 284 -21 -142 -15 52 232 111 0 106
6524 106 43 -336 7 238 274 -176 -103 127 -38 -50 37 2 78 -79 -41 -53 63 116 340 85 -91 28 -99
6547 -99 41 -153 162 -237 -221 124 313 33 -188 166 157 103 -32 286 -60 57 155 -81 -87 -67 65 -425 185
6570A85k61JL6O7o2j15pR4J0J4J69j08j20L17p8j53k4J07M4O1k56Q1J93l93J58
6595d0j32j37N25l37J73k7K53k45J13l8k34j65K4K51j53lJ39j55J63j30k90M04
6617d1K10m24L90j18j4L16k28L3j93O6r1M8j29kM22j68j06J8pN0K19k97L9j28
6641a35L34r2q0k00J58M8j63J54l35L60j61K36l0j76j4L05q0k3k17Q8J5L0k5j99
6665b02K85J04r3J2R6j66J21l67K50k51L42m01N66J4n42M48o0j55J06j27j91N6
6687a55j87M00N8Q5j45M5k7j07J07%M3o4l26K64O6L3j12j02n8J0J37m01L03O3
6711g0j10L80R1k80J85j95P9j7K45m41J68M2j47q2O8L18j96m7n7K9k4K81k73K73
6735B20j94O9J11k09M4p9J08O0j91J95k9Q4j77K59l48j89P0K67k61L04j37P9l52
$$ plain form
6570 185 -76 -75 -39 28 -34 -149 -156 -62 -52 -38 131 23 -97 220 142 -11 -35 72 116 177 -79 2 195 -198 -40
6595 -40 -172 -309 216 -121 52 25 278 33 146 108 -126 -291 -267 -16 -169 -172 -33 -188 -25 -155 -445 -41
6617 -41 169 -255 135 17 3 319 91 124 -69 -3 -94 -46 -175 -177 245 77 -29 -11 -18 32 251 -46 -7 -135
6641 -135 199 107 27 -173 -15 33 -130 24 -311 49 -112 124 94 -82 -96 209 129 106 -111 -23 -8 22 -3 -202
6665 -202 83 187 94 106 202 36 157 -210 40 -211 131 -270 296 310 -232 216 156 1 107 -20 -211 -155
6687 -155 -342 58 116 201 56 101 74 -33 74 74 117 53 -273 -9 57 90 -22 -124 -182 -172 -35 -436 -133 -70
6711 -70 -180 200 291 11 196 1 80 63 308 -133 35 77 -70 -152 -84 234 38 -9 -66 -37 -61 220 -53 220
6735 220 26 95 206 -3 41 -38 70 130 -61 134 105 189 12 271 -77 -266 -196 71 -190 114 -23 56 -296
6758b96K3M69q7j96J36K28m06k0Q4J88j08j01M8R2k70J74j9J50nk51L84l37K75
6781A55K5k84J26j34J2J69j81k9L54Lk58K98J0n49L33ml95N05N3k00J82k97R1
6804a5L9k11J9J96J4J11j06j98J80K40k82L37m21n2J6Q5K64k65k7O4J41m7q7N0
6828D5M6j85K31J00l00J04J19o5k36J75j37K31K21l15j81K68j7J76l42J22J55
6849B15k65N5R3j13L4M6r2j01J96k77L20K19o18M13l90K18q4K39m98K84J49K08
6871B51j74l42L72Kk67J97j67K13P7j90q1l2P1J21J7Rk20J16J65k94N41m52R1
6894B4l1K90l59q3K12Q0r3Kk63J01J60k23lP7J70r0k0L4J09k39r5K29J75j45J50
6919A69p6m3k05Q8j05L46j87K56k13N7m2j93l2R0J81n0j59K21j09J7n3L64m65
$$ plain form
6758 -296 -273 196 109 -87 49 277 -129 -149 -65 123 15 -86 -38 54 -216 -42 -61 89 84 -167 217 -120 155
6781 155 180 -104 22 -112 -100 69 -112 -141 213 216 -42 256 266 -283 50 46 -349 156 209 9 191 -106 -15
6804 -15 24 -187 -168 28 42 153 47 -151 29 269 -13 324 -97 -149 -133 -48 216 -49 -76 -12 129 82 -5 45
6828 45 91 -94 137 237 -63 41 160 95 -141 34 -103 128 349 34 -147 121 104 280 -62 60 215
6849 215 -50 5 98 -15 19 65 -27 -128 68 -209 111 330 -288 125 -265 -47 -131 108 -390 -106 43 251
6871 251 77 -265 107 109 -158 39 -128 85 162 -28 -109 -141 -70 51 68 77 -143 -27 138 -156 385 -67 24
6894 24 -7 283 -76 -159 53 133 40 42 -221 -120 40 -183 -186 -109 61 -29 -49 -15 94 -145 -240 -11 164 19 169
6919 169 93 50 -155 -67 -172 174 -13 243 30 87 45 -148 -180 -90 91 41 -118 103 -6 11 -42 322 -143
6942a43L4K52l3j16K8r7J11R9l9j8k9J74mj18k44R0J01L22l11K3k84L47Q9j56
6966G8k62K55k33N2K09j89k15J51M78l03N3o4l9L6k29J39J10l63J52J85j86K61
6988G6J23j89K17J74l62j45K11m19L46K03O0k65j70J94J41l30J89P1l52N30j95
7009A08k09m1J8J74l28N29j12P9l34Q7K1J45J77k55r2J15q6o8J6J1L02k68j44
7032a55j2j07M87N8m78kK19k8k4rK59l62K87p9J10j19j2P0j19p6j97K62l7k6L6
7057e4P2J21M2n57L50J4R5k75M2qK29j31j13J03O0N7J80j05Q3k16m5j31J54J03
7081G0L4R6m29J26J64J28m80M78K97o08QK42P5k52k98M17q4J31j75k98M55j24
7103b7J82P7j81r6K55j20j3k03k87N25n0k36J50j15K34j07M2M1M6j05O6j9J23
$$ plain form
6942 -143 -109 143 110 -6 22 -75 36 135 96 78 49 223 219 101 -143 -53 48 370 59 82 -202 145 234 78
6966 78 -184 71 -162 -110 99 -90 -305 -154 324 21 74 10 -29 7 -222 -83 27 -336 -184 1 -185 76
6988 76 199 10 227 401 39 -106 105 -314 32 235 295 30 -140 54 195 -135 54 125 -227 303 108
7009 108 -101 -142 -124 50 -278 251 139 218 -116 -29 -8 137 314 59 -33 82 -4 -72 -56 -45 257 -11 -155
7032 -155 -167 -274 213 271 -207 -209 10 -18 -42 -51 208 -154 133 54 164 45 33 103 -16 -92 -289 -27 -64 -90 -54
7057 -54 18 139 181 -376 -26 -12 83 -192 -150 -158 71 -60 -173 -70 -10 47 227 122 205 -11 -56 -187 -33 70
7081 70 104 200 -229 -103 61 189 -291 187 484 -124 -116 126 201 -51 -349 68 -16 115 -60 -358 97 -27
7103 -27 155 232 51 -45 210 90 77 -126 -413 112 62 -174 -24 -139 95 -12 30 71 117 12 78 59 182
7126A82m94L42n2j5L52l67l24L51J12l5n4j48m1P3K19l58K22J45R9q0k7K67k99
7149G0j92J80Oj77j6K66j27J15j6j64L0J05l18L94j50j9k55M72j18j17rJ56j34
7172a8O8j7K00k03K23l09P0P1J11ml12N8Q4K72j04K2m54M43j34MjN3l92L41O2
7197A34m78J30N38k89k9o9J65p5l97L15K18M1j38R7m35L56p8K7L2p6K47l92N69
7220D13m91K30p7j88J24o5PJ69k8l11J3Q3K02k80M0j2K99m58K97J44o3j18K37
7243A67k60M7k12j2M97k09J67j41J05K01l90j47J37J31K84k29m9J2Mj64m4K13
7265A08O4j33j09O0K65l14O9O2r7j2p9J12l7M4o5J3K05J33k89kj93M08k00J75
7289A88q9j78K22j23l1j35L95l32J17k00p3L25j13K03q2j0m3K09k76%K24k42J46
$$ plain form
7126 182 -312 30 -22 -37 315 -52 -376 -25 87 52 -2 -150 -191 -118 101 -257 -35 110 209 129 102 369 70
7149 70 -122 58 64 -113 -129 137 10 125 109 -55 -25 80 -238 156 6 -13 -268 204 86 -31 -40 116 -18
7172 -18 50 33 233 30 253 -56 14 85 196 192 -120 -62 22 294 190 212 -242 201 67 71 70 123 -269 72 134
7197 134 -344 -214 324 35 6 -63 102 27 -370 -55 163 204 66 163 -272 84 6 33 65 -11 236 -156 413
7220 413 -78 152 75 -113 11 -54 -47 122 94 -217 -204 -121 81 -199 -159 -171 128 -330 -33 111 48 -70 167
7243 167 -93 -46 -258 -270 227 18 185 44 149 350 -40 -187 -50 81 365 136 87 99 103 -61 -105 108
7265 108 172 39 -70 -10 255 -59 10 72 -25 -37 -116 -4 -41 3 -62 -49 156 289 0 -2 -195 213 13 188
7289 188 99 -79 143 20 -11 -146 249 -83 34 -166 -239 86 -27 176 94 84 41 250 -26 -26 198 -44 102
7312A02l19K72o1j47M2N8K14j60R2q3r2Q5J42k20j1J46M8l17R6J62p5j15L52J18
7336C29k52l55J94J82J2O0M6l27K07o7j7m5J72J40l06J94n6J65j66k03M3J32N9
7359A41J06k89J00j5j48R1k07J20k0J40J7l30M37k71J65j92L17l2J5k21o3R7l7
7382g9j98M35N1k37J13k12J72k6p6n5L67j79l29M06lk27J69Qk6Pm3p0J84k24j
7407g3j83M65r7j37N93m64k82J28m2PK89j22l1l1j49M36j87o2l2q8J28J31o8k60
7431a31L69k97O9k0J64j41mL27k96j60O9Q5Lp9M7Mj47R4N7Q7j32n3J6j26NJ52
7457c8J91K1k52R8j00K10l10J93M4J7mJ06k76P5J66j87J89m1l53K30J70j06R9
7480A42k76Q7J12l32P1L93j25j19J14J35m74K32L32n00L59J34r3j73R5n8k04k48
$$ plain form
7312 102 -217 55 -6 -153 -111 -53 161 1 93 10 -82 3 145 -75 -86 60 108 -209 -113 49 -26 -141 211 329
7336 329 77 -278 -84 98 110 170 216 -111 96 29 12 -33 139 279 -27 167 111 276 110 -93 -50 82 141
7359 141 247 -42 58 43 -105 -14 -221 -101 -121 19 36 -294 143 -128 37 -155 162 130 145 -76 -139 -42 -79
7382 -79 -277 158 209 -28 85 -127 45 19 -57 -112 255 76 -253 153 150 -77 92 100 74 81 38 -32 152 -72 -73
7407 -73 -256 209 112 -25 568 104 -178 -50 -92 -85 204 82 51 20 -129 307 120 58 26 -62 66 197 129 -131
7431 -131 238 -59 10 -10 154 13 9 336 40 -120 -51 34 37 -42 5 9 -138 -44 13 100 -32 -85 -69 -195 -190 -38
7457 -38 153 174 -78 20 -80 130 -180 13 57 74 70 176 -100 -25 141 -46 143 102 -251 -21 149 43 142
7480 142 -134 -47 65 -267 -196 197 72 -47 67 202 -272 -40 292 -208 151 285 192 19 114 56 -148 -396
7502c96M52Q4M1r6j0q8J32j63Q2J63n38N95k75J57p7k36J76J63j80j71O9K89P9
7525B52l47K13l48J87l9r9L91j33r8J57k12j56L40j41L57j15%p2j58j16K44k89
7547a82j04K31J07M3Oj12n6q6O1Q8J5J20K3n19L67P5J27k67J09q7J27p7j3K47
7571B43j80r2j94L90j96j51K42j89m3J10K86k32N9K2m5K03l37J19J93k48j76J07
7593a09L19l14M4M02m3m36L10J24l03j70J00J09P9J02j90j39L21j78q6K46Pj75
7615B0j33K53k53J42k07K57l15J79K19j90m9J30k61L34l76L47k96L94l02J77n8
7636A2j80Q6J87O7j25m8p0K35l25J27J87q0J14o8l95K97N5j68j34K22J8K5j82
7659a43K51l76P4L17L7j76K35k49j18K48o0k35J68K50q1Oq6K8R6k57lP4j15N3
$$ plain form
7502 -396 56 140 181 85 75 -13 119 -44 38 201 -337 258 -17 140 63 -173 3 166 -14 -185 -116 173 252
7525 252 -95 118 -230 -43 -82 -181 210 77 -21 136 -76 -232 108 -33 324 209 209 137 -21 -137 107 -182
7547 -182 -286 -55 52 95 101 -11 -67 -153 -92 -4 11 131 154 -365 2 77 204 -63 46 -41 86 9 -4 243
7571 243 63 -29 -223 167 -29 -180 62 -127 -170 -60 226 -6 53 75 30 233 -104 15 208 -40 -216 -109
7593 -109 210 -104 -60 342 299 -137 173 297 -6 -176 -76 33 112 214 24 -115 206 28 -58 188 195 20
7615 20 -113 140 -113 29 -178 79 -236 -57 162 -28 -77 53 -208 126 -250 97 -199 195 -107 70 12
7636 12 -168 -82 105 172 47 -1 -71 164 -161 -34 153 73 187 119 -276 21 76 -92 -226 -4 14 39 -143
7659 -143 108 -268 -194 123 160 -16 219 -30 -148 100 40 -195 -27 223 142 148 62 90 186 -71 -74 0 -115 -62
7683f2K7K16l23K96k25q0K27l18L16j7j04J4L27j29k84K41j23P7j28l4j2k86M58
7706G4k82Q2j27L63n7L65j84j75J27j72L1J50l03J36Q2k2j35J31K63m63K25k7
7728H2k9j80L69j27j31j81m7K12O6Lj47J02J8k7K13j35P9j31j8J14k86J71k20
7751b30L69m63N53j98j25j14l3L89j97J84p6k74M69m17k9L39J11j92k58Q6l6L15
7773A73k83Q3L5k72L59m67N71j60O1N2k48p2L95k47j30pp7j3M42k55J38K8Rn1
7797F4k24l7qK04j85M69l80r9J25K5M8O4M7j48N2o8j70K24j3K28k47k66o9J90
7821a74L1K02N1j38N5j80J25o5L31k92R3mj55P1L27l43P7R4l0j54L09j19k37p0
7845a95L75j45rj50j27J55j96L26J85N2l55K33k26N6j12M65m02j54L66J57m36
$$ plain form
7683 -62 -35 181 -142 154 -71 -151 76 -242 74 57 -47 -33 294 165 -119 122 -1 76 -52 -86 -98 -384 74
7706 74 -208 -126 -253 110 53 418 234 59 186 14 45 195 -108 28 110 88 -47 84 347 -116 109 82
7728 82 53 -127 242 115 -16 -197 -244 -32 34 37 -110 -8 10 -17 196 61 140 9 -9 105 -181 -10 -230
7751 -230 139 -324 229 31 -94 -208 -241 148 -49 135 59 -215 254 -163 -192 147 258 66 -192 -106 -142 173
7773 173 -110 -27 8 -264 95 -372 199 39 100 152 -96 -168 227 -20 -150 -157 -234 -247 195 -60 78 106 115 64
7797 64 -160 -197 -205 -1 -186 283 -97 -196 -71 -46 2 66 113 -35 17 -51 -221 3 -10 218 -29 -295 -364 -174
7821 -174 -143 59 110 -28 27 -153 -28 -93 238 -54 39 35 -120 -49 278 -65 12 106 76 -78 231 112 -125 -195
7845 -195 180 35 26 -124 -251 -96 -292 34 219 271 -84 149 -77 -21 -133 332 -70 -224 142 299 -137
7866a37m6J19K82r9j73J22r3J67r5k68L28l17K46q0L48m3l36R1P9K63m90K74l39
7889a97J59P7j43J57Q0L6l76J47j6K33l42L53k29M02k43j76J21J1j47k8k5K6J85
7912F5m7j4J50m12K97j39J55j74l6J02J61Q8k48R6k11K74n5K00l0J15m23Q1k8
7935c3j80K60K6q7P8k43N3K58k08l3J34J62j57Q3M5L0l05K38j33q9k89K19J39
7958c2%k3R6j47K75J82k01k90j01K60J23k79K46J72q7l54K8k89N62q6k38M66j41
7981A42M3l50M23j75j36K19N3j46J1j09k56L76j35L7N2k90J15P5j11L76k78m9
8003a13k92L32J20kK09n0r1P1j28l86K91qJ62J37p1k89R2O2P1l41nK70j31L7P0
8028A7q8k5J00J43r6j36J1J41j16p8K40p5m51K70k57J86K43K19k89J95l19K50
$$ plain form
7866 -137 -183 -64 218 119 -54 68 -25 142 47 -221 107 -210 36 -44 304 261 -75 16 95 358 -132 142 -197
7889 -197 -38 39 -104 53 133 169 -207 -60 -76 157 -185 168 -61 341 98 -78 43 54 -93 -121 -146 -120 65
7912 65 18 4 154 -258 39 -100 55 -119 -155 -53 108 196 -52 44 -167 107 52 252 222 337 -86 -5 -33
7935 -33 -213 47 73 -14 64 -179 -126 132 -76 -109 25 187 30 113 158 188 -117 121 -12 -101 -390 -171 -32
7958 -32 -32 -55 41 -106 169 351 150 -140 -241 19 142 -137 109 281 194 -160 -132 -421 141 55 -183 283 142
7981 142 185 -165 258 83 -53 166 219 73 84 -25 -281 95 -40 -3 49 -241 -126 -51 -162 214 -64 -113
8003 -113 -405 -73 47 45 254 204 113 184 56 -330 -39 -47 115 252 181 -108 -16 46 117 -224 -229 41 -90 -53 17
8028 17 -71 -96 4 147 51 -85 -74 67 -49 -127 113 38 -413 -143 -400 -214 29 248 -41 154 -165 85
8050H5j22j86L63J60l09j46J81j16Q4r3J27J10n39M47j74K38Pk76K33k30Q9J23
8072E6r4J07k21l02L18K54j06j98L61Q9j78k88M16m37j0q2M54l00J9OJ43K07j08
8095A06l82N23l26Q0J9m9L0K46k11j10K19K08l26j44n5K80l66K14n7m1J87j00
8117e5J58R0l51L76j95Nj1J35j44J0jj99O9Q0J2j5r1j39L39J12k62J88P6m8l12
8142a73K26m7k8n2L0q2J74q2K48k00j7J18j40l5K71k03k30J13J48J95k37J05j55
8165e3K32j03j33J48k26J44J26k18k20M99m54K91j19K15O0r0o5M4l27M92j61j01
8187a9J48j7p0j06
$$ plain form
8050 85 -37 -223 140 300 -9 -155 26 -90 -6 -99 28 138 -401 46 -128 110 117 -159 74 -156 -67 56
8072 56 -38 69 -152 -454 -136 118 12 -186 175 264 86 -202 214 -223 -233 -315 139 -161 -142 -136 7 214 106
8095 106 -276 247 -79 1 20 -29 1 247 36 -74 145 353 27 -117 -172 108 -258 -44 -101 -142 45 -55
8117 -55 103 193 -158 218 23 28 17 152 8 18 17 -182 -113 -33 -21 -36 -127 -266 73 185 -77 111 187 139 -173
8142 -173 53 6 -22 -74 -44 -126 48 -34 214 14 -3 115 -25 -60 211 8 -222 -109 39 234 -3 102 -53
8165 -53 179 76 -57 91 -135 9 135 -83 -303 196 -258 33 -86 129 189 99 34 78 -249 243 82 -19
8187 -19 129 112 42 -64
8191f4
$$ Imaginary data points
##PAGE= N=2
##DATA TABLE= (X++(I..I)), XYDATA
0@%%%%%%%%%%%%%kJ0j6J6j6J9k7L2m0M8n5O5p4Q8j03J19j38J56j76K02k30K60
35A38k92L27l68M13m61N13n69O31o99P74q56R46j045J151j267J396j539J697j872
54i82K067k287K536k820L149l532L989m546N239o132P328r026J1649j6288K6983
69A7327j03066k2503J24856K4355M6945J7881k7767q8490n3542k3697l297J6980
81g4018Q0345Q6956L4952k3194k5652m3378p2718o4035o54L2080L6988M6772N7365
94G1809J3651m2434n4203l3648l1828j9349K5848O5759N5074K9469J5001j1119
106H4030n2555o1229k9891j017J0929L0267N0807L8944j366k8746l6555m5467
118d1849m3716r315L1030M2779M0164M1303K4373j5765m3787m2183l0781j6262
$$ plain form
0 0 0 0 0 0 0 0 0 0 0 0 0 0 0 -2 8 -8 8 -8 11 -16 16 -24 24 -31 34 -40 48 -55 64 -74 82 -94 108 -122 138
35 138 -154 173 -195 218 -243 270 -299 332 -367 407 -449 497 -548 603 -664 732 -807 890 -982
54 -982 1085 -1202 1334 -1486 1663 -1869 2120 -2426 2813 -3319 4009 -5017 6632 -9656 17327
69 17327 -85739 -108242 16614 40969 87914 105795 78028 -10462 -64004 -87701 -90998 -74018
81 -74018 6327 93283 128235 105041 79389 36011 -36707 -100742 -101396 -69316 -32328 14444 71809
94 71809 85460 43026 -11177 -44825 -76653 -96002 -70154 -4395 50679 80148 95149 84030
106 84030 31475 -29754 -59645 -60662 -49733 -19466 31341 70285 68919 40173 3618 -41849
118 -41849 -85565 -94880 -63850 -21071 19093 60396 84769 69004 25217 -16966 -47747 -64009
130f4009J0631M0914M8039K9500Q954j0194l6463n3381m1457j2986J0015K8077
142d2360M4729M2956J7014r466k4544l4234l6551j9362J0752L1001L5731L4036
154D9702K0933m548l0256l8094l2513k2838l144K2803L6086K8712J5519J383j8217
167B5528l3503l0631j3247M320J8603L2376L4539J7667l367j6641k6366l1301
179b2023k2084O14J8596K3619K3409J8710J241j9705k8437k4150j7403m294J7025
192c4882L1505K7323J6221O081r046k6124k9541j5996j385R349K0707K8215J9276
205D1703J39j3612k0576k6483k3950n748J3690K1215K1972K1413J0829q796k2363
218I433k0772j5306q478N877K1697K4966J5251N364m009j7798k6641j9852n075
$$ plain form
130 -64009 -53378 -12464 35575 65075 74029 63835 27372 -26009 -67466 -80452 -70437 -42360
142 -42360 2369 45325 62339 52873 28329 -5905 -42456 -61818 -51066 -20065 15666 49702
154 49702 70635 66087 35831 -2263 -34776 -57614 -60758 -37955 -1869 26843 42362 43745 25528
167 25528 -7975 -38606 -51853 -47533 -28930 3446 37985 55652 52285 35644 9278 -22023
179 -22023 -44107 -43493 -24897 -1278 22131 40841 42082 22377 -6060 -30210 -47613 -51907 -34882
192 -34882 -3377 23946 40167 46248 37202 11078 -18463 -34459 -35844 -26495 -5788 22427 41703
205 41703 41842 28230 7654 -18829 -42779 -48527 -34837 -13622 8350 29763 40592 31796 9433
218 9433 -11339 -26645 -35123 -29246 -7549 17417 32668 38032 34023 16225 -10416 -30268 -35343
231c5343M854J2239K1371K0866O876q162j2515j6911j8127r577P644J7310J7538
244H063J5405J1721k029j7474j9341j4199q831j313J2297K0319J4630N509j755
257B3002r620j9124j8174o495M187J0339J6049J8582J1132k768j0474j3960j5151
270a2475j2045N9J1794J4721J2107R855J826j0331j7320j4572q336k471P126J6022
284d040J6472Q733J812n276j2524j5550j0421L53O638J1292J3767J1874J421p966
298A6585j2386j3063j1649l705O422J2310J1454R667M823m227j2372j3062p628
311a6831l019M198J1313J3931R405K331l413r825j3950j0742l020M429P982J1375
325D164J0209M066m275r552j0219r943m725L916R657J1018R451N266j511q591
$$ plain form
231 -35343 -30489 -18250 3121 23987 30863 22701 10186 -6725 -24852 -34429 -26785 -9475 8063
244 8063 23468 35189 33160 15686 -3655 -17854 -26685 -27998 -15701 4618 19248 24757 23002
257 23002 13382 -5742 -23916 -30411 -26224 -15885 164 18746 29878 27110 16636 2676 -12475
270 -12475 -24520 -24461 -12667 2054 14161 24016 25842 15511 -1809 -16381 -24717 -27188 -20062 -4040
284 -4040 12432 21165 22977 17701 5177 -10373 -20794 -20441 -13803 -2511 11256 23130 24551 16585
298 16585 4199 -8864 -20513 -24218 -17796 -5486 5968 15635 20458 16231 3859 -9203 -16831
311 -16831 -19850 -15652 -4339 9592 18997 21328 17915 8090 -5860 -16602 -19622 -15193 -7211 4164
325 4164 14373 18439 14164 4612 -5607 -15550 -20275 -16359 -6702 4316 13767 19033 17522 8931
339H931j1067q832m941O87P036J1312R229L460j608o293j0692j0218m490J967
353a5519N938R253J0434O121j575o410p419q749o255O04O565Q469P865N134O41
368A5097n991j0038q113m536j344L945R271R697M141K21l063p765r310n615Q98
383a2505M692O492Q666O864O79n555p215p543o520k260M435P732O854N149K371
398A2336k660q069p695m921j183J742O734R161N671J298k046n069q172o818j695
413a1386K928M317O302O858K607k486o480n460n380l904J718N886O686N078K917
428A0201K76m963p349m856k077J73L525P053O002J911j261l513o004o738l103
443a0723J681L827M939N784M308p37m479n115m767l690k06M214O390M440K967
$$ plain form
339 8931 -2136 -10968 -15909 -15222 -8186 3126 12355 15815 14207 7914 -2778 -12996 -17486 -15519
353 -15519 -9581 -328 10106 16227 14652 8242 823 -7926 -14181 -13577 -7012 1457 9322 14456 15097
368 15097 9106 -932 -9045 -13581 -14925 -10980 -1709 7988 12129 12350 9287 1522 -7788 -13403 -12505
383 -12505 -7813 -1321 7345 14209 14888 9333 2118 -5425 -11945 -14205 -9770 -2038 4816 9965 12336
398 12336 9676 1607 -6088 -11009 -12192 -10450 -3716 5445 11116 12414 10368 5299 -2873 -9691 -11386
413 -11386 -8458 -4141 2161 9019 11626 9140 2660 -2800 -8180 -12084 -10366 -4480 2206 7284 10201
428 10201 10477 5514 -1835 -6691 -8768 -8595 -5070 1983 7985 9896 8635 5122 -882 -7620 -10723
443 -10723 -9042 -5215 -276 5508 9816 9079 4600 -515 -5282 -8972 -9178 -4964 1426 5866 8833
458H833P24l313o387n335k799o94K470M953O532L195l07k444m076o024m101K09
474h564K961M664M907M416R90k964m658m249l965j924K023M792M412K838J858
489G537j347m257n274l034j181J201L255N215M071J019j367k919m096m215j346
504f738J491L088L516L806K478j981l505l964k970k391N36L779M254L010J961
519F370k26k758m633l491q63K42K437L732M119J394j088j777l700m260k250R18
535e834K488L065L804K407J23l252l173k807k134q01K427M269K848J981L85j694
551D102l642l935j412j67J215L063L561K270m78j443k118l423k392l83J766K672
567g44K728K681J077k139k872k512j894j088P87K854L326J677M57o30k410l449
$$ plain form
458 8833 9557 6244 -143 -5478 -8277 -8971 -6501 -1548 4984 8179 7872 5428 1352 -4672 -8773 -8564
474 -8564 -5603 -939 3968 8384 9374 6410 1752 -2497 -6462 -8386 -6363 -1571 2841 5679 7537
489 7537 6190 1933 -3341 -6375 -7556 -6355 -3100 2115 6186 7205 5838 2919 -1177 -5392 -6738
504 -6738 -5247 -2159 1357 5163 7641 5660 2155 -1809 -4779 -7170 -6634 -2855 1399 4409 6370
519 6370 6144 3386 -1247 -4738 -5601 -5359 -2922 810 4929 6323 5235 3458 -242 -4502 -6752 -5834
535 -5834 -3346 -281 3523 5930 6053 2801 -372 -3179 -5313 -6114 -3687 582 3430 5411 5796 4102
551 4102 460 -3475 -4887 -5054 -3839 -776 2785 5055 4577 3134 1016 -2407 -4799 -5182 -3416 -744
567 -744 1984 4665 5742 3603 731 -1781 -3675 -4763 -3976 -1122 2204 3881 4338 3708 1298 -2151
583b151j725m08P99J883K852K703M07j176j667k165k936j021J240K446K277J810
599C168J275q30k454k727j736o85J71K021L054K071M64l49j461k813k222p63P58
616c058J339K021K396J595q89j552j994k034j574K21J662K085J735J410M36j963
632A836k410j655r55k29J291K297K269Q67k41p40k117k153j378L28J242J682J816
649A750J509k81j105j602j790j254n23J373J586J819J109O70q33k110j822q23
665b327l67M72K062J633J255J89q94j336k231j383P1O33J459J648J558M06q43
682B005j290j431j717n30R90J488J385J243P95n36j439j974j271m16J52J413J936
699H03J101K59N0j235j872j253m11L97J234J130J741P78o67r97j265j177r91L78
$$ plain form
583 -2151 -3876 -4284 -3485 -1602 1250 3953 4360 3184 1517 -648 -3584 -4605 -3365 -919 1358 3168
599 3168 4443 3613 1159 -1568 -3304 -3989 -3818 -1797 1257 3328 3792 3443 1982 -831 -3053 -3816 -3058
616 -3058 -1719 302 2698 4293 3404 1852 -142 -2176 -3750 -3529 -1867 218 1953 3363 3799 1836
632 1836 -574 -2229 -3184 -3413 -2122 175 2444 3311 3070 2330 213 -1940 -3318 -2990 -1748 -66 1750
649 1750 3259 2978 1873 271 -1519 -2773 -3296 -1923 -337 1482 2591 3261 2428 318 -1504 -2327
665 -2327 -2694 -2222 -160 1473 2728 2917 2023 687 -1544 -2927 -2856 -2223 -764 884 2442 2848 2005
682 2005 715 -716 -2433 -2963 -1973 -485 900 2143 2938 2402 963 -1011 -2282 -2698 -2546 -1133 803
699 803 1904 2163 2213 978 -894 -2147 -2558 -2161 -927 203 1944 2722 2055 1058 -207 -1384 -2375 -1997
717a997J049J482R05P21K4j202j623j006l85k08O06J643J632N91j88q93j126j370
735a345p86N53K99J078J450R91k09r13r33j554m86m18J076J211J279M33J68k91
753A603j442j210o78j54M62J339J283P53j41l38j053j487n83l23O48R29J158Q65
771A631J68n71q78j066r29r5L67J306R75M78O29l00j006j316q12k4K49P83J094
790F83O35L81m68q32r03r07o15Q19P98J059M44O71k02r98j209o28l60K64R09R25
810D66N16M80j54k93j396r60j65K77P03O03J400k70P1o08j097r24p5K9O75Q26
830A04R09N00k56n35q76p11n80l13J032Q50N54P13m08k17j041m18m8m39N14P88
850A22P80L44n2l14p78r14l75l15R16N61N20Q38m60j26q54m84p36J08J79J206
$$ plain form
717 -1997 -948 534 1439 2160 2184 982 -641 -1647 -2032 -2240 -1634 9 1641 2232 2044 1151 25 -1345
735 -1345 -2131 -1578 -1279 -201 1249 2240 2031 1118 185 -1369 -1855 -2273 -1197 14 1293 1726 1894 1603
753 1603 161 -1049 -1727 -1881 -1419 -80 1203 1956 1815 1477 424 -1063 -1646 -1969 -1321 -392 766 1631
771 1631 1799 1228 350 -716 -1645 -1740 -1373 -67 908 1386 2015 1715 709 -607 -1419 -1443 -1194 -411 683
790 683 1318 1699 1231 399 -504 -1411 -2026 -1207 -409 650 1094 1765 1563 565 -644 -1272 -1632 -1368 -459 466
810 466 982 1462 1308 1015 -381 -1341 -1506 -1229 -526 77 1477 1207 1278 670 -427 -1351 -1426 -1397 -722 104
830 104 1013 1513 1257 722 -154 -865 -1445 -1758 -726 124 678 1391 983 766 -275 -693 -741 -1180 -666 122
850 122 902 1246 1194 880 102 -812 -1187 -1502 -586 -25 495 1333 873 747 -107 -591 -1327 -1219 -1040 166
870A66L78L88K97n75k94j015l57J01K00O97K19J059m99k30k61q81k22k66K76O70
890a49N92J90N03l74o12o06l50k12L68P38M52K65j8J46o22o77p52J98M58J50M25
911A13O30K33m51m56j04l20m42N1P50K41P4O19M0q02o98N6k48k52P20N19M42Q5
933H00k51m5q77m50J75KL03O12L04L54j14o10l02j025L22K33P6M54N86K12k67
954D92l70k57n61J03Q6J24L62O07J07K4m01j46p09j21j29N45K2M39Q18k85m95
975B55m6l70l62r2K66L89J52J47L74m32k09l0n70O0j23P23M36n0J45j83m93k95
997c08l82o7J85N09L85N18o4k37n83l27m14L08J56M32K51J32M7J13o91l90o0k2
1019e09Q8M31K14L74k30j28K14o95l38k27K61O56P8K84L18o42j91r0k50k25LM23
$$ plain form
870 166 544 932 1229 654 360 -655 -1012 -911 -711 -14 205 1264 765 535 274 -607 -829 -1095 -819 -149
890 -149 443 633 1136 762 150 -456 -806 -1018 -650 88 540 805 787 933 311 -366 -1118 -920 -462 -312 113
911 113 743 976 525 69 -35 -355 -797 -746 4 245 319 938 978 176 -522 -466 -714 -966 -246 273 715 800
933 800 549 504 -373 -823 -648 -646 -343 269 573 927 813 203 -99 -1124 -802 -569 -493 -39 547 759 492
954 492 122 -135 -696 -593 -507 -383 -21 586 693 717 316 170 -539 -660 -789 -244 -222 217 1035 750 255
975 255 209 -161 -523 -615 -349 40 192 339 713 281 72 42 -528 -468 -591 132 568 518 663 480 -13 -308
997 -308 -690 -757 -572 -63 322 840 776 539 -44 -371 -785 -477 -321 111 362 494 541 654 -37 -427 -487 -509
1019 -509 -421 10 224 598 368 240 454 -241 -579 -806 -545 111 189 473 791 149 -42 -132 -382 -607 -604 -181
1041a81L08M09K11l38j65p53j34K72NK00K19L16J02r0k94m09m20K43K32J49M00
1062B82J15p6KK5k46l75p7r8K15L96K09j48K44o11J91l73k7J85j15J53N37j7p0
1085C21Mk49l49j90l67O89O3J20N65k47j40k25k18m68M17q0J64L40K09rj63k64
1107g7k00j01J65K69o4K70O7jk70R3l72N2j58K76J54K51J9k34K43o52L06k52m42
1130f58O06J92J49k77N58n35J65n69k01M55k54K77M66j12m0K8P0o59J1K3m6M10
1152E9L07J97l49O9k47Q0l52j88K71k4M05J02k0J45j71n19j99J42K30J89n0M32
1174E09K13m59n60K03j29k23K14L43K71J54J19l47l24l65O8j16K46P1J08M55j49
1195C02K3j13k80k90J86P5K68k5k0L20k55j26j2l19P0l62P72l7j80K94P8l80r8
$$ plain form
1041 -181 127 536 747 409 244 -509 -643 -371 -366 -166 53 369 471 381 87 -322 -742 -499 -267 -118 282
1062 282 397 321 323 348 102 -273 -350 -448 -233 163 372 224 468 -143 48 -325 -352 -167 -282 -129 408 391 321
1085 321 325 76 -273 -463 -830 -141 -78 42 607 360 220 -5 -223 -691 -274 -354 -190 150 359 350 187 -77
1107 -77 -277 -378 -213 56 -8 262 329 328 58 151 -221 -169 -327 -51 103 354 373 139 382 -270 36 -216 -658
1130 -658 -52 140 289 12 570 35 200 -369 -570 -115 -369 -92 374 262 222 250 320 -339 -328 -305 -351 59
1152 59 366 563 214 283 36 116 -236 -424 -153 -177 228 330 310 455 284 -235 -434 -292 -62 127 77 509
1174 509 722 263 -297 -94 -223 -446 -232 111 382 536 655 308 -16 -381 -313 -429 -183 -112 -4 451 302
1195 302 325 212 -68 -358 -172 -97 171 146 126 446 191 65 53 -266 -196 -558 214 177 -3 291 369 -11 -109
1218a09j05J76l73J80J43M42r8m21L50l59Nq3k76L91J14K46J26l04p9K6j79k15
1240d02N9r4Q09k23p8M12m70j65j21J74m36N01j13M17K30m12K26m45p1k57K47
1261b12l33Q00K64k75N2j31j07N3n64K51K0M70j7r1K04j31k20k76J57j52k3J85
1283g6L30K71r5l11Q2l74R5k02J12L59j90K89l9J25k38l04j6p0K08J14K02J51
1305D23o9l18rm67K12R1NL5o8K54M4OJ6k36l45P1L62k5j19L26M4QKl18k20j9j2
1332c26M68J37k56J56K13m46r0o2J37m8j0J12L77k11O3k39N1j86j61p1L17n4K18
1355H9N4J36k00o1n23M21l73M57O9q5M05l00J47l23k42j4L29k35K49K1K57pL8
1378C09j87p1k79ML27j15Q5K11KJ01m71k96J97k7N9K33q6L10r6k34K23k43n26
$$ plain form
1218 -109 -214 -38 -411 -231 -88 354 256 -165 185 -174 -169 -252 -528 -137 -23 223 349 45 -34 -8 -187 -402
1240 -402 -343 -437 372 149 71 483 13 -152 -273 -99 -535 -34 -147 270 500 88 314 -131 -202 -459 -212
1261 -212 -545 255 519 244 296 165 58 111 -453 -202 -182 288 271 180 384 253 33 -243 -86 -238 -261 -76
1283 -76 254 525 430 119 201 -173 -78 -280 -168 191 1 290 251 376 138 -166 -182 -252 -44 70 272 423
1305 423 354 36 27 -440 -228 -137 -132 -97 -165 89 133 139 155 -81 -426 -355 7 -18 -137 189 233 241 243 -75 -295 -314 -326
1332 -326 142 279 23 179 392 -54 -144 -206 -69 -117 -127 -15 362 151 214 -25 26 -160 -321 -392 -75 -129 89
1355 89 143 279 79 18 -505 -84 -457 0 69 -16 389 89 236 -87 -329 -343 -14 -249 0 21 278 271 309
1378 309 122 51 -228 -224 103 -12 73 284 286 387 -84 -380 -183 -210 -151 82 -4 306 210 -24 199 -44 -570
1401e70M72j91K48O0K84j68j19j9K3k58K41l45M10J75K55l39N4j43Lj00j99J1
1423b15J88J34K68k40n1M2r4j32j04j2L98K7N6M8K1k01n1k03k00K68o0j4K10M08
1447D91R4o39o3j08J1J80J01N6j13K14P0j84l53K0K6P9J72mn4j78M04k63k10J58
1471i3k42K56j11l0O06m1j76k87j59L53j9n22L31K17K87j14J45l43j86n8KJ57
1493b7m3J32K97k29L50n95J00l5j28j96M25k23J31J55jL5l20Q9Q4o8m6kJ28P8
1517I1p9K11k30m01L97j60J46j85J70L55J56l62k24J37R3m41J4K51k4L19j61j03
1539c0J12k82N1M22m83nM76j67j7J19j1k76j1J36j24P8J38j12K92k02k3O1j79
1562c7M6O7l18Q2N7O8L77k8k96j20j81J82j43l0K61K86l60R2k43j29N0N4M39k22
$$ plain form
1401 -570 -98 -289 -41 19 303 135 16 -3 20 -238 3 -342 68 243 498 159 213 70 73 -27 -226 -215
1423 -215 -27 107 375 135 84 126 32 -100 -204 -216 182 209 265 313 334 133 82 -121 -321 -53 -113 -127 83 491
1447 491 585 -54 -117 -225 -214 -34 67 123 10 224 294 110 -243 -223 -197 -118 54 50 -4 -182 222 -41 -251 -93
1471 -93 -335 -79 -190 -220 386 345 169 -118 -277 76 57 -465 -134 83 370 256 401 58 -128 -186 -184 -27
1493 -27 -70 62 359 130 480 -115 -15 -50 -178 -374 51 -172 -41 114 113 148 -172 -83 1 -67 -113 -115 13 91
1517 91 12 223 -7 -408 -11 -171 -25 -210 -40 315 471 109 -115 22 115 -326 -312 -61 -85 234 73 -30
1539 -30 82 -200 -149 273 -210 -215 261 94 77 196 185 -91 -102 34 -90 -12 126 14 306 104 81 142 -37
1562 -37 9 76 -242 -160 -103 -35 342 314 18 -102 -283 -101 -244 -274 -13 273 -87 5 -238 -367 -317 -263 176 -46
1586d6P1NJ95J03n57M99m30J0O7L18m0p0l8j64o3j98J95j60K85l11N37j30J23
1609B01k09L8k99M38n29K88K1N8J79J19m3j32r2J47l83j00K44J67M9l17M07k77
1631b5r7q0m2K39J9J19J8m4J2k64j44J48J48j83J68M1r1K18K47j24k88k2m7k30
1655c04L46Mr0L03j47l01J80k0j73nk1K52J16O7Qk86K32n5m38Q1K04m1J38j31
1679h1l3O6m2J75L1l30J25k16Q1M84j42K00m31L33j95l03O4K31l74M10r6j03J3
1702a33J68k51J89k25L28J86k15j24P6L68k44m35J59J09J97k81J22o1Q5j40j87
1723c09J10k5kP0K34J64l63k4OR9L6n3K50O1q7o3j63n8K03j40Jj17j06K06J83
1748A13J21k43OK25k99J31m7L4J73j62J41k33L9R3l60O8L63r1j45J99p6J81q0
$$ plain form
1586 -46 25 30 225 328 -229 270 -160 -150 -83 235 195 125 87 -77 -140 -338 -143 -303 -18 -329 208 78 201
1609 201 -8 30 -269 169 -360 -72 -51 7 186 305 262 130 38 185 -198 -298 -54 113 162 -155 252 -25
1631 -25 -122 -202 -244 -5 14 133 151 107 119 -145 -289 -141 7 -176 -8 33 -58 160 407 283 -5 -27 -74 -304
1655 -304 42 46 -44 259 112 -189 -9 -29 -202 -207 -228 24 140 207 215 -71 161 106 -332 -251 -47 -88 50 -81
1679 -81 -114 -48 -90 85 116 -214 -89 -305 -224 260 118 318 -113 220 25 -278 -214 17 -357 53 -43 -146 -133
1702 -133 35 -216 -27 -252 76 262 47 -77 -1 367 123 -312 -153 -44 153 -128 -6 -67 18 -122 -309
1723 -309 -199 -224 -226 -156 78 242 -121 -145 -139 -40 -4 -57 193 254 167 104 -59 -117 86 -54 -53 -170 -276 -70 113
1748 113 234 -9 -3 222 -77 54 7 41 214 52 193 -40 -1 92 -268 -200 163 72 -73 126 50 231 151
1771A51J07k76J64n25J65j15L66l1J39Om14n1M77k5m46J47K85k30L10l02K10k18
1793a06j05l1L61J61k66K25j50k86M0K47j67Lp4K28j74N0N9J82k5j44q0O1k06
1816a97L40j1n4Q4l03L63j88o7pK1K42j82O3j70J96k29kLm2m6K53k35J85J14L16
1841D47j36m07K35j10j10J42r9om1L00r4J13k32K2o6n1K28M8J45p7k44K39m01
1864a55J95P6j04Q1K4m4k56K13J87l64O0L4K5O2J18M4k41K23l20L6K6J78k3j48
1888g3J82k65K35n3q4j41L32j19j9J39j80j3K26j04j15k08J97j46R8l8j11L85
1910A25k14K60k18Q5R9k20k15J25L65p3N1j60KL7m18L76K9k02Q9j80M38l8j36
1933GJ74q6l27K18O2Pj9j12j12L02j03J43j59J57l72K64Pj35K85k17j12J98l34
$$ plain form
1771 151 258 -18 146 -379 -214 -329 37 6 145 151 -263 -314 163 138 -308 -161 124 -106 204 -98 112 -106
1793 -106 -211 -242 119 280 14 239 89 -197 -157 90 -77 -74 -148 80 -94 -44 15 197 172 28 -52 9 -197
1816 -197 143 132 78 162 -141 222 34 -33 -40 -19 223 41 104 -66 130 -99 -101 -98 -140 -186 67 -168 17 131 447
1841 447 311 -96 139 29 -81 61 -38 -44 -85 215 121 234 2 24 -42 -93 135 183 328 251 7 246 -155
1864 -155 40 116 12 93 117 73 -183 30 217 -147 -87 -53 -28 34 152 196 -45 178 -142 -106 -80 98 75 -73
1888 -73 109 -156 79 26 -58 -199 133 14 -5 134 -46 -59 167 63 -52 -260 -63 -209 -111 -149 -260 125
1910 125 -89 171 -47 38 137 -83 -298 -173 192 119 170 10 12 49 -369 7 36 -166 -77 -257 181 143 7
1933 7 181 95 -232 -14 48 55 36 -76 -188 114 11 154 -5 152 -220 44 51 -84 201 -16 -128 70 -264
1956b64L22k6q8J09k3K15k67L5m1qj50L33K2K68m96L74k61l06K88l54J63mQ4P1
1980dL94p0l40M1j29j6r0P9M15n2r4R6l84J23j52K58M9k01J20m9J3K19L83n41
2004F8j31j6q0J76J06K93n85M21l58K41p9k53J59J75k43J85o7j07OJ61o2Jk23
2027b12J01L08k36K38k3j75K25k05J62l72K05O5k2rN8r9J85J3k72M7k5J45l4q5
2051a7M7l28J32q8K21j49k4K86k79K15R7K71j84k54k10K39j74r1K78J13k2mj98
2074a23k96O12k51J12P3q3kJ15k28MK76n85N02j55J9j91J60j68M61j3m36Q0k4
2097a41K31q9kK02k36p4M8k7m1K90k44r3L44k33J31N5K5Lk34M0K55k36k6N0k7
2122b9r8J83k4j96R0J71K4j77J59q0j68J4K98K2k30j28M3K7M62j80K13n00R9j44
$$ plain form
1956 -264 58 32 -56 53 30 245 -22 13 -28 -36 -186 147 169 437 -59 315 54 -252 36 -318 -155 -159 -75 -4
1980 -4 390 320 -20 21 -108 -124 -214 -135 280 228 134 230 -154 -31 -183 75 124 -77 43 -6 7 226 609 68
2004 68 -63 -79 -159 17 123 416 -169 252 -106 135 56 -197 -38 137 -106 79 12 -95 -89 72 10 11 -212
2027 -212 -111 197 -39 199 176 1 226 21 183 -189 16 81 59 50 108 9 194 207 -65 -18 -43 102 68 -17
2051 -17 30 -298 -166 -254 -33 -182 -206 80 -199 16 113 384 200 -54 -264 -25 -199 -290 -12 101 79 75 -123
2074 -123 -419 193 -58 54 127 44 42 157 -71 -67 209 -376 126 -29 -10 -201 -41 -209 252 239 -197 -117 -141
2097 -141 90 1 -1 201 -35 -109 -61 -88 -129 161 -83 -176 168 -65 66 121 146 149 -85 -45 210 -26 -52 -2 -29
2122 -29 -127 56 32 -164 -74 97 121 -56 103 23 -145 -131 167 189 -41 -169 -126 -99 363 183 396 -104 -5 -149
2146a49Q2R2J55l09J39J10p4J94l84K02j98J99p6j69nL38p3j14J40n7j7N7r3l4
2170d4L9Q1j1M1k70p4J70L1n0J89L0j28p7l6J75J40j18k75J81j9J24J50j17p8
2194E4R7l60J55K43q5J63l47J57l3j73L1Q2J49n28N62l41L27J36j48J47n23N17
2216B82l17J42j49j95j6K5L54l8j03J30j89M13n61k9K66L84l80J50k04l61P16
2237C20l66M30k83P7l50j3N4K78l08p0M17j25j17M4j7K03mj83O7l76M67j41K47
2260B51r2j37j71K01J10j12q6P7k36J83L68l51K2M2L3j96j11L94k46J26J67k40
2282dK37k57J84j53O2o5j56L37o9M7K09nl83Q0l09qL50M7j12k51j7K53j31N9J90
2307A35k21j20K89m34M26j9k34K98o7p4K43m13L11J57k74o5k02M41k32j0J14j02
$$ plain form
2146 -149 -67 25 180 -129 10 120 46 240 -144 58 -140 59 -17 -186 -191 147 74 -40 100 43 26 83 -10 -44
2170 -44 -5 76 65 106 -164 -238 -68 -37 -87 102 132 4 -73 -109 66 206 88 -187 -6 -25 99 249 132 54
2194 54 151 -209 -54 189 104 267 -80 77 44 -129 -98 -16 133 -395 167 -174 153 289 141 288 -235 282
2216 282 -35 107 -42 -237 -253 -228 126 88 -15 115 -74 339 -222 -251 15 399 19 169 -35 -396 320
2237 320 -46 384 101 178 -172 -185 -131 147 -161 -231 186 61 -56 -12 -29 174 170 -13 54 -322 145 4 251
2260 251 159 22 -149 52 162 50 -36 41 -195 -12 356 5 27 69 102 -94 -205 189 -57 69 236 -4
2282 -4 233 -24 160 7 69 4 -152 185 116 163 372 367 -16 64 -245 -253 97 144 32 -219 -236 17 -114 -55 135
2307 135 -86 -206 83 -351 75 56 -178 120 53 -21 222 -191 120 277 3 -62 -264 177 -55 -65 49 -53
2329e3j88L52o5Ql1Q5r1r1Q1L6j1P6N8k7QK7k45K22j40P1r3k50M05r4J90k84J
2356d3L0l9J02k4k20J01K25J70k13J18k25m3K67l15J09R1k61M05k32Q3J47k03
2378C0j11O03m36M8l95Q4J25J91l73K61j86J5L00R9j75j91J49j89K42k48k5J77
2400eJ01k86K46L9k83K04N3j83N5P1j12L53j64j96k4J91k47O4K66j41M3j75L05
2423A75L8j45j15J85J4j24n2L3J0J19Kk88J32m9j90J37l9J15J36k69P8r2J50N5
2447A6L5j93L14l35J64n3K22o9k61K89k39J67k19j48M28m89N5N33J11j37k23L30
2469B98p30M07K1k78L10o6k17M31r4l68J02R9Q3L79m3m21K88k14j3J03k46M7J21
2492ak6K21p1l52R4M0l2R6n1j63NL96j79J09m5j81L12jj56o9R3J30M2J99m16j12
$$ plain form
2329 -53 -241 111 46 54 23 108 17 -74 7 43 32 108 166 139 147 174 -71 151 11 82 -11 -261 144 50 240 -44 -43
2356 -43 -13 -52 50 26 -194 -93 132 302 89 207 -18 -61 206 -109 0 91 -170 235 3 86 233 30
2378 30 -81 522 86 134 -261 -177 -52 139 -234 27 -159 -144 156 255 80 -111 38 -151 91 -157 -182 -5
2400 -5 96 -190 56 95 -188 16 69 -114 -59 12 -100 253 89 -107 -131 60 -187 -123 143 2 45 -130 175
2423 175 213 68 -47 138 152 28 -24 9 19 138 140 -148 -16 -65 -255 -118 -157 -42 94 -175 -97 -189 -39 16
2447 16 51 -142 172 -163 1 -52 170 101 -160 129 -110 57 -162 -310 118 -371 -316 217 328 191 -32 298
2469 298 -432 -25 -4 -282 28 -38 -255 176 82 -286 -184 -85 -2 377 334 -87 201 -13 -26 77 -169 -122 -1
2492 -1 -27 194 123 -229 -135 -95 -127 -31 -82 -245 -240 156 -23 86 41 -140 172 171 15 -54 39 169 211 410 -6 -118
2518a18K93k27J55j37J21K28j50k56n2J50J49k59J03j48j63L83N2j86j4K8k2k7
2540i7J23Q4K1ok84m6K66J90j22l8k06k8%K27k14mjj61M24k82K02n4k58L67n7
2565D6J37n8l50L2L5P4Q9K5K98q7J09l98Q3k38J0J26o2N7J90L5m53N29k04O9j02
2590hk52J47Q0nO8k77K25k7j80J63J41L4q2r1M5Lkk22J31J78p2J64k96j29K2K25
2616a7nP6j82k11L41J1m9P3J12o64N32J06N0k67q9K88JJ97j9n6j8k76j6k25K73
2641c4Pj32J01K6k94K22J53n8j64K2J4N1M81k06k73L16j74k03L05o9k46K67m0
2664G2q9j07K93r7j73L13k49J39j50P2O5j56L21m35J10j03J73k30J59Q5J8J10
2686A41j50J81l76r0L27k0l0M5L69l56l6n7J10k04K66P1l3k21j43N15j99k65K60
$$ plain form
2518 -118 175 -52 103 -34 87 315 165 -91 -143 7 156 -103 0 -148 -311 72 124 -62 -76 -48 -70 -97
2540 -97 26 110 131 125 -159 -205 61 251 129 91 -115 -143 -143 84 -130 -134 -135 -296 128 -154 48 -6 -264 103 46
2565 46 183 125 -225 -193 -158 -84 5 30 328 241 350 -48 35 -203 -193 -67 -129 -72 118 153 -300 229 25 94 -8
2590 -8 -260 -113 -33 -38 30 -247 -22 -49 -229 -66 75 109 27 -64 -19 -16 -18 -240 -109 69 -3 161 -135 -264 -242 -17
2616 -17 -22 54 -128 -339 2 13 -36 37 149 -515 17 123 173 -94 -183 105 106 303 284 228 210 -66 -82 -307 -34
2641 -34 -27 -159 -58 -32 -326 -104 49 -9 -173 -151 -137 -86 395 189 -84 232 58 -145 160 91 -155 112 72
2664 72 -17 -124 169 72 -101 212 -37 102 -48 24 89 -67 254 -181 -71 -174 -1 -231 -72 13 31 141
2686 141 -9 172 -204 -294 33 13 -17 28 397 41 5 -52 58 -146 120 191 158 -63 -206 309 110 -155 105
2709A05l10K88p0r3J18l46J06L37l20J87j39j07L31k62N44m01l4Q8r0R7k57J24
2731a04J9k66L58N6lj94L8J8M25j29m89L55k14J47j92K82l02M53j55N2l3l04K75
2754I3p4q6J34k36J08K62j19k50K41j45L22P7k30n9o7O2j77K44K46m14L28l37
2776g7M6K0J52l08P6p3O6N7M9j11L61l03K1K12J52k69j73L4J29j24N9K62kj42
2800A14n3r1K89k82LK97l54q6J51K11l84K38j90k29J86N5M9n8M93K8k75k5O2o6
2824H3j25l0L29j69j33K18j93n3j4L62l94k17K35l0L38k8rm03J14J06j23J24J26
2847A14r5m3M6K7m0r0K59N8j86j14M74o00J06J26R8Lj34m6k1O2J3k4J61j55kM2
2873C9j48k10L19K02p9m8K20l81O7n1J69j5k31k08N5M40O5k78qJ20k91L49l39
$$ plain form
2709 105 -205 83 13 -80 38 -308 -202 135 -185 2 -137 -244 87 -175 369 -32 -66 22 -68 29 -228 -104
2731 -104 -85 -351 7 63 60 -134 -96 -78 347 218 -271 84 -130 17 -175 107 -195 258 103 155 122 -182 93
2754 93 19 -67 67 -169 -61 201 82 -168 73 -72 250 327 97 38 -29 33 -144 100 346 -68 260 -77
2776 -77 -31 -11 141 -167 -91 -164 -98 -41 8 -103 258 -45 -24 188 340 71 -102 -68 61 -63 -4 258 256 114
2800 114 61 -30 259 -23 -20 277 -77 -163 -12 199 -185 53 -137 -366 -180 -125 -76 -134 359 387 112 87 149 83
2824 83 -42 -72 257 88 -45 173 -20 -73 -87 275 -119 -336 -101 -131 207 179 170 -233 -119 -13 -136 -12 114
2847 114 19 -24 22 49 9 -81 178 236 50 -64 410 -190 -84 42 140 143 9 -37 -58 4 17 -7 154 -1 -3 39
2873 39 -109 -319 0 202 123 75 295 -86 -19 -70 99 84 -147 -355 -300 140 205 -73 -81 39 -252 97 -242
2896b42M84o44K25L2j15L65k4m8k70K97R4j81O7k17J3K45J42o04M87k8j12L4K03
2919B03j84J21J7j73K73j95o5J4j2k89L18K9P1l45K43Mk07K17J12j62J09j79J6
2942f4k52J88ml3N02m76L6J26j16k8j70M26l82L32k04%K94j39R7K3j1j15j18K15
2966A27K03r2l22L51m11O36m82j53k13J47J93K43rl31L65l01J42k47%J44j85J96
2988Aj96J58j20L20J93l39P7R8k54M9j75K69j96J82J89m4m02K46J56k35L05j14
3010A68k98J11K8l8J23J65o8l84M46m35K14J05l33L23k73m1L17k96RK29o1K12
3032B23J4n1q1j26K67l05N5J4k1R0n9lK6N4KJ78r1j58n1K17r9j38Q5R2K29m33
3058g0P2J3o6j40K67K5k39kO0L3K5j86J55J32m6l34K46J77k15P3l50N88M1l98
$$ plain form
2896 -242 242 -402 -177 -145 -260 105 81 33 -237 60 154 -27 40 -177 -164 81 223 -381 106 78 -34 0 203
2919 203 19 140 157 -16 257 62 -3 11 -1 -290 28 57 128 -217 26 30 -177 40 152 -10 99 -80 -64
2942 -64 -316 -128 -132 -165 337 -139 -103 23 -93 -121 -291 135 -247 85 -119 -119 175 36 133 156 145 30 -88 127
2966 127 330 238 -84 267 -144 492 10 -143 -356 -209 -16 227 218 -113 252 -49 93 -154 -154 -10 -195 1
2988 1 -195 -37 -157 163 356 17 94 192 -62 -13 -188 81 -115 67 256 212 -190 56 212 -23 282 168
3010 168 -130 -19 9 -29 94 259 191 -193 253 -182 32 137 -196 127 -146 -187 130 -166 -157 72 11 223
3032 223 237 186 105 -21 246 -59 -4 10 -11 79 20 17 43 97 99 277 186 28 -23 194 95 -43 42 134 363 -70
3058 -70 2 15 -51 -191 76 101 -138 -140 -80 -47 -22 -208 -53 79 33 -301 -55 122 -93 -20 -370 218 259 -139
3082a39K67kk10L12j75l26M02j13k26L74r5j48J77j77j60L83j52l15L46j2L6J11
3104A58o5L4j76j30K73J25j47l2po1r9K14O0j17j29L80m07L16k96N4R6j66Q2N4
3128A4J4j8oo1J79j60J47l81J72J17k22L70j07l4k03J49L00j56k37K49j9j1k95
3151a99J91k3O7o2l7O7j99M59l54M07m07J57Q4j05J18m63M07j85K29k19j66L70
3173A37o1J1k50J78k4N0M1o9q9J45o0k46J39L73j40j74Rn6j61K60J34p2n7m0K71
3198B49l08J08j30nJ30M8J44k84K40p2k73N81l76P4k89P9k28J80J5l6L52j44N3
3221A08j76K14q9M4k3k70K66J35R5l08j87P5P3K51l28J13K8j95L24l82J50L23
3243B41q1l24K5K86k4J19l49P0j70j35N7J81L80k41J49j34k63Q5K34k04K39j20
$$ plain form
3082 -139 128 126 -84 228 53 -273 129 16 -210 164 69 -79 98 -79 -239 144 -8 -323 23 11 47 158
3104 158 93 127 -49 -179 94 219 72 40 33 -28 -127 87 147 30 -99 281 -126 190 -106 -52 44 -122 -40 14
3128 14 28 10 4 -57 122 -38 109 -272 -100 17 -205 165 58 24 -179 -30 270 114 -123 126 107 96 -199
3151 -199 -8 -31 36 -26 -63 4 -195 264 -90 317 -90 67 151 46 164 -299 108 -77 152 -67 -233 137
3173 137 76 87 -163 15 -9 41 82 13 -76 69 9 -237 -98 275 135 -39 -30 -86 -247 13 147 75 18 -22 249
3198 249 -59 49 -81 -86 44 92 236 -48 192 120 -153 428 52 126 -163 -84 -312 -132 -117 -153 199 55 108
3221 108 -68 146 57 101 78 -192 74 209 304 -4 -191 -116 -43 208 -120 -7 21 -174 150 -232 -82 241
3243 241 160 -164 -139 147 123 242 -107 -37 -207 -342 -285 -104 276 35 184 50 -213 -128 106 -98 141 21
3265B1m5J70n4l09J1L75j25J41j78q2m2J79j30J01M1j96K88o9j56m3J64N0p6o9
3289c3k92M26k53J51J28P2m0j49m0L1j24J83m02O90l44J98k60j26L80j5k28P5
3311B8l10L50K6l50K83j29N77m19j34K03m83K93K37l03J11K41j33j46l59L88r7
3332a26K42o1k87K28j48k78L24l4L43j47K26j51k83J17n6OrJ95q5K8k7o0J21j24
3356d6l3j0K43K89n26J04l70N42l20O9J41j66K27l62J94J09J10J1k45J22j51J01
3378C3M4j18K08j94N8N9j87J53j17l7Q1qJ95k80J36k76N46l95M6j05P6K4O4K17
3402B23k82K17lk93k12M82j64J63j6K12p14M93n4J01k42Q3N2M1o2L20j02j48O
3425A01l03K59OJ50l16N12l58m2K7k71n3L23M5p3k6J96l57K75j68q7J03K20p8
$$ plain form
3265 21 -24 146 92 -217 -206 169 44 185 7 -75 -117 62 -68 33 74 -122 166 97 -59 -102 62 112 36 -33
3289 -33 -325 101 -152 -1 127 199 159 10 -30 1 -123 60 -342 348 4 202 -58 -184 196 181 -47 28
3311 28 -282 68 94 -256 27 -102 475 56 -78 125 -358 -65 172 -131 -20 221 88 -58 -417 -29 -126
3332 -126 116 55 -232 -4 -152 -430 -106 -140 203 56 282 131 -152 -35 -91 -85 -94 101 16 44 17 -43 78 -46
3356 -46 -79 -89 154 443 -83 21 -349 193 -127 -58 83 -83 144 -218 -24 85 195 206 -39 83 -68 33
3378 33 77 -41 167 -27 31 90 -97 56 -61 -98 -17 -25 170 -110 26 -250 296 -99 -53 -158 -82 -58 6 223
3402 223 -59 158 155 -138 -350 132 -32 131 115 327 -387 106 52 153 -89 -6 46 87 25 345 243 95 101
3425 101 -202 57 63 213 -103 409 51 9 36 -235 -288 35 80 7 -19 177 -180 95 -73 -160 -57 163 85
3448H5r2K04j42l14K02M08k85j7J13l06K13k13K51N9p9r8k26K87q0N8k0J41j38
3471A1J13q4j02j05L70j52R9J5l13K34L7M2p2k74L34N9l63K29l34L44J5j09K2
3494A6or4q4M75m89L96j61l26K64k6J47j12J72j04k20kJ50j45L16l00J11M3K8
3517D9j28J16K42j92k79K76j83L05k96L04ol34L02p2q2Qq7o5J01N6J05j80R9q3
3541b4O7l64N44l72J34Mn7j19O1K18j41J3j99M41l50J61J00m7l8K9N6k18J08k2
3565a5k11L83k16K02L1k50k00L00J53j39L7K9j11m22N06p0M0P2J1k19J26Mk16
3588a75K27k62M3L18l8o9j27n0J05k57N90l22J08J7NK3j79P0k63L20j25J67j26
3611@L8j1K99k13j24N0J25n6j83j55J76K20k45n6K97j69J7j24R1k64K34K04j79
$$ plain form
3448 85 -7 197 55 -259 -57 351 66 49 162 -144 69 -144 107 166 87 -11 -237 50 -30 28 8 149 11
3471 11 124 40 -62 -167 203 51 150 165 -148 86 123 165 93 -181 153 212 -151 78 -256 88 103 -6 16
3494 16 10 -84 -168 307 -182 214 53 -273 -9 -35 112 0 172 68 -152 -154 -4 -149 167 -133 -22 21 49
3517 49 -79 37 279 87 -192 84 -99 206 -90 214 208 -126 176 104 22 30 -57 -122 -21 35 140 -40 59 -24
3541 -24 43 -321 223 -149 -15 -11 -68 -187 -126 92 -49 -36 -235 206 -144 17 117 70 32 61 117 -101 7 -15
3565 -15 -226 157 -59 143 174 -76 -276 24 177 38 75 104 -7 -429 77 7 47 119 130 -89 37 41 -175
3588 -175 52 -210 -167 151 113 44 -83 -133 -28 -285 305 -17 91 108 113 136 -43 27 -236 84 -41 126 0
3611 0 38 27 326 113 -11 39 164 108 -75 -230 -54 166 -79 -135 162 -7 10 -114 -23 -287 -53 151 -28
3634b8L67k29o4l10r6L24L37l24j28R1P3k6l12o4N34q1j47q1R6r1K73J2j30p5
3658g9J68j80%R3O9K02j68q7p1K23j86j30N1J79k4q3K49j94K92r7j48J15k73O1
3682a8j25J59j06Q1r2L39j43j82J02m1K15L6m79K25J05p9K50m77L42l67J65K44
3704A54p1n3j91K6L15j95k14J56K16j65j89K26K04j41j30n0o3J69j4k15M61k96
3726f0j46oj3N31l47K52k80P7p1k27J81J90n3N8m27M23l03J43r1J29K7lJ81j57
3750HK13l16K85m8l8k74M5k7L3Q0M6P5J73m11R7k14J53K43j7Jq9j15M47l21r0
3775f1P1J19l86J40L92n98L69k36K38l79K36o2N4Q8J11J45k77N9J77k83L26k98
3797e5P4J05j04N6Q5j01j29J93j00J74j54j23N9%J51j76j7J30J08J8l79M7l0O3
$$ plain form
3634 -28 339 110 46 -264 -360 -36 301 -23 -151 -60 13 -13 -325 -389 145 64 -83 -164 -68 -159 114 126 -4 -79
3658 -79 89 -91 -91 2 71 273 105 18 -53 170 -16 -146 -95 84 60 -23 226 32 324 227 79 194 -79 -18
3682 -18 -143 16 -90 -9 -101 238 95 -87 15 -26 189 225 -254 -29 76 -3 247 -230 112 -255 -90 154
3704 154 83 30 -161 -135 180 -15 -229 -73 143 -22 -211 15 219 78 -52 -102 -165 4 -10 -225 236 -60
3726 -60 -206 -212 -225 306 -41 211 -69 8 -63 -290 -109 81 28 86 -341 82 -221 -78 -169 -40 -13 -16 165 8
3750 8 221 -95 190 142 104 -170 -125 -152 -119 -39 7 82 255 -156 -59 -273 -120 123 106 107 18 -97 350 29 -61
3775 -61 10 129 -257 -117 275 -323 46 -190 48 -331 -95 -157 -103 -15 96 241 -36 23 200 -83 243 -55
3797 -55 19 124 20 76 161 60 -69 124 24 198 44 -79 -20 -20 131 -45 -62 68 176 194 -185 -138 -168 -105
3821a05J24j51oKJ56K64N8k05P7l62L8K17l7j65p0J76K1k82M44k25J00k85K40
3844B4N7q6n9K19l96M46%q7k39J45p0L15o1j50j85J88k32L78k84j15J57Qj19k5
3868a71L93j37j18k21R1J90k1M2k27K9J46j7O4k48M13j39j47L24j77L7q1j36K09
3891I8J49k80J00k63K58K42o09L26k1j2l58M65M2j59K50j62J48J55o1j72P0k76
3913g0n8n2O1K04j61J02NJ56l99K19j21j07L52j66J53m4N5M3m6q9j87Q6J00KR0
3938A28j77j98L25j08J37j30k1J26K9N3k3o3K7k9j15k6O5R1Q3k47k7N5J06L5k61
3963a65M68j97n8J03l46J48K52j44K8J55j79m4j51K08k10N7Q2l3J45K22m49N3
3985e5J47j73K45l6P5j45l5k58K21Q1Q8j91j69J32K53pk75J71k03m0J30K64l16
$$ plain form
3821 -105 19 -132 -138 -136 20 284 342 137 214 -148 -110 107 70 -95 -165 11 32 -250 194 -31 69 -216 24
3844 24 81 -5 -64 155 -241 205 205 118 -121 24 -46 269 208 58 -127 61 -171 207 -77 -192 -35 -27 -146 -171
3868 -171 222 85 -33 -254 -163 27 6 48 -179 -150 -4 -21 43 -205 208 69 -78 246 69 106 25 -111 98
3891 98 247 -33 67 -196 62 304 -305 21 0 -12 -370 95 137 -22 228 66 214 369 308 136 206 -70
3913 -70 -128 -180 -119 85 -76 26 31 187 -212 7 -114 -221 131 -35 118 74 129 172 126 37 -150 -64 36 38 128
3938 128 -49 -247 78 -30 107 -23 -44 82 111 164 141 78 105 76 -39 -65 0 91 174 -73 -100 -45 61 96 -165
3963 -165 303 106 48 151 -195 -47 205 61 89 244 65 21 -130 78 -132 -75 7 -26 119 341 -108 -55
3985 -55 92 -81 164 128 203 58 23 -235 -14 67 155 -36 -205 -73 180 173 -102 69 -134 -174 -44 220 -96
4008i6j01kJ8o4N57l38j2j26L27k22K81J5l0M4l93J3k07J05K50j49M72m6l60J42
4032G8j43Q8J42j22K29l53J51k77J07k6p9K9K14J9j26K38m29L92k42K74j70oQ6
4055G4J8j77L0O4J75k99J31Q8m8j36m7O1k49N27l27oJ10Q3m6M7J56j20k49M88
4079C48k60K4j34k3J5K34l62K22m31L87J18j69M7j16K70j43o1N7j03J52J37j75
4101C4n2N0k19J71R1K03j95j48J11j07J45k96J78p5J28k00Q8J05K80j67o8j89
4123a32R3j73K21m8O6P9M1K50o04J44R3j90K08k87J77M3J31j5j64J04k72K08N5
4146B8j05k34K57r4Q0J12k61M36k44J64m43M44m1k40J37N9j32l0M42j95j6K11
4168C35l74J18K8j38o1L79l75j16M62m51J08K49j09o9j51J15n6K13m39L35J01
$$ plain form
4008 -96 -197 -199 -181 -245 312 -26 -38 -164 163 -59 222 237 207 251 -142 -129 -336 -231 19 -130 342 296 -64 78
4032 78 -65 23 165 43 272 -81 70 -207 -100 -126 -205 -176 38 57 -69 169 -260 132 -110 164 -6 -12 74
4055 74 92 -85 -55 9 184 -115 16 104 56 -80 -127 -66 -315 212 -115 -121 -11 72 26 73 229 109 -140 348
4079 348 88 112 -22 -45 -30 204 -158 64 -367 20 138 -31 16 -100 170 27 -34 23 -80 72 209 34
4101 34 -18 32 -187 -16 75 278 83 -65 46 -61 84 -212 -34 -109 19 -181 -93 12 292 125 57 -132
4123 -132 -39 -212 9 -39 27 106 147 397 -207 -63 30 -160 48 -239 -62 -19 112 97 -67 37 -235 -27 28
4146 28 -77 -311 -54 -148 -68 44 -217 219 -25 139 -304 140 99 -141 -4 55 -77 -107 335 140 124 335
4168 335 -39 79 107 -31 -92 287 -88 -204 258 -193 -85 164 55 -14 -165 -50 -106 107 -332 3 104
4189A04j42K32k61K33k05K48o9J62j5k52p7J46j5j57L3j4j17M86k77L25l62n0
4211d4R9j0j04K00J2p2K7l12n7L22J02r4l2k52K51j31K6j07K46k30J47J03k04
4234a14K06J25k08qj28J66q8J3oj04Q7k2J51q2RJ39J73j56j88K8M3k3K72L5k66
4259E4J24m57L11K34n24L60j57l75O72k01m1m4k88O41k44J41j99j70J42j30K30
4280G9k06j15K19r8J71J11o7j11M08l43O2k58M05j48J7k87J5K59j61K29p7j03
4302Ar2j25K37J80J8j4j02R3K0k13j82R4O3j91L91j43M1O1j08L02k92o9M7o1P8
4327C4j03J74k49J18J1J56j20Q1Oj38M5k74L15J25q9p3j83L33kr9K02k92J19j3
4351H4j57K72O2n30J21K04K0j12k28R5J21J37m49M48N7j92j72Q3R8j4L1j39K69
$$ plain form
4189 104 -38 194 -67 166 -39 209 140 302 287 35 -42 104 89 -68 -35 -49 -166 320 43 368 6 -44
4211 -44 55 45 -59 141 153 81 108 -204 -261 61 163 69 37 -215 36 -95 -69 -176 70 -160 -13 90 -114
4234 -114 92 217 9 1 -127 39 -49 -36 -42 -146 -59 -81 70 -12 -3 136 309 153 -35 -7 36 13 285 320 54
4259 54 178 -279 32 266 -258 102 -55 -430 242 41 0 -44 -332 309 65 206 7 -163 -21 -151 79
4280 79 -127 -242 -23 -121 50 161 94 -17 391 48 110 -148 257 109 126 -161 -146 113 -48 181 104 1
4302 1 -91 -216 21 201 219 205 103 196 216 3 -179 -85 -22 -213 178 35 76 137 29 331 39 -30 17 -44 34
4327 34 -69 105 -144 -26 -15 141 21 102 108 -30 15 -259 56 181 92 19 -164 169 167 68 270 -22 97 84
4351 84 -73 199 261 -269 -148 56 76 -36 -264 -169 -48 89 -360 88 145 -47 -219 -136 -38 -52 -21 -160 109
4374A09K0j0o17N71j59L78l52k2J11nj60J01J18k48J3L4J55K63k61k61L82m32
4396b72K15j95L62j74J62j33J73m48O1L48k95K36J6j35O8k63K29mJ41n8m0Q5o1
4419A8P4k09L89k05J32k12K49k91P2r9J27p7K65l45q6J59N8n9J01k66L20MM0k30
4443g1J85R8j34n9k03K64p2j13J4L12k36l38L61K72k61J20J13l73k0J38j43L59
4465B13l16j04J38K46j52l89M03L18l33o3J02l22Q1L06Rj19K3o7k0R6l65K89r
4488c5kN0m5M3j54J26k37L85P8l20K45k12R1j65L38j0j66kM0J92k72J10o2q3r3
4513a60J91k09L31k38R9n0M9P1k21J40q3N3K47l03K71N2l55K52o6n37M36J41K61
4536C72n09K22j46M3J52j59j44p8K60m6K66k63k12k3K49n6k27J95J08J84m32K29
$$ plain form
4374 109 129 119 -498 73 -86 292 -60 -82 29 24 -136 -35 83 -165 -152 -118 37 300 39 -222 160 -272
4396 -272 -57 -252 110 -64 98 -35 138 -310 -249 99 -196 40 56 -79 -11 -274 -45 -49 92 34 -6 79 18
4419 18 92 -117 272 67 199 -13 236 -55 17 -82 45 -32 233 -112 -198 -39 19 -40 61 -205 115 119 159 -71
4443 -71 114 212 78 19 -184 80 8 -105 -91 221 -15 -353 8 280 19 139 252 -121 -141 -3 -146 213
4465 213 -103 -207 -69 177 25 -364 39 357 24 -39 63 -259 -178 128 137 18 41 -26 -46 50 -315 -26 -35
4488 -35 -37 13 -32 11 -143 -17 -254 131 209 -111 134 -78 13 -152 186 176 10 8 48 240 -32 78 16 -67 -160
4513 -160 31 -178 153 -85 14 -36 13 84 -137 3 -80 -27 220 -83 188 240 -115 137 71 -466 -30 111 372
4536 372 -137 85 -61 -18 134 -25 -169 -247 13 -33 233 -30 -242 -265 -16 -72 -299 -104 4 188 -244 -15
4558a5Q6L6j27q6j16K07L2Q0k61L51k01nJ97n16M23k03K82k74Q6J59k68J39K5
4581C1J26J66l39j83M11l63j16K48K54j90j02J08j7r9N5j69M7Kl3M10m02J2O2
4604h1K8L0Q1j26P0r9K24j80O7K9j71L2j16K18r6J84n6J09m56L92J50k53M71n20
4628f9K20j12J18k22J24J8j8Oj68j22J58K58m5j05k61J81J86j76Q6j45j81L40
4650G1J67k01R9m9k96K39k5j18K50j51k98K94J22k68K15m6j0K04j63q7K93l90
4672a48l6K15j39L53k90P5k70K73j93K02P7L0Q0j2k11J17l29J41K41j53M0o1K33
4695B35m24K47P4Jk66J44J35o5k70M16m28K38j71J35m7p4L38k06K9p0K8j81J00
4718h2K84j95p7Q7j54O3j40L95l14L06J47l91OJ81k80M32j45k19J0M2k20L50N2
$$ plain form
4558 -15 71 107 -20 -106 -222 -15 17 97 -164 187 -14 -19 178 -338 85 -118 164 -110 -24 135 -133 6 31
4581 31 157 323 -16 -199 212 -151 -267 -19 235 45 -57 51 34 -65 -10 -179 -132 -130 -163 247 -155 -143 -81
4604 -81 -53 -23 58 -68 2 -97 127 -53 14 43 -128 -96 -212 6 -90 94 38 147 -309 83 233 -20 451 -69
4628 -69 151 39 157 -65 59 77 59 65 -103 -225 -67 191 146 41 -220 -39 147 -29 57 -88 -269 71
4650 71 238 37 136 87 -209 30 5 -113 137 -14 -312 -18 104 -164 51 5 -5 199 36 -51 242 -148
4672 -148 -184 31 -108 245 -45 30 -240 33 -160 42 119 149 229 217 6 123 -206 -65 176 23 63 2 235
4695 235 -189 58 132 133 -133 11 146 81 -189 227 -201 37 -134 1 -46 -120 218 12 41 -29 -1 -182 -82
4718 -82 202 7 -70 17 -137 -74 -214 181 -133 173 320 -71 -65 116 -164 268 123 -96 -86 -44 -264 86 138
4741A38j12q5r7N02l86K02k08J85l75L38p5M6j56L08j29l30J80NJ23j29J48m4
4763D9K13j83J05l5l59O5N5J34J02N7l57L26N8k29J79k58J3J09J49k65j95J13
4785a54K99o3j30j2L37k08p9K5l05L71k14K90m04n8K53q3K24q6pn1J62l48Pl31
4809e65K09L30J58Mj34J32J2j93m9J65j81j1K51l5K5L5p6J26l61K70o2J95l23
4832g8n7J79k3r4K25j47o4j1J44l52R0J91m5K64l81k0L32l04M4J03j22N2J87k73
4856a60J74J72q5j38p4K00j21Q2j96J09n3M3j45M92k85j77M56k60n5K2J26k72
4878a45K83M5l66O3J29p5O8J50j06o5j27L0K42l02K32q3K00k73K00k59K60k98
4900a97R0J41k91K53q4M9L21k71N6K2J3J05m58K18K75l6k06J57l56K66l9N0J03
$$ plain form
4741 138 26 -59 -156 346 -40 162 -46 139 -236 102 27 73 -83 225 96 -234 -54 -49 74 -55 93 49
4763 49 262 79 184 149 -210 -145 -90 44 146 203 -154 172 230 1 180 -78 -65 44 193 -72 -267 -154
4785 -154 145 82 -48 -60 277 69 -10 15 -290 81 -133 157 -247 -305 -52 -135 89 3 -4 -55 107 -241 -234 -565
4809 -565 -356 -26 132 136 2 134 146 -47 -96 69 -112 -123 128 93 118 153 77 203 -158 112 50 245 -78
4832 -78 -135 44 21 -73 152 5 -59 -70 74 -278 -188 3 -42 222 -159 -179 153 -151 -107 -4 -126 -74 113 -160
4856 -160 14 186 101 -37 -111 89 -32 50 -146 -37 -90 -47 -192 300 15 -162 294 34 -21 1 127 -145
4878 -145 138 183 -183 -120 9 -66 2 152 46 -19 -146 -116 126 -176 56 -27 173 -100 100 -159 101 -197
4900 -197 -107 34 -257 -4 -88 -39 282 11 67 89 102 207 -251 -33 242 206 0 157 -199 67 28 78 181
4923A81m17M31p0k36J25R0k21J12m5K6R6k49k6K59l05L32l34L04J83j95J02j36
4945GM9L14m14J08J02j64j60j28K61q6Jj2k0J30J98j93M5J06Jk29K11j75j26K32
4969E8k27L24q2Q6n9o9N0J28k7j97m3n9n5kK01l87J23L19j85O4J73k93K15M1r1
4994FJ1k12L00n26M61K79j96rj44M3j73J45Q4j69L08o2j27RMn2r4K80P6q2K11
5019C71j6m75J96P4l49J68r2j53K45K27lk01o4j4K6J95j3j31R6l10J79LJ88k76
5043a29R5K95j05k99L43k1k82L94j25j90K7m1J84l37M3J74n9O0o8K05n5k41K76
5066A44O2l69L91m98L7K66j04J3M05l93j0K33j35M7j93J27mM4p7k9M1K9j8j18
5090a09L59j20k09O0k82L25L29m31O8J71m7j9l1J22k13K12J31M7j15k69pJ75n6
$$ plain form
4923 181 -236 195 125 -111 14 104 -117 -5 -50 -24 72 -177 -203 56 -249 83 -251 53 236 41 143 7
4945 7 56 370 -44 64 166 2 -158 -286 -25 -111 -110 -122 -142 -12 186 -7 38 144 145 -84 127 -48 -174 58
4969 58 -169 155 73 159 100 31 81 209 182 -15 -58 -117 -172 -174 27 -360 -237 82 -103 -39 134 -159 56 97 6
4994 6 17 -195 105 -421 40 319 123 114 -30 13 -160 -15 69 -100 208 146 19 28 32 -20 -114 166 242 160 371
5019 371 355 -120 76 150 -199 -31 -123 -276 -31 196 193 -8 -72 -86 -60 135 122 -9 87 -223 -44 -41 147 -129
5043 -129 -34 261 156 -143 200 179 -103 291 166 -24 3 -38 146 -191 -148 26 -33 27 -41 164 109 -132 144
5066 144 206 -163 228 -270 -233 33 -71 -58 347 -46 -56 177 42 89 -104 23 19 63 -14 -43 -2 27 9 -109
5090 -109 250 130 -79 -19 -301 24 353 -78 -10 161 114 95 64 186 -27 185 316 363 248 -21 -28 147 91
5113I1j40J9J62l3j72K14J12m49J53kL10o32L92J07k85J83J90k78M1pJ34l26K74
5136E8J57n76N32o9j46J90Q1P4k45k2P8k32K21k60Q9K28j21j69P8q7Lq2L99j09
5160G0p7J32o6l80K58K54l98K66J46q3M8j38l52K64J64k17J03Q2J35l06j1K67
5182A61l21J45M6J59k69J74j43J3m6N1K23j61o5P3l14L60K6k16M3M4n0K63k47
5205e1P7J59k11l1J54j03j73M85m35p5Q5K61k05K44l54O2L63O0m75Ro6K37M0j5
5229D2pj01N33m75K15l78N9K49o9j43O7p3lJ91k36J65L4K97j12j82o9o0Q2k77
5253b51k8L19J06R9k16q7p3K64p0k43N69l91k6M03l39r6Q5l24L91j81Q9L6l7r1
5277i2Q0N0j42L58m67J92k34M87l91N8K07kn8K5L1k31J5M76j55j18j22j51J21
$$ plain form
5113 91 -49 -30 132 99 -73 141 253 -196 -43 -45 265 -367 25 132 -153 30 220 -58 -17 -24 110 -216 58
5136 58 215 -361 171 102 -44 146 227 301 56 34 112 -120 101 -159 -70 158 37 -132 -54 -141 -138 -220 179 70
5160 70 -7 125 59 -321 -63 191 -207 59 205 122 170 32 -320 -56 108 -109 -6 76 211 -95 -106 161
5182 161 -160 -15 31 190 -79 95 -48 -35 -81 -30 193 32 -33 40 -274 86 112 -104 -61 -17 -67 196 -51
5205 -51 26 185 -26 -57 97 -6 -179 306 -129 -204 -119 142 -63 181 -173 -111 252 312 -163 -154 -220 17 57 42
5229 42 35 -66 467 -8 207 -171 -112 137 68 -75 -8 -81 -84 107 -129 36 70 367 255 73 4 -56 26 -251
5253 -251 -279 40 146 245 29 -58 -131 133 63 -180 389 -2 -28 375 36 -60 25 -299 92 -89 0 36 -1 -92
5277 -92 -12 38 -104 254 -213 -21 -255 232 -159 -101 106 104 46 71 102 -129 -114 362 207 89 -33 -184 -63
5300f3K64k05J43k74p5L13r5O9L09m09k51L15J30m35K85m9o9K61m8l25O9J74j10
5323g6R4J9K37l85q6J81J70r2j00K49k10j4k45L24p5p2J65j57L17n39L36J1q6
5346c4j4K99k31R5n2l4Pnj03J58l54N51m1j68m2J13k41M8J15m30J54L76m4p3j74
5371a24J49M5j08J54q6O3j11o5j57J10N3M29m19J54j33R5Jj44J20O3j51jL25j47
5395A15k9Ok45K81q6J02j31J63p3m8k08J97K04l03J36j80M26j70k14J42J06l42
5417a51J01J10J1l11M28l22R5J02k69J16q7L34q5q1J1p4J03k2k00M49j75k77K24
5440C0Q7O3k07K89k06j96K20j58o7m8M35l50j24N17l64k23M35k51K0K73J9j90
5462DJ63j25j57P0p1J30J32k73O9N1R2J36m04K18Q9l7k31j70L77n3P6j03j43J08
$$ plain form
5300 -63 201 -4 139 -135 -210 103 8 77 386 -23 -274 41 171 -264 21 -28 -97 164 116 -209 -140 34 -76
5323 -76 18 37 274 -111 -197 -16 154 62 -38 211 1 -13 -258 66 -9 -81 84 -73 244 -295 41 52 -34
5346 -34 -48 251 20 115 63 29 36 31 -72 86 -268 283 242 74 32 145 -96 -48 67 -363 -209 167 123 50 -124
5371 -124 25 70 -38 116 30 93 -18 -83 -240 -130 -77 352 -67 87 -46 49 50 -94 26 89 -62 -63 262 115
5395 115 86 92 -153 128 42 144 13 176 103 55 -153 44 248 -55 81 -99 327 157 -57 85 191 -151
5417 -151 -50 60 71 -240 188 -134 -39 63 -206 -90 -177 157 72 -9 2 -72 31 9 -191 258 83 -194 30
5440 30 117 180 -27 262 56 -140 80 -78 -145 -193 242 -108 -232 285 -79 -302 133 -118 -98 175 194 4
5462 4 167 42 -115 -45 -116 14 146 -127 -58 -7 85 221 -183 35 124 87 -144 -314 63 10 86 -17 -160 -52
5486e2K03K5l44K70Q7m6k12J08j12L18l63L79m06R7J10q5nJ27QP5j67j31n5K75
5510A04j64Q0j4j69J56R9l82L54J5l67L78k4l9J75l59L97j12k05R5qQ6j24J13
5533H5J4k12o6K57j11M9p6M4l9K03j69N8p7J74l74P4J33J0n0r9p9M65n95K26K89
5558A34j94M16k31j42K34l27P7o9k53K90jj68J61K09J1k43J16L4J81l49J31lK58
5581B72k15j80J58o2p8J92k26J59N4j21O0J1p1k12K32j11J52l0l0O2j35m6P1J02
5605HJ50R6k05l07M38q5k92K17J27j04k3j02K25j18n5O4j08J93j52K39j42q7j64
5628a87M54l04N7K11k44j28M50m78L02J1q9k8j03L8j99J41j3j33M09J01j81k14
5650a27K15J25j13m00M41r2NJ81J2J8j73m47L97Rj84r3K56j5j57M3l1P8L2J9n5
$$ plain form
5486 -52 151 176 -168 102 189 143 -69 39 -73 245 -118 261 -145 -48 62 -23 -28 99 107 182 15 -116 -171 104
5510 104 -60 20 6 -163 -7 92 -290 64 79 -288 90 66 27 202 -157 240 128 -77 18 10 96 -28 85
5533 85 99 -113 -179 78 -33 16 -60 -16 -55 148 -21 37 -40 134 -240 -166 -33 -23 -73 -172 -251 214 -381 -155 134
5558 134 -60 356 125 -17 217 -110 -33 -102 -355 -65 -66 -234 -73 136 147 -96 20 54 235 -114 17 14 272
5581 272 57 -123 35 -27 -105 87 -139 20 74 -47 13 24 -47 -259 -27 -138 14 -16 -46 16 -119 -165 -94 8
5605 8 158 254 49 -258 180 95 -197 20 147 43 20 -82 143 25 -30 34 -74 119 -33 206 64 -23 -187
5628 -187 267 -37 20 231 -13 -141 309 -169 133 144 55 27 -76 -38 -237 -96 -109 -242 167 268 87 -127
5650 -127 88 213 100 -300 141 49 54 235 247 265 92 -355 42 51 -133 -226 30 15 -142 -99 -130 -52 -20 -1 -56
5675e6J28j25Q5k06J92k84L41k07J2L43j65J56k80q4J72J4rj70L20k37j6K98j22
5698A00J9k66J14m6L6q6jn2J18R4k34K35L1k96P5K56q6m0J14M2L7P7k91R8k9l9
5724b0K93j93k94M14k9j33rj1O7j43K09p2j58l5j23l9%J37J86O0k48J37K09j96
5748IJ86j54J6k06K73k2j25K6J12j4L5j77Q6J32j83k9K11l56k21K51J57q0J44
5771G1j1P2j70K06k83J88O4r4l0K90j38k63K49l6n3J49l00J47j12N9o3Q8j03Q0
5795Gj58J97J31p0k73K15k35Q9oL18j81k95O2J41R5K1m0j14K44j08nJ65l02r1
5819a93J40O4p4j58Q4O9j52L25l26N40m77J78Q3k10K26j82J61m76N08n13N21j81
5841d3j95R6p1J19kj1J91K8qQ9j96m0J71k46Q1n7M44k60k24K03N2o5j72r2K09
$$ plain form
5675 -56 72 -53 32 -174 18 -266 75 -132 -120 223 58 214 -66 -150 22 36 27 -143 177 -60 -76 222 100
5698 100 119 -147 -33 -79 -43 -129 -130 -182 -64 30 -204 31 62 -234 -159 97 11 -29 85 127 164 241 -50 48 19 -20
5724 -20 273 80 -214 200 171 38 29 18 85 -58 151 79 -79 -114 -237 -276 -276 -139 47 107 -141 -4 205 9
5748 9 195 41 57 -149 124 102 -23 3 115 101 136 -41 45 177 -6 -35 176 -180 -401 -150 7 -73 71
5771 71 60 132 -38 168 -115 73 137 43 13 303 165 -98 151 115 62 211 -89 58 -54 5 -58 30 -73 7
5795 7 -151 46 177 107 -166 49 -186 -97 -103 215 34 -261 -199 -58 37 58 18 -96 148 40 35 200 -102 -193
5819 -193 -53 11 -63 -221 -137 -68 -220 105 -221 319 -158 20 103 -107 119 -63 98 -378 130 -383 138 -43
5841 -43 -238 -142 -213 -94 -96 -107 84 112 104 193 -3 -43 128 -118 -37 -94 350 90 -134 69 121 56 -116 -208 1
5866AN2J5Q7j6l27M53r7j22L4p4o2N8N3j69K3K80m33L58j53K25k37J44M0l69M9
5891a87K33Nk89J44NJ18j89N34m24r3O9R8J4l8K27k60m52M73j45m6M63k68K7M3
5915F2j14o8J11J0j50K11P5n7n5R6p1j42r5j9L6M09k67J16k53M9j1j02K15J7L36
5940C39n01K44j04M5o4K30K7k07j63L29o1l21k48P54m06L0J2K14K9r2j52j1pj43
5964b27N15k62j33j84M11j02J67k20k08K96km1k96N88l45m79O27j72lK05k51J0
5986a06P0N6J63j70K8j35R1K28j30k41O3j31L35j50o3Oj45L61j99k56L73NNj02
6010d4q1R2kj2j36J66m6o5J94n7K82k95K62j52O5j58j02M31l70qJ37k08L22k73
6034e8k2r7J05J68k12O5m5J45k08J29p9L6K90k32j62k17N51k83J66N8k38J45N6
$$ plain form
5866 1 53 68 155 139 -188 265 168 46 80 6 -56 2 55 -114 -91 189 -244 114 -39 186 -51 93 133 -236 -187
5891 -187 46 51 -238 -94 -89 29 -160 374 -50 -143 -74 24 38 0 227 -33 -485 -12 -157 -203 260 -8 19 62
5915 62 -52 -120 -9 1 -149 62 137 80 25 121 50 -92 -187 -206 -170 239 -28 88 -165 -116 -127 -229 -14 3 339
5940 339 -162 82 -22 23 -41 189 216 9 -154 175 114 -207 -455 299 -107 -77 -65 149 178 86 -66 -77 -84 -227
5964 -227 288 26 -107 -291 120 18 185 -35 -243 53 51 10 -286 302 -43 -522 105 -67 -70 135 -116 -106
5986 -106 -36 20 183 13 41 -94 -3 225 95 -146 -83 -214 121 -29 -92 -86 -231 130 -69 -325 48 53 58 -44
6010 -44 -125 -33 -35 -47 -183 -17 -63 -128 66 9 291 -4 258 106 171 13 -89 342 -28 -36 101 -107 215 -58
6034 -58 -80 -177 -72 96 -116 -51 -96 49 -159 -30 -109 -73 217 -15 -177 -394 157 -126 40 98 -140 5 61
6057F1L7l7Rp4J62p8j0K5q1j65M74m45L40l78O0p2L60k42J32j60J4n2o4N8Q2K23
6083A79m1m03J89l3k29M03k01L60o2j28m2j59L87k4r3J45j16r7J12l73K00k2j49
6106a97j52M70j1K6j89J00K20j55k05j12J59j97L52M5k23l2r2k3J77j28K53j6
6128G0M2p0j98r4J11L49o23M37p6JJ49l17J09J41m50P81m97p9L42j55J96k31R1
6151B9j76Q9K45J48k27R7m07K42r7J32J47l00J83k66K25J97L1k91J02n6k34J31
6173e6L0L8M00l77j06k78M75k47J66J54k9j81J24j74N8J79p2R9o9j04k92J86K13
6196A37j8l34L21n6l30K20j8r5m5K18o6R4K47J3m86K98j62J66n7j0n5j7k7n9Q2
6221c9J83j7j57K0J40l23L20j47Q1J36k58K23l19J19q6K41l00J93j01O9j79J20
$$ plain form
6057 61 98 61 70 -4 158 80 70 95 14 -151 323 -122 218 -160 -100 -172 188 -54 78 -82 -68 -120 -184 -126 -44 179
6083 179 138 -265 -76 -109 -338 65 -136 224 162 34 -8 -167 220 196 103 248 132 35 147 -226 -26 -48 -197
6106 -197 -349 121 110 136 -53 47 267 112 -93 -205 -46 -243 109 154 -69 -101 -193 -216 -39 -167 86 70
6128 70 112 42 -156 -250 -139 210 -413 24 -52 -51 98 -219 -110 31 -419 362 -135 -214 128 -27 169 -62 29
6151 29 -147 -58 187 335 108 205 -202 40 -57 75 222 -78 105 -161 64 261 292 1 103 47 -187 -56
6173 -56 -26 12 412 35 -71 -349 126 -121 45 199 170 -11 113 -61 -3 176 104 203 134 30 -262 -76 137
6196 137 119 -215 106 50 -280 -60 -78 -173 -218 0 -66 28 275 288 -198 100 -62 104 47 37 -18 -35 -62 -121 -39
6221 -39 144 127 -30 -10 130 -193 127 -20 61 197 -61 162 -157 -38 -124 117 -183 10 -91 -22 -201 -81
6243h1N8Rk20J47K15k86l1K89j29j22J86l14L27j21o5R0J38J4p7J46m44M83j08
$$ plain form
6243 -81 -23 -14 -234 -87 128 -158 -189 100 -29 -151 35 -279 48 -73 -138 -48 90 104 27 173 -271 212 104
$$ [...]
8191b85
##END NTUPLES=NMR FID
##END=
