##TITLE=1H_DE-60K_D2O_2
 D2O
 8 sc, 
 4.7.2024
##JCAMPDX= 6.0         $$ Bruker NMR JCAMP-DX V2.0
##DATA TYPE= NMR FID
##DATA CLASS= NTUPLES
##ORIGIN= UXNMR, Bruker Analytische Messtechnik GmbH
##OWNER= root
$$ XWIN-NMR		Version 3.5
$$ Thu Jul  4 15:31:26 2024 Russian Standard Time (UT+4h)  she@DPX200
##.OBSERVE FREQUENCY= 200.1314
##.OBSERVE NUCLEUS= ^1H
##.DELAY= (6, 6)
##.ACQUISITION MODE= SIMULTANEOUS
##.ACQUISITION SCHEME= undefined
##.AVERAGES= 8
##.DIGITISER RES= 18
##SPECTROMETER/DATA SYSTEM= spect
##.PULSE SEQUENCE= zg30
##.SOLVENT NAME= DMSO
##.SHIFT REFERENCE= (INTERNAL, DMSO, 0, 15.7039)
##AUDIT TRAIL= $$ (NUMBER, WHEN, WHO, WHERE, WHAT)
$$ ##TITLE= Audit trail, XWIN-NMR		Version 3.5
$$ ##JCAMPDX= 5.01
$$ ##ORIGIN= Bruker BioSpin GmbH
$$ ##OWNER= she
$$ F:/spectra/data/she/nmr/H-F/1/audita.txt
$$ ##AUDIT TRAIL=  $$ (NUMBER, WHEN, WHO, WHERE, WHAT)
(   1,<2024-07-04 15:30:18.28 +0400>,<she>,<DPX200>,
      <created by zg, POWCHK disabled, PULCHK disabled
       configuration hash MD5:
       00 E9 B6 7A A2 85 ED C7 34 08 36 98 17 FE 4E 26
       data hash MD5: 16K
       4D 47 B2 8F CD FF 19 1A 7F C4 C3 1A C0 7A 43 8E>)
$$ ##END=
$$ 
$$ hash MD5
$$ 0A 28 C3 CC E5 98 56 11 6B BE 8E 90 2D EA A4 B7
##$RELAX= 
##$RELAX= 
##$RELAX= 
##$RELAX= 
##$RELAX= 
##$RELAX= 
$$ Bruker specific parameters
$$ --------------------------
##$DU= <F:/spectra>
##$EXPNO= 1
##$NAME= <H-F>
##$PROCNO= 1
##$TYPE= <nmr>
##$USER= <she>
##$AMP= (0..31)
100 100 100 100 100 100 100 100 100 100 100 100 100 100 100 100 100 100 
100 100 100 100 100 100 100 100 100 100 100 100 100 100 
##$AQSEQ= 0
##$AQ_mod= 1
##$AUNM= <au_zg>
##$AUTOPOS= <>
##$BF1= 200.13
##$BF2= 200.13
##$BF3= 200.13
##$BF4= 200.13
##$BF5= 200.13
##$BF6= 200.13
##$BF7= 200.13
##$BF8= 200.13
##$BYTORDA= 1
##$CFDGTYP= 0
##$CFRGTYP= 5
##$CHEMSTR= <none>
##$CNST= (0..31)
1 1 145 1 1 1 1 1 1 1 1 1 1 1 1 1 1 1 1 1 1 1 1 1 1 1 1 1 1 1 1 1 
##$CPDPRG= <>
##$CPDPRG1= <>
##$CPDPRG2= <>
##$CPDPRG3= <>
##$CPDPRG4= <mlev>
##$CPDPRG5= <mlev>
##$CPDPRG6= <mlev>
##$CPDPRG7= <mlev>
##$CPDPRG8= <mlev>
##$CPDPRGB= <>
##$CPDPRGT= <>
##$D= (0..31)
0 1.2 0 0 0 0 0 0 0 0.06 0 0.03 0 0 0 0 0.0002 0 0 0 0 0 0 0 0 0 0 0 0 
0 0 0 
##$DATE= 1720092617
##$DBL= (0..7)
120 120 120 120 120 120 120 120 
##$DBP= (0..7)
150 150 150 150 150 150 150 150 
##$DBP07= 0
##$DBPNAM0= <>
##$DBPNAM1= <>
##$DBPNAM2= <>
##$DBPNAM3= <>
##$DBPNAM4= <>
##$DBPNAM5= <>
##$DBPNAM6= <>
##$DBPNAM7= <>
##$DBPOAL= (0..7)
0.5 0.5 0.5 0.5 0.5 0.5 0.5 0.5 
##$DBPOFFS= (0..7)
0 0 0 0 0 0 0 0 
##$DE= 6
##$DECBNUC= <off>
##$DECIM= 24
##$DECNUC= <off>
##$DECSTAT= 4
##$DIGMOD= 1
##$DIGTYP= 9
##$DL= (0..7)
0 120 120 120 120 120 120 120 
##$DP= (0..7)
150 150 150 150 150 150 150 150 
##$DP07= 0
##$DPNAME0= <>
##$DPNAME1= <>
##$DPNAME2= <>
##$DPNAME3= <>
##$DPNAME4= <>
##$DPNAME5= <>
##$DPNAME6= <>
##$DPNAME7= <>
##$DPOAL= (0..7)
0.5 0.5 0.5 0.5 0.5 0.5 0.5 0.5 
##$DPOFFS= (0..7)
0 0 0 0 0 0 0 0 
##$DQDMODE= 0
##$DR= 18
##$DS= 0
##$DSLIST= <SSSSSSSSSSSSSSS>
$$ [...]
##$SUBNAM2= <"">
##$SUBNAM3= <"">
##$SUBNAM4= <"">
##$SUBNAM5= <"">
##$SUBNAM6= <"">
##$SUBNAM7= <"">
##$SUBNAM8= <"">
##$SUBNAM9= <"">
##$SW= 24.0689651099613
##$SWIBOX= (0..15)
0 0 2 0 0 0 0 0 0 0 0 0 0 0 0 0 
##$SW_h= 4816.95568400771
##$TD= 16384
##$TD0= 1
##$TE= 0
##$TE2= 300
##$TE3= 300
##$TEG= 300
##$TL= (0..7)
0 120 120 120 120 120 120 120 
##$TP= (0..7)
150 150 150 150 150 150 150 150 
##$TP07= 0
##$TPNAME0= <>
##$TPNAME1= <>
##$TPNAME2= <>
##$TPNAME3= <>
##$TPNAME4= <>
##$TPNAME5= <>
##$TPNAME6= <>
##$TPNAME7= <>
##$TPOAL= (0..7)
0.5 0.5 0.5 0.5 0.5 0.5 0.5 0.5 
##$TPOFFS= (0..7)
0 0 0 0 0 0 0 0 
##$TUNHIN= 0
##$TUNHOUT= 0
##$TUNXOUT= 0
##$USERA1= <user>
##$USERA2= <user>
##$USERA3= <user>
##$USERA4= <user>
##$USERA5= <user>
##$V9= 5
##$VALIST= <valist>
##$VCLIST= <CCCCCCCCCCCCCCC>
##$VD= 0
##$VDLIST= <DDDDDDDDDDDDDDD>
##$VPLIST= <PPPPPPPPPPPPPPP>
##$VTLIST= <TTTTTTTTTTTTTTT>
##$WBST= 1024
##$WBSW= 4
##$XGAIN= (0..3)
0 0 0 0 
##$XL= 0
##$YL= 0
##$YMAX_a= 85456
##$YMIN_a= -98348
##$ZGOPTNS= <>
##$ZL1= 120
##$ZL2= 120
##$ZL3= 120
##$ZL4= 120
##$ABSF1= 10
##$ABSF2= 0
##$ABSG= 5
##$ABSL= 3
##$ALPHA= 0
##$AQORDER= 0
##$ASSFAC= 0
##$ASSFACI= 0
##$ASSFACX= 0
##$ASSWID= 0
##$AUNMP= <proc_1d>
##$AZFE= 0.1
##$AZFW= 0.1
##$BCFW= 1
##$BC_mod= 2
##$BYTORDP= 1
##$COROFFS= 0
##$CY= 11.3945322036743
##$DATMOD= 1
##$DC= 2
##$DFILT= <>
##$DTYPP= 0
##$F1P= 15.6554695791079
##$F2P= 12.8336369535428
##$FCOR= 0.5
##$FTSIZE= 0
##$FT_mod= 4
##$GAMMA= 1
##$GB= 0.15
##$INTBC= 1
##$INTSCL= 1
##$ISEN= 128
##$LB= 0.24
##$LEV0= 0
##$LPBIN= 0
##$MAXI= 10000
##$MC2= 0
##$MEAN= 0
##$ME_mod= 0
##$MI= 1.114404
##$NCOEF= 0
##$NC_proc= 0
##$NLEV= 6
##$NOISF1= 3.799351
##$NOISF2= 2.8
##$NSP= 1
##$NTH_PI= 0
##$NZP= 0
##$OFFSET= 15.70392
##$PC= 1
##$PHC0= -25508.63
##$PHC1= 9.787479
##$PH_mod= 1
##$PKNL= yes
##$PPARMOD= 0
##$PSCAL= 0
##$PSIGN= 0
##$REVERSE= no
##$SF= 200.130013532006
##$SI= 16384
##$SIGF1= 3
##$SIGF2= 2
##$SINO= 400
##$SIOLD= 16384
##$SREGLST= <1H.CDCl3>
##$SSB= 0
##$STSI= 0
##$STSR= 0
##$SW_p= 3612.71676300578
##$SYMM= 0
##$S_DEV= 0
##$TDeff= 0
##$TDoff= 0
##$TI= <>
##$TILT= no
##$TM1= 0
##$TM2= 0
##$TOPLEV= 0
##$USERP1= <user>
##$USERP2= <user>
##$USERP3= <user>
##$USERP4= <user>
##$USERP5= <user>
##$WDW= 1
##$XDIM= 8192
##$YMAX_p= 0
##$YMIN_p= 0
$$ End of Bruker specific parameters
$$ ---------------------------------
##NTUPLES= NMR FID
##VAR_NAME=  TIME,          FID/REAL,        FID/IMAG
##SYMBOL=    X,             R,               I
##VAR_TYPE=  INDEPENDENT,   DEPENDENT,       DEPENDENT
##VAR_FORM=  AFFN,          ASDF,            ASDF
##VAR_DIM=   8192,          8192,            8192
##UNITS=     SECONDS,       ARBITRARY UNITS, ARBITRARY UNITS
##FACTOR=    0.0002076,     1,               1
##FIRST=     0,             0,               0
##LAST=      1.7004516,     0,               0
##MIN=       0,             -98348,          0
##MAX=       1.7004516,     85456,           0
$$ Real data points
##PAGE= N=1
##DATA TABLE= (X++(R..R)), XYDATA
0@%%%%%%%%%%%%qJ6j6J6j6K1k9L2l6M3m7N5o4P2q6R8j08J22j38J55j75J96k19
35a16K45k71K99l33L70m10M55n03N57o18O85p60Q46r47J064j199J363j566J817
54I78k146K601l260M311o256J1035m5985n9626Q7078O5651j0850n4657l9619J0450
68d0295P4981L9592n4247p1690J723N3101M6056j3481p0234l7212O1283P3293
80F2870j4034o4550k9201K3060N0489K3912m6144o4791R346O6458L4756k9435
92B2736n3039j6685M8762N6414j6988o7553k9359L5635N2362J1082m7800m9742
104e4175K2291O6798K1756m3612m9918m052M5486M3095k0863o3950j9395M9897
116f642N2629l363n1216l8803K5832O0322J0924n3256m4988J0506M7425L5220
$$ y = [0, 0, 0, 0, 0, 0, 0, 0, 0, 0, 0, 0, 0, -8, 8, -8, 8, -8, 13, -16, 16, -20, 23, -24, 31, -33, 39, -47, 51, -57, 65, -73, 82, -93, 103, -116, 129, -142, 157, -176, 194, -216, 239, -264, 293, -325, 360, -400, 446, -501, 563, -636, 727, -839, 978, -1168, 1433, -1827, 2484, -3772, 7263, -38722, -98348, -11270, 54381, 43531, -11126, -50745, -40295, 34686, 74278, 20031, -51659, -49936, 3165, 49221, 35740, -34494, -71706, -10423, 62870, 48836, -15714, -44915, -21855, 28634, 52546, 6402, -58389, -49043, 17415, 52171, 22736, -30303, -46988, 1774, 58188, 41200, -26353, -55712, -20077, 32285, 43367, -4433, -54175, -31884, 34914, 56670, 13058, -36860, -40912, 4574, 47669, 26806, -37144, -56539, -6642, 45987, 42624, -8592, -47395, -21563, 38759, 49683, -3573, -48561, -38055, 9370, 44590]
128D4590j8868n7100j6836N1774M9270j5525n5443l0737K5984N3325J1154m7748
140f160m1071J8544M9989K5106k4356n0337j4393M5859M2533k1779n3232j6871
152d6168L4716M4782N057m3291l5359K2247M8120J0639l6997m1114q0M4466L4711
165D1729k4278m9067n487M2109L5907r251m4571k8942K4673M7317L908m3067l1628
178d0648J4604M4485K4573k6850m6574l538M4075L0137k0483m4852j7937L1829
190a1179M5040K2m4027k7709K3062M2009J2338l3001m2822P49M5304K9356k5520
203A3622m2183o813L5473L7614n275m4470k6421K4871L9702M350l4437l2381Q683
216b7665M2976K4099k7053l9258l04L4724K5913j3394m0159j7901K9069L8192
$$ y = [44590, 25722, -31378, -48214, 3560, 52830, 37305, -18138, -48875, -22891, 30434, 41588, -6160, -47231, -28687, 21302, 46408, 22052, -28285, -42678, 3181, 45714, 23935, -29297, -46168, -11452, 33330, 38387, -4904, -40263, -18016, 30104, 40743, 3746, -37368, -37448, 7018, 41729, 17451, -31616, -37103, 5006, 40913, 31662, -12909, -41851, -17178, 30139, 34047, -9020, -40648, -26044, 18441, 43014, 16164, -30410, -33948, 10127, 40264, 19781, -25071, -43008, -11179, 33861, 33883, -10144, -37853, -14791, 27218, 39556, 6555, -36267, -35518, 9786, 39142, 13622, -28561, -35374, 99, 37713, 32438, -12032, -38453, -13582, 26120, 30470, -3967, -36348, -27665, 15311, 39410, 12357, -26901, -27205, 7519, 33432, 20038, -20121, -38022, -8953, 29239]
228B9239k789l6068k2077J7654L7676J1943l1067l7137N553L8342K0312k1416
240A0165l5457o930L3302L4472r408m0396j8011K3967L3648K843l3181l0880J1759
253b4107M1782J6758k6491l3942N29L3686K6887j5750m1061j3558K8880L3273
265B6886k685l3153k3772J7199L9702J1379l2509l3290N631L4681K0846j8920
277A1995l6754q170L3738L1617q622l5203j7863J9412L3000N120l2431k8702J1166
290b1697L6359J5034k1863l0621j134L1378K4706j5517l5307j1562K4987K9012
302B3775k330l1112k0932J8201L5342P626k8973k8418N924L2135J8383k0490l4569
315b5438l903L2042K7000r263l2812j6033K0846L2850J527l2579k5975J2059L4383
$$ y = [29239, 26450, -9618, -31695, -14041, 23635, 35578, 4511, -32626, -27073, 11269, 31581, 10165, -25292, -32222, 1080, 35552, 26144, -14252, -32263, -8296, 25352, 28195, -4986, -35866, -24107, 17675, 34433, 7942, -26000, -25471, 8215, 35102, 19352, -21709, -35267, -6387, 26886, 24201, -8952, -32724, -15525, 24177, 35556, 3047, -30243, -24612, 10069, 30915, 11995, -24759, -32929, 809, 32426, 23804, -11399, -29262, -9850, 23150, 28270, -4161, -32863, -21697, 14662, 29696, 7833, -22788, -23922, 7456, 32162, 16645, -18662, -30224, -5237, 23775, 21445, -9667, -30599, -12398, 22944, 30570, 1597, -26821, -20897, 11238, 29621, 9131, -25438, -29341, 2701, 29701, 20438, -12374, -28407, -7561, 25289, 26816, -5763, -31738, -19679, 14704]
328A4704J4185k2591l1399J465L2726K2826j5447l3941j2100K3849L0528k699
340B2106l2671k0580J8488L3518Q188k5920k8214L988L1783J8254j9525l2280
352b2865n243K7967K7209p013l1791j5509K0857K9816R13k8266k3495Q796L0789
365A2165J4107k1335k8730K274L0623J9611j4533l0327r806K2775K6780m791l0224
378a1411j6565J6967L0342P716k5169k7041O911L1703J4279k0459k9819k937K6105
391F22K4725p065l0737j4337K1327K9429O25k9023k3037J0443L0663J1615k1912
404C338k6424K113K8033K0637j2203l0557j1096K3354K6107m706k8945j6744J5153
417a1940K9215Q212k3391k4825N683K7832J4796j6387k8834n416K5294K3674q121
$$ y = [14704, 28889, 6298, -25101, -23636, 9090, 31916, 16469, -17472, -29572, -5723, 24805, 22106, -10565, -31145, -12657, 20861, 29049, 3129, -25085, -21097, 10686, 28940, 9415, -22865, -28108, -141, 27068, 20055, -11736, -27245, -6388, 23428, 24341, -3925, -27420, -18624, 12165, 26272, 4937, -23793, -21519, 9104, 28715, 14182, -16145, -25951, -3176, 23604, 18813, -11411, -27976, -11009, 19333, 27049, 1880, -25161, -18250, 13453, 27732, 7273, -22546, -25483, 622, 25347, 18282, -12455, -26792, -5465, 23964, 24589, -4434, -27471, -17028, 13635, 25250, 3338, -23086, -20973, 7060, 27697, 15494, -15063, -26159, -2805, 23302, 18596, -10349, -27093, -11940, 17275, 25487, 2096, -22729, -17046, 10786, 25582, 9195, -19639, -25055, 239, 23913, 15792]
430A5792k8489j0712J8502K5376J610k4755k1915R944K7814R659k0427k4124K227
443a9498K6470J8618j3003k7643p242K1767K1988m905k6214j6151J4597K8807
455A7591O372k4576k2358Q081K7361J2611j7594k6757m139K4764K1642q429k6872
468a2303j1646J8300K6574J863k6404k0146J0567K6180Q774j8718k3773R63K5788
481F019J8554j2006k6775p066K0211K1918m095k5626j5759J4425K6293M724k0672
494A45k0497N748K4802J3537j5513k6312l068K2679J8920p762k4392j0049J6992
507d770K4077L12k3507j6928R120K3914Q003j7920k3267L107K5234J4834j2370
520I839k3598n439J9038K0948m760k5644j4301J5385K4364L666k0586j9752O489
$$ y = [15792, -12697, -23409, -4907, 20469, 22079, -2676, -24591, -14647, 13167, 22826, 2399, -21725, -19498, 6972, 25590, 12587, -15056, -22298, -531, 21457, 16552, -9662, -25813, -11216, 17591, 23963, -613, -22971, -14890, 12471, 25082, 7488, -19269, -23408, 1356, 22998, 14569, -12303, -23949, -5649, 20925, 22788, -3616, -23762, -13195, 12985, 21759, 3041, -20732, -19769, 6019, 24573, 12567, -14208, -21274, -1063, 20855, 16760, -8866, -24625, -10200, 16093, 20817, 145, -20352, -14604, 10198, 23735, 8222, -18090, -21158, 1521, 20441, 12679, -11713, -21762, -4770, 19307, 19619, -3888, -20816, -11696, 12218, 20221, 2301, -20966, -17859, 7375, 22209, 9839, -13759, -19198, -160, 20788, 16028, -9616, -23917, -8532, 15832, 19498, -1088, -20840, -14351]
533a4351K5979J1971j7126k3892j755K1047J8256p299k4250j0772J7258K3789
545A8855L67k2552j7063R245K3593Q168j8603k1653J965K3301J5280j0521k2838
558a2456o759J8638K0449m724k3610j3065J3306K2139L807j8514j8680O170K3430
571A0131J1421j5107k2398j745J9966J6766p771k2962q321J6219K0577J09k0122
584c237j5752Q936K2640O855j8626j9553L394K1255J3283j0486k1935m818J8971
597I27J8609n022k2793j2247J2824K1859L947j9898j7706O758K2998J0392j4363
610F285k1357k652K0170J6675q259k2610q234J5877K0154N56j9645j5476Q968
623i548K1408O759j6872j9390K541J9997J4022j0728k1062m056J7810J6910m673
$$ y = [-14351, 11628, 23599, 6473, -17419, -19174, 1873, 20129, 12830, -11420, -22192, -4934, 18855, 19222, -3330, -20393, -11148, 12445, 20613, 2010, -19643, -17678, 5623, 20903, 10382, -12456, -19215, -577, 19872, 15148, -8462, -21527, -8221, 13918, 17725, -789, -19469, -13299, 10131, 21552, 6445, -15953, -17698, 2268, 19034, 11263, -11699, -20020, -3801, 16776, 16885, -3237, -18989, -10053, 12587, 19442, 816, -18737, -15343, 5912, 19195, 8709, -13226, -18044, 927, 19536, 14514, -8279, -20526, -7702, 14157, 18104, -1794, -19500, -12742, 10256, 20648, 6285, -15072, -17724, 2446, 19121, 10862, -11748, -19982, -4105, 16049, 16605, -3040, -18516, -9548, 11860, 18619, 1747, -17643, -15102, 4895, 18917, 8189, -12873, -16929, 881, 17791, 13118]
636A3118j9815j2121J1334K0753L257j8833j6030P175K0596R500j3345j9962j426
649a5799J8926J4582q243k0296p207J4252J9265J66k0098j4061J0473K0632M681
662A7273j6490j7470K277J9876J2591j1137k0201l276J7788J6495m395k0490j1319
675a8478J2034K0285K076j8791j4921O667J9641J0073j2749j9903j239J8556J4601
688A7852q323j9725p473J4051J8006Q0j8906j2504R142J9176N504j5289j7379
701a5788J914J9515J1385j1103j8256k591J5937J5242l990j8685j0677J1451J8712
714A3066J478j6880j4493O348J9454Q094j3147j7563J86J7442J2366p441j8890
727i980o934J4117J7085q79j8342j1265R477J7937M656j5110j6212L364J8116
$$ y = [13118, -6697, -18818, -7484, 13269, 16526, -2307, -18337, -11162, 9434, 18934, 5589, -14373, -15799, 3127, 17709, 9466, -10830, -18037, -3785, 15480, 15646, -4452, -18513, -8040, 12592, 17273, 783, -16687, -14410, 5466, 18057, 6920, -13281, -16557, 1231, 17726, 13331, -7159, -18478, -6444, 13841, 15917, -2874, -17795, -11128, 8513, 18586, 5837, -14066, -15305, 3251, 17852, 9529, -10196, -17669, -3618, 14388, 14468, -4438, -16942, -7800, 11376, 16880, 1591, -15788, -13874, 5641, 17026, 5923, -12333, -14924, 1013, 16255, 12265, -6420, -17097, -5646, 13066, 14544, -2336, -16829, -10481, 8973, 17067, 3920, -13643, -13457, 3985, 16351, 8910, -9980, -16914, -2797, 14288, 13409, -4933, -16198, -6721, 11216, 15872, 762, -15450, -12086, 6030]
740F030R735j0093j7785l138J5791J5885m762j9230q668J1780J6725J856j6318
753b192j4484N777J9110Q209j2460j6668N5J5731J3106p105j9159o345J3883J5751
767A3209j404j6368j0455Q057J7684M649j4581j5248L249J7107Q876r577j6893
780a1695k712J5494J4364n303j7006p684J0547J5955J241j5681j3251O299J8006
793H574O042j1566j5266N48J5470J1794p506j7431n901J3244J4836j574j5992
806d728j0881R437J7345L554j4765j3730L401J6092R048r746j6981k595J5990
819A441J3460n243j6367p696J0389J6048J018j5749j2462O374J6112O841j0898
832C268j4979m82J6295J1107q145j5737n084J1824J4106j404j5608r682Q603J6123
$$ y = [6030, 15765, 5672, -12113, -15251, 540, 16425, 11663, -7567, -16235, -4455, 12270, 14126, -2192, -16676, -10899, 8211, 16420, 3960, -12708, -12653, 3078, 16184, 9079, -10080, -16425, -2542, 13209, 11805, -4563, -15018, -6961, 10723, 15372, 791, -14457, -11208, 5899, 14775, 5198, -11695, -14407, 1087, 15451, 10148, -6858, -14542, -3995, 11960, 13201, -2480, -15731, -9432, 8574, 14616, 3050, -12216, -11668, 3802, 15596, 8090, -9341, -15242, -1998, 12838, 11264, -4728, -15609, -6172, 11173, 14727, -38, -13768, -10367, 5725, 14773, 5027, -11954, -14549, 1441, 14901, 9658, -6709, -14405, -4016, 12032, 13050, -2699, -15161, -8787, 7325, 14166, 3268, -11711, -12193, 4102, 15209, 7064, -8673, -13757, -1933, 12173, 10769, -4839, -14521, -5918, 10205]
846A0205K981j2900j2819K690J5331Q904j0401j5780j140J4456J1808m239j5449
859f353p746J0893J5441j40j5172j1110O116J5224O828j1817j4589J505J5635
872D715R283p223j5253n028J1992J3822k069j5899q588R256J4859L095j2525j3359
886a2922L972J5380P402r985j4534j822J3333J2089l767j6272o459J0843J4360
899A1618l01j3596j0893N478J5001N926j1555j3366J350J4089R913p073j4886
912h295m684J2474J2279k851j4073p544P615J4326L355j3206j1633M591J4365
925F719N902r179j3907j585J3515J1674n668j4737m990J0137J3010P15j3979j0761
939a3134O126J4978M075j1298j1987J418J3657Q969o735j4322l253J1281J1333
$$ y = [10205, 13186, 286, -12533, -9843, 5488, 14392, 3991, -11789, -12929, 1527, 13335, 9096, -6353, -14099, -3206, 12235, 12095, -3077, -14187, -8071, 7153, 13981, 2164, -12425, -10920, 4715, 13998, 6775, -8478, -13506, -1514, 12308, 10239, -5660, -14248, -4992, 9867, 12962, 437, -12922, -8950, 6430, 13832, 3847, -10687, -12509, 824, 12913, 9146, -7126, -13585, -2742, 11618, 11317, -2279, -13172, -7694, 7307, 13233, 1678, -11688, -10338, 3751, 13664, 6591, -8295, -12979, -505, 11774, 8923, -5150, -12694, -5079, 9247, 12602, -604, -12237, -7646, 6719, 12621, 3442, -10465, -12050, 1465, 13139, 7471, -7266, -12256, -2119, 10891, 11606, -2373, -13134, -7008, 7970, 12045, 747, -11240, -9822, 3835, 12804, 6069, -8253, -11506, -225, 11108]
952A1108k599j3441q378Q258J4661J880j2567j0408L984J3627O302q860j3628
965a0061j338J2926J0708m986j3800n598R957J3219m12j3341r773O525J3083L861
979A0970r834j1572O71J3834Q552p555j3310k184J0667J0537k286j3688p678Q811
993d065J3056J301j1451r744L880J3240O218r584j2955m8J2333R070m767j3198
1007f714m870R667J2698p58j2928q595N832J2860L837j0321j1777J925J3435P277
1021A1568o775j2526l093J0815J1446l508j3612n821Q144J1985J030j0787r800
1034a0934M077J3203N007r008j1646l16J1382R431m952j2996m147R708J1045j208
1048H646j0914q225M964J2703K981r481j1068K489J1754O670o251j2017k176J0876
$$ y = [11108, 8509, -4932, -13310, -5052, 9609, 11489, -1078, -11486, -7502, 6125, 12427, 3567, -10061, -11399, 1527, 12235, 7249, -6551, -12149, -2192, 11027, 10615, -2726, -12499, -5974, 7109, 10970, 1136, -10436, -9765, 4069, 12621, 5066, -8244, -10428, 239, 10776, 8490, -5198, -12876, -4065, 8991, 10292, -1159, -10903, -7023, 6217, 12435, 2851, -10104, -10152, 2181, 11251, 6484, -6714, -11584, -1917, 10781, 10023, -2905, -11500, -5668, 7192, 11029, 708, -11069, -9144, 4291, 11568, 4793, -7733, -10826, -11, 11435, 7927, -5685, -11506, -3362, 8623, 9653, -1134, -10934, -6857, 6346, 11353, 2345, -9301, -9617, 1765, 11196, 6244, -6752, -10899, -1191, 9854, 8646, -2268, -10493, -5529, 7174, 10155, 674, -10394, -7905, 3849, 10519, 4268, -7749, -9925, 951]
1062I51R838l859j2409n341P658J1030J786j1082r571M948J2359M655q724j1170
1076h931j18J0978Q884n653j2178l651R625J0564j114j1128q009N947J2223K535
1090I974r852r692J753J1555O862o546j1932j501J0542Q935l491j1223o199P781
1104c034J1059Q23j0472q562M249J1713M603p992j1411M90J1073P534n234j1378
1118f539k995Q451J0402j277j1107o940O109J0946K330r295r523K008J1375N872
1132I817o887j0388j028R940Q008k840j1635n125P813J0515J73j0532p678M474
1146e373J1104M109q069j0118O60J0260P422n114j1284l471R219R459j336j0589
1160c121o118N317J0913K521r704q930K125J0881N517o548j0342r53R584Q409
$$ y = [951, 10789, 6930, -5479, -10820, -3162, 7868, 9654, -1428, -10999, -6051, 6308, 10963, 2239, -8931, -9049, 1929, 10813, 5160, -7018, -10669, -1044, 9520, 8406, -2722, -10731, -4784, 7439, 9974, 122, -9570, -7817, 3738, 10600, 4054, -7878, -9379, 1163, 10098, 6607, -4616, -10815, -3034, 8025, 8848, -1624, -10186, -5937, 5776, 10379, 2387, -9024, -8534, 2539, 10073, 4839, -6539, -9534, -1083, 9319, 8042, -3065, -10005, -3896, 7050, 9380, 85, -9438, -7430, 3945, 9817, 2930, -7458, -8486, 1454, 9462, 6622, -5013, -10138, -2325, 8190, 8363, -2169, -9847, -5373, 5731, 9840, 1771, -8347, -7687, 2573, 9995, 4881, -6403, -9874, -655, 8804, 7468, -3121, -9239, -3922, 6991, 9512, -192, -9122, -6997, 3884, 9401, 2853, -7489, -8442, 1142, 9551]
1174I551l689j0707m628P081J0457l65r226p932L929J1444L659p969r756Q74R968
1189B691O477n036j0073l343Q831Q971j954r800n912N808J0141J787r035q556
1203i003K925J0432M466o412r886r24R683P786l471j0212m470P185R366j53r527
1218b215o893M144J0578L225p887r040J263R734O389n590j0036k419Q355Q468
1232H076j501r921n384N548R413K056q897q038K952R848M357o654r013k22Q992
1247A612P008l694r820l363O797R028m77r279o567M219R971K708p592q118J502
1262f065R005N888n421r720j706P982Q019j963r527n069N887R916O51q867p042
1277h032L121Q886M225o223q825l86R165O879m243r356l419P273Q418q58r473
$$ y = [9551, 5862, -4845, -9473, -2392, 8065, 7700, -1526, -9458, -5529, 5915, 9574, 1605, -8151, -7277, 2691, 9168, 4132, -5941, -9284, -453, 8518, 6564, -3236, -9148, -3340, 6801, 8588, -447, -9003, -6078, 4354, 8820, 2408, -7478, -8402, 1281, 9067, 5596, -4616, -9086, -1901, 7465, 7312, -2215, -9108, -4964, 5614, 8839, 952, -8088, -6825, 2909, 9298, 3708, -6328, -8747, -392, 8076, 6575, -3346, -8730, -3182, 6231, 8287, -610, -8648, -5696, 4152, 8509, 1855, -7158, -7380, 1612, 8620, 4926, -4894, -8257, -1460, 7568, 7091, -2188, -8755, -4536, 5435, 8143, 551, -7567, -6065, 2940, 8828, 3407, -6313, -8019, -37, 7982, 6019, -3508, -8577, -2690, 7226, 7877, -990, -8032, -4911, 3975, 8200, 1977, -6848, -7234, 1931, 8810, 4567, -4789, -8208, -935, 7483, 6625, -2848]
1292b848n897M839R406K424p187q224R73R211O048n482r298j710P872P466k143
1307E450r010m979O318Q832O32p832p214K993R057L592o263q582K71Q680O045
1322G990l799q869k869O560Q408j133r474m940M317R241K202p230p717J757Q879
1337C323M717n235q618j768P896P319k650q795l998N928Q016Q16p818o921L251
1352d537Q877L249o685p748O10P810O188l775q687l081P392P608j255q398n528
1367g960M203R057K004p306p381J992Q674M451m899q483j350P465O938k780q427
1382c802l672N244Q127R15q034o260L496Q530K664o247p406M41P704O056l914
1397C842q845j655O409P261j072q344n253M392Q403J574p323o140J490Q288M699
$$ y = [-2848, -8745, -3906, 5500, 7924, 737, -7487, -6514, 2697, 8745, 3263, -6035, -7745, 127, 7593, 5450, -3560, -8539, -2221, 6611, 7243, -589, -7803, -4810, 4247, 7839, 1576, -7006, -6735, 1945, 7990, 4191, -4678, -7547, -987, 7421, 6288, -3186, -8126, -3809, 5432, 7634, 404, -7313, -5556, 3323, 8040, 2805, -5813, -7581, 315, 7634, 4984, -3811, -7809, -1881, 6135, 6951, -867, -7788, -4537, 4340, 7589, 904, -6844, -6234, 1576, 7764, 3989, -4698, -7779, -387, 7221, 5966, -2432, -7960, -3757, 5300, 7304, -2, -7383, -5391, 3283, 7734, 2835, -5648, -6998, 467, 7405, 4625, -3802, -7474, -2230, 5897, 6812, -1222, -7482, -3986, 4544, 7208, 961, -6445, -6004, 1700, 7756, 3842, -5003, -6658, -249, 7012, 5940, -2404, -7657, -3265, 5138, 6712, -611, -6751, -5261, 3027, 7726]
1412G726n051q357q30O941O345k447p773l827N380P877L88p834n681L021Q395
1427D273K937n959p871N24Q094N209m118p859k152O603O989j120p754n352M702
1442b854P929J539o844o612J895Q141M082m921p544r91O819N949k365p492l871
1457g140N608P137M39p424n450L300P911K826o298p319Q81P759M687l803p475
1472d361k107O356P248k274p697m079M208P534J353o834o148K437P776L361m592
1487B181p289q05O805N843k520q024l115O007O476l36o622n022K839P908K357
1502F683o045o655Q89P133M535l682p591j399O369N827j633p149l809M039P158
1517D670J349o525o134K413P463L098m156p097o79O461N425k520p553k575N174
$$ y = [7726, 2675, -5682, -6512, 429, 6774, 4327, -3446, -7273, -1893, 5984, 6372, -1462, -7143, -4122, 4273, 7210, 1251, -6620, -6096, 1998, 7207, 3089, -4770, -6922, -319, 6670, 5550, -2204, -7556, -2854, 5075, 6614, -230, -6842, -4947, 3194, 7276, 2355, -5189, -6180, 639, 6588, 4223, -3269, -7140, -1532, 5605, 6044, -1380, -6830, -3530, 4381, 7207, 909, -6410, -5529, 2230, 6917, 3114, -4361, -6468, -112, 7136, 4862, -2835, -6914, -2706, 4828, 6181, -653, -6801, -4364, 3412, 6773, 2181, -5108, -5913, 892, 6735, 4215, -3809, -6924, -917, 5559, 5223, -1399, -6421, -3582, 4326, 6683, 638, -6017, -5128, 2005, 6540, 2858, -4733, -6132, 237, 6064, 4431, -2718, -6527, -2488, 4670, 6019, -506, -6640, -4227, 3236, 6334, 2178, -4919, -5598, 863, 6288, 3768, -3785, -6360, -1186]
1532a186O477l73o306n123L246P497J809n771o195J466O480M402l733p290j265
1547e865N961O331j855p048m016M466P106O77o736n331K367P171L048m544o892
1562e160J5O421N241l063o898k798N363O456r47o659m176L693O375K025n298o008
1578e418N99P031M093m029p014r91O037N418j463o587l826M323O385P40o019n208
1594e929K143O773K911m518o436K77O290M485l065o584j902M725O008m11o704
1609a937m062L608O705J479n740n276J013O847L101l655o239j162N606N323j383
1624D228o898l098M216O073K23o010m631K374O357K985m837o038M17N915M659
1639E935k923o424k197N096N710q47o433l378L135O320J415n011n921J697O394
$$ y = [-1186, 5291, 4918, -1388, -6511, -3265, 4232, 6041, 270, -5925, -4459, 2021, 6423, 2690, -4600, -5865, 96, 6427, 4572, -2476, -6492, -2026, 5080, 5757, -979, -6310, -3943, 3228, 6276, 1732, -5160, -5145, 1276, 6517, 3454, -3444, -6242, -879, 5577, 4630, -2029, -6205, -2512, 3863, 5888, 590, -5418, -4819, 2212, 6305, 2276, -4738, -5729, 308, 5726, 4263, -2324, -6150, -1827, 4558, 5298, -721, -5929, -3786, 2987, 5898, 1380, -5056, -4779, 1511, 5996, 2931, -3653, -5555, -830, 5178, 4767, -1937, -5999, -2391, 4314, 5793, 53, -5223, -4210, 2637, 5738, 2083, -4156, -5318, 288, 5611, 4228, -2670, -5768, -1552, 4521, 4744, -1266, -5897, -3523, 2834, 5819, 982, -5056, -4639, 1276, 5935, 3012, -3412, -5609, -513, 5197, 4350, -2083, -5461, -2326, 3994, 5409, 398, -5523, -3826, 2568]
1654B568L002l512o289j198N308N746j959o689k470L898O096M91n943m468K042
1669c377O331K573m758n221R1N708M296k817o249j869N387M888j052n937l620
1684e626L323O255J477n662m800J416N746L174l436o223o28N444N113k449o062
1699b938k360M102N845J67n656m651K311O311K053m437n417L48N502M162k566
1714B776o289j850N138M702m10n512m235L311O499O52m697n122J529N647L004
1729E143l513n782k20M601N001k017n825k648M085N630N5n910l957K664N555K039
1745D901l730n738N01N732L268k289n804j327M238N106p27o140l178L573N643
1760D029Q73m846m798J481N757K589l572n402j010N632M149j878n578k598M278
$$ y = [2568, 5570, 2058, -4231, -5429, -121, 5625, 3666, -3023, -5493, -1595, 4501, 4992, -951, -5419, -3377, 2954, 5527, 769, -4452, -4361, 1347, 5643, 2826, -3423, -5292, 95, 4983, 3931, -2006, -5626, -2303, 3952, 5429, -233, -5033, -3617, 2129, 5303, 1867, -4356, -4984, 460, 5573, 3124, -2938, -5298, -1196, 4649, 4816, -840, -5491, -3180, 3131, 5184, 747, -4670, -4322, 1180, 5342, 2776, -3513, -5363, -225, 4477, 4067, -1445, -5680, -2369, 4130, 4782, 85, -5037, -3508, 2139, 5143, 1630, -4152, -4372, 229, 5230, 3213, -2612, -5260, -1175, 4455, 4510, -1400, -5357, -2693, 2862, 4901, 1171, -4567, -4066, 1666, 4934, 2645, -3159, -4486, -248, 4858, 4131, -2009, -5187, -1614, 4029, 4902, 56, -4742, -3261, 2496, 5085, 1513, -3889, -4899, 733, 4882, 3004, -2574, -5172, -894]
1775h94N549n93n144l807K062N478K385m619n105Q49N611L243k962n271j428M220
1791d26N375j201n879k726L205N011J217m880m291J380N699K391l634n290k04
1806d253M578M339j882n604j844L881M888k52n167l307J896N879J452m059m889
1821d344J050M846L201k756n301j177M546M612j616n280k590L163N451L36m840
1836f99l490J617N346J714l403m792o61N161M210k634m936k157M099M663k22m866
1852a050l864K842N047J257m162m314R64M918L006k699n285o07M115M346j382
1867C132n132k935L245N189P83m894m043J813N260K146l538m918N7M969L497k078
1883B553n272j884L892N008p90m835l213K629M584J519l788m423Q24M706K845
$$ y = [-894, 4655, 4062, -1082, -4889, -2827, 2651, 5036, 417, -4688, -3839, 1772, 5015, 2053, -3218, -4646, -426, 4949, 3748, -2131, -4857, -1652, 3359, 4576, -304, -4595, -3215, 2484, 4875, 1241, -4049, -4253, 325, 4664, 2782, -2822, -4666, -785, 4103, 3851, -1316, -4623, -2727, 3152, 4604, 545, -4344, -3294, 1552, 4753, 1997, -3304, -4481, 65, 4677, 3061, -2219, -4809, -1646, 3805, 4141, -699, -4189, -2572, 2774, 4488, 1085, -3707, -4368, 793, 5003, 2369, -2567, -4724, -625, 4038, 3816, -1050, -4914, -2072, 2975, 4232, 70, -4244, -3280, 1638, 4644, 1945, -3340, -3947, 168, 4514, 3132, -2000, -4935, -1690, 3499, 4282, -612, -4655, -2842, 2418, 4564, 1026, -3892, -3835, 1134, 4631, 2553, -2719, -4603, -711, 4297, 3507, -1328, -4541, -1912, 2672, 4191, 403, -4020, -3196, 1510, 4355]
1898D355k667m929p29M462M028j090n334k844L563M738J51m418l535J634M839
1913B224K560l613m990L00M274L590k113m927j447L604M486o92m440k920K078
1928b026M952J188l989m283J024M972K265k689m531o11M248L658j456n093j963
1943d334L219M091Q82m441l769K045M767K236l646m895K69M377L645k289m824
1958b667j519L822L985k32m824k925K680M497J095l890l927J061M843K052k596
1973A455m463p66L820M281j752m748j993L406L877M55m627l334K201M686J476
1988C974l528l896M6M364L232k083m584j384L690M006o06m818k517K691M134J250
2004C971m289l570Q46M886K184k813m442n0L758L474j425m477k081L150M212K88
$$ y = [4355, 1688, -3241, -3970, 492, 4520, 3430, -1904, -4748, -1185, 3553, 3704, -714, -4249, -2615, 2224, 4784, 1171, -3819, -3519, 755, 4345, 2232, -2695, -4142, -538, 3948, 3256, -1184, -4104, -2026, 2926, 4114, 125, -4158, -3134, 1838, 4103, 1414, -3117, -3728, 520, 4178, 2722, -2371, -4334, -1115, 2976, 3858, -583, -4352, -2307, 2460, 4696, 1050, -3845, -3576, 801, 4446, 2157, -2667, -4186, -364, 3621, 3389, -1435, -4360, -1680, 2817, 3912, 22, -3905, -2844, 1999, 4051, 1455, -3008, -3774, 46, 4327, 2575, -2173, -4166, -760, 3117, 3572, -1055, -4389, -2188, 2498, 3974, 446, -3450, -3404, 960, 4192, 2109, -2475, -3859, -169, 3837, 3231, -1587, -4104, -1413, 2721, 3971, -318, -3888, -3042, 1844, 4028, 1215, -3227, -3277, 481, 3955, 2530, -1947, -4028, -878, 3334, 3622]
2020C622m566l208K119M413J480l280m129K68M428K923k391m371j391L748L905
2035C570m88m558k762K923M278O49l824l497J146M355K396l302m434K15M025L194
2051C886j523m749j487L051M092j87m181k880J966M243J786l632l771M97M027
2066A138K958k311m209j122L283L506l74m331k488K635M088N72l789l392J356
2081b480M310J799k659l569n82L712L281j477m210j801L050L688o9l915k812J646
2097b088M559R89k997l981Q44L885K727k438m118q28L382L552j022m216j738K251
2113a237M123M06l456l356J332M211J692l106l521m12L982L171j687m198j589
2128c645L172L552j29l738k927J885M262Q47l129l254L51M261K228k328m093r53
$$ y = [3622, -944, -4152, -2033, 2380, 3860, 580, -3549, -3281, 1147, 4070, 1679, -2692, -4083, -335, 3570, 3082, -1476, -4238, -1315, 2963, 3612, -212, -3709, -2563, 1792, 4188, 886, -3548, -3333, 692, 3886, 2363, -2386, -3873, -822, 3270, 3083, -1098, -3978, -2012, 2231, 4017, 385, -3386, -2889, 1138, 4096, 1785, -2424, -3546, -263, 3243, 2869, -1462, -3950, -1315, 2773, 3345, -444, -3836, -2480, 1830, 3629, 970, -2599, -3181, 531, 3812, 2335, -1875, -3676, -626, 3062, 2993, -922, -3734, -2088, 2471, 3460, 463, -3518, -2674, 1211, 3938, 1500, -2618, -3446, -64, 3488, 2466, -1750, -3488, -1237, 2886, 3292, -164, -3520, -2188, 2023, 3715, 609, -2912, -3324, 658, 3829, 2142, -2056, -3645, -473, 3079, 2950, -788, -3715, -1830, 2432, 3279, 150, -3104, -2753, 1508, 3736, 1408, -2685, -3638]
2144c638L630L340p94m087j874K081M257J56l482l242J605M071J280k482l864
2159c043J79L553K954j541m502j182K946L558k56l826k559K021M000P76k818l416
2175c156O33L890K107k159m062l81L151L408j173m034j814K618L754M10l730k624
2191c162J045L896J702k578l787l0L675K597j678l835j034K675L498J9m118k655
2207c770K292L596J007l032l349P11L649K299k114l801j61K867K745o30l744j795
2223c230K641L647J63l807k687J321L899J317k775l336L26L592K137j279l948
2238b019j381L396L055n16l895k175K247L278R43k866l276R47L724J844k250l575
2254b519l31K979L049j170l863q24J919L199L47l368k405J168L603J281k707l298
$$ y = [-3638, -8, 3332, 2538, -1549, -3423, -1342, 2915, 3071, -411, -3653, -2048, 2023, 3303, 821, -3043, -2864, 689, 3643, 2102, -2400, -3582, -636, 2922, 2666, -1160, -3719, -1698, 2302, 3078, 260, -3156, -2523, 1367, 3474, 1315, -2747, -3128, 23, 3431, 2258, -1776, -3590, -972, 2782, 3192, -538, -3162, -2117, 1779, 3481, 903, -2884, -2914, 761, 3358, 1680, -2155, -3189, -514, 2984, 3003, -1115, -3770, -1478, 2118, 3125, 93, -3256, -2545, 1104, 3403, 1289, -2512, -2673, 194, 2939, 2309, -1435, -3230, -589, 3058, 3221, -586, -3273, -1952, 1947, 3264, 489, -2847, -2521, 1071, 3208, 1929, -2019, -3400, -4, 3051, 2535, -1360, -3535, -1288, 1990, 2933, 67, -3209, -2262, 1462, 3306, 1056, -2519, -2850, 129, 3178, 2008, -1855, -2679, -760, 2439, 2786, -582, -2987, -1819, 1784, 3065, 358, -2940]
2270b940N32L018K721j363l929j040K862K919l77l476k157J851L553Q51k920l248
2286c143J150L022K135k204l154p79L376K645j486k715j978K319L296J35l290
2301f71k243J241L505J103k587l312N48L154K419j513l726p37K837K847n40l592
2317a267j639J901L245M67k708k981R73L176J815k313l101j74K652K491p64l105
2333a332j605K355L123L0l180k392J502L128J334k212l508Q15L047J754j566l576
2349b283m11K581L026n14l393j828J873L264N84k992k706J016L055J784k218l322
2365b484N0L170K034q39l304j734K415L356l76k968k202J586L029J103k587l159
2381b910P79L143J781j703l088r32K935K813p09l130k048K146K841O39k651k769
$$ y = [-2940, -2408, 610, 3331, 1968, -1961, -3001, -139, 2780, 2403, -1073, -3230, -1379, 2174, 3025, 105, -3143, -1993, 1029, 3164, 960, -2194, -2973, 403, 3048, 1562, -1153, -3131, -812, 2484, 2619, -671, -2914, -1673, 1832, 2935, 348, -2964, -2416, 738, 3157, 1644, -2082, -2819, 18, 2865, 2325, -1267, -2906, -1005, 2240, 2707, -1, -2982, -2009, 1167, 2982, 669, -2432, -2606, 46, 2537, 1773, -1332, -2937, -582, 2541, 2571, -609, -3001, -1499, 1629, 2963, 751, -2757, -1942, 1105, 2859, 1293, -2283, -2694, -113, 2913, 2399, -994, -2822, -949, 2315, 2899, -93, -2799, -1783, 1272, 3056, 838, -2484, -2434, 736, 2770, 1931, -1373, -3107, -692, 2664, 2288, -680, -2882, -1296, 1733, 2836, 249, -2910, -2131, 1012, 2793, 1090, -1998, -2930, 5, 2818, 2109, -1021, -3069, -923, 1918, 2557, -94, -2863]
2397b863R20L207J353j919k935m41L182K295j079l536r85K409L005k40k995k335
2413b957J615L058J120k603k725N05K812K100j679l381n83K725K706q19k892j720
2429b718J798L091M87l017k129P16L129J494k074l174J01K771K051q33l352p02
2445b361J895K964n73l022j292J244K780R51k520k492J22L233J764j640k863o39
2461b449K705K081n79l304j147J650L183K71l055j995J018K811J569k132k952
2476b325j8K901K153j291l035j054K515K468j69k610k259J426L026P37k455k353
2492b343M79K870J620j868k788k02K128K530o63k779j403J881K759j18k490k253
2508b640J172L074R08k197k371L14K750J263r56k813j034K309K701q57k345j953
$$ y = [-2863, -1943, 1264, 2617, 698, -2237, -2678, 504, 2799, 1720, -1816, -2801, -392, 2613, 2373, -622, -2957, -1342, 1716, 2836, 233, -2492, -1987, 825, 2925, 1246, -2135, -2718, 7, 2713, 1894, -998, -2718, -920, 2171, 2658, -359, -2488, -1772, 1357, 2851, 777, -2397, -2296, 475, 2526, 1693, -1659, -2361, -466, 2498, 1925, -1097, -2389, -1145, 1635, 2586, 66, -2426, -2304, 929, 2693, 1053, -1810, -2449, 256, 2337, 1758, -1546, -2693, -1043, 2140, 2411, -644, -2639, -1621, 1190, 2759, 627, -2325, -2343, 558, 2711, 1420, -1615, -2669, -154, 2314, 2145, -465, -2724, -1298, 1728, 2465, 10, -2343, -1864, 1006, 2626, 758, -2030, -2232, -104, 2426, 1763, -1016, -2419, -538, 2221, 2103, -387, -2640, -1468, 1606, 2514, 317, -2054, -1740, 1010, 2273, 1317, -1496, -2530, -221, 2480, 1623, -722, -2675]
2524b675J312K834J090k373k391L83K918J370j864k170l93K023K122o85k596q69
2540a964J392K403O8k300j962R69K538J163k010k095J15K160J756j227k530r94
2556b518K619J912n98k015j548J327K500K61j891k028M51K731P27j404j968m38
2572a880K068K127p58k556j286J739K134l4j881j790R10K272J025j769k138M43
2588a374J993J846j192k827n44K083K010n09k329j198J245K187P07k244k184J043
2604a287K119J394j563k383n50K159K119q37k150j079J276K261P2j860j668J073
2620i04K158O59j639j931J45K154J744j287k206q65J909J910o07k161j286J373
2636h34K454L21k100j797N76K428Q91j333k182j19J891J645n58k426j022J781
$$ y = [-2675, -1363, 1471, 2561, 188, -2203, -1820, 1098, 2468, 604, -1566, -1959, 64, 2186, 1501, -1095, -1964, -572, 1831, 1899, -401, -2363, -1394, 1144, 2307, 297, -1798, -1683, 477, 2233, 1006, -1524, -2518, 101, 2013, 1415, -600, -2148, -821, 1679, 1940, 49, -1979, -1528, 1203, 1930, 526, -1442, -1880, 188, 2315, 1557, -999, -2285, -546, 1588, 1554, -327, -2117, -1207, 1065, 2090, 321, -1817, -1374, 619, 2465, 1273, -1554, -2098, -15, 1995, 1486, -843, -2041, -796, 1391, 2098, -146, -2330, -1287, 832, 2226, 663, -1720, -2270, -111, 2008, 1171, -979, -2058, -782, 1479, 1551, -309, -1977, -904, 1254, 1913, 274, -1657, -1512, 642, 2386, 1099, -1107, -1972, -63, 1847, 1240, -921, -2207, -834, 1620, 1941, -159, -1956, -1380, 1048, 1939, 606, -1576, -1695, 196, 1841, 1283, -1143, -2165, -384]
2652c84K112k01k172j496J271J994R19j915k080M88K226J167r07k373m09J653
2668a07J955k44k466j263J632K016L30j908k138P07K663R78j852j706j80J698
2684A15J914q35k341q01J869J813k29j973j541J074K253O37j859j871O17J565
2700D07J272p77k358P1J327K076p39k210r89J515J816M65k039j771P17K150P19
2717A652j046k310N0J828J584o08k398o31J421J835q0j861j438J352J890N26j485
2734B81j788K03K010J368j462j873n02J594J932n80j905j433J632J809M72j956
2750a98j722P38K124R09j649j415k98J697J834j458j749l95J512J582N7k338j036
2767a805Q02K255N36j810j324K07J682J382j396j811l32J654J624o62j720j222
$$ y = [-384, 1728, 1527, -645, -2141, -870, 1124, 2043, 128, -1952, -1464, 762, 1929, 1022, -1351, -1760, -107, 1848, 1604, -862, -2125, -493, 1523, 1853, -55, -2193, -1486, 1177, 2155, 303, -1403, -1583, 115, 2029, 1194, -1147, -1948, -79, 1734, 1505, -468, -2009, -935, 1318, 1955, 96, -1775, -1158, 407, 1679, 902, -1456, -1385, -58, 2018, 1279, -931, -1920, -405, 1411, 1876, -163, -1934, -1217, 933, 1652, 606, -1704, -1654, 174, 1758, 1150, -1248, -1879, -458, 1377, 1297, -564, -2002, -650, 1240, 1766, 281, -1507, -1304, 706, 2074, 612, -1261, -1763, -169, 1763, 1183, -722, -2155, -523, 1286, 1758, -198, -1920, -1182, 942, 1851, 202, -1213, -1511, 186, 2020, 562, -1187, -1582, -70, 1512, 1569, -769, -1805, -1003, 1252, 1788, -22, -1346, -1139, 543, 1925, 529, -1282, -1614, 40, 1664, 1002, -718, -1940]
2783a940J431K061k01j687j170N88J939O64j291j932J80J643J458p94k216l90
2799a657J677J684o95j403j249O49K071N62j444j831N21J693J216j366j681q3
2815a336J164J541l21j787q21J031J986m3j954j181Q69J943N11j241k099M30J790
2832D82J188q99j835o76J554J662k62j831r79Q65J925Q4j085j557J44K215N43
2849A538j048j929mJ372J558o18k244j50R01K067m4j761j255L77K096P88j463
2866A81j499q2J813J025q58j468n03J219J814n58j788p60Q35J939J92j547j570
2883a615Q29J294J262j561j564K57J534J237p94j809q16J537J607l47j425j222
2899a596N92K026K98j002j858Q53J293R80r88j485p50J750J375m82j342j262J029
$$ y = [-1940, -509, 1552, 1351, -336, -1506, -918, 1021, 1685, 394, -1538, -1358, 285, 1743, 949, -1267, -1657, 20, 1704, 1009, -394, -1643, -994, 1077, 1639, 195, -1636, -1115, 578, 1794, 428, -1253, -1336, -172, 1369, 1048, -739, -1560, -529, 1457, 1414, -540, -1721, -852, 1091, 1602, 361, -1738, -1308, 482, 1670, 771, -1064, -1740, -186, 1476, 1214, -617, -1596, -731, 1194, 1278, 193, -1364, -1220, 995, 1538, 490, -1439, -1443, -71, 1487, 869, -1375, -1525, -624, 1443, 1399, -362, -1617, -1240, 856, 1644, 181, -1318, -1400, 413, 1438, 580, -888, -1391, -172, 1642, 1084, -704, -1464, -629, 1310, 1502, -45, -1615, -786, 508, 1770, 209, -1355, -1098, 436, 1673, 879, -930, -1746, -209, 1398, 1051, -374, -1596, -1004, 1022, 1320, 318, -1540, -687, 606, 1586, 598, -887, -1637, 113, 1488, 1006, -336, -1598, -569]
2916e69J700K31j408j514N77J970P13j207j790j8J803J004p66j301j232J794J044
2933A031L19j878j319J130J560N23j320j329L13J592J014j016j738k76J669J009
2949A284O6j884j166Q22K088J67j785j110L39K001P82j155j765P4J278J325p14
2966F47j464m88P17J887K41k031j089O92J786K85j205j397O61J086J098q92j528
2983i94n26J624J211m20j588q03R76J703K36j660j103N15J610O78r43j642k08
3000a334J801J168r88j302p09J455J179l07j453p13O49J434L68j540j150K78J629
3017D65P39q74j191m66J392J271j41j596j041Q80J495K62j500j004K13J706P42
3034A352j487j151R5J173J685q36j802k75J546Q20j33j308j035N62J685N79j490
$$ y = [-569, 1131, 1362, -46, -1560, -983, 987, 1700, 493, -1297, -1315, 488, 1492, 726, -575, -1807, -13, 1031, 1350, -528, -1847, -717, 843, 1366, 46, -1283, -970, 622, 1636, 620, -1118, -1394, 275, 1284, 1350, -534, -1700, -878, 1210, 1377, -408, -1518, -1179, 822, 1604, 449, -1316, -1242, 36, 1361, 647, -817, -1305, -588, 1299, 1540, -491, -1580, -888, 898, 1183, -22, -1419, -758, 328, 1426, 534, -994, -1520, 104, 1315, 895, -693, -1496, -520, 1183, 1419, -241, -1344, -829, 781, 1459, 516, -1126, -1334, 467, 1635, 647, -655, -1364, 91, 1270, 963, -490, -1203, -554, 880, 1248, -292, -1442, -1164, 465, 1204, 330, -861, -1327, 65, 1336, 1195, -401, -1442, -562, 933, 1195, -305, -1309, -1096, 610, 1352, -135, -1286, -1191, -18, 1667, 831, -971, -1246, 300, 1120, 987, -321, -1356, -794, 891, 1470, -20]
3051b0j083K04J882J51o84j350o67J574J381j26j737r75J192J243L09j687q28
3068a221P40J104O02j092j181j04J429J044o06j598n47J135J707l44j648o68Q97
3085c51J223M65q82j628L11J435P94j017j393k20J350J205m20j630l28R66J123
3102A003J0j158j082N97J216N58r69j522J43J571O57m81j556n55J340J266j7j532
3120e11q28O14J600K41j089j378M25J274P19n02j758P3J140J201j32k092l93J218
3138a78J535l34j239j163O20J676L67r55j376n3J667J076j024j542l95J447J153
3155A282l75j249r29Q64J184J44j086j081N57J461L79p29j474L6J158J036l80
3172G98j658l49R21J327Oj297j099O42J216O25o48j551J70J262Q72n17j604k23
$$ y = [-20, -1103, -899, 983, 1134, 450, -900, -1567, 7, 1388, 1262, -475, -1450, -258, 985, 1294, -393, -1221, -481, 623, 1225, 133, -1048, -1152, 277, 1321, 715, -883, -1430, -295, 1412, 1068, -580, -1248, -351, 872, 1337, 455, -1173, -862, 573, 1367, 350, -1043, -1263, 87, 1292, 872, -758, -1086, -120, 1003, 1013, -145, -1227, -630, 586, 1144, 175, -1347, -1204, 367, 1024, 543, -1013, -1568, -228, 1038, 1021, -511, -1339, -725, 875, 1116, 27, -1351, -926, 348, 1067, 565, -1193, -1120, 20, 1221, 1089, -1003, -1396, -178, 1357, 1023, -216, -1379, -759, 917, 1284, 329, -1047, -1100, 567, 1643, 619, -923, -1318, 129, 1282, 907, -342, -1271, -407, 777, 921, -165, -1246, -689, 772, 1151, 422, -1052, -1016, 142, 1178, 798, -860, -1209, -288, 1039, 1045, -252, -1351, -709, 507, 1132, 484, -1067, -897, 365, 1237, 720, -884, -1107]
3190a107J294R74j18j231r52Q43J333K00j469q55K29J422P16j161j052r4J572
3207E44P57o78j372m93J192J169l07j230j011J277R06M26j045j047M0J078J224
3224A430r12j198k83Q81J079Lj207p86M30J610L8r33j280O40J010J075j244j450
3242a097K52P52J222n44j191o09J169J055J82j454j079O91J391N41j491r02Q0
3259a032J376Q63p39j274l88J177J116n25j226m10O49J408J8j243q78J99J700
3276G91R9p01j036j91J222J150p50j195n22Q73J161Q4j492n56O19J325L24j360
3294a55j074N00J287O74q42j188j36Q52J205l45j386n75P02J480j49r96j101Q01
3312d46J017P92j421j072JJ444Q90p74j093l93Q19J338jj267q57O57J262J54j177
$$ y = [-1107, 187, 1161, 1043, -188, -1140, -297, 1036, 1236, -233, -1088, -859, 563, 1279, 118, -934, -1028, 544, 1301, 623, -749, -1242, -50, 1119, 812, -418, -1429, -152, 754, 1180, 135, -912, -872, 206, 1430, 518, -680, -963, -82, 997, 1000, -207, -993, -563, 1047, 1085, 152, -1128, -488, 522, 1597, 353, -1097, -845, -93, 1129, 585, -606, -1215, -46, 1009, 1191, -263, -1342, -651, 740, 1281, -210, -1112, -1032, 344, 1207, 468, -806, -1194, -17, 1099, 574, -652, -1062, -413, 995, 1013, -230, -1108, -909, 791, 890, 189, -847, -1038, 184, 1334, 584, -611, -1133, -260, 901, 985, -507, -1063, -444, 881, 1205, -155, -1229, -729, 558, 1232, 390, -798, -934, -82, 1123, 778, -608, -1183, -481, 999, 850, -146, -1247, -446, 571, 1363, -58, -1130, -1129, 315, 1205, 431, -662, -1055, -236, 1102, 1101, -166, -1023, -366, 896, 1050, -127]
3331a27q52J43J370O60j036j068k09J350Q58o98q81n49O62J338m1j151q46M48
3349f29Q67O30p52j091L06Q33J119q53r09o79Q73J322n69r39p11M95J521K91j052
3368G3q65K29J217M15n98j131l73R96J024l67j326l07O25J222J1j090p74M65J380
3387H26J50r30j257N64P89R39r05q72l37J054O98m14o58l44L52Q09N65j183j236
3406a390P70R90P44p87q32k35O04J204l68j263k32Q66R09l05r12q83O11J277J42
3425I10q55q75m0J166O50n16j103n02J390O45k27j181m78Q34R33P0q44q47K16
3444f54J372L06r29r55J09Q37P31k04r81p07R89R66r5j275l01N25J004L37j047
3463B8j125J64J414Q45p37j188l53J049O45j83q54o84P24J139Q6r91r35M28N71
$$ y = [-127, -979, -836, 534, 1194, 158, -910, -1119, 231, 1089, 391, -490, -1039, -377, 961, 920, -231, -1077, -629, 238, 868, 116, -975, -669, 164, 1283, 430, -479, -1158, -285, 1037, 468, -471, -1182, -687, 834, 1125, 73, -792, -563, 654, 1069, 471, -660, -1033, -37, 987, 620, -706, -1013, -388, 834, 845, -245, -1019, -554, 826, 976, 46, -1211, -647, 142, 1081, 176, -696, -1033, 21, 719, 305, -353, -697, -345, 464, 1029, -154, -1390, -620, 370, 1114, 327, -505, -740, -136, 1068, 700, -563, -795, 71, 980, 675, -237, -1120, -509, 768, 910, 55, -820, -860, 306, 956, 440, -663, -1165, 225, 870, 643, -538, -1016, -182, 751, 821, -23, -870, -654, 718, 1024, 95, -860, -751, 86, 817, 613, -368, -1075, -86, 880, 785, -490, -791, -266, 738, 1075, 28, -1097, -933, 481, 1326, 589, -599, -952, 97, 742, 559, -295, -979, -255, 884, 970, -21, -956, -528, 43]
3482D3Q18j078m44OR50O34l87j172n06J115Q72J91j085o99M52J339k98p45p71
3501g65J43R94N84o69r57j96P30J021m23j094l46P96P08K43q77p29Q0J519L16
3520A078q11j437N87P63Q68n71j237m11J237N52J75j277l44K93J409R3j007q35
3538h75J23J166K75l71j228O2P82R21k09j243l63P74P01J30j058l79o4J439L60
3557I43n67r36J13N41Q19l09j265q1N09R90r1q72p60M72J305q7o35q81Q6J036
3577C30O47p21q36l48J227P22p63j018k44J031R76k98r86m63M51J152P5p49r39
3596g54K07O90J081q64j061k26J087M16q2j005k70O95Q80L5j083q15M33J147N17
3615A028r21r57R4Q39O91o12o73k54O57J312m52r33p89L08J122M43q30q70j42
$$ y = [43, 861, -217, -661, -655, 295, 929, 542, -630, -1136, -21, 851, 1042, -43, -742, -290, 1049, 751, 6, -765, -622, 372, 956, 287, -670, -866, -136, 885, 462, -632, -978, -182, 526, 769, -108, -837, -757, 762, 1078, 267, -1170, -583, 180, 1048, 477, -760, -1171, 66, 618, 793, -484, -828, -535, 874, 967, -40, -875, -752, 414, 689, 318, -910, -848, -66, 855, 646, -597, -960, -186, 515, 645, -413, -792, -856, 583, 943, 376, -560, -447, 94, 913, 604, -661, -742, -233, 757, 666, -206, -966, -494, 811, 724, 89, -792, -706, 330, 977, 256, -580, -928, 299, 1021, 258, -760, -1004, 27, 1003, 705, -281, -744, -293, 859, 934, 185, -754, -547, 143, 1224, 360, -701, -927, 160, 576, 494, -511, -781, -86, 794, 829, -254, -1069, -636, 511, 1028, 107, -850, -756, 83, 774, 162, -511, -765, -108, 1204, 752, -181, -970, -662, 460, 903, 73, -797, -939]
3634i39J275O97r49n69l02Q69Q37j00j418n25P48R38K59r66q71J41J332L24m81
3653C00q49j65Q69O10k90r50l43M25J150Pq65q87Q23P23J47o15r62KJ067J162
3673A359j122n87k41M99J147p97n25m97P37Q39L4r39p46L82J011J69p12q00K28
3692e61Q03O53j50j162k05L31J194m92o12m73J80J361j96n89j206K27J531m4m37
3711A53n96m99J128N25l73q65l49O38O62K06q90m59K07J099M30p48r97M9R54L92
3731F67r3j184m57J156O72j64p12q89N88J217r8r71l56L83O32K62l04q45P7O29
3751B10P44m28q32l91O75O17k30o55m34RJ180J23n68o41n9O94Q02n64n38m74Q86
3772A26R58n75j079j23N68O05L03o78p82L67N79L23k76j266M78N29R46n36q46
$$ y = [-939, 336, 1033, 84, -485, -787, 82, 919, 819, -599, -1124, -376, 562, 821, -145, -1016, -875, 457, 781, 300, -549, -714, 155, 765, 475, -475, -818, -393, 757, 764, -101, -988, -165, 558, 705, 90, -872, -870, 197, 1359, 237, -350, -591, -92, 1055, 258, -267, -764, -27, 812, 846, -93, -839, -457, 554, 723, 11, -789, -561, 242, 895, 745, -417, -622, -291, 903, 411, -201, -674, -494, 867, 671, 82, -1124, -897, 634, 590, 153, -443, -942, 186, 711, 338, -527, -876, -238, 424, 630, -260, -719, -512, 587, 1017, 269, -728, -679, 275, 667, 574, -610, -1067, 89, 761, 597, -115, -1004, -416, 801, 703, -268, -624, -241, 391, 653, 349, -496, -419, 210, 954, 526, -306, -697, -22, 595, 365, -290, -724, -715, 465, 588, 20, -621, -680, 14, 816, 252, -286, -760, 126, 1084, 509, -570, -693, -125, 480, 783, 105, -677, -310, 269, 592, 316, -950, -472, 57, 1003, 467, -379]
3791c79m09M52Q85J38j229l35M87J101Mo88m28k71Q10N99n2j183l7M01R69n07
3811C28o14n72Q14P65j1q45o22L10R26L79n20r27J9N89P32l93q07k28R44K67K6
3832E60o49q06N88P81J32m06r80K63R48R0l08q28N1M45J055m55p17m25L81R82
3852G02j56p78n15J73P64N09o95n63K04P74J94q2j050K9M37Q91l08p77o54L93
3872e08J045K12p33n05J29M07P82p17o32o4Q02O91p24k43p56N03Q60J30r26j35
3892c82L0P68L17n99q12K78Q54K51j45j280J2O92M97M2m34p57N31N11K05n42q88
3913h51M34N56M91l96r51o1J050N68j58r45k16L40O87j21o49k71j03J084L40l34
3933D94j273k0Q56M87m24p87kO61N31K6r98k90N08O88K97n88n06j38O48K42m89
$$ y = [-379, -788, -336, 549, 687, -542, -877, -390, 711, 715, 27, -401, -672, 138, 737, 685, -498, -535, -134, 835, 328, -286, -858, -44, 721, 710, -135, -757, -447, 479, 858, 338, -589, -570, 19, 751, 358, -449, -677, 267, 534, 560, -89, -895, -307, 474, 606, 200, -780, -517, 431, 521, 213, -615, -564, -119, 936, 481, -236, -661, -280, 702, 546, -232, -747, -574, 190, 699, 4, -559, -355, 419, 613, 531, -519, -490, -53, 838, 530, -247, -901, -508, 537, 749, 16, -489, -360, 47, 829, 112, -520, -584, 218, 909, 185, -58, -814, -311, 549, 679, -247, -382, -352, 416, 733, 134, -678, -400, 454, 705, 560, -720, -708, -16, 481, 523, 89, -668, -137, 374, 579, 37, -851, -417, 139, 630, 234, -717, -778, 272, 840, 682, -263, -479, -139, 548, 427, -222, -493, -596, 488, 828, 494, -779, -799, 57, 544, 120, -667, -669, -8, 523, 549, -449, -739, -231, 457, 754, 166, -340, -478, 170, 412, -77]
3954g7l65k60N84R13k36q96j70K50P24%o87p11O78Q35R5n27j129M19R14L81l62
3975C73p35k65O19P50k94o18n16K31R47J6m02q05Q2Q80K85k69r85MO89J171p89
3996C69q61J7L76O74J36j017m69L35R91m7n38p10M66O68M43m51r10j34N20L62
4016B20K68p03k88N22L75J11m50q07J50J008L04o63m13j12P89P07o85o84k85M55
4036a81R04k83o71j96J35P15L07r21n55J37J118L42o84n58n40J104M48l98l38
4055a15p10O45Q24m2p83n98K82O71M27m41j007K95O28O76m25p72k29N13R83l88
4075D34q09m91N46O66L65r28j88l00J092L38o09n16l47Q19O55k03p43n55N00J033
4095G59l39n34o85M68O59O34p05r28K14Q66L94p83m22l04N39N19L20r43k08K84
$$ y = [-77, -442, -702, -118, 795, 559, -337, -507, -257, 467, 467, -220, -931, -253, 582, 677, 150, -979, -560, 354, 735, 373, -362, -627, -8, 742, 448, -170, -686, -455, 492, 508, 106, -699, -617, 263, 548, 279, -706, -702, -13, 1158, 369, -492, -475, -99, 575, 711, -306, -775, -440, 551, 504, -34, -744, -278, 390, 833, 382, -528, -662, -142, 220, 488, -215, -503, 19, 394, 505, 55, -752, -602, 406, 710, 47, -366, -478, 311, 1018, 333, -351, -636, -181, 723, 440, -231, -427, -292, 423, 730, -191, -746, -609, 509, 851, 167, -391, -931, 173, 621, 223, -115, -825, -180, 644, 602, -181, -779, -497, 174, 601, 160, -847, -552, 76, 752, 327, -445, -674, -161, 822, 434, -375, -866, -320, 346, 711, -217, -405, -705, 387, 725, 116, -400, -747, 72, 727, 524, -219, -774, -274, 759, 420, -114, -799, -331, 328, 962, 257, -671, -457, 409, 803, 20, -402, -706, -167, 352, 672, -271, -479, -195]
4115a95Q86j37m23o63Q3O46L33m94l29j33O17P3k03l46m87P26O47j16q56l72L96
4136c47M06N75o56m45n9O44K70j90o93l21P88O44j86n99m28L88R14l32l84m87
4156d98j5N44O66n97p28L49M54P11n04p11l82N98P24j05o96k45J49N60L24n59
4176C9o95J35O55M37j20q76j39N95M88J20o77r08O30Q96n3p86n99N73N68K91m76
4197I8r55L45O86O74k42q12n25M76N83j24k81l60R3R15q2k37p49M5M83P22o58
4218I5k91k47L17O05L9p20k72K50O42K71q30m28K44O47L26o02n04r6P35L37k65
4239B53l88m85M96Q10R1j016k95N58K38L40l86p95L72L49M46m76n79kL97N14k58
4260A84m27k91N10O81k8l99p25L9P65L99r35m93J05R27L93m61r87M31K29N53q7
$$ y = [-195, 691, 554, 131, -532, -449, 197, 530, 36, -293, -426, 191, 264, 61, -285, -772, -46, 601, 485, -371, -743, -347, 59, 634, -22, -467, -526, 118, 388, 198, -495, -816, -28, 616, 430, -169, -597, -209, 705, 373, -11, -498, -513, 31, 697, 100, -628, -279, 175, 886, 382, -329, -711, -113, 611, 506, -190, -435, -286, 274, 598, 39, -656, -521, 134, 571, 451, -425, -564, 31, 519, 639, -38, -946, -316, 580, 527, -259, -858, -285, 283, 574, 98, -857, -512, 174, 848, 606, -206, -731, -255, 328, 204, -77, -437, -344, 571, 489, 252, -497, -452, 31, 753, 95, -196, -443, -126, 479, 518, -202, -474, -224, 418, 689, -141, -569, -325, 322, 648, 46, -458, -554, 181, 518, 253, -135, -620, -124, 686, 777, -239, -534, 24, 262, 602, 216, -579, -207, 142, 588, 112, -467, -469, -72, 442, 184, -243, -534, -24, 657, 629, 230, -495, -456, 309, 708, -227, -720, -615, 312, 705, 244, -743, -312, -83, 470, 383]
4281C83o27o34O22N77J52m52n34K78K95P45n21n20n4M54L50l24n06m99M85P79
4301D49J9l98p70M86M78N19o85p32o4P21O24k82p03n1J16R01J13q54m73L19P05
4322D38K6k62q51L98O81Kj77o10l10P56J0J74o46j79L68N64J64q06k79L80N33
4343C74J90l79p34l13J141L72k55n84m15L13J071j49j087L0J43L88N47n84k38
4362a69rL77L88k96p53PO22N17k96n52l26L64O59r5n23m88N57K80J87p06l11o9
4384f35Q47K04k10o98j8N34K24L54j082j51N91L11M51q56k97R7O77J16l83n77
4404e01n7P45M07l17o50k67P34K48lk19q02L77N75M99q52m87J36O19L28l73m75
4425c35o9N31M20k68m41k32j38Q20K35n50l23P8M17J57k75k74l83Q19L05j14o42
$$ y = [383, -244, -878, -256, 321, 473, 21, -513, -235, 60, 805, 284, -236, -290, 164, 514, 190, -316, -815, -330, 449, 468, 70, -700, -214, 264, 783, 98, -634, -698, 23, 647, 365, -338, -389, -273, 628, 741, -113, -586, -267, 438, 464, 202, -649, -251, 430, 432, 255, -355, -665, 91, 101, 275, -371, -550, -182, 382, 546, -260, -539, -159, 374, 564, 185, -549, -862, 279, 651, 396, -188, -603, -290, 781, 632, -455, -425, -282, 106, 653, 69, -169, -178, 199, 587, 291, -462, -455, 167, 684, 388, -164, -490, -126, 533, 438, -85, -573, -16, 264, 451, -255, -566, -635, 212, 416, 206, -492, -510, 24, 248, 602, -480, -631, -40, 271, 722, -134, -431, -334, 343, 459, 76, -501, -558, 187, 594, 277, -373, -640, 94, 342, 339, 120, -682, -305, 270, 769, -83, -570, -434, 185, 513, 140, -335, -404, 127, 547, 279, -162, -394, -532, 288, 523, -27, -350, -272, 145, 302, 27, -247, -630, 189, 494, 380, -262]
4446b62l24J28Q73M9o83l61K19O49L39m22n38P0L93N2k47m90J07N86M10l76k71
4467i9n89N21Q36l59m96l02L03M48K36n44k31m6O07L14m26n41j00M83L62p2m15
4488a10m66K71N03K20k66n78Q2N77J78k69m41l9J1M87J78q06o2N03M32j49l18
4509f2l23oO32L32n00p07J52N46L63k28n03q5K38N66j10n96n2P7N51P4m96l98
4531e35K46K20O56j44n40P3L0M08j42n76j93K86N51L3q68q9L36O10R5m52j99R9
4553i5K67N52l92o38M9K71M36j81l73m28M66M29j02n4o12J69N22J99l46m24j49
4574d34M53O66l87m62J1O4L44R7q64R7J20O32K41m92m86k19P22L88k23p58l4N28
4596DO24l30p57k58O06O06J47q84M5l39O86J06l38l91M50L84K52j88p00l08M64
$$ y = [-262, -586, -458, 415, 464, -219, -580, -361, 288, 627, 205, -333, -263, 130, 182, -65, -555, -448, 138, 548, 172, -99, -688, -167, 669, 310, -186, -488, -185, 263, 499, -45, -276, -322, 285, 599, 173, -368, -468, 15, 377, 305, -110, -576, -305, 198, 418, 152, -426, -344, 233, 411, 142, -299, -338, -327, 160, 338, -468, -530, -27, 405, 256, -62, -385, -391, 241, 573, 73, -634, -482, 64, 427, 199, -304, -389, -151, 415, 305, -291, -343, -266, 285, 359, -137, -535, -289, -69, 587, 443, -97, -24, 6, 414, 272, -304, -497, -211, 340, 373, -495, -584, -248, 362, 457, 5, -194, -95, 172, 724, 332, -306, -257, 14, 450, 269, -104, -532, -66, 363, 261, 207, -405, -236, 286, 485, 139, -285, -434, 19, 685, 298, -164, -153, -89, 255, 352, -512, -415, -295, 337, 578, 86, -400, -619, 103, 491, 268, -490, -524, 4, 628, 298, -459, -717, -111, 495, 642, -242, -197, -536, 150, 256, -82, -473, -23, 361, 613, 425, -275, -583, -119]
4617a19M46k7l65m08J31P22km30l11OL29K62j40k76k85N52N87k73o60l87L65K95
4639A2K70k97o87K54P12N05p86k16r1L81M13l74k33l57J25P94j91n04N9OL63R5
4661B53j30m77J0L03N48j56n79j58M08O4M81o79l25L84O35Jn55n33l6O58L26m53
4683a0o69L08N38L64k56n51q1kQ24L3o81k16K26M76K02n23j95k42M55J28K20r53
4705f05J01O01J31J17p00k14M34N22K52m01n93J05M38L57n82l84r2M27N40k05
4725B49o52J18j20R12r7m79l22J62M26N4k68n21n6R55K5k06n74j93P38K00j35
4746B16m15p1L11L39j42p50J85M32L09M23m33o00k56O44R7r4p51K44K74M12J03
4767D77o39n26N86N63k1m97m04K37N30L18m52m43j38L14P85m02o86l1M81L63j58
$$ y = [-119, 327, 300, -65, -473, -342, 380, 378, -52, -363, -357, -28, 234, 94, -182, -467, 85, 672, 399, -261, -648, -283, 12, 282, -15, -702, -448, 264, 769, -17, -233, -324, 57, 470, 96, -137, -494, -369, 425, 234, -270, -211, -205, 158, 253, 123, -354, -344, -41, 507, 351, -228, -386, 22, 86, 567, -112, -437, -53, 582, 583, 28, -505, -541, 117, 443, -10, -679, -371, 167, 531, 275, -276, -357, -359, 465, 498, -183, -399, -173, 303, 505, -18, -213, -455, 0, 128, 348, -605, -504, 97, 228, 345, -355, -569, -135, 387, 639, 238, -355, -250, 188, 545, -37, -421, -513, -86, 454, 249, -403, -285, -405, 507, 410, -69, -391, -229, 197, 251, -17, -538, -594, 361, 386, 180, -394, -587, 151, 351, 216, -199, -270, 41, 380, 238, -512, -327, 105, 414, 837, 404, -196, -452, 192, 289, 195, -556, -312, -38, 374, 477, -162, -688, -102, 461, 440, -57, -461, -224, 306, 624, 172, -271, -409, -95, 690, 288, -398, -429, 52, 415, 257]
4788B57l61m95K49N04J97m14l33J22M98J83j10k96l61M09N93l54m78l70M71K95
4808B06K99k45n58j07M97J08p1k97j24L60K24K22n57n3p9L46J81n98oJ96L48k93
4830aR0m31k88R09K60n59n74O4P40L45l98j24m99L83N25N2l89o68L98M70k23N2
4852A34m35j51M36R6J8n26l7K08M72mn27p9J72N67P1m61j58j21P54j26k6o12p1
4875d06N93K89l71j36l31J37L88K15m57j4k78N49M69l32n06l51P80j48J26o51
4895d35L03K83K75k49m61m76O10M62%l07n20L16J97K18j30l23m7L69K57k00o42
4916e00K58M9O47j18j68n31L89J66J4L7m39l0M60L1o4o21J10K36J66K61o25j78
4938d50K33L47l4k07k50J82K81L20k67o55L06L69J62k92o17J12K96M79j83l14
$$ y = [257, -104, -599, -350, 154, 351, -63, -396, -274, 224, 407, 297, 1, -360, 49, 642, 288, -190, -560, -89, 206, 505, 260, -298, -405, 92, 200, 129, -168, -292, 68, 292, 514, -43, -96, -175, 171, 352, -246, -252, -56, 292, -1, 89, -342, -630, 279, 539, -20, -594, -530, 210, 555, 157, 33, -466, -83, 442, 494, 105, -563, -165, 305, 82, 134, -301, -452, -16, 80, 98, -428, -465, -257, 215, 211, -316, -395, -223, 344, 415, -46, -204, -325, 429, 303, 277, -335, -406, 187, 476, 105, -31, -362, -225, 163, 378, -79, -93, -371, 178, 647, 315, -191, -542, 238, 90, 216, -435, -132, 151, 426, 177, -284, -760, -150, 312, 312, 5, -515, -199, -2, 216, 86, -237, -284, 85, 342, 142, -500, -242, -193, 454, 336, 168, -363, 26, 192, 206, 243, -196, -226, 234, 265, 201, -420, -310, -74, 92, 353, -272, -450, -217, 130, 96, -111, -361, -179, 102, 422, 155, -500, -194, 175, 337, 45, -572, -460, -164, 315, 132, -182]
4958a82j72p7M31L69m34l8k01O98o8J56q31m6P08k17N8l46m5K13L9K60k77m14
4980d16L68o2N99m14j87k5K55K88k90Pm15K47K58R5m36j58J5N25K67n27k88K98
5002Dm02J044n40m78K50j61O18p2k01m18L03M75J29m93k81J77N5N74o89k57k42
5023f05Q51L70m43m93j87O05K06k75R6o83L20M96k1j90n73M18K14K59l90P0m42
5044c97M41K73J12l50n51N45J04K30l60l49Q0L62J89j80o07J60J85M28n59J09
5064a35k87J20N76R5j74n30R6N03J34k48l25L2L57P9l39j34k77K64O76r2n03l64
5086d76L64J83K71l96m78M76M65l72R7n85L17J28K33J73q81K33K93RL41n88k71
5107d64M36M62lm59m43L36L37J82m1o55m5K83O67o24m1k33L5L79k06J2l84N03
$$ y = [-182, -354, -431, 0, 369, -65, -103, -304, 394, 326, 482, -349, -395, 313, 96, 154, -192, -237, -24, 15, 275, -2, -416, -48, -110, 489, 75, -112, -137, 118, 406, 116, 123, -292, -45, 213, 308, -128, -286, -271, 254, 521, -6, -294, 4, -398, 646, 106, -372, -122, -283, 335, 263, 62, -356, -53, 422, 551, 58, -223, -46, 9, 583, -106, -363, -605, 246, 616, 173, -320, -507, 98, 304, 29, 125, -558, -238, 258, 237, 47, -526, -108, 106, 365, -25, 45, -397, 44, 317, 429, 79, -472, 73, 177, 407, 47, -302, -222, 140, 329, 149, -458, -298, -113, 315, -244, -135, -422, -302, 274, 369, 195, -335, -239, 264, 398, 150, -175, -143, 214, 293, -46, -180, -457, -193, 483, 391, -112, -476, -112, 71, 342, -54, -532, -56, 409, 37, 134, -451, -134, -6, 227, 400, -481, -248, 45, 54, 395, -193, -464, -28, 434, 431, -28, -471, -135, 202, 384, 343, -312, -357, -74, 593, -31, -72, -305, -270, 109, -97, -85, -469, 34]
5129C4K55R9l64l51K07P2K68Rm75R8M05J21m01L7o47M40N49L28p83l62P8N64L59
5152E40m61l23n2O26k13J1n15j10M46K06J72n13j17K01M00K10m69m24o9L68L22
5173B36J78p94RM68K58K83q53j60oM93K79o25m8r2M60J60n1n00j7K91K09L55m76
5196E7m67L8M47Nk80j11K61K68K96l72l11KJ48J02j19P9m04J93L72R0k97k60J26
5219a37L27M22n52k61k33M66M08l40m62N6N25L2l84q0j11M73K40j93l6m32m8N03
5241A83J39l94j3m36P28J08l35j88K34o9M09k17n30O9J43M82j7j81m26J89L25
5262B03J55l35l87J05L83J11L3n08j02M22J14k24k15M8J00N09Q7l76m30K77l2
5283f2K86P3l96n22N83L58k8k77n19N83Q3K22m00n08L29J11M02o7n54q1O83o1
$$ y = [34, 289, 388, 24, -327, -120, -48, 220, 229, -246, -148, 257, 378, -23, 14, -633, -193, 356, 684, -99, -461, -383, 181, 540, 79, -244, -296, 330, 117, 128, -387, -497, -51, 155, 327, -186, -303, -102, 298, 508, 39, -385, -454, -86, 236, 414, -380, -371, 97, 355, 638, -215, -375, -381, 112, 391, -234, -282, -374, 86, 246, 195, -305, -322, -31, 178, 533, 57, -410, -372, 75, 80, -200, -311, -50, 218, 514, 142, -169, -167, -19, 83, -36, 43, -361, -168, 204, 294, -3, -263, -137, 190, 612, 60, -201, -434, 32, 440, 100, -362, -306, 219, 251, -133, -213, -324, 149, 389, 196, 160, -272, -320, 183, 322, -72, -85, -521, 207, 315, -20, -208, 26, -43, 366, 149, -381, -312, -169, 313, 296, 115, -311, -122, 203, 358, 23, -364, -259, 124, 235, 268, -240, -342, 80, 194, -30, -245, -197, -97, 412, 499, 123, -307, -30, -62, 224, 297, -99, -621, -38, 320, 292, 15, -504, 79, 162, 384, -16, -524, -195, -84, 318, 251, -303, -384, 299, 238]
5305B38k90m21J78O0L38K95m92k6J24J32q7j6k33R9K35L01l60j77K89o6M09j26
5327D04n84N1J17K97J19o32k47O23nj51J79m81J64L36J62k46n1j41K63n3j88j83
5349b47j39N16j82J12j81j49J05Q1N73l22n59M01KK70l80j07j00l6O12m53K66
5370H3k65r5M38J81k69n49L25K14K33K5m99j7L15O5j11K19n34J31K8N20m40l04
5392c06J2N66O3n00j83K35J15O79o56k15l11L15L79m8l15K0j0K83K8k76m19N04
5414d0K87Q3j49l13j64J24K45R1k69j95M20K48j83k92r2r3L73M15m18l58l2N58
5436B46L34m66k31l35N42N19k22o30k07Q0L66J63n5m13L74J75R0n3m54K3M14j50
5458A10N2L7o45L85L91m20J09m72J38L07L67o62J37p2M79J82l12oo11O19K81k64
$$ y = [238, -52, -473, -295, -235, 103, 398, -94, -120, 4, 136, 49, 33, -200, -101, 134, 435, 75, -102, 187, 121, 530, 404, -180, -129, -12, 285, 404, -228, -475, 148, 143, -8, 171, -310, -146, 190, 352, 106, 55, -86, 177, 124, -64, -247, -386, 130, -52, 60, -121, -270, -165, -84, 489, 167, -392, 9, 11, 281, -99, -206, -306, -342, 270, -183, 83, -182, -277, 161, 342, 73, -476, -151, 63, 296, 321, -178, -195, 120, 185, 74, 293, -241, -110, -82, 438, -2, -306, -294, 272, 335, -165, -348, -113, 2, 681, 25, -190, -501, -186, 193, 145, -170, -150, -160, 123, 151, -125, -544, -40, 247, 330, 181, -132, -296, -172, 73, 164, -105, -300, 120, 368, 185, -107, -199, -292, 81, 496, 78, -280, -312, 246, 580, 114, -117, -452, 90, 609, 387, -243, -450, -370, -4, 159, 104, -309, 65, 240, 330, 277, -177, -154, 260, 110, 162, 199, -446, -61, 330, -90, 19, -453, -315, -8, 359, -303, -166, -238, 241, 423, 111, 105, -506, 113, 394, 130]
5480A30m9l57j76M89K84k56j21L5J90J29j89k76j8L76K21l01l69mK11M60j50o05
5502c46K73l43N22K66k31k96J4K98J37r8l94j55M42K93j11m23k53L60K64j19l83
5523b83J33k50N36J21n58m7K53Q1J55p5k08k78M74K4K26m46Q7J2j9M45j22l01
5545d0m10M55M26k06l22n6KK35K14l91k71O3N13Q5j35n49J12N16k15K00k51j70
5567a95M94l36J6j30oK40K51k38o2k52Q6N16m4m46O1J9J0J65o3m44oO83kr0n58
5592c31L37j70K30P4k37J24j87J51K51m01k06O9J20J79K41k40m33M71L17j71k93
5613a05k42J59M23K0O7m24J74j19M33k00k07k60P7M89n3n13N2K79L27j34j65m07
5635c29j36O36q1m8l94L22j2N20l96k52j96M43K91j57k2k74j06K05J47j80m16
$$ y = [130, 81, -276, -452, 37, 321, 65, -56, -21, 169, 298, 109, -167, -185, 191, 412, 111, -258, -262, -51, 409, 259, -346, -73, -416, 106, 372, 141, -155, -141, 157, 294, 196, -198, -353, 89, 382, 271, -152, -405, -45, 219, 100, -283, -150, -400, 136, 257, -301, -348, -95, -14, 141, 66, -142, -420, 54, 78, 304, -142, -55, -43, -62, 383, 261, -40, -450, 5, 431, 225, -97, -153, -151, 84, 298, -93, -364, -301, 212, 297, 162, -387, -275, 241, 26, 226, -25, -195, 299, -37, -21, -151, -157, 83, 334, 96, 34, -218, -132, 384, 340, -106, -45, -26, -16, 149, 86, -358, -364, 319, 317, 227, -331, 6, -164, 66, 140, -97, 27, -160, -9, 242, -159, -365, -296, -176, 3, 244, 4, -429, 42, 359, 188, -105, -347, -188, 235, 255, 322, -102, 72, -47, 386, 186, -21, -281, -204, 285, 232, -281, -229, 50, 377, 243, 78, -329, -465, 171, 90, 42, -352, -30, -42, 478, 82, -170, -366, 77, 368, 211, 189, -85, -191, 14, 161, -19, -435]
5656d35K86J65kn2j68l7O1M60J07o76L26k36L19J85j24k75mL98o3k83m21O21k51
5679i9M82k59k87J3Q7K92j49n0o07N95J95k19Q4o04K02N14o4J62o91J31J56L65
5701B49K40p51kj7L80J23k63l20L48K41Lm13K3k1j24N20m37L08o04M68L29p7k6
5724A77k82m3L70L88m30n72L30R8K33j88m43L83K36K4j40m41J28J84L93k68k49
5745a12k90J72K78J6K0l02K82K67L71n46m88K09K76J29O2j13m11K23M4k2j35k40
5767c10P3L53ol35K25j94J02L36j79j79n19O69K25jn12ML14J64M02m31n10M0K01
5790f8J1J62k00r0M7L23J51k93k70P5L81L30p09K8K04mK89o3o41K53ok2k2l65
5814d99K04J64M46l7j71m59K10M91k05j53k0p1M79n4Q9m69j60L06J03k21P1l70
$$ y = [-435, -149, 16, 14, -38, -206, -243, -182, 278, 385, -291, 35, -201, 118, 303, 179, -96, -100, 298, 235, -48, -469, 152, -99, 383, 124, -163, -150, -63, 229, 80, 30, -577, 18, 213, -6, 78, -526, -324, 190, 126, 288, -403, -272, -116, 249, 489, -262, -264, -281, 99, 222, -41, -361, -13, 228, 231, -182, -159, -180, -304, 216, -221, 87, -517, -49, 280, 203, 177, -105, -148, 222, 610, 180, -392, -62, 36, 269, 81, -362, 21, 257, 281, 141, -300, -172, 12, 405, 137, -112, -402, -230, 48, 64, 84, -218, 64, 331, 702, 156, -332, -123, 153, 282, 344, 231, -180, 43, 87, 65, -70, -310, -237, 116, 110, -225, 0, -194, -92, 244, 65, -114, -633, 36, 261, 260, -252, -248, 66, 230, 632, 201, -309, -269, -68, -57, 105, -95, -185, -138, 185, 336, 43, -227, -152, 229, 559, -150, -122, 82, 78, 367, 304, -337, -84, -90, -112, -134, -499, -295, -131, 315, 278, 107, -352, -142, 349, 144, -9, -29, -100, 379, 325, 414, -55, -215, 91, 194, -27, 44, -326]
5836c26O6N09k47J11m34J36L67m6K14k81j25J47J34J45n20l10M17L93j75m37j13
5857c75M29J62L30o58k93L20J36J74k0m37J21J15L87mo56j29K20O18l20j49k77
5878c06M31L01l78J57k50k37J00M12m48m9n1L26L22p0k53q8O1J67M38m46n45J04
5900c02M37J24o0l54rn9L26j25j01J6j91N53N6n24L12k74L22j7M4j5k61L29L21
5923E48n47j88k26M93J48m8l78J98J8K17J12j88l88K45J62J16j34n58K43J86K67
5944B98j69m34J03K69J99k78q9l7J71q4p6J76j79p7J62L07m00q1J18P1L15k42
5966D3j86j16Q6L10J91l00j69j35N03P4j86j16o11N12K46Ok98j31l7N21J97n61
5988a57J75q7J90K8j91k93M03j06L0J02j63L7J74J36r5n52n5L41K86J59n84j48
$$ y = [-326, -260, 249, 2, 113, -321, -185, 182, 136, 350, 69, -56, 91, 225, 370, -150, -460, -43, 350, 175, -262, -375, 54, 216, 546, -112, -405, -85, 51, 225, 205, -232, -111, 4, 391, 387, -269, -398, -178, 440, 120, -29, -306, 125, 426, 48, 205, -45, -282, -182, 230, -218, -267, -318, 8, 330, 260, 7, -81, -20, 147, 585, 139, -406, -302, 135, 259, 199, -155, -164, -223, 103, -22, -123, -107, -298, 255, 311, -213, 99, -175, 147, 130, 174, 159, -102, 227, 548, 1, -187, -413, 80, 228, 180, -198, 0, 18, 235, 347, 159, -229, 16, 178, 294, 160, -398, -155, 31, 298, 129, -305, -202, 67, 266, -12, -101, -138, 33, -51, -127, 49, -130, -207, -45, 262, -138, -219, -101, -30, 285, 43, -143, -259, -173, 137, 328, 28, -141, -276, 227, 301, 115, -1, -612, -100, 146, 152, -146, -277, -314, 207, 404, -157, 18, -69, 121, 149, -42, -335, 68, -38, -8, 94, -69, -32, 142, 278, 183, -369, -424, -83, 203, 362, -222, -370]
6010c70N84j64J67J2n14K3M40Nj99n4m32L70O9K76k91j87K3L0N32l78l82L31L15
6033B06K4j58k73j69K07R7l0j58p2N98J00l80K04o35L45K43j01k09N4j51N02K27
6055D71l92j4m41J21L64J41n70J68j35R4N93o02k93L72K38K81m06q7r5K80Kq3
6077Gj15j92K22L27L6k97j03J43J44O7O1n49J34M75l63K50n22N1J16L26k71Ok1
6100f8j34N89k87k85j36j68M80P1J79j22l9j63K31K31m93k10K05K57l9m0j34K8
6122d7K81K0m55K0q9Q7K67j5j98k9J12K67j8j45l26j83M71N17p98J31K4K01K18
6145C13j77o13K62K53J55Rn40p4M23j4L34l23k98L07L36j03n04K5o7J53K82q8
6167E1n93L76M0L9K81l15p0J24K45J70k29k49J53L22j36j06k20m9J99K30k31p6
$$ y = [-370, 214, 50, 217, 229, -285, -262, 178, 183, -16, -70, -502, -132, -63, 213, -78, -265, -242, -212, 320, -58, -440, -109, 206, 230, 72, -201, -370, -163, -66, -96, -254, -326, 272, 372, -8, 196, -439, -94, 149, 48, -161, -107, -258, 244, 471, 79, 65, -376, -255, 109, 250, -320, -152, -287, -193, 400, -202, -495, -123, 115, 396, -10, -97, -192, 88, 90, 7, -108, -300, -78, 249, 285, -12, -115, 28, 172, 239, 300, -249, -115, 360, -3, 247, -275, -224, -108, 218, -53, -47, -68, -202, 387, 100, -185, -321, -489, -9, 62, 241, 119, 80, -83, 148, 379, -114, -324, -119, 138, 99, 59, -75, -47, 234, 254, -201, -181, -270, -183, 84, 69, -129, -158, -46, 221, 203, 58, -268, -451, 20, 537, -261, -130, -106, 95, 313, 136, -477, -215, 38, 193, 202, -338, -412, 11, -3, 331, 8, -290, 17, 353, 250, -254, -229, -296, -143, 139, 51, -542, -166, -126, -87, 194, -121, -191, -67, 178, 348, 119, -130, 23, 345, 209, 103, -117, -166, 33, 263, 32, -44]
6189d4o5j59M79k13j69j43n3N64J53m61k33J66M34J46l89n3m13P47p9j72qk88
6211b53J5N76j77k17J18j04J9L85k63j47l37l5P24k26p1l11L00K28k17p8J63l38
6233b46M38J70m99K87m58K36K30q6k06l80N61L78k68j55l40L08K66j07j47j7l4
6254f9J92J20q3o06K41L42J60Jm50j20K38N56l42l70j11J79J67L13o19j92K31
6275b22O18k63P9m21K13K8p3K33m31K1JJ72L22j43m91J12N24r1l27N6J07Q2K52
6298C58k83k08m2J92K61j34l71l6K95J46L6R8n47p2M60m1j31p0j16K19J65J8j99
6321bk82J71M75l0q29K01K80J1pj17j83k7M61J04m30j72M19o8M35o0m93k62L48
6344e7L71Ll92l1k38M58J87l42j73j84M28K08J66o26J38K6K85O3n99j0K68J59
$$ y = [-44, -109, -268, 211, -2, -171, -314, -367, 197, 350, -111, -344, -178, 256, 402, 13, -40, -453, 294, 215, 43, 35, -253, -238, 338, 161, -56, 62, -42, -23, 362, 99, -48, -385, -420, 304, 78, 7, -304, -4, 224, 7, -71, 92, -246, 192, 362, -137, 150, -308, -72, 158, 72, -134, -514, 47, 425, 157, 2, -338, -30, 236, 129, -18, -35, -69, 123, 243, 160, -446, -205, 137, 297, 298, -152, -272, -34, 522, 180, -190, -301, -122, 45, 358, -261, -453, -222, 396, 133, 212, -209, 4, 32, -41, 192, -239, -218, -217, -45, 277, 134, -357, -245, 279, 188, -139, -83, 24, 106, 358, 75, -133, -175, 17, 278, 144, -227, -263, 32, 178, 214, 312, -235, -307, 153, 112, -19, -89, -205, 14, 179, 197, -2, -284, -113, 362, 332, -497, -296, -16, -5, -12, -129, -312, -339, 122, 226, -204, -376, 43, -25, 410, 350, -143, -405, -57, 314, 317, -75, -106, -344, 114, 301, -41, -214, -398, 30, 238, 404, -222, -84, -58, 227, 290, -309, -319, -51, 108]
6366A08M4j90P6n02L59O8J75Mm24L51nk74K32m11L4O02j04j70k67N3M00J25k88
6389dr4p1L42N7K76m90l97K71J56j9P2k76N22j77nK20o61L39p5J78k98j42J8J15
6413a43L34r5j00l39J60N09k82j27j66P0o5N06j56m97L65Q3K30j0l59J4K94p3
6435A53j73p7l05J09L53p0J63m55K66j03M36j78j19k39L15K43m03k47J48K23M5
6456H5m4J20m15l7M97j09j01k32K92k05N53m84M4m25O37k74J70j80K10k60L01
6477A43J15l53l8P9P6K73m80K4j59M87K69l68k42j72N16J98k34l63K42j96L78
6498A95p4j82j07J08J88j25K09l36l3r6K67Q6j17l9O2P9J23J51o22M2M84j6k77
6521c0l44N4K87L8M43o90J96J08j80L76l38j24K0K78L71p31K40K74j95J04k31
$$ y = [108, 152, -38, 38, -464, -105, -37, 138, 142, -282, 69, 64, -210, 22, -389, -355, 247, 143, -27, -294, -241, 159, 284, -4, -98, -169, 173, 230, 506, 16, -381, -110, 46, 27, 99, -177, 345, 168, 163, 383, -278, 61, -14, 164, -134, -276, -258, -143, 191, 96, -4, -343, -183, 326, 44, -83, -249, -179, -244, 262, 106, -391, -26, 57, 287, 277, -82, -68, 226, 153, -20, -97, -402, -293, 60, -10, 153, -302, -36, -139, 297, 119, 0, -239, 76, 319, -84, -331, -183, 40, 85, 41, 161, -254, -291, 206, 97, -4, -236, 56, -149, 404, -80, -36, -461, 176, -98, 72, -108, 102, -158, 143, 258, -95, -133, -54, 22, 295, -185, -161, -320, 167, 436, 68, -174, -346, 170, 368, 134, -229, 13, -183, 195, 121, -61, -168, -60, 128, 3, 212, -124, -157, -253, 14, 100, -17, -56, 6, 85, 208, 359, -263, -221, 263, 247, -30, -374, -320, -33, 5, 448, -242, -46, 62, -118, 258, -80, -204, -184, 94, 465, -266, -26, 248, 53, 157, -74]
6542g4k02Ql4L50o0k14j93O58k10J11J40k86j75K56R2k06n0q4j79N23k83R8j54
6565a68M13q4K88l77l56j04N93j70k1q9j33P0K58J94o40J81K2N58k79P3o77K69
6587a79K73K46l15k29J14L06k35L5k89O9L37L3k66J27m47N23O23o96k89L08J92
6608B41j5J09j42l11J0O9N32k68k27J14j30L56j60j74k18M60J61o0o86M55m99
6629c83M60N2j92k19J98oM00j2m16k22L64J79m18M19k81L6Q5J48j57j46L26M27
6651F42n56k80l38K58M43p2J50n80J64J92m5J03n1k20J37J42n1L33l23l25L55
6672G8M7K92k98r9p6R7J18l14k03N07J11l60M85j39n62L07L4J30l61K83k07L01
6694A71k03k9k15L08L8j50J42o5O9Q2N2p0l70QJ34J56K60o37J73J91J20l10J5
$$ y = [-74, -276, -268, -302, 48, -12, -226, -419, 239, 29, 140, 280, -6, -181, 75, 167, -39, -89, -173, -352, 171, -112, -14, -168, 245, 161, 449, 72, -284, -388, 205, 35, 14, -75, -208, -138, 120, 314, -326, -145, -123, 435, 156, 229, -448, -179, 94, 340, 25, -204, -90, 216, -19, 16, -273, -204, 133, 166, -100, 27, -420, 103, 726, 30, -259, 49, 241, 226, 335, 193, -118, -108, -39, 493, 225, -2, 112, -18, 338, 178, 4, -214, 246, 407, 347, -339, 116, -383, 77, 129, -63, -282, -84, -90, 310, 298, -118, -340, 24, 203, -215, 204, -77, -41, 44, 192, 35, -111, 215, 642, 86, -194, -532, -274, 169, 97, 247, -333, -169, 23, -22, 81, 30, -190, -53, 89, 38, 371, 48, -277, 78, 125, 417, 119, 20, -56, 41, 159, -155, -358, 149, 260, -100, 385, 246, -316, -9, 25, 155, -206, 77, -130, 171, -32, -61, -276, 32, 70, -80, 62, -3, 66, 148, 200, 130, -240, -232, -98, 58, 318, -319, -146, 45, 165, -145, -130]
6717a30l7j24L75K67n46j17J94L58k33n2k15k2J93M63n30J72k91K65N3k8l9j42
6739a66j7N15Q9m47l93L28L66k51J26m36J80J14k00K54M8l18N15j03K31n73k33
6760c71L20L6L24k63n76L70J78K3L8m43l4K63M07k53j86o2P1L22J98m45q9K5L90
6783B43l32J45Q9n28O42j88p4k24J78K55l06J77J81n89L56j26L63J43q20M88K30
6804C03L8k3l45q2k36M11k58O4K8j27L88p0k29j13J72J93n0k2k35J41n7M54j73
6827A72r3l39N6M94k7o03j39L55J48K05j20l43J43L01j29j07j28J85Q0Q9J08n21
6849b13K11j30L29j27j50R3k15L37R8j90J8K9k09K12J02k05O0J68j40P0rj37j58
6872a56L13K08j88n79L48k30N78l55J7k25O2L22l4k96l2J91J28Lj51m2K07J35
$$ y = [-130, -167, -291, 84, 351, -195, -312, -118, 240, 7, -45, -260, -282, -89, 374, -156, 16, -275, -10, 43, 15, -24, -166, -183, 332, 421, -26, -419, -91, 275, 24, 150, -286, -106, 8, -192, 62, 110, -208, 307, 204, 435, -138, -371, -51, -15, 309, 46, -530, -160, 18, 41, 79, -364, -398, -135, 272, 19, -167, -229, -158, 164, 362, -83, -172, -147, 243, -89, 56, 145, -383, 259, 71, -3, -227, -49, 206, -100, 77, 258, -331, 25, -101, 262, 405, -415, 73, 303, 341, 318, -27, -109, -345, 66, -192, -128, -100, -227, 161, 91, -138, -251, -79, 114, 64, 42, -193, -52, -109, 345, 172, 79, -260, -204, 290, 263, -340, -479, -124, 24, 229, 109, -234, -91, 210, 81, -26, -154, 31, 111, 200, 308, -213, -2, -132, 197, 70, -80, 13, -202, 135, 233, 43, 61, 90, -119, 93, 195, -10, 50, 218, 78, 148, 139, 2, -156, 157, 365, 177, -402, -54, -284, 294, -61, -44, -269, -207, 115, 81, -215, -247, -56, 72, 75, -76, -118, 89, 224]
6894B24r8j91Jj31J98J29r6N3k67J36L47l6k50m08J47M19j70J51l20J9N40r5j34
6917A68K0m80ON04Jj96l01L03n%j58L7j44K57J44J52o58K42J29l2J46m39j02L57
6941d9J92l12K09m67K77K08L1j36K3p1Q5N28o48j59J55K54K05m20L7r9N56k65
6963A34J71k32o0r9K04K14p0n06j05L40L74N9l45l07N7L59m0l41J7M2K45L24l97
6986C8k96L8L12J97k78n95M46j88O13l43j35O7J55j3R3n61L79r3K90K5k02q2K8
7009a05q3K55K83m53l08L94J09j2k15j00L40J72m2m04J23k79M11Q3j52K1l36J41
7031a57M78j52j50l32K5K53L01l47l14L08L15N5k34o8o4L20K09q2m50j28j74N16
7053A28M2k51L1pM6L25l09j43J8L84j22J38o4o71N07k70L36j37j91J10K73L01
$$ y = [224, 126, -65, -64, -195, 3, 132, 36, 89, -178, -42, 305, 269, 19, -389, -242, 177, 7, 158, -162, -143, 397, 302, 168, 188, -292, -286, 218, 219, 23, -278, 25, 20, 20, -138, -101, -245, 12, 156, 308, -350, -108, 21, -11, 135, -304, -406, -49, 143, -169, 40, -427, -150, 58, 89, -47, -24, -95, -10, 518, -130, -289, -134, 120, 325, -95, -58, -157, 399, 134, 305, 73, 13, -86, 118, 332, 262, -244, -349, -9, 365, 424, 79, -228, -171, 188, 148, -193, -176, -134, 111, 435, 38, -258, -220, 92, 289, 11, -584, -138, -326, 287, -56, -191, -124, 31, 18, 111, -450, -71, -164, 126, 151, -51, -133, -105, -188, 67, 350, -103, -411, -17, 92, 80, -135, -235, 105, 277, 235, -169, -46, -325, 86, 169, 17, 38, -298, -157, 321, 169, 19, -313, -288, -35, 266, -81, -395, -87, 228, 283, 49, -19, -83, 237, 446, 364, -86, -214, -388, 128, 170, -81, -50, -57, -11, 314, 5, -138, -120, 264, 142, 280, 216, -455, 52, -218, 118, -19, -210, -100, 173, 474]
7075D74n62m8M23k65L25m06j7j2L04J24l78J83k7L2j48n1J55l62M2K00L19k76
7097B9k18JM14M4J8n93J39K15k7L17k90k48K35O4N7j76k92M38qJ84Oo08J89J15
7121EL84j69l66Q6O7k47M95m54J57K30j69J6L72o48kL60J59l13k04l1J50K32j47
7144c7l21J87J12K99K7k78J06m49L04K51l10j69K45Q3J92k4k52P4p9M9K68m28
7166a50R0r9L46k08j88Nj08J6M38n8q8j98L20K38K5l71l09R3O74k26j97q8j7J54
7190I4N7q7N2j33J81J36m09M08m17J01K98j58j51R2l3K71k66O8m49K38L52j29
7212A16r6j12j25K73j3L0j67l33L85L49k67R9m40K93r5m6O8j1J56R2j7k73K16
7235H2j08l29N23k94K67l30K26k16N12m26j01j09M27p5n5k75N2N19j12j48o4j26
$$ y = [474, -88, -136, 287, 22, 347, -59, -76, -88, 216, 340, -38, 145, 118, 150, 2, -49, 106, -256, -214, -14, 305, 29, -189, -188, 226, 270, 288, -305, -166, 49, 22, 339, 49, -199, 36, 100, 157, -19, -311, 127, 119, 303, 309, -299, -110, 5, 389, 220, -146, -60, 7, -240, 255, -199, -42, 188, 19, 35, 407, -241, -243, 117, 276, -37, -241, -272, -122, 110, -37, -358, -171, -59, 240, 267, -11, 95, -354, -50, 201, -109, -278, -33, 50, 242, 218, -34, 40, -39, 10, 278, -150, -60, -159, 187, -21, -209, -204, -312, -296, 142, 84, -4, -202, 118, 356, 381, 10, -299, -206, 468, 242, 45, -43, -60, 94, 151, 64, 116, -17, 164, 300, -109, 299, -118, -17, 281, 123, -28, 64, 31, 302, 36, 104, -345, -107, 245, 116, 20, -92, -217, 56, 43, 73, -94, -427, -42, 307, 40, 139, -301, -8, -103, -149, -81, -92, 64, 156, 139, -134, 82, -26, -355, 168, -126, 141, -189, 37, -179, 333, -93, -194, -303, 124, 49, -6, -281, -229, 290, 178, 30, -34, -160]
7257a60L29k09K80j78m60N47r0J25j76j67j54K42J56j12J44k59o3M46j09j92q8
7278a48L37n8L4j82r5R0M8M00m82j61J99J36Q1j5n42j4L04J23K38m54O0k6K15
7301H8M07m24j1j28j4K72n05J14n9J68J63n3j7m12N32J60k25p5j68L1K04k51M82
7324B79k37k18M35q8l10J78j58rM99l51k34J50J06m4J5o4j25jJ90OQ4k42K15j88
7348a12L42l72j16K74q1K13J43k09k53J86ML41l78k26K35K81l59R2J21l51J63
7369f2K1J73k7k5n9J45j91o4O0j44O1K93l92K01j21J04Q5K46l42k35J72J00O6
7392F5nj78L2L18j38j21j32k69K70L44J55l01k85L26L4n0j11o1p9q2L14j34o6
7415a54J05j24N63n33q1R7M19J83n19l81K47K81J24l82L00l71J67M29l04M1K91
$$ y = [-160, 169, -40, 240, 62, -398, 149, 59, 184, 8, -159, -313, -71, 85, -27, 117, -142, -205, 241, 132, -60, -148, 189, 131, 165, -17, -112, -22, 26, 426, -56, -217, -18, 118, 199, 184, -358, -372, -68, 55, 293, -161, -101, -127, 88, 495, 71, 60, -68, -82, 190, -315, -201, -260, -92, 71, 18, 1, -411, 121, 281, 56, -19, -187, -156, 48, -203, 279, 42, -176, 259, 171, -139, 39, -119, -128, 371, 20, -214, -64, 42, -2, 13, -51, -176, -177, 13, 19, 103, -139, 76, -112, 230, -142, -258, 16, -65, 148, 291, 82, -171, 15, 19, 360, -18, -244, -9, 272, -87, 5, 126, -225, -62, -41, 132, 105, 80, 21, 166, -25, -89, -29, -173, -112, 181, -211, -10, -131, -27, 58, 304, -38, -273, -101, -1, 65, 60, -118, -86, 232, 94, -27, -159, -428, -158, 186, 341, 40, -245, 81, 115, 65, -46, -107, -186, -268, 46, -88, -154, -49, -173, 390, -143, -224, -127, 292, 475, -44, -425, -178, 103, 227, -155, 145, -226, -59, 370, 66, 107, 398]
7436C98l72l28L72l92K86J8Q7Q2J90n64l3L40L5k6k02n8J5K41J31l81m5n3J03
7459a56R6J23j22jj00N24j46n64L87J42Q2l83K27j89l26M59L43J92p93K44j55
7480a16K83j3l05k24K08M83k8j15k15J04j03J65k16j52J32M08n97M16j6j53L52
7501B98j03J11j65n51J32L25O8Ml94L23L2J74k39j06N3l2O22l30n53L03J68J24
7523B64j93j47J42j39m8M21j33j62k06M54j09j17k78K03j92J00J6L7k03J03L12
7544A25K80p0n74K23K7K88j55l24m7J05K74Kj50j64K30J94j61m74m9Q3N45J52
7566C60m04Q5j1o4K3j67K98l21J25M68j18k22k84l0L42M6P6m84J77K18Kj22k65
7589b72L27NJ5j39l4k9R3K21K94q98M23J13k06L84k09l34K89j98L72j69Q2J0l35
$$ y = [398, 26, -302, 70, -322, -36, -18, 69, 151, 341, -223, -256, 84, 119, 93, -109, -167, -152, 89, 220, -161, -206, -259, -156, -60, 63, -59, -60, -160, 364, 218, -346, 41, 183, 265, -118, 109, -80, -406, 53, 396, 588, -205, 39, -116, 167, 154, -151, -375, -167, 316, 288, 173, -42, 62, -41, 124, -92, -244, -112, 296, -301, 115, 99, -54, 298, 195, 306, 141, -410, -278, 47, 115, 119, -275, 48, 80, 254, 15, -91, -38, -70, 552, 222, -331, -28, 140, 264, 71, -76, 66, -73, -121, 300, 167, 5, -201, 253, 144, 27, -251, -48, -240, -140, -124, -87, -290, -187, 125, 405, 335, -239, -16, 11, 299, 144, -180, -227, -122, 152, 154, 4, -160, 70, 264, 103, -371, -420, -337, 208, 360, -44, 41, 30, -34, -11, -178, 120, -201, -76, 392, 274, 52, -232, -262, 80, 126, 202, -282, -105, 113, 115, -7, -272, 55, 60, 75, -64, -98, -127, -34, 187, 481, -417, 6, 119, -87, 297, 88, -246, 43, -155, 217, 48, 130, 140, -195]
7612a95M15J06l20k71J71nN9L94m17l49J22N20O1m26j97M23L6o1j60O6j44M95
7634C23j38k81J51l53O14J12k57n60O21l4M2l08Q8J2K6O7n9j44J5J43j24L18l16
7657d2j5j4j23J91j12j38L18j68M62l10m0m0j19J47K18Q5m55k30K10L62P8n77
7679c12O0L32J50J4l33r2K6M36k06Lk42J05M43j11o10J41q6J02J45J55m19J50
7701a49L14N2n5n90K54K69J61j81Ol84N9L13j1K02n58R8L04K63l74l4j44J54M5
7724A4J83m17r0L42M15k98k22O4j85J81L00r1Jk44K7K82n5k64j99l9M45K10m66
7747a06oK04K00p4l78j87K23K77OJ81l40q0J87J8O9n51J72K79K9j2R3m77r4N07
7771A40j56K24l37J0K25k17q7P6R2K00K0k84p3J82k45J94J18n1m89kM27M8K79
$$ y = [-195, 220, 326, 6, -265, -94, -99, -40, 354, -63, -412, -290, 230, 291, -135, -332, 91, 127, 66, -94, -28, -172, 323, 185, -96, 55, -298, 316, 428, 171, -389, 232, 198, 240, -68, 20, 32, 58, 125, 66, -78, -63, 80, -44, 274, -42, -57, -71, -194, -3, -115, -253, 65, -103, 359, 49, 9, -31, -150, -3, 215, 300, -155, -385, -175, 187, 265, -312, -252, 80, 230, 244, -89, -181, -155, 281, 75, 78, -164, -59, 384, 273, -337, -196, -282, -180, -35, 120, -299, -149, 165, 217, 162, -428, -174, 95, 256, 75, 81, -303, -244, 69, 58, 260, -298, -200, 104, 367, -7, -41, -185, -31, 14, 197, -220, -310, 32, 447, 149, -73, -9, -194, -13, 287, 196, 197, -47, -20, 262, 207, -57, -256, -295, 150, 360, -106, -112, 92, 292, 218, -160, -347, -124, 153, 159, 340, 0, -80, 107, 125, 194, -357, -185, 94, 123, 111, 204, -273, -367, 140, -16, 208, -129, -119, 106, -111, -198, -122, -30, 170, 190, -94, -167, 15, -230, -36, 82, 31, -458, -460, -33, 15, 294]
7794B94j10j24L4J61n02K00K37N2J49n0m95lj53L41K59l53Kj33O1J51O0k67O4
7817a25n6L05J44k41k13N8J77p6J03Lk99M10l5k8j08l4m6K33m2m47K20nM05j78
7841A25k02J30l13K44P8J55k06j82N41m21Q2J10j43m1J65j39J98l91J20L99j52
7862A57n1l4q6j57M32k97k52P9L95k46K7J9k21M04j06J58m10K79k1L7J08K6j84
7885E6j43K16p0m8j65k43M81o5K81l36K3o1J43K88l54j91k6N9j6j09Q9j60L08
7908d3K96l78O3j40M35j04M4n75J01J50J07K84l08n0J68k6O8M9o1P6k18J94j1
7931A21k52J5M0L15k14J52k97o7Q4L9J81k13k84K33L79l12J38j29R0K18l5j66
7953C6m99L74J69ol41M24j87K88n28N58l05j40J3J60K55l35k17K16Q3q9K02j30
$$ y = [294, 184, 60, 94, 255, -247, -47, 190, 242, 391, 341, -154, -157, -310, 31, 290, -63, -61, -194, -133, 18, 78, -189, -125, -181, 124, 268, 27, -186, -128, 49, -27, 76, 79, -220, 190, 155, 127, 19, -15, -61, 172, 130, -317, -97, -102, 303, 125, -77, 53, -260, -16, 62, 217, 11, -171, 370, -51, 31, 141, -2, -43, 122, -17, 181, -210, -90, 309, 157, 106, 72, -14, -171, 261, -36, -288, -209, 186, -60, -33, -14, -235, 169, 63, 221, -189, 90, 69, 106, 214, 240, 56, -87, 129, 59, 11, -154, -397, 84, 19, 300, -36, -13, -74, 69, 357, 3, -188, -214, -155, -171, -280, -191, -351, -43, 253, -125, -62, -202, 233, 129, 173, -402, -301, -151, -44, 240, -68, -118, 50, 24, 92, 141, 80, 156, -62, 132, 121, -131, -116, -76, 239, 25, 177, -120, -187, -103, -64, 117, -96, -380, -147, 232, -80, 58, -71, 19, 237, 202, 36, -463, -89, 80, 74, -267, 157, -30, 258, -270, 288, -17, -157, -144, 16, 271, -64, -281, -65, 18, -71, 131, 1]
7975Aq4M59m67J28J4k67J63M28m34k5J57j92L43k62K1k9L36j75L24l31j14K34
7997B28L6J95l05m12QJ24M91m17p4j83K87Q0l1K0l50K00J19K28q9m64P6J30J46
8020D3L2K8k48O1K37J7o10N17j60J96K02j99k87K90k24L99J86p53%M28K83n60
8042a22n3J1j26M34j05j43l65K58K99J74m15j00Q7L33O3j55j32J95J30l07O2P6
8064I9m35M78J4l89M07l69J1K19L40k70j22k32K81p8J92J1m83L40M9j57m6j06
8086b46J97J05m0J8l10P9K03J50k18N6J9k49N33j29j96o01P49L0j01p5p3L49j53
8109I7m0J62l86J46j89K68j37Pj8K98J08n5K3m11m1J24OK82m26J9K22L9J45n13
8133b70L42j04oR6k5k48K6K27P6q6r2k99L41L1o0k3n3R1J62o4O9l07M10j86K79
$$ y = [1, -83, 376, -91, 37, 51, -216, -53, 375, -59, -84, 73, -119, 224, -38, -17, -46, 290, 115, 439, 108, -6, 228, 264, 459, 154, -258, -250, -126, 365, -52, -126, -309, -22, 58, 27, 47, -303, -103, 16, 244, 155, -309, -233, -103, 43, 75, 103, -145, -84, 153, 170, -440, 77, -83, 113, 315, 116, -171, 119, -105, 294, 480, -273, -273, 155, 438, -122, -175, -164, -290, 144, 39, -104, -469, -211, 88, 262, -153, -253, -166, 167, 230, 75, -57, 138, 268, -39, 23, 99, -336, 142, 156, -233, 174, -195, -184, 35, 375, 105, -17, -249, 32, -46, 146, 157, -326, 14, 63, -94, -140, -246, -49, 56, 16, 34, -276, -197, 6, 156, -62, -6, 13, -236, 297, 168, -28, -629, 120, 150, 49, -26, -99, 250, 97, 57, 219, -167, -21, -210, 58, -79, -72, -90, 208, 316, 261, 284, -127, -168, -44, -38, 244, -182, -163, 59, 98, 243, -270, 72, -32, -38, 58, 33, -215, -189, 38, 114, 28, -64, -363, -22, 9, -51, -74, -127, -36, 126, 62, 131, -176, 234, 48, 327]
8158C27m13k25J74J69J23j78RK19n7Q5K23m87j92q8M05l54N9m5R2J65p3J52r0
8181@Q9k17O9N1J47l59N62l37K26k76
$$ y = [327, -86, -311, -137, 32, 155, -23, -14, 205, 148, 233, 456, -31, -223, -311, 94, -260, -201, -246, -154, 11, -62, 90, 0, 89, -128, -59, -8, 139, -220, 342, 5, 231, -45]
8191d5
$$ Imaginary data points
##PAGE= N=2
##DATA TABLE= (X++(I..I)), XYDATA
0@%%%%%%%%%%qJ6j6J6j6K4l2L4m2M8n6P2q2R0j04J20j38J60j83K07k34K62k94
33a56L32l70M11m58N11n66O27o97P70q54R47j047J160j289J434j598J788k011
51a066K275k594K991l497M171n119O558r036J4492m8848M0547Q4582n7461n7589
65b9594k1015L9042N8254J7624p4002n9312K7523O8631K3484l3419o2625j0277
77e5686P0448O0749m1428p3920j1200M6229M2010N95n2927m6458L0882P2633J4579
90E6506n1173m7208O453N3564L7611l6341o7118o993N5960M4975j2160n2501l1879
103e0304L7775O2736n90o1190l9840K0282N1100K5612l5425n6988K401O2636L9266
116E7471k8615n6373j9975M0512N2248q769o1414l0222L5054N1220J5112l5628
$$ y = [0, 0, 0, 0, 0, 0, 0, 0, 0, 0, 0, -8, 8, -8, 8, -8, 16, -16, 18, -24, 24, -32, 40, -42, 48, -56, 64, -74, 86, -97, 110, -124, 138, -156, 176, -194, 217, -241, 270, -296, 331, -366, 404, -450, 497, -550, 610, -679, 755, -843, 945, -1066, 1209, -1385, 1606, -1891, 2280, -2839, 3719, -5317, 9175, -39673, 874, 85456, 27995, -29594, -50609, -11567, 46687, 64311, -9691, -69003, -41480, 27151, 50635, 17216, -45409, -55686, 14762, 75511, 34083, -39837, -51037, -4808, 37202, 37797, -15130, -61588, -30706, 41927, 56506, 5333, -41875, -35422, 18142, 55753, 19412, -47706, -54699, 1261, 46236, 34076, -18425, -50304, -12529, 50207, 49617, -11573, -51413, -31131, 19969, 45581, 10156, -46832, -44431, 18205, 57471, 28856, -27517, -47492, -6980, 45268, 36499, -24915, -55137, -20083, 31137, 46249, 10621]
128A0621m9560J427N7771L4918l7846n7016q972M3716M6255p259n3214k7827L6330
141a0656M9588L560m1109m1862M707N0879L0408l6080n0985L521M8301L3673j5393
154B8552m6887k2699L4527M3985o968m6400k7585J9859M6431J9990l5978m5043
166c8216J0757M8892K1693k8701m4201j1374L7111M1432j0929m7731j8389L1825
178g831M1609N019l8747l9220J1814M8041J7511l4485l9787J587M2364L4109j6416
191B5568m7868j5382L6060L6758o506m1027k9764J7848M8032J5961l7334l7650
203c5304J0050M2152K3565k2406m5117j2104L6749L5868j0797l9290j9454K3744
215a2344M1191Q659l7977l4450J3504L9147J4336k6569l5370k523L7435L1188
$$ y = [10621, -38939, -37512, 20259, 55177, 17331, -39685, -48657, -4941, 41314, 34055, -19159, -46986, -10656, 38932, 42492, 1383, -40479, -35772, 15107, 45515, 9435, -41550, -38029, 10272, 43945, 28552, -18335, -41034, -6507, 37478, 30510, -15890, -43475, -23616, 22815, 42805, 6827, -38216, -27459, 21433, 43126, 14425, -29776, -41150, -4039, 37393, 26464, -21267, -39656, -7831, 33778, 38797, 50, -39170, -27356, 20685, 38196, 3711, -36076, -34489, 7875, 41984, 25568, -22300, -37682, -1622, 35136, 28630, -12397, -42161, -24313, 23719, 39680, 2346, -35304, -25254, 16898, 40463, 18057, -27060, -39164, -2415, 33453, 22656, -16634, -36088, -12344, 28847, 37506, -471, -34921, -21417, 17730, 32066, 5497, -29873, -32396, 5039, 36227]
227C6227j6117l9431j0359K8523L1542l787l7467k7099J9951M0267Q394l1361
239g17k9304Q018L7428K2319k3765m0277n352L3630K7722j1310l5493j7938K5238
252i801L9597K778l6548k7518J3969L5658J3756k7170l6139J436L7773K5680j6769
265A6702l5278j1159K7407L3789l666l9167k4406J9533L6860Q625k8542l0432
277b9734O379L7751K1865k2828l6601n790K9271K7031p943l5038j8035K4066L5400
290B5794K695l1273k4648J0638L3557J3597k5964l3052K256L3012K1879j3954
302A4537l1823r664K6446L0173o148l4798j9926J8411L2028P055k7886k8091R508
315b0178L5865J6771k1841l2907l798K8499K6103j0867l5322j4560K4407L2816
$$ y = [36227, 20110, -19321, -29680, -1157, 30385, 26598, -10869, -37968, -18017, 22250, 30644, -717, -30021, -22003, 15425, 37744, 13979, -26298, -31650, 1980, 29702, 18392, -17101, -35039, -9801, 29796, 32574, -3974, -31492, -17523, 18135, 31891, 4721, -31418, -29982, 7791, 33471, 16702, -18576, -29735, -2328, 31461, 27795, -11372, -35778, -16245, 20615, 29240, 698, -29734, -23355, 14396, 36261, 13433, -23168, -28958, 313, 27344, 19401, -15637, -33672, -9606, 25794, 28489, -2784, -27432, -16794, 16763, 30360, 4396, -28656, -26400, 6612, 28491, 14537, -17286, -26950, -504, 29669, 23521, -11277, -31203, -12792, 19236, 26291, -1595, -29686, -20178, 15687, 32458, 10617, -22290, -26088, 2411, 28514, 17647, -17675, -32235, -7828, 24988]
327B4988J629l0271k4548J2702L4499J1024k6388l1051J629L1469K3128j3883
339A4927l3607r485K7883K9316o044l2234j9982J5478L1965P924k7208k7274P927
352b0414L2895J7867j8518l1573n367K8253K3731j1293l0691j3142J9962K9101
364B0811L322k7149k3162J2611L1873R145k4381k7424K061K8673J9478j4416l0227
377a8785o261K5963K5592n045l0403j9041J6834L1075M075k8222k3311R839L0407
390A2717J5191j7766k9979l737K8177K2585j1519l1540j2846K1356K8949J052
402B2640k7735k0511J3073K9275J0077k1847k8042j28K9013K0146j4814k9402
414a8255o282K4271K5173l726k8815j7865J5483K7986M482k4164k3418O233K9545
$$ y = [24988, 26617, -3654, -28202, -15500, 18999, 30023, 3635, -27416, -25787, 5682, 28810, 14927, -18680, -28165, -282, 29034, 22990, -9244, -29226, -13748, 18217, 26141, -1067, -28341, -20414, 12481, 30348, 11830, -19743, -25110, 3143, 26874, 15581, -15110, -28252, -8290, 20811, 24133, -3016, -26178, -13567, 18306, 27451, 3070, -24354, -22293, 6380, 25858, 11442, -18785, -25046, 917, 26509, 21464, -8939, -27980, -11146, 19929, 24004, -4218, -27529, -17690, 12717, 27908, 10142, -19837, -23574, 4603, 27188, 15669, -15871, -28717, -7361, 21588, 22640, -5095, -25606, -12533, 16742, 26819, 4972, -23070, -23198, 5815, 25961, 11147, -18255, -24537, -266, 24907, 21181, -7634, -25499, -10016, 17970, 22452, -1712, -25130, -18897, 10648]
427A0648J5916j7795k7593j633K5118J9213r295k7381j2995J8636K6797J97k5613
440e780j7460J2071K7535Q567k1549k5116K769K6684J5326j4720k5715n539K2223
453g04K4412m345k8438j5958J7508K6408K150k3986k1652P757K7752J3713j7261
466G356k5670j842K4435K0329r504k8552j2049J9766K5063m75k4574j6896J1024
479a1589K6248R800k0660k4416J870K5462J5679j3258k5435o294K1613K3056m723
492A7353k5399j3544J3794K4051M114k2093k1070O879K6125J1829j6028k2596
504a6585j702K2474J8500r269k5812r773J7498K2138o46k2848j6160J1754K5921
517A5490O643k0431k1129L689K3209J3882j3189k4817m959K2018K0883n596k4591
$$ y = [10648, 26564, 8769, -18824, -20457, 4661, 23874, 14579, -12802, -25797, -7161, 19636, 19833, -5780, -23240, -11169, 16366, 24933, 3384, -21732, -18963, 7721, 23047, 8327, -17388, -22927, -704, 23708, 19363, -9075, -25033, -7525, 18883, 21033, -2953, -24605, -16848, 10904, 24617, 7356, -18314, -20156, 4279, 24608, 15104, -13448, -25497, -5731, 19332, 18857, -5717, -22613, -11589, 14659, 24459, 3799, -20617, -18747, 6715, 22394, 9136, -16299, -22593, -980, 22076, 17353, -8046, -21590, -7796, 16255, 20369, -1724, -22794, -15915, 10210, 22039, 6011, -16585, -18287, 4187, 22687, 13418, -12394, -22167, -4669, 17469, 16823, -6025, -22185, -10431, 15490, 22133, 1702, -19427, -15738, 7471, 21353, 8164, -16653, -21612, 406, 21289, 15693, -8898]
530h898j2601J4606K4654K780k3677j9465Q325K4262J1188j5165k2955j364K2510
543D200J8590r525k5242r049J6430K1594o79k2243j5837J1418K4319O820j8120
556B676k0630K222K2305J4027j2651k3575m757K0003J9246m583k1890j2412J3656
569f363K2957K130k1023j8014O987K2622J0089j4479k1431j72K1179J6000q823
582A1659k2582q350J5587K0385j215k2322j3936J2139K2058N685j7395j9032K523
595a4796K2423J2917j3302k2826l545J9146J8728m798k2258j1541J4592K2063
607A6803J401j9962j7517N732K2699J0057j5087k0927M06K0757J5290q159k1663
620a0170q901J5504K0234j982k0797j3596J0160K1757O267j6527j8595L327K1142
$$ y = [-8898, -21499, -6893, 17761, 20541, -3136, -22601, -14276, 9986, 21174, 6009, -16946, -18310, 4200, 22790, 13265, -11977, -21026, -4596, 16998, 16319, -5924, -21761, -10343, 13976, 20796, 2676, -17954, -15732, 6573, 20600, 7949, -15626, -20383, -380, 18866, 14283, -7607, -20019, -6363, 16594, 18724, -2299, -20313, -13326, 9296, 19385, 4906, -16525, -16697, 4482, 20482, 11659, -10923, -19273, -3686, 16699, 15484, -6838, -20774, -8635, 13423, 19108, 1713, -17319, -14796, 7627, 20544, 7242, -15584, -19129, 17, 18745, 13947, -8311, -19852, -5260, 16803, 18204, -1758, -19275, -13543, 9156, 19213, 4126, -16801, -16395, 4362, 19652, 11493, -10170, -19071, -3567, 16667, 14685, -6112, -19708, -9548, 12209, 18476, 1949, -16646, -13319, 7823]
633G823J0982j2450k0018l960J7214J7603m130k1379j0363J4159J9851J365j8423
646a726j6045O032K0751Q651j4583j8634N43J8987J4435p651k0752p923J5823
659b092J8795l231k0307j1995J0547K0265N475j6610j7896M365K0698J0573j1672
672F915k0388m045J7656J7237n611k0974q538J3316J8997J873j7718j6189N785
685a1684K0951Q193j4488j8366O68J8160J4022p281j9889o697J4604J6717k234
698A2676j7891j2342R235J9853M981j6048j6054M461J8628R501j0994j8311l693
711a5998J6318J5528n414j9124q376J2628J8353J575j7934j3782O945J8771O246
724A5736j3153j6939M15J7483J3320q210j9054n012J4673J5980l213j8007j1359
$$ y = [7823, 18805, 6355, -13663, -17623, -409, 17194, 13064, -8315, -18678, -4519, 15332, 16697, -1726, -17771, -11739, 9012, 17663, 3080, -15554, -15011, 3976, 18411, 10760, -9992, -17915, -2092, 16703, 13472, -6835, -18830, -8283, 11982, 17457, 847, -17049, -12684, 8014, 18587, 6915, -13473, -17518, 138, 17375, 11764, -9210, -17748, -4432, 14565, 16438, -1280, -17469, -11684, 9267, 17460, 2972, -15394, -14726, 3434, 17456, 10175, -9714, -16411, -1807, 14910, 12676, -5215, -17557, -8322, 11531, 16512, 464, -15590, -11129, 7499, 17000, 6006, -12305, -15998, 320, 15848, 10434, -8690, -17066, -4438, 13915, 15490, -2444, -16226, -9281, 9490, 15736, 2583, -14356, -13941, 3542, 16862, 8652, -10402, -15414, -741, 15239, 12026, -5981, -17340]
737a7340J0356J8538L460j5453j4407M123J7833J0321j1271j8746k802J6654J4040
750A5306n534j7864q294J1510J8239J600j7163j3331O766J7011P154j2337j6897
763a3834K0J7536J2055q114j6910m670J2681J5281j995j7532j1009R771J7569
776A0849K818j4169j3575L638J7395R327j0807j7425j641J5129J2597m559j7419
789g842q127J2043J7195r9j5853j1464O249J6436O316j2677j6073J418J6503J1053
803A5078q184j6304m848J3838J4922l110j7432r530R807J6044L191j3703j4426
816a4657M173J7718Q609j1145j6162j286J4138J2674n040j7080p301J1828J5794
829A2263J87j4544j1601N659J6429O161j2753j5081K029J4714J0137o806j6020
$$ y = [-17340, -6984, 11554, 15014, -439, -14846, -10723, 7110, 17431, 6160, -12586, -15388, 1266, 15306, 9772, -8092, -16386, -4876, 13363, 14963, -2200, -15531, -8765, 8246, 15400, 3063, -13834, -13814, 3722, 15777, 7663, -9247, -13917, -1236, 14045, 12050, -5482, -16491, -6720, 10849, 13667, -502, -14077, -10439, 6956, 16283, 5476, -11949, -13590, 1539, 14136, 9577, -7842, -15969, -3926, 13269, 13170, -2683, -14147, -7898, 8538, 14854, 2177, -13896, -12478, 4025, 15078, 6894, -9410, -14258, -420, 14502, 11392, -6040, -15570, -5763, 10281, 13472, -231, -14657, -10484, 7234, 15843, 4698, -11464, -12750, 1388, 14062, 9022, -8058, -15359, -3531, 12263, 12450, -2094, -13695, -8036, 8393, 14554, 1801, -13280, -11251, 3463, 13600, 6794, -9226]
842i226m219J3210J3708k954j6245q292P996J5881K994j4041j2837M965J6564
855G504O768j0069j4915j688J4195J2061n991j6071n709J0881J4459N71j4625
868b629j1171O888J6257M233j2228j3271P02J4858J0027p362j6051l095J3166
881C24J2697l044j4938q918Q688J5515K253j4062j2087M833J4923Q119r832j5146
895a0675j505J4570J1143o190j4858n916J0156J4132K62j4193j0002P032J4382
908H338M408j1055j3273J352J4087R171q079j4570k099J1771J2001k223j4875
921e046p992R261J3929J048j2753j1053M222J4856P053j0459j3481j26J3419R728
935A2606n682j4188o331J0970J3819r36j4015q280O617J3720M154j0987j3216
$$ y = [-9226, -13445, -235, 13473, 10519, -5726, -14018, -6022, 9859, 12853, -1188, -14025, -9060, 7504, 14272, 4203, -10712, -12400, 1795, 13856, 7865, -8206, -13915, -3034, 11425, 11996, -2629, -13800, -6912, 9345, 13578, 1350, -11921, -11219, 3639, 13666, 6304, -9747, -12842, 324, 13021, 9977, -4961, -13879, -5191, 10324, 12577, -1485, -13572, -8739, 6184, 14303, 4471, -10675, -12180, 2390, 13533, 7343, -7515, -13431, -3275, 10857, 11119, -3074, -13076, -6044, 8338, 12746, 1691, -11582, -10230, 3857, 13028, 4949, -9621, -11720, 51, 12052, 9829, -5046, -13038, -3777, 10152, 11200, -1553, -12606, -8384, 6472, 13525, 3066, -10415, -10541, 2878, 12606, 6924, -7264, -13595, -2625, 11194, 10258, -3757, -12037, -5420, 8300, 12454, 1467, -11749]
948a1749J908J4110P784p626j3108k885J1632J2260l034j4948o804R056J2871
961I467J013j1913j0522L859J4268O457r586j2840m55J2710J0096n577j4724m565
975a2312J0345J2091j028j2139q990O481J3494M057j1369j1735K217J3251P075
988A1438p042j3218k328J1898J0708l587j2876o578Q356J2481J359j2630j0316
1001a2335N644J3240M802q816j1982k69J2533R570o027j4157l822R804J1612j005
1015H792j2138q639O604J3803K719j0700j0806K135J2240P654p599j3228j485
1028a0648J1943R663l696j2308o058P873J2438R29j2043r414M784J2156N428q776
1042B271j1842N70J2572P717n931j1882m114R092J1058r83j2393p177O492J2336
$$ y = [-11749, -9841, 4269, 12053, 4427, -8681, -11566, 66, 12326, 9292, -5656, -12460, -3404, 9467, 10480, -1433, -11955, -8096, 6172, 12629, 3043, -9797, -10252, 2458, 12554, 6977, -7747, -12312, -1967, 10124, 9096, -3043, -12033, -5552, 7942, 11999, 630, -11105, -8888, 4363, 11438, 4396, -8822, -11150, 748, 11456, 7869, -5007, -11585, -3229, 9252, 10611, -2019, -12335, -6691, 6549, 11351, 2535, -9447, -9716, 2817, 12387, 6360, -7797, -11619, -1815, 9797, 8792, -3346, -11985, -5381, 8422, 11141, 441, -10365, -8230, 4010, 11664, 4065, -9163, -10648, 1295, 10958, 7262, -5046, -11104, -3231, 9207, 10136, -1907, -11321, -6537, 5619, 11047, 2271, -9571, -9001, 3571, 11288, 5357, -6525, -10639, -1547, 9511, 8528, -3865, -11042, -4550, 7786]
1056G786K699j0117j0320K338J2259O336q141j1623o81J0265R525l660j1875n944
1070a1153Q834J1863m64j1340q557N024J1695M463q659j1361R34J2071P620n569
1084E401j2153l599R176J0649j757j1511o908O303J1731K873r693j0109K702J1556
1098D661N741p413j1157j313J0468Q516k578j2391m624Q024J0654L23j0858q569
1112a0516M327J2233M077r009j0058J154J0571P498n334j1442l345R296R685j998
1126G139j1309n955O225J1168K310j0061q577K645J1090N262p042j0991p22J0221
1140A403Q583m275j1434l606P686J0081J37j0480q220M678J1849K985q789r423
1154h825O95J1172P288n546j1370k440Q437R365k048j0694o092O397J1015J484
$$ y = [7786, 10485, 368, -9952, -7614, 4645, 10981, 2840, -8783, -9464, 801, 10326, 6666, -5209, -11153, -2319, 9544, 9080, -2260, -10817, -5793, 5902, 10365, 1706, -9655, -8721, 3350, 10970, 5401, -6752, -10351, -1175, 9474, 7717, -3794, -10702, -4399, 7332, 10205, 512, -9597, -6895, 4661, 10402, 2989, -8168, -9481, 987, 9503, 6925, -5466, -10090, -2066, 8588, 8911, -1947, -10516, -6189, 6044, 10121, 1112, -8946, -7792, 2779, 10277, 4943, -6499, -9844, -548, 9137, 7139, -4170, -10125, -3900, 7268, 9578, -483, -9060, -6415, 4675, 9937, 2895, -8096, -8818, 1403, 9986, 5711, -5723, -9329, -1643, 8438, 8575, -1905, -10125, -5447, 6402, 9387, 598, -8825, -8130, 3042, 10330, 4784, -6586, -9026, -589, 8776, 6728, -3966, -10058, -3661, 7354, 8838]
1168H838r499q542L274J0706M969o998j0609m97R568Q262m091j0745l886P512
1182a738J0065k51j0234p589N195J0355K827p960r102J167J0351O578n318j0460
1196f114k403Q495Q587k378j0121n604O359R967J113q973p586L032J0286M397
1210I057o741r910j86R615P077m039j0428l633P620R968j274r248o869M894R727
1225E630K940q404q682J356J0415O205n831r526k424Q599Q445k428j0225n204
1239i134O047R734J300r081o946L061J0093L688o879r043k4Q721O851m228r229
1254e069l476P639Q949j077r794n757M800R420K691q081q188J593R857N179n639
1269C047r199j463Q261P596k770r708m316O225Q899P49q684o809L343R877L588
$$ y = [8838, -661, -9203, -5929, 4777, 9746, 2748, -7861, -8358, 1210, 9472, 5381, -5364, -9250, -1738, 8327, 8076, -2158, -9747, -4552, 5803, 8630, 670, -8432, -7265, 3086, 9664, 4346, -6114, -8517, -22, 8565, 6187, -3934, -9538, -3179, 6788, 7901, -1072, -8658, -5626, 4660, 9057, 2316, -7594, -7780, 1835, 8912, 4873, -5555, -9188, -1568, 8400, 7126, -2122, -8991, -4097, 5630, 8570, 166, -8516, -7160, 3255, 9460, 3629, -5897, -8321, 278, 8723, 6295, -3930, -9134, -3087, 6647, 7947, -1134, -8080, -5019, 5074, 8762, 1883, -7160, -7184, 1537, 8388, 4160, -5069, -8545, -906, 8043, 6966, -2828, -8585, -3785, 5635, 8326, 245, -7943, -6350, 3507, 8686, 3047, -6152, -7615, 646, 8242, 5472, -4236, -8552, -2327, 6572, 7321, -1363, -8172, -4829, 5048, 8636]
1284H636p159q751J97R099O465m502r431k664P514Q184j190q901n865M833R204
1299E669K269p994p758J904R081M885n008r011j178P556P661k728r308l751N568
1314b143Q222M97p875o614L541R185L029o539p971J17Q434O459m645r355k099
1329g757P383P711j279q677n140M379R355J588p756p069J996Q061N252n646q670
1344f269l36P711O676l064q716l875N731Q361L53q592n457L353Q510L320o312
1359A394p808LQ966N183m255q539k603O661Q222j352q919m719M996Q366J333p117
1375a88p027J852Q545M554n378q266p82P719O250k053r148l614O120P783p36p417
1391a786n412L114Q653K928o219p931J064P998N088m367q239k225O768P756j834
$$ y = [8636, 1477, -7274, -7077, 2022, 8487, 3985, -5446, -8110, -596, 7588, 6398, -2503, -8368, -3535, 5669, 7938, -56, -7814, -5910, 3171, 8056, 3048, -5963, -7141, 415, 8076, 5348, -3960, -7711, -2143, 6079, 6576, -1299, -7913, -4372, 4813, 7842, 1303, -6668, -6551, 1883, 8342, 3697, -5658, -7757, -374, 7337, 6058, -2619, -7759, -3380, 5975, 7563, -193, -7262, -5266, 2795, 8047, 2401, -6269, -6605, 1106, 7782, 4718, -3998, -7873, -2142, 6219, 6572, -2020, -7477, -4124, 4386, 7706, 1394, -6414, -6411, 2555, 7738, 3483, -5056, -7659, -998, 7224, 5872, -3047, -7766, -2770, 5596, 6929, -188, -7215, -5363, 3182, 7736, 2358, -5908, -6690, 1029, 7279, 5226, -3922, -7536, -1416, 6367, 5631, -1786, -7198, -4084, 4569, 7497, 1278, -6653, -5589, 2409, 7497, 3130, -5109, -7334, -566, 7190, 5356]
1406E356q522m032M943P463J642o894p033K107Q144L966n249p598o90P417O356
1421G376k798q842k836O042P219m56p497n385L355Q719K557o927p265J610P525
1436B397M868m262q156j996P121O785j950p431m687M975P595J592p071o828K316
1451d732Q336L113m949p569m40P243O061k714q302k566N294O868m77o994n175
1466g003L942P341K036n899o262O68P651M695m418p693j799O761O349j725p437
1481b793m130M666P726Q61o867o096K357P617L455n309p249k60P547N139l262
1496C402o956k914N343O589k10p425m950L944P380K094n791o838J252P646M544
1511G110m805p114j298N972O020j205p504l952M586P309R38o882n307K108P161
$$ y = [5356, -3166, -7198, -2255, 5208, 6850, -44, -7077, -4970, 3174, 7140, 1891, -5707, -6397, 1020, 7376, 4578, -4264, -7100, -1058, 6161, 5705, -1792, -7177, -3822, 4897, 7454, 527, -6738, -5128, 2397, 7265, 3003, -5153, -7149, -28, 6757, 4807, -2624, -7311, -2336, 5259, 6851, -220, -7048, -4732, 3604, 6717, 1768, -5801, -6241, 1002, 7063, 4349, -3953, -6519, -1225, 5643, 5166, -1828, -7003, -3061, 4280, 6316, 417, -5845, -5177, 2474, 7169, 2751, -4942, -6741, 20, 6369, 4644, -2793, -6923, -2257, 5469, 6330, -537, -6633, -4276, 3341, 6796, 1487, -5762, -6022, 1525, 6664, 3402, -3554, -6468, -1125, 5464, 5254, -2171, -7121, -3177, 4203, 6297, 506, -6332, -5080, 2566, 7110, 2305, -4809, -6107, -135, 5885, 4680, -2824, -6776, -2190, 5119, 6057, -825, -6132, -4024, 3137]
1526C137L481n107p222M08O789M672k724o853k919N688O399o92p375m156L685
1541b789O907J896n894n979J293P073M000m080p387q21N931N777j785p597k901
1556f356M792O445P66o266n023J824P059K971n086o793K17O867M650k788p283
1571d004j834N248O057p04o570m242L334O772J836n516o376J690P368L080l720
1586B419o877j045N927N341j587p006l516M806O648O7n984n289K815O622K193
1601E534m623n794K28O084M324k773o741j976N652N629j271o297m047L783O439
1616D151J224n823n157J496O592L425l768o609q30O089M960k355o513k559L929
1631a748O373L94n988m383K287O601K217m860n885J65O521M348l429o416j557
$$ y = [3137, 6618, 1511, -5711, -5303, 1486, 6158, 3434, -3419, -6338, -650, 5749, 5057, -2318, -6474, -2789, 4118, 6014, 120, -5859, -4566, 2507, 6507, 2427, -4960, -5781, 150, 5927, 4142, -3455, -6356, -1564, 4881, 5647, -619, -5642, -3818, 3241, 6212, 1126, -5667, -5450, 1417, 6067, 3279, -4004, -5838, -590, 5467, 4763, -1807, -6049, -2715, 4057, 5893, 377, -5999, -4309, 3059, 6139, 2419, -4458, -5503, 424, 5765, 4178, -2828, -6344, -1538, 5110, 5177, -807, -6096, -3281, 3341, 5534, 911, -4883, -4655, 1429, 5753, 2980, -3761, -5737, -85, 5544, 4273, -2024, -6071, -2288, 4151, 5375, -448, -5605, -4109, 2483, 5908, 2140, -4469, -5299, 790, 5750, 3395, -3118, -5677, -1748, 4625, 5019, -969, -5352, -3065, 3536, 5753, 893, -4992, -4827, 1694, 6042, 2613, -3803, -5360]
1646e360M955N716p33o379l979L451O513R95n471n102J755O135L356m020o395
1661d563m37N816M436j915o188l062M291O280J54o067m154K700O025K176m678
1676H14n628p8O534L864l145o113j616N382N227r67o548l627L960O254N28n340
1692d99m764J369O158L474m165n922k09N604M139j976o094k668M512N714k43n600
1708a170l976K584O004J974m420o046R01N806L870l456n681j238M596N448j099
1723D097o395k859L142N626R78n116m550J690O277K563m200n392m52N254M747
1738E410k300n996k195M332M887M4n268m030K317N929K049m641n149J013N236
$$ y = [-5360, -405, 5311, 4578, -1801, -5780, -2329, 4184, 5179, -292, -5394, -3639, 2496, 5852, 1832, -4563, -5000, 816, 5252, 3337, -2851, -5913, -1622, 4658, 4812, -1255, -5409, -2709, 3316, 5492, 814, -4814, -4892, 1642, 5506, 2361, -3752, -5368, 14, 5241, 4274, -2274, -5901, -1941, 4313, 4841, -499, -5263, -3894, 2264, 5738, 1573, -4349, -4558, 1046, 5185, 3209, -2885, -5553, -1041, 4673, 4430, -1170, -5146, -2562, 3442, 5416, 996, -5050, -4149, 1657, 5527, 2071, -3610, -4848, -252, 5196, 4097, -2298, -5157, -2015, 3611, 4589, -527, -5077, -3387, 2890, 5453, 1253, -4139, -4591, 663, 5410, 3110, -2886, -5081, -749, 4138, 4182, -1086, -5116, -2799, 3130, 5179, 538, -4611, -3598, 1638]
$$ [...]
8191c31
##END NTUPLES=NMR FID
##END=
