##TITLE=1H_DE-59_TFA
 DMSO-d6
 8 sc, 
 24.6.2024
##JCAMPDX= 6.0         $$ Bruker NMR JCAMP-DX V2.0
##DATA TYPE= NMR FID
##DATA CLASS= NTUPLES
##ORIGIN= UXNMR, Bruker Analytische Messtechnik GmbH
##OWNER= root
$$ XWIN-NMR		Version 3.5
$$ Mon Jun 24 16:00:53 2024 Russian Standard Time (UT+4h)  she@DPX200
##.OBSERVE FREQUENCY= 200.131
##.OBSERVE NUCLEUS= ^1H
##.DELAY= (6, 6)
##.ACQUISITION MODE= SIMULTANEOUS
##.ACQUISITION SCHEME= undefined
##.AVERAGES= 8
##.DIGITISER RES= 18
##SPECTROMETER/DATA SYSTEM= spect
##.PULSE SEQUENCE= zg30
##.SOLVENT NAME= DMSO
##.SHIFT REFERENCE= (INTERNAL, DMSO, 0, 15.7039)
##AUDIT TRAIL= $$ (NUMBER, WHEN, WHO, WHERE, WHAT)
$$ ##TITLE= Audit trail, XWIN-NMR		Version 3.5
$$ ##JCAMPDX= 5.01
$$ ##ORIGIN= Bruker BioSpin GmbH
$$ ##OWNER= she
$$ F:/spectra/data/she/nmr/H-F/1/audita.txt
$$ ##AUDIT TRAIL=  $$ (NUMBER, WHEN, WHO, WHERE, WHAT)
(   1,<2024-06-24 15:59:20.17 +0400>,<she>,<DPX200>,
      <created by zg, POWCHK disabled, PULCHK disabled
       configuration hash MD5:
       00 E9 B6 7A A2 85 ED C7 34 08 36 98 17 FE 4E 26
       data hash MD5: 16K
       D2 7D 99 71 CA 37 4D B2 1A BE 97 81 53 ED 8F 22>)
$$ ##END=
$$ 
$$ hash MD5
$$ B0 45 00 09 62 56 60 02 12 CA FD 38 2E 3E 0F 68
##$RELAX= 
##$RELAX= 
##$RELAX= 
##$RELAX= 
##$RELAX= 
##$RELAX= 
$$ Bruker specific parameters
$$ --------------------------
##$DU= <F:/spectra>
##$EXPNO= 1
##$NAME= <H-F>
##$PROCNO= 1
##$TYPE= <nmr>
##$USER= <she>
##$AMP= (0..31)
100 100 100 100 100 100 100 100 100 100 100 100 100 100 100 100 100 100 
100 100 100 100 100 100 100 100 100 100 100 100 100 100 
##$AQSEQ= 0
##$AQ_mod= 1
##$AUNM= <au_zg>
##$AUTOPOS= <>
##$BF1= 200.13
##$BF2= 200.13
##$BF3= 200.13
##$BF4= 200.13
##$BF5= 200.13
##$BF6= 200.13
##$BF7= 200.13
##$BF8= 200.13
##$BYTORDA= 1
##$CFDGTYP= 0
##$CFRGTYP= 5
##$CHEMSTR= <none>
##$CNST= (0..31)
1 1 145 1 1 1 1 1 1 1 1 1 1 1 1 1 1 1 1 1 1 1 1 1 1 1 1 1 1 1 1 1 
##$CPDPRG= <>
##$CPDPRG1= <>
##$CPDPRG2= <>
##$CPDPRG3= <>
##$CPDPRG4= <mlev>
##$CPDPRG5= <mlev>
##$CPDPRG6= <mlev>
##$CPDPRG7= <mlev>
##$CPDPRG8= <mlev>
##$CPDPRGB= <>
##$CPDPRGT= <>
##$D= (0..31)
0 1.2 0 0 0 0 0 0 0 0.06 0 0.03 0 0 0 0 0.0002 0 0 0 0 0 0 0 0 0 0 0 0 
0 0 0 
##$DATE= 1719230359
##$DBL= (0..7)
120 120 120 120 120 120 120 120 
##$DBP= (0..7)
150 150 150 150 150 150 150 150 
##$DBP07= 0
##$DBPNAM0= <>
##$DBPNAM1= <>
##$DBPNAM2= <>
##$DBPNAM3= <>
##$DBPNAM4= <>
##$DBPNAM5= <>
##$DBPNAM6= <>
##$DBPNAM7= <>
##$DBPOAL= (0..7)
0.5 0.5 0.5 0.5 0.5 0.5 0.5 0.5 
##$DBPOFFS= (0..7)
0 0 0 0 0 0 0 0 
##$DE= 6
##$DECBNUC= <off>
##$DECIM= 32
##$DECNUC= <off>
##$DECSTAT= 4
##$DIGMOD= 1
##$DIGTYP= 9
##$DL= (0..7)
0 120 120 120 120 120 120 120 
##$DP= (0..7)
150 150 150 150 150 150 150 150 
##$DP07= 0
##$DPNAME0= <>
##$DPNAME1= <>
##$DPNAME2= <>
##$DPNAME3= <>
##$DPNAME4= <>
##$DPNAME5= <>
##$DPNAME6= <>
##$DPNAME7= <>
##$DPOAL= (0..7)
0.5 0.5 0.5 0.5 0.5 0.5 0.5 0.5 
##$DPOFFS= (0..7)
0 0 0 0 0 0 0 0 
##$DQDMODE= 0
##$DR= 18
##$DS= 0
##$DSLIST= <SSSSSSSSSSSSSSS>
$$ [...]
##$SUBNAM2= <"">
##$SUBNAM3= <"">
##$SUBNAM4= <"">
##$SUBNAM5= <"">
##$SUBNAM6= <"">
##$SUBNAM7= <"">
##$SUBNAM8= <"">
##$SUBNAM9= <"">
##$SW= 18.0517599122864
##$SWIBOX= (0..15)
0 0 2 0 0 0 0 0 0 0 0 0 0 0 0 0 
##$SW_h= 3612.71676300578
##$TD= 16384
##$TD0= 1
##$TE= 0
##$TE2= 300
##$TE3= 300
##$TEG= 300
##$TL= (0..7)
0 120 120 120 120 120 120 120 
##$TP= (0..7)
150 150 150 150 150 150 150 150 
##$TP07= 0
##$TPNAME0= <>
##$TPNAME1= <>
##$TPNAME2= <>
##$TPNAME3= <>
##$TPNAME4= <>
##$TPNAME5= <>
##$TPNAME6= <>
##$TPNAME7= <>
##$TPOAL= (0..7)
0.5 0.5 0.5 0.5 0.5 0.5 0.5 0.5 
##$TPOFFS= (0..7)
0 0 0 0 0 0 0 0 
##$TUNHIN= 0
##$TUNHOUT= 0
##$TUNXOUT= 0
##$USERA1= <user>
##$USERA2= <user>
##$USERA3= <user>
##$USERA4= <user>
##$USERA5= <user>
##$V9= 5
##$VALIST= <valist>
##$VCLIST= <CCCCCCCCCCCCCCC>
##$VD= 0
##$VDLIST= <DDDDDDDDDDDDDDD>
##$VPLIST= <PPPPPPPPPPPPPPP>
##$VTLIST= <TTTTTTTTTTTTTTT>
##$WBST= 1024
##$WBSW= 4
##$XGAIN= (0..3)
0 0 0 0 
##$XL= 0
##$YL= 0
##$YMAX_a= 51637
##$YMIN_a= -95881
##$ZGOPTNS= <>
##$ZL1= 120
##$ZL2= 120
##$ZL3= 120
##$ZL4= 120
##$ABSF1= 10
##$ABSF2= 0
##$ABSG= 5
##$ABSL= 3
##$ALPHA= 0
##$AQORDER= 0
##$ASSFAC= 0
##$ASSFACI= 0
##$ASSFACX= 0
##$ASSWID= 0
##$AUNMP= <proc_1d>
##$AZFE= 0.1
##$AZFW= 0.1
##$BCFW= 1
##$BC_mod= 2
##$BYTORDP= 1
##$COROFFS= 0
##$CY= 11.3945322036743
##$DATMOD= 1
##$DC= 2
##$DFILT= <>
##$DTYPP= 0
##$F1P= 15.6554695791079
##$F2P= 12.8336369535428
##$FCOR= 0.5
##$FTSIZE= 0
##$FT_mod= 4
##$GAMMA= 1
##$GB= 0.15
##$INTBC= 1
##$INTSCL= 1
##$ISEN= 128
##$LB= 0.24
##$LEV0= 0
##$LPBIN= 0
##$MAXI= 10000
##$MC2= 0
##$MEAN= 0
##$ME_mod= 0
##$MI= 1.114404
##$NCOEF= 0
##$NC_proc= 0
##$NLEV= 6
##$NOISF1= 3.799351
##$NOISF2= 2.8
##$NSP= 1
##$NTH_PI= 0
##$NZP= 0
##$OFFSET= 15.70392
##$PC= 1
##$PHC0= -25321.85
##$PHC1= 15.58748
##$PH_mod= 1
##$PKNL= yes
##$PPARMOD= 0
##$PSCAL= 0
##$PSIGN= 0
##$REVERSE= no
##$SF= 200.130013532006
##$SI= 16384
##$SIGF1= 3
##$SIGF2= 2
##$SINO= 400
##$SIOLD= 16384
##$SREGLST= <1H.CDCl3>
##$SSB= 0
##$STSI= 0
##$STSR= 0
##$SW_p= 3612.71676300578
##$SYMM= 0
##$S_DEV= 0
##$TDeff= 0
##$TDoff= 0
##$TI= <>
##$TILT= no
##$TM1= 0
##$TM2= 0
##$TOPLEV= 0
##$USERP1= <user>
##$USERP2= <user>
##$USERP3= <user>
##$USERP4= <user>
##$USERP5= <user>
##$WDW= 1
##$XDIM= 8192
##$YMAX_p= 0
##$YMIN_p= 0
$$ End of Bruker specific parameters
$$ ---------------------------------
##NTUPLES= NMR FID
##VAR_NAME=  TIME,          FID/REAL,        FID/IMAG
##SYMBOL=    X,             R,               I
##VAR_TYPE=  INDEPENDENT,   DEPENDENT,       DEPENDENT
##VAR_FORM=  AFFN,          ASDF,            ASDF
##VAR_DIM=   8192,          8192,            8192
##UNITS=     SECONDS,       ARBITRARY UNITS, ARBITRARY UNITS
##FACTOR=    0.0002768,     1,               1
##FIRST=     0,             0,               0
##LAST=      2.2672688,     0,               0
##MIN=       0,             -95881,          0
##MAX=       2.2672688,     51637,           0
$$ Real data points
##PAGE= N=1
##DATA TABLE= (X++(R..R)), XYDATA
$$ [...]
$$ plain form
1855 -290 -42 -281 54 123 -28 -213 -63 151 32 -62 90 -247 -143 -64 7 339 -238 243 43 -10 275 17
1877 17 -152 126 -54 -61 -480 111 -84 -42 127 -129 -216 64 179 -106 -71 261 130 -34 51 36 324 -80 31
1900 31 2 -139 -89 8 -140 126 37 -87 18 43 -117 -160 95 -92 317 73 -81 108 25 -46 -279 -183 -41
1923 -41 71 64 38 109 -106 244 -122 161 -50 -173 -108 211 113 -34 -54 -43 -132 -76 137 90 -103 -105 30 -246 -48
1948 -48 -286 -48 208 260 -72 -57 135 -194 -135 -302 79 52 268 -209 159 12 42 160 -50 -99 109 145 130
1971 130 80 162 -3 111 176 -153 46 99 135 123 -19 115 97 -29 259 111 83 -6 210 10 -142 -163 62
1994 62 -10 -26 149 89 174 184 37 18 149 -8 -138 -152 -110 9 185 51 -266 -144 -383 -19 109 80 238
2017 238 -60 -64 65 57 -98 305 -60 62 -102 -77 201 39 33 -5 7 -380 8 321 -204 -103 -75 252 -352
$$ packed form
1855b90K48k39L35O9j51j85J50K14j19r4J52l37J04P9P1L32n77M81k00n3K85k58
1877A7j69K78j80pm19N91j95M2J69k56q7K80J15k85L5L32j31j64Q5j5K88m04J11
1900C1k9j41N0R7j48K66q9j24J05K5j60m3K55j87M09k44j54J89q3p1k33R6J42
1923d1J12pk6P1k15L50l66K83k11j23O5L19r8j47k0J1q9N6K13m7j93kJ35k76J98
1948d8k38K38K56N2l32J5J92l29N9j67L81k7K16m77L68j47L0J18k10m9K08L6j5
1971A30n0Q2j65J14O5l29J99N3L6j2j42J34j8j26K88j48k8q9K16k00j52k1K25
1994F2p2j6J75o0Q5J0j47j9J31j57j30j4M2J19J76j34l17J22k39L64J28k9J58
2017B38k98mJ29qj55M03l65J22j64K5K78j62ol8J2l87L88L13n25J01K8L27o04
$$ plain form
2040 -352 34 137 134 326 36 -79 43 -6 -54 54 -89 354 -309 156 58 -265 28 14 -261 213 146 142 58
2063 58 -160 -22 81 67 6 -30 221 -117 209 -26 113 283 146 -76 -54 66 -48 130 171 283 23 55
2085 55 91 -69 -20 119 7 137 299 -263 -191 -154 -112 155 -143 65 -42 133 -110 -40 222 253 -206 -107 -129
2108 -129 128 208 -40 169 15 -78 37 -166 206 25 -69 -189 112 -48 201 96 -256 224 -110 -29 -126 39
2130 39 274 35 -221 67 25 137 79 -132 51 -34 -53 -56 -140 -18 -260 59 -110 260 41 122 -134 -131 161 -251
2154 -251 157 190 106 86 135 218 148 -116 259 105 37 -106 -213 152 293 -19 48 -288 -279 -54 -77 7 7 -32 141
2179 141 54 183 295 -148 59 117 -135 -248 -109 -279 -179 123 -6 118 -4 34 13 -38 80 -82 -17 103
2201 103 -67 -22 235 79 70 15 137 86 -71 130 156 43 70 -234 105 198 33 360 114 -237 -236 45 78 -67
$$ packed form
2040c52L86J03lJ92k90j15J22m9m8J08j43M43o63M65r8l23K93j4k75M74o7mq4
2063E8k18J38J03j4o1l6K51l38L26k35J39J70j37k22K2J20j14J78M1J12k60L2
2085E5L6j60M9J39j12J30J62n62P2L7M2K67k98K08j07J75k43P0K62L1m59R9k2
2108a29K57Q0k48K09j54r3J15k03L72j81r4j20L01j60K49j05l52M80l34Q1r7J65
2130C9K35k39k56K88m2J12n8k11J83q5j9lq4J22k42L19j69L70k19Q1k56LK92m12
2154b51M08L3q4k0M9Q3p0k64L75j54o8j43j07L65J41l12O7l36RK25k3Q4%l9J73
2179A41q7J29J12m43K07N8k52j13J39j70J00L02j29J24j22L8k1n1J18j62O5J20
2201A03j70M5K57j56rn5J22n1j57K01K6j13K7l04L39R3j65L27k46l51JK81L3j45
$$ plain form
2225 -67 -37 102 10 95 154 242 -8 -26 -236 -12 134 -67 -263 61 109 135 -52 -196 -103 81 -69 -90 -6 -22
2249 -22 -174 188 -67 -14 -131 -69 -23 -242 116 137 13 -6 -32 -166 -94 -53 92 -186 -20 -4 37 161 153 -83
2273 -83 -242 -332 -25 102 115 -210 -238 4 -80 -94 187 -62 -45 3 69 -300 -87 28 -56 270 384 -10 320
2296 320 62 50 -83 146 22 -40 -108 6 -212 -103 -70 93 97 -232 182 -54 72 78 25 207 125 57 57 174
2320 174 234 144 -24 -56 15 -119 75 72 35 -24 162 48 142 201 -97 -241 296 199 -4 131 -12 -144 -225 -96
2344 -96 -10 -74 -161 12 278 58 428 82 169 -311 -36 80 341 -6 56 -41 38 -128 -175 85 56 142 -74 24
2368 24 -76 434 -104 -4 20 -17 -136 70 -67 -139 167 59 10 -57 -68 31 -159 49 24 -41 93 -12 28 68
2392 68 -108 20 57 253 -23 45 -19 97 165 -41 107 97 349 -101 209 -154 -97 -11 22 -91 203 6 120
$$ packed form
2225f7L0J39r2Q5N9Q8k50j8k10K24J46k01j96L24M8K6j87j44R3J84j50k1Q4j6
2249b2j52L62k55N3j17O2M6k19L58K1j24j9k6j34P2M1J45k78J66J6M1J24qk36
2273h3j59r0L07J27J3l25k8K42q4j4K81k49J7M8O6l69K13J15q4L26J14l94L30
2296C20k58j2j33K29j24o2o8J14k18J09L3J63Ml29M14k36J26On3J82q2o8%J17
2320A74O0r0j68l2P1j34J94ll7n9J86j14R4N9k98j44N37r7k03J35j43j32q1J29
2344i6Q6o4q7J73K66k20L70l46Q7m80K75J16K61l47O2r7P9j66m7K60k9Q6k16R8
2368B4j00N10n38J00K4l7j19K06j37p2L06j08m9o7j1R9j90K08k5o5J34j05M0M0
2392F8j76J28L7J96k76O8o4J16O8k06J48j0K52m50L10l63N7Q6L3j13K94j97J14
$$ plain form
2415 120 72 -65 -324 84 -253 -404 -271 106 19 -201 102 50 18 17 7 243 -112 58 -118 204 -117 -369
2437 -369 29 51 172 230 -54 -175 -65 -72 134 42 30 -235 118 195 -210 54 13 353 123 -141 79 -124 -22
2460 -22 78 25 -72 92 242 301 -207 -22 -249 -33 93 127 54 3 127 -98 90 -91 -109 60 93 -96 77
2483 77 -114 74 -109 147 -234 154 -152 -6 -89 106 67 246 39 26 231 52 -152 161 15 150 257
2504 257 -229 -131 -98 30 -234 -218 102 159 184 -191 -140 -121 -67 131 -302 -22 -36 -81 92 -43 126 120 18 -252
2528 -252 130 96 133 -73 -209 -206 17 49 111 124 98 -105 -122 188 -28 -159 95 8 112 332 308 -90 76 72
2552 72 -153 -55 68 193 -248 -254 134 -281 -29 -139 49 135 -37 -4 146 70 193 -83 -325 351 -147 -70 -168
2575 -168 -30 174 42 -144 92 139 -52 14 -36 84 -69 8 -213 -379 -159 34 20 55 -25 -248 -100 -124 -91
$$ packed form
2415A20m8j37k59M08l37j51J33L77q7k20L03n2l2jj0K36l55J70j76L22l21k52
2437c69L98K2J21N8k84j21J10pK06r2j2k65L53P7m05K64m1L40k30k64K20k03J02
2460b2J00n3r7J64J50N9n08J85k27K16J26L4p3n1J24k25J88j81j8J69L3j89J73
2483G7j91J88j83K56l81L88l06J46q3J95l9J79k07j3K05j79k04L13j46J35J07
2504B57m86R8L3J28k64J6L20N7K5l75N1J9N4J98m33K80j4m5J73j35J69oj02k70
2528b52L82l4L7k06j36LK23L2O2J3k6k03j7L10k16j31K54q7J04K20k4l98J66m
2552G2k25R8J23J25m41oL88m15K52j10J88Q6j72L3J50p6J23k76k42O76m98P7r8
2575a68J38K04j32j86K36M7j91O6n0J20j53P7k21j66K20J93j4L5q0k23J48k4L3
$$ plain form
2598 -91 58 124 -71 157 17 -122 -48 3 89 -120 -229 -258 167 174 123 -198 -301 -57 184 -16 183 67 -94
2621 -94 6 139 -34 143 -95 47 -109 267 -57 -81 26 -81 53 -75 109 31 -35 -193 334 88 -118
2642 -118 -152 178 22 -186 128 134 11 -68 -161 201 -147 126 -2 -159 -40 -52 4 -135 103 -125 -118 -11 131
2665 131 29 25 196 87 -256 -139 -88 311 -12 -238 -136 -128 157 78 3 -176 92 -9 138 -1 -142 -40
2687 -40 303 -141 -189 -5 -190 -86 -67 -91 106 -96 18 -72 160 -232 29 260 14 62 -26 234 -157 -62 -46
2710 -46 -160 -182 182 82 81 133 153 23 78 -91 100 -174 -2 36 218 -85 169 -115 31 -154 137 -69 7
2733 7 -102 -231 91 38 246 143 -316 -168 -37 79 -126 87 144 -65 106 163 -270 80 41 -4 -290 -255 -115
2756 -115 2 249 27 -173 142 -23 83 -34 -13 78 -95 52 128 237 -122 -153 -64 -175 36 -70 167 70
$$ packed form
2598i1J49O6j95K28j40j39P4N1Q6k09j09k9M25Pn1l21j03K44K41k00J99j16j61
2621i4J00J33j73J77k38J42j56L76l24k4J07j07J34j28J84p8o6j58N27k46k06
2642a18l4L30j56k08L14Oj23p9r3L62l48K73j28j57J19j2N6j39K38k28PJ07J42
2665A31j02mJ71j09l43J17N1L99l23k26J02QK85p9p5j79K68j01J47j39j41J02
2687d0L43m44m8J84j85J04J9k4J97k02J14r0K32l92K61K31k46M8q8K60l91R5J6
2710d6j14k2L64j00jN2K0j30N5j69J91k74J72L8J82l03K54k84J46j85K91k06P6
2733Gj09j29L22n3K08j03m59J48J31J16k05K13N7k09J71N7m33L50l9m5k86L5J40
2756a15J17K47k22k00L15j65J06j17K1R1j73J47P6J09l59l1Q9j11K11j06K37r7
$$ plain form
2778 70 -154 34 94 -357 -13 -28 -104 135 119 -116 -401 -87 -167 -123 -141 -5 152 54 -197 46 137 -317 -59
2801 -59 -1 15 -126 -93 -240 -45 35 -95 11 13 -13 -100 -94 -135 -212 80 -222 -288 -27 -81 -43 359 130 -116 -178 227
2827 227 -62 79 6 -90 -39 -159 155 43 253 -27 -91 -103 144 151 31 -29 75 -342 -102 105 -11 -44 27
2850 27 -4 31 25 -248 -62 99 -51 44 58 52 -18 -100 81 -129 -160 -127 100 111 -92 113 148 211 -130 89 -118
2875 -118 -205 111 176 99 -48 21 178 -5 -42 12 16 304 10 -213 2 46 82 266 -134 168 53 -16 -298 -50
2899 -50 -134 -62 22 -71 -181 -172 -8 69 234 192 -112 217 220 260 124 61 -74 139 -256 -110 345 -233 -72 -55 -20
2924 -20 154 -69 -138 -94 -15 57 131 33 145 114 51 38 -157 -61 -148 -85 -99 235 -63 253 182 184 90 -93 -125 -195 -59
2951 -59 -148 286 233 -194 336 8 -305 -40 222 -72 -111 -225 -368 26 95 326 17 85 171 74 -115 -259 53
$$ packed form
2778G0k24J88O0m51L44j5p6K39j6k35k85L14q0M4j8J36J57r8k51K43R1m54K58
2801e9N8J6j41L3j47J95Q0j30J06Kk6q7Om1p7K92l02o6K61n4L8M02k29k46o2M05
2827B27k89J41p3r6N1j20L14j12K10k80o4j2K47Pj20o0J04m17K40K07j16l3P1
2850B7l1L5ok73J86J61j50R5J4op0q2J81k10l1L3K27J1k03K05L5O3l41K19k07
2875a18q7L16O5p7j47O9J57j83l7N4MK88k94k23K15M4L6J84m00L02j15o9k82K48
2899e0q4P2Q4r3j10RJ64P7J65m2l04L29LM0j36o3j35K13l95J46M55n78J61J7L5
2924b0J74k23o9M4P9P2P4r8J12l1o3j3j95R6q7O3j4L34k98L16p1Kr4j83l2p0J36
2951e9q9M34n3m27N30l28l13K65K62k94l9j14j43L94O9K31l09O8Q6r7j89j44L12
$$ plain form
2974 53 -210 -124 119 302 -82 -31 68 -96 -295 291 -26 -182 63 26 87 111 -12 -116 -1 26 -170 146 -84
2997 -84 57 -63 -47 -150 -124 -154 -105 37 15 93 -41 23 -239 153 -134 17 0 145 85 -120 24 -44 406 -71
3021 -71 190 175 -146 -1 -86 -36 -111 -149 269 30 149 -12 -177 -123 9 -183 -24 68 -38 27 -70 1 43 168
3045 168 -188 -216 193 163 93 -23 -157 -54 233 -6 14 -162 22 67 -2 -31 15 304 124 13 37 0 -195
3068 -195 45 -160 -86 185 -8 -8 112 -216 -186 50 90 -76 11 -33 -132 -189 147 202 -7 70 -47 -4 89 39 -73
3093 -73 -360 -270 -140 215 -151 -136 -34 -8 -223 -130 100 -62 134 98 -114 177 146 173 84 68 -111 -66 246 -273
3117 -273 125 -205 23 88 117 80 -18 -195 -5 78 221 -197 -141 448 -209 240 60 25 89 164 138 -279 -108
3140 -108 -6 98 4 136 -195 77 -65 -20 104 280 -18 -134 -111 97 113 189 142 35 232 -113 -38 -291
$$ packed form
2974E3k63Q6K43J83l84N1R9j64j99N86l17j56K45l7O1K4j23j04J15K7j96L16k30
2997h4J41j20J6j03K6l0M9J42k2P8j34O4k62L92k87J51j7J45o0k05J44o8M50m77
3021g1K61j5l21J45q5N0p5l8M18k39J19j61j65N4J32j92J59R2j06O5r7P1M2J25
3045A68l56k8M09l0p0j16j34J03K87k39K0j76J84M5o9k9M6K89j80j11K4l7j95
3068a95K40k05P4K71j93%J20l28L0K36M0j66Q7m4r9n7L36N5k09P7j17M3R3n0j12
3093g3k87R0J30L55l66J5J02K6k15R3K30j62J96l6k12K91l1K7q9j6j79M5L12n19
3117b73L98l30K28O5K9l7r8j77J90Q3J43m18N6N89o57M49j80l5O4P5k6m17J71
3140a08J02J04r4J32l31K72j42M5J24J76k98j16K3K08J6P6m7j07J97l45P5k53
$$ plain form
3162 -291 151 -64 84 -198 126 100 -163 -178 220 195 -42 235 -106 -63 77 75 -182 -46 131 120 -92 21
3184 21 -8 77 258 128 -100 -112 -148 -167 82 -199 74 33 -35 -39 -78 164 -140 85 -246 116 181 58 -175 226
3208 226 -2 47 -175 281 200 -55 -85 34 215 -108 91 31 45 -122 -91 272 107 92 -34 -82 -80 -74 -62 188
3232 188 -162 51 -96 105 8 3 90 -33 -160 -181 -474 12 -333 321 110 -178 110 350 -147 -82 84 74
3254 74 -40 -177 87 -5 44 -264 235 -40 -45 118 -134 -251 -136 -62 -98 -168 -100 55 263 33 -73 -38 -143
3277 -143 155 -36 152 75 69 -17 -100 64 -177 -61 125 405 -80 -59 79 272 -129 -193 122 -83 -122 7 30
3300 30 -220 -75 -265 84 -313 40 -115 138 -141 80 36 115 -63 134 54 -57 210 -10 57 -48 69 192
3322 192 64 110 -145 -105 -320 217 170 -141 69 62 143 -10 -205 -252 84 -273 109 -183 315 -156 -177 -49 -10
$$ packed form
3162b91M42k15J48k82L24k6k63j5L98k5k37K77l41M3J40kk57J36J77j1k12J13
3184B1k9Q5J81j30k28j2l6j9K49k81K73m1o8ml9K42l04K25l31L62O5j23k33M01
3208B26k28M9k22M56q1k55l0J19J81l23J99o0J4j67L1L63j65j5j26m8KOJ2K50
3232A88l50K13j47K01r7nQ7j23j27k1k93M86l45O54k11k88K88K40m97O5J66j0
3254G4j14j37K64r2M9l08M99k75nJ63k52j17J15P4l6p0O8J55K08k30j06L5j05
3277a43K98j91J88p7oq6q3J64k41J16J86K80m85K1J38J93m01o4L15k05l9J29K3
3300C0k50J45j90L49l97L53j55K53k79K21m4P9j78J97q0j11K67k20O7j05J17J23
3322A92j28M6k55M0k15N37m7l11K10pQ1j53j95m7L36l57L82k92M98m71k1J28L9
$$ plain form
3345 -10 -147 -42 -54 -117 -39 59 -5 -133 90 204 -15 136 -161 -298 -239 -38 111 71 65 -3 -226 -55 168 -25
3369 -25 119 124 -86 -308 190 -65 -97 -217 -203 -95 -64 113 -62 -189 49 311 190 -163 -1 115 121 151 390
3392 390 -131 -38 -226 -29 -78 199 116 -129 30 -146 46 -222 -151 -221 -64 4 -283 62 -125 -21 148 -187
3414 -187 342 -47 41 77 330 169 8 -34 101 -69 -34 141 -139 -88 162 -188 369 -139 121 40 8 -259
3436 -259 120 143 39 -99 177 137 -189 -10 -13 -76 148 87 -70 -203 112 30 57 -71 -166 13 1 -211 50
3459 50 -180 63 177 -100 176 -53 21 -160 -70 -4 188 -35 176 -7 50 -33 -249 -275 56 21 -147 -173 100
3482 100 11 -70 -46 77 -172 86 -94 -526 -210 0 35 -73 -148 92 62 75 -139 79 -4 -31 -238 161 -390
3505 -390 118 124 -169 -190 -110 -142 39 -63 200 48 -10 143 -375 -248 -68 -71 -37 -133 44 -105 -83 216 28 -63
$$ packed form
3345a0j37J05j2o3P8R8o4j28K23J14k19J51k97j37N9K01J49m0oo8k23J71K23j93
3369b5J44Nk10k22M98k55l2j20J4J08L1J77j75j27K38K62j21l53J62J16OL0K39
3392C90n21R3j88J97m9K77q3k45J59j76J92k68P1p0J57O8k87L45j87J04J69l35
3414a87N29l89Q8L6K53j61j61m2J35j70L5J75k80N1K50l50N57n08K60q1l2k67
3436b59L79K3j04j38K76m0l26J79lo3K24o1j57j33L15q2K7j28r5J79j2k12K61
3459E0k30K43J14k77K76k29P4j81R0O6J92k23K11j83N7q3k16k6L31l5j68k6K73
3482A00q9q1K4J23k49K58j80m32L16K10L5j08p5K40l0J3k14K18q3k7k07L99n51
3505c90N08Ok93k1Q0l2J81j02K63j52n8J53n18J27J80lL4r6J77j49K2K99j88r1
$$ plain form
3529 -63 -233 -9 -5 -59 82 -227 -132 111 -105 81 158 20 315 20 -108 -56 -22 -226 -181 262 141 2 272
3552 272 -180 9 -19 -107 -138 -149 -104 116 0 135 34 72 -230 -268 -178 3 -284 22 32 -50 -21 -150 71 -220
3576 -220 138 -74 -157 -115 160 106 56 -177 -229 13 -39 -29 111 14 -233 130 -65 -28 -31 21 88 -84 -81 -199 105
3601 105 99 0 -56 187 114 55 -176 -209 -69 174 -82 -34 275 -273 -113 -5 181 193 -67 149 81 -312 124
3624 124 294 183 -189 -8 96 -66 -31 -105 -35 -129 66 -55 15 -323 97 198 96 -146 -100 -50 -104 82 -99
3647 -99 -136 -165 -48 191 193 2 173 129 -211 15 -42 -183 46 154 200 172 -54 173 178 -45 -201 -62 188 -13
3671 -13 -22 130 10 -316 -137 -269 332 2 65 3 196 151 97 65 -177 251 -71 91 -333 289 -122 -369 -49
3694 -49 159 128 60 108 95 104 -166 -77 -174 42 197 -199 63 94 12 260 217 -99 -83 -76 -19 156 -114 190 -36
$$ packed form
3529f3j70K24Mn4J41l09R5K43k16J86P7j38K95k95j28N2L4k04M5M43j21j39K70
3552B72m52J89k8q8l1j1M5K20j16J35j01L8l02l8R0J81k87L06J0q2K9j29K21k91
3576b20L58k12q3M2K75n4n0k33n2K42n2J0J40r7k47L63j95L7lN2O7j72Lj18L04
3601A05or9n6K43p3n9k31l3J40K43k56M8L09n48J60J08J86J2k60K16o8l93M36
3624A24J70j11l72J81J04j62L5p4P0r4J95j21P0l38M20J01j02k42M6N0n4J86j81
3647i9l7k9J17K39Kj91J71m4l40K26n7j41K29J08M6k8k26K27Nk23j56J39K50k01
3671a3rJ52j20l26J79j32O01l30O3o2J93m5n4l2k42M28l22J62m24O22m11k47L20
3694d9K08l1o8M8j3Rk70Q9r7K16J55l96K62L1q2K48m3l16J6PN7J75k70L04k26
$$ plain form
3719 -36 293 -85 130 -83 246 4 81 -9 -15 172 -200 -105 -32 125 34 24 -11 -91 -50 -162 93 -27 300 -61
3743 -61 -7 16 288 73 -58 -222 186 -38 392 66 39 -127 -147 242 -535 100 -29 -186 -360 -13 12 48
3765 48 122 -43 58 33 -26 -223 -72 -233 -10 12 -232 15 -185 116 146 86 -4 -352 198 -2 -110 220 -104
3788 -104 6 168 25 162 115 46 -46 214 -190 -38 21 6 -70 -62 137 -17 173 298 110 -113 88 125 129 93
3812 93 -178 11 343 -11 71 273 19 -150 23 -402 -5 -29 44 -11 127 152 17 84 -154 -19 -107 -163 127
3835 127 -146 -14 79 47 19 21 13 -219 -128 80 -82 -54 -45 -154 -43 105 -110 85 1 -20 146 208 -32 3 -56
3860 -56 -94 -29 20 -177 211 94 127 -105 283 -64 -166 249 -175 207 178 95 -86 -38 126 -69 -226 45 -61
3883 -61 57 124 149 -181 -71 -143 -62 -374 -34 15 -106 85 -47 6 -154 -3 313 12 -11 237 -171 37 172
$$ packed form
3719c6L29l78K15k13L29k42P7r0oJ87l72R5P3J57r1j0l5q0M1j12K55j20L27l61
3743f1N4K3K72k15j31j64M08k24M30l26k7j66k0L89p77O35j29j57j74L47K5L6
3765D8P4j65J01k5n9j97J51j61K23K2k44K47k00L01L0o0r0l48N50k00j08L30l24
3788a04J10J62j43J37m7o9r2K60m04J52N9j5p6QJ99j54J90J25j88k23K01L7Ml6
3812I3k71J89L32l54Q2K02k54j69J73m25L97k4P3n5J38K5j35O7k38J35q8n6K90
3835A27k73J32R3l2k8Kqk32R1K08j62K8Rj09J11J48k15J95q4k1J66O2k40L5n9
3860e6l8O5M9j97L88j17L3k32L88l47j02M15m24L82k9q3j81M8J64j95j57K71j06
3883f1J18O7K5l30J10p2Q1l12L40M9j21J91j32N3j60J51L16l01k3K48m08K08J35
$$ plain form
3906 172 -56 28 -7 -394 171 195 -55 -99 -27 -68 74 116 -173 -108 -77 80 -195 -270 129 79 27 -51 73 -2 136
3931 136 177 -255 280 130 79 -94 -30 -155 -110 -121 -121 -77 129 -5 -128 56 -57 -188 187 28 3 -177 -75
3954 -75 -112 -158 -121 -87 -80 -114 -144 38 367 53 112 -66 -69 102 73 -6 -60 -24 -130 -140 89 -12 24 -51 11 -24 240
3981 240 -203 -3 2 -17 -181 -193 162 99 36 -259 284 275 17 160 -322 264 -153 -28 147 -43 8 -22 29 -116
4005 -116 322 63 139 -174 5 149 272 -81 -57 -128 316 -163 195 -16 115 -126 -14 -21 -110 -155 -58 146 -176
4028 -176 34 63 63 262 -148 84 62 -134 -86 -187 136 -153 227 41 -159 -148 -23 -154 -7 -75 -284 -280 121
4051 121 6 151 -27 189 -16 -31 -27 -166 -68 -97 -184 -72 297 55 141 -92 19 33 144 -347 -50 152 96
4074 96 -92 -193 -276 -130 59 32 -66 -261 43 -98 -63 -160 104 213 -135 -60 94 -44 121 95 -102 -211 -188
$$ packed form
3906A72k28Q4l5l87N65K4k50m4P2m1J42M2k89O5L1J57k75p5L99n0n2p8J24p5J38
3931A36M1m32N35j50n1j73O4j25M5j1%M4K06j34j23J84j13j31L75j59k5j80J02
3954g5l7m6L7L4Pl4l0J82L29l14N9j78lJ71k9p9n4L6j06j0K29j01L6p5O2l5K64
3981B40m43K00Nj9j64j2L55o3o3k95N43rk58J43m82N86m17J25J75j90N1l0N1j45
4005a16M38k59P6l13J79J44J23l53K4p1M44m79L58k11J31k41J12pq9m5R7K04l22
4028a76K10K9%J99m10K32k2j96M8j01L23k89L80j86k00J1J25j31J47o8k09MM01
4051A21j15J45j78K16k05j5Mj39R8k9q7J12L69k42Q6k33J11J4J11m91K97K02n6
4074I6j88j01q3J46J89k7r8j95L04j41L5r7K64J09l48P5J54j38J65k6j97j09K3
$$ plain form
4097 -188 -79 -52 -254 73 -79 257 196 190 112 93 220 177 119 -169 199 -160 192 22 202 56 194 -180 -201
4120 -201 51 47 132 179 178 31 181 145 250 139 -18 -226 -85 128 116 43 -56 -296 -57 -137 -49 210 -135 198
4144 198 -246 -243 -29 -81 149 58 -336 103 -58 -294 183 22 -91 161 -21 179 -9 169 -287 -46 38 169
4166 169 45 -60 178 154 65 -63 -154 97 -130 -134 21 82 77 -97 93 118 -24 -82 79 -307 -180 38 -51 -104
4190 -104 53 30 -152 -47 -233 -93 -191 -98 282 -148 29 183 -10 -175 -2 76 -395 259 343 305 -62 19
4212 19 37 -212 -5 -60 -75 -44 -82 -238 84 184 -30 16 -82 173 127 102 51 23 -62 132 -29 -89 50 90 -82
4237 -82 -182 -202 -233 -48 127 -13 110 -152 -19 226 51 256 -132 165 189 146 -130 7 -130 -32 224 -14
4259 -14 96 -153 -113 248 319 -100 25 -37 95 160 -168 -32 -124 -6 -52 78 86 93 83 -31 0 151 -251 100
$$ packed form
4097a88J09K7k02L27j52L36o1op8j9J27m3n8k88L68l59L52j70J80j46J38l74k1
4120b01K52mQ5M7jj47J50l6J05j11j57k08J41K13j2p3r9k40K39q0Q8K59l45L33
4144A98m44LK14n2K30r1l94M39j61k36M77j61j13K52j82K00j88J78m56K41Q4J31
4166A69j24j05K38k4q9j28r1K51k27mJ55O1nj74J90K5j42n8J61l86J27K18q9n3
4190a04J57k3j82J05j86J40r8R3L80m30J77J54j93j65J73P8m71O54Q4l8l67Q1
4212A9J8k49K07n5j5L1l8j56L22J00k14M6r8K55m6k5n1k8q5J94j61o0J39M0j72
4237h2j00k0l1J85J75j40J23k62J33K45j75K05l88K97K4m3k76J37j37R8K56k38
4259a4J10k49M0L61P1m19J25o2J32O5l28J36r2J18m6J30QPj0j14L1J51m02L51
$$ plain form
4283 100 28 -90 380 240 -75 -197 -187 142 -122 48 167 56 226 91 4 -104 35 -22 -113 18 -55 130
4305 130 -98 -343 -71 -279 -75 97 38 -38 -249 83 1 -87 112 -111 1 132 211 -93 -129 -110 -170 129 274
4328 274 -201 61 106 -27 -521 -89 -6 86 13 15 20 29 -43 -153 -63 51 16 269 -75 -118 -189 -154 128 -204 244
4353 244 9 -10 -157 -160 -160 -36 -68 24 -258 102 43 -103 66 262 180 33 -88 69 10 -173 -1 77 48 228
4377 228 -298 -16 -19 -131 -115 156 -105 -71 58 -136 -141 106 -95 -249 46 -103 141 7 -172 -98 28 0 51
4400 51 -53 181 -132 -35 126 -185 -15 -191 119 -88 69 69 129 251 167 9 -34 -86 95 252 201 78 -166
4423 -166 87 -101 7 -246 38 -252 -153 -77 -101 24 263 -126 -24 210 -374 -182 -121 -151 -177 -114 -191 217 -117
4446 -117 150 -189 413 -34 39 209 195 131 -116 -25 2 141 -178 21 18 11 72 -73 -21 -41 -117 -81 89 -198 39
$$ packed form
4283A00p2j18M70j40l15j22J0L29k64J70J19j11J70j35q7j08J39n7r1J31p3J85
4305A30k28k45K72k08K04J72n9p6k11L32q2q8J99k23J12J31P9l04l6J9o0K99J45
4328B74m75K62M5j33m94M32Q3R2p3KNRp2j10R0J14l5K53l44m3p1L5K82l32M48
4353B44k35j9j47l%J24l2R2k82L60n9j46J69J96q2j47j21J57n9j83J72P8k9J80
4377B28n26K82lj12J6K71k61L4J29j94nK47k01j54K95j49K44j34j79P4J26k8N1
4400E1j04K34l13R7J61l11J70j76L10k07J57%O0J22q4j58m3n2J81J57n1j23k44
4423a66K53j88J08k53K84k90R9P6k4J25K39l89J02K34n84J92O1l0k6O3p7M08l34
4446a17K67l39O02m47P3J70j4o4k47R1K7J39l19J99lpO1j45N2k0p6L6J70k87K37
$$ plain form
4471 39 -92 9 49 -304 -189 54 113 228 -168 44 10 53 -121 -70 98 82 -18 -255 -30 -88 275 119 48
4494 48 -269 149 250 149 42 2 -321 -99 -114 -80 81 -1 200 -40 -114 46 -71 -185 -86 133 -90 -273
4516 -273 -38 202 6 -77 9 -138 320 17 -47 -177 -128 -164 137 7 -141 67 39 34 -28 16 33 172 -131 -52
4540 -52 -22 -63 -244 -35 136 -174 -209 6 8 40 -8 -242 -92 199 161 15 318 -45 56 93 -41 195 14
4563 14 66 -3 88 -8 -264 -135 -53 216 -43 53 -143 51 -151 162 243 101 -21 98 -52 -149 -121 -141 164 -37
4587 -37 288 123 7 -28 -74 241 -106 -40 145 -209 75 -230 -34 -384 243 235 -117 27 139 -76 41 -2
4609 -2 161 76 -62 17 15 -248 78 -56 4 -372 93 184 -188 -88 114 117 -134 105 -45 162 186 -139 86 50
4633 50 -128 40 -77 0 18 223 94 -75 155 -226 -142 -25 145 181 122 -318 191 40 206 163 394 6
$$ packed form
4471C9j31J01M0l53J15K43N9J15l96K12l4M3j74N1J68j6j00k37K25n8L63j56p1
4494D8l17M18J01j01j07m0l23K22j5L4J61q2K01k40p4J60j17j14R9K19k23j83
4516b73K35K40j96q3Q6j47M58l03o4j30M9l6L01j30j48K08k8no2M4J7J39l03P9
4540e2L0m1j81K09J71l10l5K15KL2m8k34J50K91l8j46L03l63J01L7j34K36j81
4563A4N2o9R1r6k56J29Q2K69k59R6j96J94k02L13Q1j42j22J19j50r7K8k0L05k01
4587c7L25j65j16l5m6L15l47O6J85l54K84l05J96l50O27ql52J44J12k15J17m3
4609bJ63q5j38P9kk63L26j34O0l76M65R1l72J00K02Lk51K39j50K07K4l25K25l6
4633E0j78J68j17P7J8K05j29j69K30l81Q4J17J70L6n9m40N09j51J66m3K31l88
$$ plain form
4655 6 -7 160 6 -120 -74 185 13 9 -87 -5 -100 149 -16 1 63 71 -281 0 -41 -17 -113 87 -27 232 -16
4680 -16 -150 -69 -23 -240 71 20 -108 98 -290 -244 -248 -143 106 101 -49 -144 -7 62 -84 42 -191 -56 15 -113
4704 -113 74 -98 5 -50 -46 -95 82 138 28 118 233 54 64 -50 -177 37 48 -116 247 243 -173 250 -18
4727 -18 129 -19 -123 -41 241 -53 -63 -22 -166 -90 100 -124 -3 108 -85 -226 -229 177 -92 -143 -54 60 -154
4750 -154 -9 -52 254 210 61 154 -16 66 -46 24 66 -107 103 189 -144 -40 -134 -160 -51 187 -43 -245 21
4773 21 36 -91 240 -134 10 185 133 -25 -78 34 158 -135 46 -69 42 -296 -22 51 25 42 6 126 -143
4796 -143 54 212 -38 87 135 -140 115 -200 -248 -101 36 287 34 -17 244 -300 -41 -150 224 -92 -40
4817 -40 65 281 -218 182 21 -8 112 298 162 -96 4 -121 54 -31 282 137 152 -228 -159 288 -53 30
$$ packed form
4655Fj3J67j54j26M6K59j72mr6Q2r5K49j65J7O2Ql52K81m1K4r6K00j14K59k48
4680a6j34Q1M6k17L11n1j28K06l88M6mJ05K49nj50r5J37O9j46J26k33J35P1j28
4704a13J87j72J03n5Mm9J77N6j10R0J15j79J0j14j27K14J1j64L63mm16M23k68
4727a8J47j48j04Q2K82k94j0M1j44P6J90k24J21J11j93j41lM06k69n1Q9J14k14
4750a54J45m3L06m4j49R3j70Q2j12P0M2j73K10Q6l33J04r4k6J09K38k30k02K66
4773B1J5j27L31l74J44J75n2j58n3J12J24k93J81j15J11l38K74P3k6J7l6J20k69
4796a43J97J58k50J25M8k75K55l15m8J47J37K51k53n1K61n44K59j09L74l16N2
4817d0J05K16m99M00j61k9J20J86j36k58J00j25J75q5L13j45J5l80O9M47l41Q3
$$ plain form
4839 30 25 154 -197 -71 -148 -213 71 -93 -1 138 23 -43 -4 80 22 -112 -2 -63 135 -27 -38 -70 -304 -96
4863 -96 -142 107 42 126 7 111 -190 4 -166 -126 -238 -182 35 -226 6 -94 -71 -34 195 -113 -24 -90 -60 10
4887 10 -216 -111 -152 51 -30 267 -27 -114 33 78 140 7 -273 -64 132 -4 -170 201 -208 -184 -217 86 -65
4910 -65 -51 -30 -87 29 301 182 -33 313 293 -12 -114 128 -73 -30 -79 -72 64 -9 91 -261 61 113 -351 -194
4934 -194 -74 -149 -124 -143 85 -45 74 -81 -172 11 33 95 17 256 -108 166 20 -106 -184 156 -299 100 23
4957 23 -161 -230 -64 -219 -55 269 182 124 134 -91 -94 324 -210 84 113 39 -163 182 28 -3 -101 -96 -117 -26 -36
4982 -36 63 40 51 200 1 -26 -393 -240 -130 5 -131 -377 216 70 182 20 -161 -57 -232 44 194 185
5004 185 -247 -71 131 -23 -25 -301 318 323 7 85 -153 -66 169 -105 -172 77 -51 -37 55 82 72 -96 83 -62
$$ packed form
4839C0nJ29l51J26p7o5K84j64R2J39j15o6L9Q4n8j34J10o1J98j62j1l2k34K08
4863i6m6K49o5Q4j19J04l01J94j70M0j12N6K17k61K32j00K3L7K29l08Q9o6L0P0
4887A0k26J05m1K03q1K97k94q7J47M5O2j33k80K09J96j36j66L71m09K4l3L03j51
4910f5J4K1n7J16K72j19k15L46k0l05j02K42k01M3m9PJ36p3J00l52L22N2m64J57
4934a94J20p5K5j9K28j30J19j55r1J83K2O2p8K39l64K74j46j26p8L40m55L99p7
4957B3j84o9J66j55J64L24q7n8J0k25lM18n34K94K9p4k02L45j54l1r8Nk1R1j0
4982c6R9k3J1J49j99k7l67J53J10J35j36k46N93j46J12j62j81J04j75K76J50r
5004A85m32J76K02j54kk76O19Nl16P8k38Q7K35k74o7K49j28J4R2K7j0j68J79j45
$$ plain form
5028 -62 -50 -29 30 106 62 -129 -71 -57 147 -159 -66 -132 333 -32 -30 83 14 16 173 -55 -43 256 167 -162 125 -19
5054 -19 41 -198 -21 -404 122 -49 -159 159 -229 -89 -204 -37 12 50 243 230 326 228 48 -36 -23 -18 19 -34
5078 -34 269 -230 369 -79 183 79 162 -1 -106 -270 -9 51 4 0 25 -294 -12 60 96 19 -290 47 -12 9
5102 9 -29 -123 -58 97 69 -2 -51 -121 -41 -59 -32 -283 -8 -72 -131 33 254 -82 26 -148 333 107 -2 134 -175
5127 -175 150 151 178 -42 -110 53 -95 -74 137 -72 -38 18 -48 -317 -342 47 49 55 -162 272 -42 -31 59 -38 -12 223
5153 223 154 148 70 -15 -22 -285 -175 136 46 198 254 -30 -42 -68 -9 -166 199 -67 34 -18 191 286 -30 -62 170
5178 170 -57 153 147 -310 -284 -115 12 147 -58 75 -24 -25 9 -83 109 84 212 155 -15 204 -237 -151 87 -69
5202 -69 255 117 -28 -45 -123 -8 -92 32 310 106 56 82 -46 -39 -335 16 -184 -55 144 55 -94 -55 86
$$ packed form
5028f2J2K1N9P6m4j91N8J4K04l06R3o6M65l65KJ13o9KJ57k28J2K99q9l29K87j44
5054a9O0k39J77l83N26j71j10L18l88J40j15J67M9L8J93j3R6r8j80q4J3NL7n3
5078c4L03m99N99m48K62j04Q3j63j05j64K61O0m7mK5l19K82P2L6p7l09L37n9K1
5102Il8r4O5J55k8p1m9p0Q0j8K7k51K75o4n9J64K21l36J08j74M81k26j09J36l09
5127a75L25JK7k20o8J63j48K1K11k09L4N6o6k69k5L89KOk17M34l14J1R0r7K6K35
5153B23o9op8q5pk63J10L11r0J52N6k84j2k6N9j57L65k66J01n2K09R5l16l2K32
5178A70k27K10om57K6J69J27J35k05J33r9jL4r2J92k5J28n7j70K19m41Q6K38j56
5202f9L24j38j45j7p8J15q4J24K78k04n0K6j28Pk96L51k00J29J99q9j49L9J41
$$ plain form
5225 86 90 329 -74 -64 162 -197 -37 -67 -178 -112 -246 -10 274 -2 52 -104 87 -75 -129 -88 231 93 -142
5248 -142 -167 -49 -213 154 -120 -132 49 -95 -74 49 4 54 76 326 -194 -1 32 -78 16 34 150 -110 -313
5271 -313 -10 -142 -220 157 -217 -44 -68 129 123 109 -89 77 -107 -110 124 -172 -226 157 82 71 -28 -261 54 -156
5295 -156 -56 99 63 25 -64 59 -11 -147 37 -77 -88 -54 94 -256 108 -185 14 -19 -10 90 -68 104 141
5318 141 238 -44 -152 -95 137 -235 91 -70 -78 101 129 -297 71 131 -67 28 -62 47 246 24 76 -138 256
5341 256 343 -107 118 177 219 64 -18 -36 -81 -328 88 174 -385 -78 -156 -103 30 -31 -225 -136 -147 119 110 109 -2
5366 -2 -245 -1 -330 122 111 -347 -269 -132 340 116 273 46 -42 246 -163 -118 40 140 254 50 -40 -12 -268
5389 -268 106 408 -33 -74 -76 -226 -81 -36 -78 -172 252 131 -394 -160 -202 -33 -239 -212 -128 -38 -180 20 44 89
$$ packed form
5225H6MK39m03J0K26l59J60l0j11O6j34K36K84k76N4j56J91j62n4M1L19j38k35
5248a42k5J18j64L67k74j2J81j44K1J23m5N0K2K50n20J93L3j10R4J8J16k60k03
5271c13L03j32p8L77l74J73k4J97oj4j98J66j84lK34k96n4L83p5j1r9k33L15k10
5295a56J00J55l6l8q9J23p0j36J84j14j1L4J48l50L64k93J99l3RJ00j58J72L7
5318A41R7k82j08N7K32l72L26j61qJ79K8m26L68O0j98R5r0J09J99k22N2k14L94
5341B56Q7m50K25N9M2j55q2j8m5k47M16Q6n59L07p8N3J33o1j94Q9j1K66rjj11
5366bk43K44l29M52j1m58P8J37M72k24J57k27q8K88m09M5J58J00J14k04r0K8k56
5389b68L74L02m41m1kj50J45M5m2r4M24j21n25K34m2J69k06K7Q4R0j42K00K4M5
$$ plain form
5413 89 -46 -69 251 -355 -170 153 -98 -1 -86 109 -225 1 -126 1 -82 -342 37 148 -164 -28 119 5
5435 5 82 -96 -115 -229 221 -258 109 112 -66 174 9 -204 101 -212 -107 -98 14 74 -12 110 -215 -2 149
5458 149 73 162 -54 -198 -48 -59 -372 99 55 -57 -56 99 65 104 127 -13 -189 119 21 95 -105 244 -51 -138
5482 -138 65 -154 -60 135 -192 -172 -82 -372 -58 -228 85 -26 34 -44 129 149 -144 8 -57 275 -128 -97 77
5505 77 -348 -282 36 20 -214 -82 -32 109 195 115 -240 -236 28 59 -5 155 93 -76 52 64 -175 60 33 -3 -114
5530 -114 -195 34 -168 126 -26 140 -25 -98 41 44 19 64 17 24 167 118 -236 134 -57 -273 -347 -26 80 68
5554 68 119 236 -43 157 122 0 30 18 -190 24 146 -134 178 137 -114 -42 132 189 32 -79 -348 36 273
5577 273 -341 53 -97 24 117 -118 231 4 -148 44 277 101 107 229 -81 -182 -276 40 -66 -96 -121 24
$$ packed form
5413H9j35k3L20o06J85L23k51R7q5J95l34K26j27J27q3k60L79J11l12J36J47j14
5435EP7j78j9j14M50m79L67Lj78K40j65k13L05l13J05RJ12O0q6J22l25K13J51
5458A49p6Q9k16j44J50j1l13M71m4j12JJ55l4L9K3j40j76L08r8P4k00L49k95q7
5482a38K03k19R4J95l27K0R0k90L14j70L13j11O0p8J73K0k93J52o5L32m03L1J74
5505G7m25O6L18j6k34J32N0J41Q6q0l55MK64L1o4J60o2j69J28J2k39K35k7l6j11
5530a14q1K29k02K94j52J66j65p3J39Lk5M5m7PJ43m9l54L70j91k16p4L21J06j2
5554F8N1J17k79K00l5j22L0j2k08K14J22k80L12m1k51P2J74N7j57j11k69L84K37
5577B73o14L94j50J21R3k35L49k27j52J92K33j76OJ22l10j01r4L16j06l0k5J45
$$ plain form
5599 24 341 -172 -133 211 189 19 -140 74 335 -23 92 -101 -75 -119 -47 105 -118 -260 -206 -126 305 199 -56
5622 -56 108 66 124 -305 348 -188 -197 61 4 -11 -155 -139 140 38 268 64 -259 181 147 202 -141 214 121 36
5646 36 -190 168 -140 208 -87 5 20 -18 -57 -9 25 -80 25 -67 27 -44 26 64 57 472 -128 145 -151 -35 -84
5671 -84 -53 60 -156 222 12 -48 -48 101 114 128 175 -54 43 233 -10 -210 160 -107 -96 -17 -108 -91 -33 -118 254
5696 254 194 -88 -200 72 -36 -172 -36 -179 129 -216 97 194 -65 -9 63 15 243 31 -13 -25 -146 -80 115
5719 115 -179 -111 94 -114 149 31 -79 223 -156 -30 147 -74 133 -15 -155 -42 126 -101 -22 -80 -239
5740 -239 -422 206 222 -37 7 127 -109 313 -40 -138 -80 31 242 -54 244 -91 -71 229 205 -65 119 -104
5762 -104 -77 -115 97 162 -166 314 191 128 101 68 -40 -238 -228 130 330 -92 -108 103 -113 304 -268 -15 -6
$$ packed form
5599B4L17n13L9L44k2j70j59K14K61l58J15j93K6m4P2J52k23j42N4Q0M31j06k55
5622e6J64m2N8m29O53n36rK58n7j5j44J6K79j02K30k04l23M40l4N5l43L55r3q5
5646C6k26L58l08L48k95R2J5l8l9M8L4j05J05r2R4p1P0L8pM15o00K73k96J16m9
5671h4L1J13k16L78k10o0%J49J3J4M7k29R7J90k43k00L70k67J1P9r1J7N8q5L72
5696B54o0k82j12K72j08j36J36j43L08l45L13R7k59N6P2m8K28k12m4j2j21O6J95
5719A15k94O8K05k08K63j18j10L02l79J26J77k21K07j48j40J13J68k27P9n8j59
5740b39j83O28J6k59M4J20k36M22l53r8N8J11K11k96K98l35K0L00k4k70J84k23
5762a04K7l8K12O5l28M80j23o3k7l3j08j98J0L58K00m22j6K11k16M17n72K53R
$$ plain form
5785 -6 135 -60 -86 -139 -68 128 30 -111 -289 -76 -247 -73 84 286 -115 104 -105 112 114 155 25 -204 -110
5808 -110 -146 8 247 -180 43 221 -116 45 50 88 -96 10 54 -132 110 37 -116 -40 -267 -271 184 9 -41
5831 -41 -67 -38 63 41 -50 111 154 139 -168 -428 -91 -184 183 -69 -121 188 36 -400 -7 11 -61 -160 -70 -190
5855 -190 71 -216 247 33 -26 -10 157 23 -143 -228 -60 97 -139 46 -119 115 -39 68 -139 -33 -90
5876 -90 -73 36 -104 -183 -58 -229 -29 12 158 24 -136 -276 114 198 137 131 -319 -99 213 -7 27 -159 -145
5899 -145 63 319 9 76 -181 -110 147 -276 -154 -61 -7 -19 41 -146 169 51 54 -232 -79 28 49 -124 263
5922 263 84 81 98 190 -60 122 -19 5 280 111 -69 -15 93 258 -238 177 -4 -46 -118 -225 -45 154 -90
5945 -90 -121 -164 2 -220 82 119 -149 -29 6 39 77 311 -266 167 -89 274 -241 78 82 -284 -97 -43 -42 13
$$ packed form
5785fJ41j95k6n3P1J96r8j41j78K13j71J74J57K02m01K19k09K17KM1j30k29R4
5808a10l6J54K39m27K23J78l37J61NL8j84J06M4j86K42p3j53P6k27mM55j75n0
5831d1k6K9J01k2r1J61M3j5l07k60L37r3L67k52n2L09j52m36L93J8p2r9R0j20
5855a90K61k87M63k14n9J6J67j34j66q5J68J57k36J85j65K34j54J07k07J06n7
5876i0J7J09j40p9J25j71K00M1J46j34j60j40L90Q4o1om50K20L12k20L4j86J4
5899a45K08K56l10O7k57P1K57m23J22R3N4j2O0j87L15j18Lk86J53J07K1j73L87
5922B63j79lJ7R2k50J82j41K4K75j69j80N4J08J65m96M15j81m2p2j07J80J99k44
5945i0l1m3J66k22L02L7k68J20L5L3L8K34n77M33k56L63n15L19Ml66J87N4JN5
$$ plain form
5969 13 -26 -5 5 159 20 54 176 249 -92 27 176 57 186 252 -45 53 38 99 -167 79 -38 133 126 -58
5993 -58 -125 -148 -63 71 -24 119 192 43 -119 -96 -101 46 -1 -18 -366 103 -90 -178 75 -146 93 -123 -20 56
6017 56 -160 -108 11 -49 -145 -80 33 14 112 -153 114 37 261 44 21 274 -36 86 -260 -8 148 65 -306
6040 -306 171 -340 292 69 309 150 3 -134 498 -102 -95 -133 -281 258 60 -245 -74 190 -141 -117 178
6061 178 56 -17 -96 -205 96 -32 -159 76 50 107 106 240 -241 -47 14 -116 -329 37 279 -49 -244 324
6083 324 162 -188 346 47 -37 132 256 70 254 -91 50 -58 -118 131 -171 161 -142 102 218 8 170
6104 170 43 -144 102 92 -138 -221 118 -154 -66 -58 -115 282 -105 246 9 -292 38 141 191 59 60 55 -118 34
6128 34 -39 165 214 -123 -122 49 -99 -108 372 90 -185 53 -38 -162 10 -134 60 28 224 -141 201 -88 -98
$$ packed form
5969A3l9K1J0J54j39L4J22P3l41J19J49j19J29O6k97R8j5O1k66K46j17J71pj84
5993e8o7k3Q5J34r5J43P3j49j62K3nJ47m7j7l48M69j93q8K53k21K39k16J03P6
6017E6k16N2J19o0r6O5J13j9R8k65K67p7K24k17k3K53l10J22l46K52J56q3l71
6040c06M77n11O32k23K40j59j47j37O32o00Pl8j48N39j98l05J71K64l31K4K95
6061A78j22p3p9j09L01j28j27K35k6N7jJ34m81J94O1j30k13L66K42l28j95N68
6083C24j62l50N34k99q4J69J24j86J84l45J41j08o0K49l02L32l03K44J16k10J62
6104A70j27j87K46j0k30q3L39k72Q8Qn7L97l87L51k37l01L30J03N0j32Jnj73J52
6128C4p3K04M9l37JJ71j48rM80k82k75K38r1j24J72j44J94l2J96l65L42k89j0
$$ plain form
6151 -98 12 -115 -181 -164 -105 -152 252 -189 49 506 -34 63 142 77 -155 124 -178 -65 -106 50 28 47 -148 -247
6175 -247 24 25 187 191 13 139 83 -269 -149 -125 34 97 -17 48 50 -3 1 41 107 -214 41 76 107 53 94 -201
6201 -201 -49 131 -101 190 66 67 -121 -12 -261 104 29 -230 -39 -305 -23 -57 14 39 -207 -122 -11 -135
6223 -135 259 -112 -39 -45 -30 -6 -27 -131 290 24 6 43 151 21 83 -15 -65 8 -116 54 -139 -176 -163 -10 -415
6248 -415 -26 -38 -68 -80 27 -103 35 -221 -217 86 279 11 -28 -46 -156 66 -204 -10 -37 -186 73 21 -208
6271 -208 149 -50 -76 8 -53 243 185 60 -60 83 -30 188 2 88 -17 -50 64 -62 163 55 -313 43
6293 43 -8 -21 -101 -126 150 -25 72 -110 -24 283 284 189 158 -50 50 -32 19 -187 -314 -2 27 329 -83 -8 -15 -62
6319 -62 -45 -176 -83 190 -245 -42 -284 -158 84 173 82 164 51 188 105 158 -328 -27 110 153 230 94 124 133
$$ packed form
6151i8J10j27o6J7N9m7M04m41K38M57n40R7P9o5k32K79l02J13m1J56k2J9j95r9
6175b47K71JJ62Mj78J26n6l52J20K4J59O3j14O5Kn3MM0O6l21K55L5L1n4M1k95
6201b01J52J80k32K91j24Jj88J09k49L65p5k59J91k66K82l4P1K5k46Q5J11j24
6223a35L94l71P3oJ5K4k1j04M21k66j8L7J08j30O2r8n0P3j24J70j93l7J3J53m05
6248d15L89j2l0j2J07j30J38k56ML03J93k68l9j8j10K22k70J94k7j49K59n2k29
6271b08L57j99k6Q4o1K96n8j25j20J43j13K18j86Q6j05l3J14j26K25j08l68L56
6293D3n1j3q0k5K76j75R7j82Q6L07Jr5l1k08J00q2N1k06j27L12K9L02m12P5pm7
6319f2J7j31R3K73m35K03k42J26K42Q9r1Q2j13J37q3N3m86L01J37M3P7j36L0R
$$ plain form
6343 133 -63 -163 -57 116 23 -24 -138 -16 -88 293 -36 -11 -180 -126 21 -38 -23 -276 71 91 40 -91 205
6366 205 11 -212 83 29 277 -40 -98 101 178 -54 -183 56 -41 130 -262 146 -69 -193 124 -10 9 -33
6388 -33 -235 32 -75 -210 3 86 75 -16 -240 -45 -78 -53 161 -180 76 158 -272 101 -151 125 -448 -47
6410 -47 232 -66 -239 34 125 314 36 271 -222 -222 325 -234 55 -55 89 -15 -240 322 -56 -37 -52 111
6432 111 35 292 -186 -83 175 198 89 -42 -90 9 162 -11 -127 38 -17 133 239 52 -163 62 166 196
6454 196 -278 120 96 -92 -42 93 312 -46 161 66 -78 71 -87 -230 -21 22 52 -83 -69 16 39 -129 -230
6477 -230 109 -19 250 -266 -40 89 -92 272 -149 -54 -5 -21 -148 -62 -132 -6 -131 197 -31 30 -26 60 66
6500 66 -92 93 -31 -183 74 154 -236 -82 133 -123 -36 -32 166 -67 142 122 37 -20 67 -158 -155 -420 199 201
$$ packed form
6343A33j96j00J06J73r3m7j14J22p2L81l29K5j69N4J47n9J5k53L47K0n1j31K96
6366B05j94k23K95n4K48l17n8J99P7k32j29K39r7J71l92M08k15j24L17j34J9m2
6388c3k02K67j07j35K13Q3j1r1k24J95l3K5K14l41K56Q2m30L73k52K76n73M01
6410d7K79k98j73K73R1J89k78K35m93%N47n59K89j10J44j04k25N62l78J9j5J63
6432A11p6K57m78J03K58K3j09j31m8R9J53j73j16J65n5J50J06j87k15K25J04L0
6454A96m74L98k4j88N0J35K19l58K07r5j44J49j58j43K09M3L0j35J4Q5K3j68j01
6477b30L39j28K69n16K26J29j81L64m21R5M9j6j27Q6p0J26j25L28k28O1n6Q6O
6500F6j58J85j24j52K57Q0l90J54K15k56Q7MJ98k33K09k0q5n7Q7k25Lk65O19K
$$ plain form
6524 201 -92 261 164 148 -95 96 -150 42 -194 -61 -117 348 84 -102 -85 -162 109 63 49 -86 -37 136 69
6547 69 238 73 -179 -27 -29 -92 -318 173 86 179 261 89 140 34 -141 -65 117 -40 -294 34 22 49 143 -137
6571 -137 74 -39 -116 289 -22 -100 -53 -98 145 -300 -109 -14 -45 198 -75 -28 56 4 249 201 214 160 -258 199
6595 199 -18 -134 132 -132 -11 50 -201 193 253 270 116 -100 -87 1 310 -215 221 309 2 -95 48 -85
6617 -85 40 7 163 -98 68 -190 -8 -141 -70 155 -228 280 29 16 4 -176 -26 23 -57 63 -243 -108
6639 -108 181 -100 68 -88 236 -243 -83 -90 233 115 -152 -202 120 247 -152 -214 63 -242 -1 128 -230
6660 -230 -18 -221 -152 10 -206 -71 278 30 -125 229 -47 -87 199 -13 -61 48 226 204 164 -134 -226 -220 -154
6683 -154 -26 43 64 -276 -137 -78 72 55 -151 -139 -125 178 -52 279 -140 -284 85 7 90 -15 -137 -6 -445
$$ packed form
6524B01k93L53r7j6k43J91k46J92k36J33n6M65k64j86J7p7K71m6j4j35M9J73o7
6547F9J69j65k52J52ko3k26M91q7R3Q2j72N1j06j75P6J82j57k54L28j2K7R4k80
6571a37K11j13p7M05l11p8M7m5K43m45J91R5l1K43k73M7Q4n2K45m8J3n4m18M57
6595A99k17j16K66k64J21O1k51L94O0J7j54k16J3Q8L09n25M36Q8l07r7J43j33
6617h5J25l3J56k61J66k58J82j33P1K25l83N08k51j3j2j80J50M9q0J20l06J35
6639a08K89k81J68j56L24m79J60pL23j18k67n0L22J27l99o2K77l05K41J29l58
6660b30K12k03O9J62k16J35L49k48j55L54k76m0K86k12m8J09J78k2m0k98r2OO6
6683a54J28O9K1l40J39N9J50j7k06J2J4L03k30L31m19j44L69p8Q3j05j22J31m39
$$ plain form
6706 -445 -13 -90 -85 87 126 -28 -40 -85 -90 7 129 57 -95 42 61 -117 30 -180 -1 135 200 -199 50 12
6730 12 -120 -296 -60 -74 89 175 100 -13 20 79 233 211 -166 159 -174 -47 -4 -97 -156 -47 97 100 44 66 188
6755 188 41 -124 -309 196 -2 -80 -64 115 55 229 108 -68 -40 -145 -159 -118 -96 103 35 -101 70 261 126
6778 126 -4 -27 81 78 88 94 -17 60 94 128 -30 137 265 140 -278 141 152 -105 168 -102 -113 -177 -329 267
6802 267 101 -96 221 -3 293 -73 -222 129 85 318 -234 -97 52 237 115 198 178 22 31 -26 -81 -51 -93
6825 -93 -13 68 -230 3 -241 237 90 -243 -4 9 37 -93 -128 205 93 155 -214 -45 6 -11 -3 217 136 -186
6849 -186 152 11 -25 -25 -114 -128 72 10 -176 11 10 11 205 160 23 -16 104 9 -326 -61 158 313 -42 164
6873 164 -203 -34 -213 176 -4 57 -117 65 -64 -139 -138 -206 215 -138 283 69 262 -299 54 -5 152 255
$$ packed form
6706d45M32p7NJ72L9j54j2m5nR7J22p2j52J37J9j78J47k10J79J36O5l99K49l8
6730A2j32j76K36j4J63Q6p5j13L3N9J54k2l77L25l33J27M3r3n9J09J44Ln6K2J22
6755A88j47j65j85N05j98p8J6J79o0J74j21j76K8j05j4M1K2J99o8j36J71J91j35
6778A26j30k3J08lJ0Oj11P7L4L4j58J67J28j25m18M19J1k57K73k70j1o4j52N96
6802B67j66j97L17k24K96l66j49L51m4K33n52J37J49J85j22Q3k0j56Rn7n5L0m2
6825i3Q0Q1k98K33k44M78j47l33K39J3K8j30l5L33j12O2l69J69N1j7QK20q1l22
6849a86L38j41l6%q9j4K00o2j86J87jJJ94m5j37l9J20r5l35K65K19J55l55K06
6873A64l67J69j79L89j80O1j74J82j29p5Jo8M21l53M21k14J93n61L53n9J57J03
$$ plain form
6895 255 139 245 -6 -160 80 -52 269 -27 -71 -36 -190 -266 -32 -1 134 -77 120 141 384 -17 220 182
6917 182 -274 -325 -46 -68 -45 198 -84 -46 122 367 -101 -315 -96 -65 45 -249 245 137 -75 -15 31 -43 -68
6940 -68 -67 -99 79 -125 -12 -69 -221 -21 147 -171 -160 26 -147 164 -93 79 -44 25 206 -95 -25 -41 22
6963 22 -66 216 -328 -111 150 48 -18 139 205 -31 33 -138 -195 46 167 -58 -9 -281 -93 -234 187 -162
6985 -162 -53 306 -102 -44 205 -32 -411 15 -58 -250 -120 16 -35 51 21 225 161 -116 27 172 -53 -104
7007 -104 102 -93 106 154 -81 43 -103 -76 323 -124 -71 15 50 -61 -135 61 237 213 -200 -11 34 -60 191
7030 191 39 -55 -198 -161 154 -230 4 49 63 200 330 275 -38 -140 -90 68 49 -193 171 25 -269 -125
7052 -125 40 -42 266 230 241 41 125 20 -241 -192 -97 -86 -80 22 117 -169 54 -146 -143 -256 133 66 -56 76
$$ packed form
6895B55j16J06k51j54K40j32L21k96m4L5j54p6K34L1J35k11J97K1K43m01K37l8
6917A82m56n1K79k2K3K43k82L8J68K45m68k14K19L1J10k94M94j08k12O0M6p4k5
6940f8Jl2J78k04J13n7j52K00J68l18J1J86j73L11k57J72j23O9J81l01P0j6O3
6963B2q8K82n44K17K61j02o6J57O6k36O4j71n7K41J21k25M9k72J88j41M21l49
6985a62J09L59m08N8K49k37l79M26p3j92J30J36n1Q6l0K04o4k77J43J45k25n1
7007a04K06j95J99M8k35J24j46K7L99m47N3Q6L5j11p4J96J76k4m13J89M5r4K51
7030A91j52r4j43L7L15l84K34M5J4J37J30n5l13j02N0J58j9k42L64j46k94J44
7052a25J65q2L08l6J1k00Q4j05k61M9R5J1OJ02R5k86K23k00Lj13L89o7j22J32
$$ plain form
7076 76 191 -59 133 244 -80 -152 68 -102 34 111 147 -217 147 122 53 29 23 76 77 18 -121 -73 16 196 -134
7101 -134 44 151 134 -38 132 78 -8 95 312 9 82 -64 137 44 -101 -159 -156 60 -43 -70 224 -121 73
7124 73 179 -68 -28 116 36 -67 -107 55 324 -68 -210 94 -224 -72 111 -73 294 -43 -27 -210 -36 -99
7146 -99 24 224 -246 100 22 60 52 -195 53 100 -287 208 -134 -473 -169 -210 30 -39 -103 -294 -193 -70 -177
7169 -177 16 146 -123 -85 237 116 46 225 12 97 60 80 -166 -205 -55 -123 -307 278 -194 178 -347 17
7191 17 -81 143 106 -76 154 -70 -171 201 52 -23 -66 125 133 -72 102 139 -125 -185 28 322 -53 -133 -44 11
7215 11 109 213 -134 48 -58 -241 205 -200 43 134 42 255 -217 -38 -221 -102 -269 28 -180 -22 -76 138
7237 138 -123 -250 134 -125 -91 129 8 173 35 56 99 -102 -19 -27 298 35 -328 59 29 14 -138 108 0
$$ packed form
7076G6J15k50J92J11l24p2K20j70J36P7L6l64L64k5o9k4oN3Jn9j39M8Q9J80l30
7101a34J78J07j7j72J70n4q6J03K17l03P3j46K01r3j45n8LK16j03k7K94l45J94
7124G3J06k47M0J44q0j03m0J62K69l92j42L04l18J52J83j84L67l37J6j83J74o3
7146i9J23K00m70L46p8L8qk47K48M7l87M95l42l39L04m1K40o9o4j91J01J23j07
7169a77J93J30k69L8L22j21p0J79k13Q5l7K0k46l9J50o8j84N85m72L72n25L64
7191A7r8K24l7j82K30k24j01L72j49p5m3J91Qk05J74L7k64o0K13K94l75q0Q9N5
7215A1R8J04l47J82j06j83M46m05K43R1r2K13m72J79j83J19j67K97k08J58n4K14
7237A38k61j27L84k59L4K20j21J65j38K1M3k01Q3qL25k63l63L87l0j5j52K46j08
$$ plain form
7260 0 -206 225 -271 227 85 -272 -133 -51 209 142 -71 51 -135 59 -295 43 15 23 -102 77 276 143
7282 143 -46 -98 -257 -141 -193 32 -145 109 172 310 -34 239 -58 100 -82 -93 73 -54 211 219 156 -307
7304 -307 416 -71 119 -52 -165 110 115 353 -10 -167 -30 -290 29 -12 -223 313 -41 138 220 -7 -15 -243
7326 -243 138 85 -77 -95 108 31 57 -113 294 157 -225 -162 36 102 87 -140 213 20 -76 217 -21 -235 218
7349 218 -106 -23 59 -27 38 -31 175 21 192 189 -14 204 43 219 -60 -117 -107 -105 -38 60 -171 94 -308 42
7373 42 -111 -5 0 -101 244 -157 61 -62 -42 79 -13 98 60 -86 89 94 -138 -50 -132 74 17 88 254 26
7397 26 -235 -158 -10 85 -151 -186 48 -2 13 49 -81 -22 -146 299 256 5 -99 37 -86 -146 28 -49 -69 -149
7421 -149 -215 -18 -148 -117 -208 -75 83 -197 -74 160 133 -71 -126 31 -179 -106 -159 211 -138 -118 289 -20 230
$$ packed form
7260@k06M31m96M98j42l57J39Q2K60o7k13J22j86J94l54L38k8Qj25J79J99j33
7282A43j89n2j59J16n2K25j77K54O3J38l44K73k97J58j82j1J66j27K65Qo3m63
7304c07P23m87J90j71j13K75NK38l63j57J37k60L19m1k11N36l54J79Q2k27qk28
7326b43L81n3j62j8K03p7K6j70M07j37l82O3J98O6j5k27L53j93r6K93k38k14M53
7349B18l24Q3Q2q6O5o9K06j54J71lk03K18j61J76k79n7J0KO7R8k31K65m02L50
7373D2j53J06Nj01L45m01K18j23K0J21r2J11l8j46J75Nk32Q8q2K06n7P1J66k28
7397B6k61P7J48R5k36l5K34n0J5L6j30N9j24M45m3k51j04J36j23o0J74p7k0q0
7421a49o6J97j30L1r1J33J58k80J23K34k7k04n5J57k10P3n3L70l49K0M07l09K50
$$ plain form
7444 230 37 -178 -84 -89 -168 -33 7 172 124 208 -28 25 -339 -16 154 -142 -44 -173 375 242 297 -100 133
7467 133 -5 -255 57 201 21 -260 -56 243 -69 -238 277 -79 -251 159 -25 40 -26 -102 -124 -157 42 -22
7489 -22 235 182 -272 -52 -106 -122 75 44 -39 78 18 142 -309 21 -29 -175 -171 -42 -24 -1 242 -28 34 159
7513 159 -254 -91 88 53 -33 184 -35 -51 167 -80 151 -91 125 -94 150 284 -17 -93 22 92 -209 56
7535 56 -51 76 -15 20 -112 -245 -17 -115 135 55 -316 21 303 -11 -23 -95 39 296 13 -111 -151 -201 -149
7558 -149 -44 89 208 -17 -19 -36 107 -195 -118 -199 -235 292 31 -233 215 30 -89 198 94 -61 -35 -145
7580 -145 -168 -101 152 -7 -19 26 138 -74 -38 222 56 -8 -210 -211 338 -93 -21 -93 -169 -57 46 -41 13 127
7604 127 -285 -213 155 -96 -157 88 -7 77 5 -84 -35 129 -127 -184 -115 47 182 -289 28 182 -84 23 -113
$$ packed form
7444B30j93k15R4np9J35M0J65m8Q4k36N3l64L23J70k96R8j29N48j33N5l97K33
7467A33j38k50L12J44j80k81K04K99l12j69N15l56j72M10j84O5o6p6k2l3J99o4
7489b2K57n3m54K20n4j6J97l1q3J17o0J24m51L30n0j46MJ29J8K3K43k70O2J25
7513A59m13J63J79l5q6K17k19j6K18k47K31k42K16k19K44J34l01p6J15P0l01K65
7535E6j07J27r1L5j32j33K28r8K50q0l71L37K82l14j2p2J34K57k83j24m0n0N2
7558a49J05J33J19k25kj7J43l02P7q1l6N27k61k64M48j85j19K87j04j55K6j10
7580a45k3O7K53j59j2M5J12k12L6K60j66o4k02jN49m31P2p2p6J12J03q7N4J14
7604A27m12P2L68k51o1K45r5Q4p2q9M9J64k56n7O9J62J35m71L17J54k66J07j36
$$ plain form
7627 -113 -212 -405 290 95 -242 -155 295 -152 387 317 1 -85 381 212 -18 137 -221 -7 -121 -24 -235 -107
7649 -107 154 60 46 135 -122 -7 -266 62 -302 56 -70 -152 104 31 21 209 167 -8 -77 -55 -230 -261 -99
7672 -99 101 271 -88 -37 98 131 -108 0 -107 117 -95 104 -87 251 128 -87 50 -226 -42 -209 -35
7693 -35 34 31 -207 105 -245 -106 -372 -79 200 111 10 -44 -56 -266 302 184 -149 -341 -11 98 -97 78
7715 78 56 -203 5 -286 129 -85 -300 -92 -209 -105 52 -124 178 -306 -240 -1 98 -117 77 231 182 -120
7737 -120 -84 96 -182 197 92 -119 101 113 113 -109 16 -114 -9 -318 -192 -40 -126 -91 1 65 71 -224 -292 -400
7761 -400 165 260 -257 174 -65 79 -271 -72 -139 101 -202 -139 -185 137 -165 -141 267 66 -314 -3 54 50 -43
7784 -43 316 260 -210 -32 85 87 -150 231 -62 -97 190 -119 153 172 71 -11 -204 -128 18 -57 -168 63 -156
$$ packed form
7627a13r9j93O95j95l37Q7M50m47N39p0l16q6M66j69k30J55l58K14j14R7k11J28
7649a07K61r4j4Q9k57J15k59L28l64L58j26q2K56p3j0J88m2j75o9K2j75l1J62
7672i9K00J70l59N1J35L3k39J08j07K24k12J99j91L38j23k15J37k76J84j67J74
7693c5O9lk38L12l50J39k66K93K79q9j01n4j2k10N68j18l33j92L30J09j95J75
7715G8k2k59K08k91M15k14k15K08j17J04J57j76L02m84O6K39R9k15J94J54m9l02
7737a20L6J80k78L79j05k11K20J2%k22J25j30J05l09J26J52q6L5R2O4Ok95o8j08
7761d00N65R5n17M31k39J44l50J99o7K40l03O3m6L22l02K4M08k01l80L11N7mr3
7784d3L59n6m70J78J17Kk37L81k93l5K87l09K72J9j01q2j93P6J46p5j11K31k19
$$ plain form
7807 -156 294 128 97 63 -2 -65 21 -85 -87 256 345 -27 -269 -337 -112 -15 -123 -33 29 307 332 -32 50 318 133
7832 133 178 180 -56 -132 -177 -270 -130 -69 80 54 -139 63 -148 57 -107 26 -14 -44 199 -102 -142 37 -52 118
7856 118 -47 -29 138 -144 -149 113 -198 -170 -5 -173 94 -90 48 72 95 23 -168 126 -144 -93 -40 0 -68 139
7880 139 192 69 32 -301 50 61 37 -75 90 -66 40 -159 121 168 -215 -121 156 35 39 30 314 -158 63
7903 63 264 27 -23 29 217 -207 -120 193 162 35 -234 -114 52 -61 157 -186 -283 60 -92 72 -121 -125 42
7926 42 -247 -254 77 53 59 16 -105 -191 85 -136 6 4 73 19 198 -130 339 55 95 35 -116 105 -138 -34 153
7951 153 174 199 -19 129 51 -140 -270 -124 145 -12 108 232 268 83 -30 22 189 33 -77 -109 -86 15
7973 15 64 -103 -193 -135 -9 -27 300 -111 -49 -97 -90 116 139 -16 61 59 -194 63 -58 -117 28 48 -43 -198 2
$$ packed form
7807a56M50j66l1l4o5o3Q6j06kL43Q9l72k42o8K25R7j08R0O2K78K5l64Q2K68j85
7832A33M5Kk36p6m5r3J40O1J49k6j93K02k11K05j64J33m0l0K43l01m0J79q9J70
7856A18j65J8J67k82nK62l11K8J65j68K67j84J38K4K3p2j91K94k70N1N3M0o8K07
7880A39N3j23l7l33L51J1k4j12J65j56J06j99K80M7l83R4K77j21MrK84m72K21
7903F3K01k37n0N2J88m24Q7L13l1j27k69J20J66j13K18l43r7L43j52J64j93mJ67
7926D2k89pL31k4Om3j21q6K76k21J42kO9n4J79l28M69k84M0o0j51K21k43J04J87
7951A53K1K5k18J48p8j91j30J46K69j57J20J24L6j85j13N2J67j56j10l2K3J01
7973A5M9j67r0N8J26j8L27m11O2m8PK06K3j55P7kk53K57j21n9J45K0r1j55K00
$$ plain form
7998 2 -10 -52 317 47 121 55 53 -37 36 52 -73 76 195 -153 -90 67 162 184 -32 -128 -185 -95 -351 195 -144 133
8024 133 170 -33 61 124 -185 23 -197 -119 -60 31 -152 -132 -19 -47 130 103 114 -81 256 -2 169 -45 -8 -148
8048 -148 42 111 147 112 -111 3 42 -239 188 75 85 31 86 267 -23 244 -101 -42 94 151 -89 -249 -31
8071 -31 237 -64 -237 -85 211 125 122 57 78 69 -191 55 -114 275 -90 -188 19 -7 -102 -42 5 -133 -106 -221 -163
8096 -163 -329 36 -150 -20 -82 -240 -174 141 -29 -94 2 -344 -65 -96 -88 -109 100 116 -176 -6 6 -132 27
8119 27 -250 43 16 -107 223 174 -329 -15 -260 -290 -17 138 -187 57 -110 -29 -24 -157 -55 -17 128 212 7
8142 7 131 -244 193 -58 -43 -134 207 -81 58 -9 -109 152 17 -140 101 227 -99 105 48 11 -128 -38 -4
8165 -4 120 82 -233 136 83 138 27 264 112 -148 46 17 329 -186 95 -61 16 110 -107 172 -203 -160 -67
$$ packed form
7998Bj2m2L69k70P4o6kr0P3J6j25J49J19l48O3J57R5K2k16r6n7R0k56N46l39K77
8024A33L7k03R4O3l09K08k20P8N9R1j83K0J13k8J77k7J1j95L37k58J71k14L7j40
8048a48J90O9L6l5k23J14L9k81M27j13J0n4N5J81k90K67l45N9J36N7k40j60K18
8071c1K68l01j73J52K96q6lo5K1rk60K46j69L89l65r8K07k6r5O0M7j38K7j15N8
8096a63j66L65j86J30o2j58O6L15j70o5R6l46K79l1Qk1K09J6k92J70J2j38J59
8119B7k77K93k7j23L30m9n03L14k45l0K73J55l25K44j67Q1Nj33J02L8J45Q4k05
8142GJ24l75M37k51J5r1L41k88J39o7j00K61j35j57K41J26l26K04n7l7j39R0L4
8165dJ24l8l15L69n3N5j11K37j52k60J94k9L12n15K81j56P7R4k17K79l75M3R3
$$ plain form
8188 -67 34 45 11
$$ packed form
8188f7J01J1l4
8191A1
$$ Imaginary data points
##PAGE= N=2
##DATA TABLE= (X++(I..I)), XYDATA
$$ plain form
0 0 0 0 0 0 0 0 0 0 0 0 0 0 0 0 8 -8 8 -8 9 -16 16 -21 24 -29 32 -40 46 -52 61 -69 79 -89 101 -116 129 -145
36 -145 165 -183 206 -229 253 -284 315 -348 385 -425 469 -517 570 -627 691 -760 839 -926 1022
55 1022 -1133 1259 -1403 1569 -1767 2004 -2297 2665 -3147 3809 -4777 6332 -9241 16596 -79825
70 -79825 -93036 51637 18684 4283 26394 -12058 -95881 -59559 2835 7236 9118 38672
82 38672 439 -58759 -52723 -12135 -8377 3902 29907 19400 -26506 -40231 -28614 -21746 -4764
95 -4764 28399 26974 -8812 -29307 -27345 -27738 -12263 19282 26513 3893 -14558 -25066 -30355 -13944
109 -13944 15217 21610 6355 -8020 -18491 -21488 -9784 5972 10542 5596 -3180 -12094 -13840
122 -13840 -6722 2058 4310 -940 -5372 -2665 -688 -856 -493 -830 -2696 113 4673 2873 -261 1844
$$ packed form
0@%%%%%%%%%%%%%%Qj6J6j6J7k5L2l7M5n3O1p2Q6r8J13j30J48j68J90k17K45k74
36a45L10l48L89m35M82n37N99o63P33q10Q94r86J087j197J318j451J599j765J948
55A022k155K392k662K972l336L771m301M962n812O956q586J1109j5573K5837r6421
70g9825j3211J44673l2953j4401K2111l8452q3823L6322O2394M401J882K9554
82C8672l8233n9198O036M0588L758J2279K6005j0507m5906j3725J1617O868J6982
95d764L3163j425l5786k0495J962l93J5475L1545P231k2620j8451j0508n289J6411
109a3944K9161O393j5255j4375j0471k997J1704J5756M570m946q776q914j746
122a3840P118Q780K252n250m432K707J977j68L63l37j866K809M560j800l134K105
$$ plain form
138 1844 915 -1639 232 2966 1217 1875 4287 2649 369 -516 -2707 -3192 1213 6235 7802 4950
154 4950 -2771 -8476 -6793 -502 7329 12332 9203 -1195 -9682 -10751 -5511 5641 15745 13356
168 13356 1151 -10519 -15961 -10350 4597 14564 13688 3653 -8917 -17011 -12220 -380 9405 12813
182 12813 7394 -5255 -13970 -12587 -5537 3560 10924 10274 1834 -7078 -12834 -11922 -2907 8209 12672
197 12672 8257 -2915 -13889 -15518 -7175 4296 12574 11992 569 -12041 -16396 -11535 160 11643
211 11643 13893 4414 -7919 -15376 -13369 -2290 9956 13381 7773 -3218 -12590 -12938 -3889 6472
225 6472 11516 9146 72 -8972 -10012 -5399 2076 7778 8852 3733 -3000 -6756 -7109 -2333 5164
240 5164 8871 7410 2078 -4606 -7555 -4307 2949 8946 10430 5438 -2935 -7538 -5001 1848 9073
$$ packed form
138A844r29k554J871K734j749O58K412j638k280q85k191m85M405N022J567k852
154D950p721n705J683O291P831N003l129j0398q487j069N240J1152J0104k389
168A3356j2205j1670n442N611J4947R967q76j0035j2570q094M791J1840R785L408
182A2813n419j2649q715J383P050R097P364o50q440q912n756R12R015J1116M463
197A2672m415j1172j0974j629Q343J1471Q278n82j1423j2610m355M861J1695J1483
211A1643K250r479j2333p457K007J1079J2246L425n608j0991r372l48R049J0361
225F472N044k370r074r044j040M613P475N702J074n119o733l756l53M776P497
240E164L707j461n332o684k949L248P256N997J484m992q373m603K537O849P225
$$ plain form
255 9073 11168 5468 -2258 -6261 -4626 1343 7995 9919 5793 -441 -4705 -4485 1034 7079 8459
270 8459 6017 946 -3159 -3133 1001 5222 7222 5841 2011 -1813 -2301 -173 2697 5567 5450 2695
286 2695 -290 -1531 -2117 354 4001 5277 4529 1468 -2698 -3994 -1363 3472 6326 6207 1376 -3938
302 -3938 -5366 -2022 2644 7178 6447 1133 -4812 -5822 -3067 2651 7234 5773 619 -4015 -5401
317 -5401 -3578 1377 5022 5040 2014 -2386 -5463 -4049 -480 3396 4465 2960 -689 -3855 -3926 -2183
333 -2183 749 3895 3977 1617 -1751 -4425 -4549 -935 3020 4968 3675 -148 -4266 -5461 -2748 1959
349 1959 5717 5691 1062 -4055 -5867 -3347 1856 5777 5629 1506 -3058 -4895 -3112 787 4487 5130
365 5130 2527 -1228 -3233 -2934 378 2942 3837 3070 1155 -1312 -1909 -1110 803 2772 3691 2621 203
$$ packed form
255I073K095n700p726m003J635N969O652J924m126o234m264K20N519O045J380
270H459k442n071m105K6M134M221K000j381l830l824m88K128K870K870j17k755
286B695k985j241n86K471L647J276p48l061m166j296K631M835K854j19m831n314
302c938j428L344M666M534p31n314n945j010K755N718M583j461n154m634j386
317e401J823M955L645J8l026m400l077J414L569L876J069j505l649l166p1J743
333b183K932L146Q2k360l368k674j24L614L955J948j293l823m118j195K713M707
349A959L758k6m629n117j812K520N203L921j48m123m564j837J783L899L700O43
365E130k603l755k005K99L312K564Q95p67j915k467n97P99J913J969R19j070k418
$$ plain form
382 203 -1269 -2191 -1010 1689 3786 3657 1827 -897 -2909 -1848 909 3565 4151 2647 -1084 -2869
398 -2869 -1859 741 2897 3617 1913 -746 -1770 -1473 353 2285 2638 1008 -281 -1088 -638 334 1093
415 1093 818 11 83 -169 -325 -187 -76 -27 -19 69 171 5 -337 -830 -674 48 21 275 -454 -1065 -1209 -191
437 -191 150 -99 -266 -1173 -1368 -960 47 -34 -224 -974 -2091 -1521 -287 768 759 -356 -1946 -2532 -1180
456 -1180 83 846 893 -707 -2500 -2805 -1397 229 1171 962 -834 -2026 -2140 -1229 469 857 683 -415
474 -415 -1464 -1674 -1709 -720 247 586 433 24 -640 -1558 -1380 -615 256 1438 1145 -288 -1371 -2167 -1536
493 -1536 352 2020 2009 676 -1556 -2437 -1742 552 2030 2095 1194 -1226 -1955 -1448 92 1766 2212 970
511 970 -521 -1541 -1035 -373 784 1590 1243 459 -701 -948 -684 -69 679 1268 1162 378 -472 -1120 -962
$$ packed form
382B03j472r22J181K699K097j29j830k724k012J061K757K656N86j504l731j785
398b869J010K600K156P20j704k659j024K97J826J932L53j630j289q07M50R72P59
415A093k75q07P2k52j56J38J11M9QQ8J02j66l42m93J56P22k7K54p29o11j44J018
437a91L41k49j67r07j95M08J007q1j90p50j117N70J234J055rj115j590n86J352
456a180J263P63M7j600j793l05J408J626R42k09j796j192j14R11J698L88j74j098
474d15j049k10l5R89R67L39j53m09o64r18J78P65Q71J182k93j433j083p96O31
493a536J888J668j1j333k232q81O95K294J478O5r01k420p29N07J540J674M46j242
511I70j491j020N06O62J157Q06l47p84j160k47K64O15P48N89j06p84q50o48J58
$$ plain form
530 -962 -199 1211 1932 984 -11 -1401 -1446 -582 848 1928 1224 -196 -1601 -1857 -1009 637 1602 1124
548 1124 -48 -1201 -1761 -650 61 976 830 -147 -987 -1141 -548 -465 69 143 -28 -380 -678 -770 -568 -894
568 -894 -433 106 412 -21 -680 -1111 -1442 -532 439 853 187 -563 -1395 -1312 -787 296 562 104 -424 -1291
588 -1291 -894 -426 451 335 98 -893 -1053 -519 -177 -87 -268 -188 -312 -58 -14 -30 -455 -601 -645 252 433 712
610 712 -259 -411 -545 -153 477 716 311 -42 -730 -449 9 541 527 251 -57 -478 -294 237 677 608 190
631 190 -17 161 441 370 271 300 55 354 561 734 521 -40 -118 -172 435 801 952 515 37 -101 128 719
653 719 1124 958 -188 -541 -476 46 633 608 330 38 -274 194 420 750 449 308 -107 42 275 192 296
674 296 -126 73 -82 196 529 -116 -196 -424 -20 -34 403 67 -114 -275 -106 -97 298 484 100 -388 -658 -446
$$ packed form
530i62P63J410P21r48r95j390m5Q64J430J080p04j420j405k56Q48J646R65m78
548A124j172j153n60J111P11R15j46r77q40j54N93Q3N34P4j71l52k98r2K02l26
568h94M61N39L06m33o59m31l31R10R71M14o66p50q32Q3N25J083K66m58n28q67
588a291L97M68Q77j16k37r91j60N34L42R0j81Q0j24K54M4j6m25j46m4Q97J81K79
610G12r71j52j34L92O30K39m05l53o88K81M58N32j4k76l08m21J84N31M40o9m18
631A90k07J78K80p1r9K9k45K99K07J73k13n61p8n4O07L66J51m37m78j38K29N91
653G19M05j66j146l53O5N22N87k5k78k92l12M68K26L30l01j41m15J49K33q3J04
674B96m22J99j55K78L33o45q0k28M04j4M37l36j81j61J69RL95J86l84m88k70K12
$$ plain form
696 -446 107 472 466 96 -353 -114 135 102 216 -156 -463 -353 -258 152 258 -317 -347 -494 -315 63 335 123
718 123 -402 -205 -200 201 135 167 159 -424 -198 0 356 238 0 -134 -255 138 23 317 309 -78 -471 -49 242
741 242 218 563 -21 -6 -105 -216 161 792 607 -121 24 -11 250 491 541 187 -239 -153 406 397 543 283 227
764 227 80 174 196 167 220 105 170 65 512 496 131 -6 -43 239 708 678 388 197 -370 -131 387 707 542
787 542 240 -333 -124 -131 24 420 552 153 -31 -303 -187 274 335 195 -278 -139 -149 140 -189 123 133 -159
809 -159 -80 95 19 -96 -182 -270 -196 129 406 309 -364 -252 -381 163 138 231 -7 -503 -413 -304 -188 46 254
832 254 -261 -325 -262 -399 96 -60 -43 -193 -321 -10 7 43 -166 -51 -57 90 -99 -217 -345 -382 -97 121 291
855 291 201 -343 -533 -367 -329 431 106 121 -10 -400 -242 -268 5 507 115 57 -178 -258 -85 68 226 226 31
$$ packed form
696d46N53L65ol70m49K39K49l3J14l72l07J10R5M10J06n75l0j47J79L78K72k12
718A23n25J97NM01o6L2qn83K26J98L56j18k38j34j21L93j15K94ql87l93M22K91
741B42k4L45n84J5r9j11L77O31j85p28J45l5K61K41N0l54m26Q6N59rJ46k60n6
764B27j47R4K2k9N3j15O5j05M47j6l65j37l7K82M69l0k90j91n67K39N18L20j65
787E42l02n73K09pJ55L96J32l99j84k72J16M61O1j40m73J39j0K89l29L12J0k92
809a59P9J75p6j15q6q8P4L25K77r7o73J12j29N44k5R3k38m96R0J09J16K34K08
832B54n15o4O3j37M95j56J7j50j28L11J7L6k09J15oJ47j89j18j28l7K85K18J70
855B91r0n44j90J66L8P60l25J5j31l90J58k6K73N02l92n8k35q0J73J53J58%j95
$$ plain form
878 31 -186 -94 -178 -6 200 153 -25 420 198 371 -46 -214 202 74 313 159 -31 -5 -138 -74 50 293
900 293 473 191 -16 -235 252 161 401 176 -78 -12 -57 -261 172 138 355 -50 -96 147 -177 139 41 -86
922 -86 71 187 -49 156 -2 -385 31 162 113 12 -17 -159 -244 -305 98 288 374 -110 -293 -373 -328 137 235
945 235 159 60 -311 -257 -280 -60 242 183 -179 -55 -64 162 -130 -234 -130 -32 333 -63 -512 -481 -217 -122 -18 -52
969 -52 110 -129 -513 -436 17 145 281 -70 -207 -296 -365 -163 218 257 197 177 -14 -266 -293 131 151 -32 6 -279
993 -279 -36 109 16 -80 -62 -40 261 67 -177 -237 -418 -106 -75 341 337 93 -37 -7 -7 296 401 20 113 -127
1017 -127 -67 -100 284 397 350 69 -69 -1 74 286 48 6 -77 5 -173 -20 -169 -42 -109 9 405 -127 -58
1040 -58 -87 -140 80 305 294 256 153 50 -194 214 17 -46 -124 -373 -260 50 -85 53 169 16 -121 -257
$$ packed form
878C1k17R2q4J72K06m7j78M45k22J73m17j68M16j28K39j54j90K6j33O4J24K43
900B93J80k82k07k19M87r1K40k25k54O6m5k04M33l4K17m05m6K43l24L16r8j27
922h6J57J16k36K05j58l83M16J31m9j01k9j42q5o1M03J90Q6m84j83q0M5M65R8
945B35p6r9l71N4k3K20L02n9l62J24rK26k92j04J04R8L65l96m49L1K64R5J04l4
969e2J62k39l84P7M53J28J36l51j37q9o9K02L81L9o0k0j91k52k7M24K0j83L8k85
993b79K43J45r3r6J8K2L01j94k44o0j81L12L1M16mk44j30L0%L03J05l81R3k40
1017a27O0l3L84J13m7k81j38O8P5K12k38m2q3Q2j78J53j49J27o7J18L96n32O9
1040e8k9n3K20K25j1l8j03j03k44M08j97o3p8k49J13L10j35J38J16j53j37j36
$$ plain form
1062 -257 119 -298 49 135 -120 98 -72 114 -126 -176 -213 -205 -144 99 221 90 192 42 -219 170 25 85
1084 85 79 19 -163 -19 318 200 13 -132 -188 -223 9 53 72 208 -56 -23 -74 -66 123 -213 -297 -18 -117 -339 -48
1109 -48 -59 -229 -98 45 -60 -195 -38 -86 -42 -14 23 221 70 190 -226 3 -210 174 -245 18 -324 -154
1131 -154 61 112 136 334 118 -40 18 138 126 85 -73 54 196 255 362 -5 -83 20 39 -120 149 226 120
1154 120 65 -13 -7 9 -25 94 86 -141 -125 50 87 30 410 -11 -73 -86 -9 -93 -72 -67 -286 -145 111 -151 -376 -93
1180 -93 104 4 -215 111 155 336 53 -37 116 -320 -16 78 -137 -6 74 298 49 100 -10 -203 -47 -120
1202 -120 -201 -190 -55 -79 256 -224 -76 -25 -179 -173 117 39 38 117 -125 -181 63 51 -114 116 405 34 -143 58
1226 58 163 -32 0 39 -43 -171 10 -47 -50 -347 19 94 -156 -188 36 222 -344 -325 -29 -165 -48 -134 12 157
$$ packed form
1062b57L76m17L47Q6k55K18j70J86k40n0l7QO1K43J22j31J02j50k61L89j45O0
1084H5oo0j82J44L37j18j87j45n6l5K32M4J9J36k64L3n1QJ89l36q4K79r9k22K91
1109d8j1j70J31J43j05j35J57m8M4K8L7J98j51J20m16K29k13L84m19K63l42J70
1131a54K15N1K4J98k16j58N8J20j2m1j58J27J42N9J07l67p8J03J9j59K69P7j06
1154A20n5p8OJ6l4J19qk27J6J75L7n7L80m21o2j3P7q4K1Nk19J41K56k62k25K83
1180i3J97j00k19L26M4J81k83r0J53m36L04R4k15J31Q0K24k49N1j10j93J56p3
1202a20q1J1J35k4L35m80J48N1j54OK90p8jP9k42n6K44j2j65K30K89l71j77K01
1226E8J05j95L2L9q2j28J81n7lk97L66P5k50l2K24J86n66J9K96j36J17q6J46J45
$$ plain form
1250 157 -26 294 11 208 15 44 -131 -420 72 129 24 139 60 34 -223 -7 273 -48 -331 123 -19
1271 -19 166 153 139 98 164 -132 86 66 291 -166 207 443 298 -315 -164 -63 -9 146 44 214 -201 67
1293 67 -123 50 84 319 117 131 266 -338 -128 262 33 122 242 209 11 -271 -70 142 -110 184 44 -192
1315 -192 -36 55 -64 168 -37 -114 199 -174 62 -85 -22 78 73 -47 73 51 -211 41 -86 114 -104 -272
1337 -272 -255 -74 -245 10 54 -54 109 -78 -28 -159 -77 35 109 -106 -81 -273 -188 -125 -198 31 -213 -417 93
1360 93 95 -228 -244 -168 0 255 -32 -95 34 -74 -178 63 143 251 226 136 -17 -26 -140 -109 39 223 -59 -327
1384 -327 -194 70 -72 -99 51 -16 -86 11 -132 -108 225 189 -319 -136 210 122 3 -67 103 127 247 65 56 -80
1408 -80 292 -101 178 187 41 -110 -121 -343 38 -167 -60 -138 -71 232 -184 44 283 6 -26 99 -5 -133
$$ packed form
1250A57j83L20k83J97j93K9j75k89M92N7j05J15p9k6k57K16K80l21k83M54j42
1271a9J85j3j4m1O6k96K18k0K25m57L73K36j45o13J51J01N4J55j02J70m15K68
1293F7j90J73L4K35k02J4J35o04K10L90k29Q9J20l3j98k82K01K12k52K94j40k36
1315a92J56R1j19K32k05p7L13l73K36j47O3J00nj20J20k2k62K52j27K00k18j68
1337b72J7J81j71K55M4j08J63j87N0j31Q2J12P4k15K5j92Q5O3p3K29k44k04N10
1360I3Kl23j6P6J68K55k87o3J29j08j04K41Q0J08k5r0j53rj14L1J48J84k82k68
1384c27J33K64j42k7J50o7p0R7j43K4L33l6n08J83L46q8j19p0J70K4J20j82rj36
1408h0L72l93K79Rj46j51j1k22L81k05J07p8O7L03m16K28K39k77l2J25j04j28
$$ plain form
1430 -133 -292 270 17 75 242 -172 -63 155 -27 137 19 122 -61 59 130 58 198 -11 351 -180 -22
1451 -22 -65 177 -13 49 -32 23 99 -13 -135 45 -142 220 155 -216 -35 283 95 -147 348 -270 190 -1
1473 -1 110 -75 309 120 -57 -150 -15 206 -134 95 -70 168 12 138 179 -62 -53 64 95 25 179 -26 -6
1496 -6 36 25 -155 -197 -18 62 -89 -10 230 -269 179 -160 71 53 -200 -159 140 161 165 199 133 13 -59 -276 174
1521 174 330 -85 390 50 103 196 -97 -58 21 148 -80 -79 -115 30 -28 128 -58 10 59 -152 421 -138 182
1544 182 67 48 -236 98 308 -9 79 -18 -198 182 -22 -299 48 50 -90 -181 190 -220 -106 -90 90 -110
1566 -110 -230 4 129 190 142 11 31 334 -133 406 -323 174 -6 -135 -52 -315 -69 -105 -40 -137 224 -9
1588 -9 14 -104 -97 47 -129 72 -103 116 -45 -113 97 0 -86 223 -97 182 -180 20 -30 -9 -235 67 -148
$$ packed form
1430a33j59N62k53N8J67m14J09K18j82J64j18J03j83J20P1p2J40k09L62n31J58
1451b2m3K42j90O2q1N5P6j12j22J80j87L62o5l71J81L18j88k42M95o18M60j91
1473aJ11j85L84j89j77r3J35K21l40K29j65K38j56J26M1k41RJ17L1p0J54k05K0
1496fM2j1j80m2J79Q0j51P9K40m99M48l39K31j8k53M1K99K1ML4o6j20p2k17M50
1521A74J56m15M75l40N3R3k93L9P9J27k28Jl6J45n8J56j86O8M9k11N73n59L20
1544A82j15j9k84L34K10l17Q8r7j80L80k04k77L47Kj40r1L71m10J14J6J80k00
1566a10j20K34J25O1m8j31K0L03m67N39p29M97j80j29Q3k63K46l6O5r7L61k33
1588iK3j18PJ44j76K01j75K19j61o8K10r7q6L09l20K79l62K00n0K1k26L02k15
$$ plain form
1611 -148 269 15 127 -39 14 61 -140 123 -142 159 13 148 -161 -68 -56 -133 -125 -94 -120 -70 143 85 -204 222
1635 222 50 -17 -100 -176 97 -96 -63 229 -23 -257 -36 -217 -58 -228 -158 100 0 -79 -153 103 -15 11 -224
1658 -224 6 3 131 -57 -201 -124 25 -84 -131 42 -268 182 19 -99 -172 -38 190 62 -8 -142 -6 188
1680 188 133 242 -192 -13 -5 -270 273 265 -133 335 -194 -53 68 -41 -9 -123 99 -6 378 177 150 -159
1702 -159 -84 -238 238 54 264 216 62 -186 55 -11 -60 -58 136 208 -176 -111 56 16 -4 52 194 78 -51 55
1726 55 -260 -204 179 -65 -30 -2 -138 172 -182 -150 -91 84 -85 -103 77 0 -83 311 -78 -34 218 -226 -112
1749 -112 315 65 28 -143 97 83 13 -88 82 -84 338 168 -123 14 -44 -27 -49 -3 -49 153 -141 -204 -51
1772 -51 197 62 -105 -138 -160 -35 -132 154 339 94 78 131 -142 -40 129 -38 -3 25 -119 166 -12 -62 12
$$ packed form
1611a48M17k54J12j66N3M7k01K63k65L01j46J35l09R3J2p7QL1k6N0K13n8k89M26
1635B22j72o7q3p6K73j93L3K92k52k34K21j81J59j70P0K58j00p9p4K56j18K6k35
1658b24K30lJ28j88j44P7J49j09m7J73l10M50j63j18p3J34K28j28p0j34J36J94
1680A88n5J09m34J79Qk65N43ql98M68n29J41J21j09L2j14K22j05L84k01k7l09
1702a59P5j54M76j84K10m8j54k48K41o6m9KJ94P2l84O5J67m0k0N6J42j16j29J06
1726E5l15N6L83k44L5K8j36L10l54L2N9J75j69j8J80p7q3L94l89M4K52m44J14
1749a12M27k50l7j71K40j4p0j01J70j66M22j70k91J37n8J7k2M6m6K02k94o3J53
1772e1K48j35j67l3k2J25r7K86J85k45j6N3k73J02J69j67L5K8j44K85j78n0P4
$$ plain form
1795 12 79 -74 -158 22 22 160 190 -83 176 -54 -172 -24 -278 -182 207 -87 -178 38 238 -89 179 142 119
1818 119 -37 42 218 -151 -44 -21 201 232 267 -245 -123 11 199 43 126 217 -92 -217 -67 -56 130 35 37
1841 37 -362 48 206 -83 -69 -257 97 -53 63 95 -63 -231 249 18 -63 75 -109 -49 107 -74 -27 205
1863 205 4 -123 2 -116 -125 13 -78 -28 -60 18 168 69 -71 -41 248 -80 -299 -96 -156 12 191 3 -98
1886 -98 -100 -36 239 91 11 69 95 172 2 -334 -119 -26 -120 -218 -162 -73 21 102 -30 -188 -150 152 -63 -105 -296 -24
1912 -24 205 27 131 152 -14 -8 -73 296 67 -337 85 52 -143 -195 -138 228 97 -357 3 -102 -147 -89 27
1935 27 113 74 -286 -148 1 97 -261 -207 -12 -76 -40 93 -87 55 294 102 107 26 -206 20 143 -79 238
1958 238 102 -46 25 119 -43 125 344 -62 125 -53 -2 134 247 30 31 -100 -343 4 -172 290 12 154
$$ packed form
1795A2O7j53q4J80%J38L0k73K59k30j18J48k54R6L89k94r1K16K00l27K68l7k3
1818A19j56P9J76l69J07K3K22L1L5n12J22J34J88j56Q3R1l09j25J50J1J86r5K
1841C7l99M10J58k89J4j88L54j50J16L2j58j68M80k31q1J38j84O0J56j81M7K32
1863B05k01j27J25j18rJ38r1N0l2P8J50r9j40L0K89l28k19K03o0J68J79j88j01
1886i8kO4K75j48q0N8K6P7j70l36K15R3r4r8N6Q9R4Q1j32j58L8L02k15m2j91K72
1912b4K29j78J04K1j66Oo5L69k29m04M22l3j95n2N7L66j31m54L60j05m5N8J16
1935B7Q6l9l60J38J49R6l58N4J95o4L6J33j80J42K39j92Nq1k32K26J23k22L17
1958B38j36j48P1R4j62J68K19m06J87j78N1J36J13k17Jj31k43L47j76M62k78J42
$$ plain form
1980 154 -153 52 80 70 86 -52 21 130 -66 -82 -17 151 -118 -249 65 -256 -15 -150 125 -170 -233 -151 -18
2003 -18 285 147 -127 37 -17 107 -43 -185 -20 -65 31 186 -165 85 -76 -62 -36 -126 -47 -223 -164 -345 -288
2026 -288 -53 -105 -51 15 7 169 -13 8 39 -71 -163 -132 139 113 -241 -99 -13 66 -250 -47 259 288 -28 96
2050 96 78 -66 -123 -95 -112 126 234 -125 -18 19 100 -11 252 39 367 -22 -7 37 -18 278 -53 277 -103
2073 -103 120 -242 172 -57 13 79 40 -168 50 0 105 72 -258 -43 -68 106 57 -362 -216 -19 47 -43 -70
2096 -70 -20 -145 -213 23 38 -122 -145 -31 -16 -112 -17 86 182 -114 204 175 135 -378 76 192 -226 -102 -363 154
2120 154 -158 -102 32 0 55 172 25 34 -83 -124 -116 179 -100 274 -17 -59 154 -275 31 -217 -69 -137 67
2143 67 31 26 -39 90 214 -204 159 19 112 -1 -242 -191 -21 -190 188 -272 89 22 -121 -110 -48 30 -57 -148
$$ packed form
1980A54l07K05K8j0J6j38P3J09j96j6O5J68k69j31L14l21K41j35K75k95o3Q2J33
2003a8L03j38k74J64n4J24j50j42J65m5R6J55l51K50j61J4K6r0P9j76N9j81N7
2026b88K35n2N4O6qJ62j82K1L1j10r2L1K71k6l54J42Q6P9l16K03L06K9l16J24
2050I6j8j44n7K8j7K38J08l59J07L7Q1j11K63k13L28l89J5M4n5K96l31L30l80
2073a03K23l62M14k29P0O6l9k08K18n0J05l3l30K15k5J74m9m19J46J97O6r0k7
2096g0N0j25o8K36J5j60k3J14J5r6R5J03R6k96L18k9m0n13M54J16m18J24k61N17
2120A54l12N6J34l2N5J17j47Rj17m1QK95k79L74k91m2K13m29L06k48J48o8K04
2143F7l6no5J29J24m18L63j40R3j13k41N1J70j69L78m60L61o7j43J1O2P8q7r1
$$ plain form
2167 -148 85 30 -92 167 -130 63 -90 -294 106 30 88 -60 51 -172 -130 255 -118 131 -26 -119 -12 230
2189 230 237 -121 55 -116 175 -122 48 89 -239 164 -47 -13 -214 62 55 -74 237 166 -18 221 150 -76 -9
2212 -9 113 -48 -143 -1 -178 104 -86 -26 65 -252 -29 -125 -30 -151 112 -138 217 121 146 16 -303 79 -12
2235 -12 -104 -62 7 -21 121 175 9 -63 -166 136 -37 -35 50 -193 80 -39 -117 5 -102 175 247 156 -184 57
2259 57 153 -2 52 -225 65 149 -164 104 143 15 18 -7 -142 23 -296 -358 248 -166 -10 -66 42 -5 -122 55
2283 55 19 -20 124 -27 9 113 59 -290 -7 -309 198 -140 300 144 -35 249 4 -119 165 67 -32 71
2305 71 -52 -119 -45 -125 80 -4 -58 -166 92 212 240 -157 -21 -155 -89 41 -173 -61 -18 -95 105 24 133 -70
2329 -70 10 -43 53 -109 -177 112 -232 -31 -199 318 -264 154 171 76 -1 -10 59 36 15 -118 143 74 149 202 -112
$$ packed form
2167a48K33n5j22K59k97J93j53k04M00p6N8j48J11k23M2L85l73K49j57r3J07K42
2189B30Pl58J76j71K91k97J70M1l28M03k11L4k01K76pj29L11p1j84K39p1k26O7
2212iJ22j61r5J42j77K82j90O0R1l17K23r6R5j21K63k50L55r6K5j30l19L82r1
2235a2r2M2O9k8J42N4j66p2j03L02j73KQ5k43K73j19p8J22j07K77P2r1l40K41
2259E7R6j55N4k77K90Q4l13K68L9j28Lk5j35J65l19o2O06m14J56n6J08m7j17J77
2283E5l6l9J44j51L6J04n4l49K83l02N07l38M40j56j79K84k45j23K84r8r9J03
2305G1j23o7P4q0K05q4n4j08K58J20K8l97J36j34O6J30k14J12M3p7K00q1J09k03
2329g0Q0n3R6j62o8K89l44K01j68N17n82M18J7r5p7rO9k3k1j33K61o9P5N3l14
$$ plain form
2354 -112 -86 -44 -144 47 64 90 265 59 48 -155 140 -23 -307 149 6 88 -82 -18 139 -163 6 156
2376 156 -72 11 -104 -117 138 29 118 -89 222 -211 -32 -1 -74 71 125 2 84 -5 -74 -108 -103 -219 243 -11
2400 -11 69 197 -38 298 72 -75 -272 15 -73 -168 -182 -60 -142 367 -1 39 -122 -123 71 -223 -248 -318 224 -185
2424 -185 -196 -75 292 -133 -139 -102 -141 51 13 -118 207 281 30 239 -13 246 67 -46 -127 166 256 160 -10
2447 -10 -47 -17 92 -136 -82 135 -327 151 -173 -77 -96 192 -21 65 -57 -159 -55 78 -72 13 31 -132 119
2470 119 119 -84 -111 -119 -131 44 -165 -59 37 111 286 -91 -260 236 87 44 -34 47 -10 -25 173 63 211 3
2494 3 -126 33 222 -29 -41 8 117 149 181 -299 42 283 -273 -118 -212 -138 -67 24 -213 15 125 -88 -114 37
2518 37 49 -79 -34 -252 60 247 231 134 23 205 -106 20 -203 119 233 -52 -28 28 29 -92 105 -134 3
$$ packed form
2354a12K6M2j00J91J7K6J75k06j1k03K95j63k84M56j43Q2j70O4J57l02J69J50
2376A56k28Q3j15j3K55j09Q9k07L11m33J79L1p3J45N4j23Q2q9o9l4Nj16M62k54
2400a1Q0J28k35L36k26j47j97K87q8r5j4J22q2N09l68M0j61jJ94k94k5p0N42m09
2424a85j1J21L67m25oL7l9J92l8j31L25P4k51K09k52K59j79j13q1K93R0r6j70
2447a0l7L0J09k28N4K17m62M78l24R6j9K88k13Q6j22j02J04J33j50Q5J8j63K51
2470A19%k03k7qj2J75k09J06R6P4J75l77j69M96j49m3p8Q1n7j5J98j10J48k08
2494Cj29J59J89k51j2M9J09L2L2m80L41K41n56J55r4P4P1R1k37K28J10k13k6J51
2518C7J2j28M5k18L12J87j6r7j11J82l11J26k23L22J14k85K4N6Jj21J97k39J37
$$ plain form
2541 3 -76 252 -208 -197 -91 -43 -39 -244 110 -5 -214 82 99 -95 -100 -69 -243 -195 102 -12 322 -300 14 -47
2565 -47 -27 -114 -10 -38 34 -29 -88 159 -237 85 213 122 6 -116 89 -29 85 -154 292 32 166 -33 57
2588 57 -20 -221 185 -208 -61 122 36 -93 138 299 -62 -119 61 -191 235 -324 108 -99 165 98 33 84
2610 84 128 100 -59 13 206 39 168 133 441 197 -151 129 -98 34 -118 -108 273 -39 49 -314 235 191 47
2633 47 224 158 32 93 -190 35 215 -108 -18 -63 -153 -124 -130 275 246 97 -173 -96 12 41 185 113 196 -96 226
2658 226 109 -1 177 12 -258 -137 81 32 -3 -106 -317 231 30 -53 -111 -212 93 -184 -215 44 59 227
2680 227 -87 36 39 -142 -29 -107 137 -80 -103 46 114 248 125 -163 -277 138 102 -27 -69 149 -53 -186
2702 -186 -158 -164 200 45 0 -106 20 -104 -178 -148 -122 -110 276 154 -30 63 -148 -195 299 33 116 61 12 -126
$$ packed form
2541Cp9L28m60J1J06M8Mk05L54j15k09K96J7j94nL1j74M8K97j14L34o22L14o1
2565d7K0q7J04k8P2o3n9K47l96L22J28r1j16j22K05j18J14k39M46k60J34j99R0
2588E7p7k01M06l93J47J83q6j29K31J61l61n7J80k52M26n59M32k07K64o7o5N1
2610H4M4k8j59P2J93j67J29l5L08k44l48K80k27J32j52J0L81l12Q8l63N49m4j44
2633D7J77o6j26O1k83K25J80l23R0m5r0K9oM05k9j49k70P7J08K9J44p2Q3k92L22
2658B26j17j10J78j65k70J21K18m9l5j03k11N48k01q3n8j01L05k77l1K59J5J68
2680B27l14J23Lj81J13p8K44k17k3J49O8J34j23k88j14M15l6j29m2K18k02j33
2702a86K8oL64j55m5j06J26j24p4L0K6J2L86j22j84R3k11m7M94k66Q3n5m9j38
$$ plain form
2726 -126 126 95 3 3 -63 60 244 94 235 -36 -36 42 185 27 62 123 95 -24 -35 -103 -158 73 17 100 -96
2751 -96 155 188 278 -87 -35 -324 -212 -161 10 -78 188 135 202 -30 118 -11 -18 -194 -167 124 54 -167 51 71
2775 71 40 2 196 -85 -75 4 -5 129 76 189 150 -133 -74 226 -170 -13 -60 478 -55 -91 -103 148 -8 65 21
2800 21 174 28 -80 -154 -168 -67 -197 -140 66 74 -179 -80 -42 143 -132 -119 -44 149 -77 105 103 56 17 207 -33
2825 -33 -73 -169 101 67 68 -166 -106 31 -79 26 56 213 -109 -64 399 257 129 95 149 363 -138 -122 134 100
2849 100 211 -17 3 39 -68 88 -113 205 232 -239 209 154 -7 -249 228 36 190 -267 128 92 184 223
2871 223 -139 87 -60 225 -159 158 110 14 72 -43 87 -98 -289 130 50 -241 38 66 -26 -174 -134 -6
2893 -6 -92 -145 199 -156 -8 -56 -107 194 34 48 228 13 -228 273 115 -91 92 -125 215 190 -41 -324 92
$$ packed form
2726a26K52l1r2%o6J23J84j50J41k71%P8J43j58L5O1k8j19j1o8n5K31n6Q3j96
2751i6K51L3R0l65N2k89J12N1J71q8K66n3O7k32J48j29pj76K7K91p0k21K18K0
2775G1l1l8J94k81J0P9rJ34n3J13l9k83N9L00l96J57m7N38n33l6j2K51j56P3m4
2800B1J53j46j08p4j4J01j30N7K06Qk53R9L8J85k75J3P5J93k26J82km7l9J90k40
2825c3m0r6K70l4Jk34O0J37j10J05L0J57l22M5M63j42j28l4N4K14n01J6K56l4
2849A00J11k28K0L6j07J56k01L18K7m71M48n5j61k42M77j92J54m57L95l6R2L9
2871B23l62K26j47K85l84L17m8r6N8j15J30j85j91M19q0k91K79K8r2j48M0J28
2893fq6n3L44l55J48m8n1L01j60J4J80k15k41N01j58k06J83k17L40k5k31k83M16
$$ plain form
2916 92 -218 -107 168 108 8 137 -20 -324 36 16 33 144 59 -54 101 107 -94 98 117 97 42 117 -149 -52
2940 -52 64 -91 -118 -76 -181 -55 -81 -20 123 -372 170 301 -115 -86 -14 -177 36 -119 266 69 -128 -268
2962 -268 -40 152 -6 83 -1 124 -30 -108 147 -127 180 43 115 -116 -106 -206 120 -31 36 -22 -32 -69 -48
2985 -48 43 -248 138 145 174 88 -39 76 255 -74 288 54 -79 12 263 -42 23 22 -423 -87 -140 -291 -2 118
3009 118 154 -89 -294 -184 83 38 -142 66 56 59 151 -95 60 -317 -140 -72 134 122 -258 -19 -355 -114 -99
3032 -99 61 -203 164 81 -19 195 158 42 -86 -50 -53 353 84 96 83 -96 -298 3 228 7 -44 -217 -75
3055 -75 179 -222 91 80 -3 155 -130 122 -22 103 -169 -95 -60 -155 211 -23 86 -114 -118 -257 -78 -93 -344
3078 -344 5 -106 48 40 48 -216 -110 -174 -59 -84 -58 -25 -138 180 145 0 55 -76 -152 134 57 60 90 -121 23
$$ packed form
2916I2l10J11K75o0j00J29j57l04L60k0J7J11q5j13J55Ok01J92J9k0n5P5k66R7
2940e2J16j55k7M2j05J26k6O1J43m95N42J31m16K9P2j63K13j55L85j97j97j40
2962b68K28J92j58Q9q4J25j54p8K55k74L07j37P2k31J0j00L26j51O7n8j0l7K1
2985d8R1k91L86PK9q6j27J15J79l29L62k34j33R1K51l05O5jm45L36n3j51K89J20
3009A18L6k43k05J10K67m5j80K08j0LR2k46J55l77J77O8K06j2l80K39l36K41J5
3032i9J60k64L67q3j00K14l7j16j28L6lM06k69J2j3j79k02L01K25k21n1j73J42
3055g5K54m01L13j1q3J58k85K52j44J25k72P4L5r5L66k34J09k00mj39J79j5k51
3078c44L49j11J54qQk64J06o4J15k5K6L3j13L18l5j45N5j31p6K86p7LL0k11J44
$$ plain form
3103 23 -154 65 -149 -82 -360 198 -165 38 94 -17 -74 85 110 69 -40 288 -303 309 -56 80 254 16
3125 16 206 -18 154 -174 70 266 -44 -246 55 37 45 -4 -67 134 96 -129 81 1 111 -66 -187 -8 48
3148 48 -152 -60 -51 108 -101 136 -33 60 69 332 -49 -78 -112 -16 -176 193 -116 5 106 -62 -171 -153 0 -69
3172 -69 -148 0 -3 16 174 -32 -234 -161 -258 -84 -53 30 -96 38 -236 -33 -52 -355 188 -126 34 139 -104
3195 -104 -41 100 -144 81 -116 45 -129 125 153 -137 -171 -102 123 -216 -109 -190 -276 24 249 260 115 159 -481
3218 -481 19 174 -285 -360 241 340 194 180 -174 -5 -155 -111 -14 217 -4 -125 250 36 -145 -249 107 -161
3240 -161 89 -1 77 -275 -173 43 -170 173 -103 -74 -66 -3 177 -2 -26 -38 -55 114 87 -129 69 166 -62 157
3264 157 133 64 38 32 102 55 -203 162 -200 -56 36 48 -153 94 29 125 -9 80 266 25 -49 55 -52 72
$$ packed form
3103B3j77K19k14O7k78N58l63K03N6j11n7J59K5m1j09L28n91O12l65J36J74k38
3125A6J90k24J72l28K44J96l10k02L01j8Qm9o3K01l8k25K10q0J10j77j21J79N6
3148D8k00R2RJ59k09K37j69R3RK63l81k9l4R6j60L69l09J21J01j68j09J8J53o9
3172f9p9J48lJ9J58k06k02P3r7J74L1Q3j26J34k74K03j9l03N43l14J60J05k43
3195a04O3J41k44K25j97J61j74K54K8k90l4O9K25l39J07q1q6L00K25J1j45M4o40
3218d81N00J55m59p5O01R9j46j4l54J69j50M4R7K31k21j21L75k14j81j04L56k68
3240a61K50r0P8l52J02K16k13L43k76K9QO3J80j79k4j2j7J69k7k16J98R7k28K19
3264A57k4o9k6oP0m7k58L65l62J44R2J2k01K47o5R6j34Q9J86k41p4J04j07J24
$$ plain form
3288 72 7 -148 45 -23 -92 87 180 -7 112 -24 -110 106 131 -112 -25 -41 -15 185 128 -225 -29 -18 187 -234
3312 -234 156 -61 122 -57 -42 121 167 14 28 424 -89 -27 -37 151 46 -113 205 -42 -339 -58 -331 147
3334 147 -22 -274 -199 -21 -62 -13 54 -19 -8 185 -97 45 -18 -134 -276 -96 176 82 19 -133 35 -64 10 206
3358 206 -96 68 -56 -130 -170 27 -155 -168 -193 -198 -67 -31 -67 12 -114 135 -21 -63 -52 -215 114 -128 231 210
3382 210 -87 -67 -164 168 57 -104 -57 130 -298 197 -184 -213 125 -11 -123 74 -242 -182 -40 253 -196 82
3404 82 -177 -353 99 90 170 -129 130 139 -5 103 -187 -102 94 217 -16 -26 -17 122 -229 130 -48 124 77 -178
3428 -178 272 129 -258 57 147 -58 -13 -181 -71 -19 -81 106 -315 -112 214 158 28 131 131 84 -63 -33 151
3451 151 -135 227 309 47 40 148 16 296 -249 53 -209 -46 97 275 169 -26 -16 268 296 81 -28 51
$$ packed form
3288G2o5j55J93o8o9J79R3j87J19j36q6K16K5k43Q7j6K6K00n7l53J96J1K05m21
3312b34L90k17J83j79J5J63M6j53J4L96n13O2j0J88j05j59L18k47k97K81k73M78
3334A47j69k52P5J78m1M9O7p3J1J93k82J42o3j16j42J80K72r4o3j52J68r9P4J96
3358B06l02J64j24p4m0J97j82j3k5nJ31L6l6P9j26K49j56m2J1j63L29k42L59k1
3382B10k97K0r7L32j11j61M7J87m28M95l81k9L38j36j12J97l16O0J42K93m49K78
3404H2k59j76M52rQ0k99K59Rj44J08k90Q5J96J23k33j0RJ39l51L59j78J72m7k55
3428a78M50j43l87L15R0k05M5j68J10N2o2J87m21K03L26n6j30J03%m7j47L0J84
3451A51k86L62Q2k62pJ08j32K80n45L02k62J63J43J78j06j95J0K84K8k15j09P9
$$ plain form
3473 51 -26 -117 -36 -100 116 31 326 17 -294 -70 112 -173 222 -247 -90 -27 -3 77 25 166 343 -188 -10
3496 -10 -182 -95 39 114 -168 74 -74 -53 -224 2 41 68 -3 -181 27 -42 69 -88 -44 -74 -188 27 -109
3519 -109 271 -296 107 162 -219 -31 132 178 15 -84 66 157 -101 -1 -43 174 -12 62 46 -40 40 122 185 -14
3543 -14 -26 65 -130 -161 35 -182 76 -4 102 76 10 400 -33 -46 -138 125 -130 210 435 113 231 -18 175
3566 175 -131 -3 -218 -193 -42 27 -236 -197 -26 -205 -182 -21 182 -153 -177 -117 109 5 318 39 -71 210
3588 210 -114 -140 4 -98 31 167 -87 25 84 106 -182 11 -243 -41 -40 -148 136 93 22 -33 28 256 129
3611 129 -341 88 -191 -137 36 -60 -46 -165 -30 291 239 196 -97 -135 -424 224 167 -99 -70 43 -74 -44 9
3634 9 90 296 122 9 -70 -23 -61 -94 76 -124 -103 11 404 91 6 85 -75 -134 -17 40 88 -3 -59 -112 -241
$$ packed form
3473E1p7r1Q1o4K16q5K95l09l11K24J82k85L95m69J57O3K4Q0n2J41J77n31J78
3496a0j72Q7J34P5k82K42j48K1j71K26L9K7p1j78K08o9J11j57M4l0j14K15j36
3519a09L80n67M03N5l81J88J63M6j63r9J50R1k58J00m2K17j86P4j6q6Q0Q2O3j99
3543a4j2R1j95l1J96k17K58q0J06k6o6L90m33j3r2K63k55L40K25l22J18k49J93
3566A75l06J28k15K5J51O9k63L9J71j79K3J61K03l35k4O0K26j04L13k79j10K81
3588B10l24k6J44j02J29J36k54J12N9K2k88J93k54K02Jj08K84m3p1n5O1K28j27
3611A29m70M29k79N4J73r6J4j19J35L21n2m3k93l8k89O48n7k66K9J13j17L0N3
3634IQ1K06j74j13p9M7l8l3J70k00K1J14L93l13q5P9j60n9J17N7M8r1n6n3j29
$$ plain form
3659 -241 251 51 28 -121 -91 268 183 155 141 74 3 -76 78 -86 -307 207 74 57 192 -167 -116 -4 136
3682 136 -18 -25 -258 -76 -160 15 -222 51 -82 -101 262 86 146 -157 156 -53 -39 218 -84 -127 -95 31 80
3705 80 -272 199 -226 235 245 -90 -126 129 -88 70 -62 -233 67 3 113 77 -74 -78 74 -10 -125 48 188
3728 188 -348 -203 -59 -175 -155 153 -171 9 123 -126 -115 -214 9 -344 5 193 -68 -140 332 -27 -187
3749 -187 277 -238 82 -76 58 -43 -28 -52 93 256 -80 -146 -223 -68 26 -13 248 -93 109 90 128 335 64
3772 64 362 22 210 -260 -173 147 31 -62 86 317 -201 135 205 -226 83 405 104 65 208 -320 106 142
3794 142 18 199 32 -126 61 173 -255 -140 20 114 -253 -35 33 -64 -136 139 -264 59 270 60 41 -40
3816 -40 -259 -190 238 -109 -32 -69 124 -30 -278 -5 44 13 -191 -188 29 83 102 -162 -50 23 74 28 67 242 329
$$ packed form
3659b41M92k00k3j49L0L59q5k8j4o7p1p9J54j64k21N14j33j7J35l59N1J12J40
3682A36j54pk33J82q4J75k37K73j33j9L63j76O0l03L13k09J4K57l02m3L2J26M9
3705H0l52M71m25M61J0l35l6K55k17J58j32j71L00o4J10l6j51mJ52q4j15J73J40
3728A88n36J45J44j16K0L08l24J80J14k49J1r9K23l53L49J88k61p2M72l59j60
3749a87M64n15L20j58J34j01J5k4J45J63l36o6p7J55R4l9K61l41K02j9L8K07k71
3772F4K98l40J88m70Q7L20j16r3J48K31n18L36P0m31L09L22l01l9J43n28M26L6
3794A42j24J81j67j58J87J12m28J15J60R4l67K18O8r7p2K75m03L23K11k10j9q1
3816d0k19O9M28l47P7l7J93j54k48K73M9l1k04LK17N4J9k64J12P3N1m6L9J75Q7
$$ plain form
3841 329 159 -217 -157 -62 -104 -82 184 -64 100 -240 183 -44 144 -18 -130 -188 68 -28 236 283 -122 22
3863 22 93 283 -175 10 199 161 53 -267 -12 58 -168 11 26 -130 -75 -117 51 46 244 41 219 -12 26
3886 26 -128 -295 -392 67 175 -89 -82 -74 -168 15 43 175 176 -245 117 -65 126 -32 -169 86 62 -302 -243 220
3910 220 -270 47 -154 79 -132 -122 124 -60 115 -120 101 86 -51 -253 67 -113 -40 110 -14 -119 131
3931 131 34 -127 132 172 -34 -72 88 59 67 105 89 80 193 -140 159 -39 21 226 -86 327 51 62 125 225
3955 225 -125 -119 147 -43 -157 -2 98 -43 -221 -120 125 -60 205 300 206 -26 139 412 72 155 201 69
3977 69 -77 258 -31 83 146 -146 160 -69 205 95 61 -233 -131 109 -51 208 -91 -191 21 67 -41
3998 -41 178 -115 -311 -193 182 -245 11 352 262 118 -183 -42 64 -125 -142 -162 -151 -159 -47 -166 -201 462 -120
$$ packed form
3841C29j70l76O0R5m2K2K66k48J64l40M23k27J88j62j12n8K56r6K64M7m05J44
3863B2P1J90m58J85J89l8j08l20K55P0k26J79J5j56N5m2J68nJ98k03J78k31L8
3886B6j54j67r7M59J08k64PQr4J83K8J32Jm21L62j82J91j58j37K55k4l64N9M63
3910B20m90L17k01K33k11J0K46j84J75k35K21j5j37k02L20j80P3J50j24j05K50
3931A31r7j61K59M0k06l8J60k9QL8j6rJ13l33K99j98O0K05l12M13k76J1O3J00
3955B25l50OK66j90j14J55J00j41j78J01K45j85K65R5r4k32J65K73l40Q3M6j32
3977F9j46L35k89J14O3k92L06k29K74j10l4k94J02K40j60K59k99j00K12M6j08
3998d1K19k93j96J18L75m27K56L41r0j44l01J41J06j89j7k0J1qJ12j19l5O63n82
$$ plain form
4021 -120 333 -76 94 288 116 -2 372 -201 162 -102 -3 367 97 -148 -49 -31 -125 83 -95 -82 41 2
4043 2 -165 141 -77 -84 -77 -168 -101 48 -154 12 112 -130 237 78 6 326 101 172 -216 -75 179 37 71 -108
4067 -108 476 -51 -204 187 -186 187 105 32 93 177 -38 247 -311 147 -286 -43 36 -145 24 -254 -55 -118
4089 -118 -345 -150 224 -3 -125 125 83 -93 -65 -177 49 193 -379 141 -159 -149 25 -52 41 46 16 106 298
4112 298 24 -57 -207 133 233 29 180 112 111 106 -64 124 220 228 118 -146 -253 -5 236 -38 108 -90 -252
4135 -252 147 -98 23 -178 175 -6 -9 185 27 -68 115 194 -212 -104 -245 133 -101 152 -303 -163 -52
4156 -52 -52 -198 -124 227 -13 -337 131 -148 235 68 -39 51 -169 -207 -11 124 -32 -125 -67 -223 -183 -236 75
4179 75 -218 -42 166 -32 129 60 23 140 21 -13 -390 -202 -241 35 -2 68 222 141 24 98 -268 149 -136
$$ packed form
4021a20M53m09J70J94j72j18L74n73L63k64R9L70k70k45R9J8r4K08j78J3J23l9
4043Bj67L06k18pPr1O7J49k02J66J00k42L67j59p2L20k25P1l88J41K54j42L4j79
4067a08N84n27j53L91l73L73q2p3O1Q4k15K85n58M58m33K43P9j81J69k78J99o3
4089a18k27J95L74k27j22K50m2j76K8j12K26J44n72N20l00J0J74p7R3Nl0R0J92
4112B98k74q1j50L40J00k04J51o8jnj70J88R6Qj10k64j07K48K41k74J46j98j62
4135b52L99k45J21k01L53j81lJ94j58r5J83P9m06J08j41L78k34K53m55J40J11
4156e2%j46P4L51k40l24M68k79L83j67j07R0k20l8J96J35j56r3N8j56M0n3L11
4179G5k93J76K08j98J61o9l7J17j19l4l77J88l9K76l7P0J54q1j17P4l66M17k85
$$ plain form
4202 -136 -64 7 -83 153 -41 -154 -153 197 -70 59 -49 365 -127 94 83 -144 279 216 44 -159 -16 54 -138
4225 -138 20 -4 -30 -190 49 243 156 -276 -166 178 80 38 -45 -286 331 85 -14 122 -87 -182 258 10 10
4248 10 127 177 -295 -95 -137 8 29 54 32 -78 65 -75 -46 -128 -335 172 -65 135 -183 -12 89 -144 -167
4271 -167 92 114 -117 -344 -12 111 49 220 -98 15 121 -97 259 115 -50 -181 -130 -171 164 249 -32 -178
4293 -178 -288 297 -98 133 -214 30 -123 -430 -13 -46 -136 -187 3 8 -45 96 146 95 153 11 155 -33 184
4316 184 -19 -48 109 -160 164 174 -24 -152 182 126 -213 -39 -85 -22 -77 -187 80 -76 105 -91 -29 198
4338 198 -98 -42 -120 -160 52 356 -159 5 -7 -27 181 159 3 132 203 155 -92 54 79 -272 111 96 -146
4361 -146 -129 -100 -216 -204 -232 173 30 83 -47 -102 -11 103 -17 64 -45 111 -223 35 114 191 87 -28 278
$$ packed form
4202a36P2P1r0K36j94j13JL50k67J29j08M14m92K21j1k27M23o3j72k03J43P0j92
4225a38J58k4k6j60K39J94q7m32J10L44r8m2q3k41O17k46r9J36k09r5M40k48%
4248A0J17N0m72K00m2J45K1K5k2j10J43j40K9q2k07N07k37K00l18J71J01k33k3
4271a67K59K2k31k27L32J23o2J71l18J13J06k18L56j44j65j31N1m1L35Q5k81j46
4293a78j10N85l95K31l47K44j53l07M17l3r0n1J90Nn3J41N0n1N8j42J44j88K17
4316A84k03k9J57k69L24J0j98j28L34n6l39J74m6O3n5j10K67j56J81j96O2K27
4338A98k96N6p8m0K12L04n15J64j2k0K08k2j56J29P1m8k47J46K5l51L83j5k42
4361a46J7K9j16J2k8M05j43N3j30n5R1J14j20Q1j09J56l34K58P9P7j04j15L06
$$ plain form
4384 278 -44 -51 -13 -139 -53 132 -36 95 -26 -176 32 -177 -88 -105 88 -73 -212 99 301 291 81 33 56
4407 56 27 -139 80 -115 -129 -109 271 -138 -86 157 198 100 138 -10 -174 -308 52 -97 147 111 -370 -191 55
4430 55 240 264 309 182 -174 -157 48 -193 -45 -126 -61 120 -362 -128 97 -238 -168 -57 -149 -117 42 -35 204
4453 204 -106 134 -156 -50 -17 -226 325 49 211 -276 -142 204 174 73 10 68 -47 48 -51 -71 77 -158
4475 -158 42 63 -130 -281 199 51 -113 37 125 20 -140 167 131 69 146 47 -290 -32 -210 -15 -132 -131 172
4498 172 52 -78 -41 147 -26 -179 -188 237 63 32 -2 121 -256 -286 219 120 87 -86 45 36 183 -28 60 -149
4522 -149 -241 -126 156 96 -196 110 112 149 16 127 -26 -273 72 -34 62 -237 -68 143 138 -145 75 -182 165
4545 165 -10 -195 -142 -26 -46 13 350 14 201 -39 -142 -97 119 51 -151 -56 -93 36 -21 28 55 49 90 -110
$$ packed form
4384B78l22pL8j26Q6J85j68J31j21j50K08k09Q9j7J93j61j39L11K02j0k10m8K3
4407E6k9j66K19j95j4K0L80m09N2K43M1r8L8j48j64j34L60j49K44l6m81J79K46
4430E5J85K4M5j27l56J7K05k41J48q1O5J81m82K34K25l35P0J11r2L2J59p7K39
4453B04l10K40k90J06L3k09N51k76J62m87J34L46l0j01o3N8j15R5r9k0J48k35
4475a58K00K1j93j51M80j48j64J50Q8j05j60L07l6o2P7r9l37K58j78J95j17JL03
4498A72j20j30L7J88j73j53rM25j74l1l4J23l77l0N05r9l3j73J31rJ47k11Q8k09
4522a49r2J15K82o0k92L06KL7j33J11j53k47L45j06R6k99J69K11nk83K20k57L47
4545A65j75j85N3J16k0N9L37l36J87k40j03M5K16o8k02R5l7J29n7M9K7oM1k00
$$ plain form
4569 -110 137 184 -10 -96 52 52 87 21 -192 -251 -167 394 15 -221 -118 97 106 114 47 -230 154 -206 61 305
4593 305 243 -217 89 289 -8 32 149 105 2 17 -24 42 25 -211 196 316 167 -19 -178 287 150 18
4615 18 153 -21 188 -14 0 55 -6 48 -134 249 -139 165 11 -238 66 -80 76 -27 -51 264 -23 19
4637 19 226 -19 121 -122 -52 -215 -79 100 112 119 -30 -76 18 -237 348 44 -46 -42 100 62 -4 285 7 40
4661 40 87 -92 103 246 -109 -23 118 170 152 114 136 -46 63 28 -70 -88 -37 -21 -20 68 -79 -1 -187 -287 7
4686 7 2 -256 62 81 116 -62 -260 9 -137 -170 -68 -55 -70 127 -120 -150 -268 8 -84 -243 -232 3 268 193
4710 193 365 -40 -155 -114 22 -32 344 200 -88 -350 191 140 -300 61 -68 -50 -11 -64 -134 178 -18 -164
4732 -164 58 -151 116 10 3 -202 17 -211 -27 184 262 -8 60 359 -32 -51 4 -69 22 -43 -264 27 91
$$ packed form
4569a10K47M7j94q6J48%L5o6k13n9Q4N61l79k36J03K15RQo7k77L84l60K67K44
4593C05o2m60L06K00k97M0J17m4j03J5m1O6j7k36M07J20j49j86j59M65j37j32
4615A8J35j74K09k02J4N5o1N4j82L83l88L04j54k49L04j46J56j03k4L15k87M2
4637A9K07k45J40k43P0j63J36J79J2Pj49m6R4k55N85l04r0MJ42l8o6K89k78L3
4661D0M7j79J95J43l55Q6J41N2j8l8K2j82J09l5r8j8N1J6JQ8j47P8j86j00K94
4686Gnk58L18J9L5j78j98K69j46l3J02J3j5J97k47l0j18K76r2j59J1K35K65p5
4710A93J72m05j15M1J36n4L76j44k88k62N41n1m40L61j29J8L9n3p0L12j96j46
4732a64K22k09K67j06pk05K19k28J84K11P8k70O8K99l91j9N5p3R1o5k21K91O4
$$ plain form
4755 91 -142 56 105 5 -198 35 83 34 119 101 273 30 65 -37 75 -205 -282 -128 -270 20 -206 -240 151
4778 151 -214 74 -99 -213 -88 26 217 134 179 229 -232 -168 133 50 121 21 97 -1 6 467 -166 -354 27
4801 27 -20 -135 23 -176 -210 -19 171 -227 26 -168 59 -77 216 -157 43 53 279 155 91 -95 -115 -160
4823 -160 39 138 -11 315 159 162 -15 -127 81 -308 -72 63 -294 79 -82 33 -120 55 -51 3 -56 22
4845 22 -171 127 -242 -179 -48 -14 -107 -232 150 175 144 270 -368 -64 -123 -307 -82 70 289 -340 -174 -155 145
4868 145 108 -141 -35 -25 -21 48 85 -121 -82 -224 103 -18 -105 278 -75 -57 173 164 17 -8 76 -140 65 31 -77
4893 -77 172 -110 -49 97 -20 -99 218 -143 214 28 159 28 8 82 -33 58 171 132 31 47 -203 -174 -305
4916 -305 -106 105 145 -157 -212 40 -52 101 -54 -29 136 64 43 -135 319 68 -265 -35 -223 -67 344 137
$$ packed form
4755I1k33J98M9j00k03K33M8m9Q5j8J72k43L5j02J12k80p7J54j42K90k26l4L91
4778A51l65K88j73j14J25J14J91q3M5N0m61O4L01q3P1j00P6r8PM61o33j88L81
4801B7m7j15J58j99l4J91J90l98K53j94K27j36K93l73K00J0K26j24o4j86k0m5
4823a60J99R9j49L26j56Lj77j12K08l89K36J35l57L73j61J15j53J75j06N4n9P8
4845B2j93K98l69O3J31L4r3j25L82K5l1J26o38L04n9j84K25J52K19o29J66J9L00
4868A45l7k49J06J0MO9L7k06L9j42L27j21q7L83l53J8K30rj47k5Q4k16K05l4j08
4893g7K49k82O1J46j17p9L17l61L57j86J31j31k0P4j15R1J13l9j01J6k50K9j31
4916c05J99K11M0l02n5K52r2J53j55K5J65p2k1j78M54k51l33K30j88J56M11k07
$$ plain form
4938 137 -102 218 -33 -79 184 224 28 -93 4 139 -22 8 -37 147 213 24 -49 53 42 204 -69 46 -67
4961 -67 162 21 -119 -141 137 113 -82 86 89 -65 6 -38 162 75 8 -185 -339 -100 25 -85 127 63 86 -89
4985 -89 -297 -72 -244 70 78 -25 -134 -141 53 7 38 -73 135 -56 49 32 -20 -44 -40 63 -242 -20 -119 191
5009 191 -296 -163 -7 -117 4 -213 204 -63 209 1 -80 63 -123 195 207 60 106 -165 -131 38 -131
5030 -131 -142 325 -158 -65 112 81 33 54 -128 -119 57 172 -137 148 260 121 14 117 -165 -174 -25 -240 51
5053 51 -275 -141 -263 95 -101 6 88 34 -138 -120 170 -46 72 238 160 -80 -76 -44 210 53 7 -298 -107
5076 -107 26 -163 -366 89 50 -94 -115 109 -55 130 -51 7 -69 21 385 -122 52 -151 171 -113 -34 173
5098 173 80 266 -88 80 -54 -86 3 -425 -10 -91 -113 -78 -51 -96 108 78 -173 172 -147 -181 -64 90 118 -17
$$ packed form
4938A37k39L20k51m6K63M0j96j21R7J35j61L0m5J84O6j89p3J02j1J62k73J15j13
4961f7K29j41j40k2K78k4j95J68Lj54P1m4K00q7o7j93j54K39J25j10K12o4K3j75
4985h9k08K25j72L14Qj03j09pJ94m6L1j11K08j91J05j7n2k4MJ03l05K22r9L10
5009A91m87J33J56j10J21k17M17k67K72k08q1J43j86L18J2j47M6k71L4J69j69
5030a31j1M67m83R3J77l1m8K1j82RJ76J15l09K85J12j39j07J03k82rJ49k15K91
5053E1l26J34j22L58j96J07Q2n4j72J8K90k16J18J66p8k40ML2K54j57m6l05J91
5076a07J33j89k03M55l9j44k1K24j64J85j81N8p6R0L64n07J74k03L22k84P9K07
5098A73r3J86l54J68j34l2Q9m28M15q1k2L5K7m5K04l0k51L45l19l4J17J54K8j35
$$ plain form
5122 -17 -121 112 75 -309 -216 -238 68 -115 25 19 -128 115 51 -24 -178 -32 79 -114 -149 102 -314 -87 -258
5145 -258 -65 -109 -98 91 -208 -81 -99 -91 -122 16 122 -199 2 -222 -189 -38 190 -104 6 23 114 -117 206
5168 206 39 74 -265 -106 28 55 6 228 -104 64 -187 -217 130 191 30 97 -297 -373 410 -110 344 -118
5190 -118 145 -104 -368 157 296 82 212 87 -189 -28 -284 43 191 69 55 27 234 52 13 289 -113
5211 -113 219 50 18 24 242 255 77 230 -14 -311 92 367 63 -29 -72 -55 -236 197 95 -104 -198 -233 -173
5234 -173 65 142 3 -39 -122 -55 138 67 -73 80 228 329 -37 -107 -207 158 164 -210 -89 -107 -23 67 113 158
5258 158 164 26 -67 26 38 -212 205 -77 56 111 -40 206 250 -129 -2 -22 226 -18 116 131 -101 209 -201
5281 -201 -54 231 -185 85 140 -57 -13 -213 -12 -36 61 -55 -147 -157 99 -111 42 -55 32 191 55 236 -11
$$ packed form
5122a7j04K33l7l84R3k2L06j83J40oj47K43o4p5j54J46J11j93l5K51m16K27j71
5145b58J93m4J1J89k99J27j8Ql1J38J06l21K01k24L3J51K28k94J10J7R1k31L23
5168B06j67L5l39J59J34K7m9K22l32J68k51l0L47O1j61O7l94p6P83n20M54m62
5190a18K63k49k64N25J39k14J30j25k76J61k56L27J48j22j4k8K07j82l9K76m02
5211a13L32j69l2OK18J3j78J53k44k97M03K75l04r2m3J7j81M33j02j99r4l5O0
5234a73K38P7j39m2q3O7J93p1j40J53J48J01l66p0j00L65Ol74J21j8Q4R0M6M5
5258A58Oj38r3R3J2k50M17k82J33N5j51K46M4l79J27k0K48k44J34J5k32L10m10
5281b01J47K85m16K70N5j97M4k00K01k4R7j16r2j0K56k10J53r7Q7J59j36J81k47
$$ plain form
5304 -11 -43 116 -150 47 -213 -103 -151 20 17 94 -191 406 159 117 -350 194 -80 -15 -179 124 55 -56 -49 -24
5328 -24 -211 43 105 125 8 -54 -57 151 -214 15 115 -98 11 58 116 -12 5 -20 -105 322 -241 -38 -30 -22 320
5353 320 104 130 -6 96 -230 67 176 -112 115 146 48 -34 -157 30 -60 85 -21 -274 -160 53 -124 287
5375 287 -274 -311 -104 0 -147 -52 85 152 -27 109 -180 67 -288 137 72 124 -225 -80 67 68 165 -5 231
5398 231 199 -59 113 49 -68 216 -161 78 -207 -38 -124 2 -139 126 30 -113 -167 22 45 -149 -82 234
5420 234 164 126 -191 -42 -218 -199 90 -190 53 -137 -18 162 -106 42 -30 -31 -2 56 13 -44 190 79 157 -79
5444 -79 -164 -179 21 260 180 -218 -207 -233 34 54 -45 15 216 70 191 43 -79 38 233 -103 156 240 261 -122
5468 -122 259 166 150 72 127 -217 -30 106 34 385 426 17 -82 -62 -278 54 201 11 154 2 140 71 -24
$$ packed form
5304a1l2J59k66J97k60J10m8J71lP7k85N97k47m2m67N44k74O5j64L03o9j11PK5
5328b4j87K54O2K0j17o2lK08l65K29J00k13J09M7N8j28J7k5q5M27n63K03QQL42
5353C20k16K6j36J02l26K97J09k88K27L1r8q2j23J87r0J45j06k53J14K13j77M11
5375B87n61l7K07J04j47R5J37O7j79J36k89K47l55M25o5N2l49J45J47JR7j70K36
5398B31l2k58J72o4j17K84l77K39k85J69q6J26j41K65r6j43n4J89K3j94O7L16
5420B34p0l8l17J49j76J9K89k80K43j90J19J80k68J48p2jK9N8m3n7K34j11P8k36
5444g9q5j5K00K39q0l98J1k6K67K0r9O0K01j46J21j48j22J17J95l36K59Q4K1l83
5468a22L81r3j6p8N5l44J87J36p2L51M1m09r9K0k16L32J47j90J43j52J38o9r5
$$ plain form
5491 -24 -98 126 269 240 -10 -44 -193 102 252 -167 -134 26 -59 -61 25 85 153 13 37 -187 -109 202 -48 48 122
5516 122 -360 172 -65 20 -245 28 -232 -163 181 -218 -127 86 184 209 117 -28 41 30 -20 -151 -4 -188 -3
5539 -3 -173 -114 84 -7 -11 8 -74 89 -42 -100 -193 -191 118 -12 -42 1 -3 -326 94 22 229 -279 24 -150 72 -87
5565 -87 -50 -153 -322 -92 -129 147 -76 -14 100 -74 -233 113 63 244 -103 192 -231 -230 9 54 -129 -128 -11
5588 -11 349 -30 -47 -53 185 272 50 149 -164 28 -21 -96 284 18 60 58 39 96 -182 78 -60 110 101 -9 172
5613 172 41 42 -116 0 86 8 155 -226 19 -30 60 -81 -29 34 -335 -169 202 12 29 -48 -64 106 -56 -112
5637 -112 41 107 -80 89 1 32 -138 306 -19 -183 98 -174 -91 -82 214 -72 106 38 -195 -261 -86 -143 127
5660 127 -51 19 -70 -89 -57 -56 82 192 93 -250 -37 -48 49 -67 168 -7 -236 40 -85 -92 8 -20 -28 -340 -139
$$ packed form
5491b4p4K24J43k9k50l4j49K95J50m19L3J60q5kQ6O0O8j40K4k24P8L11k50R6P4
5516A22m82N32k37Q5k65K73k60O9L44l99R1K13R8K5r2j45O9j1n0j31J47j84J85
5539cj70N9J98r1mJ9q2J63j31n8r3KL09j30l0M3ml23M20p2K07n08L03j74K22j59
5565h7L7j03j69K30l7K76k23O2J14j74j59L46n0J81l47K95m23JK39M5j83JJ17
5588a1L60l79j7oK38Q7k22R9l13J92m9p5L80k66M2kj9N7k78K60j38J70rj10J81
5613A72j31Jj58J16Q6p8J47l81K45m9R0j41N2O3l69J66L71j90J7p7j6J70j62n6
5637a12J53O6j87J69q8L1j70M44l25j64K81k72Q3RK96k86J78o8k33o6J75n7K70
5660A27j78P0q9j9L2JJ38J10r9l43K13j1R7j16K35j75k29K76j25pJ00k8ql12K01
$$ plain form
5685 -139 41 54 30 132 120 146 -17 -252 -160 -262 -20 206 -77 43 -39 61 -152 34 113 93 160 -97 -216
5708 -216 84 201 39 158 76 122 -208 -125 -427 2 179 -70 11 150 32 322 -441 109 264 -189 -48
5729 -48 121 135 17 59 -195 -308 -166 274 141 -174 -100 82 30 -257 -76 -169 190 265 109 242 -362 72
5751 72 -244 242 -87 -52 -151 -153 244 -172 -54 171 29 62 28 -1 -82 80 358 63 132 238 -203 176 -31
5774 -31 -203 249 107 150 99 -167 -252 -156 -6 -229 111 222 -82 80 -44 -151 35 -62 60 139 50 73 14
5797 14 -137 122 -119 -121 213 29 -62 -81 -42 -54 93 137 -61 34 -110 124 65 -192 -103 -72 58 -198 10 173
5821 173 -70 228 -142 -253 -24 141 -222 131 -193 141 7 170 -74 45 151 270 -165 134 -9 -119
5841 -119 288 125 -43 -66 -95 -111 207 -212 -180 8 70 -77 28 -369 -138 -58 -70 46 -123 102 -87 -76 -93
$$ packed form
5685a39J80J3k4J02j2K6j63k35R2j02K42K26k83J20q2J00k13J86P9k0O7k57j19
5708b16L00J17j62J19q2M6l30Q3l02M29J77k49Q1J39j18K90p63N50J55m53J41
5729d8J69J4j18M2k54j13J42M40j33l15P4J82n2k87J81r3L59P5j56J33o04M34
5751G2l16M86l29L5r9kL97m16J18K25j42L3l4k9q1J62K78k95O9J06m41L79k07
5774c1j72M52j42M3n1k66q5R6J50k23L40J11l04J62j24j07J86r7J22P9q9K3n9
5797A4j51K59k41kL34j84r1j9L9j2J47M4j98R5j44K34n9k57Q9L1J30k56K08J63
5821A73k43K98l70j11K29J65l63L53l24L34j34J63k44J19J06J19m35K99j43j10
5841a19M07j63j68k3k9j6L18m19L2J88O2j47J05l97K31Q0j2J16j69K25j89J1j7
$$ plain form
5864 -93 -292 -175 128 -66 -14 -104 67 -62 -93 -20 -82 -24 26 74 84 -79 -145 207 -145 -21 45 201 58 -351
5888 -351 253 -249 48 -42 127 -67 -116 -98 85 -96 -32 -232 181 149 -63 -95 293 56 -20 -211 -65 -17 165
5911 165 -150 143 -112 -78 230 91 184 -179 8 160 7 -121 125 211 -193 20 -37 186 184 161 134 -72 -67
5934 -67 62 66 -16 -266 -68 -60 -156 194 -76 100 -156 -89 -22 250 11 -82 -122 -54 77 -36 186 -31 392 158
5958 158 -242 172 -63 55 30 117 237 166 -108 -256 -275 -159 -92 -189 14 171 76 -52 184 -100 264 -88
5980 -88 43 55 -210 43 23 10 72 -150 -194 41 180 5 165 37 18 17 -48 41 -63 173 84 195 59 -150
6004 -150 -148 -207 -325 -200 94 -5 30 56 -22 -16 -196 116 -225 288 149 -171 -55 -189 134 -78 -15 111 -227
6027 -227 42 -119 -189 154 -53 4 54 -6 -159 61 -213 223 41 -101 -231 8 -188 231 -128 175 30
$$ packed form
5864i3j99J17L03j94N2r0J71j29l1P3o2N8N0M8J0j63o6L52l52J24O6J56j43m09
5888c51O04n02K97r0J69j94m9J8J83j81O4k00M13l2k12l2L88k37p6j91J46M8J82
5911A65l15K93k55L4L08j39R3l63J87J52j53j28K46Q6m04K13n7K23kk3k7k06N
5934f7J29Mq2k50J98Qr6L50k70J76k56O7O7K72k39r3m0O8J31j13K22k17M23k34
5958A58m00M14k35J18k5Q7J20p1k74j48j9J16O7r7K03J57r5j28K36k84L64l52
5980h8J31J2k65K53k0j3O2k22m4K35J39j75J60j28j9jo5Q9j04K36q9J11j36k09
6004a50Kn9j18J25K94r9L5K6p8Oj80L12l41N13j39l20J16j34L23k12O3J26l38
6027b27K69j61p0L43k07N7N0o0j53K20k74M36j82j42j30K39j96M19l59L03j45
$$ plain form
6048 30 -34 358 -87 233 -118 -87 383 152 -107 167 143 -185 149 7 -161 -314 -150 -135 259 137 187 223
6070 223 69 -215 20 -79 -1 151 55 85 19 31 -35 -61 -50 87 -96 -63 -158 252 -53 160 31 43 -49 -89 -44
6095 -44 -239 -445 -272 71 393 -111 204 18 -241 -150 158 -219 -23 -175 -22 48 -116 -366 -38 -74 52
6116 52 55 -99 -118 25 -51 -128 83 15 101 -164 129 95 -21 369 27 18 -6 -120 -473 -184 -89 68 -86 315
6140 315 80 113 98 -136 108 62 197 129 73 77 -213 -52 83 -46 134 243 186 -74 26 -14 132 -28 53
6163 53 201 -235 146 94 99 -79 94 -218 -72 -76 324 -20 -146 130 -87 -13 -3 138 13 -169 -185 107 -26
6186 -26 -43 -179 202 -40 33 -55 42 -1 -44 -58 35 99 121 -326 31 -26 1 -131 277 33 -276 261 52 20 -154
6211 -154 -206 -163 4 290 -53 -46 -203 20 7 -71 -14 -80 -4 137 -79 -53 252 -254 -55 -286 -173 76 21 -36
$$ packed form
6048C0o4L92m45L20l51L1M70k31k59K74k4l28L34j42j68j53J64J5L94j22N0L6
6070B23j54k84K35r9P8J52r6L0o6J2o6k6J1J37j83L3r5M10l05K13j29J2r2m0M5
6095d4j95k06J73L43L22n04L15j86k59R1L08l77J96j52J53P0j64k50L28l6J26
6116E2Lj54j9J43p6p7K11o8Q6k65K93l4j16L90l42rk4j14l53K89R5J57j54M01
6140C15k35L3j5k34K44m6J35o8n6Mk90J61J35j29J80J09n7k60J00m0J46j60Q1
6163E3J48m36L81n2Nj78J73l12J46mM00l44j26K76k17P4J0J41j25j82j6K92j33
6186b6j7j36L81k42P3q8R7m3m3j4R3O4K2m47L57n7K7j32M08k44l09N37k09l2j74
6211a54n2M3J67K86l43Pj57K23j3p8N7o6P6J41k16K6L05n06J99k31J13K49n5n7
$$ plain form
6235 -36 204 246 -43 317 36 9 39 -1 62 -82 46 -96 -73 -87 2 106 -73 181 -197 -24 107 -267 227
6258 227 86 -191 132 114 -42 -126 -31 -53 -42 124 -147 -3 76 -111 213 -242 0 163 36 115 183 67 -110
6281 -110 7 -192 -175 7 -42 57 196 -26 -217 -164 -142 45 159 64 75 10 155 -106 54 -346 -148 82 118
6304 118 -109 -41 82 126 -26 80 32 -19 220 -116 -59 6 -186 -132 60 27 22 63 -189 -250 0 29 -12 -103 -8
6329 -8 212 58 -109 -131 -53 -162 -134 -16 -31 63 -29 43 2 120 -166 138 69 -90 -160 67 94 -69 3 192 -182
$$ packed form
6235c6K40M2k89L60k81k7L0m0O3j44J28j42K3j4Q9J04j79K54l78J73J31l74M94
6258B27j41k77L23j8j56q4R5k2J1J66k71J44P9j87L24m55K42J63j27P9O8j16j77
6281a10J17j99J7J82m9R9J39k22j91N3K2J87J14r5J1o5J45k61J60m00J98K30L6
6304A18k27O8J23M4j52J06m8n1K39l36N7O5j92N4J92l3nM1k52o1K50K9m1r1R5
6329hK20j54j67k2P8j09K8J18j5R4r2P2m1J18k86L04o9j59p0K27K7j63P2J89l74
$$ [...]
8191B25
##END NTUPLES=NMR FID
##END=
