##TITLE=1H_DE-59_NaOH
 D2O
 64 sc, 
 28.6.2024
##JCAMPDX= 6.0         $$ Bruker NMR JCAMP-DX V2.0
##DATA TYPE= NMR FID
##DATA CLASS= NTUPLES
##ORIGIN= UXNMR, Bruker Analytische Messtechnik GmbH
##OWNER= root
$$ XWIN-NMR		Version 3.5
$$ Fri Jun 28 14:48:23 2024 Russian Standard Time (UT+4h)  she@DPX200
##.OBSERVE FREQUENCY= 200.1313
##.OBSERVE NUCLEUS= ^1H
##.DELAY= (6, 6)
##.ACQUISITION MODE= SIMULTANEOUS
##.ACQUISITION SCHEME= undefined
##.AVERAGES= 64
##.DIGITISER RES= 18
##SPECTROMETER/DATA SYSTEM= spect
##.PULSE SEQUENCE= zg30
##.SOLVENT NAME= CDCl3
##.SHIFT REFERENCE= (INTERNAL, CDCl3, 0, 15.7039)
##AUDIT TRAIL= $$ (NUMBER, WHEN, WHO, WHERE, WHAT)
$$ ##TITLE= Audit trail, XWIN-NMR		Version 3.5
$$ ##JCAMPDX= 5.01
$$ ##ORIGIN= Bruker BioSpin GmbH
$$ ##OWNER= she
$$ F:/spectra/data/she/nmr/H-F/1/audita.txt
$$ ##AUDIT TRAIL=  $$ (NUMBER, WHEN, WHO, WHERE, WHAT)
(   1,<2024-06-28 14:46:35.95 +0400>,<she>,<DPX200>,
      <continue with go, POWCHK disabled, PULCHK disabled
       configuration hash MD5:
       00 E9 B6 7A A2 85 ED C7 34 08 36 98 17 FE 4E 26
       data hash MD5: 16K
       51 25 D4 C0 41 D2 7A 5B B0 E0 D3 8C AA 76 48 89>)
$$ ##END=
$$ 
$$ hash MD5
$$ E6 0A 16 29 E9 CC 0C 8C BD 99 13 1B AC 16 D5 F9
##$RELAX= 
##$RELAX= 
##$RELAX= 
##$RELAX= 
##$RELAX= 
##$RELAX= 
$$ Bruker specific parameters
$$ --------------------------
##$DU= <F:/spectra>
##$EXPNO= 1
##$NAME= <H-F>
##$PROCNO= 1
##$TYPE= <nmr>
##$USER= <she>
##$AMP= (0..31)
100 100 100 100 100 100 100 100 100 100 100 100 100 100 100 100 100 100 
100 100 100 100 100 100 100 100 100 100 100 100 100 100 
##$AQSEQ= 0
##$AQ_mod= 1
##$AUNM= <au_zg>
##$AUTOPOS= <>
##$BF1= 200.13
##$BF2= 200.13
##$BF3= 200.13
##$BF4= 200.13
##$BF5= 200.13
##$BF6= 200.13
##$BF7= 200.13
##$BF8= 200.13
##$BYTORDA= 1
##$CFDGTYP= 0
##$CFRGTYP= 5
##$CHEMSTR= <none>
##$CNST= (0..31)
1 1 145 1 1 1 1 1 1 1 1 1 1 1 1 1 1 1 1 1 1 1 1 1 1 1 1 1 1 1 1 1 
##$CPDPRG= <>
##$CPDPRG1= <>
##$CPDPRG2= <>
##$CPDPRG3= <>
##$CPDPRG4= <mlev>
##$CPDPRG5= <mlev>
##$CPDPRG6= <mlev>
##$CPDPRG7= <mlev>
##$CPDPRG8= <mlev>
##$CPDPRGB= <>
##$CPDPRGT= <>
##$D= (0..31)
0 1.2 0 0 0 0 0 0 0 0.06 0 0.03 0 0 0 0 0.0002 0 0 0 0 0 0 0 0 0 0 0 0 
0 0 0 
##$DATE= 1719571378
##$DBL= (0..7)
120 120 120 120 120 120 120 120 
##$DBP= (0..7)
150 150 150 150 150 150 150 150 
##$DBP07= 0
##$DBPNAM0= <>
##$DBPNAM1= <>
##$DBPNAM2= <>
##$DBPNAM3= <>
##$DBPNAM4= <>
##$DBPNAM5= <>
##$DBPNAM6= <>
##$DBPNAM7= <>
##$DBPOAL= (0..7)
0.5 0.5 0.5 0.5 0.5 0.5 0.5 0.5 
##$DBPOFFS= (0..7)
0 0 0 0 0 0 0 0 
##$DE= 6
##$DECBNUC= <off>
##$DECIM= 32
##$DECNUC= <off>
##$DECSTAT= 4
##$DIGMOD= 1
##$DIGTYP= 9
##$DL= (0..7)
0 120 120 120 120 120 120 120 
##$DP= (0..7)
150 150 150 150 150 150 150 150 
##$DP07= 0
##$DPNAME0= <>
##$DPNAME1= <>
##$DPNAME2= <>
##$DPNAME3= <>
##$DPNAME4= <>
##$DPNAME5= <>
##$DPNAME6= <>
##$DPNAME7= <>
##$DPOAL= (0..7)
0.5 0.5 0.5 0.5 0.5 0.5 0.5 0.5 
##$DPOFFS= (0..7)
0 0 0 0 0 0 0 0 
##$DQDMODE= 0
##$DR= 18
##$DS= 0
##$DSLIST= <SSSSSSSSSSSSSSS>
$$ [...]
##$SUBNAM2= <"">
##$SUBNAM3= <"">
##$SUBNAM4= <"">
##$SUBNAM5= <"">
##$SUBNAM6= <"">
##$SUBNAM7= <"">
##$SUBNAM8= <"">
##$SUBNAM9= <"">
##$SW= 18.0517328524113
##$SWIBOX= (0..15)
0 0 2 0 0 0 0 0 0 0 0 0 0 0 0 0 
##$SW_h= 3612.71676300578
##$TD= 16384
##$TD0= 1
##$TE= 0
##$TE2= 300
##$TE3= 300
##$TEG= 300
##$TL= (0..7)
0 120 120 120 120 120 120 120 
##$TP= (0..7)
150 150 150 150 150 150 150 150 
##$TP07= 0
##$TPNAME0= <>
##$TPNAME1= <>
##$TPNAME2= <>
##$TPNAME3= <>
##$TPNAME4= <>
##$TPNAME5= <>
##$TPNAME6= <>
##$TPNAME7= <>
##$TPOAL= (0..7)
0.5 0.5 0.5 0.5 0.5 0.5 0.5 0.5 
##$TPOFFS= (0..7)
0 0 0 0 0 0 0 0 
##$TUNHIN= 0
##$TUNHOUT= 0
##$TUNXOUT= 0
##$USERA1= <user>
##$USERA2= <user>
##$USERA3= <user>
##$USERA4= <user>
##$USERA5= <user>
##$V9= 5
##$VALIST= <valist>
##$VCLIST= <CCCCCCCCCCCCCCC>
##$VD= 0
##$VDLIST= <DDDDDDDDDDDDDDD>
##$VPLIST= <PPPPPPPPPPPPPPP>
##$VTLIST= <TTTTTTTTTTTTTTT>
##$WBST= 1024
##$WBSW= 4
##$XGAIN= (0..3)
0 0 0 0 
##$XL= 0
##$YL= 0
##$YMAX_a= 1064420
##$YMIN_a= -1095956
##$ZGOPTNS= <>
##$ZL1= 120
##$ZL2= 120
##$ZL3= 120
##$ZL4= 120
##$ABSF1= 10
##$ABSF2= 0
##$ABSG= 5
##$ABSL= 3
##$ALPHA= 0
##$AQORDER= 0
##$ASSFAC= 0
##$ASSFACI= 0
##$ASSFACX= 0
##$ASSWID= 0
##$AUNMP= <proc_1d>
##$AZFE= 0.1
##$AZFW= 0.1
##$BCFW= 1
##$BC_mod= 2
##$BYTORDP= 1
##$COROFFS= 0
##$CY= 11.3945322036743
##$DATMOD= 1
##$DC= 2
##$DFILT= <>
##$DTYPP= 0
##$F1P= 15.6554695791079
##$F2P= 12.8336369535428
##$FCOR= 0.5
##$FTSIZE= 0
##$FT_mod= 4
##$GAMMA= 1
##$GB= 0.15
##$INTBC= 1
##$INTSCL= 1
##$ISEN= 128
##$LB= 0.24
##$LEV0= 0
##$LPBIN= 0
##$MAXI= 10000
##$MC2= 0
##$MEAN= 0
##$ME_mod= 0
##$MI= 1.114404
##$NCOEF= 0
##$NC_proc= 0
##$NLEV= 6
##$NOISF1= 3.799351
##$NOISF2= 2.8
##$NSP= 1
##$NTH_PI= 0
##$NZP= 0
##$OFFSET= 15.70392
##$PC= 1
##$PHC0= -25333.78
##$PHC1= 30.58748
##$PH_mod= 1
##$PKNL= yes
##$PPARMOD= 0
##$PSCAL= 0
##$PSIGN= 0
##$REVERSE= no
##$SF= 200.130013532006
##$SI= 16384
##$SIGF1= 3
##$SIGF2= 2
##$SINO= 400
##$SIOLD= 16384
##$SREGLST= <1H.CDCl3>
##$SSB= 0
##$STSI= 0
##$STSR= 0
##$SW_p= 3612.71676300578
##$SYMM= 0
##$S_DEV= 0
##$TDeff= 0
##$TDoff= 0
##$TI= <>
##$TILT= no
##$TM1= 0
##$TM2= 0
##$TOPLEV= 0
##$USERP1= <user>
##$USERP2= <user>
##$USERP3= <user>
##$USERP4= <user>
##$USERP5= <user>
##$WDW= 1
##$XDIM= 8192
##$YMAX_p= 0
##$YMIN_p= 0
$$ End of Bruker specific parameters
$$ ---------------------------------
##NTUPLES= NMR FID
##VAR_NAME=  TIME,          FID/REAL,        FID/IMAG
##SYMBOL=    X,             R,               I
##VAR_TYPE=  INDEPENDENT,   DEPENDENT,       DEPENDENT
##VAR_FORM=  AFFN,          ASDF,            ASDF
##VAR_DIM=   8192,          8192,            8192
##UNITS=     SECONDS,       ARBITRARY UNITS, ARBITRARY UNITS
##FACTOR=    0.0002768,     1,               1
##FIRST=     0,             0,               0
##LAST=      2.2672688,     0,               0
##MIN=       0,             -1095956,        0
##MAX=       2.2672688,     1064420,         0
$$ Real data points
##PAGE= N=1
##DATA TABLE= (X++(R..R)), XYDATA
$$ [...]
2472G6M63l47k58Q69q28q8q15J523p91N46o87O19p03J037k82p04R87j608N94N9
2492c38J77P72m73N53r14J09l28M82k23k13L5N29p02L12P93o45L65O81q82L0j98
2513g8l69J192o09O68k04j004O96m3o80J088p31N58r7n27M05p49P02O1j10j58
2533A1K49p76N62k59L2L9N73l15J88j54J37l17r43N23M23j014m67J275j65k35
2553f33M06k63J233n94M79q14O74J58Nj292P53M47j74n37r0o61L30O51N41p93
2573a74M10j29q2m04lN33n45R45r91O30k83J95J82k49O8L38j005J230j114J205
2593G57p88j113Q63k59Q64q84P94p55P56m39P7n05O05L34n87l77M87M26n36R5
2613a85p7P38m54n56O71n21K37J84l96J0K37m66Q56m08o08l4J333p9j002O45J13
$$ y = [76, 539, 192, -66, 803, -25, -113, -928, 595, -196, 350, -337, 282, -421, 616, 334, -370, 617, -991, -397, -338, -161, 611, 138, 691, -223, -114, -442, 40, -183, -396, -361, 168, -534, -222, 571, -74, 291, 972, 90, 120, -78, -447, 745, 136, 804, 600, -404, 292, 249, -431, 657, -74, 484, 387, -140, 265, -484, 218, 279, 169, 11, 260, -516, 46, -213, -181, -142, 431, 116, 304, 150, 287, -30, -973, -450, -27, -1041, -1508, -233, -398, -633, -227, -490, 743, 149, 628, -186, 488, 646, 651, -641, 112, 559, 385, -152, -242, -903, -573, 78, 619, -174, 236, 107, 25, -379, -382, 151, -394, 551, -440, 190, -93, 102, 284, 35, 103, 441, -564, 666, -448, 757, -31, -1144, -281, -540, 324, -560, 234, -521, 235, -204, -127, -632, -27, 307, -280, -657, -170, 256, -280, -185, -262, 476, 22, -534, 137, -384, -147, 37, -359, -349, -112, -578, 278, -130, -738, -772, 561, 482, -520, 125, 238]
2634B38K2m79L87M8k95L45l3l29J48O00p05j84O20n90L18J123j473J7P07L43p33
2655I5p51P96M28m61K89K39o91O48p0j347M16Q37n38k8M23k57P67j123J180n75
2675B77n53J11N4L81k8k73m59O48l47J20M12M92q76K70k85o60L96N91j220J279
2695C30J0n27K46Q2n31J9K51K07j42k00l6L86k16l36J54N17j48j04k80j11kj46
2717e77L22M61k14p75Q43M0o07P03L3l26N7p27K95P40j37K5j23P93j122Q02q61
2738c55q8J220j020P19k79r49Q44M06n46j207J504n12K59J27k13P5O59q90M98
2757B52j93J1l50L12K39m32L43r5m3M96Q4j234R00j3pq43Q83m72M86j57k81J075
2779I61j221j91M03k10m62P00N20j05K23j038R09L24r70Q85r53n49P77l63K53
$$ y = [238, 260, -219, 168, 216, -79, 266, 233, -96, 52, 652, -53, -237, 383, -207, 111, 1234, -239, -222, 485, 828, 95, -656, 140, 568, 107, 396, 635, -56, 592, 522, -825, -409, 428, -110, -138, 285, 28, 795, -328, 852, 277, -276, -165, -111, 270, 242, -31, -490, 158, -189, -69, 343, 835, -41, 229, -56, -716, -320, 271, -949, 330, 340, -187, 59, 141, -390, -371, -120, 87, -55, -255, -291, 95, -121, -457, -303, 214, 66, -38, -318, -429, -431, -577, -255, 206, -8, -783, 60, 100, -507, 196, 229, -97, -40, -767, -472, 268, 131, 156, 33, 826, -296, 506, -355, -443, 777, -243, 476, 197, -752, 92, 498, -48, -1255, 249, -263, -4, 123, -90, -15, 644, -246, 252, 59, 70, -280, 32, 271, -161, 182, 87, 44, 540, 624, -610, 290, 277, 270, -573, 310, -162, 324, 167, -114, 961, -260, -451, -48, -258, -720, -20, 500, 395, 618, -420, 489, 813, -157, 728, -225, -774, 3, -360, -107]
2798a07j14M76m23p88R11j45P4j58J027j411O2J041n65k85O10o20L66P4m6O54
2818F33j342J109p47L87k32K90J18L09m81K7l27M0n33R36K07p01L33L08j26l65
2838a57J38j71P89j150Q18n00m0J034k10q34o0P30o70L93n30K22K0k35R81o95
2858a27M92m09k66O37p0l9J55n23L65k59l15Q60j145M08O1R4P14r62M22J77m65
2879a95j2O12j48n74M36m63K04j42L57R7O1R8q83O66M28m90N16m16k99N91r63
2900e19l96Q57M46K1m09j66m54Q14K3K67k0n56L45j67k20j23M15o8j79J08K83
2921C02j53L12Q8j096P1P59q40O76m11K36k19L84o35P21P3m36J36J10l43Q34o78
2942a09J69o83L21O30O27j476M89N4k71J18L7J18j83j5O1J54k15L78J20k58k80
$$ y = [-107, -221, 255, -168, -956, -45, -190, -116, -274, 753, -658, -596, 445, -120, -405, 205, -415, -49, 25, -21, 633, -709, 400, -347, 40, -192, 98, 216, 525, 44, 71, -256, -216, -749, 187, 394, -307, 26, 334, 208, -157, -19, -190, 599, -551, 267, -233, -273, 761, 551, -283, -343, 387, -283, 110, -420, -198, -178, -413, 568, -127, 365, -44, -310, 327, 257, 218, 373, -150, 215, -44, -359, 501, -644, -236, -175, -81, 633, -329, 93, 270, -195, -207, 405, 257, -317, 119, -344, -140, -282, 75, 172, 233, 331, -552, 114, 542, 52, 568, 152, -147, 444, -519, -915, -58, 388, 409, 0, -166, -620, 194, 217, 484, 464, -92, 253, 86, -134, -257, 158, 90, -89, 19, 302, 149, 461, 549, -547, -476, 283, -557, 119, -292, -56, -275, 109, -526, 195, 268, -168, -32, 78, -265, 569, -109, 60, -623, -302, 328, 955, -521, -32, 22, -249, -131, -94, 24, -159, -174, -113, 41, -174, 204, 324, 66, -214]
2963b14m22N36P03j097r0N67j47P7P55j575N11J542q08m35N92o64L96k3j111J468
2983E61m41M0K72m78L30J65Mp25M3Q86n98j7N42n55m7n79K28m00M42R58j077J088
3005F42j106K13M24r54N94l91N51M93o09J32k62N21o51M47m09J338j604N62K52
3024A83o47L50k10M78k5q29L40M04k75L82p04K60L03Q07o58L36o64j9k8J1Q57
3045F52n83l01J45k20J444j377N01k20j52o8l91L75Q14j011L78O26q66J084j9
3064H11j107J02L04N62K25q76l13L82q30Q77j00M5J22n53R21n27%q3L19M5l59
3085c3K2p25L09J53M69r79N00N04J30o02J64p3P3L83J05l24n32k43L26Q69k99
3106A97o26P62j95j13M67j397J495k08J82j023N71J15J63N65j74q25n73M07l24
$$ y = [-214, -636, -100, 603, -494, -584, -17, -164, -87, 668, -907, -396, 1146, 338, -97, 495, -169, 227, 204, -907, 561, 120, 160, 432, -46, 284, 449, 453, -272, -229, 657, 59, 42, 584, 29, -18, -597, -369, -769, -327, 631, -446, 642, -464, -251, 173, -781, -187, -578, -27, 466, -143, -11, -273, 248, -403, 44, -365, 973, -631, -69, 183, -464, -114, -324, 154, 129, -700, -360, 44, -231, 151, -553, -293, 10, 817, 159, 495, -169, -188, -216, -205, 652, 69, -232, -87, -307, 1137, -240, 261, 41, -111, -179, -570, -195, 619, -392, -14, 612, -254, 830, 811, -296, -194, 110, 672, 897, 21, -292, 90, -740, 137, 37, 82, 204, -349, 572, 45, 45, -38, 281, 326, -33, -11, -736, -427, -274, 195, -784, -284, 220, 350, -252, -88, -161, -88, 295, 400, 76, -456, -699, -373, 496, 197, -429, 333, 138, 25, 492, -905, 590, 382, 564, -459, 112, 227, 390, 955, 781, -44, -617, -210, -534]
3125e34M62J92j97j74J36m88N21m89J004k53k2L24R3j138O25R4N71j172R20k95
3145A80l49j0Q0n80J58P5J174m36o74O80q14m70J699o13m36L45p40J62J3M85M85
3166D14j178J279J16k6j068N14M3m84K76k24K39NN88l63l27M80m80Ml5j78J08
3187b97Q14o50Q80q99n3K7J88N27j319J229n89n19Q02m26k72K87q3M05L15m40
3207g3Q0m62j76N20O04q8p41O06o76O05J91k68N5l82J21o59R73r23J58J056q65
3228c44L99K57m6k50M73n14k21j14J8m7O82l67k88J64N7L18o1j33J34j87j65N65
3250C30j04q15j55N56O61o38P19j34m88M98o26L76o29O78Q1o17L10J36K22L01
3270F62p96L71k50o9j87Q82p65P3j0j40j0N19k78P69j096J053j26j211O16q3J94
$$ y = [-534, -72, 120, -77, -251, -115, -603, -82, -571, 433, 180, 158, 482, 575, -563, 62, 156, 727, -445, 475, 180, -169, -179, -99, -679, -521, -446, 728, 292, -382, 298, -516, -986, 713, 100, -336, 9, -731, -569, -556, -71, 414, -764, 515, 631, 605, -463, 51, 94, -390, -114, -338, -99, -94, 494, 131, -196, 284, -196, -192, -227, -405, -297, 517, -133, 747, -152, -205, -178, 10, 537, -782, 447, -142, -661, 141, -285, -557, -270, -353, 52, 367, -73, 7, -455, -631, -111, 493, 405, -336, 270, -406, 199, 390, 122, 177, -205, -84, -743, 230, -693, -535, 521, -344, 55, 312, 266, 16, 489, -25, -246, -360, -342, -389, 293, -74, -362, -198, -141, 177, 116, -17, 117, -70, -235, 330, 226, -589, -744, -188, 473, -165, 554, 420, -68, 430, -196, 180, -449, 229, 310, -307, 3, 139, 361, 662, -134, 237, -13, -82, -269, 613, -152, -79, -89, -229, -239, 280, 2, 771, -325, 728, 602, -609, 7, -76, 118]
3291A18o83J159j035L49l81Q40r94P10J52r69O5k83R00M2k87K33L02o42Q09p88
3311c83L18J74o01J49j64P66M23k91J76J20M5q44o7K71l06k23J301p64J81j57
3331A24J03r0k93m5N85n71L48m54J30L6M10J67l31n54N14k48P4L14l94P35l45
3352B15o2q76Q35L92k68J58o8L5j17j82k7N7m30J057r75O95k25m78K37K52L31
3373E56n03J95n69M07q15Q28o95J62N39M34o27N98q43P01L66n22M91j140R15l25
3393A53j52k89P2J62k97k92P32K76k44n11MK14K46p2k4J86j076Q12M25k95K58
3414B88k55J58q61N42L30O93j072K79N85r73N28q55J189J95m57L49j653Q51K17
3433G8l2k24N66k7l55K03n06L96k59L58Kn71Q58q13N65l78l30O88m82O13p27Q77
$$ y = [118, -565, 594, -441, -92, -473, 367, -627, 83, 235, -734, -669, -952, -52, -10, -297, -64, 238, -404, 405, -383, -65, 109, -492, -343, -507, 259, 682, 391, 567, 687, 732, -112, -179, 92, -214, -437, 864, 100, 281, 124, 227, 137, -156, -201, 384, -187, 161, -293, -163, -127, 283, 450, 119, -435, 79, -169, -95, 219, -175, 560, 215, 153, -723, 112, 504, 236, 394, 326, 361, 244, 62, 35, 92, -338, 719, -256, 439, 214, -264, -27, 225, 556, 53, 248, -321, 86, -729, 99, -596, -434, 105, 539, -88, 510, -333, 368, 734, 212, 703, -437, 478, 153, 1, -288, -216, -54, -351, -643, 89, 365, 121, -390, -386, -172, 74, 2, -22, 164, -912, -100, 325, 30, 288, 33, 191, -670, -128, 202, 895, -177, 102, 687, -286, 242, -613, 576, 771, 314, 663, -990, -139, 78, 46, -178, 388, 361, 6, 209, -297, 99, -160, 198, 200, -371, 487, -326, 239, -139, -469, 219, -263, 350, -377, 500]
3455E00o94J08N32j98R7n18P0L41k38J13k67J39N4m10Q6k82Q95n88j054R79Q66
3476E31J23r86Q19m44O44o42l40M08q28R04l79L00o18J0O04l05P13M92j716Q28
3496A18j29l57N71l02N09j95J51j64J4n2J77J48k71q4j87n67j14J240q06k93L27
3517b66O34o07O55n58K87j70L74j096J573p46j2o6L97N73j011j5n79N97M24p7
3537C11k64k31L61k17N90l4n83m0o27R46L7o69K40M72p12O8m96J544n64L06j73
3558B65j111J027k58M1L55j15l06O23l40L42j94m34k25K03P7M20l63Q4k63k60
3578d32m5L96L57j06O55k44p66J01K19l99l74M91P47q68O26p88J048J2o27P10
3598G13k19m93M00J8r0p83M92M22m11k21M17j033R67J69q55L81K95k59M3l73k2
$$ y = [500, -194, -86, 446, 248, 345, -173, -103, 238, 0, 113, -154, -15, 39, -371, -285, -567, 328, -260, -1314, -335, 531, 654, -332, 487, 43, 687, 45, -295, 113, -715, 189, -190, 110, -508, -498, 106, -199, 514, 1006, -710, 118, -11, -368, 203, -99, 410, 215, 366, 202, 216, 164, 341, 489, 218, 134, -53, -620, -734, 506, -300, -593, -266, 368, -239, 416, -142, 145, -25, 349, -747, 826, 80, 68, 2, 399, 972, -39, -54, -633, -36, 388, 311, 47, -184, 177, -40, 550, 516, -67, -107, -734, 212, 249, -420, -180, 292, -420, -352, -848, 696, 132, 438, 265, -846, 181, -77, -36, 319, 204, -102, 521, 181, 523, 329, -105, -330, -127, -50, 370, 7, 91, -172, -432, -477, -81, 276, 170, 825, 581, -185, -84, 135, -264, -638, -147, 600, -268, 358, -430, 618, 630, 3, 713, 494, 1, 401, 419, 329, -454, 38, 460, 49, -172, 245, -788, 179, 348, -507, -126, 169, -90, -47, -420, -442]
3619d42M11Q6L8K91n12M39P53j180J62K76J22N9q46O58j69l48l99Q45j061Q51
3639C4N09n48J89m04r9K91M1Q75q11O2o81J446j3j687L14J322o67n27O44l17J65
3660A38k94M84l56Ok86K28k23L15k7N11J3o28l93L78l72J614j428J67R43r59j5
3681a84l42N32K63L71l85l00K73q63J033r42N78l10L18M30r5L05l91J64p48M84
3701A91Q25j901P87n41R36k98O6J96m99j15M57p14P8N14k15M15k35K89L6Jj85
3722H8R66r77m27q69J141K75j06M19p16M74k6n27O65o11L63J14n92K55K61k32
3742f2L57k75P5J73J60M40j582J74K08M59K00j28N1j40l32P59j036O39r99J448
3762E89n71ql60L83K96q40Q17l29R6n24m1O50K6m83L95N21o47K04o04M98j61k25
$$ y = [-442, -31, 55, 93, 384, -128, 311, 1064, -116, 46, 322, 444, 503, -343, 315, 146, -202, -601, 244, -817, 34, 543, -5, 184, -220, -319, -28, 13, 888, 77, 139, -542, 904, 891, -796, -482, 840, 173, -354, 290, -27, 138, -156, 328, -28, -22, -308, -80, -303, 12, -15, 496, 509, -119, -512, -134, -506, 1108, -320, -153, 790, -169, -184, -526, 6, 269, 640, 255, -45, 228, -635, 398, -544, 34, -276, 42, 472, 377, 682, 291, 455, -293, 191, 1016, -885, -98, -639, 297, -1, 65, 261, -238, -353, 104, -610, -532, -18, -233, 182, -53, 236, 272, 273, 88, 1054, 77, -350, -1219, -78, 197, 91, 510, -206, 268, 242, -285, 380, -231, 132, 246, -346, -91, 170, -62, 295, 20, 95, 268, 428, 868, -714, -540, -332, 127, 327, 199, 250, 110, -222, 537, -499, 140, -859, 589, 18, 10, -350, 33, 329, -511, 306, -23, 73, -451, -492, 158, 184, -299, 96, 617, -30, 174, -430, 68, -93, -318]
3784c18m40J266q05n27Q99K9m61Q00q35l24P19j49p9k21k09O29N13o11m01L50
3804a75J06m72N60J20q3K42l44J56M0n32J63K2M58m13N75n31n68P23m48P05R9
3825D03o68K84r4O7R23o63m48l51M29O36m93j329J014K81j56M76k32p52L85L4
3845b54K99P8n24L39k6M2J125k181M95J16Q63R6o27O23l81M44k71l24k0R9%j94
3867a83N02J84k98j20k81q3K59l15Q89n39n0L13n81j85j38Q64o00k00l32N0J073
3888B29L2M14j332L42K93l72p62J227j53J40k49m53J145n37k98M79m37K01L44
3907B53R51j256k11j85N36J61p94R72l8k81P81k87r20Q28m26Q57n21m50r7l94
3927e21Q83J18k19l98J60j44j60L77OP34j079J69o54O49M48o00J55j93P00k45
$$ y = [-318, -758, 508, -297, -824, 75, 104, -357, 443, -392, -716, 3, -146, -225, -446, -655, -26, 487, -124, -525, -175, -69, -541, 19, 139, 56, 298, -46, 110, 150, -382, -219, -197, 261, -152, 423, -108, -676, 47, -401, 304, 403, -265, 19, -75, -8, 915, 252, -196, -547, -118, 518, 25, -1304, -290, -9, -165, 311, 79, -673, -288, -254, 45, 123, -401, -62, -88, -46, 1079, -1102, -607, -491, 372, 468, -159, 464, 83, 527, 256, -68, -88, 11, 11, -183, 319, 503, 205, 85, -196, -279, -20, -335, 554, 15, -35, 278, -303, -488, -626, 238, -362, -562, -894, -844, 229, 261, 675, -657, -315, -22, -394, -1156, 71, -82, 58, -191, -644, 501, -36, -334, 145, -292, -91, 253, 1204, -52, -263, -448, 88, 249, -545, 427, 389, 108, 889, 602, -318, 510, 84, 941, 420, -30, -127, -521, 362, 480, 261, -137, 23, -121, -281, 96, 102, 836, -243, -74, -728, -79, 369, -231, -76, -269, 431, 186]
3947A86j157J168l59M10p86JL09l07O47r9n6k24M90o5j6j60J39l33l04J97O75
3968C56l80O7J10k86nK34l08J55K46o90m6R2j00L70K19K3M59p07k34J95o19J092
3990B43N8p36l40O82K91p61Q03n52k74K70K94m9M65p07l0P01M7j70L29l55p73
4011e64J077O7o65j42J60M43J90q23K72J06P98j287l0K57L49k17J33J31n24o1
4031c30L0J24M21o4R3r7n18J023j102P9N20K9J36o54N49jj52p0k4O2m34J024j311
4054f67Q29p2M37q15P48nj015Q41L37o30j49M50m1L28q91l88N01N06o96O83j4
4075B77m71K22l38K74R00r30J063l86q71J94m47L69L08q98J447j077P71j68r34
4094f95o80J441m16P36j122J301l45n17J75j65O7M00m09P1r4k00J075m02j049
$$ y = [186, -971, 197, -162, 248, -538, -537, -228, -535, 112, 13, -43, -267, 223, 158, 142, -18, 121, -212, -516, -319, 356, -24, 43, 153, -133, -138, 96, -212, -57, 189, -501, -547, -455, -555, -185, 34, 57, 516, -191, -425, -230, -849, 243, 301, -435, -775, -93, 198, -563, 240, -312, -586, -316, -22, -71, 394, -313, -343, 358, 405, 235, 564, 209, -564, 513, 580, -85, -227, -67, 376, 566, -257, 15, 121, 919, -368, -398, -141, 208, -9, 124, 255, -269, -330, -300, -176, 245, 181, 274, 177, -341, 682, -420, -341, 179, 208, 344, -310, 239, 238, 86, 16, -8, 54, -380, 644, -667, 162, 90, 527, -288, 460, 455, -560, 281, 618, -12, -161, 289, 248, 576, -315, -703, -202, 304, -392, 291, 277, -194, 28, -310, -36, 864, -66, 997, 611, -260, -66, -513, -144, 164, -734, 713, -364, 407, 239, -695, -1375, 66, -350, 386, -736, 565, 220, -297, -122, -287, -220, 180, -229, -158, -252, -452, 623, 221, -828]
4113h28K12j97R23l8j29Q32j344J246r45N68p67N74l4K21n60K69K09l00M61q5
4133B88l97K8P74r88r1P14l8m87k0k07K89k52P94j26j59O92k17p91Q78q01OK01
4155I0N67l55r63N47K9m03K49L28k35m6J6J153l05p42j9K45K19r0O89j296k57
4176e79N07O88m01p40Q00j65J76m17L0O40j511P77O8m08L57N26r80J003j87r3
4196I1J58j76N21k2p42m0N77l44L85l33n8J75m89N66K49k21o33%O96m93J39K01
4218B07L89k57j9l59l04M50j65O09p16q2K2N58K72r9n37r33J180o51J36P45o51
4239b05P7P5L75m81R7M39j044n9J251o42k33l94K30O26k17q93P94N67L53j341
4259f25N04r9K38k26j91Q02r78J183p98M91j70p29K05L05N60q41Q98K81m73n87
$$ y = [-828, -616, -813, 110, 72, -57, 775, -569, 677, -268, 300, -467, 107, 73, 294, -266, 3, 212, -88, 373, 288, -109, -81, 693, -295, -386, 328, 290, -197, -217, -424, -135, -387, 407, 281, 122, 814, 597, -194, 684, -117, -111, 90, 657, 302, -661, -114, -85, -488, -239, 89, -146, -192, -176, 977, 672, -70, -89, 156, 375, 285, 974, -322, -579, -72, 616, 215, -525, 275, 110, 286, -131, -101, 539, -972, -195, -127, -535, -178, 348, -632, 371, 184, 91, 249, 73, 594, 572, -170, -210, 367, 23, 408, 75, 17, 192, -297, 269, 518, 297, -336, -336, 360, -133, 6, 207, 596, 339, 320, -39, -343, 107, -58, 551, -165, -247, -225, 333, 605, 506, -31, -964, 216, -435, -299, 446, -205, -128, -53, 322, -159, -62, 377, -667, -726, 525, -117, -350, -744, -514, 112, -105, -998, -204, 363, 716, -625, -121, -220, 18, -208, -399, 403, -575, 608, -190, 301, 131, -598, -393, -88, 472, -369, 529, 810, 337, -250]
4279b50K82mk72l62L47J13M81Q3q13Q45m78M33n16J313j491L69jJ01m64O90n70
4300a64N1N78rj76m19O04j20k12j68J67r80J379p60J43J75l35J023o09J24l15
4320b3K93q44N99n7M60L21m98l29J64Q1o55R94m20m36j23O7J96o5ml07Q6O85n7
4343A28k5n63J28n07N32Q76p6n68K65p06Q65q19O49M02J15j388O48k12j69M55
4363C0R8R19o62Oq49l02Q65R9j70m00L01N9m24R74m54n62j38J112J39j251J020
4384D10n49n40Q07K04p9p73J351j686M98K59k54J84P45o54k4J74m86M22J95j4
4404A90L75n84q66J889o75o31P94p58l65J214m23m83P56r29M44JJ19J49J58l19
4424E6M4K49o75k67M39Q22o09k23j40N41l12Q8L9N71p19r7N87o47J0K82n49O9
$$ y = [-250, 32, 28, -244, -606, -259, -146, 335, 418, -395, 450, -28, 405, -111, 1202, -289, 80, 79, 180, -284, 406, -164, -113, 465, 456, 280, -139, 465, 345, 133, -35, 132, -848, 531, -229, -86, 89, -246, 777, 168, 292, -23, 270, -574, 25, -32, 428, 749, 251, -78, 86, 167, -488, 506, 86, -350, -473, -406, -210, -275, -279, -586, -500, 185, 128, 103, -460, -332, -839, -307, 569, 493, -75, 190, -516, 349, -470, 179, 581, 696, -692, -44, -256, -425, 30, 128, 1047, 385, 391, -458, -760, 105, 204, 34, -366, -65, -6, -430, 544, 90, -472, -610, 502, 641, -610, 410, -139, -679, 128, 332, 253, -520, 831, -855, -357, -98, -352, -168, 577, -77, -101, 73, -413, 9, 204, 190, 565, -19, -885, 1004, 329, -302, 492, -266, -631, 583, 160, -323, 433, -496, -52, -51, 68, 217, 375, 56, 100, 349, -326, -593, -154, 668, 59, -164, -304, 237, -75, 13, 52, 623, -96, -193, 394, -253, -243, 39, -510, -441]
4446d41j72O33L41o83J35L52Q7j03q20O84n56N04k22O82o40P89m90n5O5M5j27
4467HL63k56J55j79l25M01n27K17N22r49R14q80K80m67O86l96R57o73l9J43j31
4488a76M83L52o3l24P21r00q1m23K19P99m28j96j64J7j51P35l97O0PL70k91k76
4510a07J22L93r8o0M18p60l13J98M61K95j87j05p46O91n43K43L31j044J439r67
4530c39m16R86k70j25Q55n72J85M15r39M81n54R6K66L49m82P8k19M1M03J4K51
4551E04mj396J170k4j92l51m15O7R47m76K57N0M0q6j297P97J33O79r0r31oQ73
4573B49J29K5k44m5l8J27l64o13O43O93k9l0k71q66J247J6j050J047n90K57J99
4594D92j74P18q98m39O16n30K30j69J29J05j073N23K78O05J10k48K52l04l20N09
$$ y = [-441, -613, 20, 361, -322, -187, 165, 252, 149, -671, 13, -543, -39, -261, 421, -219, 570, 80, 25, 90, 135, 8, 371, 115, 270, 91, -234, 167, -360, -143, 379, -570, 344, -536, -256, -723, -37, -433, 524, -149, -188, -45, -176, 307, 659, 596, 272, 993, 93, 12, -411, -192, 607, 179, -17, -181, -164, -315, 420, 23, 83, 90, 460, 169, -107, 15, 408, 310, 250, 668, -92, -405, -207, 254, 549, 362, 257, -489, 202, -341, -98, 233, -811, 628, -339, -755, 231, -39, -164, 691, 119, 304, 719, -220, 261, -293, -197, 69, 418, -64, 14, -205, -164, 239, 253, 504, 500, -896, 274, 250, 58, -293, -708, -641, 306, -170, 87, 137, 177, 91, -1206, -409, -276, 403, 313, -618, -624, 249, 378, 403, 159, 114, 76, 203, -161, -774, -131, 562, 533, 503, 232, -634, 613, 629, -421, 626, 36, 293, 492, 318, 1036, 138, -301, 315, -215, 15, -154, -25, 80, -993, -470, -192, 413, 523, 275, 527, 223, -97, 412]
4614D12R8n57K88R5n26L98n27k43M30o41J029J50k09n06N45n12m0Q44k30J17l34
4635H1m31R00M10n16o64n30J259k97j34Q8L35l38q67O78O84p50K02M18J00l66
4655B62o71j5l84J11M64N21J92r47R38r70o3L19N54p62L47R67j154R16j392J15
4675f52J84K99O45j247O96M55n89j19J022r02L5j35J120p12q01r6J89O42j33k34
4695c33N42l9k0L74K20q63P29l70M3m36J91j70l63J0L55m2j26J31N61J27m84m55
4717d18K77l32L88p3O35q00P9Q97m94m6o7r7M60o00k54K41K7J91K22R0r43R66
4739C49P77r72m30q0O40o10K77q49J204k90O89q56QN7L85O0l30N39o45O73l67
4760B29p88L47j08J91O8J78k08q01R90L66p92O98n27m62N72j35N52n50L06n11
$$ y = [412, 510, -47, 241, 336, -190, 208, -319, -562, -132, -773, 256, 406, 197, -309, 236, -276, -316, 528, 298, 415, 81, -350, 550, 960, 444, -220, -750, 509, 212, 78, 166, 501, 163, -704, -26, 658, -92, 110, 528, 628, 262, -409, -424, -808, -697, -233, 288, 480, -467, 471, -499, -562, -243, 311, -451, -104, 863, -291, 625, -767, -652, -468, -169, 476, -771, -75, 380, -209, -328, 694, -208, -173, -308, 812, 100, -701, -797, -608, 34, -99, -333, 209, 170, 150, 524, 744, -119, 610, 240, 283, -153, 38, -132, -495, -485, -130, -172, -298, -167, 394, 521, 37, -418, -141, -473, -85, -158, 477, -323, -244, 653, 159, 113, 46, -51, 409, -191, -445, -204, -177, 14, 236, 326, -617, 349, 1126, 154, -276, -356, 284, -326, -49, -898, 306, 16, 705, -151, -143, -86, 299, 359, 29, 568, -77, 596, 229, -559, -212, -320, -129, -61, 117, -91, -892, 98, 464, -328, 370, -157, -619, -47, -182, 370, -180, 126, -385]
4780c85J262j636J178l40j15l96N72n61R18o5j78l91k60o54J563l25J8l3K2n11
4800c17j52J122p09L33n15M6N52l76P36k00K48p76K89J24o16L6N27o1j39N24n18
4821A58j251O27L94N4O93r94K46j15K63n23Ko9K83o9o6R90k86m68J72J98p54O39
4843A24q31J377q80M13j19N52m72k54n83K62K56L05j40j147L75N47K23K93q46
4862e45K74L53O02l61m18P71q08j60P75r14l33R52o1J80k27p28J57M92k08r2r6
4883c95K76j57l46J036n69j005J198J59J13r7mk19J30k01m84K51J57j35J33K21
4903F2%J6Q52l96q88M02K12j63m30K85M27o16L0N70j25o3Q7l48K16M06o69J43
4925A0K20K42n68L12N2p31j61J463j460R55N69j104K90J71J1j82J51J41o37l2
$$ y = [-385, 877, -759, 419, 79, -36, -432, 140, -421, 497, 432, 254, -137, -397, -1051, 512, 187, 205, 172, 194, -317, -469, 653, -56, 277, -238, -192, 360, -16, 720, 520, 768, -8, 281, 405, -211, -175, 352, 291, 152, 676, 158, -1093, -466, -72, -18, 675, -319, -73, -188, 75, -448, -446, -515, -232, -301, -367, 623, 337, -131, 41, 239, -515, 124, -707, 670, -210, 203, 84, 636, 164, -90, -673, -411, -155, 150, 10, -1137, -762, -215, 8, 301, -545, -271, 82, 684, 323, -95, 676, -132, -292, 483, -431, -764, 188, 127, 307, 80, -648, -491, 1, -207, -299, -395, -119, -276, -622, 414, -155, -1160, 38, 197, 310, 213, 209, -10, 120, -81, -565, -314, -157, -292, -159, 62, 62, 78, 930, 534, -354, 48, 260, 97, -333, -48, 379, -237, -207, 363, 238, 175, 262, -86, 130, 536, -133, 10, 230, 472, -96, 216, 268, -463, -624, 839, -621, 334, 903, -201, 89, 260, 271, 89, 240, 381, -256, -288]
4945b88L66o95M14J61l78K30M24k2J53k92o86N34k34O39l30K14J85P2o51M23m22
4966a83M07N34o13k07K73j05j046J042m57m36J551j424J26R16o16k20Q14n22J27
4985c9j51m88J353q42L49p49N98Q5k75l46Q41m19n92M13%K24L28n89R88l93j99
5006I7k93M97k2m91J79o72J055K68k87L43J28j04o95o18N29N5L40Jq07k56Q18
5027F5j57qm88K86O91j003j3R62l45K50m3n14K64k47n6L92J55j38R11n64K72n63
5049A09L41j269N63L34M34j56k21l46K70j27J76P7L42j10l93O91k92R6l00j15
5069A04l18n65M96l29R07l86L76k77J21J7J63K61q30M63k1Q2q92Q38j82l50K75
5090d7N77p51K93l3N28m16q47P52pk52L15l48M82m60J92J0j89j19L00k46M76p25
$$ y = [-288, 78, -617, -203, -42, -420, -190, 234, 212, 365, 73, -613, -79, -313, 326, -4, 210, 395, 467, -184, 239, -183, 224, 758, 145, -62, 211, 106, -940, 102, -355, -791, 760, -664, -538, 378, -238, -458, 356, -166, -39, -190, -678, 675, -167, 182, -567, 31, 116, -159, -505, 336, -83, -675, -262, -262, -38, 290, -299, 689, 296, 97, -196, 301, 279, -212, -33, -705, 350, 618, 331, 674, 802, 698, 3, -615, -86, -31, 309, 310, -497, -753, 65, -92, -100, -588, -302, 389, -614, -627, 335, -10, 240, 197, -317, -53, -300, -356, 36, 191, 53, 964, 400, 672, 109, 450, -819, -256, 78, 512, 356, 135, -211, 59, -68, 108, 185, 527, 417, 24, 715, 423, 519, 219, 104, -214, -779, -283, -612, 295, -91, 285, 8, 129, 146, 309, 570, -260, 203, 182, 264, -628, 210, 28, -322, -47, 530, -221, 72, 39, 567, 151, -696, 56, 49, -203, 112, -236, 246, -214, -22, -12, -201, -320, -20, -266, 210, -515]
5112e15J68L65k94L29l01K93K6M4l62M1KQ84n59j91q8J14m69J011k13n60k61Q13
5134B77p5J64J01m45J16Q4J03n05m5J24j98R8N12j019J488j45q24J73m72Q16j103
5155g75P57K43j68L40n58Q31p05J88L79P01j075j08k58K37k4j51R4r9Jo39O91
5176i8j34k76N75p21L54K09K21j14J08ln71R73r74M56K08j09m37K67R63l01n33
5197F3m9j71p2M48m12Q50k66lj31j88l80L63k6J08O1j36l09mN73o48Q69o99R0
5220f9M81r15l35O89O9L98k81K93j13j66R4p05N83K86J50j14q83P63r6j35p48
5241g54K33N44j49M12M01j025P06m01M76j93n48K75QO57l60k96m06Q65l25k21
5261a01O40k95N17p40k00k28L91K58J09q72J92M07k30L75j38K65l73k49K36j02
$$ y = [-515, -347, 18, -276, 53, -248, 45, 71, 115, -247, -206, -204, 680, 121, -70, -158, -44, -513, 498, 285, -275, -536, 277, 202, 366, 467, 22, 138, 222, 325, -180, -225, -101, -299, -201, 311, -708, 780, 635, -189, -16, -488, 328, -775, -18, 225, 57, 397, -161, 670, -35, 153, 532, 1233, 158, 50, -208, 29, 5, -146, -52, -151, -150, -789, -98, -232, -508, 67, -654, -300, -91, 130, 16, 124, 121, -450, 523, -451, 5, 213, 104, -333, -66, 897, 596, 63, 14, -157, -229, 219, -193, 657, 391, 388, 257, 69, -311, 52, 26, 134, 195, 59, -250, -254, 319, -329, 540, -159, -69, 412, -503, -838, -149, -80, 318, 37, 330, 217, 51, 145, -560, 23, 309, 459, 345, -538, 225, 129, -6, -754, -521, 23, -126, 286, 687, -338, 368, -33, 443, 250, -298, -23, -15, 642, 282, -14, -420, 445, 120, -101, 539, 244, 761, 21, -179, -407, -16, 242, 351, -521, -329, 78, -152, 223, 85, 350, -23, -272, -36, -138]
5281a38Ql54J174p79J89K05j543J448l07M31L67j205K88n13J292r46l7k24M27
5300b17M59N27j084j51M10l5k87N3Q49r91J024n55l09N32j18K25m08QN6o78P37
5321D7j27l96N58m06P80o25oP00q30K04M66r3l39j39K38O26j014M95o73M20N49
5342D35p48N00K71o7j26J15j141J193n99L08K49q28P30k2m60j06l3K46J84J13
5362B14m68o94J214P83j892N5Q30KJ87J60kl94j95O53l70j83P64p71M78K97k16
5383D52m34K2l17R8N77j415J233m16j79N91m46M54J07L92l41qQ2n3l23r1J035
5404A020r84Q15n41p46m18K78Q47m77l11L84K03m20J191r72m6M08o30J33J63k2
5424a25k34J61N71r6j18k88J10k21P79l69j73M55m52O28p63j44n7R36o94l05N9
$$ y = [-138, -130, -484, 690, -89, 100, 305, -1238, 210, -97, 334, 701, -504, -216, -729, 563, -383, -420, -644, -217, 242, 769, -315, -466, -56, -91, -378, -325, 524, -467, 557, 2, -307, 225, 107, 332, -76, -68, -12, -690, 47, -80, -476, 82, -324, 456, -169, -175, 525, -305, -101, 365, 272, -67, -206, 32, 658, -356, 139, -534, -114, 435, -313, 187, 458, 391, 265, 380, -761, 432, -167, 141, 390, -438, 292, 270, -190, -296, -329, -83, 101, 214, -254, -948, 266, 1049, -843, -788, 42, 44, 231, 391, 389, -5, -200, 453, 83, -100, 664, -107, 371, 668, 452, 18, 40, -277, -179, 398, -1017, 216, -200, -379, 212, -234, 220, 327, 719, 378, 370, 452, 399, 76, -15, 1020, 36, 851, 310, -436, -854, -576, 271, -206, -517, -133, 70, -350, 841, -131, -177, 231, -399, -266, -103, -125, -359, -198, 373, 277, 159, -129, -19, -240, 539, 170, -3, 452, 0, 628, -135, -279, -336, 600, -94, -399, -340]
5445c40J34k96Q03l58L73r4K85j306J021p61L38l18Q57j130R85O73j046J34j73
5464b19O85o44M86j1j02J12j63L24o65K79Ok60K6M43J5m55M8n66J123N2k48m48
5486a82J075j016M87L27p83l68P1J09j62l91J173o1j75m4p6N25n13P60j030L23
5506D9P90j387J657j156l73K50p43J004o92O19o7Mr9k90K07M9M23o3j28L66o03
5527a83M2k23j79N99j97K49m41O68k81m87J171j328O53oL30m56Q13o60m39O69
5547C14l69p34M71O04n67pO84n19N0J20k71L14q04l85J641m40p36O31J52j69K90
5568B70l46Q9L60L02k01n0j62p9n39J5P01m30j60L92L48n93O83L80r39k2k12n0
5590b43j2L89m26j83N62p0o73J200m77K57l45j7M27j79P4l53P0K97j9o19P43o64
$$ y = [-340, -206, -502, 301, -57, 316, 222, 507, -799, 222, -539, -201, -519, 338, -792, 193, 866, -180, -46, -219, 466, -178, 308, 297, 195, 307, 144, 468, -197, 82, 88, -172, -146, 297, 312, -143, -95, -661, 462, 514, 266, -182, 893, -123, 364, 691, -92, -460, -389, -280, -442, -833, 340, 279, 104, 60, -16, 509, -4, 756, -274, 49, 839, -548, 1109, -47, -420, -170, -913, 91, -601, 18, -49, -45, -144, -434, -227, -178, 245, 182, 54, 420, -183, -141, -364, -543, 56, -141, 108, -333, 335, 54, -433, 738, -590, 63, 57, 387, -69, 744, 84, -355, 314, -55, -789, -318, 286, -281, -288, 396, -123, -73, 47, -224, 90, -714, -1099, 542, 102, -634, -3, 149, -20, 270, -76, 13, 373, 675, 474, 424, 262, 183, -356, -341, 360, -70, -230, 162, 510, -83, 600, 980, 41, 19, -193, -243, -255, 134, -292, -475, 87, 17, -656, 544, 67, 324, -21, -38, 389, 210, 284, -69, 1, 298, 279, -340, 403, -261]
5612b61j90k3OP22K24k97P3M12n58K23l34J71m19L46p15J40J185j66n61j89L53
5633A42n85P62j45r86Q12J28n16J08j67O40q51L58N04k42j54o46R49l41l49L93
5653a86K89j48n14P55l62K37m5M39o13k7l36M81m15M61n21Q22j215J33J255p87
5673b97m24R15j430J345q01J647j063k89Q55l8L77m82k75J81k05j17K80J55k82
5692E2N4n49M99J33K8L69r99K35O09j15j03r3l50J93M93l98n92M12M60j071N38
5713a95Q7j19m9K62Q3k27K49%o3j66m46N37k06O21n19N76n69q9J89j97m84J162
5735D37n73k5N9k35J29k3N65l04K18l84J23j76j93j39P52M12o32O18j292M64M65
5756B66nk49M78n25l92L94J79l25K68k17r5O30l25p91L79K55k89J73om9K54j94
$$ y = [-261, -451, -474, -468, 254, 478, 181, 254, 666, 108, 331, -3, 168, -251, 95, -620, -480, 705, 539, -22, -211, 142, -443, 319, 174, -812, 0, 128, -388, -280, -447, 193, -658, -300, 204, -38, -192, -838, 111, -230, -579, -186, 103, -45, -559, 196, -166, 71, 26, 465, -148, -175, -511, -30, -445, 16, -505, 317, -898, -765, 490, -297, -721, 194, -1236, 109, -692, 955, -108, -397, 458, 420, 797, 315, 40, 221, 16, -101, 179, 334, 52, 106, -443, 56, 189, 217, 586, -413, -178, 431, 316, 213, 120, -230, -37, 456, 58, -534, -122, 338, -733, -195, -108, -227, -276, -14, 69, -158, 91, 91, 28, -138, -584, -47, -253, 368, -151, 425, -144, -233, -44, -241, -725, 437, -136, -161, -102, -337, -208, -231, 334, 30, 248, -136, -13, -189, -382, -521, 231, 643, 11, 629, -663, -199, 266, 261, 12, 490, -35, -427, -33, 146, -179, 89, -128, -223, 407, 82, -709, -330, -75, -364, -191, -197, -246, 8, -186]
5778a86p32O52J48k10L29K5k22K01J60j81l14R2o74J264m26M2n15P77r66J378
5798F42j399N98O6n06M03N47m22M71J29q74K74J89L42j502Q04jR2P5k77M37k67
5819a79N08k49j94O09o48N17p9K90r55P16M7M8k78l95o0P22k86K22O0o09M53k12
5841D8L14p26j10L42N58j044R93p0k33l12M45n29O3K63l01K79o82P91J32L40l83
5862A78k65J52J26K07q44M78j8K33J56p7m40J20j39K96P8R2o74L19k1L22j79l39
5884b39J283j397J54R0O44n33p0N15l7l52K10n81O93k97M11j134Q30j13K60j88
5904A49k11j30k89J168j113L75l02M54p0p49J229r70J43R20n44J2o93P6N07o7
5924a05J56J81O52j340K49m89J256n26R0O15q12L7P39l97l93n00k32P81j53P6
$$ y = [-186, -918, -266, -118, -328, 1, 26, -196, 5, 165, -16, -330, -238, -912, 352, -74, -32, -547, 230, -736, 642, -757, -159, -93, -599, -196, 351, -71, 400, 529, -345, -71, 118, 460, -1042, -238, -239, -147, -72, -349, 88, -179, 329, 80, -114, 495, -153, 364, 285, 575, -380, 336, 383, 431, 153, -242, -302, 420, 134, 356, 416, -193, 260, 48, 362, -364, -474, -132, 426, -618, 375, 305, 72, -240, 205, -324, -261, 2, -299, -20, -702, 89, 221, 561, 178, -87, 65, 191, 398, -446, 32, 14, 247, 403, 326, -114, 6, -133, 163, 241, 333, -341, -22, -43, 279, 100, -239, 1044, -353, -199, -109, 535, 2, -68, 447, 410, 58, 268, -313, 380, 83, 494, -640, 190, 77, 337, 149, -62, -192, -481, 687, -426, -51, -353, 101, 31, -718, 511, -459, -316, 604, 60, 72, -621, -545, -38, -105, 51, 232, 884, -456, -207, -696, 560, 34, 124, 739, -73, -36, 703, 306, -87, -587, -819, -38, -191, -115]
5944a15L13J31m27k7L60q35M78n43N12P59j92J52r33j13O45J78M30j013L15k23
5964a48J17k64k15J152k01j62N5k02M3k11j42L38m42Q7L08Q51r10L07M85m67l52
5985B7m26K69l69R17p68N43O0K11n96L91J27l90k51K47J50m26M4L48lm06M03J47
6007B49j72l93Q03q26j41O46l85L73j84K00N83q43J88k53M43M2j024N19J68O59
6027F52o2l46k56k75R3P46q44M05m24l83O84k08R3O47n85N20j221J332K42j438
6047f28P34k20n98k73Q11K63o1N32m70j49N14j140L29R52o09MK32q63M74M0P84
6068F58p54N36l53o28J638p44o4k17P10l2j490J058r05R95j003l05J041J87q63
6087e35M75K00q1P35r72j57J61r9k98J274o34n60L78O10l29m7J60o86L29m38J60
$$ y = [-115, 198, 329, -98, -125, 235, -600, -122, -665, -153, 606, 414, 566, -367, -480, 165, 343, 773, -240, 75, -148, -31, -295, -510, 642, 441, 279, 334, 132, 175, -36, -178, 160, -282, -195, 113, 964, 54, 361, 846, 379, 27, -399, -130, -499, 418, -350, 193, 253, 464, -132, 259, 386, -4, -255, -8, 142, -284, -240, 108, 105, -301, 102, 249, 77, -316, 487, -339, -480, 166, -219, 154, -30, 170, 753, -90, 98, -155, 288, 330, -694, -175, -7, 652, 590, 244, -12, -287, -194, 552, -292, 113, -311, -694, -10, -218, -125, 522, -63, 457, -764, 568, 810, -628, 106, -114, -712, -985, -174, 89, 28, 560, 90, -59, 455, -685, -356, 596, -13, -9, 223, -640, -166, -126, 658, -96, 440, 87, -541, 1097, 353, 289, 72, 782, 750, -740, 318, -587, 408, -595, -900, 141, 328, -535, -60, 140, 59, 794, -178, -335, -174, -273, -571, 703, 69, -491, -113, 497, 168, 121, 281, -405, -76, -514, -354]
6108c54J59k19P18J20Q0n68O20j188R9M19l4K40p2p8k31M80ML3j168L95J60R12
6130E27j096J293j208P13n83K66k5L18J7j95K83m83N58n39O99j051P63M4K64k36
6150C29k37L57l42n44O89o76O70k24l65K47K80m63j93R39O87p72j50j68o59K28
6170c67k64J322m25MO10q65m7J02n19Q77p38K1J4J82K46P5N9R5J95p23J112j193
6192b27j22k87M69J254k58o25p06M56l48M25K67m73J56l17P91p29P60r25P97n49
6212a91O51p73N11k46J21K54p51L83M44L0r44r4O94K19J19n87J70M47k80l91J2
6233b02j30K88L67m62L83j010J183m05n33R9J605o13r07J58jJ52n78Q07l35M60
6253C26q91O49n11P56k83k49j76J52N41n61oK68q09O31J78k47k90J503j339R21
$$ y = [-354, -195, -414, 304, 424, 504, -64, 556, -632, -533, -114, -148, 92, 20, -58, -289, 191, 195, 228, -940, -545, -385, 527, -569, 724, -484, 229, -354, -88, -113, 205, 222, 27, 310, -173, 385, -154, 545, -506, 257, 301, 565, 329, 92, 449, 107, -437, 252, -424, 246, 22, -343, -96, 184, -279, -472, 467, 1154, 382, 232, 64, -595, -367, -631, 691, 266, 270, 880, 15, -32, 70, -449, 428, -310, -289, -275, -93, 153, 228, 287, 382, 577, -146, 966, -227, -349, -636, -167, 1087, 829, 204, -502, -46, -394, 31, 298, -175, -19, -336, 455, -274, 486, -439, 358, -191, 460, -313, 198, -48, 73, 327, -424, -41, 403, 433, -511, -605, 89, 308, 427, -160, 10, 457, 177, -214, -202, -332, -44, 323, -139, 244, -766, 417, 12, -521, -422, 1183, 570, -337, -179, -180, -28, -606, 201, -134, 326, -565, 84, -427, 329, 46, -203, -379, -227, 314, -247, -253, 15, -794, -163, 15, -232, -522, 981, -358, 563]
6273E63j202Q42O39j127K5N13R4l20k63k39N23J36l95K80N07j189Q00O39m67m63
6293a04L99j59o52L89O97M9m96o1K32m18Q72j158P11n03L6J73k50L99k90j52L80
6314I4n92J181n46q30J426q68k90N24M65o71q0n01O51L57r54P46Q7n80L00m97
6334e78Q32Jk24n47N44M1j75k80N16Q0n85R07m06j08R8k99Q95j011m78Q07J38
6355A68L89j045n3R46l70N0N40q94L85K02n6J6q11k25P34P07m15n67P07l2m63
6376h7l94J026l54k22L30n31N13l53m2m42L4L89j20R6J00L22N2j151J278j61q33
6397e50P45J55m95Q65o83k17l99L38M49q00J0L97n74O21k24K2K23p67R07m66M75
6418C2R4p32J297J84q81k93R42o88L24M95j068P71k61L5j84j0j8O22o18j212R06
$$ y = [563, -639, 203, 842, -285, -260, 253, 347, 27, -236, -475, 48, 184, -211, 69, 576, -613, 187, 826, 359, -104, 295, 136, -516, -127, 570, 619, 123, 62, 294, -124, 748, -410, 301, -202, -166, 7, -243, 156, -134, -286, 94, -498, 683, 137, -693, 733, -135, -425, 99, 564, -107, -187, -688, -37, 320, -634, 112, 199, -381, -81, -578, 254, 255, 31, -516, 28, 69, -106, -386, 130, 210, -375, 532, 126, 18, 116, -183, 712, -299, -777, 30, 168, 557, -488, -541, 405, 35, 85, 625, -269, 116, 318, 262, 278, -533, -758, -24, 683, 268, -299, 408, 376, -87, -481, 545, 191, -31, 299, -232, 281, -72, -114, -556, -522, -133, -253, -157, -57, 265, 317, -834, 444, 283, -550, 195, 350, -145, 720, 37, -180, -579, -241, 208, -592, -582, -185, -759, -138, -362, -340, -117, -884, 23, -443, 32, 126, -606, 691, 875, -6, -299, 643, -45, 279, 774, -294, 477, 216, 251, 67, 57, 39, 661, 43, -1169, -263]
6439b63p0O65m37j34k51J64M91l13l91L74J95m66k1L21N85M53q80K4M29l00J32
6460C07j39k49k79M8K78l78J060l70j45J24m12l49Q45j05k85L78m69j91L13n24
6480e42P52n7j84K80k97l43l56J180m28l24N93M80j64j66l16M11j034R18r96K68
6500c25N24n63K7n5L68J35l04O97Kr4n88k1R03p67P20n23L0L62N5n26k29K41n01
6523d32J87J121j296k29P42J13k00L60m76m14L79M41L4n26N52k52O17m61j11o71
6543e22m14O09K41K03N75n55n32J64r2P57l09K0M62p90R80p36L3K16r01Q69k77
6564AN91p99J68l31J202l91l59K89P58j111K67K24m24l37P5l07k59M29J6NJ029
6585G36q63k15J178l77r13M29m1L20o29J248j053l64O0P59p48l84P23k1Q52j27
$$ y = [-263, -333, 332, -105, -239, -490, -326, 165, -148, -539, -165, 30, -436, -457, -136, 449, 902, 22, 46, 475, 175, 307, 168, -81, -360, -312, -34, -412, 648, 278, 133, 257, -155, -504, 341, 236, -49, 329, -140, -331, -18, -542, 210, 153, -31, 249, -48, -391, -747, 433, 5, -319, 274, 754, 590, 424, 108, 519, -515, 403, -593, -325, 199, -364, -337, -392, -24, 111, -193, 504, 506, 412, -176, -197, 706, -61, 659, 136, 166, 528, 583, 57, -172, 69, -432, -245, 876, -420, -649, 93, 206, 6, 366, -110, -524, -145, 296, 330, -196, 356, 104, 721, 260, 149, -522, -936, -327, -86, 117, 692, 137, -395, -231, -323, 434, 125, 145, 607, -183, 797, 61, 94, 310, -591, 278, 1, 592, -207, -39, -370, 832, 441, 82, 371, 1129, 18, 285, 509, 85, -252, -177, -484, -743, -314, -298, -293, 736, -127, -342, 836, 459, -454, -25, -66, 254, -375, 873, -180, -544, -484, 275, -473, -857, -134, -155, 697, 570]
6605E70p35MN79K47n17l44N9O95m49o14N57m35K10m75M20N24n7n40M25r26P27
6626g5J00m86Q0o1J133k03l36o0N61j015O58j224P86J08p86R06j049P43L14j93
6646i9M34j72r16J009N6p57L13O15j59J97j31j129J211l36K34p91O20M22n80r77
6666i36N59n00N08Q4k63J065p87J63m65L17N68p39l11L28N14J7N17o43J26j8n09
6687d05m81N73M64r15J103k68L35m75L62j51k91r2M81n29R74q74M53n59N36L18
6707E59p85L72L35k82k38j17J7P98q92N13om55r8Q83j7k79K91r63L54j21N93l21
6729A41M85n12m02j54L34M71J11j88m86J00p3k49L50M19n38m37n5K28j35R20l35
6750eL47m80M00l11l5j35N49j41k13p2q6j4J17J60j86J55j17k8k8n12J83L6L69
$$ y = [570, -165, -161, 418, 665, 148, -196, -137, 558, 109, -505, 52, -383, -173, -648, -228, 296, 239, -301, 124, -802, -75, 25, -461, -381, -442, 691, 488, 152, 92, 653, -362, 296, -928, -142, -34, -820, 86, -963, -220, 94, -99, 335, 163, -753, 256, 312, -445, -132, 483, 324, 521, 390, -739, 472, 136, 370, -421, 199, 621, 41, -936, -377, -877, -369, -285, -548, 517, -270, -107, -572, -255, 313, -426, -737, -409, 105, 122, 639, -4, 122, 104, -405, -886, -313, 151, -764, 339, 71, 406, -69, 293, 142, -149, -241, 240, -289, 685, -189, 264, -295, 241, 559, -226, 146, 481, 199, -39, -156, -139, 659, -233, 280, 274, -181, -279, 604, 587, 308, 599, -364, -10, -131, 462, 141, 626, 114, -288, -442, -108, 363, 474, 286, -200, -100, -173, -422, -72, 347, -191, -628, -683, -455, -590, 330, -5, 342, -138, 262, -49, -84, -219, 330, 189, -24, -96, -182, -196, -79, 81, -105, 50, -67, -95, -123, -635, -452, -416, -47]
6773d7L26p4m34M81n7p47N01J25J52m93j84K65L6p4K16m10K34K29j18N20p19O94
6795D22K42j72n23n23J384r47J99j27K63O7n38O40k89L83r8P6K44l54n20L50O67
6816H46l90o90N3J90J98M95M9m38l84j01K42J60m69K81k12k25J04k87M08P99j075
6837d46L87N08J15o08M53L00p90mM70k06J08p08J209q12M14p87J088o53q0K54
6857B12o30J56Q11j527P59K75K9k1J68K31o33k7m37j51O75K69k29R15k60j304
6877g19J090L49m60l78N86o84K41J27m90L98m70M71p24J042o09L55n11L16m32
6896e02R76r64L60J17K43k35L76k58K19k05n39K42K15k42M10lo95J20J1P84k28
6917B02m10l8k04O64o66M64N09r2l9o59N15p90M58j65k62O03m29O71K37m34J4
$$ y = [-47, 279, 205, -229, 252, 195, -552, -51, 74, 226, -267, -451, -186, -150, -224, -8, -418, -184, 45, -73, 447, -272, 422, 664, 492, -31, -554, 830, -117, 82, -45, 218, 285, -253, 387, 98, 481, 383, 459, 703, 349, -171, 179, 846, 456, -234, -181, 9, 207, 702, 751, 313, -71, -172, 70, 230, -239, 42, -170, -395, -291, -578, -170, 629, -446, -59, 449, 564, -44, 409, 709, -81, -85, 385, 179, 287, -421, 788, -24, 390, -397, 691, 38, -42, 212, -418, -262, 549, -978, -219, 56, 85, 64, 232, 463, -170, -197, -634, -785, -110, 159, -70, 845, 585, -719, 371, 720, 260, -118, 468, -216, 25, 152, -338, 60, -410, 61, -663, 379, -230, 125, -386, -70, -502, 474, -490, -130, -13, 230, -5, 371, 113, 332, 127, -412, -170, 45, -197, 213, 210, -485, -365, -354, 430, 202, -208, -246, -450, 214, -452, 12, 521, 429, 390, -269, 246, -544, -86, -251, -513, 90, -339, 332, 569, 135, 149]
6938A49p55M28Q18p94K27K84r63R68l64p3J14q6M13m75k25N37q83J373m85M52
6958F60k13j211L87J59P87j028O65L41J20N9j036O03N5r77K55j86J029r68J099
6977F00q00P21k92J34m03l09j20l8J186q93Q5j1J5l01O77j30O6j12Qq66O50L61
6999B28R3k37J20l21j8K69M26j133M84J88j72L60j53J20N6j85J04p15J122m01
7019B35k17L98J22p23J51n28M32l65M41L14n50M80n84M66o08N44n79j60P50M00
7039D19q92Q04p20P05J03r56O71L88o70L03L17l6k01j1m06J89j02J20qR10n98
7060C29n60J088p24o82J26Q75p60N21o8m14j53Q32M37n11Q6l66k58J98M06n27
7080a25M99m97K48j34j93M12n56K27q3N25N98j531M28K87k14M70j134J390m72
$$ y = [149, -606, -178, 640, -154, 73, 357, -606, 362, -2, -75, 39, -47, 366, -109, -334, 203, -680, 693, 208, 660, 447, -764, -377, -218, 569, -459, 206, 547, 667, 726, -310, 293, 348, -629, -374, -560, 469, -499, 600, -200, 521, 229, 363, -40, -349, -469, -507, 679, -214, -129, -140, -125, -426, 251, 121, 187, 75, 83, -783, -133, 228, 321, 84, 204, -117, -135, 134, 560, -573, -89, 99, -73, 287, 134, 254, 310, 125, 229, -486, 636, 235, 18, 416, 538, -185, -34, -562, -130, -495, -54, 260, -290, 190, -394, 72, -536, 8, -571, -731, 19, 419, -473, 331, -389, 316, 419, -537, 134, 522, -148, 155, 472, 436, 235, 224, -182, 7, -95, 25, 17, 927, 329, -231, 857, 133, -549, -423, 452, -308, 213, 145, -269, -422, 410, 847, 336, 422, 56, -202, -4, 402, -125, 374, -123, 125, -9, -202, 210, -346, -119, -202, 323, 921, -610, -182, 105, -109, 361, -773, 617, 145]
7099A45j099J264k68m23M1J12J78M46o0j48n54k9K62RN58q01k1J035n20j401J620
7120C46p2r2l03k48J070j278J761j193k81j77M52n6P09N6o83M31m42j19J09j22
7140a32k83R78l85Qj33j36m09N56m82R36n79M88q93O64n35o3J74j18J56K62o4
7161A0m24M70M62k68k34K68P31j161j78K36J97l2l88l6J525q30n86O42r39O70
7181A35n28m47Q75n8k17L67J85m40L46m4o09L93Q7k92R26j283JP35J37k53N00
7202E16l89L00k99P6L84q99K42L17o51N73L6o22O39N3M52q92j73P09m18k64M90
7223A80j39p14N14o0l77N07p18J306j36n48Q5M03o5k34l49p7K27K39n85M17K66
7244A42o17R76m70P45j059M52p80R94m23L9J43O03q01L14k55L88p06M43K99p76
$$ y = [145, -954, 310, 42, -381, -340, -228, -50, 396, 336, 188, -366, -395, -133, -124, 434, -367, -388, 647, 127, -1274, 346, 274, 182, -121, -369, 701, -577, 1184, -9, -290, -467, -15, -71, 638, 694, 11, 442, 0, -119, -10, -132, -415, 563, 178, 186, 53, -83, -492, 64, -418, 518, -61, 427, -466, 198, -337, -400, -226, -344, -188, 74, 10, -414, 56, 518, 250, 16, 284, 1015, -146, -324, -88, 109, 77, -311, -347, 1178, 348, -238, 404, -535, 135, -393, -840, 35, -23, -240, 127, 312, -128, 218, 174, -435, -42, 45, -247, 679, -604, -603, 132, 269, 16, 516, 127, 427, 128, 204, 588, -311, -69, 248, -403, 170, 206, -416, 223, 276, 728, -164, -337, 372, -46, -310, 180, 41, -673, -159, -219, -596, -89, -807, 499, 363, -185, -100, 303, 238, 4, -345, -422, -195, 44, -541, -124, 142, -475, 501, 31, 776, -283, 169, -611, 383, -40, -1, 142, 745, -56, 258, 3, 391, -315, 128, 427, -349]
7264c49K52k15P27m40K0r7N35j16k98l87K95R15j68p84P46n38n56N64O6r3m9K13
7286B43k33K6r9l2L70o66K49N1j75M72J10j65n34R30r81N27K26k46j51N76k04
7307B94m67j69M36j064J180P9l65j62P33p15R25j000J19J64M6K73k54O5o2q23
7327g67M27Q50o14L35o14K18J68N49n91n75J259n63r44Q33O6J39K10p63l46J568
7347H45p23O93j214P37p7j77K74J8r60J23K20J206q88j26M93m13r10J51R04P27
7367I03p22J5j4m3l60m49N04J37M57m20P45r63M86J37m58K9p01J344n08r6K06
7388B29J33Q6k75K51k89O22j939J269K6q41M50J00K49J26j019J140l39J25L64
7407D68o32n79J918p19j124J082k64m8K6l62O64p00P02n14K67j27R4j4J1l96j34
$$ y = [-349, -97, -312, 415, -25, -5, -102, 433, 317, 19, -368, -73, 842, 674, -110, 636, 98, -458, 106, 172, 79, 30, 243, 10, 36, -63, -95, 275, -391, -142, -91, -266, 206, 316, 151, -383, 547, -434, 93, 319, 73, -78, 498, 294, -173, -342, 94, -970, 210, 289, -76, -238, 495, -220, 705, -295, -176, -12, 34, 307, 53, 118, 56, -767, -340, 510, -104, 231, -383, -165, 3, 552, -39, -614, 645, 82, -862, -29, 37, 176, 386, -377, -723, 845, 122, 815, -399, 338, 261, 84, 358, 376, -584, -461, -241, 965, 77, -49, 444, 31, -879, -728, 176, 903, 181, 196, 182, 139, -221, -670, -166, -29, 428, 8, 753, -210, 276, 413, -45, -16, -717, 627, 119, 23, 229, 362, 448, 173, 424, 135, 757, -1182, 87, 113, -728, -278, -178, 71, 197, -822, 318, -21, 104, 468, -164, -743, 1175, 456, -668, 414, 150, 102, 128, -234, 430, -270, 432, -82, 185, 58, 152, 138, 149, -247, -381]
7428c81M69R49o66l29r3rm1j88J26N47o18J62O11n16L2O62kn51J49n10m40R54
7450C17r44P27j25k39M03o76Q89j8j51l74L30k89j05n03P97l64M35NK57o74O89
7471C87L19q97P11j065o3J74Q07K04r58r1P02n25R83o19n7o07M18J70K94N45j135
7492c03N2Q69n19n78m29P33k11j1O1J007n4q74R05j04M42j810J020J70l19L65
7512D12r68k78M54J72n6O43j06n7O60q65K75o22k19R7R45j66K27m58n56J51K95
7533b0Q7j049Q06N76j038J144o34j16j18Q57n82J92J70q36N77N71l84j25L9L2
7553A49L60l68k63Q0MO13L34o62n37N19O02j175p8m00Q78P7o8j28K81o41Q44K18
7575F39m12j205Q15L3O39m86N22r33N5n02Q43O37n67k8L52O5j164M69K87R8n49
$$ y = [-381, 88, 1037, 371, 42, -51, -60, -101, -289, -163, 384, -234, -72, 539, 23, 55, 717, 715, 164, 313, -197, -637, 317, -627, 100, -25, -264, 139, -537, 352, 334, 183, -191, 139, -150, -255, -758, 39, -325, 110, 115, 372, -302, 387, 706, -191, 520, -545, -608, -434, 373, 577, -381, -472, 230, -295, 688, 69, 12, -595, -177, -7, 287, 832, -303, -251, 618, 99, -479, -908, -175, -386, -397, -336, 671, 617, -257, 648, 544, 986, -824, 196, 366, 47, 412, -556, -834, -380, -208, -264, 379, 273, 216, 876, 11, 286, -336, -555, -458, 487, 321, 548, 90, -466, -315, -20, 67, -982, -176, 400, -638, 506, -128, -244, -362, 495, -87, 105, 275, -561, 16, 587, 203, 78, 117, 149, 509, 141, -122, -42, -38, 575, 909, 247, -290, 229, 831, -344, -422, -822, 56, 133, 65, -63, 218, -423, 421, 639, 227, -978, -163, -130, 509, 23, 545, -388, -333, -835, 8, 645, 78, 50, 402, 467, -697, -228, 59, 157, -392]
7596c92O52l72O22J0q81N95n37O9l73L76Q54q85n02J191J32m61r5K44J2l8l70
7617a49K28K4J35K83j45p4n23n0j98m27Q83k21l19m7L25K59J00n43M21O55o72
7638e5K84m19M82o15M68K54j02j29j16n8l49R41k30j226Q41J02j61j98L21m7K64
7659B52j67N15j489J349r24P93p32O55N84j004K81kP06m29m87L96J8l42Q5M05
7679D63q08J69K79N33n43L9N48m32n14M20N20o81n03%J59J07J014j060p8J55K79
7700F6r6l31P68k59q53L83K58p17R5M12N19O37j178OL88n56O39l40J75n67O90
7721A39L35Nk2j239J53N45Q78p40J9J74J83n24P24j556J272n50M07n41l01N60
7741g9n5Q64l42Jr53P64L16J49j200K8M19J32N22l89n41R37m27l09L04J5N84r57
$$ y = [-392, 260, -112, 510, 520, -361, 234, -303, -234, -607, -231, 623, -262, -764, 427, 559, 98, 3, 247, 259, 221, -149, 79, 103, 238, 521, 376, 302, -221, -271, -469, -896, -13, -234, -553, -600, -275, -16, 84, -459, -38, 617, -55, 229, -190, 292, -323, 145, 399, 297, 168, 52, -6, -355, 586, 356, -870, -29, 73, -88, -286, 35, -12, 252, 85, 600, -889, 460, -464, 329, -403, 252, 836, -168, 113, 111, 817, 388, -99, 297, 315, -27, 58, 463, -345, -176, 103, 636, 93, 132, 680, 248, -266, 154, 674, -7, -510, -510, -351, -244, 770, -290, -368, -213, 66, -30, -361, 407, 148, -705, -322, -64, -781, -686, -274, 245, 882, -296, -290, 98, -458, 181, -159, 16, -551, 139, 474, 479, 457, -782, -629, -84, 794, 54, 73, 247, 430, -94, 630, -926, 346, -204, 203, -338, -639, -79, -134, 730, 388, 389, -564, 200, 516, 665, -535, -507, -88, 44, 566, 177, -364, 573, 146, -163, 141, 156, 740, -217]
7763b17L07L5M57m65j46J91L68m59k4l61Q3R78p09O7K53o01q2N55k75K7R35j442
7785e25K62o8R21j66L32j355M20O2L95m07L71K15r21N16l20j89N5M7L30k35j19
7806c79M34k9o14O63J25o51N90L56N07j081J97q18R39j96j26K89n38n03M17l78
7826g96P90N73m15k18K05rM60n93l15P97o99L82l04M8K42l6L69l7l45k37m03O79
7848A38K84o34P05j12M12o89K40k97J72j88k06M16j251J085m52O59m30N54J85
7867E91N5r71J47k7N07n51M22k47j46M94J07j28l33N5n6L50o26J62L74j15L70
7888D34m31J51n18L38n06K93J94n20L67P55o79L28n2k6K92k42p98R61m87M84Q3
7909D21k45K18p61j15P13J08j028M43P93L02j165L02m92R18q75P38o08Q8N41m56
$$ y = [-217, 90, 125, 582, 117, -29, 162, 530, 71, 47, -314, -231, 747, 38, 105, 358, -243, -325, 230, -45, -18, 917, -525, -263, -331, 590, 424, 756, -599, -179, -117, 278, -129, 242, 457, -464, 52, -268, -457, -402, -355, -25, -260, -379, 55, 26, -588, 75, 200, -451, 139, 495, 1002, -79, 118, -700, 239, 43, -83, 206, -332, -835, -418, -796, -6, 567, 152, -66, 139, 130, 590, -3, -318, 479, -220, 162, -142, -94, 148, 112, 481, 444, 99, -138, -541, 138, 422, -212, 493, 381, 793, 104, 344, 47, 219, 31, -175, 241, -1010, 75, -377, 282, -148, 406, 591, 646, -325, -178, -205, 302, -249, 173, -74, -220, 274, 381, 253, -80, -25, -81, 269, -357, -195, 179, 64, 434, 3, 154, -364, -26, -532, -239, -45, -565, -198, 557, -122, 206, 154, 128, 420, 178, -620, 341, -146, 338, 421, 176, 394, -367, -482, 231, 339, -689, -246, 547, 849, -316, -14, -506, 412, -463, 275, -333, -245, 296, -160]
7929a60n8K1L63K70k44J032j317K20O26q91M24l90L77m79j84R49j006N43L00n62
7949a66P56p56p6M43l86J220j393j58N63M36o10q09J286l1m55L09m85l64P91q42
7969g27Q03K70n44K68p04L61N49N36r08j22M6K60J5N33o21m75j15O44J6L66L11
7990G62l86l30K78m64J07J2r8J65M3L79r46M28l12L06M36n8o86J47j3M03q51O44
8012c4K62Q8j54J62m02j8m38M06j14J91Q1p8J42J48r19R88p18q2L67o22J665r98
8034g7L95q27R02k34p25O34n09K04N0k75L98O23o85n38L88J82k49P71k31K2n85
8055c66P35j82K25j27j19k96n08L2N32p26K98N67J107m63j060J126o30j53l55
8074c63M66L62o45j09l06J308l63k51j5l13K61M7m7k65K30l19P51q10N84l66j39
$$ y = [-160, -218, -197, 166, 436, 192, 1224, -93, 127, 753, -138, 286, -104, 273, -206, -390, 559, -447, 96, 396, -166, 590, -166, -242, 201, -185, 1035, -358, -516, 47, 483, -127, -936, 350, 319, -136, 173, -312, -676, 115, -727, 76, 346, -198, 70, -634, -273, 276, 812, -96, -218, -172, 88, 103, 636, 15, -460, -575, 69, 85, 451, 762, 376, 46, 324, -140, -33, -21, -119, 46, 89, 468, -478, -50, -362, -56, 380, 322, -364, -217, -230, 173, -678, -34, 228, 316, 162, 324, -78, -96, -534, -128, -242, -51, 30, -48, 94, 242, -677, 311, -407, -489, -122, -744, 921, -77, 318, -509, 393, 159, -566, 68, -441, -237, -187, -462, -64, 559, -126, -664, -276, -94, -343, 428, 197, 219, -366, 369, 187, 412, 285, 166, -130, -638, -606, -74, -800, -502, 65, 1172, 709, -351, 775, 145, -8, -363, 103, 465, -180, -289, -595, 713, 350, 99, 84, -229, 32, 79, 32, -233, -3, -322, 429, -381, 203, -163, -302]
8095c02M96k08N4M57n09n07RO42j09k96O90k76j42J59k51j25J87L08k55r9n19
8116e96M57P46m91l16Q05l0m57J34L22p93J86M39j49q38L23L80n52R42n03r13
8136i04Q47j54O27%n44J68l89L32L31n90k86L61L60L3n39l31j83P59L67k31P0
8157A04m60P8n8L53q3Q43o42o5L74k37Jp7l72J309j703J93N96OM1O1r71P27J13
8180A31r84N94K65J185j136J10l40l90J143n66l56
$$ y = [-302, 194, -14, 40, 497, -12, -519, -510, 132, 23, -273, 417, 141, -1, 158, -93, -218, -31, 277, 22, -77, -596, -139, 607, 116, -200, 605, 575, 118, 252, 574, -219, -33, 406, 257, -581, -258, 122, -430, 512, 9, -904, -57, -211, 416, 416, -128, 40, -349, -17, 314, -276, -562, -201, 159, 192, -347, -678, -861, -102, 265, 34, 104, -356, -278, -336, 17, -66, 777, 135, 70, 444, 207, 208, 131, -241, 1068, -635, -442, 154, 160, 201, 262, -709, 18, 131, -853, -259, 6, 1191, 55, 165, -175, -565, 578, 12, -344]
8191c44
$$ Imaginary data points
##PAGE= N=2
##DATA TABLE= (X++(I..I)), XYDATA
0@%%%%%%%%%%%%%%O4j28J28j28J28j92K56k57L21l85M49n14N80p06Q28r53J084
31E75j220J377j563J769j992K241k514K817l148L501l897M329m800N317n873O484
47C403p150P877q695R583j0552J1632j2825J4167j5669J7371j9324K1569k4209
60a2822K7352l1165L5924m2041N0249o1918P9969j11953J85982p16767k05453
71h02643R21768M40665M59074m2446l66236o71110n07737l44612L0152L24058
81e59067N84337N22057L39319k8568k97192m90500m86389l37352K949K58753M09415
92h2238M15013L07850K3917k47127l85093l60826k69348m2191K13227L63084L45980
103B82248K39738N4347j56717l15363l26320k16644m4442J32830K64176K94850
$$ y = [0, 0, 0, 0, 0, 0, 0, 0, 0, 0, 0, 0, 0, 0, 0, 64, -64, 64, -64, 64, -128, 128, -129, 192, -193, 256, -258, 322, -384, 444, -509, 575, -645, 732, -831, 938, -1054, 1187, -1327, 1490, -1658, 1843, -2054, 2275, -2525, 2792, -3081, 3403, -3747, 4130, -4565, 5018, -5534, 6098, -6727, 7440, -8229, 9142, -10182, 11387, -12822, 14530, -16635, 19289, -22752, 27497, -34421, 45548, -66405, 119577, -597190, -802643, 119125, 559790, 1018864, 976418, 610182, -60928, -568665, -913277, -883125, -559067, 25270, 547327, 886646, 858078, 560886, 70386, -416003, -753355, -750406, -491653, -82238, 332775, 640625, 664542, 417415, 32322, -328504, -597852, -640043, -426816, -63732, 282248, 521986, 576333, 419616, 104253, -222067, -438711, -483153, -350323, -86147, 208703]
113B08703K11119L1308j34371k32922k68688k08441m5448J19370K14484K36465
123A31579J94225O1791r7246j94454k10828j67154n9771P8826J80189K02926J49180
134B69263N3534o0926j59430j93533j48800n2604M9524J31118J71774J42277N1002
145B53199m3412j14604j49556j29632n4296L9443J08547J34119J20195N9578k7990
156A95591r6862j24078j06367n8052J5558Q1466J12050R5604N0183r909p0675
167H4509j02471r1675m5459Q504N9956R0792Q7698M7569n245n0814p8669p6511
179g1816m8186K420M5918O8889O8528M3840N86m1655o5121o1779m0728n555L5198
192f9461N8210N8892L6698P046k7722n1534n3618l4941m567K3451M5512M9507
$$ y = [208703, 419822, 451130, 316759, 83837, -184851, -393292, -438740, -319370, -104886, 131579, 325804, 387595, 290349, 95895, -114933, -282087, -341858, -263032, -82843, 120083, 269263, 322797, 261871, 102441, -91092, -239892, -292496, -242972, -111854, 59920, 202197, 253199, 209787, 95183, -54373, -184005, -238301, -198858, -90311, 43808, 164003, 223581, 195591, 98729, -25349, -131716, -189768, -174210, -92744, 19306, 114910, 165093, 155184, 84509, -17962, -109637, -155096, -146592, -86636, 4156, 91854, 139423, 134178, 83364, 4695, -71816, -120002, -117582, -71664, -2775, 65753, 109593, 110179, 68524, 3403, -58376, -99104, -104659, -69461, -11251, 47641, 84339, 91385, 63663, 12129, -41489, -76430, -80997, -57546, -12034, 37473]
204C7473L4110N972k1489m0218m4728l3459q105J8106L5250M0295L0089R761j5603
217D7454l2658l5658k7443r849J1490L1124L3150K6720R109r221k4999l1937k4747
230c7465r055O859K1457K7172K3777R956p212j7861k5362k3243q193M791J7031
243a7348K2188J9981J0845l452j5056j9622j8810q820N28J3201J8573J6949Q421
256B7578o66j1209j7305j5332q887J431Q455J4314J5307R229n59o793j3757j3897
270a2091q124N02P136J0470J2107Q715L98o354j0647r906q447q70L589J0367J0421
285G266O476K124m601p748j0038o795k094M806P946Q174O541J711k814p430p233
300c709o897j657K359O569O792N086K220j467o766n271n517l039L352M143O083
$$ y = [37473, 71583, 77555, 56066, 15848, -28880, -62339, -70444, -52338, -17088, 23207, 53296, 63057, 47454, 14796, -20862, -48305, -58154, -46664, -15540, 17610, 44330, 53439, 44218, 19219, -12718, -37465, -46520, -39661, -18204, 8968, 32745, 42701, 35489, 17628, -7734, -30977, -39170, -34379, -17348, 4840, 24821, 35666, 32214, 17158, -2464, -21274, -30094, -29566, -16365, 2208, 19157, 27578, 26912, 15703, -1602, -16934, -25821, -24390, -15935, -1621, 13686, 22915, 22356, 15563, 1806, -12091, -20215, -19713, -12577, -2107, 10000, 18715, 19113, 12759, 2112, -7794, -16241, -17111, -13522, -3155, 7266, 13742, 15866, 11265, 3517, -6521, -13316, -15410, -10604, -2658, 5516, 12057, 13768, 10954, 3524, -3709, -10606, -12263, -9904, -3335, 3457, 8543, 10763, 9296, 2530, -2741, -8258, -11297, -7945, -3802, 2281]
315B281M559K820j452m332m678n183j987o75M331N925L866K722j352l370l756
330b81m856j441R24J883M767L052K697r40j801l783l725j956j32K640K292L211
346B551K735k35j232l611l118k793M8K352K756K927J394R38j632k547k084k142
362c693l34Q34K058K615Q89J599j288j532k714j172j094k5K886K054J825K53n80
379B581r67k117j496q93O29P21J798Q35J276l49k64j739r69j689J34J442J634
396E67J93J304j48J81j438k452r56P20J291J133K36J143k1n47r58j066j11p68
414a697j6J448J122O97J77r01O1j783q42q14J127J418J259P10p46k45p92r30j69
433i16j97L54J62M57Q88M03p37n2j16j100m90n79N77J919J96P96r35k96Jj056
$$ y = [2281, 6840, 9660, 8208, 3876, -802, -5985, -7972, -8647, -4316, 1609, 5475, 8197, 6845, 3475, -281, -5137, -6578, -5654, -3771, 996, 4048, 6745, 5805, 4004, 221, -3504, -5460, -5592, -2952, -660, 2551, 5286, 5051, 3819, 208, -2910, -5703, -5655, -3303, -547, 2380, 3774, 4712, 3080, 533, -1551, -3693, -4027, -3193, -1135, 1480, 2369, 3968, 2680, 1148, -1566, -2738, -3832, -3857, -971, 1083, 2908, 3161, 2581, 1614, -503, -1999, -2892, -2263, -1542, 256, 1091, 2367, 2018, 1754, 15, -954, -2643, -2509, -1067, 567, 760, 2064, 1916, 2097, 659, -1793, -2749, -2029, -738, 395, 631, 1774, 1753, 1206, 248, -818, -929, -1697, -1713, -265, 857, 1554, 1731, 830, 891, -892, -1734, -2548, -1421, -3, 1256, 1966, 1220, 975, 183, -747, -916, -1113, -759, -597, -140, 748, 1151, 414, 362, 246, -854, -1344, -1923, -1346, 573, 769, 1565, 630, 334, 335, -721]
453g21O6q0K98M8J311j02k24N64l85q45m5p91p20J278R42L01k65j22m20j06o35
474f53N43j271Q52K15L99j81K96L59r32k00j02R27j419N61J273M56j349P35q81
493c72J08o91K05m58P05P32J105j495Q7J212j896M19p55k1P84J192p39J74N43
512H39r20J76j061O28q39Q19J86L56J85j04K70p09l62m36J296j146R58L87l42
531A81M33k05k46L86j720R55l20O79l94L36N08n33J226r58p73J89M12K28l74P05
551G15n64L83j04j0q37NR51r67P35m70M70Q4l82J091j846m45J087p53R74N62j464
572g85L80k7N71l46k96K22Q15j085P62j48l12Q75%j238M02k38M6Nl03P35m37J244
594H42m59k88j06n29J36o8O96r5N1L95K89p84K9l07j53l72N77M82J37k92n20K51
$$ y = [-721, -655, -735, -437, -389, 922, 820, 596, 1160, 775, -70, -115, -906, -1626, -348, 594, 895, 630, 508, 88, -18, -653, -110, -1381, -529, -314, 85, -96, 200, 559, -373, -573, -675, 252, -1167, -606, 667, 1123, -226, 509, -372, -264, -955, -750, -1208, -503, 229, 1334, -161, -74, 1138, -758, -339, -1094, -1115, -331, 861, 122, 296, 839, -81, 95, -966, -338, -1177, -358, -172, 184, 369, 265, 535, -174, -536, -972, 324, -822, 136, 523, 181, 614, 409, 163, 549, -1171, -216, -536, 143, -251, 85, 593, 60, 1286, 328, -445, -256, 156, 384, 10, 715, 151, 534, 430, 420, -417, -412, 539, -428, 307, -163, 307, 391, 9, 1100, -746, -1191, -104, -857, 117, 679, -785, -405, -432, 139, -207, -503, -281, 534, -551, 211, 63, -249, 626, 626, -612, -210, -448, -402, -397, -700, 35, -402, 842, 383, 95, -11, -540, -404, -472, 224, 129, 180, 575, 864, 80, 109, -198, -351, -723, -146, 336, 473, 181, -339, -88]
616h8n39J79Q89j046R48Q40j531M74j91O23o00j2l93J11Q44r13K97L61j8l80j41
637b86l23O03J51j28k89L30j82K25M56j70P32j219M47k81k78k96nQ45j88k38j27
658b21K68K36k34M00k99j33k26K94P5j56o49O52N24l89k7j48j28K46n02Q49q80
679d48L38m21L80M5N93l41R3q9K67J76l7j58l70J31l21n89O14L41n40N59l73j13
701b63l75Q12m66N06k04o12M78k83J36K74O02p21J64m33O90l50k81o37J623j030
721c70M9M83l55J306j111N79o47jL53K05J94r79nJ532j001o7J46p53J88O27n76
742b03K37o5j84P3j53k49J048r26M19R05l02q10j03m5q0M77k88j08P34o7r95L63
764c22J7R8N7j0r0J72N6J19K84p3M8r24l9L37q8l2K14J335q27J31o92k12P67J46
$$ y = [-88, -627, -448, 441, -605, 343, 1183, -348, 126, -65, 558, -42, -54, -447, -336, 508, -405, -108, 253, 235, -145, -286, -609, -6, 145, 17, -272, 58, -124, 101, 557, 387, 1119, -100, 347, 66, -212, -508, -513, 332, 144, -94, -221, 47, 283, 49, 449, 150, 17, -209, 85, 160, 4, -645, 7, 531, 142, 115, -33, -161, 85, -417, 432, -448, -110, -531, -151, -106, 487, 146, 239, 150, 417, 593, 556, 398, 28, 159, -162, -751, -137, 204, -336, 223, -150, -263, -638, 174, -292, 214, 10, -602, -124, -407, -271, 3, 605, -116, 48, -385, 305, -45, -326, -963, 660, -370, -321, 162, -193, 1113, 2, 581, -66, -67, 286, 491, 685, -294, -299, 1233, 232, 165, 311, -442, -254, 373, -203, 34, -31, -215, -142, -295, -544, 504, -422, -3, 902, 600, -210, -313, -358, -438, 39, -249, -357, 377, 310, -685, -322, -305, -207, -150, -160, -250, -78, -22, 97, 381, 308, 356, -568, -607, -270, -358, -390, -176, 1159, 332, 463, -229, -441, 326, 472]
788D72m74O87r23M66q72N20L23p98K66P4l4N98j051Q83r18Q84M67n50l52k06O46
809A08M75M70j318J322q65K27k68m42k22N16J45p72q2K11N14L73M5k60p11J032
829D98m28k83NJ57K18o50J05N22P37p78L64L29o84J0N59m95l65L87K53o60J1J2
851a76r90R45K76J81k42j4k95l9Q02K43r64N20K92R3l43J60l89m90q9j85J32P24
873A52r8K85n52L62M11m84L33q26J172j060N69N57j061P29n02k82N76o74L10q5
893a68m62N63M78J57q09j81P86r0m02k3Q6L21R00r05l79J09P01q07J83M59k04
914C13j102J518p43O08p23P4j27N53j72p48L46Q17r97J98K19k85L69n70j53O30
934B5j91l33N42O5l23q4P00q72R03n12J80L17j68m51N5J80K7J86k58L44p67P36
$$ y = [472, -2, 685, -238, 228, -644, -124, 199, -599, -333, -259, -293, 305, -746, 137, -781, 103, 570, 20, -332, -538, 108, 583, 1053, -265, 1057, 192, 419, 151, -291, -513, 3, 148, -624, -706, -495, 19, 392, 437, 177, -534, 498, 70, -213, -208, -51, 167, -483, -378, 144, 881, 103, 467, 796, 112, 122, 681, 186, -179, 208, 461, -199, -188, -176, -1166, -221, 55, 236, -6, -20, -315, -354, 448, 691, -273, 247, 539, 632, 289, 449, 60, -430, -519, -704, -572, 152, 54, 339, -213, 149, 560, 76, 409, -417, 755, -305, 264, 821, -240, 489, -13, -295, 281, -393, -83, -168, -630, -67, 411, 568, -241, -422, 364, 274, -128, -151, -65, 256, 1156, 251, -128, -19, 682, -125, 58, 517, 313, -789, 729, -14, 594, -129, -55, -182, 371, 199, -549, -203, 614, -383, -185, 34, -251, 118, -452, -605, 25, -166, -499, 43, 108, -215, -299, 401, -471, 432, -80, 100, 417, 249, -202, -147, 33, 60, 246, -12, 332, -435, 301]
956C01n39N23j5m58L1L85o0j030J260l62M4N87j226L92j55K91j78l78P67k0PO98
978H65r14P99k42l58J62l37N18n39N03n37j04L90l1J84j18K29q50o10J198l29
998a21L38K99K67j034l39O32m35M42O26q45n18O04N74K30l90o59M07O71m04N30
1018H75n81L79n97q63mN97m35Q60K43j084K52j86P09m34O49l7m2o7l75K63j73
1039e1m73n6M2M41Q17n27m68l19Q85P02k08j258j2J99M4mJ85Q86l89l80n08L87
1061f5j5N3M50k14m60O36k76K11L63j115P76n47K99N84N5n26J5j5o5M72rp6n74
1084d3j02J16j74Q45r77P31k03L27n36K24q12R05m64j90O47Q9j7q3j076J144k5
1105C26p26j39O12N23m12l62l14K75n09J255n19N01r48K06N49l77M81P1L54p22
$$ y = [301, -238, 285, 270, -188, -157, 228, 168, -862, 398, 36, 80, 667, -559, -167, -322, -31, -209, -587, 180, 160, 167, 865, -49, 750, 508, 150, 312, -25, 493, -46, 457, -80, -184, 206, 175, 359, 241, 470, -380, -990, 208, -121, 217, 516, 783, -251, -590, 42, -393, 49, 675, -170, -688, -84, 490, 720, 330, -329, 78, 749, 345, 875, 294, 673, 76, -787, -791, -194, -629, 231, 474, -610, -358, -544, 165, -269, 380, 343, 301, 234, -141, 122, -51, -524, -580, -538, -97, 720, 193, -275, -594, 291, 993, 785, -473, -485, -286, -242, -246, -61, 825, 436, 56, -452, -65, -80, -27, 423, 209, -251, 385, 109, 320, 683, -432, 344, -203, 96, 680, 735, 209, 224, 209, 144, 616, 607, 531, -43, -145, -29, -203, 642, -335, 396, 193, 520, -16, 208, -604, 301, -163, -353, 294, 383, 366, 283, -793, 351, 326, -400, -539, 73, 596, 184, -178, -492, -217, -726, 529, 10, 511, -437, -231, 318, -59, 422, 493, 847, 125]
1125A25N00l37l87l15J90j62Q01j225K60J333n19k8m38j85N39l16n2j187J402
1144aK53k77o7M85p86qk19J327p95k23J362j787J063j59l9o22R00n57M0M66n40
1165a84O63q54L21N02j16l30r6p4L28M86j058N30Q1K26m88j45O51n66N58l54m05
1186c24M67J0j31j040N40R60j62J66L9p22J71N57j17o27m00N91J36n20N15l72
1206b63m50J370p85O07p98K56q25M58J59O62K56j544R20q3J63j8n99N74J88m43
1226a95K20l98J079n18m1L99p24K91K30p20O98N61p49j413K056j318O13N7k54
1245a26o71J081J38k83m57J257m17j431J409j028m29J151m38K07J26n71M18J029
1263I65r12n37O74k08j15M17K40r05OO95p63R21j336L91O03L95j79j165O02j98
$$ y = [125, 625, 288, -99, -414, -224, -386, 415, -810, -550, 783, 264, 236, -202, -387, 152, -164, -216, -1403, -1, 252, -25, -92, 393, -393, -401, -620, 707, -88, -311, 1051, -736, 327, 168, 129, -493, 407, -150, -110, 356, -184, 479, -375, -54, 448, 332, 2, -94, -168, 160, 646, -412, 118, 199, 425, -63, -208, 443, -123, 435, 81, -324, 143, 153, 22, -1018, -478, 482, 320, 486, 525, -197, -26, 531, 414, -213, -613, -22, 114, -406, 109, -263, -713, 657, -128, 479, -319, -63, -888, -430, -271, 391, 647, -897, 23, -60, 103, 85, -514, 60, 248, -195, 25, -373, 706, 188, 147, 546, -178, 113, 343, -377, 321, 882, 133, -1280, 776, -542, 71, 128, -126, -797, 284, 422, 139, -318, 939, 522, -909, 500, -528, -957, 194, -244, -37, 89, -482, -64, 965, 53, -484, 190, -18, -133, 284, 524, -381, -375, 320, -443, 478, -858, -467, 136, 531, 352, -813, -211, -409]
1283d09Q17l82j08R3J06J89q33K40J95R84o90n13k3k98O79L13K85j023j17m5J40
1304d00P28n09J74l49M11l39O76j089N00L1J04L35m41J41q86J079O6o99Q67Q6
1324D86m05J44m92L61N08k07p45K74L05l05L97k0m62L66l67N63J17l12o9M51n16
1345G2r05J012m27P28J08L84l42r63J301j130N42k48n09J65l65J298q68l95P96
1364B54N3j05J07r63Q34n8k20m95R37p63P0k04J167l68o32P5l24Q07m30L93L00
1385D35k83J03J29M8l1l76J013j184L24j40L88l20N56n57j38K31j090J506K14
1404H28q71P18K0j121R99n09p68Q55J85L5m78J42J10Ll56J55l62R61j209N81O1
1425b1k18j80J74L77J23O49n23j00l09P03l29m38J22K61M15o17K15k48k24Q46
$$ y = [-409, 408, 26, -82, 11, 117, 306, -527, -287, -92, 892, 202, -311, -334, -632, 47, 360, 645, -378, -495, -540, -400, 328, -181, -7, -356, 55, -284, 392, -697, -197, -166, -62, 273, -168, -27, -913, 166, 232, -467, 400, 486, 81, 225, -267, 94, 602, 395, -350, -76, 229, -76, 321, 301, -161, 205, -162, 401, 518, 206, 137, 588, 72, -833, 179, -248, 480, 588, 972, 630, -333, 968, -162, 380, 132, -377, -212, -577, 721, -147, -542, 254, 307, 202, 309, -654, 180, 122, -98, -593, 344, -419, -349, -553, 614, 246, -386, -311, -635, 172, -258, 135, 435, 152, 255, 384, 432, 401, 25, 1038, -146, 178, 38, 426, 106, 662, 105, -33, 198, -892, 614, 828, -43, 675, 695, -426, 573, 64, -704, 151, 336, 371, -107, 35, 145, 148, -208, -53, -415, 546, -663, -82, -21, -239, -419, -245, 132, 255, 904, 381, 281, -28, 675, 346, -92, 30, 291, 706, 89, 304, 56, -168, 678]
1445F78j07r97P61n95J10N30m02M9P62j953J534q84Q43l35o09n1R25P75j612J414
1465H36j498J65Q95m03l20NL10n07J168l38r05O83L4q05P01NP1K22o24Pl5p4O29
1488B22N89l41p49l58l1P16L69j66m79P83j031J94N02m56JM3J05K05l69K28l93
1509d16R17o50J25L4j6L7qn76O42N34l71m37L23q1o90P46n25K73R83q75j43L80
1531B06j0N2n14L28l15m05Q69j54q1k01m5M68O05j138O84L56r64pL32J91o61Q32
1553D28q38N64K21K96m27K26k72P5k03O49j2j33m96j04m5J26J52o12M00N58K7
1574E80n48P85o13r85M69K36k34N0L50l26o07R98n27P27j359J406p86R41r62M04
1594al95K15O40o70O62p35L8P52k72j54o30K47K55M52p27J002p22N80o56m32J73
$$ y = [678, 571, -426, 335, -260, -150, 380, -22, 27, 789, -1164, 370, -514, 329, -6, -615, -666, 259, 1034, -578, 836, -662, -497, 398, -5, -325, -320, -10, -517, 651, 313, -592, 91, 125, -680, 21, 26, 97, 319, -305, -298, -333, -407, 222, 811, 470, -279, -637, -668, 48, 417, 251, -228, 555, -476, -282, 220, -236, -235, -192, -87, 118, -251, -23, -416, 501, -149, -24, 10, -6, 31, 23, -553, 89, 623, 252, -185, 138, 57, -633, 113, -412, -139, 844, -31, -174, 206, 196, 248, -266, 62, -253, -658, 211, 57, -24, -225, -270, 198, 803, -335, 349, 705, -259, -266, 66, 257, -404, 428, -410, 154, 375, 671, 244, 470, 198, 273, 70, 719, 707, 574, 78, -26, -71, 55, 207, -405, -5, 553, 580, 32, 817, 204, -781, -312, -76, -310, -260, 90, -236, -843, 155, -372, 355, -1004, 402, -384, 557, -405, -1, -396, -181, 459, -211, 451, -284, -246, 506, 234, 80, -550, -303, -48, 404, -323, 679, -43, 537, -119, -551, -378]
1615c78J098r09l14K94l59J167m52K9k22Q08n48k44K8O12o73J77j39J53j017N72
1635c17Q21m04J97Q4Q2M4o73P29q10R36j234R56k75%k6l57P54m14l95K13j71J9
1657b41P65o63J61O7m75q9L68P05Q9j064r5L46M08j031O01O44m03o32J50O21L8
1678B70l14M79o01k60N37p61Q0J148p80L04k07RO0K39l86m85K5N0Q25n00n86R03
1700D9P8J10m70O75l92J84j400R42R3l6N13m87L97m01N01n52J07O65k05m55J4
1721g0J02k1k39j29K34M45l54m28L25J87p10M50L84lp94J82K25K09j50J51M56
1742D52m66J84O17o29m68J014j004K02N26l38J81k53l31P3P02n40L44J8p83P3
1762d26K47K50L44k26o75K88L87o74M39M01l52J34q57J186K29n45R8q58K4N32
$$ y = [-378, 720, -189, -503, -209, -568, 599, 147, 176, -46, 762, 214, -30, -2, 610, -63, 114, -25, 128, -889, -317, 504, 100, 297, 381, 463, 507, -166, 563, -247, 689, -545, 411, 136, 136, 110, -247, 507, 93, -302, -89, -260, -241, 524, -139, 22, 89, -386, -475, -107, 598, 687, -377, -472, -126, 282, -749, -148, 496, 93, -539, -389, 232, 270, -44, 435, -166, -426, 111, -650, -570, 578, -202, 102, -105, -96, -36, 203, -183, -668, -643, -593, 232, -268, -854, 49, 127, 237, -233, 442, 50, 234, -1166, -224, -131, -167, 346, -141, 256, -145, 356, -196, -89, 576, 371, -84, -70, 32, 11, -228, -357, -123, 322, -32, -460, -135, 52, -658, -208, 176, 173, -621, -439, -214, -5, -155, -4, 452, -14, 170, 787, 158, -310, 704, -300, -98, 428, 90, 271, 18, -313, -240, 462, -78, 266, 284, -499, -426, -179, 71, 415, 189, -486, -198, 189, -485, -46, 355, 3, 137, -720, 466, 695, 150, 248, -610, -586, -54]
1782e4N9N99q60p15Q60q2R0K65j37O27r70R25p21L16K0m63k04L54r7j80j56J22
1804d02P16O4j195N70N24l26O38o37j73J29J84m61K62q2n0J66P0L10j444J240
1824A03K98o49k21M66j37J06K09k35M42l64P3j98n4m66L42P12j546J286l12l13
1844d58o67J515m44P3j61r1K33m79Q39p77Q70l26K08K18j029K52J54m07N08l58
1864c27R1j08M85n27K93M34j49l11m30O04K31j83k25j15k00K65j40R1j3o29N05
1885c58O46k26o45N42m2L21j10p85R2O64K55j051M85O75r46K39O08o62M74N95
1905G71o64k11P3j44L80o50J191p83p9j70J20o74M78J08J18k48n91Q77m91K16
1925c73k55J176P12j415l86L64o15R79n97J104j094N68j20k16P09q54O96l9m41
$$ y = [-54, 5, 604, -256, -971, -111, -193, -103, 162, 25, 652, -318, 607, -114, 202, 222, -241, -445, -91, -188, -368, -524, -402, 314, 378, -817, -247, 277, -49, 589, -48, -221, -92, 92, -369, -107, -189, -239, -73, -3, 307, -1137, 103, 401, -248, -469, -3, -140, -34, 175, -60, 382, 18, 91, -107, -161, -627, -285, 427, -1119, 167, -145, -458, -1125, 390, -54, 19, -142, -233, 0, -479, 360, -417, 453, 127, 335, 553, -476, -224, -70, -477, 31, -327, -236, -344, 141, -386, -93, 341, 192, -119, -549, 55, 286, 103, -122, -237, -437, -172, -312, -221, -234, -863, -358, 288, 62, -583, -41, -83, 238, 128, -657, -565, 99, 354, -697, -212, 463, -483, -244, 364, -298, 176, 771, 107, -104, -31, -175, 205, -445, 746, -37, -116, -286, -166, -840, -362, -254, -136, -384, -975, -98, -589, -373, -628, 548, 1260, -155, -541, -177, -792, 187, -410, 694, -400, 168, 48, -168, 541, -313, 383, 344, -97]
1944i7N12o53M54m36M69n64k97kR77k06N7o15L11O2M08m07qr0j39K93K6O58j212
1967d99L36K62o8l06L75n14N37n42J18Q82n31m60Q33n03o79N15j15M71k59n19
1987f66O19M47K38p82R5j144P93M47k92J31k36N28J10j98n61L68J12p91R67k6
2007A59n94N9J98p43K67O46O6j65j65Q9Q60n91m36q33O56MJ211N4q15km88R19
2029C56j30q07J244r76p40P08L34m42L73N3Q6N0j54K74J82J25q95m03Q60m08n99
2050i09R85M90q34n79M17M36l59M32j023J614r24M88q53j35J206n71K88k26M46
2069C89J04j75p7o56M77L51j66l78k8L41O87k89j14r57k77J085k71k65M01o0J15
2090B37m06P61r88M57M10l15q58Q77K69o17k12N29o05K68L33q37P20L31n53M7
$$ y = [-97, 415, -238, 216, -220, 249, -315, -612, -614, 363, 157, 214, -401, -90, -28, 380, -27, -35, -125, -264, 29, 55, 713, -499, -163, 99, 31, -275, 100, -414, 123, -419, -301, 581, 50, -410, 423, -80, -759, -244, -359, 112, -147, -666, -47, 400, 638, -144, -49, -1193, -400, 47, -245, -114, -350, 178, 288, 90, -471, -103, 9, -782, 185, 159, -435, -376, -178, -921, -654, -8, 58, -107, -272, -183, 677, 86, -350, -1183, -527, -523, 688, 742, -73, -75, -563, 356, 226, -581, 663, -313, -1053, -345, -11, -453, -80, -27, 59, 109, -45, 229, 411, 536, -359, -762, 98, -310, -909, 76, 566, -268, -847, -430, 6, -353, 79, -944, 670, -254, 234, -619, -754, 452, -119, 169, -57, 389, 493, 318, 241, -415, 62, 413, 247, -131, -159, 182, 869, 580, 466, -491, -768, 317, 46, -219, 182, 122, 237, -169, 592, -396, 61, 471, 156, -702, 175, 444, -173, -385, 144, -461, -193, 140, -697, 23, 354, -199, -152]
2110a52M69K17m72L72k47l43N62j091O77Q27j463J837q58j02l07l23J95L12l79
2129b69O01j805J529o98O97O8l26j07P4P06o97Q31o73L36j435J091o2P96r47K73
2149a7j60k13M48j147J117k97j55K83J41N17l20j318J183m81Q98J9q58O23J39
2168D02o12m76K69O06n96J1J87K81M97o65O2r61Q95J73L13q91O19l21R39o50k98
2189b16M52k37l69J93N84n90j3N06m29j80R9K52N61q5p13O49n83N26r14N09M8
2210E0J56m3R8M5p57J164j95p59K88l93Q28m03k00K61L35k82q75P07O04q18J8
2231a71R3N18n44K50k0p88P54J37p58J172k03n27O22q70O28j313N08K73J63J69
2251I3k87J09N67n03p2N44m04j97L05l5p04J027k95k28M03o23N57k02m43R5K55
$$ y = [-152, 317, 534, 62, 434, 187, -156, 406, -685, -8, 819, -644, 1193, 335, 233, -74, -397, -202, 110, -269, 332, -1473, 56, -642, 55, 123, -203, -310, -236, 470, -227, 604, -69, 267, -1168, -77, -139, 657, -290, -17, -177, -390, 58, -1089, 28, -269, -424, -141, 0, 517, 197, -1121, 62, -419, 479, 498, -360, 263, 402, -210, -686, -417, 189, -407, -396, -209, 72, 569, -96, -34, -995, -100, 73, 386, -505, 114, -207, 732, 82, -216, 236, -1, -370, -177, 407, -183, -196, 310, -119, -299, -200, 52, 613, 528, -185, 464, -119, 407, -507, 2, 50, 206, 163, 261, 306, -451, 713, 518, -241, 47, -346, 482, 79, -121, 140, 475, 193, -682, 25, 629, -189, -171, -78, 440, -104, 146, 126, -662, 92, 229, -529, 643, 440, -87, 535, -335, 293, -1020, -512, -239, -76, 93, -194, -85, 482, -21, -93, 451, 47, -150, 155, 120, -584, 443, 148, -80, 323, -300, 257, 55, -388, -293, -38]
2272c8O04n66j36qL3k40l99M80L13K52q89R86k73q8K53p1J279j452n78R04k04
2293A62k55j62P01L5o30M15j55L94j006j82k11L47J482l60j292O98K07l57J85
2312A6o30M97K40k95N49m75j42O47m60L75n55Q88o32P4k69L06p42R76k68m76R90
2333F14J18l03k26j72K11k30R5j02K00k88l10N06J36j010J132J39j012M37K86
2352B21o78K55N92n09J286j283L81J40k14l35P78j477M05J495o09r71k08J89N00
2371d2n70M11M55o48K44L45l44p79J140K7l2n36K76N31l62j99j75J151n35q47
2391d89O87l33j72L58n45Q69m06P02r72J121j407N79L70j5q11O13l64j39J41O27
2411D14o1q74R6N66k3k27J66K88p55J356j155k50M90j224J186L18j139J354p01
$$ y = [-38, 566, 0, -136, -144, -111, -351, -750, -270, 43, 295, -594, 392, 119, 31, 284, 213, 1492, 40, -538, 366, 162, -93, -255, 446, 481, -149, 266, 111, 505, -501, -683, -894, -547, 935, 575, -717, -19, 188, -169, 16, -614, -117, 123, -172, 377, -98, -240, 407, -53, 322, -233, 655, 23, 97, -172, 134, -608, 368, 100, -376, 614, 732, 429, 203, 31, 242, 12, 107, 5, 205, -83, -393, 113, 249, -761, 371, 510, -502, -65, 221, -457, -202, 390, -119, 1167, -116, 265, 405, 191, -144, 634, -843, -438, 1057, 448, -523, -731, -542, -42, -612, -201, 254, -394, -150, 195, -149, -928, 212, 239, 207, -329, -53, 478, 116, -83, -258, 893, 358, -489, 198, -135, -307, 51, -494, 375, -31, 671, -301, 820, -587, -8, 362, 347, -464, 149, -215, -354, -213, 414, 353, -521, -425, 141, 118, -109, 57, 345, -410, 946, -209, -459, 31, -1193, -7, 311, -828, 526, -175]
2430a75K92K00o30q0M56j32J291j412J44L18o02K76M50l06m8J04k3m21L83J61
2450B46k65m18j22Q08K8m79R78l28L9j503J240k27O83o45k0O28q69J6k17N52o17
2471d92J054p66J18j98j02K05j21j41N35K74n26o44J357o37K37m02L79J91j077
2490g56K70M61p21O50N92l0r42q4J524j018M11m19O66l47Q8o6j50q1J75p36J85
2511c28K98l8O08j039J14K21j62N73q45L9J32O19o53m9N21J235n19r77n51R27
2531A26j9k17o5k96O93K19k69J88j04r18J018L05l01r73P0O43K7K9M4k25M65j238
2553g98J395r4l46Q6N47r28O2k57N92k54p60J295k8OK85q94O12k11n14J215j140
2574a29N6M86j72J88o18l09J66K21M35n85N06k26k23R9k0O6o59M45J23k13k4Q53
$$ y = [-175, 117, 317, -313, -393, 63, -69, 1222, -190, -46, 272, -330, -54, 396, 90, 42, 146, 123, -298, 85, 246, -19, -437, -559, 249, 277, -202, 776, 448, 487, -1016, 224, -3, 680, 35, 15, 643, -226, -210, -427, 125, -492, 562, -204, -86, -284, -386, -181, -302, -443, 92, 366, -160, -804, 553, -84, 153, -249, 130, 321, -756, -486, -25, -746, -96, 496, 466, -476, -560, 964, -54, 357, -62, 604, 257, 345, 279, 129, 48, 223, -513, -328, -30, -68, 540, -499, -385, -164, -326, 247, -598, -559, -427, 192, -461, -510, 11, 1246, 727, -250, -801, 126, 107, -110, -175, -471, 222, 441, 172, 360, 256, -662, 356, 661, 360, -613, -543, 100, 127, 156, 200, -25, 440, -798, 597, 503, 157, 243, 790, -138, -76, -333, 259, 5, -755, 540, 512, 518, 803, -91, 521, 310, -204, 1011, -129, -73, 413, 241, 429, -189, -498, -332, -111, 324, -261, 245, 19, -204, -105, -125, -59, -718, -273, -150, -363, -387, 466]
2596D66r1q50R94l7m19M6m80M14R70p96L24m13n73l8J022j157P12J30M8k24J52
2617B00M72q24n82J018p14Q21j59l63L42n50J63k20P08l09l60L67Q31r41K59q34
2637f75R77o74J83L14m42N95K71L9j193N14o22K56O56j96j18k94M66l79Q52k06
2657C24m9p1m65l08J242l49n87N84q97N27K08k85L09J6l68P75k75j58j033Q34
2677b6Q7p05O72J14M61j33r6n04J78P6N50m59R7j02n87J29j91N82L58k68k72L81
2699C42j7nO81j054j48N08Q4r28J041q80N04r10J304l46n57L74m07p16R64N58
2719C92o55J91O77o83q49P65MM15o72O59q45J125l83j60n71Q17L41J73K10r28
2739B3N1n21R66q55R97q84N1J1n50J068k81M41L50o89o62J13K62l74O81k48N66
$$ y = [466, 375, -475, 519, 482, 63, 109, -371, 43, 1013, 217, 541, 128, -445, -483, 539, -618, 94, 224, 272, 48, 200, 672, -152, -734, 284, -430, 391, 232, -131, 211, -339, -176, -396, 312, 3, -357, 10, 841, -100, 159, -675, 302, -372, -189, 125, -317, 278, 549, 588, -605, -91, -713, -457, 199, 3, -115, -409, 57, -322, 530, 324, 275, 204, -261, -569, 673, 324, -263, 321, -576, -49, 159, -126, 183, 199, -169, 606, 331, 173, -860, -26, 61, -644, 28, 142, 603, 470, 374, -130, 48, 124, 674, 215, 312, 210, -377, -248, -439, 143, 501, 233, -39, 342, 325, 320, 1001, -53, -201, 307, 391, -537, 504, -376, 128, -782, 522, 176, -381, -7, -414, -1130, -166, 392, -263, -72, 605, -78, -927, -162, -158, 257, -415, 244, -601, 524, 141, -19, -590, 227, 568, 741, 951, 23, 74, -447, 519, -336, 661, -223, -172, -161, -711, 357, 76, 517, 867, 178, -484, -371, -109, -483, 198, -50, 516]
2760E16q66L11M48l06o29L31O10l51K83q17J055k23j213J171o59j53Q41m23R3
2779A9m66k55O05n38L57O18o79L94m49Q65q66N30qo72J488r61K46j74K52q51K27
2800c18P08K74l65l4j34m76Q7K43q3P20r07N34j125L75N87j40j7K55o1M29q85
2821c33Q33Q3j142R73m67N26o86Q2k30J046q10L10q78J275o15Q34n73L83p43l77
2841e09K92j19J531j608O38j2j24j27j53k58L28N29m01l07r4J149j184J43j51
2860d37K30n10R28R9M29p81o62J51J161q03L74l20L03k74l79N70m1j34K7k26Q43
2881E48L3l94m72M59o03N16l90R6Q62j318n7P38M80p68N73K40l30r8J16R1K24
2902E46p70n60Q27J70r08O92m84N22n64R37k10k46L41j241P04o2k19Q87P6p95
$$ y = [516, -350, -39, 409, 103, -526, -195, 415, 64, 347, -470, 585, 362, -851, 320, -339, -492, 349, -74, 19, -447, -702, -97, -635, -278, 340, -339, 55, -394, 471, -395, 135, 127, -545, 943, -18, 228, 54, 306, -545, -318, 390, 664, 299, 265, 131, -345, -258, -15, -98, 622, -285, 249, -876, -501, 86, -54, -71, 184, 123, 552, -333, 500, 583, -559, 414, -53, 473, -213, -131, -361, 685, -125, 185, -693, 582, -33, 801, 228, 611, -132, -509, -217, -336, 1195, -413, 225, 213, 89, -38, -191, -449, -121, 408, 7, -300, -394, 755, -429, -286, -437, -207, -717, 211, 310, 739, -42, -704, -553, 608, -195, 179, -141, 162, -112, -491, 79, 38, -96, -69, -295, 548, 581, 187, -285, 174, -429, 87, -303, -207, 655, -663, -720, 18, 498, -270, 303, 543, 213, 115, 231, 322, 546, -224, -784, 43, 213, -695, -3, -487, 35, -529, 408, 198, -48, 293, -948, -244, -306, -525, 362, 438, -357]
2922c57L66l23K52J16K10k41r8r6P76r24J455j543M89K09q78N95n35M90L10k89
2942a6p8O6K59j580J438k44M26L78o93k17K73j65N7J87k98L38l11K92K84j2n90
2963b06K81k50L31M65m87j94n88J365p40k5j38j88O18n95K88j99J070n79J93P8
2983E00o23K79l91N92J35m66m25j84j37Q52M16p4l88K1n82j68M99K47j51L37m2
3004B47j61J57p78J134j018j08l27O68J40J8N57p31P8o61N22N29n71L60K72O0
3024C87P3p2o88M55l93P70k3r04L50J244j033n20J9j79j3K85q0L35J03N60q34
3045a58K26m17k14M52l12J80l05Q72j78n20K34L93o94J60j1K50k10L81l32K66
3065F3n50O36R2r8n10j80M98m27R7Q78o79N85K26p87K55q0r6m47P42r61M87K52
$$ y = [-357, 9, -314, -62, 54, 264, 23, -75, -171, 605, -319, 1136, -407, 82, 291, -587, 8, -527, -37, 273, -16, -94, -28, 231, -1349, 89, -155, 271, 649, -44, -261, 12, -153, -96, 91, -207, 131, -180, 112, 396, 384, -206, 75, -175, 156, 621, 134, -60, -648, 717, -23, -48, -186, -374, 244, -351, -63, -262, 808, 229, 422, 500, -123, 156, -235, 357, 492, 26, -399, -583, -720, 132, 548, 474, 86, 107, -475, -643, -144, 103, -48, 289, 247, 86, 243, -535, 599, -419, -527, -854, -186, -46, -28, 529, -202, -124, -785, -263, 266, -305, 55, 327, 387, 460, 388, -300, 155, -238, 532, 509, -395, -45, 1199, 166, -354, -335, -514, -527, -242, -322, 13, 116, 676, -158, 68, -349, -563, -111, -423, -243, -548, 324, 146, -374, -140, 253, -441, -281, -292, -42, -252, 129, -203, 63, -487, 149, 241, 143, -367, -547, -49, -476, -379, 499, -180, 405, 631, -156, 99, 19, -77, -524, 218, -743, -256, -4]
3087dl4K2J75k90L15q63O09K8J62K93m57n2N21k16j25k13K84k06J23K08Q8p47
3109c79K40k61J24K85J52L25j805P37j94l35K059j724k25J537m44K10l57K64m3
3128A66n37K39K80o87j29P42M14m09J27j71l60J030n85L34L08j044O54j194Q07
3147a5K00j92L42n43o29K15L98J54m73j98Q06l51O88p21M92J20m34K77o2J30m15
3168b11P62q00L69k60J35L09L35r29j29J122m14k74N3q68J516j128Q93k99m92
3187c10k08M98k99M08k76L51k63M55m74j65N40N03n30q09N65J18J02p17O43N98
3207G30p12j82K25l73K75M7j7n1p33M34j83K59M98J45k07l31J01N08m30J0Rj77
3229a55L90%o44j2J168p90l39j19O13L9l88L3L36J94o83K72j81o6O87J1q21J283
$$ y = [-4, -38, -16, 159, -131, 184, -679, -70, -42, 120, 413, -44, -96, 425, 209, 84, -129, 155, -51, 72, 280, 368, -379, -139, -400, -276, 9, 161, 486, -1319, -582, -776, -1111, 948, -776, -1001, 536, 92, 302, -55, 209, 166, -371, -132, 148, -539, -668, 74, 488, 79, 206, 35, -325, 705, 120, 454, 762, -282, 372, -822, -15, 185, -7, 335, -208, -837, -622, -224, -70, -543, -741, 65, -286, 402, -319, 173, 293, -141, 136, 74, 204, -211, 551, -249, 120, -140, -5, 304, 639, -290, -419, 703, 289, 15, 68, -800, 716, -412, 481, 182, -310, -518, -20, -319, 89, -187, 164, -99, 356, -118, -283, 257, 760, 230, -579, -14, 104, 206, -511, 132, 730, 18, -164, 61, -312, -37, 10, -7, -58, -791, -357, -540, -281, 217, 362, 155, -176, -75, 433, 3, 13, 22, -155, 235, 235, -409, -421, 747, -43, -382, -501, 112, 151, -237, -204, 132, 326, -357, -85, -266, -332, 355, 366, -455, 828]
3251H28m94m95m40J082j379J963q21n00P57j382J533p77J14m73M64n42j64Q15
3269H9R9L9P44j146N26j377J447m89J28m26L41o02K44J057K1l36p28L4k2K30K08
3290H1q55J574n83l39N94q73M00k42J26K4k40O70l37J99n51N17R11j184O36j344
3310h16J101P56j21o52j09k5n09K86J45M74j061O55l52j05j30L69M50p9p71j6
3330e10O67J07k69L88Jo60P55q24K80J119p57M0j25n03M86k80j46j03M37l2k97
3351b26J01J51K87m75K05K58p23L84j07K22%p15P21o8M90p83K8N82j04o65N49
3372A12qo52O00N59n52n00p11J126k99J63q52J394J00o30J386j161j01j07P2L59
3392B98m10k53M06K75o13J7lR69n53r3l00L40l24J52j5q6O09j037J001k11n20
$$ y = [828, 334, -161, -601, 481, -898, 1065, 244, -256, 501, -881, 652, -125, -11, -484, -20, -562, -726, 89, 188, 227, 971, -175, 351, -1026, 421, -68, 60, -366, -25, -627, -383, 674, 695, 359, -369, -335, -357, -127, 81, -774, 800, 217, -122, 472, -401, -1, -243, -117, -93, -333, 337, 0, 199, -352, 165, 1076, -108, 528, -816, 285, 1041, 920, 268, 159, 134, -375, -89, 56, 530, -531, 124, -228, -333, -463, -94, 356, 277, -494, -510, 157, 264, -5, 383, 384, -276, 479, -345, -65, 1054, 297, 337, 212, -291, 195, -85, -231, -334, 103, 71, -226, -125, 26, 313, -162, 43, 301, -422, -38, -145, 77, 77, -638, 83, 15, 505, -278, -250, 332, 228, -437, 112, 104, -548, 52, 611, 59, -441, -1152, -26, -325, -162, -1014, 380, 480, -150, 1236, 75, -26, -133, -61, 298, -112, -365, 41, 316, -297, -280, -283, 686, 133, 40, -260, 80, -244, -92, -107, -193, 416, -621, 380, 169, -351]
3413c51R76j023Q16n78N69L32p0n50n40J047j990J814o05P33n01J19l26j62O6
3432b24K17m96P45J21n1k02l5J63j42L72r00J164o62M3Q3r97P40l5m46Q34L74
3453F66j521J012J53q5l65K98J62p49O95L00q56J61K94j76K52r3p04Q20l64k92
3473c92O79m57l54J71J050j059M93n86N46n17m7M53m15J024n14ol28P03o42k0
3493b18k7Q05j054N42k77K57k10K07R16k92l5j89j540M59N75p2k15L87L64k52
3513A31n73K46L25k15j80R77k44ml62m54Q12l88o25J036n55N00j11J98k62n03
3533b51O58n02L05k74o80R13j76N29j17J0l45k23K58O3L9m67L33j72m91J235q73
3554b28J69j89K17k74R29P0j258O24K49l36m69j52N03J51N5l15N46J35o69J011
$$ y = [-351, 625, -398, 418, -160, 409, 741, 671, 121, -419, 628, -1362, 452, -153, 580, 79, 198, -128, -290, -224, -7, -503, 242, 363, 312, 110, 75, 238, 96, 468, -432, 732, 70, 113, 196, -801, -61, -96, -542, 292, 666, -855, 157, 310, 225, -140, 158, 320, -429, 266, 566, -290, -129, 165, -11, 241, 148, -556, 264, -100, -392, 287, -170, -524, -353, 697, -362, 131, -455, 91, -426, -473, -20, -435, 589, 75, 69, -259, 444, -198, -218, -245, 560, -494, 48, -229, 28, -182, 25, 941, 649, 614, 425, -1115, -656, -81, -153, -368, 19, 383, 131, -442, -196, 129, -86, -266, 711, 467, 463, 101, -353, 459, 71, -554, 482, -73, 427, 316, 514, 252, -251, 407, -95, 210, -64, -744, 169, -7, 522, 405, 415, 70, -153, 105, 168, 207, -260, 73, -99, -590, 645, -228, -59, -248, -31, -305, 624, 694, -564, 60, 309, -27, -496, -648, -145, 6, 61, -254, 292, 427, -242, 769]
3574G69n37J62k73P57r07L45o99m18R61q37N39Q00j219J11J000j535Q38P73n80
3593E0K4j7k14J174q13K55n35J58m9j04j80R01p85L33j08p97N88K71m23N46n18
3614b43M0n1Q04p54k13L45P7k22l15O62k29O21m65J50R05j006N21j067LP64j95
3635A32J82N95j315j49J3O64r16P23m31M94kL89l03m03n1j7N09O34n83k02J10
3656G3m15R55p12m38J183J96j274Q55m20l19M06N15l09l9m5m34K13k64l38R59
3676C48k12p4K87r18P29q88M35j19j35N85N78j363P01N6P1M89m17m26K18M26m13
3697d2J00m35J14K93M84n45O03j78j89q20J79M70p60N06K19P55l59p13L4N93K58
3718E67p29k34j77M77J19N4r68J111k14O73o28m07M69j54k98M73n70N49k84M63
$$ y = [769, 232, 394, 121, 878, -29, 316, -383, -801, 160, -677, -138, 662, -557, -446, 554, -981, -143, 630, 50, 74, 57, -157, 1017, 204, 459, -76, 82, 33, -71, -251, 650, -135, 198, 90, -707, -119, 152, -271, 275, -243, -203, -254, 550, -204, -417, -72, 5, -217, -532, 130, -99, 522, 57, 207, 1112, 106, 627, -440, -437, 327, 132, 314, 909, -406, -555, -542, 122, -794, -71, -502, -8, -10, 379, 76, -327, -378, -395, 114, 748, 165, -37, 73, -342, 613, -99, -537, 646, 842, -432, 423, 3, -316, 90, 605, 296, 257, 212, -222, -9, -273, -611, 348, 136, 62, 349, -569, 160, -728, -293, -412, -547, 38, 616, -747, -46, 10, 81, 570, 153, -273, -55, 371, -42, 58, -377, -263, 30, 514, -31, 572, 394, 205, -615, -436, 34, -726, -220, -1, 754, 395, -318, -284, 309, 567, -162, -396, -573, -96, 23, 77, -891, 220, 6, 679, 51, -356, 113, -41, -339, 134, -436, 113, -171, 292]
3738B92r59M21J00P24o82k18Q04o61k78M47j83N18n35k67L26j53J90N59Lo86q06
3759a044J192J97J1l16J57o98J58N98L70n82n78M65K65r23R52L06q06l55M0M42
3779a49n75R08J95p76K22J23O55q63K96k87K33k37K08p02P01j22R6n15L99j02
3799b92J15m67M51L10l67Q83j60l85k96J22J55J45n34L27n9n03N00N10p65O36
3819C26R2o29J75K88M10q14P02o82K83N01j125k58J29L54P7K34m12j30l56O64
3839a71L40K78n01M14j53k36l65P03r98O09o2j12j36N53J96j71n71N8O44J94n40
3860b7j52P26j12p22p1j85O46j277J123Q37j362k90K20L69P42N7J37j241Q19M0
3880B77p00M66m44K49j5m49m6oJ053N08j282L9P42k42j64Q5R7j05o85P12L79m28
$$ y = [292, -667, -246, -146, 578, -104, -322, 482, -179, -457, -10, -193, 325, -210, -477, -151, -304, -114, 445, 448, -238, -1044, 148, 345, 356, 40, 197, -501, -343, 255, 625, 43, -535, -70, 195, -728, 224, 530, -276, -631, -591, -149, -724, 184, 379, -397, -175, -52, 603, -260, 36, -251, -18, -255, -47, -749, -48, -170, -74, -589, -190, -292, -177, -644, -193, 117, -250, 633, 473, 88, -208, -86, 69, 214, -320, 7, -52, -555, -55, 455, -310, 326, 418, -211, -36, 252, 662, -152, 550, -132, 151, 652, -473, -731, -602, -248, -171, 63, -349, -479, -835, -171, 169, 447, -54, 360, 207, -29, -394, 309, -689, -80, -142, -254, -390, 163, 359, 188, -383, -325, 319, 513, -27, -179, 547, 435, -287, -358, -543, 103, -1174, -51, 786, -576, -866, -646, -277, 465, 522, 659, -582, 237, 277, -423, 43, -401, -152, -167, -616, -662, -668, 385, 893, -389, -350, 392, 150, -14, 71, 168, 63, -622, 90, 469, 41]
3902D1l22j8O05n61K1k5R45l88j221P15k88N79O5j13m89P4J019q08n66J120r9
3923B86l17K88j406J426J0J68j249J343J30l3q89M8k99J642p34p92P12O7j99m10
3943b08Q63j28r54j09k64Q10k87j90r9J3O20n0J82N06j092K84m14J170p43l88
3963d78M85J12m48J70L14k96K46N28m24m78R8l38R83j005N89p5J27K29L8j73j7
3984A87l82L43j95O78j142N68L69j97j17J37j6Q8q08n70J256J08n18J37m73Q46
4004B99r48O08L20p84O61N00p42O9j8m48N30J8o3M9j092J045M00j05j024J417
4024F92j35p01J97j08O49j101Q98j162Q75o21m2K86K54M29j28k14L54o54L3j21
4044c20P10k65K56Mp62M52K27Ok26O3n92q1M42K53K00r6N2l79n2K10P61j13o53
$$ y = [41, -281, -299, 306, -255, -234, -259, 686, 298, -923, -208, -496, 83, 148, 35, -454, -380, 639, -169, -735, 385, 286, -31, 257, -1149, 277, 287, 455, -794, 549, 679, 646, -243, -195, -494, 1148, 414, -378, 334, 401, 202, -208, 655, 527, -427, -536, -800, 10, -277, -467, -566, -553, 67, 17, 199, 705, -387, -103, -517, 653, -90, -478, 7, 119, -329, -159, 155, -141, 105, 633, 209, -269, -171, -509, 474, -531, 58, -17, 110, 339, 377, 204, 187, -195, 148, -47, 631, -511, 57, 426, 229, 112, 249, 233, 321, -487, -1057, 199, 307, -211, -74, -547, 299, -649, -41, 279, -505, 156, 656, -86, -17, -35, -483, 47, 65, 2, 51, -1041, 4, 404, 299, -725, 692, 557, -144, 53, -55, 594, -507, 391, -771, 104, -517, -559, -273, -19, 410, 282, 68, 422, -232, -199, -320, 390, 125, 381, 385, -377, 75, 302, 308, 82, 145, -447, -528, -86, 167, 367, 271, 323, -56, -108, 102, 863, 750, 97]
4067I7n83K4J95K44m3L84j055J120n19j219K084j013O03j070J070m45q72L81J
4086f16L32J90K61j29L03j079R53n86N97l92j92L49k44M86n57n0Q80M41o07j99
4106A41o9j64J01L72L47l78LM9q6m40P87q40j99N29O1m09P22J63n13m89J59L3
4128a20M16n14L09j283J050J064o44m53n81P60L43L0n00J14K87j01o32J77P67
4147D89n49M61k03k64N91n18M99o40n71L64O66j209Q92l29L05J03k93L48M24n65
4167Al22K30K82N5j267J237L96o4p45J11K06l83N80m17j0l77J69K47k75P28j016
4188f34J099l28k96N61k5l66j93O37q4m97L04m83L08l46P3L24R7N93m71Ko02J78
4210a49M23o3P3o02M70O99j861J130l93M52j59j97N14l76j59k40N14l49L87q29
$$ y = [97, -486, -462, -267, -23, -66, 318, -737, 383, -136, -1355, 729, -284, 319, -751, 319, -126, -998, -617, -616, -284, -94, 167, 38, 341, -738, 215, -371, 226, -166, -358, -9, -253, 233, -324, -374, 506, 947, 340, 141, 72, -92, 9, 381, 728, 350, 353, 402, 316, -124, 663, -177, -376, 153, 214, -195, 527, 690, 177, -312, -153, -120, 296, -218, 91, -1192, -142, 922, 278, -175, -756, 4, 347, 377, -123, -9, 278, 177, -455, -278, 489, -60, 401, 198, -66, 525, 7, 506, -134, -705, -341, 325, -884, 8, -321, -16, 87, -206, 142, 566, 1, -321, -91, 191, 246, -1021, 216, 612, 548, -197, -86, 120, -263, 317, -100, -110, -487, -318, -71, -346, 382, -634, 465, 137, -159, 402, 377, 11, -182, 455, 371, -126, 178, -305, 3, -343, -270, 54, 151, 744, 273, 275, -327, -149, 274, 211, 284, -318, 152, 851, -1010, 120, -273, 179, 20, -177, 337, -39, -198, -438, 76, -273, 114, -715]
4230g15J443l24K86p19L20J96k88l58j18q2L83O2l08n8O26n41J80J03l0J62n73
4251c53l9J297j355nP85j07m32k96K01Q72m58m2k97J24K60J08o46K99J8N29J67
4272F30p34K91n95k15Q33k01l15J062j004j40M11K47j76M44J41m17j84l89P91
4291D80m33L09j063L70M86k84L86o37P74j55n1k08j05K1k92L73m24J2l29M15j56
4312e11l12M13M90K77qk28l5qm40j44Q74o20j61K65N75j661J416k21M07m15j36
4333a83N4P5O5m89J58P67m80L57k74K96J9q22J76j15J022p93N29o45K20Q86j035
4354b12O02o65l7J91j34R39o02K07j74k48k57L80O7J34j75K00p23L23O98K66j71
4375F09q27P02k6k72n14L62k48M82K9j4k83K97l22n04J064k98K15r39Q78n1k65
$$ y = [-715, 728, 404, 690, -29, 291, 487, 199, -159, -277, -359, 24, 86, -222, -280, 346, -195, -15, 88, 58, 220, -353, -392, 905, -450, -455, 330, 223, -209, -505, -304, 568, 110, 68, -229, -105, 155, 263, -383, -84, -66, 463, 630, -104, 187, -408, -623, 210, 9, -306, 756, -248, -388, 23, 270, 94, 538, 679, 262, 78, -311, 480, 47, 356, -707, -337, 149, -135, 251, -386, 388, 233, 182, -26, -131, -110, -402, -29, -453, -441, -770, -355, -511, -823, -410, 80, 357, 349, 121, 86, 78, -362, -506, 368, -252, -413, -148, 427, -1234, 182, -39, 368, -47, -183, -129, -54, 11, -478, -320, 447, -33, 324, 50, 346, 365, -457, -281, -396, 626, -167, 362, -283, -63, 823, -212, 390, -275, -312, -121, -255, 684, 82, 289, 115, -133, -390, -10, 57, 191, 16, 216, -507, -184, 514, 780, 609, -218, 484, 458, 186, -328, 34, -214, 268, 297, 283, 0, 297, -25, -529, 535, 237, 452, -487, 391, 340, 75]
4396G5k34k79K52Q4L3J147q36k37Q73q44kl93N38j140J534q22J15l59R52o78M02
4417A81K14j053J109p75M4J205r88L65J45o45M56l00L56l07Q32r92k68M04L09
4436B92o58L44N46l37q16N79J005o95k05m41J05M17J2l60j65J00J008o71%k65
4456b05k32J554p95qm60J46k50K30M65m34k30O8K79k04L22o92O95K11l77l72N45
4477B56M10j79K10j281j59M21R48j176J167n53Q00p55n4m03O83n94jM73O43l00
4497E56j296P82m41j32J426j074M40r9m35r6j13j16n74N49N00L64M57j76n27K02
4517A97o11L90J80o86J399m97n59Q40p46K55K2j12n8l48p82J631n31K44q37n5
4537f64L77J429j363O37qj75n45N97l31N74n33J01K06q18N77J52l75n14k32O46
$$ y = [75, -159, -438, -186, -102, -69, 1078, 242, 5, 878, 34, 32, -361, 177, -963, 571, -251, -136, -495, 457, -221, 181, 395, -658, 451, -324, -280, 925, -63, 302, 447, -198, 258, -42, 314, 7, 839, -153, -421, -17, 292, -366, -22, 524, 187, -629, -50, 955, 260, 55, -386, -281, 136, 148, -212, -377, -277, 731, 60, 60, -205, -437, 1117, 322, 314, -146, 0, -250, -20, 445, 11, -219, -151, 128, -76, 246, -446, 249, 460, 83, -289, 256, 666, 487, 697, -584, -743, -322, 626, -550, 617, 64, 864, 109, 55, -348, 335, -259, -260, 213, 856, 556, -740, 42, -399, -531, 895, -179, 261, 162, -273, -369, -482, -598, -1172, -623, -123, 241, 698, 522, -5, 197, -414, -24, 156, -530, 869, 372, -187, 653, -93, 162, 184, 72, 14, -334, -1116, 515, -16, 228, -609, -664, -287, 1142, -221, 416, 408, 233, -312, 285, -46, 528, -5, 96, 302, -516, 61, 213, -162, -676, -908, -262]
4557b62N12j54k98LM73M32l57J78o10l64N10l89Q14l14R0m99P94q22N31q73J408
4578H03q43j9O66k72p06r7K87L3n48P96n44J64N82q53J189o77n22N19l9k46q2
4599d09Q5M31K71l25J3j37k36l25O50P40r03j61J49J011j636P50l7P08j71p14
4619b46k33J193k10o79N25K34j370R66L02q06O57m71N44m82N73p60k5M11o61L90
4639a48M80n58J52R06n60m40K0J22j97l51J0R61r1q41O73k8J59l27n37O80p2k62
4661b49K47K54k70m41O98r3N12j79l61R1qQ1m1j89M24n15j1J01l62N7J176k15
4683G07q86r0J058k03m73m11L25K12j56j20m30K08j35O59m84m15K57l26J000n04
4703b07l5L17M92l2q81N99R8j62l7m57O2O5L19J196j174p06J63R96r01J06J56
$$ y = [-262, 250, 96, -202, -199, 274, 706, 349, 527, -83, -447, 63, -326, 488, 174, 264, -235, 559, -263, 268, -605, 803, -40, -59, 607, 335, -371, -468, -181, -148, -696, 100, -444, -280, 302, -551, 638, -39, -561, -42, -81, -327, -409, -324, 107, 378, 53, 66, -71, -307, -632, 18, 758, -145, -306, -157, 854, -782, -32, -69, 639, 468, -246, -479, 714, 504, -175, 350, 584, -786, 180, 482, -324, 333, -138, 406, -76, 497, -263, -288, 123, -538, -148, 332, -226, -74, 832, 272, -168, -148, -26, -223, -574, -564, 397, 306, -535, 138, 110, 269, -58, -595, 85, 13, -249, -2, 252, -18, -459, 239, 146, 658, 479, 118, 209, 201, 282, 241, 52, 476, -39, -50, 51, -311, -254, 922, 707, -179, -269, 789, 586, 113, -298, 27, 239, 83, -37, -467, -259, -394, 265, -219, -634, -377, -703, 297, -207, -242, 75, 567, 535, -346, 253, 351, 189, 152, -305, -243, -178, 141, 1337, 163, -543, -380, 616, -285, -179, -23]
4724b3m14L18J03Q56n40l40k22N12m95Q4M64p74J61q7J070k25k25j62R5l8m87
4745c69N91k94N55l97K29k28n9J203r96n50M22k44O09o58K89j51K43l88Q37l80
4765B64j20N42n72l10Q41m18k16l61J29L9j2q21J247N10p10K44M56o99m82J04
4785c45K58P60m94n22Q06m50l24M03j5m11L07j11M59o46L54K75m2p34O99r81L58
4806c96M36M05o55J37k83j45R97j009J305k02q48L11R09j048N86n80j06J26P77
4825G17n41n68M75l06M06m56N5n04J042n39M80k30J83k77k61J22Q77q16k20J085
4845G24q63K56m06L62K68m68k06J84N15r20P15J34o82j83O30j451J466L46l35
4864H6P0O7N81q37m75Q72m64m22L63l45P89l84K53m36L06q9O07n04K9m95M60m83
$$ y = [-23, -437, -119, -16, 840, 300, -40, -262, 250, -245, -161, 303, -471, -310, -397, 673, 448, 223, 61, 156, 118, -369, 222, -72, 483, 86, 315, 87, 28, 1231, 235, -315, 107, -137, 472, -186, 103, -48, 195, -193, 644, 264, 144, 686, 114, -196, 645, 227, 11, -350, -221, -182, -194, -1015, 232, 742, 32, 276, 732, 33, -449, -345, -87, 673, 179, -343, 463, 13, -311, 92, 77, -334, -27, -138, 321, -325, 29, 304, 262, -472, 227, -754, -396, 40, 445, -210, -73, -356, -501, 496, -513, 792, 590, -258, 53, 962, -86, 500, -80, -186, -60, 717, 176, -392, 83, -223, 183, -273, -218, -722, 320, -219, 261, 31, 214, -63, -324, -202, 675, -141, -361, 724, -139, 117, -289, 73, 341, -127, -333, -149, 366, -554, 161, 295, -387, -570, 60, -1391, 75, 421, 86, 156, 223, 804, -33, -508, 364, -100, -522, -159, -504, 285, -99, 154, -282, 24, -65, 542, 38, 67, -428, 32, -451]
4886d51O29m57L52k47K35k51j66Q68L03r54O29l77j00j63L46q29P98O05n79n47
4906c56O34m14K35M76j108J403n05m72N70q65L40R62o57j47Kl59m15P65j95L78
4926B72l15n94O60l68Q40L8m21k44j07l99M73k34k09O27J00K95L46k99n28N19
4946D52m9j70J005j100L56J00o3l10M39j156J107j122k2R02m79kl37R12Q14n17
4966G60j054K55L71n38L61j88k76L92K16L2p99K19L31m6N47m49j73o99Q52L30
4986D44k62k64l44K76L12Q34q28q28P84L5r15O91j41l69l66J488n51L11m97p23
5006i13J292j09J58p34J174p35j09N94k16k05M5l8o83Q49o21n97O12K68p48Q33
5026A17j447J734P7q83K25K07j79O29l25M02l30p33L93M76p2o38N81l57N76o10
$$ y = [-451, 178, -279, 73, -174, 61, -190, -356, 512, 815, -139, 490, 113, 13, -150, 196, -633, 165, 770, 191, -356, 278, -136, 99, 575, -533, 870, 365, -107, 463, -402, -62, 900, 243, 96, 98, -261, -676, 89, -106, 272, -43, -637, 23, -345, 495, 533, 112, -132, -239, -638, -165, -399, -608, 19, 119, 414, 760, 461, -67, 452, 403, 233, 1238, 138, 494, 594, 531, 221, 660, -496, 611, -511, -533, 369, -110, -112, -449, 463, 1277, 760, -294, -39, 332, -206, 155, -33, -309, 83, 299, 331, -468, -249, 82, 36, 583, 134, -39, -738, 114, 444, 182, -82, -426, -150, 162, 996, 168, -660, 124, 159, -756, -65, -206, -575, -941, 547, -4, 307, -190, -913, 379, 270, 428, -306, 868, 133, 24, 618, 402, 197, 242, 204, -479, 370, -251, -848, -236, 32, -716, 117, -1330, 404, 481, -402, -177, 30, -149, 480, 155, 557, 227, -506, -113, 363, 291, -347, 234, -123, 453, -157]
5046a57N66l65k9K71J66r79J265j374M87M4o22J935j413J097p32o64q8R21l26
5065Cl55N17l16j64L48j91M09r41l14J040L35j03m20J84r16J190j053L95J75R2
5085h5j51Q88N9o01j11j032J025P76j2k32r77L31K30o8n84P57o4j74M41K03M1
5106F60q9o15m28P3P30o66R07l01l25l66Q06l58o57M38O1K70k28k49M88M8l46
5127a47M39j074J783r39J86k21n9r7O13m40k45M36n13M61j95K28m35L01K0o5K38
5148B75n34k63J443p93N41m42l72Q01j180K37K61m16J81O62m8m30M50n47M11k37
5168@L14K00j55K44r98Q3M6R97k33j056L50M43k93n70P04m94R77r09O88o26J15
5189a73K58l05n35Q69p4l66M11K57k10k85n11Q48n46K21O52l44n09P22M05k62
$$ y = [-157, 409, 44, 15, 286, 452, -527, 738, -636, -149, -105, -727, 1208, -205, 892, 160, -504, -592, 329, 3, -352, 165, -151, -315, 33, -158, 251, -690, -1004, 36, 371, 268, -152, 32, -884, 306, -747, -352, -177, -85, -236, 652, 711, 110, -1, -1033, -8, 768, 756, 524, -453, -122, 108, 40, -544, 213, 149, -25, 416, 619, 660, 571, -44, -472, -399, 331, -335, 572, 271, -54, -420, 386, 28, -629, -191, -130, 140, -88, -337, 151, 199, -147, 292, -782, 1001, 62, 248, 27, -32, -129, 484, 44, -201, 235, -278, 183, -12, 216, -219, 82, 102, 37, 275, -259, -522, 921, 128, 669, 227, -145, 656, -524, -287, -26, -442, -261, 401, 353, -77, 373, -174, 237, 0, 314, 514, 359, 603, -395, -312, -266, 731, 498, -558, -208, 235, -58, -628, 76, -418, 559, -350, 338, -288, -173, 85, -220, -755, 114, 40, -326, 85, 342, 132, -153, -664, 184, -362, -141, 511, 167, -342, 380, 785, 523]
5209E23n4o2p81P50j02o63P35o87L24m44K23M49l36N5L97j24M64j160Q74K43o00
5230B4L21M61q01Q19o50L24p54k68N41n73R78p34nk39K00P18pJ93n81J28o53k90
5252h48J153j0o59L46k6l35J1J184n63l17p59J362n78m5j23p4J265o34r42L75
5272b17Q86n52n66J709j593J5N16m52L41N81l89o08M25l54Q34l82n12k80J043
5291D45m35l88P70q95O66o52j20J132m31l19Q08q86P8Q7n3M77k57MK06K76j216
5312g03M46P23K49k71p92L66n01J56K85o94M38K93m54N22L63k5l54m59r4N88Q66
5333I48q29j57O05j103K05R51m39k16K06l62K90m57Q55j182J171n00K83j220J571
5352F20r27K02l45j4O90j027J516j181Q14o07J059n33j80L87k16n2K95n77Q89
$$ y = [523, 469, 407, -374, 376, 274, -389, 346, -341, -17, -461, -238, 211, -125, -70, 327, 203, 667, -493, 381, 624, 24, 345, 806, 5, 824, 174, 498, -256, -524, 17, -556, 422, -312, -317, -556, -356, 362, 355, 548, -33, 95, -558, -848, 305, 295, -364, -18, -44, -379, -368, 816, 253, -64, -823, 539, -39, -84, -207, -281, 984, 350, -592, -217, 669, 117, -449, 1260, -333, -318, 198, -254, 87, 668, 279, -329, 96, -258, 576, 194, -318, -598, 445, 10, -378, 392, -503, 163, -489, -609, 523, 92, -227, 581, -305, -227, -140, -193, 284, 27, 31, 237, 513, -703, -257, 466, 715, 444, -348, 18, -483, -327, -42, -736, -298, -5, -459, 63, 426, 401, 47, -412, -506, 82, 948, 119, -38, 567, -536, -331, 620, 181, -35, 171, -191, 99, -358, 497, -685, 486, -14, 269, -951, 620, -307, -105, -450, -464, 226, -801, 715, -466, 348, -259, 800, 267, 87, 474, 258, 206, 501, -76, 813]
5371H13m99j84M84k44l80k30N74m35l99N15J54o11J58K90O10o73p5L3K25J56p22
5392d40M10M83r62P52j14L53p36K36m07O24k37J7o0n39M64L62m15k39R77p09J45
5413c5j75k19R00p49M80J48j205O41L88J40r0l87p2K04k30O75m15O05l04j07q14
5434f21J243q01K53n15J082o30oL0o05L02M97P4n42M50k01k60K87l9n84J17J159
5455F90m07k54l60P35m68J14l85K34K43P66q33L28l86q6L89n09J52m41O25r26
5475g79M62J090j073p8j13J192p3r22j92L53M00k36J12J15l35k13J009j168P46
5494B97l40l3J03l35M54K52l41j39M2J10q0J98j29m83P54J89J67j118O26m51Q09
5515E52l26l80N75j24q61N95M50p55J03j56j57K95L64l56P6K68l19M51n55p4K87
$$ y = [813, 314, 130, 614, 370, -10, -240, 334, -101, -500, 15, 169, -442, -284, 6, 616, -57, -132, -99, 126, 282, -440, -30, 453, -509, 243, 129, 482, -254, -18, -425, 199, -38, -21, -81, -620, -156, 206, -209, -448, 529, -180, -35, -210, -429, 471, -278, 202, 350, -855, -214, 174, 314, 224, -163, -235, -31, -261, 414, -1, 604, 300, 193, -621, 622, -179, 74, -441, 641, 11, 5, 35, -570, -268, 229, 303, -239, 211, 10, -250, 37, -2, -586, -469, 690, 283, 29, -331, 404, -64, 50, -335, -101, 142, 908, 75, 403, 17, -69, 320, -189, -37, -478, 147, -779, -317, 773, -300, -378, -491, 701, 628, -294, -486, -133, 267, 31, 143, 258, -77, -290, 719, -449, 297, -43, -76, 27, -308, 146, 398, 57, -82, -40, 70, -10, 188, 59, -424, 330, 519, 686, -432, 194, -257, 552, 226, -154, 421, 297, -564, 31, 481, -274, -171, -327, -484, -189, 175, -181, -105, 163, -156, 295, -260, -334, -47]
5536d7l25M49j67P32n58p12k28J108k1p88J477p95p62L56R92p61k7j61N31l85
5556i2O20j487Q44M76p78P60k41q89R52p9M4K55L67j145k47J577q14J15L67o10
5576eK38N4n56O71o06L55j10J19p42P76P89j388O84j55n95J55O4k1r30J610n5
5597C52o08J45k26M11M7o13K13k20L51J37p00O00K19o07M79j36O86l04k31J86
5617A81l35K31j43K69o02n52R09O0J5J74k90L33N14l1q82m93O33j79k97P32q49
5638f02Q93l32j84L1M05n58L88K31k93N56m78M60j012P38R1r1j058J314o8o41
5658b10K78j13N47r49L23o13J298j420R69o0M70l67j58K04k90P56j71n70j41M03
5678A86j61n8q92O82M97K28r21k0M36l4R8O76o97M71r70J51J18N9J89N72p13j29
$$ y = [-47, -372, 77, -90, 642, 84, -628, -856, 252, 231, -557, 920, 125, -637, -281, 711, -50, -77, -238, 293, -92, 528, -959, -115, 361, -417, 343, 102, -787, 165, 86, 130, 385, 752, -393, -640, 937, 123, 238, 605, -5, 233, 287, -269, 402, -204, 151, 41, 160, -582, 194, 983, -405, 279, 124, -471, -316, -252, -273, -1203, 407, 352, -256, -111, -337, 74, 121, -492, -279, -499, -148, -11, -711, -111, 108, -499, -20, -156, 530, 226, -5, 181, -154, 77, -66, 203, -399, -951, -42, 18, 33, 207, -83, 250, 764, 733, -149, -642, -9, -188, -485, 247, -602, 291, -41, -225, -194, 211, -347, 41, 272, -21, 535, 57, 517, -495, 243, 334, 243, -815, 499, 431, -210, 68, -45, 502, -447, -124, -737, 561, -859, 110, 50, 520, 153, -5, 199, -91, 665, 494, -76, -217, 186, 25, -33, -925, -243, 254, 482, -439, -459, -23, -57, 41, 717, 20, 491, -479, -328, -210, -151, 38, 610, -103, -232]
5700b32Q54j005J339j721N25L96o64J416j316K78K40j71K74k93N50n91K30K63
5718C72j069K79N91j10N12r51n8R26p26k29K46p0j14N45P4r0O0J10N9o11L03O8
5740A17J05l38L28o2M23o85J92o73O23M08m57M21p28l93j49J429p31p64R08O32
$$ y = [-232, 622, -383, 956, -765, -240, 156, -508, 908, -408, -130, 110, -61, 213, -80, 470, -121, 109, 372, -697, -418, 173, 63, 575, -376, -434, 492, -234, -463, -217, -287, -401, 144, 218, 128, 188, 298, 357, -254, 49, 117, 222, -116, 212, 150, 573, -112, 80, -593, 30, 438, -19, 402, -326, -719, -868, 561, -170, -934, -26, 606]
$$ [...]
8191f21
##END NTUPLES=NMR FID
##END=
