##TITLE=1H_DE-59_D2O
 D2O
 64 sc, 
 22.7.2024
##JCAMPDX= 6.0         $$ Bruker NMR JCAMP-DX V2.0
##DATA TYPE= NMR FID
##DATA CLASS= NTUPLES
##ORIGIN= UXNMR, Bruker Analytische Messtechnik GmbH
##OWNER= root
$$ XWIN-NMR		Version 3.5
$$ Mon Jul 22 14:10:29 2024 Russian Standard Time (UT+4h)  she@DPX200
##.OBSERVE FREQUENCY= 200.1308
##.OBSERVE NUCLEUS= ^1H
##.DELAY= (6, 6)
##.ACQUISITION MODE= SIMULTANEOUS
##.ACQUISITION SCHEME= undefined
##.AVERAGES= 64
##.DIGITISER RES= 18
##SPECTROMETER/DATA SYSTEM= spect
##.PULSE SEQUENCE= zg30
##.SOLVENT NAME= DMSO
##.SHIFT REFERENCE= (INTERNAL, DMSO, 0, 15.7039)
##AUDIT TRAIL= $$ (NUMBER, WHEN, WHO, WHERE, WHAT)
$$ ##TITLE= Audit trail, XWIN-NMR		Version 3.5
$$ ##JCAMPDX= 5.01
$$ ##ORIGIN= Bruker BioSpin GmbH
$$ ##OWNER= she
$$ F:/spectra/data/she/nmr/H-F/1/audita.txt
$$ ##AUDIT TRAIL=  $$ (NUMBER, WHEN, WHO, WHERE, WHAT)
(   1,<2024-07-22 14:07:20.29 +0400>,<she>,<DPX200>,
      <continue with go, POWCHK disabled, PULCHK disabled
       configuration hash MD5:
       00 E9 B6 7A A2 85 ED C7 34 08 36 98 17 FE 4E 26
       data hash MD5: 16K
       99 DF 92 DB F9 12 BD 68 C1 67 DE 72 4F F7 1C 20>)
$$ ##END=
$$ 
$$ hash MD5
$$ FF 58 69 F9 69 15 EE 30 3B 2A A5 92 6B 30 F7 E2
##$RELAX= 
##$RELAX= 
##$RELAX= 
##$RELAX= 
##$RELAX= 
##$RELAX= 
$$ Bruker specific parameters
$$ --------------------------
##$DU= <F:/spectra>
##$EXPNO= 1
##$NAME= <H-F>
##$PROCNO= 1
##$TYPE= <nmr>
##$USER= <she>
##$AMP= (0..31)
100 100 100 100 100 100 100 100 100 100 100 100 100 100 100 100 100 100 
100 100 100 100 100 100 100 100 100 100 100 100 100 100 
##$AQSEQ= 0
##$AQ_mod= 1
##$AUNM= <au_zg>
##$AUTOPOS= <>
##$BF1= 200.13
##$BF2= 200.13
##$BF3= 200.13
##$BF4= 200.13
##$BF5= 200.13
##$BF6= 200.13
##$BF7= 200.13
##$BF8= 200.13
##$BYTORDA= 1
##$CFDGTYP= 0
##$CFRGTYP= 5
##$CHEMSTR= <none>
##$CNST= (0..31)
1 1 145 1 1 1 1 1 1 1 1 1 1 1 1 1 1 1 1 1 1 1 1 1 1 1 1 1 1 1 1 1 
##$CPDPRG= <>
##$CPDPRG1= <>
##$CPDPRG2= <>
##$CPDPRG3= <>
##$CPDPRG4= <mlev>
##$CPDPRG5= <mlev>
##$CPDPRG6= <mlev>
##$CPDPRG7= <mlev>
##$CPDPRG8= <mlev>
##$CPDPRGB= <>
##$CPDPRGT= <>
##$D= (0..31)
0 1.2 0 0 0 0 0 0 0 0.06 0 0.03 0 0 0 0 0.0002 0 0 0 0 0 0 0 0 0 0 0 0 
0 0 0 
##$DATE= 1721642646
##$DBL= (0..7)
120 120 120 120 120 120 120 120 
##$DBP= (0..7)
150 150 150 150 150 150 150 150 
##$DBP07= 0
##$DBPNAM0= <>
##$DBPNAM1= <>
##$DBPNAM2= <>
##$DBPNAM3= <>
##$DBPNAM4= <>
##$DBPNAM5= <>
##$DBPNAM6= <>
##$DBPNAM7= <>
##$DBPOAL= (0..7)
0.5 0.5 0.5 0.5 0.5 0.5 0.5 0.5 
##$DBPOFFS= (0..7)
0 0 0 0 0 0 0 0 
##$DE= 6
##$DECBNUC= <off>
##$DECIM= 24
##$DECNUC= <off>
##$DECSTAT= 4
##$DIGMOD= 1
##$DIGTYP= 9
##$DL= (0..7)
0 120 120 120 120 120 120 120 
##$DP= (0..7)
150 150 150 150 150 150 150 150 
##$DP07= 0
##$DPNAME0= <>
##$DPNAME1= <>
##$DPNAME2= <>
##$DPNAME3= <>
##$DPNAME4= <>
##$DPNAME5= <>
##$DPNAME6= <>
##$DPNAME7= <>
##$DPOAL= (0..7)
0.5 0.5 0.5 0.5 0.5 0.5 0.5 0.5 
##$DPOFFS= (0..7)
0 0 0 0 0 0 0 0 
##$DQDMODE= 0
##$DR= 18
##$DS= 0
##$DSLIST= <SSSSSSSSSSSSSSS>
$$ [...]
##$SUBNAM2= <"">
##$SUBNAM3= <"">
##$SUBNAM4= <"">
##$SUBNAM5= <"">
##$SUBNAM6= <"">
##$SUBNAM7= <"">
##$SUBNAM8= <"">
##$SUBNAM9= <"">
##$SW= 24.0690372696642
##$SWIBOX= (0..15)
0 0 2 0 0 0 0 0 0 0 0 0 0 0 0 0 
##$SW_h= 4816.95568400771
##$TD= 16384
##$TD0= 1
##$TE= 0
##$TE2= 300
##$TE3= 300
##$TEG= 300
##$TL= (0..7)
0 120 120 120 120 120 120 120 
##$TP= (0..7)
150 150 150 150 150 150 150 150 
##$TP07= 0
##$TPNAME0= <>
##$TPNAME1= <>
##$TPNAME2= <>
##$TPNAME3= <>
##$TPNAME4= <>
##$TPNAME5= <>
##$TPNAME6= <>
##$TPNAME7= <>
##$TPOAL= (0..7)
0.5 0.5 0.5 0.5 0.5 0.5 0.5 0.5 
##$TPOFFS= (0..7)
0 0 0 0 0 0 0 0 
##$TUNHIN= 0
##$TUNHOUT= 0
##$TUNXOUT= 0
##$USERA1= <user>
##$USERA2= <user>
##$USERA3= <user>
##$USERA4= <user>
##$USERA5= <user>
##$V9= 5
##$VALIST= <valist>
##$VCLIST= <CCCCCCCCCCCCCCC>
##$VD= 0
##$VDLIST= <DDDDDDDDDDDDDDD>
##$VPLIST= <PPPPPPPPPPPPPPP>
##$VTLIST= <TTTTTTTTTTTTTTT>
##$WBST= 1024
##$WBSW= 4
##$XGAIN= (0..3)
0 0 0 0 
##$XL= 0
##$YL= 0
##$YMAX_a= 438584
##$YMIN_a= -428012
##$ZGOPTNS= <>
##$ZL1= 120
##$ZL2= 120
##$ZL3= 120
##$ZL4= 120
##$ABSF1= 10
##$ABSF2= 0
##$ABSG= 5
##$ABSL= 3
##$ALPHA= 0
##$AQORDER= 0
##$ASSFAC= 0
##$ASSFACI= 0
##$ASSFACX= 0
##$ASSWID= 0
##$AUNMP= <proc_1d>
##$AZFE= 0.1
##$AZFW= 0.1
##$BCFW= 1
##$BC_mod= 2
##$BYTORDP= 1
##$COROFFS= 0
##$CY= 11.3945322036743
##$DATMOD= 1
##$DC= 2
##$DFILT= <>
##$DTYPP= 0
##$F1P= 15.6554695791079
##$F2P= 12.8336369535428
##$FCOR= 0.5
##$FTSIZE= 0
##$FT_mod= 4
##$GAMMA= 1
##$GB= 0.15
##$INTBC= 1
##$INTSCL= 1
##$ISEN= 128
##$LB= 0.24
##$LEV0= 0
##$LPBIN= 0
##$MAXI= 10000
##$MC2= 0
##$MEAN= 0
##$ME_mod= 0
##$MI= 1.114404
##$NCOEF= 0
##$NC_proc= 0
##$NLEV= 6
##$NOISF1= 3.799351
##$NOISF2= 2.8
##$NSP= 1
##$NTH_PI= 0
##$NZP= 0
##$OFFSET= 15.70392
##$PC= 1
##$PHC0= -25645.8
##$PHC1= 17.78749
##$PH_mod= 1
##$PKNL= yes
##$PPARMOD= 0
##$PSCAL= 0
##$PSIGN= 0
##$REVERSE= no
##$SF= 200.130013532006
##$SI= 16384
##$SIGF1= 3
##$SIGF2= 2
##$SINO= 400
##$SIOLD= 16384
##$SREGLST= <1H.CDCl3>
##$SSB= 0
##$STSI= 0
##$STSR= 0
##$SW_p= 3612.71676300578
##$SYMM= 0
##$S_DEV= 0
##$TDeff= 0
##$TDoff= 0
##$TI= <>
##$TILT= no
##$TM1= 0
##$TM2= 0
##$TOPLEV= 0
##$USERP1= <user>
##$USERP2= <user>
##$USERP3= <user>
##$USERP4= <user>
##$USERP5= <user>
##$WDW= 1
##$XDIM= 8192
##$YMAX_p= 0
##$YMIN_p= 0
$$ End of Bruker specific parameters
$$ ---------------------------------
##NTUPLES= NMR FID
##VAR_NAME=  TIME,          FID/REAL,        FID/IMAG
##SYMBOL=    X,             R,               I
##VAR_TYPE=  INDEPENDENT,   DEPENDENT,       DEPENDENT
##VAR_FORM=  AFFN,          ASDF,            ASDF
##VAR_DIM=   8192,          8192,            8192
##UNITS=     SECONDS,       ARBITRARY UNITS, ARBITRARY UNITS
##FACTOR=    0.0002076,     1,               1
##FIRST=     0,             0,               0
##LAST=      1.7004516,     0,               0
##MIN=       0,             -428012,         0
##MAX=       1.7004516,     438584,          0
$$ Real data points
##PAGE= N=1
##DATA TABLE= (X++(R..R)), XYDATA
0 0 0 0 0 0 0 0 0 0 0 0 0 0 0 0 0 6 -34 63 -63 63 -63 64 -76 122 -126 129 -153 189 -202 240 -265 305 -332
33 -332 379 -422 462 -519 581 -643 709 -791 879 -970 1076 -1191 1321 -1464 1628 -1811 2030
50 2030 -2279 2576 -2937 3376 -3936 4675 -5697 7210 -9698 14643 -63236 345758 438584
63 438584 -78635 -422571 -243372 248331 397585 46851 -364614 -289772 147259 389799
73 389799 118739 -293885 -319119 72168 354068 175814 -226253 -322319 -3665 310375
83 310375 214072 -152264 -313969 -64829 259123 239763 -86154 -288975 -118189 200657
93 200657 254372 -21530 -265590 -158593 151271 254137 27336 -226343 -181916 94616
103 94616 242753 75770 -184617 -200225 43283 223759 110900 -140365 -204667 -4465
113 -4465 197016 139193 -97429 -201995 -43211 166985 155990 -54477 -190518 -75572 132632
124 132632 164311 -15160 -170379 -102635 95845 167762 20688 -150471 -121950 63103 159391
135 159391 49749 -121736 -131756 27011 148180 75110 -94940 -137744 -1234 131983
145 131983 91566 -64339 -134229 -29925 111443 105396 -37150 -128587 -51846 89937 111999
156 111999 -11028 -115814 -68676 65855 112568 14091 -100885 -83384 40810 109385 34300
167 34300 -82998 -90268 19129 100854 50398 -62746 -93846 -2225 90702 63865 -44367
178 -44367 -92727 -19466 75736 70899 -23318 -86561 -36190 60387 76809 -5616 -79875 -48257
190 -48257 45117 76476 9436 -68073 -55884 27117 72945 24130 -56111 -61643 12085 68904
202 68904 35406 -42522 -64246 -1496 60261 44108 -28493 -62346 -14728 51466 49774 -16338
214 -16338 -60533 -25027 41404 51783 -4574 -53498 -33721 29100 52190 6720 -46630 -38536
226 -38536 18255 49989 16290 -37456 -42627 7370 46302 24456 -28558 -43920 -1374 41482
238 41482 29765 -19704 -43368 -9481 34556 33699 -10265 -41251 -16805 28687 35909 -2332 -36372
251 -36372 -22388 19865 35988 5820 -32136 -27627 12695 34925 10512 -25836 -29793 5060
263 5060 31988 16227 -20068 -30623 -2377 28159 20341 -13935 -30055 -7022 24512 22790 -7007
276 -7007 -27393 -12199 18875 24238 -1305 -24684 -15590 13765 24973 3871 -20981 -17584 8030
289 8030 23123 7150 -17538 -20682 3426 22547 11623 -13298 -19797 -679 18936 13742 -9254
302 -9254 -19609 -5066 16576 16389 -4953 -18705 -7736 12815 16635 -781 -16834 -10898 9454
315 9454 17092 2009 -14612 -11962 5866 15579 4819 -12438 -12729 3108 14542 6812 -9858
328 -9858 -13871 -45 13332 8869 -6730 -12965 -2753 11600 10767 -3185 -13512 -4484 9241
341 9241 11313 -1443 -11197 -6504 7242 12089 582 -10695 -8126 4251 10673 3201 -8498 -8525
355 -8525 2460 10227 5144 -6636 -8610 318 9029 5182 -4796 -8519 -1526 7847 7258 -2896 -8386
370 -8386 -3021 6580 6612 -1477 -7758 -4770 5658 6974 75 -7275 -4728 3380 7322 1463 -5887
385 -5887 -5806 2107 6454 1993 -5977 -5191 594 6395 3446 -3316 -5888 -441 5503 4446 -2591 -5094
401 -5094 -1584 4091 4348 -1669 -5194 -2350 3891 4767 -915 -5084 -3203 2368 4359 -30 -4442 -2997
417 -2997 2180 4715 1590 -3860 -3157 940 4407 1918 -2350 -3994 467 3758 3002 -2108 -3993 220
433 220 3247 2165 -1518 -4081 -695 2228 2398 -1607 -3781 -1676 2103 2824 -895 -2921 -2397 1831
449 1831 2848 -11 -3453 -2847 1982 3644 547 -2055 -1877 1238 3537 993 -2187 -2997 1533 3226
465 3226 2096 -2048 -3438 -1020 2401 2459 -772 -2033 185 1779 2312 -866 -1765 -858 2038 2243 -338
482 -338 -2440 -1546 2058 2011 -268 -2247 -1838 99 2955 579 -1976 -1497 1188 1338 -54 -1131 -2024
499 -2024 138 1592 325 -1564 -2225 -252 2059 1339 -1360 -1866 -544 1081 1465 -137 -1821 -1135
515 -1135 1204 1785 -316 -2788 -1215 899 1576 362 -1380 -857 782 1577 489 -1165 -1736 603
531 603 1270 812 -1371 -1913 219 1686 881 -716 -1832 33 761 801 -563 -760 -51 1117 1018 191
549 191 -1402 -835 -72 1418 -380 -1867 -1224 1354 981 -121 -1321 -1428 -733 1018 763 -1185 -1106 579
567 579 1079 -716 -743 -1306 162 2453 630 322 -1497 -622 698 501 48 -774 -591 348 1015 -629
585 -629 -479 -1307 1121 610 -204 -655 -1064 724 1051 530 -261 -2007 415 1281 600 -982 -1446 -322
603 -322 857 1159 -516 -1389 -607 687 1039 -582 -1511 -192 -68 2079 650 -1246 -635 972 1355
620 1355 -329 -1514 528 218 933 446 -340 -1488 683 1052 882 -427 -688 -128 1499 1505 -58 -931
638 -931 -1551 -22 1111 56 -1120 -487 -115 149 -895 87 -593 1074 813 570 -497 -415 292 589
656 589 1163 -306 -1182 -490 1002 1201 285 -448 132 137 -6 -1015 -518 -416 310 -129 -22 -932 -719 825
676 825 499 -600 -734 -173 149 598 419 -270 444 663 1026 -83 908 -787 -405 65 203 -266 181
695 181 -114 1113 509 -860 -1321 -134 492 432 -80 -763 -271 18 870 146 -512 -969 -179 556 49 -328
715 -328 -482 -668 778 407 -426 -1214 -91 507 832 -219 -231 250 -117 326 -720 -363 -791 214 642
734 642 66 26 653 -284 481 32 221 180 -287 388 856 -120 -296 447 -188 -15 -501 515 450 413 -246
755 -246 -352 -251 385 225 183 504 -963 -68 326 527 653 -881 -661 -154 -408 -506 -71 -286 -189 242 748
776 748 -282 5 -778 307 345 33 414 31 582 891 44 -373 -352 -568 164 -42 357 -312 355 144
796 144 440 343 -1048 693 88 -54 395 -830 -331 -280 389 -189 -219 180 -40 399 85 -281 -578 675
816 675 54 -745 146 -866 -551 110 -589 -484 183 -371 -411 663 245 -748 -730 660 -462 301 320 544
836 544 -452 118 360 -604 -118 -314 484 -114 -583 -785 83 214 493 147 -151 507 -182 964 -42 96
856 96 -750 -359 153 -218 327 46 -51 330 -128 150 84 -35 412 190 6 -678 1103 -308 -186 -336 -675
877 -675 436 -719 430 -366 -34 282 384 -192 -765 -186 136 371 477 -390 -258 72 -219 29 165
896 165 -625 -469 -138 136 -149 -325 -31 -428 -122 750 -23 -352 296 -650 -97 126 -491 -408 -382 933 132
917 132 -7 -272 -397 41 -10 224 1149 122 -354 -72 -77 337 -114 502 399 -219 -698 293 -27 418 404
938 404 543 349 117 702 -327 -737 717 -626 501 -430 -14 -256 462 442 9 -483 -383 160 513
957 513 352 -61 467 -108 739 990 -527 -231 281 -80 159 -115 74 1350 101 62 502 192 526 -500
977 -500 -355 -18 -64 -401 174 -227 89 -126 -264 334 221 492 324 -266 -159 -384 213 840 492 -352 343
998 343 -495 524 18 -250 1003 698 -761 168 -260 -678 -545 -98 815 -301 -377 -23 618 691 190 441
1018 441 -664 -29 95 -623 368 -1114 643 277 -475 -376 -122 -257 62 -133 319 -361 -113 758 388
1037 388 -528 398 49 -156 -195 -37 -600 172 -884 -481 -154 -216 636 -245 9 69 -709 200 -46 537 304
1058 304 232 -977 542 -106 610 137 95 -130 -896 -758 121 -177 -662 -418 192 119 13 -326 355 183
1078 183 967 814 125 245 -239 -252 33 -105 -279 257 -47 -70 -135 418 -218 155 -234 169 -204 -496 -304
1099 -304 -127 163 -320 -32 10 716 -499 245 212 319 -447 355 -292 301 -277 -112 -557 852 92 -277
1119 -277 -296 -991 -233 -596 -84 -55 -472 -511 165 1038 1134 68 -383 -558 205 269 -625 -223 131 -148 146
1140 146 -410 -333 -70 489 -422 508 -619 4 65 355 -253 -350 -366 -832 -1071 -224 285 -360 -672 -722 -147
1161 -147 -369 -150 294 -776 127 -7 -613 -217 735 -59 172 -115 -454 274 343 -71 -139 -224 -130 433 -137
1182 -137 913 704 1469 -1002 -891 -1021 846 -89 593 956 -295 648 2 -379 52 87 266 -564 -63
1201 -63 -759 -102 -150 473 360 -370 -104 112 110 -439 138 178 -377 -78 748 315 -133 -351 731 -558 -879
1222 -879 127 849 -156 -180 575 -162 -416 145 78 -250 248 193 -60 198 1105 -779 385 38 -1203
1241 -1203 -87 150 156 -64 642 817 1000 340 -378 275 -283 25 -373 -90 147 19 318 126 890 403
1261 403 121 -1276 710 -291 254 516 -213 328 -203 237 380 349 708 889 65 78 -258 574 957 361
1281 361 -169 -631 -70 157 572 484 481 170 274 322 -305 281 -851 86 -262 133 102 516 -26 662 -157
1302 -157 256 332 -206 399 619 -667 276 -37 -103 109 -455 -595 -504 -145 -687 -246 -330 -61 -235 -691 345
1323 345 -74 265 179 -265 -266 198 49 -147 -663 88 -777 -631 -400 517 -357 511 -966 160 1279 -188
1343 -188 -5 664 745 315 -360 561 395 -343 140 -63 -461 53 -420 25 340 -140 82 -611 692 -215
1363 -215 6 150 507 791 629 -372 77 124 -63 59 661 230 240 872 -55 32 70 348 -289 -122 628
1384 628 -60 -512 -332 80 431 -369 -421 471 271 194 -151 521 510 792 178 52 229 -347 536 616 -183
1405 -183 677 498 -514 70 217 -136 -188 427 -12 300 77 -213 455 1012 377 -382 336 -874 -341 -146
1425 -146 -111 503 14 -31 -194 167 416 -494 148 742 139 -423 248 -339 -970 -206 -253 -605 338 748 -498
1446 -498 -297 -20 -277 -106 50 -62 68 -168 376 -20 400 -57 534 -31 102 -236 25 973 374 96
1466 96 286 223 326 208 556 -51 132 134 -659 -1116 -608 -13 517 -122 -90 162 672 184 -507 -31 365 650
1488 650 197 -801 659 341 -81 94 -777 752 -249 553 20 -767 -725 -129 318 -582 -131 480 500 305
1508 305 -296 -440 233 162 -614 72 347 125 -323 405 347 102 -242 45 383 -331 133 -175 490 513 -56
1529 -56 -321 251 359 640 -123 -240 -383 155 388 -80 237 95 463 515 -236 -26 602 -699 -19 -153
1549 -153 -353 -131 187 328 166 265 -549 -19 35 -407 516 294 -672 -226 -194 632 -11 1275 -467 -275
1569 -275 672 -58 769 511 386 599 -256 153 525 -556 273 -502 174 -227 -91 18 -766 395 24
1588 24 -463 -255 479 -212 -510 -203 176 -581 -422 -370 319 127 -631 196 274 -384 263 104 141 210 -642 322
1610 322 82 -129 609 175 -978 378 -568 -101 78 86 -42 285 189 -170 194 -204 -50 -748 189 483
1630 483 -503 163 640 182 484 125 -246 -582 -704 -1095 154 -110 349 -69 228 -653 -137 594 -489
1649 -489 -166 -303 -536 286 443 -271 -366 -200 -179 -394 160 -150 -78 -162 -815 130 -230 -127 1100 656 -133
1670 -133 715 -820 131 1177 443 171 21 232 568 327 -556 448 -361 823 312 75 -47 448 177
1689 177 365 -515 -448 -494 157 713 205 -195 -72 -248 -689 334 787 1107 385 142 285 841 400 291
1709 291 196 -244 602 -363 -296 286 -156 -272 580 -521 -540 440 -1068 756 424 473 315 -272 511 205
1729 205 385 250 575 -558 -448 -477 51 -86 347 -251 372 548 -223 190 -63 354 -391 -367 -594 12
1749 12 68 -325 -855 382 502 240 -405 -438 688 874 -480 224 550 154 -296 -696 194 -340 600 -976
1769 -976 98 316 25 1007 390 373 -22 210 545 584 -347 -308 507 238 -148 -1038 252 -385 -533 74
1789 74 97 -582 -501 793 177 410 301 -1022 -990 34 -415 -424 -358 288 124 -422 -155 384 199 485 -281
1810 -281 -421 -408 -230 482 -536 284 594 465 -462 108 240 -462 428 -315 160 -15 -332 76 -299 199
1830 199 720 725 -74 226 517 567 -333 211 502 -18 203 197 -125 -49 -442 -29 170 431 -61 -883 161 177
1852 177 -184 10 149 876 -54 -883 -644 540 271 -1184 -78 9 -335 282 238 131 17 301 -82 221
1872 221 562 113 -446 -112 -221 187 61 506 76 -537 581 95 -53 -52 39 -989 -818 -386 416 -1164
1892 -1164 242 534 -573 260 -38 -331 -90 -147 568 -291 758 367 45 -899 -56 958 -258 -226 -493
1911 -493 213 -569 34 635 -305 -53 486 -228 -850 -407 82 -271 467 -81 -454 88 -179 -655 279 -844
1931 -844 -15 599 346 216 272 -77 599 35 -618 24 39 272 130 -107 88 613 -386 284 -428 -1024 -255
1952 -255 -481 -473 -544 655 531 156 251 125 -598 147 73 -52 443 -27 36 126 -363 -517 -257 -20 -353 642
1974 642 -798 -488 255 19 367 -158 397 -280 -852 -333 -398 -236 -250 -304 837 391 348 542 350 -465 97
1995 97 655 278 -313 -65 -71 211 32 -124 -666 124 176 -233 21 -3 404 676 -494 -506 94 70 581 -541
2017 -541 -703 638 -332 -174 38 262 129 4 384 -533 184 758 -413 -311 -482 312 119 -161 28
2036 28 76 309 165 530 -950 -266 16 -362 151 657 542 720 -178 -341 367 -882 51 441 351 689
2056 689 1072 475 636 -519 645 97 -31 394 203 93 -5 -639 -67 -229 -552 641 230 175 -258 621
2076 621 -256 -707 -457 -412 -66 -340 -529 -534 -78 66 101 529 264 331 -145 370 145 279 97 74 -522 -676
2098 -676 -285 -43 838 -49 16 496 -110 -571 -249 236 510 493 -486 566 349 1187 -430 -97 570 -527
2118 -527 778 369 -932 -293 255 70 86 -62 -199 -459 47 70 -72 -39 -192 750 -25 -719 -287 24
2138 24 -164 -295 -519 -304 668 -373 -38 172 45 -400 -521 -53 295 133 377 -85 -106 -886 -37 601
2158 601 -98 554 -73 727 -78 -96 -366 -77 -220 -36 182 78 244 549 -258 -263 50 -821 -262 -229 -136 11
2180 11 -3 -281 60 -944 403 -513 -23 54 214 -192 87 -432 -646 53 -77 -615 522 357 0 -516
2200 -516 102 503 -146 -330 -60 -207 -210 -374 523 9 -525 -510 -183 -484 -13 -541 -848 -167 988 686 246
2221 246 349 157 -87 -209 -656 220 -329 -304 -748 -23 147 -54 -367 317 155 234 -499 56 354 7 -38
2242 -38 -790 164 -91 51 111 71 -715 134 472 -419 -353 228 -247 68 155 -298 -197 -158 -733 -486 20 -818
2264 -818 234 -143 328 604 -468 -7 95 1009 -299 81 -823 -866 50 181 838 -571 -29 -210 -8
2283 -8 107 -203 203 -354 14 -425 -431 333 -288 -177 -766 -30 61 268 -15 -3 498 -471 -986 -454 -643 -259
2305 -259 -229 -1163 -83 -830 668 149 -464 -37 -363 -470 -810 -55 358 83 81 11 -557 -384 42 -876 -256
2326 -256 90 283 390 232 473 447 453 860 280 -172 -325 349 340 -683 218 210 -58 -155 79 -248 203 -79
2348 -79 -613 468 38 -788 60 -226 -916 133 -914 41 -423 38 885 518 -263 346 -136 480 618
2367 618 -775 186 -802 91 -475 141 17 -87 -606 177 722 400 -200 103 -983 -723 672 -592 -150
2386 -150 588 -256 -391 550 -369 645 -258 -66 538 -127 -89 -143 217 451 12 -668 144 267 305 80 -266
2407 -266 -748 42 72 -313 36 -306 931 -559 315 21 706 329 102 -121 -418 1195 438 910 -33
2426 -33 179 -901 -430 -128 369 -192 -714 -316 -357 -82 323 206 -11 -24 288 -215 -306 73 -77 69 67 126
2448 126 186 952 -241 557 268 281 896 436 -381 -767 -688 -384 69 -51 -397 677 -937 62 -470 642
2468 642 25 -522 249 -900 -515 464 -468 897 -477 -701 319 523 56 180 565 14 782 903 -364
2487 -364 -882 -12 369 670 -392 378 26 -49 314 -142 15 136 377 -613 -42 737 -217 -236 -79 -1139
2507 -1139 496 201 133 490 8 151 514 96 -818 -363 -485 -2 362 -6 106 -214 -471 450 289 -873
2527 -873 -582 -744 -888 -411 559 160 414 22 444 84 944 -535 225 -43 -672 -664 313 210 -646 89
2547 89 -414 888 14 -1186 501 682 389 -471 -189 69 -648 12 770 326 32 -11 1009 364 -21
2566 -21 -358 -267 282 -148 71 66 -249 251 264 76 -137 -426 548 -698 366 -174 107 -757 236 574 94
2587 94 -740 195 238 426 -314 312 113 -481 672 -297 -359 -78 1015 -385 -131 450 -158 581 329 621
2607 621 -442 -237 -52 -166 -267 -405 127 119 -143 -1397 286 558 248 132 -500 932 561 387 144
2626 144 413 84 -455 -344 305 -727 -160 -31 -404 125 -99 103 319 128 -25 -351 83 -381 1336
2645 1336 72 -333 -423 117 723 14 -817 -137 451 308 -384 440 93 765 -124 -129 -142 29 1059 -198
2665 -198 -906 -38 -27 -595 -64 233 -550 -202 -336 174 218 -404 485 445 97 -526 -296 -171 -114 342 851
2686 851 -10 -646 -728 194 -195 497 -377 -423 164 84 -512 -337 78 -740 -669 405 44 532 362 399 -75
2707 -75 -234 -654 88 708 237 309 -248 -19 615 -509 -191 -204 -255 -465 588 77 163 -117 -495 571 505
2728 505 82 303 -567 -115 112 -506 -298 -659 725 -328 914 -293 114 63 390 104 -294 76 171
2747 171 29 317 -123 -496 -198 363 -226 616 -577 54 652 -185 103 -58 -773 -346 -367 28 473 648
2767 648 48 7 617 -698 -121 -156 467 830 103 174 254 -925 860 222 236 -10 23 -118 -31 2 515 -789
2789 -789 317 -249 -572 132 327 -556 -79 129 -252 -465 -22 15 -574 226 454 -134 483 86 41 -404
2809 -404 143 152 -384 -871 -666 777 580 500 143 -406 -280 -483 90 189 -360 236 -608 -421 279 633 -116
2830 -116 237 1175 -52 258 -67 40 217 810 409 136 -347 13 561 199 -527 747 -155 324 -495
2849 -495 726 174 21 -269 748 -115 -401 -127 -563 -409 708 -428 -219 -72 -368 -319 -146 137 -81
2868 -81 501 63 816 97 -285 277 -703 433 339 -623 -62 395 507 234 -757 -201 317 68 822 365
2888 365 937 381 264 105 129 364 -155 727 215 -132 152 -1067 -458 -147 -54 -73 -83 -241 485 -408 -87
2909 -87 -1028 -214 -486 700 44 490 -25 -445 124 -159 454 -5 -981 174 -1005 712 979 -1204 -181
2928 -181 -617 -575 -163 -463 -57 -66 508 -361 536 -637 86 -80 -601 -205 527 717 308 -303 -367 -411 295
2949 295 52 -26 -397 -625 552 -405 -49 -649 -98 814 367 -100 -541 -406 369 86 515 -141 258 -648
2969 -648 -511 98 1199 393 -355 -114 -301 -96 -156 -141 -462 -527 -248 498 113 304 -261 636 203 64 -73
2990 -73 -286 382 286 800 -380 -170 135 81 -110 179 7 -510 -30 -316 564 -291 -142 126 190 463 244
3011 244 106 15 16 414 371 224 818 -325 181 221 53 -1084 -40 -306 -206 623 117 575 402 75 -41
3032 -41 50 -332 716 -549 -13 524 -220 -262 -286 307 295 657 -352 -73 148 -223 -462 -495 48 70 -511
3053 -511 -202 -953 416 525 492 -312 883 333 780 613 98 533 581 166 -83 -129 -395 135 178 -252 588
3074 588 238 -45 504 589 905 -289 103 -912 -189 136 -722 -325 -319 -517 -310 -2 657 -206 -462 -180
3094 -180 251 495 -878 -37 -528 1085 397 -448 -733 86 -838 995 153 98 -664 -86 -462 156 237 -671
3114 -671 846 -405 153 -466 -123 -359 -53 620 475 -680 -832 741 -268 -131 1070 248 -40 94
3132 94 459 178 90 483 426 528 218 -424 71 -120 -346 163 -707 -54 614 397 27 -25 -5 -202 172 297
3154 297 -478 -384 360 -241 -165 476 -30 358 297 1020 312 -877 48 259 819 -479 -458 -717 50 80 278
3175 278 -479 142 -718 430 151 104 336 832 87 72 217 532 -57 888 -6 -1216 130 -672 -426 -199
3195 -199 -621 699 -802 -130 363 -387 344 -176 582 -15 -218 -517 -96 -165 -534 119 -1 389 116 -751
3215 -751 -2 -628 -456 -233 198 -642 857 162 -521 -12 346 215 752 -490 21 498 -213 63 437
3234 437 312 102 1099 -991 0 379 9 -553 -532 505 208 -87 -1121 -101 168 83 -72 585 140
3253 140 -770 -880 -559 436 357 -125 854 -69 685 164 211 -210 183 530 -565 -392 429 -80 -325 -379 61
3274 61 154 281 -174 354 -8 -676 455 -372 276 -274 -34 -283 -354 -877 208 -792 -24 514 -300 -735
3294 -735 330 894 -769 -530 811 675 -1076 -75 -87 452 -572 656 58 150 559 -315 378 23
3312 23 853 -11 -450 -582 194 648 -1000 -258 -298 928 -469 140 -147 -174 141 -752 511 -339 309 245
3332 245 -273 723 55 -313 -57 325 -493 6 208 -70 580 -1204 193 -192 -123 150 -207 313 49 -321
3352 -321 -274 -506 311 6 -295 588 -363 236 -463 -258 -18 -513 -71 -475 -139 -125 273 353 -373 521 201
3373 201 -224 -498 479 298 360 20 286 204 734 -344 284 -282 685 -413 -388 -29 -223 610 -209 311
3393 311 -147 -158 -288 944 718 -1140 -623 338 313 -830 1051 -752 87 79 -93 769 -715 -730 27 384
3413 384 -127 -239 962 -740 411 716 -54 11 184 91 474 4 -80 -298 -213 270 -477 77 333 -125
3433 -125 -75 -758 277 166 -467 -183 363 -393 21 269 -25 -226 -140 30 182 216 602 -612 -523 977
3453 977 568 -331 279 -339 507 427 -370 -648 359 176 202 758 -255 -288 687 101 1166 -127 -423 938
3473 938 -707 265 128 -808 -107 -156 27 -18 -147 -237 350 306 290 -534 431 -233 -760 223 -166 1367 1002
3494 1002 -1518 -258 584 -67 -184 58 248 39 654 -153 997 -498 327 442 123 -126 111 258
3512 258 -837 -880 646 722 226 -897 -237 333 61 172 -283 186 -1238 -250 -432 29 53 -327 -293 429
3532 429 -559 -265 -738 -17 -305 -311 -568 195 293 468 15 -406 154 295 -59 -152 -446 669 -120 498 -396
3553 -396 24 1196 -724 514 -118 404 -210 -523 244 715 502 -169 -246 -828 428 -738 -255 311 -373
3572 -373 59 389 86 737 69 489 -44 147 69 145 -20 -684 864 236 777 -123 -85 -290 168 -1092
3592 -1092 -134 601 304 -48 -590 517 -503 -173 -138 -53 189 719 -267 196 -356 -141 230 -173 -411 742
3612 742 548 -429 513 -343 296 -50 -144 -180 4 81 252 482 -451 -31 -557 605 125 -396 224 -129 -27
3633 -27 858 -645 -274 -521 -118 367 126 -285 -77 -478 -598 67 673 122 92 -332 524 251 273 -327 322
3654 322 -221 759 -223 -130 375 189 -480 970 -159 -191 -362 827 -59 -250 280 -612 423 -70 -9 94
3674 94 423 148 50 66 389 703 798 290 -240 -191 -35 282 -66 -440 -169 633 -128 71 769 -499 -202
3695 -202 9 -207 165 245 -529 -205 -174 -225 -23 205 -316 -1148 43 428 70 -160 -201 399 248 -37 -77
3716 -77 -104 -543 -795 508 188 -264 -201 -366 -441 -459 97 809 145 1127 146 265 782 -347 674 13 561
3737 561 -546 720 710 -612 600 123 496 437 -48 -215 -98 71 -209 397 -407 758 1074 278 38
3756 38 -80 656 -90 -363 -340 -121 -170 497 -311 -279 -427 543 374 -497 181 -454 -455 431 -235 -144 -49 -167 -127
3779 -127 -151 511 325 -264 -585 235 -104 161 177 53 -763 -635 22 -260 244 -131 -401 -179 118 80 -1176
3800 -1176 963 -99 69 -147 503 -311 631 48 163 8 -366 287 -253 400 514 147 185 252 -611 -808
3820 -808 204 389 147 -146 623 174 594 -38 86 -114 -571 213 316 -159 782 -1701 501 -442 -226
3839 -226 -176 740 -123 401 708 371 240 -232 297 445 128 391 1112 320 686 84 100 648 102 414 172
3860 172 -349 57 -441 -401 -335 507 418 -77 -121 475 134 -126 217 -806 -360 492 100 -62 278 -259 -480
3881 -480 -486 279 885 -771 -225 88 -49 96 948 178 -258 493 719 250 384 643 -33 367 227 719
3901 719 -49 689 -38 457 -255 544 -237 323 457 -682 93 305 668 168 -34 252 381 741 536 246
3921 246 129 539 753 219 -124 100 -136 -525 -615 -308 -197 447 301 423 -398 -326 -595 -374 -809 -56 -26
3942 -26 149 179 340 -460 4 498 -599 454 595 591 -576 -572 -375 -168 342 438 50 320 -1046 -626 279
3963 279 -776 440 678 -272 627 60 484 -600 -866 -244 886 -728 -1037 -100 -65 414 -418 -530 208
3982 208 107 72 -219 -666 495 951 289 -35 -136 -174 -1023 101 -64 -211 -209 82 -377 -517 -788 152 -105
4003 -105 491 655 -605 431 334 -69 -210 -113 581 32 479 -827 -270 624 393 -34 369 228 972 -522
4023 -522 -851 306 129 192 -944 88 -877 -78 158 -131 -56 -224 89 413 -7 41 -488 -449 221 -164
4043 -164 596 282 -172 1128 -165 -299 -235 382 -510 -423 -970 -330 -94 512 -157 -221 18 506 -755 64
4063 64 585 -76 -76 -376 -592 142 340 -407 284 -264 -662 536 303 -767 -211 234 404 -208 161 180 615
4084 615 -329 429 -363 89 -241 -206 -933 -69 -539 -561 -53 27 755 -934 -587 -4 -382 482 -251 -395 144
4105 144 199 -643 -7 333 287 -620 -186 81 -386 726 479 -34 -82 -197 715 -750 455 620 23 41
4125 41 328 877 787 649 225 -93 -214 121 -146 -239 208 -431 -383 271 -325 -74 -211 49 -282 168 540
4146 540 50 26 -40 -768 -7 559 127 -125 -470 -544 -144 -730 -299 -151 -751 85 -136 920 337 335 -307
4167 -307 -234 627 -83 -311 -30 -252 527 -564 -489 347 -92 -207 206 356 147 7 -289 120 -267 -558
4187 -558 -409 -68 223 588 613 -765 149 -150 611 -481 125 -30 -292 -334 -134 -999 333 -220 112 -722
4207 -722 -559 -186 -293 20 -82 519 -233 77 206 555 626 399 -87 1021 872 -378 53 715 117 76
4227 76 -752 -89 -88 356 232 38 380 -621 862 868 126 -1236 201 511 172 -590 -158 98 147 -444 822
4248 822 -349 -598 -140 -929 89 -30 695 153 165 657 748 739 27 174 -473 20 165 1073 120 -218 116
4269 116 326 608 -536 573 -190 -83 -62 -424 111 150 -126 51 731 -240 611 224 -244 172 735 -389
4289 -389 -74 -157 -252 -55 550 -262 743 322 -71 94 -709 295 -232 -301 192 261 -44 127 240 245 32
4310 32 -62 -62 -59 -296 -744 -599 64 208 116 494 -282 -62 -435 -231 -177 442 187 168 739 144 106 -429 368
4333 368 -155 549 -590 131 207 -371 -637 92 199 351 124 -458 523 -207 -579 -93 -104 372 -100 329
4353 329 245 -477 838 -73 121 163 -914 590 638 -633 -189 55 99 1060 637 681 170 187 -490 -798 -501
4374 -501 811 166 -2 -338 439 528 -375 0 3 -351 -432 250 350 -275 -123 -3 -219 444 180 -270 816
4395 816 243 -73 -235 294 248 390 -354 390 -177 -618 76 -81 58 -331 278 -549 -569 437 -341 -9
4415 -9 -139 -387 723 112 -89 629 32 57 27 -51 -183 -302 242 1 188 -336 -895 415 -112 145 530
4436 530 593 -343 522 748 278 -229 -1038 -215 306 312 511 -267 325 -190 -197 -160 378 552 18 -114 909 291
4458 291 308 -7 -698 339 401 91 151 421 -76 425 310 613 -286 33 -123 -435 482 461 -577 -196 380
4479 380 -102 -958 -265 -639 439 -285 -760 835 -141 -92 714 692 120 110 724 -242 522 352 -269 378
4499 378 -1003 -270 -445 -402 764 565 280 -378 -100 -24 462 272 -533 435 442 -614 341 223 1 432
4519 432 439 79 137 19 335 -755 -472 250 -22 528 334 382 584 -949 -457 173 71 146 -76 -345 410
4540 410 905 -135 492 33 591 -303 466 -489 -699 -181 -416 -68 -570 -534 -18 -211 -277 -915 439 18
4560 18 -3 66 271 -611 761 722 325 93 -96 286 -52 -227 -210 -191 597 44 -426 -432 316 -46 102 753
4582 753 -237 464 -375 -519 -210 292 -121 -29 -315 703 -197 183 10 434 -947 124 781 -67 571
4601 571 -617 83 -160 -626 221 -823 -680 443 166 -483 114 -220 343 -895 -629 419 -602 317
4619 317 -463 -496 219 -462 455 -463 252 -443 206 -230 -911 -205 -543 -104 -60 359 -1 212 558 -213 185
4640 185 -718 -438 -185 635 -68 420 408 -1006 -598 -105 -410 242 -95 211 40 -187 -68 -66 -112 -303 97
4661 97 -31 14 -645 -25 39 -182 -876 326 -103 -541 -242 210 242 -18 126 -82 585 -795 -19 89 704
4682 704 408 -329 111 494 -348 402 -448 654 263 202 -1061 -707 -340 -608 -53 37 -505 -17 -177 184
4702 184 346 183 15 77 -7 112 -718 449 89 -607 -549 1 -889 353 -79 588 336 -587 244 97
4722 97 -272 630 -202 -28 -218 471 -266 -427 201 -524 131 -140 159 322 -36 409 602 -962 531 818
4742 818 120 -181 -410 142 456 -491 -117 -32 -96 760 -299 295 170 -332 10 -55 39 363 161 -437 -259
4763 -259 -312 -87 309 -275 891 -403 858 345 251 -402 238 452 251 275 402 -332 463 -693 615
4782 615 -19 -327 470 79 411 197 417 -571 243 -632 789 40 530 -228 -228 860 669 -491 -258 -329
4802 -329 -171 188 -685 -168 308 593 -561 96 -136 82 -7 -568 -53 370 -54 120 329 547 737 -380
4822 -380 -137 -307 -110 -580 -273 36 220 -16 -17 389 -101 -588 232 -527 -619 213 -508 372 -449 359 -595
4843 -595 -658 -402 -388 -211 -29 577 337 -49 337 -571 779 -230 683 437 383 -176 0 692 -153 625
4863 625 240 68 114 -532 254 -478 1005 -22 -39 -1091 -423 279 296 466 206 -275 60 766 147 -358
4883 -358 324 -565 233 158 -561 -179 264 -271 -959 -656 520 -304 795 291 541 51 353 -486 -335 1054
4903 1054 162 -678 728 305 -129 615 267 178 -248 -183 195 -354 113 480 43 -428 -400 471 -106 -584
4923 -584 372 647 -639 -98 -162 67 113 334 -800 683 979 -149 265 -86 -469 1248 246 120 412
4942 412 331 608 -414 -299 -680 -109 333 1065 232 1077 6 -239 458 -417 23 165 572 582 -610 -257
4962 -257 1053 480 -55 366 -507 35 -595 452 -348 -709 40 -63 386 -772 591 -203 -40 466 104
4981 104 552 -634 290 212 -197 386 -24 466 -603 497 -207 390 -65 335 55 482 -149 6 272
5000 272 319 705 681 -432 -127 367 -32 322 950 319 571 345 -538 107 -546 201 -344 91 -25 30 460
5021 460 -555 -57 -356 -569 713 290 -659 -294 619 -160 151 -592 517 -230 -533 339 420 -327 402
5040 402 584 -317 -527 -319 589 -13 103 197 654 219 -231 604 -471 -600 -291 -182 -449 53 82 166 880
5061 880 843 -49 76 258 -87 502 -517 -306 -95 -234 101 419 169 670 337 786 -165 389 -325 38
5081 38 -991 -300 221 -555 -400 -73 -335 -94 -698 120 1081 107 157 -891 -128 -25 -568 -238 352 -595
5101 -595 391 -200 728 397 -89 -103 818 -374 -453 -615 -75 -582 -153 202 -174 1004 34 -63 -248 -71
5121 -71 153 -308 -470 -123 166 -474 350 -27 81 33 321 335 -1231 184 -823 -403 -6 331 584 26
5141 26 -476 -380 135 533 326 -675 -202 -97 99 -143 -518 406 -1345 -883 839 -59 -382 -344 144 144 -324
5162 -324 465 686 -104 -578 95 -172 -480 -369 1188 -369 121 -2 331 -273 -174 99 -718 303 638
5181 638 407 -205 381 291 -264 -456 -662 421 116 160 212 50 297 224 885 -888 389 122 219 681 217
5202 217 -774 265 -251 497 250 91 -527 283 -215 -44 274 -117 -12 -766 -155 -465 765 -1013 324
5221 324 -326 -452 -334 -195 -186 -167 -114 485 1129 122 -181 -168 -707 -343 548 854 118 -452 -750 -186 81
5242 81 -270 802 -196 234 433 -391 -485 441 -196 -328 463 -164 -198 159 101 323 -636 -533 -154 -569 354
5263 354 -281 294 -115 117 -358 233 381 -127 86 462 -63 324 -443 203 91 -460 719 329 387 -76
5283 -76 -350 -834 261 252 388 -99 356 36 214 -31 -199 -89 425 43 -34 -132 -311 -721 54 -271 194
5304 194 -64 -177 -76 802 81 -627 -226 -124 -296 502 375 12 -213 -441 265 61 -324 5 318 634
5324 634 367 670 157 538 -405 -174 -388 -281 -309 283 140 -70 -285 328 370 191 655 -347 -295 -379 -719
5345 -719 133 365 192 -707 426 217 -670 -325 -10 -572 -652 81 -751 -311 -400 502 -250 -54 688 -548
5365 -548 198 240 667 850 -499 -620 109 -248 -244 -79 722 -99 423 593 -1305 -528 -655 201 1015 287
5385 287 -868 -693 272 -311 264 193 372 642 299 31 233 253 -500 1052 259 182 -6 -41 178 -309 -63
5406 -63 -15 99 716 -292 0 -248 -429 282 274 850 460 395 -92 356 -58 298 -136 -76 -109 -141 124 -253
5428 -253 346 -209 -1028 39 -85 303 346 230 182 -174 -107 -70 88 191 44 408 -1 858 -139 -514 -254
5449 -254 233 -1057 65 1216 691 753 -632 -476 -64 22 367 550 130 -78 -343 658 -231 -352 146
5468 146 290 900 -411 648 254 -81 364 -170 343 -919 361 -496 39 -210 123 427 -748 -438
5486 -438 67 -82 207 211 145 -497 -105 -407 -27 -245 -476 389 181 -1206 -451 -423 675 439 171 -180 -987
5507 -987 302 400 473 -518 -284 -43 23 -455 -372 604 828 -80 101 -238 -514 27 714 75 257 -287 619
5528 619 -75 -83 -703 -44 91 352 -54 364 397 63 949 251 320 51 -91 -795 355 -1375 158 -214
5548 -214 238 -254 -76 203 179 257 -223 189 -876 49 -309 -1907 19 193 186 354 -713 -300 -435 140
5568 140 -393 -55 193 242 384 385 -123 -363 -112 -471 369 353 560 794 -19 25 683 -69 522 -399 -635 216
5590 216 -147 196 644 -91 -520 -279 -387 369 770 -84 421 19 63 -260 -231 -736 -73 -148 110 399 -652
5611 -652 60 145 295 -372 121 547 499 573 538 174 -278 362 332 -259 457 255 560 -68 -126 -2 -418 585
5633 585 350 463 -259 -744 275 -647 36 258 -139 572 -286 664 -399 -31 -217 671 141 614 17
5652 17 618 469 268 736 902 -17 697 74 351 930 515 82 263 601 364 726 46 680 -705 -294
5672 -294 -496 -211 -150 552 -318 -957 233 634 279 37 347 -101 187 332 -802 543 -21 132 451
5691 451 77 90 800 577 -166 -303 1006 -628 -27 895 -205 611 -105 -305 -112 549 -611 414 885
5710 885 -775 13 -598 -224 356 -220 138 -2 459 -995 80 -202 -303 -337 336 -29 -367 -444 -184 -311
5730 -311 -97 -784 -665 -71 636 461 -440 577 273 -422 -489 -309 606 -267 -61 296 -183 844 -441
5749 -441 771 730 -466 -729 364 -645 114 338 -1 -377 -542 -277 255 -152 509 -605 -96 -221 -357
5768 -357 -719 133 407 -11 -865 60 156 238 287 244 163 753 -403 -478 -901 -201 -444 -219 455 -13 -99 -535
5790 -535 913 -490 45 587 241 -598 -312 321 -31 -22 -78 301 -185 492 -339 -716 1348 8 114 -140
5810 -140 237 435 1016 -602 -128 47 -115 174 184 -287 -269 224 -116 316 314 -299 309 -190 -197 267 389 319
5832 319 -225 577 -419 -621 430 240 1084 259 -804 538 -789 -232 -545 89 488 -267 313 454 -175
5851 -175 27 -621 493 -191 288 413 -143 9 -737 526 -562 -52 317 133 27 -307 -428 447 338
5870 338 41 241 167 -640 435 -33 2 695 -421 -81 -183 464 -38 -318 -412 -43 349 -136 228 -46
5890 -46 -171 801 562 -173 -245 -811 144 354 890 491 -443 346 149 625 454 -613 -477 -120 664 -424
5910 -424 -606 398 833 -182 696 -496 392 540 325 396 419 -207 -735 -503 577 245 444 172 356
5929 356 -597 -304 471 -268 -461 224 387 193 1444 -1 -103 181 -303 -415 174 -288 401 25 -216
5948 -216 358 -43 98 237 -828 118 -284 740 -275 -201 -213 444 -390 474 69 165 108 33 -754 -183 884
5969 884 -478 8 76 -351 -214 -283 461 -3 342 546 -251 344 -372 953 288 425 -31 167 422 909
5989 909 -838 240 -529 -948 -508 -59 -145 -402 426 506 509 -508 78 -499 314 745 281 -835 -265 -166
6009 -166 364 1059 469 -299 266 957 -30 -1189 -93 -225 59 217 209 1028 64 -863 82 -230 -388 -90
6029 -90 689 694 -700 -194 38 -233 64 133 -5 833 187 99 67 -345 176 -202 510 212 177 190 -183 41
6051 41 -135 440 -1031 66 -129 196 -532 -129 500 -344 292 -65 78 281 511 -332 581 549 155 276
6071 276 55 16 -461 443 499 132 635 -150 484 -9 934 -169 99 375 175 107 236 -498 -104 -133 -821
6092 -821 78 363 -228 351 -257 -527 160 690 -222 -221 495 -1057 -311 796 -188 961 -110 -427 -684
6111 -684 18 -90 147 632 455 -742 174 180 128 -106 -171 -510 -63 -589 648 -103 -153 223 -79 86 496
6132 496 508 452 377 -965 -482 -410 -374 331 3 -51 -518 7 -94 250 871 -88 260 -544 72 -510 322 568
6154 568 89 -219 23 -69 51 -16 -609 262 799 -88 -36 -518 276 411 49 416 -82 682 -333 -584 -1024
6175 -1024 -147 466 735 3 -361 601 267 183 -532 37 -879 142 692 -660 -725 148 -481 -127 -238 209
6195 209 -452 -176 -415 289 -556 -261 -14 -13 266 571 -147 411 -1040 -294 196 -498 132 271 77 134 59
6216 59 729 734 24 257 -478 -62 351 442 220 -489 28 -132 141 -102 170 154 -199 -744 1120 261 -675
6237 -675 -847 -157 389 -16 591 -24 -614 -334 865 627 -311 526 -151 197 570 -252 395 -670 -408
6256 -408 598 -221 -312 -446 279 482 -123 253 -263 -24 -174 485 -734 463 35 550 29 -606 -138
6275 -138 764 -94 403 438 547 720 -775 -324 -139 -469 115 -649 237 381 572 105 -550 137 -814 -345
6295 -345 306 621 -467 97 -243 -168 820 -250 452 224 -325 -403 -775 -1151 160 439 -223 -76 890 659
6315 659 -1108 -358 -468 588 -945 -292 190 1040 684 207 70 -31 349 -663 -797 354 655 669 222
6334 222 -303 127 -453 -266 -1232 -43 349 338 4 896 359 232 749 -554 -308 -115 986 59 374
6353 374 -154 430 48 -432 514 356 59 200 229 -159 -244 -214 200 275 -198 -453 18 329 652 876 -616
6374 -616 120 -907 232 285 337 109 -405 -258 -509 772 -509 -35 -363 -140 794 404 386 379 271 95
6394 95 173 42 109 -135 -342 27 -292 -445 411 649 -26 43 -1420 -1551 -98 84 513 461 560 -728 -464
6415 -464 306 150 54 -300 -96 93 -297 178 813 611 116 -48 351 -405 52 199 132 -68 820 -997
6435 -997 -36 441 -148 178 -881 -122 287 -337 -498 -22 -913 1219 -220 61 147 -224 120 254 -262
6454 -262 156 -581 -283 -283 -48 -266 -710 -893 -381 -704 -858 -467 -558 -539 -636 -337 510 216 62 336 467 -224
6476 -224 771 213 369 -819 785 354 -459 -115 182 86 -403 56 -19 -217 339 251 -45 630 185 -373
6496 -373 -390 193 39 -93 359 -355 456 444 -152 -254 -673 990 -129 404 224 -325 -617 -966 -103 -249
6516 -249 -633 136 25 -637 39 -120 -370 250 -659 386 -24 -201 -765 254 65 419 6 -204 15
6535 15 -554 728 314 436 359 -514 -395 -163 334 164 295 304 357 604 682 -894 170 -459 346 483 -472
6556 -472 653 -4 -415 -373 194 209 123 241 380 -206 155 -141 -829 514 28 778 -756 -74 -462 216
6576 216 556 221 373 154 64 446 481 -1074 9 57 -214 -1017 972 -472 -202 799 -18 100 -38
6595 -38 429 -653 -681 222 686 -102 217 279 61 255 -661 365 -356 -246 253 -17 418 -188 -134 261 -558
6616 -558 -120 -104 -129 -364 -388 348 290 -47 345 60 -339 386 -384 303 -243 19 585 -93 306 961 105
6637 105 -325 -319 -517 -350 98 303 -140 219 -236 370 -896 -628 -336 -50 657 347 85 -711 -64 228
6657 228 -83 1014 319 13 247 -3 -145 -59 -119 856 -329 720 -926 -367 -219 161 12 -325 519
6676 519 65 79 650 414 558 -206 69 191 -35 607 -257 -30 -227 290 0 322 36 358 -267 -429
6696 -429 -851 140 1149 -210 -348 89 212 -330 -436 -460 -514 -377 328 -1097 529 210 229 311 4 -188
6716 -188 128 -620 -333 191 -1363 -441 133 -269 -414 269 -301 -25 -614 616 -589 141 248 -148 -654
6735 -654 -1260 350 101 -1102 -362 -199 658 -88 -238 475 495 159 -237 197 -443 -254 399 107 -106 185
6755 185 -245 96 -423 -1189 193 -337 -135 -454 -222 -890 550 594 -414 -40 39 335 846 -63 93 225
6775 225 -16 353 -921 64 -377 395 -485 672 162 -405 -223 608 180 121 -328 860 -206 14 182
6794 182 -447 -323 -854 -52 233 410 -309 24 609 122 124 -288 457 204 -552 617 -174 451 564 514 -72
6815 -72 -496 828 -76 -222 -310 -241 831 112 990 203 330 1243 363 25 -264 -281 -118 38 531 170 220
6836 220 424 -835 171 -414 -907 772 230 292 -110 -365 -786 -110 395 -198 -621 -290 -416 -297 281
6855 281 -315 372 -281 -504 -415 -239 303 -660 470 -35 331 -105 -115 -474 702 629 514 -103 433 -20
6875 -20 668 519 -1 -864 -298 -60 -73 681 167 -28 -295 614 -150 328 -1232 590 282 -476 5 440
6895 440 296 123 312 668 919 39 -99 -220 -381 -2 906 538 54 -471 469 594 481 -119 -468 -641
6915 -641 179 -651 1008 -594 -780 -694 -36 -375 -127 -1030 -56 -73 264 -446 -404 -467 375 382 -393 361 114
6936 114 -121 28 264 182 361 -450 -276 -101 -671 -220 -320 57 -418 -102 -247 -57 -433 -231 172 -5
6956 -5 -492 16 -32 -77 752 -397 -249 651 -82 -29 -219 -198 -7 -183 91 426 46 -195 175 -555 -293 163
6978 163 -504 43 364 -453 -254 361 146 -378 218 -367 64 -505 230 189 -228 420 89 -641 514 -325
6998 -325 407 145 -425 -184 -472 -224 298 -231 822 550 -305 86 696 -447 272 -70 339 -234 -108
7017 -108 -610 -8 83 509 -368 -11 460 -786 1165 11 -441 -347 -167 -163 449 57 187 -215 229 191 -333
7038 -333 -56 214 -204 -389 559 -415 36 383 51 -331 -603 196 -409 454 681 847 -337 635 -19 377
7058 377 240 -1010 -209 -66 305 165 514 -258 57 -174 -581 671 -558 52 450 -102 343 -650 495
7077 495 222 -293 359 -199 -223 90 111 -34 68 -594 437 70 -324 -26 -43 187 527 435 -340 136 355
7098 355 315 -157 -236 75 -514 167 -1115 -24 -604 886 -489 160 -166 335 198 389 272 201 1197 670
7118 670 969 -705 -490 103 1294 -479 -733 1003 366 182 265 517 314 375 -62 -45 437 -72 776 321
7138 321 497 903 117 176 -402 -840 0 307 149 -137 -265 -99 -63 108 -19 215 621 36 -250 556 403
7159 403 189 966 32 -273 512 392 -797 -95 -509 -357 773 -487 -82 -70 296 668 279 -690 -10
7178 -10 646 -288 -56 382 1260 -390 -79 -357 685 424 -210 137 465 -264 -787 -4 565 221 -521 -149
7198 -149 718 426 -254 597 -28 242 -209 -284 -561 -399 -167 436 -27 400 -302 397 275 591 -20 246
7218 246 200 -155 -160 681 390 72 603 -747 153 -352 -159 256 330 178 399 370 316 -428 -198 67 663 -806
7240 -806 -321 44 557 -91 -582 -376 -578 563 -281 661 434 79 -951 -130 -347 -222 175 -458 -69
7259 -69 224 -296 -743 -404 -247 -450 -126 -432 -178 1098 613 102 -523 -180 -285 753 540 521 -174 123
7279 123 252 -133 15 160 -163 347 -145 224 692 -330 -689 308 948 -384 -210 -419 -81 29 -198
7298 -198 385 -108 -356 -830 -422 616 -276 53 471 -564 445 -30 -318 -105 -1132 -102 90 387
7316 387 382 461 767 110 -247 -206 218 -110 777 729 -199 -497 -791 67 -23 132 -1173 12 206 364 -401
7337 -401 -190 -292 -467 -18 -548 265 351 374 531 -137 -262 -1439 -1004 -70 -465 215 -8 197 -272 -78
7357 -78 -735 1038 547 248 276 153 324 868 -181 -888 423 346 256 -331 -176 -763 231 10 85 373 233
7378 233 422 -71 51 -866 -255 11 246 227 230 -28 -238 -390 31 653 683 -62 523 -481 -503 -388 538
7399 538 480 -453 -207 -204 20 816 678 -623 -403 334 -550 464 -400 399 -330 -512 -260 -24 933 383
7419 383 -258 -26 -286 -703 -273 -784 -785 111 -12 -143 -214 -271 -296 -210 103 440 154 759 69 -548 209 223
7441 223 -150 -95 -17 -422 -100 -86 123 -425 -642 -402 -181 829 332 733 -457 -362 -522 517 143 -880
7461 -880 -378 -309 379 114 727 646 79 -811 -471 -122 58 777 -124 -584 389 77 -140 192 236 148 -24
7482 -24 576 268 -874 -63 521 -4 -651 -4 -37 142 -635 496 626 -126 -35 374 197 178 -451 273 -238
7503 -238 90 305 723 878 375 569 840 509 -347 87 -317 -338 346 -647 343 126 96 -335 473 1217 4
7524 4 192 374 483 -179 -683 747 -257 -89 -36 -1181 -145 -433 237 479 64 -31 334 292 -227 -548
7544 -548 128 -30 359 536 476 -10 169 111 -125 411 368 -563 -102 -980 431 171 -252 921 490 423 -119
7565 -119 51 -221 89 283 -105 -85 199 174 840 318 616 -365 -591 4 214 -721 -74 373 -180 -111 270
7586 270 145 -266 -24 -666 -402 -269 397 -328 -107 98 401 173 -29 279 137 -45 -11 23 -787 -420 -224
7607 -224 -211 -728 -135 152 79 60 176 415 -187 -202 212 -67 198 223 438 -958 -213 -22 39 -107 -484 469
7629 469 394 263 -117 685 -424 631 24 -182 265 421 -849 78 -19 -903 52 -634 -263 -111 -9 821
7649 821 -514 256 300 -104 364 -384 1009 281 177 551 -83 -166 321 -380 -102 50 -665 -11 546 172
7669 172 -853 -165 500 -321 183 164 498 -788 -938 -6 -539 -431 -733 737 281 -299 -463 -38 242
7688 242 -355 506 -497 -352 -516 -518 -56 -544 -153 -224 451 -1020 -273 -469 -883 462 90 721 -859 -401
7708 -401 31 -146 658 338 -766 66 66 507 -140 533 -248 284 477 87 158 178 -436 235 323 -388 157
7729 157 -552 65 275 608 -156 -288 -546 269 290 -179 755 -68 -504 -12 693 -273 -257 -146 545 -167 -418
7750 -418 102 -257 418 114 660 -295 -151 -902 -1117 -611 -58 43 49 307 81 329 -320 -533 -1 -892 472
7771 472 308 589 -51 -315 426 516 516 881 544 -138 -170 -210 -240 -62 109 -339 512 776 53 165 136 -142
7793 -142 339 165 2 -47 447 263 148 -425 142 -12 -286 -167 -824 460 408 -364 -722 -394 -5 -243
7813 -243 231 53 -201 60 30 446 -831 -1020 -239 -247 -240 107 -56 -392 -761 443 197 203 -815 -40 143
7834 143 -159 -302 412 -560 627 -232 45 -272 -764 -647 -677 -476 1434 293 -35 413 512 -108 -231 -37
7854 -37 407 23 -339 -184 -403 291 640 702 739 -783 -97 191 -1 960 407 344 -1060 667 -148 -195 -306
7875 -306 563 -218 -96 -120 -518 102 248 485 21 -105 -162 -328 150 1004 -197 309 390 -633 825 256
7895 256 335 -106 -40 234 -39 4 738 263 -624 516 698 31 213 -129 -102 489 35 382 123 -64 14
7916 14 -583 253 957 13 -191 -127 38 -841 4 -651 137 667 226 95 -211 533 506 858 7 713 -3
7937 -3 -294 -743 37 580 -137 -133 -278 -236 311 188 130 -167 -488 327 -536 692 -959 848 -986 -713 57
7958 57 -473 -10 186 -860 254 216 -250 -15 437 105 -270 1098 207 546 598 -129 243 728 107 220
7978 220 521 304 -4 -319 143 277 553 873 449 -167 268 448 700 73 -1116 -501 161 -247 14 129
7998 129 62 659 -512 -326 -640 320 -411 -34 -52 355 -2 -82 160 75 -316 34 345 -310 -488 82 401
8019 401 149 263 -161 380 513 246 -1035 320 93 162 -28 501 -472 457 -352 320 221 -1168 92
8038 92 -326 4 588 132 692 -291 -416 -89 -1043 380 -186 347 -205 332 -456 -350 -992 403 -14 1021
8058 1021 514 5 34 1065 -39 -151 -161 -43 865 180 -158 -487 397 -86 439 -981 303 -600 -490
8077 -490 691 599 472 887 -44 -784 379 124 -232 318 -44 -48 380 -302 1113 221 -542 -185 364 497
8097 497 548 -766 -75 303 395 100 570 230 -1018 -571 173 225 246 20 -252 -148 71 363 -583 320 -156
8118 -156 -644 -14 -462 -4 505 65 -238 -548 -69 -240 203 273 -971 380 450 94 206 -378 17 -359
8138 -359 496 -58 -223 -358 -522 381 -610 -613 -65 197 -86 559 538 -443 221 -213 -604 -473 -286 -7 426
8159 426 248 90 613 12 -406 -471 -133 -844 91 -1082 -159 311 516 -768 226 547 120 924 -32 -207
8179 -207 163 408 32 -297 84 -407 54 476 -96 220 515 358
8191C58
$$ Imaginary data points
##PAGE= N=2
##DATA TABLE= (X++(I..I)), XYDATA
0 0 0 0 0 0 0 0 0 0 0 0 61 -63 63 -63 63 -63 126 -126 126 -189 189 -251 257 -315 375 -426 489 -552
28 -552 618 -694 790 -880 992 -1107 1233 -1376 1539 -1706 1892 -2095 2323 -2567 2850 -3154
44 -3154 3491 -3871 4305 -4793 5360 -6016 6787 -7714 8855 -10296 12171 -14753 18527
57 18527 -24603 36050 -65336 319279 409289 -269301 -428012 -113383 371790 331158 -94353
68 -94353 -416418 -173169 264500 368900 -18819 -357819 -239945 196531 355905 61147
78 61147 -311392 -264593 113941 338874 116749 -243575 -284644 47030 304283 165280 -183341
89 -183341 -281543 -19867 260763 199125 -116127 -278906 -72810 220520 221148 -63678 -255775
100 -255775 -113268 169500 226539 -8653 -227673 -147320 120672 226713 36691 -193833
110 -193833 -169258 72628 213896 77363 -156362 -182914 27812 196618 106824 -116854
120 -116854 -185183 -12438 171476 129423 -77384 -178083 -48037 141329 145429 -38984 -170081
131 -170081 -76323 113441 150462 -6534 -150071 -97219 78279 150331 25647 -128761 -113529
142 -113529 48254 144481 50812 -103939 -121721 17435 131675 72251 -78712 -124475 -8857
153 -8857 114717 87180 -52969 -122041 -30256 95852 96120 -27237 -113422 -51415 75139 101919
165 101919 -4112 -102488 -66199 54452 101889 16840 -87298 -76127 31363 97890 35903
176 35903 -71562 -82845 12967 88222 49273 -52763 -83440 -6955 78712 60570 -34774 -84267
188 -84267 -22618 65444 66299 -19029 -77658 -35431 50501 69403 -935 -69229 -45475 36470
200 36470 69998 13562 -59349 -53207 22078 66185 23969 -47806 -56251 6115 60658 35191
212 35191 -36069 -58495 -5050 52791 40921 -22774 -55645 -15830 43664 45070 -11435 -52419
224 -52419 -24861 34135 48952 -67 -46648 -31884 23693 47477 9344 -40151 -36546 14401
236 14401 45070 16902 -33082 -39523 4281 41193 23515 -23954 -39927 -3727 36259 28795
248 28795 -16048 -38476 -10894 30216 31041 -7549 -36168 -17913 23250 32847 -726 -32158 -22442
261 -22442 16480 32495 6809 -27006 -24292 9239 30645 11305 -22331 -26286 2708 28397
273 28397 15366 -16255 -26508 -2255 24211 19340 -9924 -26963 -7310 20544 21786 -5886
285 -5886 -24263 -11952 16300 22244 -713 -21836 -14465 10930 22581 3945 -18894 -16935 6418
298 6418 20856 7886 -14853 -18359 1632 19466 11410 -11142 -17796 -1646 17474 13304 -8062
311 -8062 -16995 -5133 14118 14099 -3735 -16968 -7978 11184 14611 -315 -15411 -8781 7134 15246
325 15246 2989 -12815 -10739 4209 14728 5123 -10379 -10856 2349 13125 6059 -6838 -12518
338 -12518 -1014 11496 8575 -5250 -11326 -3402 9901 9636 -3713 -11102 -4860 7203 9363 -946
352 -946 -9647 -6257 5677 9540 947 -8506 -7571 4407 9698 2441 -7319 -7125 2052 8960 4475
367 4475 -5231 -8648 62 8232 4626 -3873 -8246 -1938 6567 6090 -2730 -7807 -2800 5762 6562 -178
383 -178 -6651 -3051 4501 6071 812 -6248 -4630 3057 6001 1363 -4801 -5274 1379 5767 2652 -3885
399 -3885 -5746 845 5886 2940 -3280 -5217 -99 4375 3741 -2260 -5396 -1197 4694 4659 -1512 -4938
415 -4938 -1991 2732 4557 -534 -4199 -2241 2123 4425 509 -4494 -3323 2599 4107 1211 -2803
430 -2803 -3415 1117 4982 2168 -2944 -3082 428 3683 2328 -2203 -3619 -615 2703 2333 -1071 -2973
446 -2973 -967 2295 2109 -250 -3022 -892 2694 2812 -635 -3645 -2105 1455 2546 -314 -2168 -1298
462 -1298 1845 2838 1166 -2145 -2074 509 2482 714 -1223 -2893 18 1964 1276 -1891 -2963 512
478 512 2129 2274 -1470 -2290 -629 2455 1502 -1489 -2049 -286 1392 697 -779 -2498 -1661 1580 2612
495 2612 789 -2413 -1254 1309 1953 148 -1706 -1902 561 2050 554 -821 -1724 160 1730 1432
511 1432 -1733 -1599 -397 2087 2747 -681 -2358 -1408 1701 1512 -389 -1618 -923 1572 1804 149 -1784
528 -1784 -505 868 2226 1038 -953 -737 1333 1666 978 -2020 -1716 512 1759 949 -2062 -1880 -291
545 -291 1307 962 -91 -1736 -132 1511 1242 -899 -1039 273 1670 952 -889 -1455 -781 760 1044
562 1044 -181 -1352 -1110 132 1084 317 -1655 -1173 326 1816 578 -876 -830 17 1275 891 -553
579 -553 -623 151 1297 456 -482 -1203 -857 921 1093 -545 -1435 -1188 588 1159 487 -1030 -1363 144 1450
598 1450 224 -1521 -1076 631 1940 275 -464 -904 -990 909 1481 -559 -1542 251 553 68 619 -816
616 -816 -560 304 910 -592 -1072 -98 -2 1115 762 -481 -811 1351 1451 758 -823 -990 -638 1371 975
635 975 -892 -839 -278 480 283 -576 -1650 186 634 972 98 -601 -496 462 1004 263 -673 272 816 1460
655 1460 212 -899 -500 895 -475 402 -168 -876 -102 -354 1024 -994 -1049 301 1364 492 -57 -727
673 -727 115 122 1013 216 2 150 -535 717 232 -871 -241 -64 611 -23 -860 -781 1089 341 849 53
693 53 -1104 361 -29 350 -489 -852 -463 67 -321 -222 -453 -211 762 200 -391 -626 -812 -71 909 355
713 355 236 138 698 748 -2 -353 -904 441 395 233 -600 -600 -220 432 587 -31 -124 648 212 -175 -493 -538
735 -538 -497 -79 835 208 -1316 -26 29 419 248 -1100 -642 84 856 -32 -546 535 532 636 131 -963
755 -963 -655 -126 -701 71 229 36 -847 89 358 -261 172 -967 -451 105 -240 253 -201 121 -174 727
775 727 -491 -116 -122 -229 -281 -571 -483 -568 1735 -157 -519 -435 156 1128 698 76 305 -475 -39 608 -685
796 -685 113 191 -81 -69 -280 137 -458 24 -18 425 164 -371 -755 -68 -65 -31 -500 -280 139 47 694 -543
818 -543 -443 -1102 403 28 -107 -882 79 41 345 1 -871 1188 -99 62 542 84 72 478 201 78
838 78 640 423 234 -618 104 854 666 -279 -194 52 -899 821 -97 572 -56 463 294 -461 1118 -279
858 -279 189 -174 433 -982 444 11 -509 433 -295 153 -100 -267 47 368 -528 -740 -651 -240 707 -93
878 -93 605 -748 -191 -145 -522 487 -146 -118 -309 -232 161 -263 384 229 778 501 -393 -795 1120 85
898 85 227 42 362 -322 541 328 299 277 691 -151 5 165 -6 30 -491 437 -544 577 160 201 10 659
920 659 -399 382 -203 879 1256 -522 -204 31 -382 -187 -137 294 95 -948 -214 70 -125 287 -533
939 -533 440 -817 -811 -259 -134 196 -460 36 -186 -627 271 153 -219 -206 -178 -239 -64 549 62 -60 505 -127
961 -127 795 162 437 416 589 473 65 -139 -679 -44 -215 -116 -120 -861 62 -489 12 448 54 757 -461
982 -461 -104 611 -61 258 -40 -297 -467 -526 -395 -95 -361 287 422 -35 189 -206 -183 -416 -317 323 -267
1003 -267 -156 -421 -35 312 370 69 -6 231 -409 779 -334 58 141 -125 -183 1010 476 -913 256 209
1023 209 634 -519 -519 -212 57 -301 70 -242 84 -34 -837 -69 -448 77 -54 104 -1039 248 184 -496
1043 -496 -102 -1135 159 -383 116 204 217 -478 -11 -955 -500 -404 -337 169 -703 7 319 418 52 -312 -177
1064 -177 31 -305 646 61 132 567 319 10 -353 344 473 -111 352 -318 89 -398 416 467 -24 -454 -354
1085 -354 733 -893 -406 73 -255 -503 -300 482 176 553 106 183 209 619 -343 -468 2 -501 786 -288
1105 -288 507 -616 -435 412 -628 -579 667 -494 -554 718 370 97 -197 -583 641 -376 425 270
1123 270 330 -173 662 -231 299 -941 477 160 -250 371 -32 -249 747 221 530 -75 149 709 -383
1142 -383 -700 -248 -602 -718 -345 415 -282 374 -163 -86 -452 113 -450 268 630 -115 -56 -520 22 79 316
1163 316 -108 -130 447 -148 -697 168 -323 152 -723 -278 225 -820 238 -547 418 -244 -725 -170 -739 123
1183 123 446 199 20 -647 342 -377 -325 -394 693 -787 -447 -655 -286 -320 116 -375 -140 286 292 515 -214
1204 -214 25 -306 447 988 3 -493 273 502 119 360 383 -485 -412 13 -49 -371 148 -917 372 285 776
1225 776 -605 -99 62 44 -139 -112 -2 -533 -136 -363 -256 -312 -423 -138 591 301 192 360 -600 714
1245 714 -202 -698 -678 251 291 20 -192 -568 -137 -188 565 -7 196 -71 1064 -514 -320 370 -724 508
1265 508 -492 -284 622 562 -934 20 184 -800 891 739 -551 61 -375 14 470 191 -538 -168 -506
1284 -506 521 -294 555 252 1 650 -30 764 -55 -358 182 -635 -578 -256 -349 -38 486 156 453 251
1304 251 216 -302 -467 133 -90 -42 234 760 -240 402 -308 -1211 408 281 -516 190 -351 -667 -347 373
1324 373 -231 168 47 608 -852 -680 314 91 -387 -1125 -88 447 -50 -156 224 -90 -465 -432 -73 -7
1344 -7 -288 157 -905 -208 336 384 290 -251 254 -259 495 114 103 -515 252 -739 -253 588 79 145 -900
1365 -900 133 122 636 27 -92 836 490 -76 632 544 -392 -415 -170 6 40 30 -529 -526 -59 -401 247 -588
1387 -588 58 -262 -768 482 -260 -127 201 329 -1039 94 -356 -497 -314 -291 64 213 83 503 -265
1406 -265 -189 407 205 231 14 4 -61 758 -809 -138 76 65 -361 -1098 -627 -419 -256 -23 -736 484 259
1427 259 -750 -221 -128 -56 605 166 -665 -159 -491 -64 -5 664 414 -1318 246 -768 -316 -340 65 -308
1447 -308 -115 -150 88 -173 -766 -40 -89 403 -118 -264 517 455 132 402 -29 -188 -322 642 -62 344 -572
1468 -572 -335 -235 -470 452 -274 -471 355 309 21 469 -284 521 840 -364 -532 235 349 -8 554 531
1488 531 -189 419 345 -202 108 -92 -387 154 475 -9 186 -65 368 -636 324 412 -861 -68 54 286
1508 286 216 -1170 -243 -789 866 40 -271 173 466 308 311 -59 -1332 163 -13 88 425 892 762 109
1528 109 199 -53 -618 -137 -569 617 113 102 222 933 136 -72 -179 -436 -535 -399 -239 -866 -196 -883 -59
1549 -59 -745 -480 -360 -318 -71 -10 -453 -1087 14 -415 -407 106 -67 433 147 -1220 -280 -437 -849 383 277
1570 277 -85 206 203 718 172 98 542 -889 -553 -331 -42 -45 -470 -712 -375 507 292 549 -828 -189 413
1591 413 -531 956 333 388 -68 -191 580 -97 -36 -62 307 -115 -501 1071 52 -190 -274 -361 354 369 156
1612 156 303 -440 -541 -118 -1192 -301 479 -198 -668 202 16 -10 160 234 -202 -296 19 188 157 134 636
1633 636 -1043 360 227 -261 117 -609 -221 -157 62 -308 -908 96 668 -82 -340 225 -352 -405 -828 306
1653 306 -11 -102 -198 -418 380 -35 4 397 701 67 -296 -839 93 129 -47 832 472 -717 375 -66 -136
1674 -136 -25 -178 -131 138 -415 -621 -88 420 10 222 582 415 677 -193 -398 -697 365 455 143 9
1694 9 -645 137 422 41 -76 275 -696 825 -464 299 393 120 -134 410 -185 -103 -817 -373 57 348 -691
1715 -691 -229 408 303 -41 -477 -62 -30 -119 420 22 2 597 -411 648 87 499 182 153 794 292 -126
1736 -126 480 542 364 237 766 527 -226 -703 146 -245 317 -340 -207 255 564 486 304 -226 -341 -190 780
1757 780 218 949 -298 -134 298 -43 -194 -360 -542 570 -79 -910 -289 36 -353 180 110 362 -213 239
1777 239 437 -98 115 -479 273 -449 183 -156 41 752 950 255 403 -424 595 1147 610 430 509 744
1797 744 150 -130 -117 -428 -1068 -127 -447 -892 -476 515 -453 -82 47 -20 -583 756 364 -364 122 225
1817 225 927 -580 -49 468 -308 488 -339 364 440 -261 -196 -681 605 112 -418 -277 -507 -596 -792 348
1837 348 -97 361 -699 155 -121 -383 299 -156 -70 -242 -748 225 601 271 -283 -714 497 512 -438 137
1857 137 -261 286 411 186 123 374 336 50 -167 -132 542 631 -123 -64 849 210 -536 433 -93 869 -243
1878 -243 688 243 101 -225 -936 853 1 175 227 606 -310 -449 -596 490 284 -349 70 292 592 427
1898 427 -593 -489 -396 43 529 -1013 462 -399 -842 -444 612 -383 120 -600 -694 448 537 -111 81
1917 81 197 163 421 -24 -956 835 253 -107 -144 111 182 160 -565 -303 -276 310 423 3 394 140 -354 -674
1939 -674 593 332 -417 -97 -940 -208 -346 -343 717 -529 -442 -12 -120 207 597 -28 427 -629 -304 -202
1959 -202 -60 136 305 292 0 601 -567 -972 55 101 8 556 23 293 -518 -837 -589 307 -739 734
1979 734 184 164 9 403 -156 -353 836 -219 -96 546 962 693 548 -572 275 -893 354 341 236
1998 236 -371 -701 -1209 -15 1124 -1288 192 -229 87 318 -353 169 85 -63 -405 168 -584 -311 -119
2017 -119 126 93 -222 30 -481 660 -25 94 -165 -7 -198 -562 -53 149 270 -131 -320 113 498 -326
2037 -326 1109 841 192 671 475 308 201 -10 589 612 -356 300 -160 439 724 491 -102 257 -50 518
2057 518 -247 -712 -28 -85 -302 -310 828 -535 123 1052 301 788 249 -311 -466 -299 28 300 -156 587
2077 587 960 184 16 -552 -72 184 -80 -554 155 132 -124 -247 535 1157 453 209 123 302 955 616 -13
2098 -13 117 157 -995 -152 483 -524 236 -240 -697 88 -271 6 -1084 286 -16 -211 28 310 260 -230
2118 -230 -282 -289 -329 601 -189 340 -274 -395 -103 685 169 485 188 64 311 -1209 -130 151 -133 -109 250
2139 250 -13 -119 182 -19 209 -217 436 279 -88 411 -75 904 -79 337 -330 -819 -20 875 26 272
2159 272 180 833 -166 -924 249 -316 236 201 -578 331 -174 594 189 -295 302 -120 6 -344 756 -241
2179 -241 425 -732 -429 -11 -985 246 -867 269 236 -393 -154 -298 -414 708 69 -601 44 -8 488
2198 488 -809 -193 -248 -234 -282 -368 -283 291 563 84 -93 842 255 -181 395 141 474 -51 532 632 376
2219 376 476 446 340 -392 308 235 -467 -303 -547 -619 -263 -530 -107 -222 380 1186 -338 441 -466 479 -421
2240 -421 -762 645 116 58 549 -223 -135 688 -433 1582 280 -317 -566 433 -92 644 -311 -164 1125
2259 1125 -455 -1202 225 -336 -270 188 248 1182 -465 -902 207 -24 -212 754 771 -751 -700 249 414
2278 414 -1359 -153 -345 -263 -107 -501 -246 -114 420 -649 797 401 -42 89 269 -460 270 -714 -317
2297 -317 -453 470 157 25 -574 149 147 169 547 492 -103 -619 -154 -530 214 251 -524 58 198 -697 -334 -179
2319 -179 362 -693 -1160 -261 606 598 -109 764 -139 727 191 389 145 -524 901 -156 110 -201 -879 55
2339 55 -173 -414 -743 -200 -440 310 374 259 -88 -58 -199 -114 558 -743 619 185 746 -475 -32 -84 98
2360 98 467 389 -647 564 -128 -516 -451 79 -108 392 -77 55 867 -646 449 149 441 -620 465
2379 465 87 -258 -255 -139 -373 189 245 1167 625 166 -282 196 729 -71 -592 -88 235 717 395 -77 -391
2400 -391 54 -435 95 -29 -62 382 374 764 -255 187 192 -484 212 -455 168 -124 -259 31 11 113 152 -286
2422 -286 -47 679 -105 -120 501 -102 356 217 248 -206 -508 -337 -52 -796 -311 -857 100 638 -546 771
2442 771 849 1147 -387 -80 56 -185 575 81 783 355 -323 -355 125 221 209 24 -120 64 329 -863 0
2463 0 -352 588 115 145 -24 -655 313 -388 675 101 134 183 810 630 538 -288 705 510 30 87 -15 670
2485 670 -632 757 202 -121 -51 342 -1021 481 -1046 -384 -1044 136 107 690 -186 -474 -72 387 708
2504 708 -311 -616 226 138 194 13 -254 65 -289 221 -376 969 1329 -744 -262 133 588 733 -385
2523 -385 -655 624 -568 248 -241 277 160 491 295 -117 -164 -350 -147 831 -918 455 -285 221 -644
2542 -644 391 -201 292 -246 226 446 547 25 377 76 -636 352 698 -414 -26 -143 554 392 765
2561 765 29 -111 39 -879 -789 139 -234 -417 221 436 230 186 393 198 210 -86 302 -717 -153 -254 250
2582 250 301 202 -959 785 671 -848 -416 -395 278 572 -462 56 337 501 111 111 1038 134 703 169
2602 169 516 -12 418 -557 -518 445 -326 -6 265 -491 -294 -639 285 560 562 691 -906 671 -89 714
2622 714 -22 342 -180 -154 137 -897 -487 -329 181 -778 312 502 538 338 1021 -243 70 214 -461 -402
2642 -402 -142 -826 -502 468 -607 -67 -963 531 173 692 -48 -770 742 43 85 71 251 347 -589 -576
2662 -576 -443 308 -323 -23 -871 100 751 -444 -101 81 -618 36 171 470 -45 -1386 -302 32 211
2681 211 -29 -24 75 -2 203 -327 190 -116 129 793 -191 -161 -309 147 310 -374 77 337 633 -64 348 1166
2703 1166 -245 -3 -584 240 596 413 965 -715 -592 -2 -91 390 -214 -613 -146 1340 289 181 -385
2722 -385 139 -246 -729 621 586 83 -483 -326 352 720 551 189 -357 370 38 395 126 783 129 39
2742 39 974 338 -9 403 -200 27 318 -679 332 343 -137 -393 -529 253 -300 -601 477 -465 122 458
2762 458 536 515 -461 322 776 -929 111 -209 -105 -139 135 -16 -182 -272 -272 -2 115 36 -522 4 583 -74
2784 -74 257 353 163 -898 -575 -247 -212 215 6 270 -1011 139 -539 -441 -137 -86 -122 -546 -514 1182 783
2805 783 -535 55 -180 -394 -1712 -181 -427 444 211 -1110 -77 735 -44 -287 -560 532 -210 -499
2823 -499 -196 398 -63 244 -749 -356 -657 267 351 -688 -116 1 -319 -61 -236 -405 713 -32 -395 105
2843 105 -231 -1054 -534 780 -43 560 248 40 -339 -361 152 -644 -90 -44 325 -111 335 -842 -218 326
2863 326 -576 0 426 -637 -341 79 1143 -57 307 153 140 647 -494 -485 63 -424 -311 8 1058
2882 1058 563 714 200 453 148 -378 174 78 360 -284 -132 -442 -147 219 -201 984 888 -41 17 450
2902 450 44 -655 -223 433 156 -688 -455 639 132 220 -282 238 -454 251 704 -191 195 764 360 -239
2922 -239 -74 -343 -293 377 250 -301 786 77 -70 -354 -69 606 341 -788 -165 398 287 245 1091 74
2942 74 -5 -281 786 -94 -36 107 -535 -254 -2 -535 -503 -149 -414 101 78 31 -775 -126 -1158 -80 -8
2963 -8 -294 731 294 562 -388 -936 122 327 -42 -429 -216 -107 133 390 -370 -164 -461 -366 -251 -530
2983 -530 -677 411 223 698 -137 48 310 520 -19 599 -10 -304 356 221 -369 183 429 -48 1237
3002 1237 165 498 306 64 56 180 -272 1037 494 536 -1 397 -675 202 282 116 -150 -758 -204 -54
3022 -54 371 -203 -34 -184 -369 11 381 -556 488 -896 -196 -232 -38 136 351 980 -612 249 252 -1355
3042 -1355 -325 34 163 168 223 -333 442 -624 379 -92 520 -755 -236 892 -241 632 -195 703 -542
3061 -542 -190 -191 259 -300 -71 -189 246 414 337 -347 32 -174 -43 407 198 842 279 -412 225 -582 -484
3082 -484 11 162 387 446 653 38 386 -247 796 -657 -18 -402 -379 -445 320 224 -270 313 500 -280 -811
3103 -811 215 102 -56 -715 363 694 -268 147 180 -77 -144 -68 -369 -151 176 -725 -120 -453 148 -467
3123 -467 -25 274 420 184 -150 364 -346 32 33 -216 242 444 -254 -96 139 283 -122 -2 224 594 444
3144 444 129 85 -27 1318 838 33 -201 304 129 -143 -520 -2 1 -293 987 -139 472 114 417 96
3164 96 -38 -401 -177 174 579 -192 79 -666 -54 -501 188 582 -364 298 855 -339 315 777 477 488
3184 488 64 362 359 -365 -1014 451 29 -665 -216 -510 -965 368 -66 607 -561 14 744 215 624 184
3204 184 -764 605 343 -129 -67 -65 222 188 -243 127 -415 -118 -494 -685 -347 396 -735 246 719 -75 -285
3225 -285 918 -9 -177 -183 -233 -590 -688 142 175 -399 -697 -504 397 122 -69 -73 124 258 -312 275 -332 873
3247 873 -170 -1064 -334 -12 -314 122 -517 354 124 -34 -554 341 75 -748 941 190 272 -162 367 666
3267 666 -337 683 383 -463 193 -92 203 -133 502 217 -486 -104 -370 20 1111 778 161 -967 -686
3286 -686 -481 -411 274 -273 385 -642 205 380 42 921 563 247 301 -177 -72 492 -504 569 -100 144
3306 144 -215 -242 -384 -708 460 -389 -1119 349 -497 -482 -203 419 -447 -341 181 60 -781 -130 -255 353
3326 353 1 -305 -504 -153 -432 64 139 22 252 510 -439 69 -127 -173 656 496 162 -624 -106 -54 922
3347 922 -124 903 281 722 -63 292 353 -546 -635 -86 709 310 -530 -416 -260 253 -378 -208 65 168
3367 168 728 197 666 63 355 4 298 205 -9 -368 688 325 -150 -199 223 -129 153 -134 199 451
3387 451 -768 305 -375 46 384 592 149 -188 -546 204 333 -269 -272 324 -838 460 387 -257 -16 198
3407 198 -325 58 -281 -443 -763 261 270 47 -444 254 -47 467 -74 -637 74 -236 -4 77 81 38 -257 374
3429 374 -102 157 -636 -469 15 462 -623 -120 509 -358 -153 -284 910 84 446 27 79 -188 -480 -367
3449 -367 90 18 -643 644 188 -696 -90 -170 35 -197 -370 -268 571 121 856 -1324 -811 696 287 241
3469 241 896 458 3 476 60 113 314 -591 10 -301 1274 -1112 63 30 -1001 -508 812 -400 -33
3488 -33 -139 276 -223 19 800 -935 -702 203 413 -168 140 -144 268 -87 -768 684 -759 110 -436
3507 -436 -609 491 -68 -232 427 520 323 -100 48 531 452 -1191 -92 411 -249 490 -306 -113 165 178
3527 178 -115 628 -269 -18 -385 -76 -6 785 -805 -863 -183 35 -230 -321 -478 -288 -287 -182 416 -648 453
3548 453 385 540 -94 444 26 162 -34 -421 614 125 310 -365 -27 -122 -242 203 936 226 -306 482
3568 482 -219 -94 -81 -357 -302 227 479 -665 -171 219 699 -455 867 37 889 476 -1342 515 1238
3587 1238 -331 41 87 493 -437 -280 146 328 82 -134 132 191 203 437 -144 -374 -508 -431 -747 808
3607 808 -55 -157 372 -37 -436 362 358 73 45 -352 -340 358 -262 338 620 -481 170 337 -903 240
3627 240 -579 123 -473 -1020 -645 421 -34 133 677 -62 302 -466 98 -37 -37 488 -209 448 385 -649
3647 -649 19 303 -430 -137 -17 272 316 -337 -27 -533 442 -178 -219 -986 -35 -244 599 196 -267 -327 879
3668 879 483 315 191 574 740 286 -275 -38 -724 206 562 -338 -299 -482 -171 -700 95 66 536 -329 104
3689 104 67 77 276 -342 -64 -696 -639 350 177 -380 181 5 -136 -196 204 382 242 -330 98 429 447 274
3711 274 -718 -117 -150 1150 -724 -240 545 488 -989 -882 -369 -478 -176 516 -56 147 51 362 7 26
3731 26 -172 -4 -335 275 -386 148 240 544 -140 -338 367 -386 -459 -75 -338 562 278 -118 -712 190 -398
3752 -398 -377 375 -389 590 -243 -196 -893 -28 -204 172 37 348 626 754 -509 402 131 -69 -85 710 811
3773 811 -373 5 314 38 -184 -121 -101 453 547 7 147 172 32 474 457 -117 500 -1298 214 625 -52
3794 -52 -327 -264 248 249 700 -576 321 -198 -322 -265 -74 -293 -322 -96 -218 43 607 214 639 107 -187 297
3816 297 200 171 599 463 215 1001 -756 -241 -189 -68 -106 220 65 -117 -261 -358 -66 337 159 -165 -77 -1002
3838 -1002 249 257 -626 938 513 117 -806 -304 260 780 49 -1134 770 166 -60 805 -71 -334 -13
3857 -13 783 -545 -532 42 643 243 586 -182 432 -462 649 741 546 -253 -252 -492 49 -525 -348 70 -143
3878 -143 181 146 131 236 -516 813 613 71 -945 578 401 698 -117 -905 510 -100 -326 729 -29
3897 -29 -41 -47 -10 106 -43 -107 -380 432 134 -407 666 489 -95 -612 167 -50 -273 829 -656 -898 -557
3918 -557 200 647 234 623 -158 349 -275 87 446 214 333 -586 -461 -113 268 -440 -111 827 348 508
3938 508 452 -489 199 490 360 7 -209 348 255 -386 212 188 -153 6 666 345 92 -204 216 30 327
3959 327 518 340 -510 -234 394 245 237 52 139 -648 -430 296 325 -108 743 387 -738 155 -137 -724 -629
3980 -629 737 -562 -316 695 468 475 -668 -507 7 -49 254 281 -256 -599 557 -216 -569 -781 439
3999 439 -237 221 -174 58 -189 257 -129 -144 667 240 -192 142 450 -786 3 336 125 512 5 328
4019 328 363 361 -589 107 346 852 238 -390 -46 754 1027 -344 -351 816 565 -782 23 -501 -198 43 730
4040 730 73 397 -502 -282 270 322 258 -763 536 158 -807 151 -685 -419 -890 413 345 364 258 603
4060 603 262 -667 -309 330 -108 -590 -117 475 601 560 140 186 349 469 -104 -105 -439 -415 521 -400 137 101
4082 101 -51 354 134 -25 -716 -801 -465 -1 -578 -654 -577 428 220 -212 -322 -341 1173 -466 -18 405
4102 405 -185 379 471 985 -274 646 388 -154 -487 -292 -299 992 76 327 21 526 -105 -217 15 112 277
4123 277 214 463 405 -676 294 688 -529 -516 -440 441 -354 16 -89 148 208 30 -364 -59 -423 -828 52
4144 52 -225 457 -313 463 -76 -167 -316 -592 155 889 27 -57 169 -167 -129 129 -496 -430 -781 -706 -361 124
4166 124 -58 78 343 210 -795 12 -35 98 393 528 152 20 -239 -308 -252 480 -275 214 88 -201 -49
4187 -49 -43 93 -959 42 795 467 0 -368 -568 -579 114 760 100 125 -726 32 153 16 348 -519 -30
4208 -30 -687 116 308 251 156 -402 -1018 -1083 500 -260 968 -542 163 69 295 73 -374 383 32 -119 84
4229 84 685 -287 399 -279 150 -311 183 51 191 -216 183 -503 -407 -128 -180 223 594 593 15 304 -616 -788
4251 -788 82 -624 115 -194 -29 -578 -243 -470 -457 334 -554 -1345 -808 -383 827 -274 643 619 -128 204
4271 204 95 -219 -556 83 -390 -410 -262 -497 134 -846 288 -480 -852 -219 -296 -712 579 -90 183 210
4291 210 -548 -304 212 64 654 -160 -589 65 -117 315 29 227 -420 688 85 531 -484 -371 631
4310 631 -83 -223 262 299 -38 334 -60 -403 -635 -613 150 -307 -424 -105 -278 1038 -165 -1073 416 930
4330 930 -357 6 51 1015 182 220 -204 -402 -140 -472 391 -23 665 164 -919 224 -283 430 566 526
4350 526 95 118 -95 -615 -35 239 -210 -807 163 -347 491 -291 -58 807 -661 204 -34 -259 149 -269
4370 -269 339 469 -336 36 87 -786 -659 -130 -215 302 -315 98 174 115 -323 -143 -723 849 95 -15 1003
4391 1003 17 -247 -116 -473 -80 -193 -455 445 -805 -533 -550 -472 -145 886 -858 724 -573 -362 246
4410 246 -696 746 -398 42 -216 22 2 718 -171 -651 573 -42 -511 -137 -467 210 936 -181 243
4429 243 -127 -353 -142 -36 644 -1044 -746 -516 66 58 163 358 -194 239 -109 56 -144 -296 -199 600 225
4450 225 -537 631 695 149 275 -58 528 5 509 -267 205 205 213 122 -386 -866 -93 200 483 648 -126 -984
4472 -984 -279 -290 355 -731 688 777 244 -604 550 -493 -75 -562 -675 -155 463 693 446 -577 263
4491 263 -119 330 431 -905 616 344 -335 335 250 330 802 408 54 694 -208 16 -428 358 -193 543
4511 543 559 -200 -387 314 194 -597 621 -222 7 123 -55 662 829 82 516 -74 107 -252 496 -29
4531 -29 618 239 -471 476 -835 -372 676 -426 78 -233 -143 -24 -102 9 265 738 -79 226 -421 -429 111
4552 111 192 839 -483 170 -172 -116 -153 -252 283 393 609 385 582 -393 -140 -151 -309 234 594 255 -239
4573 -239 36 325 -198 209 169 -379 707 333 419 -172 797 248 23 76 -205 -171 285 23 342 -271 50
4594 50 -123 -202 798 -380 -254 -559 903 -440 -49 -81 -834 -309 428 270 -303 -1074 433 387 -261 11
4614 11 -433 137 108 -1048 -70 -568 -13 656 -229 560 -471 -521 473 -202 -527 248 31 -964 170 -386
4634 -386 23 -480 179 38 99 75 350 -278 16 311 90 127 -389 281 -230 -435 385 -295 -164 -392 462
4655 462 202 -243 335 -11 655 -979 101 -316 22 1035 -482 -376 377 -386 -97 -270 76 -199 280
4674 280 -76 186 50 107 798 649 354 -346 -132 175 -584 151 -102 -417 -351 100 297 389 -407 -168 71
4695 71 -65 788 -338 419 -154 -383 36 1099 -495 163 -414 -588 -232 -37 608 -174 -896 -474 398
4714 398 1013 188 14 379 97 29 -579 392 297 -584 249 -412 -498 -273 -254 534 48 -520 -271 207 31
4735 31 556 488 -285 980 295 18 247 335 -77 -882 319 -229 -340 -34 -418 865 161 -133 208 -167
4755 -167 213 -266 3 -253 533 74 432 -252 71 1013 -404 288 121 -296 -263 -483 -249 396 -212 -168
4775 -168 -225 -530 -250 797 -72 121 154 -132 1 -279 -455 274 -252 -137 78 219 -492 -438 -459 690 611
4796 611 168 -319 26 355 892 -360 159 -277 112 -688 271 -15 245 -137 -436 -443 435 216 -190 501
4816 501 588 557 126 -101 538 499 -1079 296 -280 463 -443 -814 -440 -237 122 -117 3 305 345 -249 625
4837 625 -342 -50 -276 -102 24 263 478 -34 155 691 -98 103 624 -250 382 -997 -425 -43 171 -767
4857 -767 2 -941 -613 -522 1025 -234 -391 -617 35 -260 603 -314 -487 555 -164 -244 -616 108 -263 191
4877 191 -247 -16 -127 -153 354 -886 13 1037 575 -989 -227 -1 -472 -392 184 362 146 23 89 -89
4897 -89 -105 -359 561 -24 -541 -529 665 -157 371 -334 -392 -766 0 480 251 19 -191 955 -406 1254
4917 1254 705 231 497 -465 537 610 39 -175 -815 -85 39 -150 97 231 -161 -391 -559 186 438 -1
4937 -1 -349 145 301 224 -495 198 226 128 -230 219 710 398 58 -288 -230 162 273 -61 -135 -47 151 910 -877
4960 -877 -1173 287 -151 678 94 542 -216 -843 -287 505 -87 104 -141 -172 191 1186 158 478 568 219
4980 219 852 457 545 -165 883 1008 696 -621 -766 -9 1085 2 23 551 -194 -82 576 2 -542
4999 -542 -533 495 611 515 -251 592 -471 71 400 209 -630 355 -218 675 -26 576 685 -367 -311 565
5019 565 -816 -53 -3 -877 214 -21 267 -504 -684 -403 -590 60 617 448 -772 -169 858 -140 -43
5038 -43 286 17 -687 138 1471 -188 -614 -314 -508 -235 31 -563 -1577 185 219 -964 40 21 337
5057 337 -483 -480 778 22 302 601 683 -295 278 -189 -941 302 -163 969 12 43 -9 65 -254 -109 -47
5078 -47 761 664 -85 381 -236 296 -204 -461 -529 390 343 -379 -636 337 934 -368 -74 272 233 -530 -271
5099 -271 -372 -112 -39 -117 626 -513 11 -185 -174 -924 152 -253 -57 600 42 -905 -293 417 693 562
5119 562 319 202 423 11 -148 1020 -270 163 63 -347 -769 -57 623 -833 490 -779 682 216
5137 216 137 -207 -237 145 -76 -27 216 -264 327 339 107 -331 -15 1149 474 269 -10 -197 -192 299 651 -12
5159 -12 -375 25 206 259 -300 -36 -112 340 718 -686 -475 285 -330 692 -978 174 -582 -300 310 100
5179 100 -853 -522 -510 -284 118 337 339 -280 560 -182 95 444 461 -60 362 270 308 -335 259 -367 -61 507
5201 507 711 174 -606 41 551 -571 -707 -304 172 1032 -40 7 220 -1313 -254 -416 -870 92 272
5220 272 -151 -259 -302 216 -20 512 -141 39 52 -189 517 136 1215 609 -283 -878 649 -39 -208 233
5240 233 -379 254 106 -192 705 -726 415 -282 112 -615 136 358 -495 -140 540 -336 753 135 445
5259 445 90 16 161 -584 -421 -29 138 284 468 -134 -53 505 -245 -570 -202 74 607 484 -102 -200 409
5280 409 27 -660 41 -126 -571 167 -27 357 5 -384 1117 -444 -393 495 -60 280 -895 119 -433
5299 -433 168 241 -268 962 630 456 -260 -666 -330 -41 463 -370 -340 188 -77 591 341 -613 967 64
5319 64 294 -662 -408 -50 503 1142 -328 479 -308 382 607 -181 -470 -484 -131 -379 12 354 103 -283
5339 -283 89 -993 -169 -200 -1046 -436 223 -426 -211 583 505 596 660 274 458 868 -186 451 99 -143 -229
5360 -229 334 1032 453 -47 204 -1 413 -334 83 50 -855 323 38 118 567 253 168 -157 -231 452 -171
5381 -171 553 -498 36 402 -188 1091 852 661 948 -160 280 -485 -210 -253 -642 846 -486 655
5399 655 -152 604 -656 695 288 341 415 -45 429 -749 48 -41 212 346 -325 -227 762 -275 275 520
5419 520 556 -50 -777 -1125 -813 266 2 703 361 -313 501 713 -239 -436 -31 460 -487 -171 249 111
5439 111 -738 431 -16 -103 -956 -716 -458 626 63 499 -57 -686 -406 -480 35 -248 70 287 -493 -277
5459 -277 554 -249 442 -122 -172 -570 434 275 -165 -393 249 -257 317 -494 -46 -379 362 -326 132 -468
5479 -468 239 -129 267 -597 -211 523 -243 -59 161 30 -748 69 -53 -952 352 -528 -123 -14 -596 63
5499 63 -157 -272 -23 330 -229 -9 -105 -994 -98 -489 470 -17 935 -58 -213 395 -368 412 -101 -406 282
5520 282 -135 -486 224 -130 -407 107 141 -275 -58 -514 -450 273 1217 -9 337 133 710 -75 193 305
5540 305 465 133 150 23 1481 513 -1119 -294 -137 766 -952 -1258 -417 269 555 -36 228 -68 12 915
5560 915 -346 -455 -378 473 -718 -483 -109 -1050 -34 -347 -36 27 -704 1030 -417 -72 -58 -475 729
5579 729 868 22 94 773 112 -1366 -240 -453 -33 416 -277 -371 -274 -805 213 247 561 -372 942 -103
5599 -103 6 257 157 414 -540 465 112 276 -96 -540 -135 12 408 410 -52 -7 187 1009 -357 582
5619 582 803 586 251 -781 254 -45 36 -127 45 -241 -139 -103 -286 -204 112 469 -108 -569 -111 -691
5639 -691 -521 -326 -203 354 536 -644 412 -281 -529 390 461 223 908 -145 -218 506 61 -12 -853 47
5659 47 -454 -301 -756 -279 -526 380 422 -348 -41 260 -244 -771 127 -1021 -128 514 351 497 -498 161
5679 161 -406 420 13 -141 278 112 -259 614 126 648 -463 217 -84 -554 200 141 187 -557 430 309
5699 309 945 -364 11 400 9 196 -32 -151 -176 -103 549 755 -29 116 -425 241 -33 -258 -425 -477 -1035
5720 -1035 174 186 -162 -9 -24 -23 470 356 -452 -640 139 -692 -75 375 -20 20 359 -78 -112 -153 -708 -158
5742 -158 -1018 530 137 -226 569 208 494 -304 535 -339 -787 35 -164 -84 487 431 427 -218 1167 688 74
5763 74 -317 -86 -3 235 421 231 212 345 -168 -298 115 41 -49 -560 340 -367 632 66 384 83 -130 238
5785 238 153 -657 -224 216 -273 -369 473 -263 -360 362 -46 620 158 201 -631 -523 406 619 -304 -103 -230
5806 -230 -398 -276 305 -233 -501 437 772 378 -979 918 1122 121 75 589 -298 -280 637 -90 112 -53
5826 -53 434 544 -162 278 46 358 239 -450 397 606 -111 -79 -252 158 369 -492 200 -789 296 25
5846 25 -985 -127 -16 -131 -941 1075 -446 62 -447 -161 74 235 292 1016 -355 -153 -420 204 -98
5865 -98 54 -560 -2 1029 -435 -92 -850 -268 254 1152 -227 161 -1179 -252 -203 831 -129 -493 428
5884 428 -368 -258 -223 180 644 267 -312 -72 719 626 -459 270 68 778 527 -649 926 -81 145
5903 145 -93 -681 526 14 173 1 157 -309 -398 407 -887 -305 865 -110 67 -27 128 430 409 -72
5923 -72 -593 -233 86 -617 -34 -322 180 832 -34 503 -528 788 -34 207 -321 -801 -103 187 186 163 -117
5944 -117 634 728 -547 -147 -309 -333 -103 322 -308 -160 -439 -312 1250 -255 -278 639 -487 -178 -492 -103
5964 -103 -308 -154 296 -258 -175 -437 802 -131 516 95 -457 10 -510 442 714 -187 533 40 -280 -225
5984 -225 -125 -204 -419 -52 736 -124 -38 223 -144 -802 -147 -615 60 46 544 -172 851 -438 617 -258
6004 -258 33 551 -984 -686 246 1129 -1005 -378 -125 872 858 -489 -911 332 -16 -194 -472 155 269
6023 269 35 -446 40 -366 -230 92 -63 483 17 655 39 138 289 187 114 -665 -27 185 -500 -316 -739
6044 -739 -236 -249 199 530 214 -220 84 230 144 -156 490 -327 -480 -798 212 -111 -320 -452 445 -241
6064 -241 298 252 -451 42 22 686 -64 543 -56 -193 848 129 -553 45 44 -10 600 -436 103 251 -270
6085 -270 188 -244 -179 -640 74 -98 446 -13 319 226 367 -205 746 -28 1224 288 978 -84 242 -236
6105 -236 -1064 776 157 534 -308 -245 539 390 12 5 223 139 -67 448 -594 71 -302 -619 -568 -250 614
6126 614 -553 196 -421 -752 300 -326 -871 -3 -161 -308 632 380 600 -404 24 -380 401 444 -10
6145 -10 695 -281 -121 -103 -124 373 416 543 -389 -692 -610 819 -789 54 -314 176 160 253 -428 -112 332 -902
6167 -902 74 334 -76 138 76 -185 -331 316 -190 122 381 36 -11 -1227 -10 242 665 -73 -491 243
6187 243 119 306 -671 -293 131 53 -212 -772 158 10 -188 -100 234 164 -160 73 860 -323 754 504
6207 504 -122 -679 -413 -960 -200 -459 -853 937 740 463 435 -370 -182 315 898 -187 210 845 -96 354
6227 354 -387 443 -154 -60 -427 490 -82 205 -456 177 -48 567 -556 -263 -135 -512 261 -902 -23 -441
6247 -441 -472 294 -296 -399 726 -441 -571 -64 594 -332 -93 650 -126 1067 284 -507 -611 559 -13
6266 -13 -465 552 -827 -649 170 -241 403 601 160 -694 157 178 -628 -747 -29 330 -465 117 -85 160
6286 160 278 -767 66 149 355 256 89 226 -390 585 666 -1244 251 350 -651 -19 -869 -361 -663 -250
6306 -250 322 -101 -398 -346 -572 521 -91 -434 -469 509 886 578 869 -19 202 212 -95 -1143 -337 154
6326 154 297 359 -172 -285 -124 447 -241 -849 489 -416 -465 -205 596 -102 -27 -187 -1047 -466 5 924 661
6347 661 836 -90 644 -352 -346 -524 -494 341 452 132 -223 -220 99 181 -298 -127 -81 -586 -412 -68 -172 371
6369 371 -120 547 174 66 608 -32 1031 -466 -15 -177 29 883 -287 39 75 378 -430 -243 -290 -472
6389 -472 18 75 -950 454 213 -313 210 -154 -557 206 113 -312 -238 -397 446 475 -317 -704 -820 -859 -177
6410 -177 -444 -561 136 -135 -95 335 353 184 233 750 -24 580 -76 116 207 -261 378 72 -43 -382 -196
6431 -196 -67 -534 -891 -334 -259 424 -296 -163 196 251 -85 -204 275 -259 1082 56 344 10 -285 168
6451 168 -184 -195 187 477 913 492 -429 -468 -322 447 -603 368 -198 -22 254 -394 134 32 -90 -406
6471 -406 -117 60 -206 -516 -752 -379 46 74 -968 160 445 529 -17 463 208 113 227 743 322 927
6491 927 239 -372 -338 -531 183 468 -168 380 -208 476 9 328 -29 -333 327 -118 -636 407 -417 52
6511 52 374 290 53 -354 129 1228 -142 -232 907 -162 -167 -496 -298 -22 288 -956 310 110 274 -88
6531 -88 155 -1079 541 270 175 342 -281 -589 -261 -295 587 485 -272 28 -1013 173 -1221 -9 169
6550 169 982 -167 -41 486 -105 -102 -289 -438 -291 762 -355 28 -55 -122 215 -97 -167 47 -128 -194 639
6571 639 644 23 236 281 -1388 393 423 -297 -291 304 1379 -13 39 -11 19 -92 -116 -146 -23 -296 -196 339
6593 339 -782 37 361 863 1552 -206 -13 226 -173 243 130 -799 -244 -174 432 -123 -225 -208 347 -507
6613 -507 472 25 274 -83 -308 -262 -805 -631 -211 1 -639 -303 -239 -939 -507 -85 195 -231 754 -603
6633 -603 -287 -467 -48 -656 -266 -267 -144 396 -409 69 139 477 -688 -135 632 -593 31 21 -836 357
6653 357 -1062 0 69 291 -909 -286 352 -96 -717 315 371 -800 33 345 18 -266 -262 221 -386 361
6673 361 -105 -13 -322 -388 486 828 -950 -315 450 -345 594 -63 228 -451 -19 -674 -693 593 532 259 285
6694 285 156 752 -49 17 -758 -157 39 -464 1173 -288 122 -202 -105 -295 -7 -113 22 13 295 53 744
6715 744 -488 -867 -481 343 -179 381 80 177 103 -741 -258 260 -328 -139 -131 -91 665 -21 907 -1014 -161
6736 -161 701 -846 460 -53 -134 -906 -103 34 240 156 480 386 -493 -169 -226 213 -825 -53 -535 247
6756 247 399 -380 609 473 -370 -111 546 -60 -435 914 139 454 -440 84 -77 116 -453 -29 485 -349
6776 -349 -53 300 -43 -181 -498 416 -48 845 373 -327 -249 -342 207 -1131 -401 1048 331 -468 528 -665
6796 -665 325 -198 513 15 -561 11 -49 -566 -382 -449 5 -411 -415 -229 -571 579 352 70 316 622 522
6817 522 387 -377 -609 147 162 -777 390 -333 221 -216 630 959 -53 329 -589 -65 -252 -159 174 -168
6837 -168 -677 549 13 -605 -483 -504 170 -690 -324 -312 553 1017 -66 576 -120 305 -85 -58 -40 -141 -89
6858 -89 -889 69 -411 217 -128 -240 10 -1045 -54 -437 -365 -398 48 78 -293 1049 239 460 -97 44 256
6879 256 282 762 234 256 -327 39 -154 -44 319 189 -120 -69 -488 147 248 398 512 19 315 492 76
6900 76 275 -328 -108 186 497 490 869 -440 -44 -136 -244 114 958 107 643 240 -18 -56 516 159 413
6921 413 438 554 -560 121 456 95 -428 -238 179 271 -641 -380 814 767 -409 346 681 -843 282
6940 282 25 377 -214 -621 127 -133 -272 -426 95 -75 254 -686 -861 81 -99 -524 -388 -433 -416 -181 -38
6961 -38 -415 73 166 650 179 -453 355 1443 8 -186 395 -340 601 -1075 82 -132 121 -763 -79
6980 -79 315 65 883 135 78 -183 133 -292 75 -209 -573 262 68 207 -72 63 106 -985 -288 -52 -249
7001 -249 242 -125 -546 -59 26 -210 392 553 199 -110 343 494 -314 431 -84 -252 -355 -184 35 647
7021 647 194 459 812 765 793 -168 -424 360 -535 -151 -379 -126 307 -166 -578 -351 -319 121 -387 -335 -534
7042 -534 5 -271 -77 -751 -112 599 83 244 60 -45 -637 -1409 -323 -125 292 192 80 788 -782
7061 -782 -279 -96 -1086 674 -126 606 107 350 279 747 703 -101 350 -409 -15 809 -377 171 -337 541
7081 541 -164 114 -201 -899 -508 -34 -159 -98 -79 92 681 103 82 -574 -955 -120 176 398 343 600 -68
7102 -68 -383 -30 275 -225 -100 162 -569 276 -596 1014 297 -74 -561 244 -245 -221 289 53 38 57 -480
7123 -480 202 -417 171 -1110 716 -823 172 209 -280 -97 559 211 178 456 -405 951 -548 -29 -628
7142 -628 -243 88 -741 -80 -135 -393 28 -231 782 124 -191 -77 -65 -176 -257 -346 -810 945 128 148 699
7163 699 256 -421 102 -101 -190 942 -206 134 -345 -479 533 487 -265 58 570 331 325 -293 -104 648
7183 648 -217 450 358 -3 412 246 -222 -221 -544 -433 637 -277 -495 -162 -274 120 -318 -24 -656 -224 449
7204 449 -268 -1028 -479 19 74 -93 713 -498 -783 327 313 171 -1017 17 352 -51 365 -47 -139 440
7224 440 -214 165 201 974 11 353 388 212 -144 215 -385 -48 499 104 -63 522 64 -625 228 434 1011
7245 1011 -68 314 60 108 326 35 397 -826 518 -457 -198 -293 -18 -263 133 57 133 -153 -364 -182
7265 -182 485 -21 -53 356 241 -383 -139 -748 -225 -136 113 285 384 527 -1078 334 -474 187 931 -309
7285 -309 2 733 -478 489 450 226 -605 403 119 268 128 -301 -361 192 -353 298 -512 387 -81 31
7305 31 -133 -140 -602 -172 -177 165 162 367 315 -104 -99 -478 31 290 -450 -332 -535 -177 233 -239 92 -259 130
7328 130 -276 262 192 960 22 50 -62 -105 301 -835 -550 147 313 -545 -611 246 276 66 106 -48 40 59
7350 59 -286 715 434 -704 201 -210 156 -745 -586 -87 398 229 515 -471 173 -23 350 -226 107 393
7370 393 74 -719 364 685 565 -188 802 43 -771 429 -901 422 -438 479 -185 114 1110 -235
7388 -235 -450 -721 -894 349 33 -122 -126 -193 -97 310 -327 488 -107 371 -63 -564 316 -126 1074 209 -418
7409 -418 -114 915 230 298 320 -135 -55 -275 190 -140 -132 710 820 -58 607 39 163 -474 -331 656 -339
7430 -339 -219 11 -682 -267 -362 -32 385 397 -15 -400 86 148 289 -406 31 869 -326 -1232 -423 -371 -428
7451 -428 -324 248 25 404 -61 -196 337 5 -61 -212 -379 282 -219 -750 335 -8 353 -327 65 -270
7471 -270 375 -386 -133 -530 -1026 -598 325 -912 789 -677 -244 585 1182 496 -82 130 69 -136 170
7490 170 -262 -194 313 -819 277 -58 232 237 301 -243 -36 1013 390 -401 -631 286 684 973 -565 100
7510 100 -84 -19 776 -224 268 443 -176 641 -100 -437 75 -280 -31 -81 650 754 717 250 -75 -354 -427
7531 -427 484 29 375 -129 -467 -112 -289 19 -235 -127 434 234 -482 -182 371 -204 -275 299 -330 297
7551 297 -566 -100 391 564 -70 23 293 -49 455 -31 -103 458 610 75 -289 -348 -832 395 -286 55 -1
7572 -1 -233 431 533 -484 -53 74 226 321 511 -421 -523 -366 -603 309 -309 -347 168 -352 598 -9 111
7593 111 -107 -647 -642 -1112 -589 -546 -93 -243 29 -644 478 351 -531 15 715 -45 -538 83 569 -827
7613 -827 120 -514 -251 -96 289 -14 -877 157 291 -508 161 -194 -560 166 -484 -16 29 817 145 -92
7633 -92 -15 398 928 -159 -536 579 332 -427 220 84 -436 158 330 -339 352 798 103 -481 433 -519
7653 -519 -391 568 -1127 -487 208 -91 419 -45 746 346 40 566 -250 -39 -272 -63 156 216 321 -525
7673 -525 307 -368 -482 391 188 313 -468 117 96 -348 776 -133 -583 -510 -24 -89 -164 -159 857 -211 -481
7694 -481 35 127 73 702 -294 539 -109 -592 -327 410 -109 694 107 -40 -148 -318 524 178 524 -811
7714 -811 -93 -230 -535 75 -346 -1430 435 -675 123 165 295 -352 -318 219 -770 -91 -9 960 -126 818
7734 818 219 -514 -172 -565 47 295 -13 -396 490 -230 -544 -155 710 -692 -443 -991 -79 139 -144 -203
7754 -203 211 438 35 -20 303 -463 887 262 205 -669 -299 -797 200 251 -172 -61 -176 -270 42 514 -162
7775 -162 523 216 36 209 -456 -6 -100 478 -145 -634 -550 167 10 -362 -385 -179 551 458 -530 -417 -196
7796 -196 -1265 -33 89 -87 -145 -269 1080 286 235 -20 -1259 -360 -235 400 -229 226 -350 -445 336 408
7816 408 29 -126 358 287 524 -645 1000 47 54 -206 -34 -133 423 -101 -1021 -45 -515 261 -109 551 -31
7837 -31 -180 -600 -51 90 316 55 1273 -176 -178 -559 -435 -12 169 -719 197 297 700 -459 -359 71
7857 71 461 226 -89 1079 -785 67 433 540 153 -86 8 51 -154 177 -108 546 -38 -177 -454 -299
7877 -299 -351 -452 -481 -19 69 -68 -797 -76 79 -1119 -549 575 529 -932 -294 -236 -640 106 -756 -245 337
7898 337 -288 75 -38 -8 -80 339 322 29 332 318 -237 461 -783 63 676 361 -379 101 -628 15 -261
7919 -261 254 629 -61 -844 295 26 112 -118 -342 955 -140 723 125 808 -386 763 -331 390
7937 390 21 41 -112 -728 258 -293 -226 -153 149 -189 146 96 192 -487 -154 484 -120 -112 64 876 228 59
7959 59 112 -330 -822 -215 -45 -360 588 -59 -429 164 360 -157 230 -66 -666 113 -594 11 480 82 -204
7980 -204 -142 -52 -721 -23 61 -145 -166 -457 248 25 315 110 121 480 -156 170 -124 -974 82 473 -38
8001 -38 -609 170 629 650 -651 26 240 -494 40 -624 -433 411 89 -877 -796 277 -287 267 352 -225 295
8022 295 -232 -665 -105 618 -336 678 353 920 1212 -685 -601 -277 -291 -596 95 -468 -439 681 -205 242
8042 242 123 254 -2 70 70 -221 606 34 -309 -811 -647 -221 -515 62 -25 44 33 922 -359 -134 1 660
8064 660 -154 442 -556 168 -331 157 507 -124 420 16 -249 1200 -324 491 -264 193 -212 -40 569
8083 569 -1 592 330 266 111 254 -235 407 416 381 899 345 -121 -128 -534 277 985 153 -133 -832 -49 -311
8105 -311 -442 297 -495 -448 516 424 -1253 762 -1509 226 649 546 -305 -139 -432 -238 -282 -43 -63 382
8125 382 -146 -583 -13 -224 595 -372 108 313 -22 309 -131 337 646 -223 -58 368 -33 -159 238 -11
8145 -11 392 -423 -682 -288 141 158 -51 402 285 -349 -309 -627 -208 148 -516 -921 411 576 -545 288
8165 288 -30 -338 -112 -608 -388 450 -124 340 -703 474 -39 -62 85 -298 -422 266 94 -799 -451 -163
8185 -163 -224 278 389 249 -473 -490
8191d90
##END NTUPLES=NMR FID
##END=
