##TITLE=1H_DE-57_TFA
 DMSO-d6
 64 sc, 
 24.6.2024
##JCAMPDX= 6.0         $$ Bruker NMR JCAMP-DX V2.0
##DATA TYPE= NMR FID
##DATA CLASS= NTUPLES
##ORIGIN= UXNMR, Bruker Analytische Messtechnik GmbH
##OWNER= root
$$ XWIN-NMR		Version 3.5
$$ Mon Jun 24 15:45:50 2024 Russian Standard Time (UT+4h)  she@DPX200
##.OBSERVE FREQUENCY= 200.131
##.OBSERVE NUCLEUS= ^1H
##.DELAY= (6, 6)
##.ACQUISITION MODE= SIMULTANEOUS
##.ACQUISITION SCHEME= undefined
##.AVERAGES= 64
##.DIGITISER RES= 18
##SPECTROMETER/DATA SYSTEM= spect
##.PULSE SEQUENCE= zg30
##.SOLVENT NAME= DMSO
##.SHIFT REFERENCE= (INTERNAL, DMSO, 0, 15.7039)
##AUDIT TRAIL= $$ (NUMBER, WHEN, WHO, WHERE, WHAT)
$$ ##TITLE= Audit trail, XWIN-NMR		Version 3.5
$$ ##JCAMPDX= 5.01
$$ ##ORIGIN= Bruker BioSpin GmbH
$$ ##OWNER= she
$$ F:/spectra/data/she/nmr/H-F/1/audita.txt
$$ ##AUDIT TRAIL=  $$ (NUMBER, WHEN, WHO, WHERE, WHAT)
(   1,<2024-06-24 15:42:17.31 +0400>,<she>,<DPX200>,
      <continue with go, POWCHK disabled, PULCHK disabled
       configuration hash MD5:
       00 E9 B6 7A A2 85 ED C7 34 08 36 98 17 FE 4E 26
       data hash MD5: 16K
       84 3A DB DE 37 41 0C DF 0A 99 DD 87 16 EA B7 2B>)
$$ ##END=
$$ 
$$ hash MD5
$$ 7C EA 14 63 43 21 A6 AF C3 EE 80 59 2E 13 BC 1E
##$RELAX= 
##$RELAX= 
##$RELAX= 
##$RELAX= 
##$RELAX= 
##$RELAX= 
$$ Bruker specific parameters
$$ --------------------------
##$DU= <F:/spectra>
##$EXPNO= 1
##$NAME= <H-F>
##$PROCNO= 1
##$TYPE= <nmr>
##$USER= <she>
##$AMP= (0..31)
100 100 100 100 100 100 100 100 100 100 100 100 100 100 100 100 100 100 
100 100 100 100 100 100 100 100 100 100 100 100 100 100 
##$AQSEQ= 0
##$AQ_mod= 1
##$AUNM= <au_zg>
##$AUTOPOS= <>
##$BF1= 200.13
##$BF2= 200.13
##$BF3= 200.13
##$BF4= 200.13
##$BF5= 200.13
##$BF6= 200.13
##$BF7= 200.13
##$BF8= 200.13
##$BYTORDA= 1
##$CFDGTYP= 0
##$CFRGTYP= 5
##$CHEMSTR= <none>
##$CNST= (0..31)
1 1 145 1 1 1 1 1 1 1 1 1 1 1 1 1 1 1 1 1 1 1 1 1 1 1 1 1 1 1 1 1 
##$CPDPRG= <>
##$CPDPRG1= <>
##$CPDPRG2= <>
##$CPDPRG3= <>
##$CPDPRG4= <mlev>
##$CPDPRG5= <mlev>
##$CPDPRG6= <mlev>
##$CPDPRG7= <mlev>
##$CPDPRG8= <mlev>
##$CPDPRGB= <>
##$CPDPRGT= <>
##$D= (0..31)
0 1.2 0 0 0 0 0 0 0 0.06 0 0.03 0 0 0 0 0.0002 0 0 0 0 0 0 0 0 0 0 0 0 
0 0 0 
##$DATE= 1719229112
##$DBL= (0..7)
120 120 120 120 120 120 120 120 
##$DBP= (0..7)
150 150 150 150 150 150 150 150 
##$DBP07= 0
##$DBPNAM0= <>
##$DBPNAM1= <>
##$DBPNAM2= <>
##$DBPNAM3= <>
##$DBPNAM4= <>
##$DBPNAM5= <>
##$DBPNAM6= <>
##$DBPNAM7= <>
##$DBPOAL= (0..7)
0.5 0.5 0.5 0.5 0.5 0.5 0.5 0.5 
##$DBPOFFS= (0..7)
0 0 0 0 0 0 0 0 
##$DE= 6
##$DECBNUC= <off>
##$DECIM= 32
##$DECNUC= <off>
##$DECSTAT= 4
##$DIGMOD= 1
##$DIGTYP= 9
##$DL= (0..7)
0 120 120 120 120 120 120 120 
##$DP= (0..7)
150 150 150 150 150 150 150 150 
##$DP07= 0
##$DPNAME0= <>
##$DPNAME1= <>
##$DPNAME2= <>
##$DPNAME3= <>
##$DPNAME4= <>
##$DPNAME5= <>
##$DPNAME6= <>
##$DPNAME7= <>
##$DPOAL= (0..7)
0.5 0.5 0.5 0.5 0.5 0.5 0.5 0.5 
##$DPOFFS= (0..7)
0 0 0 0 0 0 0 0 
##$DQDMODE= 0
##$DR= 18
##$DS= 0
##$DSLIST= <SSSSSSSSSSSSSSS>
$$ [...]
##$SUBNAM2= <"">
##$SUBNAM3= <"">
##$SUBNAM4= <"">
##$SUBNAM5= <"">
##$SUBNAM6= <"">
##$SUBNAM7= <"">
##$SUBNAM8= <"">
##$SUBNAM9= <"">
##$SW= 18.0517599122864
##$SWIBOX= (0..15)
0 0 2 0 0 0 0 0 0 0 0 0 0 0 0 0 
##$SW_h= 3612.71676300578
##$TD= 16384
##$TD0= 1
##$TE= 0
##$TE2= 300
##$TE3= 300
##$TEG= 300
##$TL= (0..7)
0 120 120 120 120 120 120 120 
##$TP= (0..7)
150 150 150 150 150 150 150 150 
##$TP07= 0
##$TPNAME0= <>
##$TPNAME1= <>
##$TPNAME2= <>
##$TPNAME3= <>
##$TPNAME4= <>
##$TPNAME5= <>
##$TPNAME6= <>
##$TPNAME7= <>
##$TPOAL= (0..7)
0.5 0.5 0.5 0.5 0.5 0.5 0.5 0.5 
##$TPOFFS= (0..7)
0 0 0 0 0 0 0 0 
##$TUNHIN= 0
##$TUNHOUT= 0
##$TUNXOUT= 0
##$USERA1= <user>
##$USERA2= <user>
##$USERA3= <user>
##$USERA4= <user>
##$USERA5= <user>
##$V9= 5
##$VALIST= <valist>
##$VCLIST= <CCCCCCCCCCCCCCC>
##$VD= 0
##$VDLIST= <DDDDDDDDDDDDDDD>
##$VPLIST= <PPPPPPPPPPPPPPP>
##$VTLIST= <TTTTTTTTTTTTTTT>
##$WBST= 1024
##$WBSW= 4
##$XGAIN= (0..3)
0 0 0 0 
##$XL= 0
##$YL= 0
##$YMAX_a= 676020
##$YMIN_a= -584995
##$ZGOPTNS= <>
##$ZL1= 120
##$ZL2= 120
##$ZL3= 120
##$ZL4= 120
##$ABSF1= 10
##$ABSF2= 0
##$ABSG= 5
##$ABSL= 3
##$ALPHA= 0
##$AQORDER= 0
##$ASSFAC= 0
##$ASSFACI= 0
##$ASSFACX= 0
##$ASSWID= 0
##$AUNMP= <proc_1d>
##$AZFE= 0.1
##$AZFW= 0.1
##$BCFW= 1
##$BC_mod= 2
##$BYTORDP= 1
##$COROFFS= 0
##$CY= 11.3945322036743
##$DATMOD= 1
##$DC= 2
##$DFILT= <>
##$DTYPP= 0
##$F1P= 15.6554695791079
##$F2P= 12.8336369535428
##$FCOR= 0.5
##$FTSIZE= 0
##$FT_mod= 4
##$GAMMA= 1
##$GB= 0.15
##$INTBC= 1
##$INTSCL= 1
##$ISEN= 128
##$LB= 0.24
##$LEV0= 0
##$LPBIN= 0
##$MAXI= 10000
##$MC2= 0
##$MEAN= 0
##$ME_mod= 0
##$MI= 1.114404
##$NCOEF= 0
##$NC_proc= 0
##$NLEV= 6
##$NOISF1= 3.799351
##$NOISF2= 2.8
##$NSP= 1
##$NTH_PI= 0
##$NZP= 0
##$OFFSET= 15.70392
##$PC= 1
##$PHC0= -25318.23
##$PHC1= 13.18748
##$PH_mod= 1
##$PKNL= yes
##$PPARMOD= 0
##$PSCAL= 0
##$PSIGN= 0
##$REVERSE= no
##$SF= 200.130013532006
##$SI= 16384
##$SIGF1= 3
##$SIGF2= 2
##$SINO= 400
##$SIOLD= 16384
##$SREGLST= <1H.CDCl3>
##$SSB= 0
##$STSI= 0
##$STSR= 0
##$SW_p= 3612.71676300578
##$SYMM= 0
##$S_DEV= 0
##$TDeff= 0
##$TDoff= 0
##$TI= <>
##$TILT= no
##$TM1= 0
##$TM2= 0
##$TOPLEV= 0
##$USERP1= <user>
##$USERP2= <user>
##$USERP3= <user>
##$USERP4= <user>
##$USERP5= <user>
##$WDW= 1
##$XDIM= 8192
##$YMAX_p= 0
##$YMIN_p= 0
$$ End of Bruker specific parameters
$$ ---------------------------------
##NTUPLES= NMR FID
##VAR_NAME=  TIME,          FID/REAL,        FID/IMAG
##SYMBOL=    X,             R,               I
##VAR_TYPE=  INDEPENDENT,   DEPENDENT,       DEPENDENT
##VAR_FORM=  AFFN,          ASDF,            ASDF
##VAR_DIM=   8192,          8192,            8192
##UNITS=     SECONDS,       ARBITRARY UNITS, ARBITRARY UNITS
##FACTOR=    0.0002768,     1,               1
##FIRST=     0,             0,               0
##LAST=      2.2672688,     0,               0
##MIN=       0,             -584995,         0
##MAX=       2.2672688,     676020,          0
$$ Real data points
##PAGE= N=1
##DATA TABLE= (X++(R..R)), XYDATA
$$ [...]
2527E28o84n1L23O90j298l13P4Q08O35n93j78N72r64O57n76K97K97j87l01P53
2547D89r33R66j206Q18N49o7m0k79O70m06K8m99K67N4p40L04j65k00J87N23l49
2568b9j6p5O17l86J39k08k04N76k92l10P3K1j51O87p82M67J07o98J078n07o44
2589e37J025m22K44m32m41O30l16n5P86l36L02k05q00O60m76K60L6k65N36N8J76
2610D28R9n21L14n41O27j208M16L80M3K04J61o50L21k28N13p52l8R72q49M50k9
2631A12o31Q58K78l70l60j78K98O76j29j83p35N53j0l25J97L94p16J336p08p36
2651c79L98J88m22O30r72M88M68n53J290q49M32p67j94N1m44M03N22m86K70K23
2671B97q86J172q00j45P08l88O50r98N71J78k76k31R99j026N05l78K03l26K73
$$ plain form
2527 528 -156 -207 116 806 -492 -805 -731 77 712 119 -59 513 -451 206 -370 -73 224 37 -264 489
2547 489 -444 522 -684 134 683 616 576 297 967 561 589 90 357 411 -329 -25 -190 -390 -203 320 -29
2568 -29 -45 -120 497 111 250 42 -162 414 122 -188 -115 -94 -245 442 -340 127 234 -464 614 107 -537
2589 -537 488 66 310 -122 -563 67 -249 -304 482 146 448 243 -557 103 -373 -113 -77 -342 194 252 428
2610 428 527 6 320 -221 406 -802 -386 -6 37 241 402 -248 73 -155 358 -394 -432 540 -309 141 112
2631 112 -519 339 617 247 -113 -291 7 683 554 371 -364 189 179 -146 51 445 -271 1065 357 -379
2651 -379 19 207 -215 415 -557 -69 399 -154 1136 287 719 -48 -242 -191 -635 -232 290 -196 74 297
2671 297 -589 583 -217 -362 346 -42 608 -390 181 359 83 -148 851 -175 330 -48 155 -171 102
2690A02n33j93O94q1k21L83K32J91l48K57m22l69K69N95o82L91N6k54k55K47K71
2711C30p44O10n5k72K10o9k03P5j012J168o1J98L62J4n00N16j365O99n98N83n04
2732f18K70M10K25m74J30R0n46l38P29k81M07L36k47O85r07k49K74M90k26O3n31
2753c08Q98pl18n56l62l36J003J17J69r66L08k77O68N39n35R09p60R53j636Q31
2773C34o51J31L61l30j39M79o52P71q9K95l85k61K88p58Q49N5j92k13J65M75j032
2794d99L06M06l86j6m12J91N62J156j222J13j86K99k62j22n5J10P71o46M15o88
2814a65j09m99O49L22k20M54l89r48M18Q89n28J39J72j40K51J22m29m22N59R3
2834B19L0K16m03J26k37R44j254M51m0r06J058q24J003r70M26J23k62o3M47j61
$$ plain form
2690 102 -431 -624 70 -11 -232 151 383 574 226 483 61 -308 -39 556 -126 265 321 67 -188 59 330
2711 330 -414 196 141 -131 79 10 -193 -118 -1130 38 -23 175 537 551 51 567 -798 -99 -697 -114 -618
2732 -618 -348 62 287 -187 -57 33 -513 -851 -122 -403 4 340 93 778 -129 -378 -104 386 160 223 -308
2753 -308 590 583 265 -291 -653 -989 14 131 300 -666 -358 -635 33 572 37 946 186 1139 -497 334
2773 334 -317 -186 175 -155 -294 185 -467 304 215 510 125 -136 152 -606 243 298 106 -107 58 533 -499
2794 -499 -193 213 -173 -189 -601 -410 152 1308 86 199 13 312 50 -72 -127 -17 754 108 523 -165
2814 -165 -274 -773 -124 198 -22 432 43 -905 -487 402 -126 13 185 45 296 418 -11 -433 126 219
2834 219 249 465 62 188 -49 895 -359 92 52 -854 204 -620 383 -587 -161 -38 -300 -363 84 -77
2854g7n9m1j30N4J29R90j038k55R56m05Ll48p60N57M14p5m79M16O75K77N6l78
2876D82n31mP57j330P34N31n09n88J68J10r6L27j64k38J63O5jn0K08qO5k60n87
2899g56J702o72j87J60l4J18q57R76j064J079L88j58l88k60J97N4p9O74j591N12
2919a86N39j08l36M39k99J38O0j157O22J546j285L94k73p25K00N86k4j02M56j454
2939i69J130m98N73m41M52n73m79P03j173J590J89q6k06n87N44q48J82N94k29
2958a32n0K83K90q62O64q4j94O4M00k08K50m39K7j006J426j006R40n11l3L55L16
2979D90p03o44J432L0O9o53o3M04l28m32P0R6KoP45n77R6J76J0O72p27k79M44
3002C24K43n71K00j92M3k4j98J10J1J59l10j83O92l08k70j74O58o1K47k80l14
$$ plain form
2854 -77 -136 -177 -307 -253 -124 866 -172 -427 529 124 127 -221 -981 -424 -10 -85 -564 -148 527 804 860 482
2876 482 -49 -53 704 -626 108 639 130 -458 -290 -180 -276 51 -113 -351 -188 -123 -124 -174 34 26 91 -169 -756
2899 -756 946 274 87 247 213 331 -526 450 -614 465 853 695 307 47 244 298 219 893 -698 -186
2919 -186 353 245 -91 348 49 187 247 -910 -288 1258 -27 367 94 -631 -431 155 131 29 485 -969
2939 -969 161 -337 236 -205 247 -326 -805 -102 -1275 315 504 418 212 -375 169 -679 -497 97 -132
2958 -132 -182 101 391 -471 193 109 -85 -21 379 171 421 -18 9 -997 429 -577 363 -148 -181 174 490
2979 490 -213 -857 575 605 674 21 -42 362 34 -398 -328 -232 -230 -236 509 -68 28 204 214 886 159 -120 324
3002 324 567 -4 196 4 47 23 -175 -65 -54 105 -205 -388 304 -4 -274 -448 210 149 396 116 -198
3023a98O59j03p3J05n42Q07j70j96j69q73J085q11K97j017J199J018j223J99p53
3042g59J82J244q09ok87j35K97M59J45r26Q53k82j101J463o63J005p45L72q13
3061e06l61J000n08l06N70o32M86q6O20o88J82j22L41N28k88k95n82R02R7m47
3081i5K20L2m22N22p51Q03m47M51m52M24J43n80m20J200m48l33J40m23J166q50
3101a20L42K98J31r49M7M87o77q2O17r52Q91n96P26j90n13Q38l40R8o69J20k71
3122g64K99O84n6r6N03j054P00l94N79j22m34r6k80J28K2J09K54L20m79Q32j463
3143h08J207K76j123M54j82K36q74R58L74o0m82m23N31j90N42j09q82j05R50k46
3163D4K85m54R6j35O3R63j415K79J21K53P5l3K74p62Q96l50K95l80k5n7l67J08
$$ plain form
3023 -198 461 358 285 390 -152 655 485 289 120 -753 332 -479 -182 -1199 0 1018 -205 -6 -759
3042 -759 -577 667 -142 -148 -435 -570 -273 186 331 -595 258 -24 -1125 338 -325 680 -65 307 -506
3061 -506 -867 133 -375 -681 -111 -743 -257 -343 277 -411 -229 -351 -10 518 230 -65 -647 255 352 -95
3081 -95 125 157 -265 257 -494 309 -138 313 -139 285 428 -152 -572 628 180 -153 -13 -436 730 -120
3101 -120 222 520 651 -298 -251 236 -441 -523 94 -858 33 -563 163 -27 -540 298 -42 56 -613 -493 -764
3122 -764 -465 219 163 67 570 -484 216 -178 401 279 -155 -251 -531 -403 -381 -272 -18 302 -177 655 -808
3143 -808 399 675 -448 6 -176 60 -814 144 518 458 -24 -447 84 -106 436 327 -555 -660 290 44
3163 44 329 -125 -29 -164 -101 862 -553 -274 -153 100 175 142 416 -346 550 200 495 115 90 33 -334 -226
3185b26L79m43k59J211r16l66N32L19j074Q73J22p47r5J068L1n05K29n49J052
3204F36l59l48K59j005J290o07o31K39O32o06J68M85J81m20P7L6L29j36L05j038
3224e13l93P01N0L67J55j017L84J31P51j67l1j064O08k31N1r2Q10q33m41M26j29
3245d77M99O55o95k46O35n80J46M63l03m03O72j02q42J109p32J077j011R36q06
3264eL81k40l46j43J04L95n4m02O27J60l33l55m06Q58p01L56O76o10j04Q40j008
3285c10L14O40o96N83l80q24J250n97l7J24K64l69J07K28n30M12L0L46r12Q21
3305D64r98O02n58Q51l07M32p5m22P69q77k56O20n64K15J03J21k5J05k88j60k62
3326e10R94K21j156L45l10R3J6R17j017M46m19K73L95j137J427L85j561m51J251
$$ plain form
3185 -226 153 -290 -549 662 -254 -620 -88 231 -843 30 152 -595 -690 378 409 -96 133 -416 636
3204 636 277 -71 188 -817 473 -134 -765 -526 106 -500 -332 153 334 -86 -9 27 356 220 525 -513
3224 -513 -906 -205 -155 212 367 -650 -266 -135 616 449 418 -646 -38 -269 -218 -310 500 -333 -774 -348 -477
3245 -477 22 677 -18 -264 371 -209 -63 400 97 -306 366 264 -578 531 -201 876 -135 801 -5
3264 -5 376 136 -210 -353 -249 146 92 -310 317 477 144 -211 -617 241 -460 -104 572 -38 -142 698 -310
3285 -310 4 644 -52 531 151 -673 577 -20 -57 67 331 -38 69 297 -233 179 209 555 -357 464
3305 464 -534 68 -490 361 54 486 411 -11 758 -119 -375 245 -319 -104 -1 120 95 200 -88 -248 -510
3326 -510 484 705 -451 -106 -416 -323 -307 610 -407 39 -380 -107 288 -849 578 963 -598 -1049 202
3345B02j29l65L43l53J47K35J07Q0n34M12L9j49O04j02p81N60k80n82J104l75
3365A83n90P85p88L03j01M08q32L23J36M08l49P56m06o12O49n67O14j135O38j89
3385c66M52n04K83k07O28r0O1ok77J66p18J83L54O0j0l21N30J52o87J85k24j32
3407d88Q74p68L06K09n15m82J265N24o34l89q47N4K99K16l9J20K78L33p04j34
3427e22M94L69m52N4L38k08k74j6M15o01R13q96P29n76P08j091M43l22Q14M53
3447G72j103R3J87k35K31j25Q94r76L72r3K31j94n94K93K40J26M86J1q76Q89p58
3468a29O58j65j27l05L46l88K08J45k89K02N4l70R1j77m65P27k74M2M42p8k83
3489a35Q8M29q27N97O5n76O99j11j81m47r5J71j3j28N45k29m3J051j339J156m82
$$ plain form
3345 202 73 -292 51 -302 -155 80 187 267 -267 145 184 35 639 537 -244 316 36 -546 558 183
3365 183 -407 378 -410 -107 -208 200 -632 -309 -173 235 -114 642 236 -376 273 -294 320 -815 -177 -366
3385 -366 86 -418 -135 -342 286 196 257 251 -26 140 -578 -395 -41 19 9 -312 218 370 -317 -132 -356 -488
3407 -488 386 -382 -76 133 -382 -864 401 925 291 -98 -945 -891 -592 -376 -415 -295 -17 316 -388 -522
3427 -522 -28 341 -111 -57 281 73 -201 -217 198 -403 510 -386 343 -233 475 -616 -173 -495 319 772
3447 772 -331 -238 -51 -286 -55 -180 714 -262 110 17 248 54 -540 -247 -7 119 605 616 -260 629 -129
3468 -129 529 364 237 -68 278 -110 98 243 -46 156 210 -160 -69 -246 -711 16 -258 -216 226 148 -135
3489 -135 -47 382 -445 152 217 -359 340 229 48 -399 -494 -323 -336 -464 81 -148 -191 860 -479 677 195
3510A95L12o84N42m57n78N55J13q5J3O96l57j05K06K02n92N8p8O10j230P93r38
3531h09J88O43l38J88L3J62J128p70k85o53R05p27J017p34K69k12N70q0j021N19
3551gn65k32J341n70L6K75k39K3j14O75q83O45j162P27K72j2k56p4n55P28K01
3572B54o20L72o05N49L36J045j408k58L07j08O89m34n9n29m37J013r52N66M21
3591A42N77q65J67K65L56j45n13l11N03k29n45O19j03K27k10M12q74L23J084l48
3611E32j254J406n82l65n85J147J73p36K64k97m20J226l92m28P83l2n71n86Q02
3630H5q72O58j0k80K8j75J005n54l77J64K59M33l71L05k62q7K7N28k75M72q92
3651a91l57Q27O1Q69j362n53l2R54j01j57Q01m98j06r17J882j613K88N09L35p84
$$ plain form
3510 195 507 -177 365 -92 -670 -115 -2 -87 -74 622 265 160 366 568 -24 34 -44 566 -664 129 -809
3531 -809 -621 22 -316 -128 -95 67 1195 425 140 -513 392 -335 682 -52 217 5 575 495 -526 -7
3551 -7 -572 -804 537 -33 3 278 39 62 -52 623 -260 385 -777 -50 222 210 -46 -120 -675 53 254
3572 254 -366 6 -599 -50 286 1331 -77 -335 -28 -136 553 119 60 -469 -906 107 -845 -279 142
3591 142 719 -146 21 286 642 497 -16 -327 176 -53 -598 21 -82 145 -65 347 -527 -204 880 532
3611 532 -722 684 102 -263 -848 299 472 -264 0 -297 -717 509 117 -311 472 440 -131 -717 85
3630 85 -787 -129 -139 -419 -391 -566 439 -115 -492 -328 -69 364 -7 298 36 -51 -24 504 229 701 -191
3651 -191 -548 279 340 1209 -153 -706 -738 216 115 -42 759 261 155 -762 1120 -493 -205 304 639 -145
3671a45M44o28j04K49M86l14o84N78o89J58M75J02Q41l45J46N90j700M14N66n66
3691a26k56N39M96l51J17m76R70j234QM23k94N48j406M82j01O77j22n69R14n28
3711b89K97Q3K62l59N1R45q78o76J83N89l33L76n37n33O46J90m57l61J026l04
3731g9K44j148J788j417M98K7j55J68P96j449Q07M1J42m11J94j79K6P46r36J07
3751a90N97j41n72j30Q07k69J13p4M0l5M45k59L87r52M41j89O09l79m97Q2r3l76
3773f35M45Q38j623J222q9Q62r25ol84N76J34j033N96m72k4O95k52k79M01l31
3793b84P82p76j13n3N59P1Q7L03O7j054O79n75P87K42o16O2m30Q06j092Q36k59
3814B9J39km09k33K80N85L32r03K11O5N99p15p2P66r29Q26N03j588N50N36j154
$$ plain form
3671 -145 299 -329 -433 -184 302 -12 -696 -118 -807 -649 -174 -72 769 424 570 1160 -540 -126 440 -126
3691 -126 -382 157 653 302 419 -57 913 -321 -313 110 -184 364 -1042 -560 -661 16 -106 -675 239 -289
3711 -289 8 91 353 -6 45 990 112 -564 -381 208 -125 251 -286 -819 -173 17 -440 -801 225 -79
3731 -79 165 -983 805 -612 -114 -87 -242 -74 722 -727 80 121 263 -148 46 -133 -107 639 -297 -190
3751 -190 407 266 -306 -436 371 102 215 141 181 146 591 332 719 -233 208 19 628 249 -248 -166 -259 -635
3773 -635 -190 648 -975 247 158 1020 95 89 -295 281 415 -618 -22 -494 -518 177 -75 -354 47 -284
3793 -284 498 -278 -391 -444 115 186 273 576 643 -411 268 -307 480 722 106 168 -262 544 -548 288 29
3814 29 168 166 -243 -476 -196 389 721 -182 29 94 693 -22 -94 672 -257 569 1072 -516 34 570 -584
3835e84K26P72o20l02K68p90J684j394J300l12j54k52mJ37P2n02M98J76p75P3
3855d83J581p15j272J326Q06k41l06n52L22n05n09Q44q70J113k19l59J2K19L94
3874E86j063J74P96o73L96l24l98L93l57Q72o05M36J66r01P32q24K73L51m79O14
3894A65l20L68K6k56q4L41l21M29q1q1m7l04O0K80j25k43O18n78O41o14j114R20
3916c20N10J10j33p7k17M29l3l78J42l62K20O39q72N0j45N40K86n78K69l31K73
3937B2l33O25k43l94J129p92J91J81r23J115q24n20P88q4M67R5l62p34J399m62
3957C41m87k31Q1Q27o92J41L15K58q12r50J082Qm9L32L81m56q86J169j99l14P11
3978E70o13P80j204M64M33j424Q21N65l47r26M84N44O13n35r44R42J97j57j25
$$ plain form
3835 -584 -358 414 -206 -508 -240 -1030 654 -740 560 248 94 -158 -162 -25 47 -455 43 219 -556 -483
3855 -483 1098 383 -889 437 1243 1002 696 144 466 -39 -548 296 -574 539 320 -39 -27 192 586
3874 586 -477 -303 493 -180 216 -108 -506 -113 -470 402 -203 233 399 -502 230 -594 -321 30 -449 165
3894 165 -155 213 239 -17 -101 240 -81 348 267 186 139 -165 -105 175 50 -193 425 -153 488 -126 -1240 -320
3916 -320 190 300 167 90 -127 302 269 -109 33 -329 -109 530 -342 -292 -437 103 389 -189 80 -251 22
3937 22 -311 314 71 -323 806 14 205 386 -537 578 -246 -766 22 -62 405 500 138 -596 803 341
3957 341 -146 -377 -296 531 -161 -20 295 553 -259 -1209 -127 -119 -168 164 545 89 -797 372 173 -141 570
3978 570 -43 737 -467 -3 430 -994 -173 392 45 -881 -397 147 760 225 -719 223 420 263 138
3997A38k73K18N77m59l1K68l16n94q4O24j37m59M25P89j233M46n84J223p74M71
4017B35m16M20m25O53o37L13L13m53N83j038P66r30O40L30K2k93j098Q08L04K4
4037A21j30j98L2N4k8M90o03L61k06M09K34n96L10m24O32P9j27j31j347J602j
4058E33r30M19O47l64q76O22K37l25J57k72L83K2n98j23K72R76m46K20j31k79
4078A44M57j026J164r72M96K2J59j14l11L67m60k40N29l91L76l91J329j484P45
4097C99l96M59k78o83K070j986M81P11l84M88j359M96J68m89m3M89j60J09k14
4116a22M36j013N55R00q95P45k9o25k27M20p67n4J432n02j816J687K01l94m56
4135e24L01M47n00j31j30O56m5n15Q12pj143J001m15K77l47M96j160L42Q96m41
$$ plain form
3997 138 -135 83 660 201 170 438 122 -472 -556 68 -69 -528 -103 686 -547 -101 -685 538 -236 235
4017 235 -181 239 -186 467 -170 143 456 3 586 -452 314 -616 24 354 376 83 -1015 -207 97 121
4037 121 -9 -207 -175 -121 -149 341 -262 99 -107 302 536 -60 250 -174 458 537 410 279 -1068 534 533
4058 533 -397 22 669 305 -571 51 288 -37 120 -152 231 253 -345 -468 -196 780 334 554 423 144
4078 144 601 -425 739 -233 263 285 444 330 19 386 -74 -314 215 -176 200 -191 1138 -346 399
4097 399 3 462 184 -499 1571 -415 66 777 393 881 -478 18 186 -303 -346 143 -17 92 -122
4116 -122 314 -699 -144 756 -139 606 577 -48 -275 145 -622 -676 756 254 -1562 125 326 -68 -524
4135 -524 -223 224 -276 -407 -537 119 74 -441 371 364 -779 222 -193 84 -263 233 -927 -585 311 -130
4155a30l25m26J343r93M70k83p7q8P76j48N07J09q69j79o66J037p7N55n32M39
4175D43l16K16p90kM12l1N32j204R48R0o90J51j15J110p59J102j161M18k82J60
4195B32J39m42M47o85o1Q40M15o1j315Q14k40N4p31rK34j31J026p4p73M64J25
4216B68n68k84M08L60J75k58L5O19l21O01j428J037j102k16P57j13j85N65l08
4235D2q0j5L28l3n5m93o3J136p15M31k24j035J036k66K63K24p67P21m99m9J48
4256C5K69m81j21M94L58j084P05K25r90L00k81J74M53N12o19N93l07m61K7M9P04
4277E54O39r44K3l82M95n43P13l97p41N59L39k83K94n70k52K79Q70p36M77j400
4297a006J373M0m30Q4O73n75r6O61o92r17M05J100n91p28Q57J02p71J107l56m66
$$ plain form
4155 -130 -455 -881 462 -531 -61 -344 -421 -509 267 119 626 735 -134 -313 -979 58 -19 536 4 443
4175 443 127 343 -447 -449 -37 -68 464 -740 208 298 -392 -241 -356 754 -5 1097 -64 354 72 232
4195 232 371 -71 376 -309 -370 470 885 824 -491 323 83 137 -594 -603 -369 -500 526 452 -321 143 268
4216 268 -300 -584 -176 184 359 101 136 755 434 1035 -393 644 -458 -674 83 -30 -215 350 42
4235 42 -38 -53 275 242 187 -306 -369 767 52 483 259 -776 260 -6 257 481 -286 435 -64 -113 35
4256 35 304 -177 -298 196 554 -530 175 400 -590 -290 -571 -397 56 568 -51 542 235 -226 -199 -150 554
4277 554 1193 249 272 -110 385 -158 555 158 -583 -24 315 32 326 -244 -496 -217 653 -83 394 -1006
4297 -1006 367 407 -23 61 734 159 63 724 32 -885 -480 620 29 -699 158 260 -511 596 240 -226
4317b26k13j17M25L59O09j669J095j80j003J801p60j155P60L28O31k91M05j170
4335c71J78mj19P82q0p02J90n02Q11l37j30n87Q22N88m54L90m86j07k53J6K86
4356f9l91K61M02n99M02M07k25j85k56M48k01L28p55O14N60q29N86q87j95O28
4376D4K83k36K4N61J14q30L02q73O77k9K20k26n10l75J017K18N9j159q9J227k40
4397A79l70l54M10j42k79J080o91K62O10j186K74k59O87m07N40p4k64n83Q08r23
4417f82j6L27Q3j91J076m84q54O15L51m74l88L38P7M12K9N3K81p63J99m3M23j061
4439f92J176n67J007l89j394O80K75l53N70j092K90J275o54K56m68m09J20L2j97
4458e34M07M82j03o81j66R22j94K73o00O96r39J73K63l51L37M72o94K48L3l13
$$ plain form
4317 -226 -439 -556 -131 228 837 -832 263 83 -920 881 121 -1034 -274 54 685 394 799 -371
4335 -371 -193 -197 -316 466 386 -316 -126 -628 183 -154 -284 -871 -49 539 85 475 -11 -118 -371 -355 -69
4356 -69 -460 -199 203 -396 6 413 188 3 -253 195 -6 322 -433 181 741 -88 498 -389 -584 44
4376 44 327 91 115 676 790 -40 262 -611 66 37 257 31 -479 -854 163 381 440 -719 -808 419 179
4397 179 -191 -545 -135 -277 -556 524 -167 95 705 -481 -207 -466 221 -186 354 280 16 -567 241 -682
4417 -682 -698 -371 -288 -479 597 113 -741 -126 225 -249 -637 -299 -222 190 219 272 553 -210 -11 -54 369 -692
4439 -692 484 -83 924 535 -859 -179 96 -257 313 -779 -489 786 132 388 -80 -489 -369 -337 -534
4458 -534 -127 355 252 -429 -595 327 133 406 -194 502 -437 -264 -1 -352 -15 457 -237 11 44 -269
4478b69p77M30R47K76p36O84n92o2m64J049q71l11O62K14m83O25j79K35l93l34
4498c49O90M1j36K31k64n25K27m34Q56m41n18M71N37m2k06j31K64l83L0m28N48
4519C8K8O25q41L43k47l1L44k97l24K45j76O80k76j91j89N9M86Qk18N3k53K4K33
4542A23l09J14Q16r66J04L35j82J94M02o52k21K49j96R32q73M63K37n4l80k74
4562a38M68m47L09l2j2o65K54M46r57J111J78q56N46J47k36J09l03l82M16j04
4582a48k51M02L4L38k66M07j141K80M40q94Q54K37R80o33k35o0J46j01j57L32
4602E64m11L65j39o14n08L01K54O1J04M28r68J95R38p87l22Q6N82L64q18N10O71
4623H56o03M7q02J037o48R1N7P27j053k4P5l50J011m89k34L11J60j04J55l51k76
$$ plain form
4478 -269 -1046 -616 331 607 -129 555 -37 -99 -563 486 -385 -696 -34 180 -303 322 143 378 -15 -349
4498 -349 341 382 246 477 213 -312 -85 -519 337 -104 -622 -151 386 344 138 7 271 -112 -82 -510 38
4519 38 66 691 -150 193 -54 -85 259 -38 -362 -117 -293 387 111 -80 -269 -210 276 284 66 119 -134 -110 123
4542 123 -186 -72 744 -222 -118 217 35 229 631 -21 -242 7 -189 743 -130 333 570 516 136 -138
4562 -138 330 -117 192 160 148 -517 -263 183 -774 337 515 -341 205 352 116 225 -78 -460 -44 -148
4582 -148 -399 3 37 375 109 516 -625 -345 95 -799 55 292 1272 639 404 344 490 389 232 564
4602 564 153 518 379 -235 -743 -442 -188 -127 -23 405 -563 -368 570 -217 -539 -453 129 493 -325 185 856
4623 856 253 300 -502 535 -113 -22 35 762 -291 -315 -240 -590 421 -68 -302 9 169 65 220 -131 -407
4644d07M60P5L01j59K97k36k72m28K49K34o08Q60p11M4O74r62P93r18N89L30J5
4665B20n08J49J070j418M22Q2q0L67j95k06k29m1K51o07M9Q71j210J550q90K17
4685a36R0l83O58p88m3J372j201R93m01m48J24Q86j071K48Q80n83m60l61Q80J89
4705D45m26N0j58m92k83R59J06j30l15O34n90k13Q9K2N23m33Q68l88J93n19M02
4726C44r85J035l75J92m51N69o18k79J560r57Q1o68Q21J89j61j28j50k35K25l93
4746c84P63J04r57L57L23j79Q4N64o65m59O11j27Q2K04j138M09O77k77n72P58
4766A78J26J25N3j124N32K91r4j55k84k62k16P01L1j86P89p12M02j24n94J339
4786H16p99j34P5o21O73j66L03L36p43l16O77j38Rm40P81p72N06m65N23r48Q96
$$ plain form
4644 -407 53 128 429 270 567 331 59 -369 -120 114 -494 366 -345 -301 373 -589 204 -714 -125 205 220
4665 220 -288 -139 931 -487 -65 17 -63 304 109 -97 -326 -367 -116 -723 -674 197 -1013 537 -353 -136
4685 -136 -46 -429 229 -559 -602 770 -431 562 161 -287 -163 723 -348 -100 780 197 -263 -624 256 445
4705 445 19 69 -89 -581 -864 95 201 71 -244 390 -200 -413 -324 -302 221 -212 656 268 461 -58 344
4726 344 -641 394 19 211 -240 329 -289 -568 992 35 116 -552 269 458 297 169 19 -216 9 -384
4746 -384 379 483 -474 -117 206 27 111 675 10 -449 162 35 117 321 -817 -408 269 -8 -580 178
4766 178 304 429 482 -642 -110 181 87 -68 -352 -614 -830 -129 -98 -284 505 -207 195 71 -523 816
4786 816 17 -117 -42 -663 10 -156 147 483 -260 -576 101 -37 -28 -468 313 -459 47 -418 105 -843 53
4807E3q64Q58Q17j994J431l56j30J46l17J148p71L25K34p75K08M54m59m15J071
4826F64o60J71p11N50K78L85K2o15l04J38O12j271J36RN01M17j04l78N18o56M14
4847A16J78k01N9q62N57l03L85L97j3J20l13m94M69q17N23N50n46r3M08K05M93
4868H18p33k09O2m59O80O56j296J25Q99o4m18K94m39K43j60M66o45o99M79O49
4888B49l6J06o11L03R6N48j064Q95l52n27J68K25k95J26m6M34L01j144J101q16
4908c39o4L75M82R8j85N1L50l84o88N72R4j31l2l63K37l41l84j7J52K80n8P99
4930E04o34N36N3p56K58P72o32N83l63q06J54r7O94o60P49q72J023o23j48J67
4950i8N47p31J013n70k50J24Q9p16J025p96R8M28m87J175l32p1o97L9L12n20L48
$$ plain form
4807 53 -811 47 864 -1130 301 -55 -185 -39 -356 792 21 346 580 -195 13 467 8 -407 664
4826 664 4 175 -536 14 292 677 699 84 -220 -82 530 -741 -605 -596 -95 322 218 -160 358 -298 116
4847 116 294 93 152 -710 -153 -456 -71 326 313 433 120 -374 95 -722 -199 351 -195 -288 120 325 818
4868 818 85 -124 -62 -521 159 815 -481 -356 543 479 61 355 -84 159 -1 465 -180 -879 -400 249
4888 249 213 319 -292 11 107 655 -409 486 134 -393 -225 0 -295 -169 -215 219 520 -624 477 -339
4908 -339 -403 -28 454 552 367 418 768 384 -304 268 362 231 199 -164 73 -268 -652 -669 -517 -237 -295 504
4930 504 -130 406 459 -297 -39 733 101 684 321 -485 -331 -428 266 -394 355 -517 506 -117 -265 -98
4950 -98 449 -282 731 161 -89 35 124 -592 433 -363 -265 163 -324 851 519 448 -249 -210 102 -418 -70
4971g0M11k5q77J110k98j78M46n01J063n42q10O94j83j14n24l61L69o4J30R95
4991F71o46M3k9k03L80l35l16K50O45j521J035J06L38r11O82m80N91L02p96j5
5011b09k05J096o90L12l58l80r7Q52j48l28K17k82l03R26o71o5R48k24J11q93
5031c91J477o94j046P30Q0n64J442l53p56O98l1o16R23n32r90K48J106l67l44
5050B0%J83j45j87K3n77P26j89L98k46N15J48q56o4j26L22o29J171n02L41M21
5071G47K83o38m68rl76Q99qq36R5M68L34j54p42R03r52J098r47M45j1n47Q38K61
5093F83l92j46j76o49J103q57K18N39j197M28L68K88K20k89O25r84K9m58P19l91
5113c19J76M78j4j109J157n40J75K24p69R59j80l91Q98n98k35n67Q83n41Q5R81
$$ plain form
4971 -70 341 316 -561 549 251 73 519 18 1081 539 -271 423 240 126 -398 -759 -390 -454 -324 671
4991 671 25 68 39 -164 216 -119 -435 -185 460 -1061 -26 80 418 -493 189 -291 300 602 -194 -209
5011 -209 -414 682 -8 304 -54 -434 -531 321 173 -155 62 -220 -523 403 -268 -333 615 391 502 -391
5031 -391 1086 392 -654 76 156 -408 1034 681 -75 623 592 -24 899 367 -623 -375 731 364 20
5050 20 20 203 58 -129 -106 -683 43 -146 252 6 521 669 -187 -251 -377 -55 -684 487 -15 326 747
5071 747 1030 392 -76 -85 -461 438 430 -406 -311 157 491 337 -405 498 -454 644 -303 142 131 -416 422 683
5093 683 291 145 -31 -680 423 -434 -216 323 -874 -446 -78 210 430 141 766 -218 -189 -647 72 -319
5113 -319 -143 335 321 -788 369 -171 4 228 -541 418 238 -153 745 147 -88 -655 228 -313 -228 753
5133G53m37j097M45O32L06o61n92N59j5k67Q5J25m83O73j16j30n17J04M7J184
5153E98j125k80J003L28n86k4M77j74O34L1l28k91q7k84m60O29R8J0K3l52k0l54
5175e34O20p00J09R11Jn51k75k57J134p63R37n63k4p30R2J378p21K78J40m22l80
5196c20K38J59j67J54J89p35m16M94L75m74J295o55k65n48K97O82j0J32o82L59
5216A02K2J11m48M39K25p96p1J084n51M9n10K25N81m02O00n89q47M53J017n10
5236A84k40M30o91N64l66N26n21J36L98k28m85M88j04J55J85l16j43M84l26l4
5256I6L68j6o03K12k86J41M63j76L39p07l10J033o58l79K44M09k14k7m72j61Q91
5277A87m62N01p2m20k55R07l8n0j80L96o73P1j74J1K31R9j145N16J205k45q82
$$ plain form
5133 753 316 -781 -336 296 602 -59 -651 -92 -107 -374 -289 -164 -647 26 -90 -220 -737 -633 -586 598
5153 598 -527 -807 196 524 -62 -86 391 217 851 882 554 263 176 -108 -568 61 159 169 192 -160 -180 -534
5175 -534 86 -614 -505 406 407 -144 -419 -676 458 -305 632 69 45 -685 -593 785 64 342 482 60 -320
5196 -320 -82 77 -90 64 253 -482 -898 -404 -29 -503 792 137 -128 -676 -379 303 293 425 -257 102
5216 102 124 235 -213 226 451 -345 -416 668 117 166 -344 -119 462 60 660 71 -776 -323 694 184
5236 184 -56 374 -317 247 -119 407 -114 22 420 192 -293 195 91 246 431 115 -28 456 130 96
5256 96 464 448 -155 57 -229 -88 375 199 538 -169 -479 554 -104 -483 -239 170 -44 -71 -543 -704 187
5277 187 -275 226 154 -266 -521 386 348 298 118 514 -159 -88 -262 -251 -20 79 -1066 -550 655 410 -472
5298d72M24K6ON96k62r6j35n73j4K63L04l11L24k94l09n31J052J30J38M3j71j21
5320A7N3J41k0m74P69q02m25J235n05m60J93K05l5K60M1j79J87J47j96J79q37
5341e06Q77j53O17m57p43K91K87m12L14J35k83J86o1J04l89O62k05k82j8n96J51
5362d81J362n78o39O31l75M26L21n24q28N57P1J62k51J84M47p65j07M62j72K30
5382A33o20P63p40j4O94l44k76M11O89J16l19j58k23J89j16Q8m10K68J31p29O48
5403A81q8l33M22m81R89p00k75K27n64N17l73Q16q38L16p28J675p73O87n48M40
5423E69o41j2j90L25R38j419K88Q84p58k97M44K0j32k80l64R98l75L48l9N01r22
5444a14J99m97M65k76O72k80k2Q2K31j709J280j12N1M67j186N27r9k10J65K21
$$ plain form
5298 -472 -48 -22 -16 580 318 222 87 -486 -500 -237 67 -244 80 -214 -523 -1054 -2 128 266 309 138 17
5320 17 70 211 191 -283 486 -316 -741 494 -11 -471 -278 -73 -108 152 193 14 201 348 152 331 -506
5341 -506 371 218 835 378 -365 -74 213 -199 115 250 -33 153 92 196 -193 469 264 -18 -36 -632 -481
5362 -481 881 303 -336 295 -80 346 667 143 -685 -128 -57 105 -146 38 485 -280 -387 75 -97 133
5382 133 -487 276 -464 -478 216 -128 -404 7 696 812 493 335 112 301 185 273 -137 131 262 -467 181
5403 181 93 -240 182 -299 690 -10 -285 -58 -622 -105 -478 338 -500 -184 -912 763 -10 677 129 569
5423 569 -72 -84 -274 51 989 -430 -142 742 -16 -313 131 151 19 -261 -625 373 -2 346 307 808 -114
5444 -114 85 -412 53 -223 449 169 147 229 460 -1249 31 -81 -30 437 -749 -222 -321 -531 -366 -145
5464a45m59M05K11k70P52n09J068m83q22O57n51K59o76O05p4J07Q18q49J55p71
5484e72J32P68j436J623p68k17M95K61j81p93J433j192Q94O4k77k13n1m9Rr9l40
5505e09M13k09L71J17O09k41nm48K24p14Q21r07N15m02N46O4j34R7j71l39L54
5526E2K88l99J60l98KO54p20K55R5k21M37j20j15j17R04q22p19P04L93k20k08
5547a15m33P51l41j8N42j66J81L3j91l37k66N16M58q91m01L48K27n23Q29M42o21
5568B4M21o22j81O64p84R56L60n79m48j97m6j06M78M27n33L95l07n68K94J67L93
5589B08o02qJ97l98L43k11L46J18L19K05l75l3j011l45P54j81K07N63K00m6J89
5610D39n95j62J49K14J02k64m16J012O9L21q61k4L57j109Q23J95k73M8K68m05
$$ plain form
5464 -145 -604 -199 12 -258 494 -15 1053 570 -252 405 -146 113 -563 42 -32 75 893 44 199 -572
5484 -572 -440 328 -1108 515 -253 -470 25 286 105 -688 745 -447 447 511 234 21 -30 -79 -70 -169 -509
5505 -509 -96 -305 66 183 792 551 546 98 322 -392 429 -478 37 -365 181 245 111 208 37 -302 52
5526 52 340 -59 101 -297 -295 359 -361 -106 -11 -232 205 85 -30 -147 757 -65 -784 -80 313 93 -115
5547 -115 -548 203 -138 -156 386 220 401 434 243 -94 -360 156 614 -277 -678 -330 -103 -626 203 645 24
5568 24 445 -177 -358 306 -478 478 838 259 -189 -386 -432 -538 -60 367 -166 229 -78 -646 -352 -185 208
5589 208 -394 -402 -205 -603 -260 -471 -125 -7 312 517 142 109 -902 -1247 -493 -674 -467 96 296 250 439
5610 439 -156 -318 -169 45 147 -117 -533 479 548 869 8 -16 341 -768 55 250 -23 25 293 -112
5630a12M57l55K59J05r0j6p50N49K58K97j199O49K51l25k49N60L8M9j24j73j35
5651e6l71R24q89R54m00l09J62L34J67j597J273j37m26J37Q72n86p88M97J38O31
5671E30q0l67M13p96K74J6K57n43O1m45N37kJ37O5j34N8j00j30m07J101O9q48
5693c34M91l91k78J214l73J08m90J045p16o74M02k56r2P57k50n42m0L67o49M55
5713b46O2J09L03M67q31M2L7K4K28M68n24K20K6J07p58K47L71m36J42j37n35J10
5735e04L50L25o4L99j063m0M82m49N97J16M8m81L69K81K18n23Q44J10q67k92L11
5756A67K06q22l89M47P3M54j6k92J4m31N11L20m03N0J85k72P2Q77o24L2P91n19
5778D31o68O5M3R5Q71j154M8N78p84Q94p62o6J001j026N53N88l79j311J155J02
$$ plain form
5630 -112 345 -10 249 354 264 248 -502 47 305 602 -597 52 303 -22 -271 289 327 376 252 79 -56
5651 -56 -427 497 -392 562 162 -147 15 349 516 -1081 192 55 -371 -234 638 52 -736 -239 -101 530
5671 530 450 83 496 -300 -26 -10 247 -296 -235 -680 -143 -145 -8 57 -77 -19 -119 -249 -656 445 514 -334
5693 -334 157 -234 -512 702 329 437 -53 992 276 -398 4 -252 -344 413 163 -379 -419 -52 -701 -246
5713 -246 -184 -75 228 695 -136 -94 -57 -33 195 663 139 359 385 492 -266 -19 352 -84 58 -79 -614 -504
5735 -504 -154 171 107 506 -557 -597 -115 -564 33 149 197 -284 85 366 584 61 905 1015 148 -144 167
5756 167 373 -449 -838 -391 -318 136 120 -172 -158 -589 -78 242 -161 -111 74 -198 -126 751 127 159 950 431
5778 431 -237 -172 -129 -34 837 -317 -269 309 -475 419 -343 -409 592 -434 119 707 328 -983 172 274
5798B74p02K77j14L49l02J57k64m51J160j55p01J140j200L80j15l1M56k46J48
5817F0l52O09o80j1N9M76q07J072j45p2J64k82M57j9K74k99r39K14J17q0K66n63
5839d81m08P85J02j048P1J263j58q99O35o51L72K00l8J7J18M69P8j123P08l24
5859c12K16L72m3K2N50n02q7j30j093Q73N05r49Q96l15K46K19q24J082n26r35
5879g35K14Q10m11J18J44m90m12L64J170o04l91r2N82k03o60N78J081j276N65
5898C52k55L83o96J4n77M67l1n4J93Q63l19l5p90N11mJ16L87m65J24k80N59m49
5920A4K36j73k61M04j56J204j638L44P36m89M2k28k79N27q67l8R28n65k34J290
5940G97q86K58q72P2Q7N40L21Q07j475J82K00o91O35R0r1o9n44M35J76J00K79
$$ plain form
5798 274 -428 -151 -265 84 -218 -61 -325 -776 384 229 -472 668 -532 -152 -267 -298 158 -88 60
5817 60 -292 317 -363 -374 -315 161 -646 426 281 209 373 91 548 529 803 504 -435 -221 -104 -184 82 -481
5839 -481 -889 -104 -2 -1050 -979 284 126 -773 -138 -789 -417 -217 -255 -238 -120 349 427 -696 12 -312
5859 -312 -96 276 233 255 805 303 216 86 -1007 -134 371 -578 318 3 249 468 -356 726 200 -735
5879 -735 -521 289 -122 -4 140 -350 -762 -398 772 168 -223 -315 267 64 -596 -18 1063 -213 352
5898 352 97 480 -216 -202 -779 -312 -343 -397 -204 659 340 305 -485 26 22 138 525 60 184 -96 463 14
5920 14 250 77 -184 220 64 1268 -370 -26 710 221 263 35 -244 283 -584 -622 306 -259 -493 797
5940 797 -89 169 -703 -631 -544 -4 317 1124 -351 -169 31 -660 -25 65 -26 -95 -639 -204 -28 72 351
5961C51N6k22m43M62J95k73J83m90Q1K34P43j339Q56k20k79j9o71L94l7J515q64
5982B13k95L87m02m52P68n19K7P81l90n5l9n5p14Q72J25q26M51J37L68m53r12
6003i83O22Q59q44J093m98l46p83J83O08p25N70N64n96P58R6p89P74j123M91L00
6023B31l71K24k11Q81m64k86p91J446j033M80m40J91O1K42L09m58r15J524j134
6042e14Q94J0r5r34P70N27j36r61O00L89r95j09M32p3P0N17q59k79M93M30q58
6063f81K70M57N27k59m96m90O83j69m09Q08o34l25j87J117k72R0l61K77N34k15
6083B65j44l01Q57q00k71P63p78N74M3l59O97l08p16j83J120l97p56P18m2j12
6103a30L79o86M57k90O81K76l49n59J17m91P94K32o64j45P29l18k36K82L67j153
$$ plain form
5961 351 407 185 -258 204 399 126 309 -181 -100 134 877 -462 394 174 -105 -124 -795 -401 -438 1077 213
5982 213 -82 305 -97 -549 219 -300 -273 508 118 63 24 -31 -745 127 252 -574 -123 14 382 -71 -983
6003 -983 -361 498 -346 747 249 -97 -880 -697 -89 -814 -244 320 -276 482 578 -211 563 -560 -69 231
6023 231 -140 84 -127 754 290 4 -787 659 -374 106 -334 -143 -82 160 469 11 -904 620 -514
6042 -514 380 390 295 -639 131 658 522 -439 161 550 -445 -554 -122 -195 -125 392 -467 -746 -253 177 -681
6063 -681 -411 46 573 314 -182 -672 11 -158 -567 241 -393 -718 -905 212 -60 30 -331 -54 480 265
6083 265 121 -180 677 -123 -394 369 -409 165 208 -151 546 238 -478 -661 459 62 -694 24 -18 -130
6103 -130 249 -437 20 -270 411 687 338 -221 -104 -595 199 431 -233 -378 351 33 -203 79 446 -707
6123g07J167m27O68m86n98K26O83q98R45o76J608j734o25R16R5l03L90l04M94
6142D34n71o11M60K31r6L8N31p20J64j70O39K14m76l8Jn95Q07n42o7J8J378j298
6164b69K96J49l70j33M19J80k57L1m98Q75o44K8P29n90O32m31m7r8n13R29M20
6185H38q53R2n06K61M04j65P76o38k09m33L79P51n27p6k80m38J157j170L5P03
6205A01Jo21K75L89M6q54M14N25m41M63q89l3M50p8J12O61J89q46K07o8O54k98
6227C59M5j09r11M8M41p73L87N41L09O17j384M82k78N05pj81J15k1m72L66m35
6248c56N67n05J19K39k88N87l58K43o54J03L20m06P93l59r4j36l92P21n66N12
6268I0j03l34J063q21K94j66oQ32j005L69K35l33P07l58r51q0J62N53k42K78n43
$$ plain form
6123 -707 460 33 701 215 -383 -157 526 -372 573 -103 1505 -229 -854 62 157 -146 244 -60 434
6142 434 -137 -748 -288 -57 -153 -115 416 -304 -140 -310 329 543 67 29 30 -565 242 -300 -367 -349 1029 -269
6164 -269 27 176 -194 -327 92 272 15 46 -452 423 -221 -193 536 -54 578 147 100 2 -511 418 838
6185 838 -15 77 -429 -168 236 71 847 209 0 -433 -54 697 170 94 -186 -624 533 -637 -602 101
6205 101 102 -519 -244 145 191 -663 -249 276 -165 298 -591 -624 -174 -252 -140 521 710 -136 71 3 657 359
6227 359 404 295 -616 -568 -127 -900 -513 28 337 954 -430 52 -226 279 272 91 206 185 -287 79 -356
6248 -356 211 -294 -175 64 -224 363 5 248 -406 -303 17 -389 404 45 -49 -185 -577 144 -422 90
6268 90 -13 -347 716 -105 189 23 17 849 -156 213 448 115 822 464 -487 -567 -405 148 -94 184 -359
6289c59N36N16m83o64M54l26n4jl97M54pK20j92J443j041p63R66p20O35k83J39
6310G3n46Q8M12m13Q1l00M34r0q9P42J64l76On88Q10k02J80J54m75o71K4N55M88
6333D61o38j55M42l67L58j80j7j96j54M42N0J69k89O43r31K07k96J09R19j314
6353g37M14k91K07Q58j98r1J47L0l56j020Q96M49m39R58q48Q33j160n50N17p8
6373d59J171j068k78M90L83j17j81J54J0p00J79l31K90O84l40k06O71j49l64P
6393a54K23N2J52J294j444k78Q89o59l14j15O93p82N81N66j018j85K53k34J39
6412c41r3j9L31N18j63o7m28J36N88k73l37l27K87K90l62p25J030k27o4k07j88
6433f41M12M31p32N97j37J61m91N57o76L60R71j96q5q93k79J917q01m51J21k06
$$ plain form
6289 -359 177 693 210 -454 0 -326 -380 -381 -778 -324 -331 -111 -303 1140 99 -664 302 -418 217 -66 73
6310 73 -473 -385 27 -386 -305 -605 -171 -261 -350 392 556 180 186 -402 408 206 386 540 65 -606 -582 -27 461
6333 461 -177 -332 110 -257 101 -79 -96 -292 -446 -4 46 215 -74 569 -362 -155 -451 -342 577 -737
6353 -737 -323 -614 -407 451 253 162 309 339 -17 -1037 -141 308 -131 827 -21 812 -348 -898 -381 -459
6373 -459 712 -356 -634 -144 239 122 -59 95 105 -595 -416 -747 -457 227 -113 -319 352 203 -161 -154
6393 -154 69 121 273 1567 123 -155 734 75 -239 -354 339 -443 138 704 -314 -499 -246 -480 -341
6412 -341 -434 -453 -122 396 233 166 -262 -126 462 189 -148 -475 -188 102 -260 -985 45 -182 -246 -453 -641
6433 -641 -229 202 -530 67 -70 91 -400 157 -519 -159 812 616 531 -362 -641 1276 475 24 145 -61
6453f1M17l97k65R57q20J001q90l76K70J18L95l19J20j38L21r21P20M77j307K76
6473d22L01l79K75L72J60p0n94N72M76n08L58p63qQ2M70p28L15Lj08p83J179K60
6495D60o06J53K12p79P34k07j74l89J27k97R08N71p87O39q85M23k36R99q57M65
6515D74l11l05N38o33Q18n59J10p58L82N62o11K58l30Q67J66j045kJ24R40m38
6535B47l98L54l60l19O21k95p21K34K49N4o9J42K24P28J01q36k88K99O5k47L77
6556A62k76L74K27j114N50m19N80L93p41L63K4q85M89j9K85K8n2j91Q25N12j881
6577g66oL34O51q01Q87k67n06J26Q57o32O67n27O7j91o96R82O06j41l81k23k74
6598b34m47Q77j24j006P24N59q0J3r44J465j173m90P09P03j028J98J91n48L00
$$ plain form
6453 -61 356 -41 -306 651 -169 832 -58 -434 -164 -46 349 30 150 12 333 -588 132 609 -698 -422
6473 -422 -121 -500 -225 147 307 237 -357 215 691 183 541 -222 -230 -148 322 -406 -91 -88 -196 -979 200 460
6495 460 -146 7 219 -560 174 -33 -207 -596 -469 -766 142 713 -74 565 -320 103 -133 866 9 474
6515 474 163 -142 396 -237 581 22 132 -626 -244 318 -293 -35 -365 502 668 -377 -379 -255 685 247
6535 247 -151 203 -157 -476 145 -150 -871 -637 -388 -334 -403 -261 -37 691 792 -44 -332 -33 32 -215 162
6556 162 -114 260 487 -627 -77 -496 84 477 -264 99 123 -762 -273 -292 -7 21 -31 -222 603 1115 -766
6577 -766 -772 -438 213 -588 299 32 -474 -348 509 -123 544 17 84 -107 -803 179 785 644 263 40 -234
6598 -234 -681 196 72 -934 -210 349 269 282 -662 803 -370 -860 -151 552 -476 -278 -87 -635 -335
6617c35O42k84m74J76L76j90M00N5l11K75j21l06k54M22p1J82l81k11J64k04R64
6638E14j86m65M54m52O67j546P26k7K21K86p2m07L82j29J66l2L98j121O08o96
6658g11R18J76o78K12r07J061J95j16o02M40j39R20j146OK55k30N51L12k7j79
6678C11l91J91l34K72P67j598R53K56k11l7j25n03J40M98o02L52J85j228R89L38
6698B23l80K70q68R00q0J46o89O71M94n76o96R1J131M0j269O30o2m5l74M18l81
6719d06K02R11r46K21J9q6J54K29j60M67m09q15J432j049K02k55N83j098P25m86
6739e65Q01R00j766J096r63K32k69Q18o60P99p37L1M45P13j357k53R79r06Q86
6758B24l45J5J069p61l68O76o69K46R6M01q19R08j70j194J014k01n05qQ04j9l13
$$ plain form
6617 -335 307 23 -451 -275 101 -89 311 366 55 330 209 -97 -351 71 0 182 -199 -410 -246 -450 514
6638 514 328 -137 317 -135 532 -1014 -288 -315 -94 192 120 -287 95 -34 132 100 498 -623 -15 -711
6658 -711 207 383 -295 -83 -990 71 266 150 -452 -12 -151 769 -377 -371 -116 -346 205 517 490 311
6678 311 -80 111 -223 49 816 -782 171 427 216 179 54 -449 -309 189 -413 -61 124 -1104 -115 223
6698 223 -157 113 -755 145 65 211 -478 193 687 111 -585 -494 637 677 -592 38 -24 -69 -443 -25 -406
6719 -406 -204 707 -239 -18 1 -85 69 298 138 605 196 -619 813 -236 -34 -289 294 -804 -79 -565
6739 -565 236 1136 -630 466 -497 -265 -534 284 -376 423 -314 -283 162 875 -482 -735 244 -662 224
6758 224 -121 -106 963 202 -166 510 -159 87 183 584 -235 673 503 -691 323 122 -383 -391 413 394 81
6779H1l1k26O20r71K98P5K18p18j84P31N23r3P3m66L15L4m74R06q86m80N7O7J000
6802D69m84l73J064q30P76n41L0L59r28m18J119j58l60p3M59k00J56M08q90J74
6822b41j08K83J2k69J025L63j297J81M76N0o04m20J124j185J4M94P55j255M87
6841a15k23J39L38q39O50K14o05Q99n79O25l18J07R1r4q8n91K10j34J57%J67j27
6863a16J26K2L78q78L51M06L3n8p01J127l43J59m15k15J14k13K16j88l36R86m30
6884B5l28N40o09P83m41l85K76M43m93j94n3Q72M06k78j254L15O47q8k47R9L68
6905D04q57N67K13j15K14k95n10J54L17j111N61O68m98o17O21J14K88O52m71o71
6925c72L94n08J32M88J50J87k10j66o79N00o13P49j9n14K22M32o80O8J352j737
$$ plain form
6779 81 50 -176 444 -527 -229 -154 64 -654 -838 -107 416 323 396 -70 245 279 -195 711 -175 -655 -598 -531 469
6802 469 -15 -388 676 -154 622 81 111 470 -458 -876 243 85 -275 -348 111 -89 67 475 -415 -241
6822 -241 -349 -66 -54 -323 702 1065 -232 -51 425 475 -129 -549 575 -610 -596 -102 653 -602 -115
6841 -115 -338 -199 139 -700 -50 164 -441 458 -121 504 186 293 384 290 202 -389 -179 -313 -156 -156 11 -116
6863 -116 10 32 410 -468 -117 289 322 264 -437 690 347 506 91 -124 -10 -223 -7 -195 -531 455 25
6884 25 -303 237 -372 411 -30 -415 -139 304 -189 -383 -436 436 842 564 -690 -375 272 184 -63 36 404
6905 404 -453 114 327 212 426 131 -379 -225 92 -1019 -458 210 -288 -905 -284 -170 118 770 299 -372
6925 -372 22 -486 -354 134 284 471 261 95 -584 -84 -697 52 33 -481 -259 173 -507 -439 913 -824
6945h24P27m3q6J097q14L41j96k31q4k07J67J66m62N73J110j374K83l35P12l38
6965A82O46j037m6N71k20j05J027j086J56j06k65L1k04L84p99J240n55M68o36
6984c54L49J62J13m75Q97j123K92l7L45o6o8l76K26N03q07N63l41L65N00l90j353
7005a075J655p90L64N4j82j84n42J034n98N98J1j236J152j149J58O98l91K74k38
7024c87L10M0L28m02J90n24M66j76N11n4m0P99r31K21j100P48R4k31m04N82N13
7045E53m18O1k15k98j59P27p05P64j63k47o0P68o57O04k71K01o85k3J191j158
7065a90R94k77J09j467Q87N37r77k37N07L28m35j32J57J251o63M46j332Q35L27
7084F68p53L46k0L0j307J136M26q65M97p0N18o65k98O01l17Q48n76n48O55l62
$$ plain form
6945 -824 -97 -140 -226 871 57 398 202 -29 -113 -320 -153 13 -449 124 1234 -140 143 -192 520 182
6965 182 828 -209 -255 316 96 -9 1018 -68 88 -18 -283 -252 -456 -72 -871 369 -186 282 -354
6984 -354 -5 157 270 -205 692 -431 -139 -176 169 103 35 -341 -115 388 -419 144 -197 168 668 278 -1075
7005 -1075 580 -210 154 208 26 -158 -700 334 -264 334 345 -891 261 -888 -730 -32 -423 -149 -387
7024 -387 -77 -37 291 -111 79 -445 21 -155 356 302 262 1061 130 351 -749 -1 93 -138 -542 40 553
7045 553 135 196 -19 -317 -476 251 -454 310 147 -100 -160 608 -49 555 284 485 -200 -223 968 -190
7065 -190 804 527 636 -831 56 593 -384 -621 -114 214 -221 -353 -196 1055 392 838 -494 341 668
7084 668 -85 261 241 271 -1036 100 526 -339 158 88 606 -59 -357 244 -73 775 199 -349 306 -56
7104e6L39l34O3p11J087k82Q3K88p88n26J129n66K03L44p58M07K87m9m20J162
7124I02j371K87K11M27m12k57j2L4P27n88K81l73O91p18M24m79K84K30J05l63
7144C0O7o55J113q61K53J2j30L59q42R98K15l41K40m64j25K56k9k60N01l56j28
7165a47K5m96Q23n29J46M11j34m68R77j002K63L39K83p35J32O04k16p59p5P78
7185B20P0m67j70R46l26M34r46L57j21n91O10o45m44P42J037j195K33J55M28m10
7205h3m81M77L94m99R1M08o55O03n14N5K69O83p37k81j37M73l65p57J008R1K88
7226C31j149J322j073L82K45K34K84J07j32j018l28J565j658M12K8j24R69m18
7244b1K9K25J1j004J085j76K15o35R52j131K43R7j9M79k88N74j010k62R24j291
$$ plain form
7104 -56 283 -51 12 -699 388 106 189 477 -311 -837 292 -274 -71 273 -485 -78 209 160 -260 902
7124 902 -469 -182 29 456 44 -213 -225 -191 536 -52 229 -144 547 -171 253 -226 58 288 393 30
7144 30 97 -558 555 -306 -53 -41 -171 188 -654 344 559 218 458 -6 -131 125 96 -164 337 -19 -147
7165 -147 -122 -618 205 -324 -178 233 99 -369 608 -394 -131 208 491 -244 -112 492 276 -483 -558 220
7185 220 290 -177 -347 599 273 707 -239 118 -3 -594 16 -629 -1073 -331 706 -489 -256 -101 327 -83
7205 -83 -564 -87 307 -192 -101 307 -348 255 -259 -204 65 748 11 -270 -407 66 -299 -1056 -48 43 331
7226 331 -818 504 -569 -187 58 292 576 683 551 -467 -795 770 -888 -476 -448 -572 397 -21
7244 -21 8 233 244 -760 325 149 364 -271 681 -450 -207 -110 -129 350 62 636 -374 -636 288 -1003
7264a003R97J262j150j21k0p14M63Q66n92P9M97l81J69n93K26N26n39l75l95P52
7284d6m49N23m07Q27j042P24j39K33n03j0m0P08k67p9Q04j149o9M06J88j20Jj002
7306i08Q29K50l25n10O67J48n91J50J86o1L44M1o13R61q40m2N90p89o9J146j166
7327f02R36l67K2k07L41O24r39K44l64R58j86l40L86m13rM38k14M2lRK30k36k91
7350E9K75k26O6j08P14j374N14N55j510J291r87J155j186N95M39r50J059k00p94
7369f13N67M25J12m80k00O91l25J92l51M3M7m33l10L63J30L37O9M2n31L1J35O9
7391A0q5N4m69Q55L43p17r1M29k01o53j32K72J43O03k35Q8J85k24l93K20L03m57
7413a52p68Q84P4O92q55J63L83p28j93K47P40K83j100J36l37P48j85K42k67l98
$$ plain form
7264 -1003 -6 1256 106 -15 -35 -749 -286 580 -12 67 564 183 352 -241 -15 511 -28 -403 -798 -46
7284 -46 -495 28 -379 448 -594 130 -9 224 -279 -289 -329 379 112 33 837 -312 -381 25 213 93 94 -908
7306 -908 -79 171 -154 -664 3 151 -440 -290 -104 -165 179 220 -393 568 -272 -314 276 -513 -582 564 -602
7327 -602 334 -33 -11 -218 123 747 -192 52 -312 646 460 120 506 93 84 522 308 350 347 356 586 350 59
7350 59 334 108 174 66 780 -594 -80 475 -1035 256 -731 424 -762 -167 272 -678 381 181 -613
7369 -613 -46 379 491 11 -189 502 177 369 18 61 108 -325 -635 -272 -142 195 264 306 -225 -194 -59 10
7391 10 -75 -21 -490 365 708 -9 -100 329 128 -525 -657 -385 -242 361 126 214 399 175 -218 2 305 -152
7413 -152 -920 -36 38 730 -125 38 421 -307 -500 -253 487 770 -330 -194 -531 217 32 274 7 -391
7433c91Q95K22n57K69p49M28L07l80N07l81r2M97m13l96O57K62l44o60J7N36j25
7454A09L92k69Q0q42P72m20J4m5L73r1r5p03M72J04J240p80o88P80q12M33N26
7475E50p28j36M98J78r89k28J103Q34j876J55J485l79o2m96J78l38R3j6J160j715
7495g29Q95L24l57P77j262J001j162K58J45k93L90K0l46O42n69Q42n07L0J20M38
7515F57o69j26J473j225j173J158m92J75N74J6n71L51j29m56k8J071K8j136m4
7534e46M60o3K76n4PN04r87J043m52M23j90j206P98l68j40O40q4k36J15k02L13
7555E1p59L32L35j25p16J134l59L02r07M78R3K58j44M89j470J390n61N6m2J63
7575bM81l96j14q18L38M97j81j75M99m21L97l42PJ8L45M89k78j072P13l15P7k12
$$ plain form
7433 -391 504 726 169 438 -311 117 424 44 551 170 78 575 162 -234 423 685 341 -319 -302 234 109
7454 109 501 232 312 -530 242 -178 -164 -209 164 73 -22 -725 -253 -149 1091 311 -377 403 -409 24 550
7475 550 -178 -314 184 362 -627 -855 248 1082 -794 -639 846 467 405 -91 87 -251 -158 -174 986 -729
7495 -729 166 490 133 910 -352 649 -513 -255 -110 -403 -13 7 -339 303 -266 576 69 99 219 657
7515 657 -12 -138 1335 110 -1063 95 -397 -222 352 368 -203 148 19 -437 -465 606 634 -502 -546
7534 -546 -86 -149 127 73 80 584 -403 640 188 611 421 -785 13 -355 -495 145 61 -175 -60 -262 51
7555 51 -708 -376 -41 -166 -882 252 -107 195 -712 -234 -141 117 -27 462 -1008 382 -179 -123 -165 -2
7575 -2 479 83 -31 -849 -511 -14 -195 -370 129 -292 105 -237 -230 -212 133 622 344 -728 -15 -330 -253 -465
7597d65M14K65l80l55Q84j55q57P56k34M44n03k02P24j52m93O18l37l45P46l86
7617a3p0k37L20N15q45N90R05j252J21M51J24r57J36M62J91L2k99m65l25R57k64
7638G7K75n10%O24r59L43N5P4O31p29j30R72j165p5P60N77j582L09K38J54J66
7659A05j5M34n29M1o7k60N01mj95l16l82N58j04L04j19l21L48Mj56Nl61M13K34
7682A18K33K16q71J35j25o0N10j97K7m21N43j77J28J19r57O14j73P09R1j047P74
7703A89j80K89q87L15L4k22J47M12N41p54K52k28M88q58J33K4P72p04o5M98n13
7724c17P65l32J41p00J197j477J541q39J8J79P20j041K75O04m69q7m73M45n32
7743c82M74p56N58J75J09k40M14l63M21l79m2K87j83K72j01K50l38QJ68m00K22
$$ plain form
7597 -465 -51 214 -166 -521 363 208 -649 107 -127 317 -186 -388 336 184 -309 309 -28 -373 373 -13
7617 -13 -83 -320 0 515 -330 260 1165 -87 34 485 609 -348 -212 250 441 473 174 -291 -616 341 77
7638 77 352 -158 -158 466 -493 -150 -95 -21 610 -119 -249 723 -442 -517 243 820 -762 -453 -215 -61 105
7659 105 90 524 -5 36 -31 -291 210 206 11 -305 -687 -129 -233 71 -48 -369 -21 -17 -173 -168 -529 -116 118
7682 118 351 567 -304 -169 -294 -354 156 -41 -14 -435 108 -69 59 178 -779 -165 -338 371 462 -585 189
7703 189 9 298 -589 -274 -240 -462 -315 97 638 -116 136 -92 396 -462 -329 -305 467 -237 -302 196 -317
7724 -317 448 116 257 -443 754 -723 818 -21 -3 176 896 -145 130 734 265 178 -295 150 -382
7743 -382 92 -664 -106 69 178 -62 352 -11 410 31 -11 276 93 365 264 514 176 184 352 -48 174
7764A74j070J013K65L89q85k71O50k21q5J1P25j750J071r6K79l82J32M25m38j89
7784b53J57K12k60j48K73l34P6O06r12P79m68m97N66J3N44m7l38N3n77P59l86
7805a82J01N89o52J14L02M51p01Q5m50O59l25L3J96J21n82R67m84l0j023M29L64
7826a8j74M90r4J29k45l46L13j3L94n46J199j072pN88j376J629n39j70Q44j161
7846a75M36q58L85R2l02L63L2M77p85L30k25m70R69O54j618J088q95q7J104n17
7866bL0m10R51k05j11n77P36m37L03L68j006N49l8J40N14j795J402o5l32l63K98
7887e0K58k71M60j332J413n48O84q61J66K28k71K04o44L69K00L52o39M31o14L47
7907a18O22q54M6J39L45k69k08m90J368j482O34j35L48J07J26J73m73N55p21P03
$$ plain form
7764 174 -896 117 382 771 -114 -385 265 44 -41 -30 695 -1055 16 -80 199 -183 -51 374 -64 -253
7784 -253 -96 116 -144 -292 -19 -353 -277 329 -583 196 -272 -769 -203 -190 354 307 -31 22 -555 204 -182
7805 -182 -81 508 -144 -30 272 723 22 107 -343 316 -9 24 220 341 -241 726 242 212 -811 -382 -18
7826 -18 -192 298 204 333 88 -258 55 42 436 -110 1089 17 10 598 -778 851 312 142 986 -175
7846 -175 261 -597 -212 -120 -422 -59 -27 450 -335 -5 -230 -700 269 923 -695 393 -502 -589 515 -2
7866 -2 28 -382 569 364 253 -324 412 -25 278 646 -360 189 151 291 805 -990 412 347 15 -348 -50
7887 -50 208 -63 397 -935 478 -70 614 -247 -81 147 -124 80 -564 -195 5 357 -282 149 -465 -118
7907 -118 504 -350 -304 -165 180 -89 -297 -787 581 -901 -267 -402 -54 53 179 352 -121 434 -287 416
7927D16o23r65J277L58j261R93q36Q27q06M21M33o14J2q10J911k66m23J41J83
7946C68k83k90O40j461J597J52l62r86P05L21j46J59j695J197p07N47N33l63Q6
7965A2L72o23j40l24P89K77l07l53o4J81K93K61L66j309J383q61Q16o51p45J201
7985E74o09L39N98j257K13M41l61r23Q08O10j157N48p0L88m0J38l54l14M22L87
8005C81j82p3J16o06Q62o17O6K67o08R06k39j37m8l45R25m66n01Q9k43l44J449
8026F52j493Q45L27r78R88J33l85M33m30J09o0k3j42K22o19M57j27O1O1r39P19
8047a89L31J15L58p44J36n91L97Q00j091P99m57l11L12m5m8N24J26M9M3r5K39
8068F58j057O39j53p16K10O35O5q50R58k70o94L58L39M45p86O35L03q38k67O89
$$ plain form
7927 416 -207 -1172 105 463 -798 195 -641 186 -620 -199 234 -380 -368 -1178 733 467 44 185 368
7946 368 85 -205 435 -1026 571 723 361 -625 80 401 255 414 -1281 -84 -791 -244 289 -74 12
7965 12 384 -239 -379 -703 86 363 56 -297 -361 -180 113 374 740 -569 814 -47 769 118 -627 574
7985 574 -35 304 902 -355 -142 299 -62 -985 -177 433 -724 -176 -246 142 102 240 -114 -428 -6 381
8005 381 199 126 242 -364 498 -119 -53 214 -394 512 273 136 88 -257 668 202 -299 -210 -453 -797 652
8026 652 -841 4 331 -647 341 474 89 522 92 201 141 118 -24 198 -421 36 -91 -30 31 -908 -189
8047 -189 142 257 615 -129 7 -584 -187 613 -478 321 -136 -447 -135 -180 -228 296 422 471 514 419 658
8068 658 -399 240 87 -629 -419 216 281 -569 389 119 -575 -217 122 567 -219 416 719 -119 -386 303
8088C03k77j58L8l22Qj95J036q77L13L56L68n74M04N9p69J71L96l32J01k69O13
8109C93k4m93K32N44j772P60k47K87j48L53k15O89l6k36q85L92L37K27O74k90
8129E42m28m00P13k6n56k9Q8J98n80O89j050Q5N67M9L3j72K79O95p41M12Kl98
8151b8K66J19r54M68J84k82M81m07Q0P24j262n5R06M20o87r5N73l65m71M32m34
8172c87J206m88k19j168Q59N75J06p80P26o55k59N71K41j257K104j047n1J57j183
$$ plain form
8088 303 26 -132 -94 -416 -408 -603 433 -444 -131 225 593 19 423 482 -287 -116 280 -52 49 -220 393
8109 393 369 -124 108 652 -1120 -360 -607 -320 -468 -115 -330 359 323 87 -798 -406 -69 158 832 542
8129 542 114 -286 427 401 -155 -184 -96 102 -478 211 -839 -754 -187 -138 -105 -277 2 697 -44 368 370 -28
8151 -28 238 357 -597 -129 55 -227 254 -153 -73 651 -611 -666 240 660 -27 -122 451 86 -385 47 -387
8172 -387 819 331 112 -1056 -197 378 484 -296 430 -225 -484 87 328 -929 1175 128 77 234 -949
8191i49
$$ Imaginary data points
##PAGE= N=2
##DATA TABLE= (X++(I..I)), XYDATA
0@%%%%%%%%%%%%%k0Q4j28J28j28J34j98K56k85L49m28M92n76O97p84Q79j024J190
31F38j345J522j727J948k201K472k775L102l457L855m292M771n289N848o463P135
47C742p868Q671r556J0532j1597J2775j4093J5561j7214J9093k1239K3715k6620
60a4098L0085l4299L9553m6313N5381o8227Q7988j22541K00052p12576K14336
71c70659J018351p98392K77348L19449q58877j15875P26072l72241O5239O43335
81E33750m27029n12325M07183j55852j90923N65608N9441m17752K18178m6464
91C3815m21718K35410L09224j82867J43466J15090m00350r4271K43537p3631Q1471
102a0824K72228j58289k19965O8336r3741m4839K90496R8525j50385j4751r7336
$$ plain form
0 0 0 0 0 0 0 0 0 0 0 0 0 0 0 -20 64 -64 64 -64 70 -128 128 -157 192 -236 256 -320 377 -407 472 -552 638
31 638 -707 815 -912 1036 -1165 1307 -1468 1634 -1823 2032 -2260 2511 -2778 3070 -3393 3742
47 3742 -4126 4545 -5011 5521 -6076 6699 -7394 8167 -9047 10046 -11193 12522 -14098
60 -14098 15987 -18312 21241 -25072 30309 -37918 50070 -72471 127581 -584995 -370659
71 -370659 647692 -150700 126648 446097 -412780 -528655 197417 -174824 -109585 533750
81 533750 106721 -405604 1579 -154273 -345196 220412 279853 -137899 80279 33815
91 33815 -387903 -152493 156731 -26136 117330 232420 -167930 -262201 -18664 -92295 -10824
102 -10824 261404 103115 -116850 -48514 -142255 -187094 103402 201927 51542 36791 -60545
113f0545j64637J43606J88597k5275K1516j2451j92581n4018J21198M6322O9397
124H1129P6515j20390j35746K6527K9830L5530J01505M117q7431k2151j7828l9708
136f8101N8928P4225o933j0381k0907o7699j7279N3155L0700K4000K4798l8596
148C5910o5636k1239Q693M0303P4833K3105o0968p0534l5535J1608O6642P2206
160G9388P887m8263o4684n3378M155P3498P6197J7050m7398q1265n3534J7633
172g2714O9844O2300J8341l3424o8819n3316L130N2241N9348L2580k0961o1240
184a2690n0500o311K8672M8399M1129J29l7932m4845l1841l76M1703N5365K6871
197E7773j4957n2040o0387j7516M2532O2760M5923M0n7340p3097l1137L0793P0778
$$ plain form
113 -60545 -225182 -81576 107021 81746 103262 90811 -101770 -155788 -34590 11732 81129
124 81129 157644 37254 -98492 -71965 -42135 -6605 94900 99017 11586 -10565 -28393 -68101
136 -68101 -9173 65052 58119 47738 26831 -40868 -58147 -4992 25708 49708 74506 35910
148 35910 -29726 -50965 -42272 -1969 72864 95969 35001 -35533 -71068 -59460 7182 79388
160 79388 87275 39012 -25672 -79050 -74895 -1397 74800 91850 44452 -36813 -90347 -72714
172 -72714 -2870 59430 77771 44347 -24472 -77788 -74658 -22417 36931 69511 48550 -12690
184 -12690 -63190 -69501 -40829 7570 48699 48828 10896 -33949 -65790 -66166 -24463 30902 57773
197 57773 42816 -9224 -69611 -87127 -44595 18165 64088 64128 6788 -66309 -97446 -66653 4125
210D125P0289O541o3866p8532l5768K4720P3103O7666N805m6802o2805m6464O656
223g5332O2002O1190K0005k4653n7601m8908L50L9245M5433L1626q2l9752m5160
236c1637k2064Q056M1347N1465J6516k7498m4323l9935p156L7050N2012L0721
248F4554m431m2798n9925k2396L1086N7268M7444M177n0764o0524k3318K1788
260c7839N0529N2800Q971m1549n5322l2304J0992N2441N0294P100l1479m5084
272a0450l2588M905L6989L6339J5949r289l3325l5818q450J9111K8607K9044N394
285D6418k4420l1881k1123k170K3418L7645J8799r352l3129l9404j3508K6556
297b2151M3921K6783m422l6174m4062j4892K2390L8015L4112K359l4321m3460
$$ plain form
210 4125 74414 80955 17089 -61443 -97211 -72491 612 68278 74083 27281 -35524 -81988 -75332
223 -75332 -13330 47860 67865 43212 -14389 -63297 -62947 -23702 21731 53357 53275 13523 -31637
236 -31637 -53701 -45645 -4298 47167 63683 36185 -8138 -48073 -55229 -18179 33833 64554
248 64554 60123 17325 -42600 -64996 -33910 23358 70802 74979 24215 -36309 -59627 -37839
260 -37839 12690 65490 74461 32912 -22410 -54714 -43722 8719 59013 66113 34634 -10450
272 -10450 -43038 -38133 -1144 35195 51144 41855 8530 -27288 -35738 -16627 11980 41024 46418
285 46418 21998 -9883 -31006 -33176 -9758 27887 46686 37334 4205 -35199 -48707 -22151
297 -22151 21770 48553 44131 7957 -36105 -50997 -28607 9408 43520 45879 11558 -31902
309c1902j9287J5926L8361L5372P06k9552l3115j7312N323K9531K8504O553j4389
322A4719k6282k3237j293K2045K2219J2859l022j7132k2382q798L709J6548K3802
335A3755J2359j2554k3045k1254o262J8189K9363J7142n201k2334k8919j1770
347d0531J6662L0140K2603N64k4570l2820r896J7120K7295K0545j244k2667k2621
360a9420q749Q682K1120J9965J851j5873j6923r497K676J5447J4081K002l404
373A1958r586j0471l701N622Q422J1489M784q006j2322p258l81P344J3545Q897
387B0336l187j2179j3362p129R271J9378J0100l522j3602j8040m322J2928J5195
400A1865R086k496j4163j4159k250R330J4473Q038n387j4433r306J553Q500R730
$$ plain form
309 -31902 -51189 -35263 3098 38470 39176 9624 -23491 -40803 -35480 -5949 22555 29108 14719
322 14719 -11563 -34800 -36093 -14048 8171 21030 18008 876 -21506 -30304 -26595 -10047 13755
335 13755 26114 13560 -9485 -30739 -37001 -18812 10551 27693 22492 158 -28761 -40531
347 -40531 -23869 6271 28874 29438 4868 -27952 -37848 -20728 6567 27112 25868 3201 -19420
360 -19420 -28169 -19487 1633 21598 23449 7576 -9347 -18844 -16168 -721 13360 15362 11958
373 11958 2372 -8099 -11800 -6178 2244 13733 18517 10511 -1811 -9069 -9450 -2106 11439 20336
387 20336 17149 4970 -8392 -15521 -6250 13128 23228 19706 6104 -11936 -16258 -3330 11865
400 11865 20951 18455 4292 -9867 -12117 -2787 11686 19724 14337 -96 -9402 -7849 651 10381
414A0381L306o381q254l046J121J675O538J717k027k953l540k228J208K393J303
429A213J866K444l337n997m330R76N961P926K336o430r226n232J778R225R820
444H993j67p435j0538o988K669J3628J0258P81r155j3700p041P335J2237P877
458H754r3q800j1316l871N157Q716P692O70p028q335k545J932M973O331J961k843
474A355j647m178l702K97L519N749N042J98p852p395l613M078R645Q454J157p671
490C436j1316n482J689J3732J1381K4r823j1304m905M329J1846P300J075o164
504E818r453o288L169R791O017J288m643p122l059K056K943K647L237O1j932k590
520A940l403j322K570M165L741R98l332n501l726J16N219P074L266m217q576m826
$$ plain form
414 10381 13687 7306 -948 -3994 -2873 -1198 5340 7057 5030 2077 -1463 -3691 -2483 -90 1213
429 1213 3079 5523 2186 -3811 -8141 -7165 -1204 6722 9058 2628 -6598 -11830 -10052 -827 8993
444 8993 8826 1391 -9147 -16135 -13466 162 10420 11201 2046 -11654 -18695 -11360 877 8754
458 8754 8661 -139 -11455 -15326 -10169 -1453 6239 6909 -119 -8454 -10999 -9067 -4094 2237 4198 1355
474 1355 -292 -4470 -8172 -7875 -4356 1393 6435 6633 -1219 -8614 -12227 -8149 1496 9950 11107 3436
490 3436 -7880 -13362 -11673 2059 13440 13464 3641 -7663 -12568 -8239 3607 10907 11982 5818
504 5818 -3635 -9923 -6754 3037 9054 10342 5699 -1423 -4482 -2426 517 3164 6401 6462 4530 1940
520 1940 -1463 -2785 -215 3950 7691 8689 5357 -144 -3870 -3754 1465 8539 11805 7588 -988 -5814
536e814O20N893R108J923n452o482n181j36O234O587J705l698o178l935K679L295
552A168L177L79k684j811j006R49R87q84R37l12M04O3L36k786j481o44K320L313
570B425J601k449m459l085J236M898M205j033l706m811p95L399L197K121r78l611
586a845k814K63J935L445M2k046j353o63k4K743j79j170j092l81J295K127R39
603A222k226k638l85J074K699K511o84l916k222J703J366M235J77k639l289l68
619c380N87L702K367j603j673k053J109M25L096j235j663K0R5J80L445o91k296
636D32k187R62K399K045K72l259k490O70K473K579N45r50l279k936J385K722L502
653D885l22l000k029q39J218K340J704r33j589k02j263J302O74k67Q90q71n1r61
$$ plain form
536 -5814 -5194 699 9807 11730 6278 -204 -5385 -5521 713 7300 9005 5307 -871 -4806 -2127 1168
552 1168 4345 4724 2040 229 -777 172 1159 275 1212 900 1304 1367 1703 -1083 -2564 -3208 -888 2425
570 2425 4026 1577 -2882 -5967 -4731 167 4372 3339 -367 -5178 -5973 -2574 623 2744 1766 -1845
586 -1845 -4659 -4396 -2461 984 1026 -1020 -2373 -3036 -3060 -317 -496 -1666 -2758 -3139 -1844 283 1222
603 1222 -1004 -3642 -4027 -2953 -254 2257 1573 -2343 -4565 -2862 -1496 2739 2916 277 -3012 -3380
619 -3380 -2793 909 3276 1673 0 -2053 -944 -519 2577 1342 -321 -301 -206 -26 3419 2728 432
636 432 -1755 -793 1606 3651 3923 664 -1826 -1156 1317 3896 4441 3491 212 -2724 -1339 1383 4885
653 4885 4563 1563 -466 -1305 -87 2253 3957 3024 1435 1233 -30 1272 1946 1679 2569 1698 1647 686
671F86R90j30j524R92j38J550R24j170j876k056J164J894J245M99k460k110j684
688c204J252K972J594j94k234k388n45K256K170J247k982j641l03o8J431Q08L78
705E49n01j877N02N22P28m0n99j112M98O71N94K84j950p03L16J718O39N10j492
724g43j712p13K327N42J092L72k838j339r0K006K507M32k644j445M64M39J258
741h5P03l46j656L66j45M34J151J42l01j316J461n88J115m18p93j011N00J652
759H65O76p44j276j083P05J330L02K209j944k570l99J048J613J629k1k094j501
776a255j63J927M15K450j805j449j04J9P99J886j321p95k41R9M60O83p06k71m69
795A59j88J098J50m74p58k92M21N03O46R01j831j701N16O82J605J026r50m66k194
$$ plain form
671 686 1676 1546 22 1014 876 2426 3350 2180 304 -1752 -588 1306 2551 3050 590 -1520 -3204
688 -3204 -1952 1020 2614 2420 186 -2202 -2747 -491 1679 2926 -56 -1697 -2000 -2068 -637 171 549
705 549 48 -1829 -1327 -805 -77 -117 -716 -1828 -1330 -659 -65 219 -1731 -2434 -2118 -400 239 749 -743
724 -743 -2455 -3168 -841 -299 793 1165 -1673 -3012 -3102 -1096 1411 1843 -801 -2246 -1782 -1343 -85
741 -85 618 272 -1384 -1018 -1163 -729 422 564 263 -1053 408 -180 935 517 -276 -1287 -787 865
759 865 1541 797 -479 -1562 -857 473 775 2984 1040 -1530 -1929 -881 732 2361 2340 246 -1255
776 -1255 -1418 509 924 3374 1569 120 16 35 834 2720 1399 604 363 462 922 1605 899 628 159
795 159 -29 1069 1219 745 -13 -305 116 619 1265 2166 335 -1366 -850 -168 1437 2463 1513 1047 -1147
814a147R10j72J229J399j578j787k99P95O85O74m59j175P43j734L42K008k86L48
832D96j104j75R21jK35j256j56P4Q55M16k8j671j39L3O28J242J041r95j502l61
852a447J01K90J435L19j366m07j130Q74R66J187m83n01k52j204J586P97o37n77
870d49K64q86O17R60j156K6l15L96P71P13j088k63N7p35N33J252m57K67q98j340
890a731M73K154J249r12j265M22j218j0J977o68K29m47l30O30k04K06L6p9J92
909G04o94M86j43l89K56n1J245q59k21N00j540p75J299M14N23K39K9o44j207K96
929e32L19K051N84j359j002r26N98Q70R88j072J19k080N97O35M32n79O15O12j211
948c41l3l32J297m78K02q26N21L29l31l98m51J95O96m95O25p87k78J83M60L55
$$ plain form
814 -1147 -237 -409 820 2219 641 -1146 -1445 -650 35 709 250 -925 -182 -1916 -1574 434 148 496
832 496 -608 -783 138 137 372 -884 -1040 -966 -111 305 277 -1394 -1533 -1500 -872 370 1411 416 -1086 -1447
852 -1447 -1346 -1056 379 698 -668 -1075 -2205 -1331 -365 822 339 -162 -414 -1618 -32 765 128 -449
870 -449 -185 -1071 -454 506 -650 -624 -939 -543 228 941 -147 -410 -353 -1088 -555 697 240 507 -391 -1731
890 -1731 -1258 896 2145 1233 -32 390 -828 -838 1139 471 700 253 -77 553 349 555 591 512 704
909 704 10 496 353 -36 220 169 1414 555 334 834 -706 -1481 -182 232 755 994 1023 379 -828 -532
929 -532 -213 1838 2422 1063 61 -865 -267 603 1591 519 638 -1442 -845 -210 222 -357 258 870 -341
948 -341 -374 -706 591 113 315 -511 10 339 8 -390 -841 -646 50 -445 180 -607 -885 -702 -242 113
968A13N05l95r54j77P8O24m41J233j229L08j03l07N40L0QQ7L3m09L77J22J38k30
990d9p10P94j45m56j32n5J25j29J532l6q28l32k50l5K35J250o77k29l70J65j78
1011e10O66P56J76n93j229J03m15N88L80J144l74j374k89J227p37J290m32J36
1029E13l06k03J17J90L07J96r33l01m81J508l60j118J553p25N56J21k2q48j28
1048c64M01O77l38K82j107L22r13O45J335K66l21q16j105N53J89O74L02n98p37
1067f53l0R9J229o47L39M76j465M15l58LN57l4k18nk09J37K95n7r29J43L65j3
1089e60J291j236m92N61j73Q36P84r22p3j024l76J048P10j036R51N5r74J38J238
1108G46o77O12j062J48k63L67N92m49N82p73L0k52N75K74j78q6j79n31N33O11
$$ plain form
968 113 618 223 -731 -908 -830 -206 -647 586 -643 -335 -438 -745 -205 -175 -167 -80 -47 -456 -79 43 181 -49
990 -49 -759 35 -110 -566 -698 -753 -628 -757 775 739 -89 -421 -671 -706 -471 779 102 -127 -497 -332 -510
1011 -510 156 912 1088 495 -734 -631 -1046 -458 -78 1066 692 -682 -971 256 -481 809 377 513
1029 513 207 4 121 311 618 814 -119 -420 -901 607 247 -871 682 -43 513 634 612 -236 -364
1048 -364 37 714 376 658 -449 -127 -1040 -395 940 1206 885 69 -1036 -483 -294 380 682 84 -653
1067 -653 -683 -584 645 -2 337 813 -652 -237 -595 -592 -35 -69 -287 -292 -501 -364 -69 -126 -1055 -912 -547 -560
1089 -560 731 -505 -997 -436 -609 227 1011 89 16 -1008 -1384 -336 374 -662 289 344 -630 -492 746
1108 746 69 681 -381 -233 -496 -129 463 14 596 -177 -147 -399 176 450 272 186 7 -524 9 620
1128F20m25l42j57j111J521O54l2n34k4J73J30J320j201k56m90N04j53K86j55
1147C28L17n44o36R33o92R13j36Lj289K21P9O86P38J34p28o84M46j02J084j038
1167C3n67M0O3L10k55J160k62m94r79N2J048m23K84p1r45K84J303l73J95q23p
1188d27K9M73M51k26l47m69P7J95P6R18j148k2n08K69P47l29N99j125n6K80N48
1209El98L00m68L25p03O27k2K97N51r46r4O76M15J51j310m0m38P08J15N81j99
1230A33m76l2j054L40R67R74oj499M60M97k87Q84n84p83J71J91Q31j38r31P16
1250C74J85m97m32Q37P9k11j175J66O47J034l13k82j646N93Q22P8R94j56j010
1269H7p25l03J267O16M33j066K32j274M60J292J10j107k02J07J21N51j37r13O44
$$ plain form
1128 620 195 -147 -304 -1415 106 760 728 194 170 343 473 1793 592 336 -154 350 197 483 328
1147 328 645 101 -535 398 -294 619 483 486 -803 -582 -503 183 921 1055 327 -357 89 -13 1071 33
1167 33 -534 -494 -431 -121 -376 784 522 28 -951 -899 149 -274 10 -61 -1006 -722 581 208 403 -420 -427
1188 -427 -398 75 526 300 -47 -516 -439 -244 -168 750 -398 -420 -928 -659 88 -241 358 -767 -823 -543 5
1209 5 -393 -93 -561 -236 -939 -312 -334 -37 514 -432 -526 150 565 716 -594 -634 -1072 -364 -249 332 133
1230 133 -343 -375 -1429 -1089 -122 852 846 -653 -193 304 17 901 317 -466 -295 -104 727 589 -342 374
1250 374 559 62 -370 467 546 335 -840 -674 -27 1007 694 412 -1234 -641 181 259 1253 1097 87
1269 87 -638 -941 326 942 1375 309 541 -733 -273 1019 1129 22 -180 -73 48 599 462 -451 193
1288A93m46o8O82k43P75j099m09j32Q4J814n8q65o53r96N72J073J257j082j331
1307i32K21n29M75J853l06m51j337P57p24J403j73q27N60j073L48l12R74m32O86
1326A81j018O99M95j93j069L03n71L85J091K25r9o71r07m98J389J032j82m9j149
1345f06r45j59J018J588j004K02r83l50o2J768N2o46Q52o82p36P18l42l9O38p68
1365d86K16j83O81j72n99k50O32Q86O87m06j134n47k39J156K93R39j107q8j232
1384i53J95J501L1N9n19m2o28M47J084P86n77q28n92J75K60L30K11p57m27O95
1404D51K65n27N8n79Q4K50J090J37r39j57n48N11K28J360j035p5q15p7K11O19
1424E12K93J3r15n25j14L33J17J142r18J65o12j14K38P38k5l13j028L03N25l20
$$ plain form
1288 193 -253 -321 361 118 893 -206 -615 -747 -663 1151 1093 228 -425 -1421 -849 224 1481 399 -932
1307 -932 -711 -1240 -765 1088 782 331 -1006 -249 -973 430 257 -570 -10 -1083 -735 -1047 -73 -505 181
1326 181 -837 -138 357 164 -905 -602 -1173 -788 303 528 429 -242 -1149 -1647 -258 774 592 543 -606
1345 -606 -1551 -1710 -692 896 -108 94 -889 -1239 -1301 467 519 -127 725 43 -693 25 -317 -356 282 -486
1365 -486 -270 -453 228 56 -543 -793 -161 725 1412 1006 -128 -675 -914 242 535 1474 367 279 -953
1384 -953 -758 743 774 833 314 272 -356 91 1175 1961 1384 556 -36 139 399 729 940 183 -244 451
1404 451 716 189 247 -332 -248 2 1092 1229 290 133 -415 96 324 1684 649 574 -241 -318 -107 512
1424 512 805 818 -97 -622 -736 -403 -286 856 -62 103 -509 -623 -385 353 328 15 -1013 -710 -185 -505
1444e05M59q98P39l93R84o52N56p4j225k7O39N13K67j256R47j764R24L9J206m92
1464a3o11K88q53J094L32l17k55j7q06N44K49O15J55o82J17n13L45N96m67J9j66
1485c46R9l18P88Q7r74l3J083m29Q93m07M16j691k94J181P51j38j030K75l39M05
1505b1Q18k54j79K6m7j077J242l63K21M28r90J26L94K41K20j000l68K94P57R49
1525A417q36r98r2K42M94Q8O15k57q75p98L49J504k11O33o63q14n05l50J785k
1545G26K36p61j54r3k91N1K028j213j94o39l06O06J45Ko42J401o93M8k5l8j292
1566a098Q23j81R54L93p86j183n26Q57P11Q51j34j297r34p2Q02J398m51n5p08
1585f36j083K02J562K6k16K42r52p98O74L86P82k03j186Q05q43J82R61J011n41
$$ plain form
1444 -505 -46 -944 -205 -598 386 -266 290 216 -1009 -1036 -397 116 383 -873 74 -1690 -766 -727 479 -13
1464 -13 -624 -336 -1189 -95 237 -80 -335 -352 -1158 -614 -365 250 405 -277 -160 -673 -328 268 -199 -180 -346
1485 -346 -247 -565 223 310 -664 -697 386 -43 850 443 859 -832 -1126 55 806 668 -362 -87 -426 -21
1505 -21 797 543 364 390 343 -734 508 145 366 794 -196 -70 324 565 785 -215 -583 -289 468 1417
1525 1417 581 -417 -509 -267 227 315 930 673 -202 -1000 -651 853 642 1275 612 -202 -707 -1057 728 726
1545 726 962 201 47 -46 -337 -286 1742 529 335 -304 -610 -4 141 143 -499 902 209 257 232 194 -1098
1566 -1098 -275 -456 498 891 105 -1078 -1604 -747 -36 815 681 -616 -1550 -1622 -820 578 127 72 -636
1585 -636 -1719 -1517 45 71 -145 97 -855 -1653 -979 -593 189 -14 -1200 -395 -1238 -1056 -95 916 375
1604C75j152Q09k86q32Q97l68O83l39K49l44q8j63k99K94J560K2l81q04q98J25
1624i40R47J010l55n03k64j155lJ695L22J04m51p70J05Q41M36M77n26j93j726
1643i49J14N82J000l99q78O79m33L43O67n55K54J54N41o65j14o40R5M0O72R51
1663A459j188l00M46o35L88o51J796k80k99q55j120M47J355K28J01j38q83j080
1681a209n26K689K95o35j288K44o91J220O51j074J457j365p09k74Q29J004l58
1698B60l50P93j547J40O26m47R83k67K25j63o31K7j271J023J723J93j22j162j310
1717a277k46J136N86N01L30j735j07k70P86Q49R42j094j044o52l24J236m8J187
1735G56K85j487n67J14N96R70j18k5j024J58l7O08l28j55J19K22o29n7l92O59
$$ plain form
1604 375 -777 32 -254 -1086 -189 -557 126 -213 36 -308 -396 -559 -858 -564 996 1018 637 -167 -1065 -940
1624 -940 7 1017 662 159 -105 -1260 -1263 432 754 858 407 -363 -258 583 1019 1496 970 777 -949
1643 -949 -835 -253 747 348 -530 149 -284 59 726 171 425 579 1120 455 341 -299 -204 -164 508 1459
1663 1459 271 -29 417 -218 170 -481 1315 1035 736 -119 -1239 -792 563 791 892 754 -129 -1209
1681 -1209 -1735 954 1249 614 -674 -430 -1121 99 750 -324 1133 -232 -941 -1215 -386 618 260
1698 260 -90 703 -844 -704 -78 -525 458 191 416 253 -378 -351 -1622 -599 1124 1317 1195 33 -1277
1717 -1277 -1523 -387 199 700 1030 -705 -812 -1082 -296 553 1495 401 -643 -1295 -1619 -383 -431 756
1735 756 1041 -446 -1013 -899 -303 667 549 524 -500 -342 -379 229 -99 -254 -135 87 -542 -599 -991 -332
1755c32P81K17M79j8q41m60m64M76J162o0L16k512l1N11L42J072O88n16q73j174
1775a237K67M95J632J77o89o50j377l56J730J418p8n77l66r96k24Q77J70J60M69
1794H45m48j76K99q83l14J094Q40R1p90o80p44J63N83J377p22o4p13j033N27N49
1814a99Q33P33k29j309r03K56N99J590j125R63j084j460M33N28R81m5o97M95j933
1833a573M52N26J040P73m45j196Q7m79J164m25P87K13n95m59n35m02N77K03P75
1852D88J46k81j074j040K41J615J498p75m15r17o83m49J610J311k26j114m83m00
1870i48M94K47J210j42j268l99j36N71N54R38r97K65p06q98J83J010L09L4o58
1889c37n08L83q87M49M43J213l28K08n05n4j020J706l20Q25l44n02j373k52M08
$$ plain form
1755 -332 449 666 1145 1127 286 -174 -638 -162 1000 940 1256 -1256 -1287 -776 -434 638 1326 810 -63 -1237
1775 -1237 -970 -475 1157 1334 645 -5 -1382 -1738 -8 1410 1332 755 389 -607 -831 46 216 376 845
1794 845 397 221 520 -363 -677 417 1257 1348 558 -122 -866 -703 -120 1257 535 471 -242 -1275 -748 -199
1814 -199 634 1367 1138 -171 -1074 -818 -219 1371 246 1209 125 -1335 -902 -374 607 562 -135 360 -1573
1833 -1573 -1121 -595 445 1218 773 -423 -336 -815 349 -76 711 924 329 -130 -665 -1067 -490 -287 488
1852 488 634 353 -721 -1761 -1520 95 1593 818 403 -514 -1197 -1646 -36 1275 1049 -65 -548 -948
1870 -948 -454 -207 1003 861 -407 -806 -942 -371 183 1121 124 389 -317 -1215 -1032 -22 287 321 -337
1889 -337 -845 -462 -1349 -900 -457 756 428 636 131 77 -943 763 443 1268 924 422 -951 -1203 -795
1908g95J768Q78q11l68j294o89Q44J262J335j408j127n01m22K9J437J428K80r68
1926H78r08r66M71J470J95l17p57j227j66J113J133j272J465K26j620Q4n70p52
1944a520J570J797q72M11j961l40l0Q64R38J287j549j000r53M18P42R52Q45j92
1962A407j348j509m37J669K23J022K31j491m42j353J448P58J003p82r72q35P07
1979g01M2M53J844p66M9j228N3j161J32J453j45K43m49k39j270O40J465m63R91
1998I43o48k60j373K38J218P64l88l53q26J29j391J794J533j93k67p49p04p25
2016a258M75J525P70j128n65j62q59Q24Q02l16K69R72j355k24m48J124L71j12
2034G05M17j200j91n79k97J300Q91L65j049l99p2p55L49N51M56L6q60k97n09J264
$$ plain form
1908 -795 973 1851 1040 672 -622 -1311 -467 795 2130 722 -405 -906 -1328 -1299 138 1566 1846 878
1926 878 -30 -996 -525 945 1140 823 66 -1161 -1327 -214 919 -353 1112 1338 -282 -198 -768 -1520
1944 -1520 50 1847 975 1386 -575 -915 -945 -81 857 2144 595 -405 -1358 -940 -198 754 1599 1407
1962 1407 59 -1450 -1887 -218 5 1027 1258 -233 -675 -2028 -580 178 1181 399 -573 -1408 -701
1979 -701 -659 -206 1638 872 921 -307 -254 -1415 -1283 170 25 268 -181 -420 -1690 -1050 415 -48 943
1998 943 295 35 -1338 -1100 118 882 494 141 -685 -556 -1947 -153 1380 1187 920 171 -533 -1258
2016 -1258 -783 742 1512 384 -181 -343 -1202 -378 424 108 377 1349 -6 -230 -678 446 817 705
2034 705 1122 -78 -269 -848 -1145 155 1046 1411 362 -37 -109 -864 -515 36 492 528 -332 -629 -1138 126
2054A26J350l75l15j022M89j313Q13J349O91r65j231j71m38L46P50O53l65n0r12
2073e90L59K25q48J605m44p0M12n3n23n39L21M67K85m78n57m07J291L76j24L61
2093A069o24r51l35J0Q83j21R94r37q21J11M49J59J95k24N66q25n64J288m88J404
2113A238k48j061N8j121J80Q49q6J52Q9k00o72N39N71Kl75J45L77l1r43j81M37
2134b81N94l2N07j075n74K27l07J553K35n32n83k20j87n64J331J232n09j231k35
2153f51L74M53k29P77p16p30k69K91P27L56k80M36j131K7O69p37J548k69P61j129
2173B78n36N42r17O14J76n75J638j025l8n95p58J452P71r84Q7J29q44J042j230
2192g73Q07jL34r1j128J76K33P98M74j212R84r36m79Q76N12J26K61j259M78q57
$$ plain form
2054 126 1476 1101 786 -236 253 -1060 -247 1102 1793 828 -403 -574 -1012 -666 84 737 372 322 -590
2073 -590 -231 -6 -854 751 307 237 649 596 73 -466 -145 322 607 129 -428 -835 456 832 708 1069
2093 1069 445 -506 -841 -831 52 -69 925 -12 -833 -722 -273 -114 81 -143 423 -402 -966 322 -166 1238
2113 1238 990 -71 -13 -1134 -954 -105 -191 -39 50 -150 -822 -283 288 290 -85 60 437 406 -537 -718 -281
2134 -281 313 281 788 -287 -861 -634 -941 612 847 315 -268 -488 -675 -1239 92 1324 815 -416 -651
2153 -651 -277 176 -53 724 8 -722 -991 -700 27 383 103 539 -592 -565 104 -633 915 646 1407 278
2173 278 -258 284 -633 -19 157 -418 1220 195 157 -438 -1196 256 1027 43 130 259 -585 457 -773
2192 -773 34 33 367 276 -852 -676 -443 355 829 -383 601 -335 -814 62 574 700 961 -298 180 -677
2212f77J140o70J99N37n12N5n1O9j98M81o46P98o54j85M57oj201J718k16pp20
2233b89p34j2N17R71N99q39k04n18M97P25p42N38K98q91n4K81j15M18O87j005
2253A28k29j22p77J136L49L15k1r17J56o44OR99k29J72n94K14j74J93o7M06R0
2274C90J25l15l05O7m76Q66j0k82K72m7l36q28Q08Q03j080k86J374k514J520M74
2294B20L37p78R08q28L12jk9Q19q29L7R5p70J24N34L65j316J018l46L8M39n90
2315b41N40J79q98J238j297P37N1o65K08n60Q81K42k49q83Q70l33o7N57j06k92
2335h8K73n15N87L33l23r74M44K39l09O17O14l85o75J03k43O05P4O3j34n66Q15
2356E55o70k06j53J344r54M49p51N8O02r78O22J37k84Q33o42J40k31m80J063p26
$$ plain form
2212 -677 463 -207 -8 529 17 72 21 90 -108 373 -273 525 -129 -314 143 137 -1064 654 438 431 -289
2233 -289 -1023 -1035 -518 453 1052 213 9 -509 -12 713 -29 509 807 -84 -138 143 28 446 1133 128
2253 128 -101 -223 -1000 136 485 800 779 -138 18 -626 -620 379 150 322 -272 -58 -232 -39 -106 300 390
2274 390 515 200 -105 -38 -514 352 342 60 332 285 -51 -879 -71 732 -348 -634 740 -1774 -254 220
2294 220 557 -221 687 -141 171 170 141 960 131 168 263 -507 -383 151 516 -800 218 -128 -90 349 -241
2315 -241 299 478 -420 818 -479 258 309 -356 -148 -708 173 415 166 -717 153 -180 -247 310 204 -88
2335 -88 185 -330 257 590 267 -707 -263 -24 -333 284 898 513 -162 -59 -302 303 377 440 306 -260 555
2356 555 -115 -321 -474 870 -84 365 -386 -328 274 -704 -82 55 -229 604 -38 102 -129 -609 454 -272
2376b72O43j18n6p42k20O24M89j097R39Q8K51K6m12Q00p44j13m13L5J95O89L0
2397F22o71M36q64N87k63k92q9p0J35k50P53k87O4k19rJ40K74L51l63L31R4q51
2419d41L65K87j65j38k56K54L26O39p10L54l05k09M40p80N76m88J57J81l31J78
2439f6N4q3Q20n04p73P58r20R40o6o7r5P9q23O72J67j5j92l97R27l83r14N80J57
2462a44m74K74J021q22K2j7k57O89k79L46M2m35l29R1J355j001m31L16m85Q8N35
2483A05N12n71K62M96j472Q41J09j221J767j147j56L98J8J278j040L12n33l8M5
2502c5J66m66J47P06o40K38K48M84j31m37l59K91l24l77K44R4L11m46m60R01l89
2523b34M70o30K96M4o92M73P60m28M64J89n13J92j017P78K22n38N45Q10q06J1
$$ plain form
2376 -272 371 253 197 -545 -765 -141 348 -749 190 278 529 555 143 943 199 86 -327 -292 -97 592 622
2397 622 -49 387 -477 110 -153 -445 -534 -604 -469 -719 34 -253 -189 -408 -417 -277 -3 348 -15 316 410 -441
2419 -441 -76 211 46 -92 -348 -94 232 871 161 515 210 1 441 -339 237 -251 -94 87 -244 -66
2439 -66 -12 -95 725 221 -552 206 -714 226 160 93 -2 77 -746 -74 93 78 -114 -511 416 33 -881 -301 -144
2462 -144 -618 -344 677 -145 -123 -140 -397 292 13 359 401 -34 -363 -272 1083 82 -349 -33 -518 -430 105
2483 105 617 46 308 804 -668 173 282 -939 828 -319 -475 -77 -59 1219 179 491 -42 -80 -35
2502 -35 131 -335 -188 518 -122 116 364 848 717 280 -79 212 -112 -489 -245 -151 160 -286 -746 155 -234
2523 -234 236 -394 -98 -54 -746 -273 487 59 523 712 199 391 -626 152 374 -164 381 1191 385 396
2543C96L91j559N94l76M90O6o8l81P34o93L41N36j94k26L33j44q69O30M01n5k28
2564A19K26n24M87m42L2r40Q55J84l48N80n32K80N35n82k80P69m20L07m13q6l35
2585e28J052J7q04O58j21p44R83p36O78l37k95N25P0j89j55r5r95O85j58K06j03
2606c86j86J318j178K06R95r20Mn9N8L3k46K25J16o52J152k79p75N16O48L5J32
2627G57n95M50k39m76L49p31M92L04p66K0J507j455O27p00J108m86p00O22j20
2646c2O73p59K50j68jk55P60j082M31P7P6n4P68j090P3M31L68K64r31J292j594
2667e03J537j197L23l61P17J71n41q9k02M2J01R3k47J30j71R9l3k45k32N89j24
2688a43J26Q7n7J68O48r84l11J000m02q62J452r47O6M95j46L8K40l14o1M47m4
$$ plain form
2543 396 787 -772 -178 -554 -64 2 -66 -447 287 -406 -65 471 277 51 384 240 -629 1 402 347 119
2564 119 345 -179 308 -134 -102 -1042 -187 -3 -351 229 -303 -23 512 -70 -350 419 -1 306 -107 -193 -528
2585 -528 524 541 -263 395 274 -470 513 -223 455 118 -177 348 418 229 74 -21 -1016 -331 -489 -283 -386
2606 -386 -572 746 -432 -226 769 -151 -147 -206 -148 -115 -361 -136 -20 -672 480 201 -574 -58 590 625 757
2627 757 162 612 373 -103 246 -485 7 311 -455 -435 1072 -383 244 -456 652 166 -534 88 -32
2646 -32 641 -118 132 -36 -37 -292 468 -614 -183 -106 -30 -84 684 -406 -333 98 466 730 -201 1091 -503
2667 -503 1034 -163 160 -201 516 687 146 57 -145 -103 -2 91 -156 -26 -197 -98 -131 -376 -608 -19 -143
2688 -143 -17 70 13 181 829 -155 -466 534 132 -730 722 -225 -159 336 190 228 468 154 93 540 496
2709D96r64L20L46j233J206K45q23O36k5j079J533q9p74m48O7N93J37L93j524
2728i87L19M40O2l31O5N13j81L39n19J074q36K47pp00L88OK76L17m33P66n31Q4
2750C71R5j50n79J4k74O99l39l05J154j200J062j24r63Q04k81k50L04l80L78j58
2770a22L17J55r80P45l87N39j38q9M71l59l98J351p2l89m37r1K13r26J201m10
2790A94o24M17N19j4K79j488J059k53L63k45J51k21q10L41L85n13P56L15j407
2809g96L43Q0K42L18m82P08k72l99J1N91n64M96k45m3K53J01m30K44K51j73P60
2830I94j882J782k81j241J107j53o06L34J74p90J73j64M70n2o80J239r09M10N55
2849D80j124K68L84l54O57l87N48m49n82K97L61L85p23P42j101M04j17K32O48
$$ plain form
2709 496 -468 -148 198 -1035 171 416 -407 229 204 -875 658 569 -205 -653 -586 7 144 537 -987
2728 -987 -668 -228 -166 -497 -432 81 -100 239 -280 794 -42 205 198 -502 -114 -108 168 485 52 818 287 371
2750 371 466 316 -263 -249 -523 176 -163 -468 686 -514 548 424 -539 265 -16 -266 38 -342 36 -122
2770 -122 195 350 -630 115 -272 267 129 40 511 152 -246 1105 1033 644 207 116 329 -597 604 194
2790 194 -430 -13 506 492 771 -717 342 89 452 207 358 137 -673 -332 53 -460 296 611 -796
2809 -796 -453 -373 -131 187 -295 413 141 -258 -247 344 -220 276 31 -12 241 342 -88 156 407 234 994
2830 994 -888 894 613 -628 479 326 -280 54 228 -562 -389 -553 -83 -135 -815 424 -485 -75 480
2849 480 -644 -376 8 -346 311 -76 472 23 -559 -262 99 484 -239 503 -598 -194 -311 -79 569
2868E69j378P77L00o37N25j39L13L84o86L99l49p78L15m62M12K49Q0L55k04M51
2888D96K79r71j3P46m05n87K30j78k64l2Q31m75M8Q39j205k4N68n0K88m10L84
2909I5m65K72o50P36p74L79p9K44j79k57N18q9J231n52q42M95j81M3L1J60q84
2930g48J313n32M6m12QM74o07L5K30R91j446J128m31l47N79n52J83M62N9l18m30
2951c15N4j34P41n40M1l49J023n11L50q26PP41R3j53j77R69l19j79l73n1M26j44
2973C74pj011N2M26J18q9J28qk54L26j021K022p86l58M33j73o95P14rK10J26n06
2995A2m28J59L9M59j25m21Q09q40O51o0qK50k36po2L59n32o17L41K34N17n03j2
3018b1l54K49j94M07M27j40n97j36L47P26q11P3K89R2n61R54n97q4m9o64O01q83
$$ plain form
2868 569 -809 -32 268 -369 156 17 330 714 28 427 78 -700 -385 -847 -435 -186 -106 249 45 496
2888 496 775 -196 -209 537 132 -455 -225 -403 -667 -699 132 -343 -295 544 -661 -685 -117 -167 121 -289 95
2909 95 -370 -98 -748 -12 -786 -407 -486 -242 -421 -678 -160 -249 982 430 -412 83 -98 -55 -24 136 -748
2930 -748 565 33 79 -333 -325 149 -458 -423 -193 798 -648 480 49 -298 281 -271 -88 374 433 115 -315
2951 -315 -261 -395 346 -194 -153 -502 521 10 360 -466 -459 282 375 222 45 1014 695 516 143 92 518 374
2973 374 367 -644 -592 -166 -48 -137 -9 -17 -271 55 -966 1056 270 -88 345 172 -523 191 182 392 518 12
2995 12 -416 -257 -218 241 116 -305 504 -336 315 255 247 497 261 254 192 551 19 -598 -257 -23 494 -9 -21
3018 -21 -375 -126 -320 87 514 374 -223 -359 -12 714 -97 -24 265 357 -204 750 153 69 20 -644 -43 -926
3040i26O62O45K40m50n03J77M22j43j67m84M15K16M15j33n76P22j95J80o2j344
3060h89J374j354J079l68j47K20pJ9n34M09m96R51M5m91N56k51m31j61M10N64
3080D98n35K12R2q44N63J28Q9L50q24J1L94L45j24O80j234J72L61k75J20j06m16
3101c43q9J3n6J724j664P0N66o56L67l55K23L53J2l92L87n45N64J6m84O89o67
3122b67K05o07O97n5j96l40Q06K99j061J074r43J040K5q4m74l15J07n5L80r46
3142g10J354j100J99N14j059P81r2J87M26o96l18p75J267j78L5J245r53j91K52
3161A88J68J03k33P4m78J77qO60K7n87o08Q30R6n37j11N50o55K84M42k36r04N51
3183b07O92l09q90N91M22O46j117L53j86j93o3M34j92k73k29O77j05l82P36J2
$$ plain form
3040 -926 -264 381 621 171 -332 -155 267 124 -43 -527 -112 104 519 386 -190 532 337 517 455 -889
3060 -889 485 -869 210 -158 -305 -85 -92 -73 -607 -198 -694 257 302 -189 367 116 -315 -476 -66 498
3080 498 -37 175 267 -577 -14 114 203 553 -271 -260 134 479 355 1035 -199 -27 334 59 179 73 -343
3101 -343 -432 -419 -475 1249 -415 -345 221 -435 -68 -423 -200 153 165 -227 160 -385 179 195 -289 400 -267
3122 -267 -62 -669 28 -27 -223 -563 243 542 -519 555 -388 652 677 593 119 -196 -89 -144 236 -710
3142 -710 644 -456 -257 257 -802 -21 -113 74 500 -196 -514 -1289 -22 -200 -165 1080 127 -64 188
3161 188 356 459 226 300 -178 -1 -9 651 678 91 -517 313 409 -128 -239 311 -344 -60 382 146 -758 -207
3183 -207 485 176 -714 -123 299 945 -172 181 -5 -198 -261 173 -19 -292 -521 156 51 -331 405 417
3203D17p69J6L55l84L14K65j072M79Q84j377O10L49o3q77J613k16k82M47q56M10
3223B63m44j32L64j29J5k09K97M20m51L03n84P97j420R27K69j17l04J45k20K50
3243D0L56k94J71m16m15M08J48n08N30n56J250l23q31P89p82M46j98P21q5r5J41
3264D97p59q44P07N40p87O99k48l18k29R34o13N31l42J23M70q97M67O30m62P2
3284A71K77l12o44L40O37m39o07r1N74P32j6j48l7J73p64m08J269j04j05j37l40
3305B1M40K42n5n76o61L59O30q28Q10l96o49K32L62m35K31P18j97n3j77N6Q4j3
3327A45N07p53j49K51p2k16o8j05L92o00M23J15M8j1N07j87Q2P2J14k47r03L3
3349f22M81n52M41K35l52M44p3o92J190q06k33M01p20J201j50l12m04k33J842
$$ plain form
3203 417 -352 -336 19 -365 -51 214 -858 -379 505 -872 -262 87 24 -853 760 544 262 709 -147 263
3223 263 -181 -313 51 -78 -63 -272 25 445 -6 297 -287 510 -910 17 286 169 -135 10 -210 40
3243 40 396 102 273 -143 -558 -150 -2 -510 20 -536 714 391 -440 349 -433 13 -185 536 451 356 497
3264 497 -262 -1106 -399 141 -646 53 -195 -513 -742 192 -421 110 -232 -109 361 -536 -69 561 99 171
3284 171 448 136 -508 -168 469 30 -577 -668 -94 638 622 474 437 610 -154 -562 707 603 498 361 21
3305 21 461 703 648 72 -589 -230 400 -428 382 -14 -663 -431 -69 -504 -273 445 248 195 18 74 158 145
3327 145 652 -101 -250 1 -71 -287 -355 -460 -68 -668 -245 -130 -82 -93 414 227 309 381 495 248 -655 -622
3349 -622 -141 -693 -252 -17 -369 75 2 -690 500 -306 -539 -138 -858 343 193 -119 -523 -756 1086
3368A086j371o06R42j6k12k2K00p01J155o26Q45r11L71L29m65k07O31j016N81
3387a3j24M86r57J67L48L10l08l94O29l71L05K90o44P36L43q56l62K76l04K14
3407b29Q57n43j44Pj05N10J42L80r18j80N69q26L92l68m29P83M94m09Q5l28Q5
3428a75Q7K30P8k25K47j86N21j115J61O82m58L05M42l64L08L57j495Q42J36q78
3448e00J075m44p79R82l48J65k85o3o6M12K25p16J11L81o13Q08p14K21j85M59
3468A26q4m4j91Q6L94o47Q42n46n3M75K01p55K86N0L3l80K1K39n5L7L56m24R6
3491F3R56p11n43J69K7L4J15k00l0r8N18r61k30R67l25N55n49k0nL26k11l52L30
3514a75j70N94q2L59j60O5K10n43Q6K9j16k79P72j86q58K35j97J81K25qJ94M99
$$ plain form
3368 1086 -285 -891 51 35 -177 -199 1 -700 455 -171 674 -237 134 463 -2 -209 422 -594 -13
3387 -13 -137 349 -608 -441 -93 217 -91 -485 144 -227 78 368 -276 460 803 -53 -415 -139 -443 -229
3407 -229 628 85 -59 -52 -157 353 495 875 -43 -223 346 -480 -88 -456 -885 -102 392 -17 68 -260 -175
3428 -175 -88 142 220 -5 242 56 577 -538 -377 305 -153 152 594 230 538 895 -600 242 378 -500
3448 -500 575 131 -648 334 -14 151 -134 -197 -263 149 374 -342 -231 150 -463 345 -369 -148 -333 126
3468 126 42 -2 -193 -107 287 -360 482 -64 -117 358 559 -196 90 140 173 -207 -186 53 -2 35 391 -33 63
3491 63 1019 308 -235 -66 -39 -5 110 -90 -120 -218 300 -661 -891 76 -249 306 -243 -263 -268 58 -153 -505 -175
3514 -175 -345 249 167 526 366 431 641 98 184 213 97 -182 590 404 -454 -219 -416 -235 -10 -18 176 675
3536F75r15l10J165o59M71q19L71m73N64j78o7K8j50k07P40n1J81Nr4l32Q08p58
3558eQ74q4j070J66k13O6M15K38N5n33O0n03J028n76Q36o65K41k32l57L24L12
3579C77p5k95P12q15R9Q45n89m3k78K54O8n98Q69n63r8k66J61L75M14o63M74o25
3601b60R09p55K99q01J316k56L17q28J31k28M90j16p24M76o3K88j75O4N3q1M96
3622E52r0j330N57L9k34L60N44q6M93p95m83J30O9P58k81m12j94R8n60J223l90
3643c2o14N10L3L33o48J064l42l40O16k25l96L69Q6n92j64N10n60N17k29J24J7
3664C7j59o59L12k52L2Q39l67J87L09O64j323J95j31p1L49m94k07J373m83k1o4
3685F6q72J098m68J94l64r79N14N72J087q39k45Q41p28K11l95Q56p36O37r65J030
$$ plain form
3536 675 -240 -550 615 -44 427 -392 -21 -494 70 -108 -175 -147 -297 -504 236 185 366 371 277 -55 753 -5
3558 -5 869 785 -285 -119 -332 -266 149 387 442 -91 -31 -534 494 -82 754 89 330 98 -259 65 377
3579 377 302 7 719 -96 3 848 259 216 -62 192 260 -338 531 -32 -130 -396 -235 140 554 -109 365 -260
3601 -260 649 -106 193 -608 708 452 769 -59 72 -156 334 218 -506 -30 -93 195 20 84 137 56 552
3622 552 462 -868 -311 -272 -506 -146 398 312 805 10 -473 -343 -274 484 203 -209 -403 -305 -865 358 -32
3643 -32 -646 -136 -103 230 -418 646 304 -36 580 355 -41 328 414 -178 -342 168 -392 125 -104 20 37
3664 37 -122 -781 -469 -721 -689 150 -217 -30 279 943 -380 -185 -316 -387 -38 -532 -739 634 151 130 66
3685 66 -806 292 -176 18 -346 -1325 -811 -239 848 9 -236 605 -123 88 -307 549 -187 450 -515 515
3705E15r19J271j020L26l67j5L64m90M50r83J107q53N45R14k09l25j358Q91M79
3724C23K32n71n92J90N11n2K62n71J588j084M30r75m43J218l92J29l51R8j062
3743a112K205q48l60K49j71M39o66P75K3p54K30J41o04l63L96N54n25J96P4L86
3763B65m59j93J81R30o62N79j85n16R7J06o56L85K60p21L50K78j47N55l38m11
3783c02K24o1N3N64j157L50M5P75o29m63J112o75k37q7K92K41J68l66m27l06J118
3804B32p97J046N0m24Q4q39J015k1N6l66N80p29K61lL15l02k38j19O57k29j27
3825A02p66J065L58o64L44j284J250p58P01l06o1l40N93j117Q04n9l77N80k62
3844a97M46n41r0j28J57N86j82K75R6j61R2K17j022M00p73R67J01m94J98Q7l47
$$ plain form
3705 515 -404 867 -153 173 -194 -209 155 -335 115 -868 239 -614 -69 845 636 311 -1047 -156 323
3724 323 555 -16 -608 -418 93 41 303 -268 1320 236 666 -309 -752 466 74 203 -148 -50 -1112
3743 -1112 1093 245 -115 134 -37 402 -264 511 534 -220 10 151 -453 -816 -420 134 -391 -195 -121 265
3763 265 -194 -387 -206 724 62 641 456 -60 37 143 -513 -128 132 -589 -239 39 -108 447 109 -302
3783 -302 -78 -139 -86 478 -679 -329 -284 491 -138 -601 511 -164 -401 -488 -196 45 213 -153 -580 -886 232
3804 232 -565 481 531 107 191 -648 367 346 402 36 616 -113 148 145 460 158 -80 -199 458 229 102
3825 102 -664 401 759 95 439 -845 405 -353 348 42 -19 -359 234 -883 -79 -138 -515 65 -197
3844 -197 249 -292 -382 -510 -353 233 51 326 422 261 353 570 -452 -52 -825 142 243 -251 -53 34 -313
3865c13O98l26J006q19l00N0r40R20k51K4J197j119N56L41j323J48J77j51M9O9
3885c07P27p13l84Q62L85n71m47J89m92J192j05n18j06J08R2K94k6k21k45O15
3905C29q16N85L52m54k05N68P15n75p64J132p15M0k37j10J118p99n03J171q56
3924b4j21o12Q09j15j2k75J90K6r41J096m84J223p64O32j159j14L99r2L23Q6L55
3945D26o22R8j29r00J140j47j48K7J35J04N41k55J03q32M55J73p81L47O47n92
3965b10l24O42j33q24J578j149j34L20l56N85J49k67M35o09J032m91N67o30l38
3984a57L80n75M31m71K60J028r87K77l14M43k66l07P95o98N45l29K8M6j90m93
4004e54K97N42k14m77J13n68N07p9o82Q88j48M92o48L78J03o08J71N8J008k40
$$ plain form
3865 -313 385 59 1065 246 -54 -4 -944 -24 -275 -251 946 -173 383 724 -599 -451 -274 -425 -376 -307
3885 -307 420 -293 -677 185 570 -1 -448 -259 -751 441 336 -182 -288 -180 -88 206 180 -41 -286 329
3905 329 -487 98 450 -4 -209 359 1074 499 -265 867 152 192 -45 -155 963 164 -339 832 -24
3924 -24 -145 -757 52 -63 -75 -350 -160 -134 -1075 21 -463 760 -4 628 -531 -645 -246 -338 -15 71 426
3945 426 -196 -98 -227 -1127 13 -134 -282 -255 -120 -16 525 270 373 -459 -4 169 -612 -265 382 -210
3965 -210 -534 108 -25 -849 729 -420 -554 -234 -590 -5 144 -123 312 -297 735 244 811 181 -157
3984 -157 223 -352 79 -392 -132 896 -91 186 -128 315 49 -258 537 -161 384 55 83 129 -61 -554
4004 -554 -257 285 71 -406 -293 -861 -354 -433 -1115 -227 -375 117 -531 -153 -50 -658 -487 -429 579 339
4024C39l64j05K87Q31n68n45M61p0m82O47j042J92l0P83j19m22N0K09m9O29j52
4045D80r07N93l45M27j80m01J023p09K42m0L43o49q57P03N07o09l62L40L59O46
4065F04j012P95M3j029J242o30q31J199j406Q77O01o38P29m93J43k2R9M62j42
4084E91l06q7K08p14L75K36K25o53M59m92K47N59n62O30r8j166M80k72K67P08
4104F35k69K5r46K69O92m31L38r2j191J641p27j92M71m12k26o0K73R4N74m53j65
4125a52O60q74L00M20n31K71J009j012p49R55k90l67J626j296o2M24K01m40q38
4144g45N48J64%J53m18l47Q44kK64k17m99L80n19N12l90j2R02m62p60J355r77
4165b26K40l68q8M08J8J69J41k87k95O41J72r28N86j21J78M52l55L27n39q6LO52
$$ plain form
4024 339 -25 -130 157 988 420 -125 336 266 -216 431 -611 -419 -449 334 215 -207 -157 52 3 632 480
4045 480 -427 166 -179 248 68 -333 690 -19 223 183 526 -123 -980 -277 230 -379 -741 -401 -42 604
4065 604 -408 387 430 -599 643 13 -818 381 -1025 -148 453 -185 544 51 194 172 271 733 591
4084 591 285 198 406 -308 67 303 528 -125 334 -158 89 648 86 716 618 -548 -68 -340 -73 635
4104 635 366 391 -555 -286 406 -25 313 221 -970 671 -56 -248 223 -189 -415 -475 -202 -108 466 13 -152
4125 -152 508 -366 -66 354 -177 94 1103 91 -658 297 7 -360 1266 -30 -92 332 533 93 -745
4144 -745 -197 -33 -33 120 -298 -645 199 197 461 244 -255 125 -394 118 -272 -284 618 156 -604 751 -226
4165 -226 14 -354 -442 -34 -16 153 294 7 -288 353 525 -403 183 62 240 692 337 664 125 39 42 694
4187F94l09n69j35O26k0k56k25j96N82K30j74q22O53j19L29p48Q11m80k51k37
4207f16M45J30L09l71m03O54O65J61p29o94L82K14m72N12K23J3o71l78P52l76
4227b50j93L8L3P29j079P93O97j077K22K7j69O32l9p12N99k64m91Q7N80l50J03
4248h4J64N60l13r72L70P2J10K02k96Q47k39q1l85N09p55P77m98n24J116n22q5
4269b7k91N56n12m66J606n31m48L06o98J1p1L01K47l33R48q15L73l40N5M03l87
4290a13k86L02n13J143k84l77L0M1P56p32P04j209M04m46K16m38Q7M77L34J4P13
4311H23o89n9j0n8L43O9j179N16J61NN49j268L90J98j32K47Q59j079M40jp50P36
4333A11n10P98n51j30O27n70N07K19m7j832J280N71l17K54o80M48Q04r33j69m0
$$ plain form
4187 694 385 -184 -319 307 287 31 -194 -390 192 422 248 -574 79 -40 289 -459 352 -128 -379 -616
4207 -616 -171 -41 268 -103 -506 148 813 974 245 -449 -67 147 -325 187 410 423 -248 -626 126 -250
4227 -250 -443 -405 -372 357 -722 71 768 -309 -87 -60 -229 403 364 -348 251 -13 -504 -417 163 -187 -84
4248 -84 80 640 327 -645 -275 -203 -93 109 -187 660 421 340 -45 464 -291 486 -12 -536 580 58 -27
4269 -27 -318 238 -274 -740 866 335 -113 193 -505 -494 -565 -264 -17 -350 598 -217 156 -184 -129 274 -113
4290 -113 -399 -97 -610 533 249 -128 -98 -57 699 -33 671 -538 -134 -580 -364 -802 -715 -238 96 110 823
4311 823 134 75 65 7 350 419 -760 -244 -83 -78 471 -797 -407 -209 -341 -94 765 -314 126 125 -625 111
4333 111 -399 399 -152 -282 345 -225 282 501 454 -1378 -98 473 156 410 -270 178 982 49 -120 -160
4353a60o30M83L72J66J27o26K49L35k13L96j029J102K7o25J17l97r0L62m48P28
4373B46q48L93m88M61M4k49Q09m26L12m89M7O11l82k65O8m19O53J06o9r80M33
4394d32J048p37J51J061r32J56p38K24N84o35P28j502J315q99o1J243J92o05n77
4413d16J65P64o39l93K79O2k83O30l23M40m81L73l18M11l70L46o3l54K26M64k79
4434B41l93k63J388j257J082q12J46l53p23P79O99j90K57j90m59M05p16M14l2
4453B3%N55r08P09j25n69L06n74j25M73M31J24q2l07L71n16np53P62N00q16Q7
4475d39M55l99J008q29jj50O85L85J40m85q58j5Q83r99L38M05J64k21L13n55K80
4496A05J03m24m16P90Q6N37p89m57O53n4O33o28q92O86O60p69r1M05J35j0k06
$$ plain form
4353 -160 -790 -307 65 231 358 -268 -19 316 103 499 -530 572 599 -26 91 -306 -396 -34 -482 246
4373 246 -602 -209 -697 -236 -192 -441 368 -58 254 -235 -188 423 41 -224 -156 -575 78 184 115 -865 -432
4394 -432 616 -121 30 1091 159 315 -423 -199 385 -250 478 -1024 291 -608 -669 574 766 161 -416
4413 -416 -251 513 -126 -519 -240 -178 -461 169 -154 286 -195 178 -140 271 -99 247 184 -170 56 520 241
4434 241 -152 -415 973 -284 798 -14 132 -221 -944 -165 534 344 601 411 -48 357 -359 55 23
4453 23 23 578 -330 379 254 -315 -9 -583 -708 -235 196 320 238 -69 302 -214 -219 -972 -210 290 -526 -439
4475 -439 16 -383 625 -204 -205 -355 330 715 855 370 -488 -503 380 -619 -281 124 288 67 380 -175 105
4496 105 208 -216 -632 158 244 781 -8 -465 188 134 767 139 -753 -67 593 -176 -267 138 273 263 57
4517E7O03L26j225N79p6l4K71n51J19l90M06L42r12%O67K81j013M10K97n66l0
4538d39j01M15l71M18J73Q6o57l69P16L2j0N1J16L0L57k62R6j94j48j66Q2L50
4560B05r21Q11L8M64k72j201O54L20k45N97m50M32n48J31j15M88k37k69P90j159
4580d87L52N57k85m71K77L88k76n30P12j79N0j59L09p15O83J08n07n59J141n23
4600a14K00L27o03o23J542l06J78l29m29J98o45O46r61J914p45n22Q14O5o13n65
4620e71O83k75L36l78N0N04j010P52l95O28j75o38N81k10L92L59p19L51j009P66
4640B2n79N07k34M57%k44j09K34l00O65k01R9l17j82L37l39p19R60l82j01P8N5
4662b93j62K60N12J40k91n48M01m01M41q9J46l31R25O43j588N35O99q25j0r28
$$ plain form
4517 57 660 986 -239 340 264 230 501 -50 69 -321 85 427 -485 -485 182 463 -550 -140 157 -409 -439
4538 -439 -540 -125 -496 -78 95 181 -476 -845 -129 -97 -107 -56 60 90 447 185 281 87 -61 -227 -145 205
4560 205 -716 95 133 597 325 -876 -222 98 -147 450 0 432 -116 15 -100 388 151 -118 672 -487
4580 -487 -135 422 137 -334 -57 331 55 -475 237 58 108 -51 258 -457 226 334 -173 -732 409 -114
4600 -114 86 413 -190 -813 729 423 601 272 -157 41 -604 42 -919 995 250 -272 542 607 -6 -571
4620 -571 112 -163 173 -205 -155 349 -661 91 -304 324 149 -489 92 -118 274 633 -86 265 -744 22
4640 22 -557 -50 -284 173 173 -71 -180 54 -246 419 218 317 0 -182 155 -184 -903 57 -325 -426 -348 -293
4662 -293 -455 -195 317 457 166 -382 19 -382 59 -30 116 -215 710 1353 -235 300 999 174 164 -764
4682g64O48J017j431L29J55O40j284P07k65N35m98k63P17m05J017j435P63j025
4700h42N93N91q28J208p09l91L05M98n07J4p1m16M24j95M45N67k72o52J575p36
4720F01j295R10j170R07l96M44o18M43Q37l12K08j251O56J36o04O92J197q17n75
4739gl91j96Q48L18r36M12k3q8J5Q3q74J027K42n6J99j660Q03j51J592j812N18
4760a37J15n50M21O97n76m7J41M79p13L04R19j635N54L84k46o00M91j10P3K2j26
4781a40j01O76m77J37m86O83M37m69l23m1m47O72j162P67K16L11m34J177o24P3
4801D45l6r16N78k64L34m0O1j98mm85R38j276Q73n5l8P01l18k50j33L93l01J24
4823A33r3j6P4l90m85J889q57k74N85q79J285o87o48M48j61J21J84K55j316O30
$$ plain form
4682 -764 -116 901 -530 -201 -46 594 -690 17 -248 287 -211 -474 243 -162 855 -580 183 -842
4700 -842 -249 342 -486 722 13 -378 -73 425 -82 -68 -139 -555 -131 -326 119 686 414 -238 1337 601
4720 601 -694 216 -954 -47 -443 1 -617 -174 663 351 559 -692 -36 100 -504 188 1385 568 -7
4739 -7 -398 -594 254 572 -364 48 25 -63 -48 35 -839 188 430 374 573 -1087 -284 -435 1157 -655 -137
4760 -137 -22 -572 -151 546 -30 -77 64 543 -170 134 1053 -582 -28 356 110 -490 1 -109 -36 -14 -140
4781 -140 -241 435 -42 95 -391 292 729 260 -63 -104 -551 121 -1041 -274 -58 253 -181 996 372 445
4801 445 409 -507 71 -193 141 101 162 -36 -40 -525 413 -863 10 -45 -83 618 300 50 -83 310 9 133
4823 133 40 24 98 -292 -777 1112 255 -19 566 -313 972 285 -363 85 -76 45 229 484 -832 -202
4843b02M42J84p01l67K81P0L65m11M21m67M48j15J27M68p02m44O95p3j02O44p71
4864b10R5J95m06K15r9O26j87k41K39j039Q31L32p7j07l88N85K14j195L28j2l95
4885f96J049r63N54J29q88J068r85P09J68j27L85j522J586n97K78o24O37J08l50
4904h1N60j060J82O96M13n26K83k34R4K66j085P74J9q09J189o27k6K21j93J82
4924B38p59M31m23J95K3L34k33L61n02j5L79l90P74M8q97Q2N1k2J247p6j257O62
4946B51m86M95P9j68L72k72k93k20P42j162K73K39p79J073P4k82Q37k65r70P5
4966c87J75q4O98o61O13n38K84K29r01R68m35j264J584l27j49R55l04o94N79m98
4986a57O73j657Q09J73N4K11K93o66L97l19j64P66m00n1j68J005q81m48L43K96
$$ plain form
4843 -202 240 424 -277 -644 -363 -293 72 -339 82 -385 63 -52 75 543 -159 -603 92 19 -83 561 -210
4864 -210 -115 80 -326 -111 -210 416 229 -12 227 -812 19 351 274 167 -221 364 578 -617 -289 -301 -696
4885 -696 353 -610 -56 73 -815 253 -732 -23 145 18 403 -1119 467 -130 148 -476 161 269 -81
4904 -81 479 -581 -399 297 710 184 467 233 327 593 -492 282 301 -508 681 54 28 249 56 238
4924 238 -521 -90 -513 -318 -295 39 -194 167 -335 -350 29 -361 413 461 -436 -354 -303 -325 922 846 -411 251
4946 251 -235 260 339 171 543 271 -22 -242 500 -662 -389 -150 -929 144 218 -64 773 508 -462 -387
4966 -387 -212 -296 402 -259 354 -184 100 329 -572 396 -39 -1303 281 -46 -195 760 456 -238 341 -157
4986 -157 516 -1141 -332 -159 -105 106 399 -267 130 -189 -353 413 13 -38 -206 799 -82 -530 -187 109
5006A09r76J007m7j192J132j66R23o04o7n48N50n19l69O42j47J94j87J41M85M04
5026G65p77o74O79r09J466r00j04L70j03J45o20P58o16J48P94j076m2J211n42
5045b7l9j23Q87j316J398j618J122o31j46J02L61j50l43L63k22J1J156p00l48
5064b63N31j03r65J312m28q4O29n33j94j33lK81l93k19Q68R2j170L81M04O0M32
5085E02r43K49N21q09J25NP74n14n13J58k99J669j483Q11J06j82Q1q57k75P05
5105a69Q02j188O19L65J06k74L43l40l30O3K23l00o1P99k64p09L90L55r74J231
5125F87k56q48K02M89q1K6o00J35M37M78m16N42o75J39k48P96l92m97j0k32Q72
5146E48n20J03L99Q5K56o20k91o78P29j66K20M70k8r90J6R30p00J04N30j303j40
$$ plain form
5006 109 -867 140 93 -1099 33 -133 790 186 119 -429 121 -398 -767 -125 -272 -78 -265 -124 361 765
5026 765 -12 -686 -7 -916 550 -350 -454 -84 -187 -42 -662 96 -520 -372 422 -654 -696 515 -27
5045 -27 -66 -189 698 -618 780 -838 284 -347 -493 -391 -30 -180 -523 -160 -382 -371 785 85 -263
5064 -263 268 165 -800 512 84 0 629 96 -98 -231 -234 47 -346 -565 303 395 -775 -394 10 70 502
5085 502 -441 -192 329 -480 -355 -350 424 -90 -603 -445 -744 925 -558 253 359 177 258 -599 -874 -169
5105 -169 633 -555 64 429 535 261 604 264 -66 -3 220 -80 -141 658 394 -315 75 430 -544 687
5125 687 431 -417 -215 274 193 219 -381 -246 191 669 253 795 120 259 11 807 415 -82 -92 -324 548
5146 548 28 131 530 615 871 251 -40 -718 11 -155 65 535 507 -483 -467 463 -237 -133 397 -906 -1046
5167a046J028N04o94M33J72o28m1k90O50m57R70j356M54j28M70Q0R38q12n76K49
5187h0j53P4O05j104J060k73L62n42M68j96n26M61l20o7M45j09r66J153m47N51
5207C96j36J29l95l21l44O12L71m74J70R40l04p92J20P7j10M25n37L31O4J96l64
5228E4L62p04l2k7O31n94L99j45m25l71J269r5k0L09p87K19J13O57j05j14j48
5249D46j400R97O84r39Q70n19k73J33Q74j348R21q3k98L55l50J32l66N29j47m3
5269A75O41q86p9M61mk57R8p27N65j71n56J104j47J64j86r48R60J51r83J210m20
5290A65n01J323r09n84K91L15l80m38j30L65O75l03K57n9m26j04P32k57M43j07
5310C68n76O49l43M91m48n73L33K24j001N60J83l83J313j066Q54L71n45m28K8
$$ plain form
5167 -1046 -18 486 -208 225 397 -231 -272 -562 88 -369 601 -755 -301 -429 41 121 1059 247 -329 -80
5187 -80 -233 -159 446 -658 402 129 491 -51 417 221 -305 156 -164 -231 214 105 -861 292 -155 396
5207 396 260 389 -6 -327 -671 -59 312 -162 8 948 644 -148 -28 49 -61 364 -173 158 222 418 54
5228 54 416 -288 -320 -347 284 -310 89 -56 -481 -852 417 322 302 611 -176 43 156 813 708 594 446
5249 446 -954 43 727 -212 658 139 -134 -1 873 -475 446 363 65 420 70 202 -164 365 218 175
5269 175 816 -70 -149 312 308 51 149 -578 -13 -184 -740 364 217 381 195 -753 207 358 -625 585 165
5290 165 -336 987 78 -506 -215 100 -280 -718 -848 -483 192 -111 146 87 -339 -443 289 32 475 368
5310 368 -208 441 98 589 141 -432 -99 125 -876 -316 -133 -516 797 -269 585 956 411 -17 11
5329A1L28q04n08Q67j04r1j68J01J014j804J232M3j35P12j420O09N13p15M11j458
5349a366J505o8m15k06M76M67p07kO96o9j84p7m42mO53o53K74J73L60j297N44
5370c42Q13o13o45R87n48k01Q22P74j109p18M08k63N59M24r59L91P35o77J33k09
5390b38P12q04N30k99L5k56K32K04K26J4m8m64j59K89j16j18j22K95O32o33J059
5411I71o53n91M79J05l98Q18r18L00J74p74Q30k24L05J50r00J49o99J81L23J26
5431b46j91O87k0L1m51K48m43J103q07k37J529j618N67m1n59J106n32p8J52m20
5451b20L22p06P72r00J072L97q59o0J25k05K78M42j96L08k41l63L92p47J7N79
5471B07J85o44L11j59P36K69m06k98P6l37L65n72M54p71K97K12J022p92o56J511
$$ plain form
5329 11 339 -465 -973 -106 -210 -301 -469 -368 646 -1158 74 117 -18 694 -726 -117 396 -319 92 -1366
5349 -1366 139 71 -344 -550 -74 393 -314 -316 380 311 127 50 -392 -396 257 -396 -122 51 411 -886 -342
5370 -342 471 -142 -787 200 -348 -549 273 1047 -62 -780 -372 -635 -76 348 -611 -220 515 -162 -29 -238
5390 -238 474 -330 200 -99 -64 -320 -88 116 342 356 308 -156 -315 -26 -142 -260 -382 -87 545 -88 971
5411 971 318 -273 206 311 -87 731 -187 113 287 -487 343 119 424 574 -326 -177 -876 -695 -372 -246
5431 -246 -437 250 230 261 -190 58 -385 718 -89 -326 1203 -415 152 111 -448 658 126 48 200 -220
5451 -220 102 -604 168 -732 340 737 -122 -182 -57 -262 16 458 262 570 329 -34 358 -389 -372 207
5471 207 392 -252 59 -100 636 905 499 201 277 -60 305 -267 187 -584 -287 -75 947 155 -501 1010
5491A010j109M27j193K92R47k07o55P86N8N14j162L34q00Q43L33K83m34M9l65
5510d9p88N84l80M07J30J36k18o1n71J158q08L84l33N59j82R18n69l22k6l5l24
5531c90L06k29q3J98K47M81j02M28j220m53J204r4m65N49k26j05O92o63l95M21
5551A01K13o05O33L04m24o08j35K64l49P53j66K77k55M52q1n3m27J38J19n1l94
$$ plain form
5491 1010 -99 328 -865 -573 374 167 -488 298 356 870 -292 42 -758 85 418 701 267 316 -49
5510 -49 -837 -253 -633 -226 -96 40 -178 -239 -810 348 -460 -76 -409 150 -32 886 317 -5 -31 -66 -390
5531 -390 -84 -313 -396 -198 49 530 428 856 -364 -817 387 293 -172 377 151 46 738 75 -320 101
5551 101 314 -291 342 646 222 -386 -521 -257 -606 147 -19 258 3 455 374 321 -106 32 151 100 -294
$$ [...]
8191E8
##END NTUPLES=NMR FID
##END=
